##TITLE=1H_DE-80H_X3
 200.13MHz, d2o
 8 sc
 
 19ns.26.2.2025
##JCAMPDX= 6.0         $$ Bruker NMR JCAMP-DX V2.0
##DATA TYPE= NMR FID
##DATA CLASS= NTUPLES
##ORIGIN= UXNMR, Bruker Analytische Messtechnik GmbH
##OWNER= pz
$$ XWIN-NMR		Version 3.5
$$ Wed Mar 19 16:06:28 2025 Russian Standard Time (UT+4h)  Yarkov@DPX200
##.OBSERVE FREQUENCY= 200.1313
##.OBSERVE NUCLEUS= ^1H
##.DELAY= (6, 6)
##.ACQUISITION MODE= SIMULTANEOUS
##.ACQUISITION SCHEME= undefined
##.AVERAGES= 32
##.DIGITISER RES= 18
##SPECTROMETER/DATA SYSTEM= spect
##.PULSE SEQUENCE= zg30
##.SOLVENT NAME= CDCl3
##.SHIFT REFERENCE= (INTERNAL, CDCl3, 0, 14.3821)
##AUDIT TRAIL= $$ (NUMBER, WHEN, WHO, WHERE, WHAT)
$$ ##TITLE= Audit trail, XWIN-NMR		Version 3.5
$$ ##JCAMPDX= 5.01
$$ ##ORIGIN= Bruker BioSpin GmbH
$$ ##OWNER= Yarkov
$$ C:/Bruker/XWIN-NMR/data/yarkov2/nmr/H-C/1/audita.txt
$$ ##AUDIT TRAIL=  $$ (NUMBER, WHEN, WHO, WHERE, WHAT)
(   1,<2025-03-19 16:04:59.37 +0400>,<Yarkov>,<DPX200>,
      <created by zg, POWCHK disabled, PULCHK disabled
       configuration hash MD5:
       00 E9 B6 7A A2 85 ED C7 34 08 36 98 17 FE 4E 26
       data hash MD5: 16K
       84 1E 0C DE C3 7C 4C E7 48 14 30 24 12 D3 10 E0>)
$$ ##END=
$$ 
$$ hash MD5
$$ 40 BB AD E7 5B B3 82 47 C3 AD F8 9E 0F E5 14 AA
##$RELAX= 
##$RELAX= 
##$RELAX= 
##$RELAX= 
##$RELAX= 
##$RELAX= 
$$ Bruker specific parameters
$$ --------------------------
##$DU= <C:/Bruker/XWIN-NMR>
##$EXPNO= 1
##$NAME= <H-C>
##$PROCNO= 1
##$TYPE= <nmr>
##$USER= <yarkov2>
##$AMP= (0..31)
100 100 100 100 100 100 100 100 100 100 100 100 100 100 100 100 100 100 
100 100 100 100 100 100 100 100 100 100 100 100 100 100 
##$AQSEQ= 0
##$AQ_mod= 1
##$AUNM= <au_zg>
##$AUTOPOS= <>
##$BF1= 200.13
##$BF2= 200.13
##$BF3= 200.13
##$BF4= 200.13
##$BF5= 200.13
##$BF6= 200.13
##$BF7= 200.13
##$BF8= 200.13
##$BYTORDA= 1
##$CFDGTYP= 0
##$CFRGTYP= 5
##$CHEMSTR= <none>
##$CNST= (0..31)
1 1 145 1 1 1 1 1 1 1 1 1 1 1 1 1 1 1 1 1 1 1 1 1 1 1 1 1 1 1 1 1 
##$CPDPRG= <>
##$CPDPRG1= <>
##$CPDPRG2= <>
##$CPDPRG3= <>
##$CPDPRG4= <mlev>
##$CPDPRG5= <mlev>
##$CPDPRG6= <mlev>
##$CPDPRG7= <mlev>
##$CPDPRG8= <mlev>
##$CPDPRGB= <>
##$CPDPRGT= <>
##$D= (0..31)
0 0.7 0 0 0 0 0 0 0 0 0 0.03 0 0 0 0 0 0 0 0 0 0 0 0 0 0 0 0 0 0 0 0 
##$DATE= 1742385898
##$DBL= (0..7)
120 120 120 120 120 120 120 120 
##$DBP= (0..7)
150 150 150 150 150 150 150 150 
##$DBP07= 0
##$DBPNAM0= <>
##$DBPNAM1= <>
##$DBPNAM2= <>
##$DBPNAM3= <>
##$DBPNAM4= <>
##$DBPNAM5= <>
##$DBPNAM6= <>
##$DBPNAM7= <>
##$DBPOAL= (0..7)
0.5 0.5 0.5 0.5 0.5 0.5 0.5 0.5 
##$DBPOFFS= (0..7)
0 0 0 0 0 0 0 0 
##$DE= 6
##$DECBNUC= <off>
##$DECIM= 32
##$DECNUC= <off>
##$DECSTAT= 4
##$DIGMOD= 1
##$DIGTYP= 9
##$DL= (0..7)
0 120 120 120 120 120 120 120 
##$DP= (0..7)
150 150 150 150 150 150 150 150 
##$DP07= 0
##$DPNAME0= <>
##$DPNAME1= <>
##$DPNAME2= <>
##$DPNAME3= <>
##$DPNAME4= <>
##$DPNAME5= <>
##$DPNAME6= <>
##$DPNAME7= <>
##$DPOAL= (0..7)
0.5 0.5 0.5 0.5 0.5 0.5 0.5 0.5 
##$DPOFFS= (0..7)
0 0 0 0 0 0 0 0 
##$DQDMODE= 0
##$DR= 18
##$DS= 0
$$ [...]
##$SUBNAM0= <"">
##$SUBNAM1= <"">
##$SUBNAM2= <"">
##$SUBNAM3= <"">
##$SUBNAM4= <"">
##$SUBNAM5= <"">
##$SUBNAM6= <"">
##$SUBNAM7= <"">
##$SUBNAM8= <"">
##$SUBNAM9= <"">
##$SW= 18.0517328524113
##$SWIBOX= (0..15)
0 0 2 0 0 0 0 0 0 0 0 0 0 0 0 0 
##$SW_h= 3612.71676300578
##$TD= 16384
##$TD0= 1
##$TE= 0
##$TE2= 300
##$TE3= 300
##$TEG= 300
##$TL= (0..7)
0 120 120 120 120 120 120 120 
##$TP= (0..7)
150 150 150 150 150 150 150 150 
##$TP07= 0
##$TPNAME0= <>
##$TPNAME1= <>
##$TPNAME2= <>
##$TPNAME3= <>
##$TPNAME4= <>
##$TPNAME5= <>
##$TPNAME6= <>
##$TPNAME7= <>
##$TPOAL= (0..7)
0.5 0.5 0.5 0.5 0.5 0.5 0.5 0.5 
##$TPOFFS= (0..7)
0 0 0 0 0 0 0 0 
##$TUNHIN= 0
##$TUNHOUT= 0
##$TUNXOUT= 0
##$USERA1= <user>
##$USERA2= <user>
##$USERA3= <user>
##$USERA4= <user>
##$USERA5= <user>
##$V9= 5
##$VALIST= <valist>
##$VCLIST= <CCCCCCCCCCCCCCC>
##$VD= 0
##$VDLIST= <DDDDDDDDDDDDDDD>
##$VPLIST= <PPPPPPPPPPPPPPP>
##$VTLIST= <TTTTTTTTTTTTTTT>
##$WBST= 1024
##$WBSW= 4
##$XGAIN= (0..3)
0 0 0 0 
##$XL= 0
##$YL= 0
##$YMAX_a= 570268
##$YMIN_a= -642841
##$ZGOPTNS= <>
##$ZL1= 120
##$ZL2= 120
##$ZL3= 120
##$ZL4= 120
##$ABSF1= 10
##$ABSF2= 0
##$ABSG= 5
##$ABSL= 3
##$ALPHA= 0
##$AQORDER= 0
##$ASSFAC= 0
##$ASSFACI= 0
##$ASSFACX= 0
##$ASSWID= 0
##$AUNMP= <proc_1d>
##$AZFE= 0.1
##$AZFW= 0.1
##$BCFW= 1
##$BC_mod= 2
##$BYTORDP= 1
##$COROFFS= 0
##$CY= -3
##$DATMOD= 1
##$DC= 2
##$DFILT= <>
##$DTYPP= 0
##$F1P= 0
##$F2P= 0
##$FCOR= 0.5
##$FTSIZE= 0
##$FT_mod= 4
##$GAMMA= 1
##$GB= 0.15
##$INTBC= 1
##$INTSCL= 1
##$ISEN= 128
##$LB= 0.25
##$LEV0= 0
##$LPBIN= 0
##$MAXI= 10000
##$MC2= 0
##$MEAN= 0
##$ME_mod= 0
##$MI= 1.114404
##$NCOEF= 0
##$NC_proc= 0
##$NLEV= 6
##$NOISF1= 3.799351
##$NOISF2= 2.8
##$NSP= 1
##$NTH_PI= 0
##$NZP= 0
##$OFFSET= 14.38212
##$PC= 1
##$PHC0= -1195.094
##$PHC1= 26.39223
##$PH_mod= 1
##$PKNL= yes
##$PPARMOD= 0
##$PSCAL= 0
##$PSIGN= 0
##$REVERSE= no
##$SF= 200.129724274929
##$SI= 16384
##$SIGF1= 3
##$SIGF2= 2
##$SINO= 400
##$SIOLD= 16384
##$SREGLST= <1H.CDCl3>
##$SSB= 0
##$STSI= 0
##$STSR= 0
##$SW_p= 3205.1282051282
##$SYMM= 0
##$S_DEV= 0
##$TDeff= 0
##$TDoff= 0
##$TI= <>
##$TILT= no
##$TM1= 0
##$TM2= 0
##$TOPLEV= 0
##$USERP1= <user>
##$USERP2= <user>
##$USERP3= <user>
##$USERP4= <user>
##$USERP5= <user>
##$WDW= 1
##$XDIM= 8192
##$YMAX_p= 0
##$YMIN_p= 0
$$ End of Bruker specific parameters
$$ ---------------------------------
##NTUPLES= NMR FID
##VAR_NAME=  TIME,          FID/REAL,        FID/IMAG
##SYMBOL=    X,             R,               I
##VAR_TYPE=  INDEPENDENT,   DEPENDENT,       DEPENDENT
##VAR_FORM=  AFFN,          ASDF,            ASDF
##VAR_DIM=   8192,          8192,            8192
##UNITS=     SECONDS,       ARBITRARY UNITS, ARBITRARY UNITS
##FACTOR=    0.0002768,     1,               1
##FIRST=     0,             0,               0
##LAST=      2.2672688,     0,               0
##MIN=       0,             -642841,         0
##MAX=       2.2672688,     570268,          0
$$ Real data points
##PAGE= N=1
##DATA TABLE= (X++(R..R)), XYDATA
$$ plain form
0 0 0 0 0 0 0 0 0 0 0 0 0 0 0 0 0 0 0 0 0 0 8 -25 32 -32 32 -32 32 -32 49 -54 64 -64 81 -83 96 -113 114 -139
38 -139 146 -163 179 -198 218 -239 264 -296 320 -351 386 -428 471 -522 576 -638 709 -789 886
57 886 -1002 1140 -1311 1525 -1803 2181 -2713 3513 -4810 7154 -12271 27576 -158306 -642841
71 -642841 192099 426088 -388848 -242211 373524 29247 -245501 166296 178352 -121955
81 -121955 -4671 86617 -37909 10442 -28 -113126 33677 76817 -154896 -67596 136518
92 136518 -81500 -156094 150308 109147 -139674 35086 200104 1773 -57473 55021 -8919
103 -8919 -54211 6003 -52484 -78817 29058 13147 -48660 29726 41914 -31972 13277 39347
115 39347 -27127 424 26856 -36398 13422 66523 -61009 -60755 94224 3244 -124186 50455
$$ packed form
0@%%%%%%%%%%%%%%%%%%%%Ql3N7o4O4o4O4o4Q1j03J18j28J45j64J79k09K27k53
38a39K85l09L42l77M16m57N03n60O16o71P37q14Q99r93J098j214J347j498J675
57H86j888K142k451K836l328L984m894O226q323J1964j9425L9847j85882m84535
71f42841Q34940K33989q14936J46637O15735l44277k74748M11797J2056l00307
81a21955J17284R1288j24526M8351j0470j13098J46803M3140k31713Q7300K04114
92A36518k18018p4594L06402m1161k48821J74760J65018j98331n9246J12494o3940
103h919m5292O0214n8487k6333J07875j5911o1807P8386J2188p3886M5249K6070
115C9347o6474K7551K6432o3254M9820N3101j27532K54J54979r0980j27430J74641
$$ plain form
127 50455 107267 -92918 -33293 156106 5035 -131733 49416 84322 -108576 -84190 56396
138 56396 -5267 -70655 18162 53073 -1014 2660 37536 31336 5896 -8050 4336 17920
150 17920 -7739 -24462 1508 -2795 -35777 -16445 5785 -26670 -28425 19704 23627 -4537 10493
163 10493 37165 25101 -677 -2278 10034 -3073 -30963 -13488 15764 -15044 -31281 24425
175 24425 26195 -35269 -5542 47684 -14396 -45743 35090 33161 -49407 -12576 53032 -5489
187 -5489 -45419 15528 24844 -24001 -11653 21503 9635 -2710 6987 13278 10512 -9169 -18656
200 -18656 4772 -581 -37374 -15243 24008 -11588 -27078 30901 28672 -23939 6248 43304
212 43304 -5563 -21019 25561 11802 -25183 -242 11086 -19551 -16090 -183 -12320 -10002
$$ packed form
127E0455N6812k00185N9625J89399j51071j36768J81149L4906j92898K4386J40586
138E6396o1663o5388Q8817L4911n4087L674L4876o200k5440j3946J2386J3584
150A7920k5659j6723K5970m303l2982J9332K2230l2455j755M8129L923k8164J5030
163A0493K6672j2064k5778j601J2312j3107k7890J7475K9252l0808j6237N5706
175B4425J770o1464K9727N3226o2080l1347Q0833j929q2568L6831O5608n8521
187e489l9930O0947R316m8845J2348L3156j1868j2345R697O291k766j9681r487
200a8656K3428n353l6793K2131L9251l5596j5490N7979k229n2611L0187L7056
212D3304m8867j5456M6580j3759l6985K4941J1328l0637L461J5907j2137K318
$$ plain form
224 -10002 1470 -7854 6479 23028 -2038 -1492 34676 9349 -25595 13641 21660 -33765 -18304
237 -18304 29660 -10293 -35220 19756 18080 -29962 -3235 27649 -11797 -17243 20415 7247
249 7247 -16160 5588 11485 -7755 -1964 3419 -4682 610 3450 -4293 6409 11512 -5477 1319
263 1319 14690 -9400 -15596 9195 -3932 -27070 908 13005 -18089 -7710 24604 4304
275 4304 -12588 16747 19617 -6335 7 13812 1591 -5944 -2655 -5031 -3798 -8014 -17308 -4235
289 -4235 5851 -13437 -9497 20595 8662 -13280 14704 25581 -10226 -7621 21594 1885 -21840
302 -21840 3325 12587 -14865 -12993 9246 2423 -11747 -3569 7725 3421 -7035 -2449 10746
315 10746 4280 -12638 441 14856 -6949 -14623 13109 10807 -14810 1218 21092 -2359 -11074
$$ packed form
224a0002J1472r324J4333J6549k5066N46L6168k5327l4944L9236Q019n5425J5461
237a8304M7964l9953k4927N4976j676m8042K6727L0884l9446n446L7658j3168
249G247k3407K1748N897j9240N791N383q101N292K840p743J0702N103j6989O796
263A319J3371k4090o196K4791j3127k3138K7978J2097l1094J0379L2314k0300
275D304j6892K9335K870k5952O342J3805j2221p535L289k376J233m216r294J3073
289d235J0086j9288L940L0092j1933k1942K7984J0877l5807K605K9215j9709k3725
302b1840K5165R262k7452J872K2239o823j4170Q178J1294m304j0456M586J3195
315A0746o466j6918J3079J4415k1805p674K7732k302k5617J6028J9874k3451q715
$$ plain form
328 -11074 12636 6434 -13933 -4187 3652 -9568 -9334 -2331 -4806 -1630 1910 -2409 4738 13507
342 13507 286 524 18298 7826 -10334 6036 11265 -15063 -11959 8547 -7582 -20610 2345
355 2345 5741 -14721 -2184 15000 -1203 -5890 13693 9784 -6824 2932 11643 -3519 -7250
368 -7250 4914 2489 -7848 -3943 3051 428 -3889 -1292 2991 2291 -4075 -4031 2759 680 -8332
383 -8332 -3491 7233 216 -7409 5139 11965 -1630 -2757 11727 7636 -8022 -86 9921 -4694
397 -4694 -12490 1077 1266 -12567 -9014 2924 -1603 -6081 2023 7844 4896 3174 5446 8587 5681
412 5681 -2119 -1154 4771 -3214 -10046 652 2595 -10987 -5754 7110 -3391 -9936 6232 6755
426 6755 -8576 1308 12504 -1767 -6076 9149 4289 -9239 1013 6862 -4331 -3199 5693
$$ packed form
328a1074K3710o202k0367R746P839j3220K34P003k475L176L540m319P147Q769
342A3507j3221K38J7774j0472j8160J6370N229k6328L104K0506j6129j3028K2955
355B345L396k0462J2537J7184j6203m687J9583l909j6608R756Q711j5162l731
368g250J2164k425j0337L905O994k623m317K597M283p00o366M4O790k079r012
383h332M841J0724p017p625J2548O826j3595j127J4484m091j5658P936J0007j4615
397d694p796J3567J89j3833L553J1938m527m478Q104N821k948j722K272L141k906
412E681p800R65N925p985o832J0698J943j3582N233J2864j0501o545J6168N23
426F755j5331R884J1196j4271m309J5225m860j3528J0252N849j1193J132Q892
$$ plain form
439 5693 1274 -1850 2719 -264 -3060 120 -4048 -6785 1147 -504 -7911 2473 7753 -5412 -971
454 -971 13093 1702 -7531 9895 10324 -9724 -1952 11585 -4342 -11850 4574 1111 -13674 -3956
468 -3956 4526 -4689 -4560 6116 3178 1190 5867 2930 726 5332 -554 -4995 3864 1890 -8271
483 -8271 126 7042 -6055 -6465 8034 -111 -10883 3764 8206 -8253 -3951 11516 692 -9226
497 -9226 5373 6489 -6641 -1745 6790 -411 -2220 4932 1645 -1839 2155 116 -4365 -639 -2630
512 -2630 -6445 -310 982 -6519 237 8603 -3243 -4239 10714 4816 -8774 4046 11291 -6212
526 -6212 -5847 9961 -107 -12287 410 4914 -9894 -6167 5740 -1223 -5072 3976 4784 418
540 418 2437 1948 -131 3124 -240 -4499 3057 4038 -6364 -1155 8636 -3320 -9156 6501 3818
$$ packed form
439E693m419l124M569k983k796L180m168k737P932j651p407J0384N280j3165M441
454i71J4064j1391r233J7426M29k0048P772J3537j5927p508J6424l463j4785R718
468c956Q482r215J29J0676k938j988M677k937k204M606n886m441Q859j974j0161
483h271Q397O916j3097m10J4499q145j0772J4647M442j6459M302J5467j0824r918
497i226J4599J116j3130M896Q535p201j809P152l287l484L994k039m481L726j991
512b630l815O135J292p501O756Q366j1846r96J4953n898j3590J2820P245j7503
526f212L65J5808j0068j2180J2697M504j4808L727J1907o963l849R048Q08m366
540D18K019m89k079L255l364m259P556R81j0402N209R791j1956n836J5657k683
$$ plain form
555 3818 -10802 -1368 9993 -4937 -7561 8020 3665 -8701 981 7387 -3977 -3350 6357 2023
569 2023 -1688 3106 2063 -868 1516 -2364 -4519 391 -1644 -7052 -701 2848 -4680 -980 7838
584 7838 -195 -4809 7686 5525 -6600 963 10176 -2648 -6234 5405 2469 -8654 -2449 3115
598 3115 -4909 -5127 2998 872 -3270 2259 4457 76 -611 1401 2312 903 -2792 -761 4670 1048
614 1048 -4943 1477 6214 -3228 -5233 4102 2066 -6956 -1377 4965 -3049 -5212 4159 2821 -6019
629 -6019 -1465 6739 -32 -5005 3579 7804 -1148 -2398 5420 4244 -5085 -4919 2253 -1879 -7481
644 -7481 -2189 2249 -2205 -3796 3179 3421 -1242 -778 5299 3420 -2650 65 6713 1546 -5683 786
660 786 5280 -4976 -8065 3402 2478 -7740 -1718 7390 -703 -5287 4969 5258 -5253 -2249 5423
$$ packed form
555C818j4620R434J1361j4930k624J5581m355j2366R682O406j1364O27R707m334
569B023l711M794j043k931K384l880k155M910k035n408O351L549p528L700Q818
584G838q033m614J2495k161j2125P563R213j2824l586J1639k936j1123O205N564
598C115q024k18Q125k126m142N529K198m381o87K012R11j409l695K031N431l622
614A048n991O420M737r442k005R335k036r022N579O342q014k163R371j338q840
629f019M554Q204o771m973Q584M225q952j250P818j176r329J66P172m132n602
644g481N292M438m454j591O975K42m663M64O077j879o070K715O648n167p229O469
660G86M494j0256l089J1467r24j0218O022R108q093m584J0256K89j0511L004P672
$$ plain form
675 5423 -601 -4552 1617 4673 -1136 -895 2742 2595 -765 -2206 620 1594 -2593 -3943 2511 1106
691 1106 -6683 -1481 5174 -3161 -5592 5701 4164 -5214 2666 10021 -954 -3645 7095 3233
705 3233 -7133 -986 3181 -4603 -5324 1125 163 -3166 -426 1774 577 29 454 1775 2455 -389
721 -389 -40 4491 1090 -4530 944 4148 -4531 -4406 4564 546 -6774 1243 6220 -3466 -3756 4899
737 4899 1007 -5440 32 3853 -1849 -2521 1926 2677 -55 -282 2381 3242 -1051 -2299 2357 2288 -4528
754 -4528 -2472 3496 -1850 -6738 753 2933 -4802 -3126 5669 1743 -3741 3438 6722 -1132 -2076
769 -2076 4862 2275 -4529 -1848 2119 -1366 -4591 -581 2370 -2191 -3163 1983 2871 -2384 -1234 4081
785 4081 2427 -2749 1312 4596 -1044 -3515 2354 2480 -3870 -2384 3530 472 -3256 -169 3061
$$ packed form
675E423o024l951O169L056n809K41L637j47l360j441K826R74m187j350O454j405
691A106p789N202O655q335k431J1293j537r378P880P355j0975k691J0740l862
705C233j0366O147M167p784p21O449r62l329K740K200j197n48M25J321O80k844
721c89L49M531l401n620N474L204q679J25Q970m018p320Q017M977r686k90Q655
737D899l892o447N472L821n702o72M447P51k732k27K663Q61m293j248M656o9o816
754d528K056N968n346m888P491K180p735J676Q795l926n484P179L284p854r44
769b076O938k587o804K681L967l485l225M010K951m561r72N146Q88n255J150N315
785D081j654n176M061L284n640k471N869J26o350J486N914l058l728L087L230
$$ plain form
800 3061 -412 -3403 226 1552 -2320 -2885 1728 1938 -2812 -984 4068 751 -2279 2516 4305 -1548
816 -1548 -1811 3987 730 -3991 -206 1988 -2904 -3828 1190 -97 -3601 -666 2727 931 -807 1718
832 1718 3523 920 -804 1727 2138 -1911 -2510 1069 745 -3922 -2164 2454 -893 -3939 1619 3636
848 3636 -2188 -1312 3982 1699 -2773 673 3561 -957 -2708 1700 1110 -2192 -885 1510 849 -2058
864 -2058 -311 1107 217 -1905 -831 1307 -1243 -2523 752 1662 -2139 -1173 2890 1263 -1693 1542
880 1542 3954 -877 -1430 2961 1201 -3383 -776 1376 -2582 -4024 568 741 -2413 -1072 2336 849
896 849 -867 1732 3199 962 -128 1490 1620 -686 -2264 340 467 -3274 -2552 1297 300 -3107
912 -3107 -33 3673 -727 -2601 2852 2531 -2629 -582 3823 -123 -2928 931 2124 -2092 -814
$$ packed form
800C061l473k991L629J326l872n65M613K10m750J828N052l317l030M795J789n853
816a548k63N798l257m721L785K194m892r24N018j287l504K935L393j796j738K525
832A718J805k603j724K531M11m049n99L579l24m667J758M618l347l046N558K017
848C636n824Q76N294k283m472L446K888m518j751M408n90l302J307K395o61k907
864b058J747J418q90k122J074K138k550j280L275R10l801R66M063j627k956L235
880A542K412m831n53M391j760m584K607K152l958j442M592J73l154J341L408j487
896H49j716K599J467k237j090J618J30k306j578K604J27l741P22L849r97l407
912c107L074L706m400j874N453l21n160K047M405l946k805L859J193m216J278
$$ plain form
927 -814 2020 723 -1706 286 961 -530 -952 -709 -465 -494 -1713 -971 761 -527 -1418 1189 1908 -763
945 -763 195 3940 1126 -2127 1960 1701 -3140 -2079 2030 -2031 -4485 321 1059 -3384 -826 2630
961 2630 117 -944 2634 2099 -73 524 1877 -126 -411 -211 -688 -498 -625 -1986 15 670 -1642
978 -1642 -993 2709 -41 -2373 1040 2278 -2103 -1859 2698 205 -2679 980 2577 -1368 -374 2682
994 2682 728 -1543 953 1937 -686 -1423 514 -300 -1504 -1311 -917 314 -624 -1513 1314 2355 394
1011 394 -245 2985 1472 -983 1033 1833 -1960 -2185 813 -565 -3093 -248 728 -2561 -804 1778
1027 1778 464 -720 1665 1640 239 577 1251 -500 58 270 -640 -850 -197 -846 -264 569 111 -1290
1045 -1290 556 743 -1302 -256 1850 -1105 -1673 1207 1183 -1902 79 2564 -606 -1163 1769 1502
$$ packed form
927h14K834j297k429J992O75j491m22K43K44k9j219P42J732j288q91K607P19k671
945g63R58L745k814l253M087k59m841J061M109m061k454M806P38m443K558L456
961B630k513j061L578n35k172N97J353k003k85K00m77J90j27j361K001O55k312
978a642O49L702k750k332L413J238m381K44M557k493k884L659J597l945R94L056
994B682j954k271K496R84k623p37J937q14j204J93L94J231r38q89K827J041j961
1011C94o39L230j513k455K016Q00l793k25K998j378k528K845R76l289J757K582
1027A778j314j184K385k5j401L38O74j751N58K12r10k10O53o49N82Q33m58j401
1045a290J846J87k045J046K106k955n68K880k4l085J981K485l170n57K932k67
$$ plain form
1061 1502 -1372 341 1930 -1301 -1388 364 -373 -2064 -1355 -11 -715 -951 -56 473 1294 959 -3 1530
1079 1530 1710 -206 -576 1498 -210 -2095 60 747 -2007 -1883 1184 -292 -2098 440 1524 -978
1095 -978 -209 2335 823 -811 792 1005 -833 -289 30 -671 1 541 -22 -104 444 -659 -667 725 -612
1114 -612 -1121 670 308 -1620 -18 1854 -1400 -1233 1709 1216 -1525 732 2449 -627 -615 1448 475
1131 475 -2137 -551 284 -1528 -1852 -92 -320 -648 38 243 688 1143 531 763 1726 -105 -788 1266
1149 1266 989 -1971 -1022 1441 -1180 -2884 787 925 -2224 -737 1835 -147 -604 1478 1265 -1008
1165 -1008 191 1506 -754 248 473 11 -175 344 -317 -138 712 -547 -275 706 -464 -1689 -12
1182 -12 792 -1787 -1136 1476 -233 -1478 1570 1879 -596 -196 2496 457 -1159 1138 1126 -1561 -1363
$$ packed form
1061A502k874J713J589l231q7J752p37j691P09J344p04k36Q95N29Q21l35r62J533
1079A530J80j916l70K074j708j885K155O87k754J24L067j476j806K538J084k502
1095i78P69K544j512j634J603K13j838N44L19p01O72N40n63q2N48j103qJ392j337
1114f12n09J791l62j928J602J872l254J67K942m93k741K257J717l076J2K063r73
1131D75k612J586Q35j812l24J760k28l28O86K05M45M55o12K32R63j831o83K054
1149A266k77k960R49K463k621j704L671J38l149J487K572j982m57K082k13k273
1165a008J199J315k260J002K25m62j86N19o61J79Q50j259K72R81j170j225J677
1182a2Q04k579O51K612j709j245L048L09k475M00K692k039j616K297j2k687J98
$$ plain form
1199 -1363 -14 -807 -1364 -149 180 -404 -67 196 873 813 350 859 1459 -43 -750 849 449 -1326
1217 -1326 -238 1225 -627 -2363 173 815 -1941 -426 1755 324 -1394 941 1009 -898 -620 1393
1233 1393 92 -915 70 1158 305 -109 299 1330 -138 -710 -159 638 -1022 -1278 502 666 -1234
1250 -1234 -294 1396 26 -664 1213 1548 -253 343 1776 774 -841 646 1356 -984 -1648 1
1266 1 494 -1505 -1101 345 -19 -800 -67 1157 445 -12 474 1144 -228 -386 1115 601 -873 -18 1193
1285 1193 -1244 -1411 463 587 -597 -595 802 173 -874 258 1235 -569 -979 550 1014 -547 -200
1302 -200 1052 695 -653 -32 1958 -235 -1227 93 769 -1668 -1021 588 -301 -1649 -543 913 62
1319 62 -844 544 637 -201 -124 1642 949 -254 -177 1148 42 -1384 -162 639 -1179 -1487 330 465
$$ packed form
1199a363J349p93n57J215L29n84L37K63O77o0m63N09O00j502p07J599m00j775
1217a326J088J463j852j736K536O42k756J515K181j431j718K335O8j907K78K013
1233A393j301j007R85J088q53m14M08J031j468n72N51P97j660k56J780J64j900
1250a234R40J690j370o90J877L35j801N96J433j002j615J487P10k340o64J649
1266AM93j999M04J446l64p81P33J224p12m57M86O70j372j58J501n14j474Q55J211
1285A193k437j67J874J24j184KJ397o29j047J132R77j804m10J529M64j561L47
1302b00J252l57j348O21J990k193r92J320O76k437O47J609q89j348J106J456q51
1319F2r06J388R3q38P7J766o93j203P7J325j106j426J222Q01j818l08J817J35
$$ plain form
1337 465 -1152 -143 1647 -503 -1168 905 1155 -662 -87 1199 587 -615 -128 1150 -393 -666 629
1354 629 330 -257 -823 -165 496 -700 -681 500 -11 -676 -73 1252 -306 -627 1269 910 -184 -140 1302
1373 1302 -189 -1424 1271 112 -995 -887 386 -446 -1286 -247 981 -76 -661 983 1455 114
1389 114 404 1333 627 -402 -228 697 113 -1306 -18 957 -511 -921 125 740 -1270 -276 1014 -293
1407 -293 -989 824 1146 -545 -706 1412 710 -535 15 1320 151 -325 261 692 -811 -327 448 -208
1425 -208 -966 -507 458 -321 -400 531 642 297 -195 768 1353 -413 -116 1226 287 -1298 330 617 -866
1444 -866 -1081 758 -9 -1521 -148 1236 -48 -1223 975 1040 -361 -49 1433 76 -494 848 235
1461 235 -532 -624 353 -185 -640 -821 16 7 -277 -943 483 430 -776 -80 866 -371 -667 926 1083 -1163
$$ packed form
1337D65j617J009J790k150o65K073K50j817N75J286o12j202M87J278j543k73J295
1354F29k99n87n66O58O61j196J9J181n11o65O03J325j558l21J896l59j094M4J442
1373A302j491j235K695j159j107J08J273q32q40J039J228j057n85J644M72j341
1389A14K90R29p06j029J74R25n84j419J288R75j468m10J046O15k010R94J290j307
1407b93o96J813L22j691j61K118p02j245N50J305j169m76N86M31j503M84P75o56
1425b08p58M59R65p79p9R31J11l45m92R63N85j766K97J342r39j585J628K87j483
1444h66k15J839p67j512J373J384j284j175K198O5j401L12J482j357n70J342o13
1461B35p67r2R77n38m55j81Q37rk84o66J426n3j206O96R46j237k96J593J57k246
$$ plain form
1481 -1163 557 1569 -399 -1020 1117 553 -879 -222 413 -857 -1260 36 -187 -699 -703 584 418 -219
1499 -219 226 300 723 19 -301 783 194 -985 -338 1191 -879 -1314 347 230 -1711 -172 1286 -632
1517 -632 -1338 569 859 -976 216 1068 163 -602 667 467 -67 -25 282 98 -62 -100 111 243 -277
1536 -277 -454 13 345 -750 -115 510 -255 -771 1387 620 -880 559 1678 -64 -555 963 789 -1274
1554 -1274 -344 839 -862 -867 -204 -88 -992 -142 413 -163 -33 322 172 497 98 -16 283 398 -689
1573 -689 -417 933 -341 -797 296 587 -1444 -74 642 -373 -1033 149 649 -719 229 753 -340
1590 -340 -649 786 997 -410 30 142 -402 -5 213 -4 -298 -363 -370 139 590 -274 -405 -330 -246 -616 601
1611 601 768 -510 -71 1085 6 -592 75 269 -468 -353 150 -286 -642 -135 123 -496 -534 122 -259
$$ packed form
1481a163J720J012j968o21K137n64j432O57O35j270m03J296k23n12mJ287j66o37
1499b19M45P4M23p04l20J084n89j179O47J529k070m35J661j17j941J539J458j918
1517f32p06J907K90j835J192Q52r05p65J269k00n34M2L07j84j60l8K11J32n20
1536b77j77M67L32j095O35O25p65n16K158p67j500J439J119j742m91J518j74k063
1554a274R30J183j701nO63J16r04Q50N55n76J30L55j50L25l99j14K99J15j087
1573f89K72J350j274m56J093K91k031J370P16j015o60J182N00j368R48N24j093
1590c40l09J435K11j407M40J12n44L97K18k17k94o5pN09M51q64j31P5Q4l70J217
1611F01J67j278M39J156j079n98O67J94p37J15N03m36l56N07K58o19l8O56l81
$$ plain form
1630 -259 -8 -33 210 -180 122 463 135 362 -323 -611 368 -19 -589 -107 578 -803 -524 55 -461 -797
1650 -797 365 554 -779 -670 803 -200 -520 306 319 480 375 61 88 -144 90 -74 117 36 -30 -233
1670 -233 -75 -319 -421 423 -304 -354 513 445 55 -45 799 48 -680 309 517 -215 -229 445 -23 -785 143
1691 143 -253 -337 -289 174 0 -339 190 314 196 45 510 270 72 195 -25 260 557 -521 -253 -73
1711 -73 -101 -527 6 187 -452 228 122 -223 -360 -124 422 1 133 389 102 204 354 485 -25 74 -2
1732 -2 -187 -300 -278 -252 -195 -858 -173 -197 -22 -315 -5 508 621 -96 145 373 -42 101 570 -14 -713 156
1754 156 598 -311 -506 425 -203 -579 -27 375 -575 50 397 18 252 229 45 184 186 -107 339 330 -271 -41
1776 -41 207 -68 -103 -244 146 -484 7 509 -36 -348 272 165 121 -526 419 465 122 74 244 615 -98 -42
$$ packed form
1630b59K51k5K43l90L02L41l28K27o85k88R79l87n70M82O85j381K79N79n16l36
1650g97J162J89j333J09J473j003l20Q26J3J61j05l14K7k32K34j64J91q1o6k03
1670b33J58k44j02Q44p27n0Q67o8l90j00Q44p51p28R89K08p32j4O74m68p62R28
1691A43l96q4M8M63j74l39N29J24j18j51M65k40j98J23k20K85K97j078K68J80
1711g3k8m26N33J81o39O80j06l45j37K36N46m21J32K56k87J02J50J31n10R9p6
1732bj85j13K2K6N7o63O85k4J75k93L10N13J13p17K41K28m15J43M69n84o99Q69
1754A56M42r09j95R31o28l76N52M02r50O25L47l79K34k3j84J39Kk93M46ro01K30
1776d1K48k75l5j41L90o30M91N02n45l12O20j07m4o47R45M6l43m8J70L71p13N6
$$ plain form
1798 -42 -59 78 -384 -88 224 -311 -487 -199 344 -609 14 232 226 41 600 736 -423 106 324 407 208
1819 208 37 -247 -440 -270 -240 132 49 -202 234 80 -359 227 331 171 -218 161 230 -222 335 104 198
1840 198 -114 78 -196 -45 -19 62 136 -68 -56 230 -389 -419 -33 150 114 -327 27 92 -412 125 231 384
1862 384 -256 87 504 -74 -438 108 -87 -17 169 310 103 -603 60 308 143 -190 135 248 -13 -102 -19
1883 -19 -214 -336 496 74 114 -284 -184 -47 -29 -249 -400 294 -191 -253 -23 208 -223 -726 134 310 -269
1904 -269 748 222 -292 267 310 -30 -335 244 -136 -766 -18 444 -11 -11 225 -171 -491 -453 121 341 356
1925 356 -35 -55 134 33 112 -71 63 -15 -182 360 -267 -345 -136 187 -652 -110 98 11 -42 78 423 -284
1947 -284 226 142 364 -241 -5 -312 79 96 -101 3 -232 -102 -92 15 185 203 247 -126 -294 108 39 -215
$$ packed form
1798d2j7J37m62K96L12n35j76K88N43r53O23K18oj85N59J36j159N29K18Q3j99
1819B08j71k84j93J70L0L72q3k51M36j54m39N86J04j60l89L79O9m52N57k31R4
1840A98l12J92k74J51K6Q1P4k04J2K86o19l0L86J83l6m41L54O5n04N37J06J53
1862C84o40L43M17n78l64N46j95P0J86J41k07p06O63K48j65l33L25J13k61q9Q3
1883a9j95j22Q32m22M0l98J00J37J8k20j51O94m85o2K30K31m31n03Q60J76n79
1904b69J017n26n14N59M3l40l05N79l80o30P48M62m55%K36l96l20L8N74K20J5
1925C56l91k0J89j01P9j83J34p8j67N42o27p8K09L23q39N42K08q7n3J20L45p07
1947b84N10q4K22o05K36l07L91J7j97J04k35J30J0J07J70J8M4l73j68M02o9k54
$$ plain form
1969 -215 0 315 372 -365 -127 270 61 -295 16 422 -110 138 -417 239 122 -180 74 107 -234 246 -101
1990 -101 250 0 -336 396 -115 -225 220 288 -333 -116 173 87 -542 -247 545 -175 -242 193 -78 -406 -107
2011 -107 557 -290 620 197 99 65 -240 345 -320 -33 -136 -320 47 -370 -32 8 14 -482 263 60 -378 -17
2033 -17 431 -47 -517 -59 172 -239 -336 622 61 -324 266 205 -344 -282 -275 -258 269 -85 -113 371 -137 350 486
2056 486 75 -240 17 157 -64 -37 27 294 -279 -197 297 -376 -838 16 219 -426 249 -1 153 -241 49
2077 49 517 -336 -220 353 224 117 104 325 -387 12 479 163 -480 27 635 178 -10 -397 -136 76 178
2098 178 -203 252 335 -606 172 35 -75 -319 428 343 -365 -44 65 -222 -470 45 234 -740 215 58 253
2119 253 59 33 129 276 382 -337 556 228 180 97 234 -99 -267 212 13 -482 -434 233 -187 -134 111 270
$$ packed form
1969b15K15L15N7p37K38L97k09l56L11M06n32K48n55O56j17l02K54L3l41M80l47
1990a01L51k50l36P32n11j10M45O8o21K17K89q6o29K95P92p20o7M35k71l28K99
2011a07O64q47R10m23r8l4l05N85o65K87j03j84L67m17L38M0Om96P45k03m38L61
2033a7M48m78m70M58K31m11r7R58n61l85N90o1n49O2PJ7N27l54k8M84n08M87J36
2056D86m11l15K57J40k21K7O4K67n73Q2M94o73m62Q54K03o45O75k50J54l94K90
2077D9M68q53J16N73j29j07j3K21p12L99M67l16o43N07O08m57j88l87K61K12J02
2098A78l81M55Q3r41P78j37j10k44P47q5p08L21J09k87k48N15J89r74R55j57J95
2119B53j94k6R6J47J06p19Q93l28m8q3J37l33j68M79j99m95M8O67m20N3K45J59
$$ plain form
2141 270 -324 -191 -16 -205 -223 86 246 204 116 540 -77 128 287 39 -50 447 -18 261 -124 -71 -325 -169
2163 -169 -260 -397 405 138 -711 129 -58 -133 -490 110 49 -208 -327 787 -79 -329 286 -31 -60 100 268
2184 268 -217 -65 -133 -200 -44 -414 -150 292 -406 71 182 -269 -406 437 291 -257 113 -599 -8 -441 166
2205 166 0 166 -118 -191 3 80 115 24 24 -365 -89 312 480 197 91 188 -198 -725 -248 -8 -127 -294
2227 -294 50 -11 -604 -212 31 107 331 368 356 -162 23 160 142 -112 102 372 2 129 -133 -532 40 -235
2249 -235 -95 188 -475 -311 -80 192 19 19 112 -27 191 71 -277 -95 -128 -289 280 407 21 -229 521
2270 521 -455 99 -199 71 271 32 -219 -199 -148 134 -141 320 128 35 -251 181 445 385 219 -110 209
2291 209 -262 168 209 -58 -31 -250 177 153 -175 -135 -28 -378 238 78 139 94 -215 163 -314 -144 237 26
$$ packed form
2141B70n94J33J75j89j8L09J60m2q8M24o17K05J59k48q9M97m65K79l85N3k54J56
2163a69r1j37Q02k67q49Q40j87p5l57O00o1k57j19J114q66k50O15l17k9J60J68
2184B68m85J52o8o7J56l70K64M42o98M77J11m51j37Q43j46n48L70p12N91m33O07
2205A66j66J66k84p3J94P7L5r1%l89K76M01J68k83j06R7l86n27M77K40j19j67
2227b94L44o1n93L92K43P6K24L7j2n18J85J37j8k54K14K70l70J27k62l99N72k75
2249b35J40K83o63J64K31K72j73%R3j39K18j20l48J82l3j61N69J27l86k50P50
2270E21r76N54k98K70K00k39k51K0N1K82k75M61j92r3k86M32K64o0j66l29L19
2291B09m71M30M1k67K7k19M27k4l28M0J07l50O16j60O1m5l09L78m77J70L81k11
$$ plain form
2313 26 -369 100 -230 -382 -144 -270 -116 168 100 -41 -48 -328 109 -148 -2 -176 -71 382 -208 -147 112 156
2335 156 106 -441 243 -8 67 393 2 107 1 342 -23 -131 3 472 67 148 114 -84 22 -30 119 326
2357 326 75 -21 -273 -60 -368 -135 261 -136 -435 228 -398 -229 -386 498 438 -152 31 -66 -82 -243 83
2378 83 112 -85 -249 -51 154 -569 -108 -300 -81 2 -170 134 -325 253 119 72 -302 -345 -85 -119 -510 -6
2400 -6 -38 -212 -166 450 -248 -127 -301 203 198 -478 -29 281 309 -29 10 -256 176 -59 -301 -246 -98 -91 128 -122
2424 -122 -110 -193 79 -623 128 36 -216 -190 -160 106 -136 -273 441 119 36 47 -153 -144 291 -225 196 253 311 70
2448 70 -85 164 -265 221 -275 -5 -264 218 294 -190 318 234 -135 -241 82 91 -410 -74 -52 -146 -665 509
2470 509 384 -172 345 47 -75 -77 -68 288 354 -68 -201 -19 -416 -361 -90 273 379 54 205 -173 124 230
$$ packed form
2313B6l95M69l30j52K38j26J54K84o8j41pk80M37k57J46j74J05M53n90O1K59M4
2335A56n0n47O84k51P5L26l91J05j06L41l65j08J34M69m05Q1l4j98J06n2J49K07
2357C26k51r6k52K13l08K33L96l97k99O63o26J69j57Q84o0n90J83r7j6j61L26
2378H3K9j97j64J98K05p23M61j92K19Q3j72L04m59N78j34m7l74m3K60l4l91N04
2400fl2j74M6O16o98J21j74N04no76M49L10K8l38L9k66M32k35k42N5J48PK19k50
2424a22J2q3K72p02P51r2k52K6L0K66k42j37P14l22q3J1k00RM35n16M21N7N8k41
2448G0j55K49m29M86m96K70k59M82P6m84N08q4l69j06L23Rn01L36K2r4n19J174
2470E09j25n56N17k98j22kRL56O6m22j33J82l97N5K71L63J06l25J51l78K97J06
$$ plain form
2492 230 -86 157 118 149 -358 -99 -373 -300 -126 382 -122 217 15 -25 -111 154 -49 -255 27 33 -273 -204 85
2515 85 465 64 -181 -23 154 -443 -90 284 77 -16 80 -63 -1 -58 -1 24 -367 19 -61 -151 65 292 -132
2538 -132 526 -397 -9 49 -92 223 56 77 -88 168 189 -432 513 129 132 -167 -142 184 -65 69 -32 -387
2560 -387 -134 13 -92 127 -27 -351 41 -225 8 302 81 -42 -42 596 9 -96 437 -205 -561 77 -74
2581 -74 -203 -164 -243 53 290 -275 -580 323 37 249 37 -125 -221 103 267 377 110 271 -168 145 -25
2602 -25 56 -224 -211 -155 114 -31 -166 384 540 -461 344 269 -82 260 466 329 503 -68 -26 49 -329 -62
2624 -62 179 426 -143 50 127 327 -2 -359 -206 -456 -284 -89 -6 -176 -137 -181 96 -52 179 151 243 318 -404
2647 -404 -326 13 -216 -249 -209 2 207 426 -309 248 -147 203 307 -109 285 62 5 -25 -211 -102 373 39
$$ packed form
2492B30l16K43l9L1n07K59k74P3J74N08n04L39k02m0q6K65k03k06K82Ol06O9K89
2515H5L80m01k45J58J77n97L53L74k07r3R6j43O2n7N7K5l91L86q0r0K16K27m24
2538a32O58r23L88N8j41L15j67K1j65K56K1o21R45l84Lk99K5L26k49J34j01l55
2560c87K53J47j05K19j54l24L92k66K33K94k21j23%O38n87j05N33o42l56O38j51
2581g4j29L9p9K96K37n65l05R03k86K12k12j62r6L24J64J10k67J61m39L13j70
2602b5Q1k80J3N6K69j45j35N50J56j001Q05p5l51L42K06j37J74n71M2P5l78K67
2624f2K41K47n69J93P7K00l29l57J53k50J72J95Q3j70L9m4K77j48K31k8R2P5p22
2647d04P8L39k29l3M0K11K05K19p35N57l95L50J04m16L94k23n7l0j86J09M75l34
$$ plain form
2669 39 -2 -523 201 258 -59 19 -281 10 71 28 -356 -122 -58 218 397 -77 110 242 100 -195 -111 53 -5
2692 -5 -197 -282 -167 63 -128 -225 162 -120 50 380 -177 -160 -68 -80 -402 323 -75 -51 56 91 33 148 228 -75
2716 -75 -104 318 -64 -248 509 -84 -1 159 361 412 -5 202 -179 44 345 -59 -170 -168 -58 -619 95 -527
2738 -527 -132 128 213 258 -131 35 121 168 45 241 -181 -88 34 -102 8 -62 -60 -82 -214 -102 45 -120 137
2761 137 -200 449 90 -390 -170 5 -73 -77 187 111 380 -177 209 334 -18 -300 27 -191 -200 -195 -368 174 48
2784 48 14 -150 -107 -312 67 -58 477 185 163 302 156 -363 74 4 -43 459 375 207 -154 -50 117 367
2806 367 -21 -112 99 -234 25 73 -281 -212 160 -308 -269 101 119 21 178 -184 -29 -120 -21 -81 -33 -171 471
2829 471 -19 -76 201 233 -143 167 -329 -50 131 -33 -50 -60 -24 -413 -166 191 266 120 155 26 -491 -23
$$ packed form
2669C9m1n21P24N7l17P8l00K91O1m3l84K34O4K76J79m74J87J32j42k95Q4J64n8
2692ej92q5J15K30j91r7L87k82J70L30n57J7R2j2l22P25l98K4J07L5n8J15Q0l03
2716g5k9M22l82j84P57n93Q3J60K02N1m17K07l81K23L01m04j11KJ10n61P14o22
2738e27L95K60Q5M5l89J66Q6M7j23J96m22R3J22j36J10p0Kk2j32J12J47j65K57
2761A37l37O49l59m80K20J75p8mK64p6K69n57L86J25l52k82L27k18rNj73N42j26
2784D8l4j64M3k05L79j25N35k92k2J39j46n19M37p0m7N02q4j68l61J04J67K50
2806C67l88r1K11l33K59M8l54O9L72m68L9L70J8r8J57l62J55r1R9o0M8j38O42
2829D71m90n7K77L2l76L10m96K79J81j64j7j0L6l89K47L57P5j46L5j29n17M68
$$ plain form
2851 -23 36 -83 -122 315 -83 271 85 71 296 112 -192 -42 477 -27 -201 34 34 -202 172 -211 357 -260
2873 -260 331 110 236 132 -22 -10 -63 -144 19 103 414 -436 19 188 13 257 206 -274 312 745 -11 169
2895 169 81 -32 -85 203 75 181 -121 -145 -157 52 11 20 97 -195 38 95 65 332 -136 109 -208 164 -76
2918 -76 -73 94 -27 -319 428 221 55 335 -394 23 -2 469 -284 -342 -159 18 97 178 219 -184 -83 113 -46
2941 -46 -214 -528 138 327 370 -124 3 58 -441 -86 -130 235 -1 -290 -215 29 -113 -164 -242 282 175 -155
2963 -155 -151 -310 59 158 -34 210 -145 -393 242 76 -183 197 -3 5 75 10 249 263 57 -44 193 235 105
2986 105 -320 10 66 107 82 -180 -110 -454 169 -112 269 -119 95 323 24 -97 213 -32 125 72 191 148
3008 148 132 45 -69 -68 -83 116 -177 -25 -176 79 389 19 -250 321 241 -230 110 5 31 92 124 286 380
$$ packed form
2851b3N9j19l9M37l98L54j86j4K25j84l04J50N19n04j74K35%k36L74l83N68o17
2873b60N91k21J26j04j54J2n3q1J63Q4L11q50M55J69j75K44n1m80N86M33p56J80
2895A69q8j13n3K88j28J06l02k4j2K09m1RP7k92K33N7l0K67m68K45l17L72k40
2918g6LJ67j21k92P47k07j66K80p29M17k5M71p53n8J83J77P9Q1M1m03J01J96j59
2941d6j68l14O66J89M3m94J27N5m99L55m4L65k36k89P5K44j42n1p8N24j07l30
2963a55Mj59L69R9j92K44l55k48O35j66k59L80k00QP0o5K39J4k06j01K37M2j30
2986A05m25L30N6M1k5k62P0l44O23k81L81l88K14K28k99j21L10k45J57n3J19m3
3008A48j6q7j14Jj5J99k93J52j51K55L10l70k69N71q0m71L40j05K6O1L2J62R4
$$ plain form
3031 380 206 -70 233 -45 -151 -420 -134 -37 211 154 -249 -188 124 -44 -255 4 -384 -117 480 -26 131
3052 131 158 135 -79 260 -86 26 -121 157 -128 12 450 167 -62 -42 -282 -231 -182 1 -445 -329 86 -109
3074 -109 165 -155 -163 -49 -16 98 -123 447 -170 239 142 62 252 62 250 -408 1 -128 126 173 237 316 194
3097 194 -211 -164 -199 -1 116 587 -66 -85 -335 185 -162 -47 -185 -171 89 -47 48 45 157 169 -323 -138 244
3120 244 -218 75 268 42 391 -201 -144 272 -129 -226 -114 192 20 -86 300 -176 107 94 -303 -43 -344
3141 -344 -472 87 151 -357 33 -4 84 -93 -270 -486 -313 127 -693 -13 -44 291 -75 264 -154 102 -10
3162 -10 -368 -144 -406 78 435 89 28 145 -149 -308 308 427 76 148 -252 -125 -18 -84 -198 -7 107
3183 107 -213 465 221 -209 192 -148 27 -171 -47 455 68 -152 -76 385 1 255 85 100 477 -3 -273
$$ packed form
3031C80j74k76L03k78j06k69K86R7K48n7m03O1L12j68k11K59l88K67N97n06J57
3052A31K7k3k14L39l46J12j47K78k85J40M38k83k29K0k40N1M9J83m46J16M15j95
3074a09K74l20qJ14L3J14k21N70o17M09r7q0J90j90J88o58M09j29K54M7O4P9j22
3097A94m05M7l5J98J17M71o53j9k50N20l47J15j38J4K60j36R5lJ12J2m92J85L82
3120B44m62K93J93k26L49n92N7M16m01r7J12L06j72j06L86m76K83j3l97K60l01
3141c44j28N59O4n08L90l7Q8j77j77k16J73M40q20O80l1L35l66L39m18K56j12
3162a0l58K24k62M84L57l46o1J17k94j59O16J19l51P2m00J27J07o6j14J91J14
3183A07l20O78k44m30M01l40J75j98J24N02l87k20P6M61l84K54j70J5L77m80k70
$$ plain form
3204 -273 -14 -52 440 228 85 50 191 114 43 374 176 106 340 -519 317 217 90 -135 51 50 -85 -254
3226 -254 -92 74 -67 -358 6 -112 229 -360 48 -295 -50 278 203 -272 -293 -85 -100 99 113 83 -468 -138
3248 -138 -84 -191 -322 196 -359 42 -58 -239 -202 380 18 294 268 -32 91 -266 -136 -25 -259 18 -26
3269 -26 268 255 119 356 186 548 229 235 26 339 -86 -283 285 -61 22 -281 181 148 126 303 -45 -230
3291 -230 -46 68 -138 406 -59 -42 -111 30 -91 -147 300 331 319 -301 -101 -190 -2 -319 -8 -145 -21 -211
3313 -211 -34 -170 -115 140 -33 -70 -172 -59 -323 -71 -149 -283 116 -168 -57 -84 -279 90 -227 336 -159
3334 -159 197 -147 -442 84 348 239 508 161 74 80 306 -50 40 -37 306 108 118 -246 175 19 -189 282
3356 282 -49 200 -373 38 -284 36 -79 186 -452 -32 -83 140 305 -717 -18 -39 -77 112 -139 74 -51
$$ packed form
3204b73K59l8M92k12j43l5J41p7p1L31j98p0K34q59Q36j00j27k25J86jj35j69
3226b54J62J66j41k91L64j18L41n89M08l43K45L28p5m75k1K08j5J99J4l0n51L30
3248a38N4j07j31N18n55M01j00j81L7N82l62K76k6l00J23l57J30J11k34K77m4
3269b6K94j3j36K37j70L62l19Ok09L13m25j97N68l46Q3l03M62l3k2J77l48j85
3291b30J84J14k06N44m65J7o9J41j21n6M47L1j2o20K00q9J88l17L11j37J24j90
3313b11J77j36N5K55j73l7j02J13k64K52p8j34L99k84J11k7j95L69l17N63m95
3334a59L56l44k95N26K64j09K69l47q7OK26l56R0p7L43j98J0l64M21j56k08M71
3356B82l31K49n73M11l22L20j15K65o38M20n1K23J65j022O99k1l8J89k51K13j25
$$ plain form
3377 -51 -494 -340 -75 -77 -310 51 -206 -40 165 142 124 172 -25 109 120 299 2 -162 7 -148 -205 53 -164
3400 -164 180 261 -309 -60 -379 -13 -149 33 17 129 -503 178 375 -182 -365 -65 -1092 395 -444 -313
3420 -313 337 -57 -100 -16 -160 573 167 -80 22 102 -134 -70 328 5 -89 -381 251 -371 -186 306 214 -76
3442 -76 368 -21 336 69 -41 -37 -59 31 210 446 -88 11 -57 2 228 -184 276 -255 -122 -102 -163 61 53 -117
3466 -117 97 133 -218 155 6 -247 276 24 -108 36 -97 -239 -113 113 225 -109 176 34 -45 -298 483
3487 483 172 72 -23 106 -24 -118 352 175 -191 -25 51 95 158 60 -63 120 -4 -161 197 126 147 -437 74
3510 74 307 69 -212 360 234 -194 319 239 -34 -139 62 -368 49 -223 -332 -9 62 525 -337 -43 14
3531 14 145 -93 -174 205 293 -69 -516 194 -134 4 -133 18 -130 -111 19 -221 -323 127 -155 469 157
$$ packed form
3377e1m43J54K65kk33L61k57J66K05k3j8M8j97J34J1J79k97j64J69j55n7K58k17
3400a64L44Q1n70K49l19L66j36J82j6J12o32O81J97n57j83L00j027J487q39J31
3420c13O50l94m3Q4j44P33m06k47J02Q0k36O4L98l23r4k92O32o22J85M92r2k90
3442g6M44l89L57k67j10Mk2R0J79K36n34R9o8N9K26m12M60n31J33K0o1K24qj70
3466a17K14L6l51L73j49k53N23k52j32J44j33j42J26K26J12l34K85j42p9k53P81
3487D83l11j00r5J29j30r4M70j77l66J66P6M4O3r8j23J83j24j57L58p1K1n84N11
3510G4K33k38k81N72j26m28N13q0k73j05K01m30M17k72j09L23P1M63q62K94N7
3531A4J31k38q1L79Q8l62m47P10l28J38j37J51j48J9J30k40j02M50k82O24l12
$$ plain form
3552 157 306 -499 263 197 -412 -237 -318 -122 -226 255 68 202 -239 -346 9 -269 154 -63 -180 18 53
3573 53 29 144 124 -70 -141 -41 39 5 21 -180 256 127 190 298 -144 -16 184 -139 55 17 -65 -39 131 65
3597 65 332 67 -10 418 -188 49 118 1 130 -128 182 146 18 148 -201 96 -292 -74 424 343 23 499
3619 499 145 -15 -181 180 249 -2 -533 -292 306 -147 255 -189 -38 -20 22 75 14 159 -54 115 -159 -48
3641 -48 293 93 185 -307 -108 -2 17 356 46 -53 180 -39 348 130 28 -23 123 137 -159 -163 -225 -288 292
3664 292 132 -146 -94 -152 10 112 424 60 -289 130 167 126 -149 -326 -20 -31 31 -232 -25 -7 -150 -22
3686 -22 -159 -189 102 322 573 -310 148 55 243 247 -127 -80 214 -175 256 85 -148 -109 237 309 591 -245 346
3709 346 -305 214 291 -140 123 219 -57 -96 -7 276 232 224 -275 -130 -298 212 169 -78 -112 92 428 131 177
$$ packed form
3552A57J49q05P62o6o09J75q1J96j04M81j87J34m41j07L55k78M23k17j17J98L5
3573E3k4J15k0j94p1J00Q0l4J6k01M36j29O3J08m42J28K00l23J94l8q2K6J70o6
3597F5K67k65p7M28o06K37O9j17J29k58L10l6j28J30l49K97l88K18M98q1l20M76
3619D99l54j60j66L61O9k51n31K41N98m53M02m44J51J8M2N3o1J45k13J69k74J11
3641d8L41k00R2m92J99J06J9L39l10r9K33k19L87k18j02n1J46J4k96mo2o3N80
3664B92j60k78N2n8J62J02L12l64l49M19L7m1k75j77L06j1O2k63K07J8j43J28
3686b2j37l0K91K20K51q83M58r3J88Ml74M7K94l89M31j71k33L9L46P2K82q36N91
3709C46o51N19P7m31K63R6k76l9Q9K83m4qm99J45j68N10m3k47l4K04L36k97M6
$$ plain form
3732 177 198 -58 76 80 197 52 16 -4 -183 -475 160 -393 -241 108 171 53 -451 -272 201 334 -33 -108
3754 -108 -58 -127 56 272 69 309 191 -9 -8 -130 287 -225 -251 -107 -101 -269 69 146 -95 1 3 -154 223 103
3778 103 248 170 75 -100 -507 282 207 -224 -3 -260 -533 289 65 22 212 -329 28 -39 -115 -269 -21 -149
3800 -149 -221 234 -12 -333 -246 462 8 -85 -284 46 -391 179 81 -214 -141 -254 -191 33 288 33 68 511
3822 511 -446 209 147 554 -79 -266 -258 -113 46 -335 -94 -191 476 -251 -16 114 1 127 -438 230 86
3843 86 -162 334 -248 -23 -149 26 430 385 -118 -101 -195 -142 318 148 -51 315 -279 115 -326 -51 104 -216
3865 -216 23 10 242 246 372 -45 -222 103 -77 -110 180 68 598 272 162 -160 -93 -36 75 358 -105 -131
3887 -131 -247 360 34 -165 39 -120 -455 -120 98 -239 -504 -91 335 -3 94 177 86 -366 -280 186 -264
$$ packed form
3732A77K1k56J34MJ17j45l6k0j79k92O35n53J52L49O3j18n04J79M73J33l67p5
3754a08N0o9J83K16k03K40j18k00Jj22M17n12k6J44Oj68L38P7k41R6Kj57L77j20
3778A03J45p8r5j75m07P89p5m31K21k57k73Q22k24m3J90n41L57o7p6j54K48j28
3800a49p2M55k46l21Q7P08m54r3j99L30m37N70r8k95P3j13O3K24K55k55L5M43
3822E11r57O55o2M07o33j87QJ45J59l81K41r7O67p27K35J30j13J26n65O68j44
3843H6k48M96n82K25j26J75M04m5n03J7r4N3M60j70j99L66n94L94m41K75J55l20
3865b16K39j3K32MJ26m17j77L25j80l3K90j12N30l26j10l22O7N7J11K83m63k6
3887a31j16O07l26j99K04j59l35L35K18l37k65M13M26l38R7Q3r1m52Q6M66m50
$$ plain form
3908 -264 -73 125 13 1 -84 -171 -58 -43 120 -48 44 214 -57 -240 17 -188 25 -124 182 71 -164 23
3930 23 33 7 37 221 -57 277 104 34 -329 0 142 -15 90 -21 297 -68 -271 -114 96 -377 109 335
3952 335 365 163 -10 -321 -27 115 854 -173 -472 142 -420 -262 57 128 -203 -90 -423 -306 -108 -35 -264
3973 -264 311 -45 -232 311 -81 250 -244 122 187 118 334 27 -85 461 -269 463 263 -378 -126 39 6
3994 6 61 -121 99 342 -9 24 92 -62 172 -224 -11 493 251 -108 -151 5 313 -300 51 143 198 164 -211
4017 -211 128 102 150 -408 -364 -186 -192 -174 -157 179 362 -315 37 166 212 191 159 174 80 77 -54 291 -334 234 -109
4042 -109 -141 -68 244 -210 9 -497 226 0 -33 180 12 187 -219 -188 -281 -163 -57 323 -250 266 304 -66
4064 -66 -44 -78 277 -25 -101 -197 -343 99 105 295 -36 -381 -61 151 -68 1 -17 196 -187 -439 325 -304 -32
$$ packed form
3908b64J91J98j12j2q5q7J13J5J63j68R2J70k71j83K57k05K13j49L06j11k35J87
3930B3J0k6L0J84k78L34j73p0l63L29J42j57J05j11L18l65k03J57K10m73M86K26
3952C35L0k02j73l11K94J42P39j027k99O14n62J58L19P1l31J13l33J17J98P3k29
3973b64N75l56j87N43l92L31m94L66O5o9K16l07j12N46p30P32k00o41K52J65l3
3994FN5j82K20K43l51L3O8j54K34l96K13N04k42l59m3J56L08o13L51R2N5l4l75
4017b11L39k6M8n58M4J78oJ8J7L36J83o77L52J29M6k1l2J5r4lj31L45o25N68l43
4042a09l2P3L12m54K19n06P23k26l3K13j68J75m06L1r3J18J06L80n73N16L8l70
4064f6K2l4L55l02p6r6j46M42OJ90l31l45L20K12k19O9j8K13l83k52P64o29K72
$$ plain form
4087 -32 275 -191 43 -179 38 -84 -74 128 -309 -339 -49 -242 63 -386 -97 -381 -329 -10 -50 -189 567 230
4109 230 456 9 -155 88 -376 53 149 -175 -142 298 -249 -527 -312 -114 -222 -575 -341 -297 -107 -68 -165 346
4131 346 -3 -225 -413 67 -301 439 -13 239 462 -341 -488 22 -303 235 -170 -94 -28 -149 -139 -241 -347
4152 -347 -118 163 101 -52 -186 264 148 144 113 -457 -311 -294 118 318 98 254 -287 28 335 -115 -60 -39
4174 -39 234 230 -20 -54 -242 106 55 -322 -132 -28 5 -50 -304 271 204 -208 -95 -286 56 -46 344 -141 -496
4197 -496 -48 297 -461 -415 92 -15 240 -87 33 -124 -46 -209 250 167 63 362 138 169 11 89 233 88
4219 88 -152 -233 2 183 -114 -397 -230 166 59 -46 99 -548 311 -532 -123 114 121 378 -328 -255 158 -79
4241 -79 -49 206 283 -108 155 1 220 -1 -44 -201 106 470 225 88 -314 -45 -118 -207 -539 -53 -125 -593
$$ packed form
4087c2L07m66K34k22K17j22J0K02m37l0K90j93L05m49K89k84N2L19m0j39P56l37
4109B30K26m47j64K43m64M29R6l24L3M40n47k78K15J98j08l53K34M4J90L9r7N11
4131C46l49k22j88M80l68P40m52K52K23q03j47N10l25N38m05P6O6j21J0j02j06
4152c47K29K81o2j53j34M50j16ml1n70J46J7M12K00k20J56n41L15L07m50N5K1
4174c9K73mk50l4j88L48n1l77J90J04L3n5k54N75o7m12J13j91L42j02L90m85l55
4197d96M48L45p58M6N07j07K55l27J20j57P8j63M59q3j04K99k24L1j58P8J44j45
4219H8k40q1K35J81k97k83J67L96j07j05J45o47Q59q43M09K37PK57p06P3M13k37
4241g9L0K55P7l91K63j54K19k21m3j57L07L64k45j37m02K69p3q9l32M86p2m68
$$ plain form
4263 -593 51 312 -92 -135 -56 -232 189 51 94 -8 -91 -156 246 148 135 -11 61 318 -50 59 -358 2 -43
4286 -43 454 226 102 -157 131 31 -139 83 237 -197 166 -26 -34 7 -34 89 -83 -168 -420 -119 -328 -40
4308 -40 -301 105 353 -31 -475 -209 -154 267 -59 175 105 -47 -355 -131 322 218 44 -113 128 6 -103
4329 -103 171 -222 -8 -160 355 -687 -100 -399 -271 -109 -188 -138 -9 -80 -85 203 22 -337 -221 48 45 26
4351 26 132 148 -263 41 -16 103 -94 305 -80 114 -16 -478 -460 23 282 244 -109 -158 -208 40 91 -10 -275
4374 -275 -112 -400 -64 -275 14 30 53 -112 -198 237 114 234 -425 -228 -4 -62 434 -324 10 -308 -153
4395 -153 -128 -44 248 467 -504 -105 28 213 34 -233 287 55 -261 -23 162 -131 -75 284 396 192 199 -188
4417 -188 -118 -83 -178 202 421 -11 108 26 -35 429 -264 -505 348 -334 -186 547 -116 167 -49 -296 -161 258
$$ packed form
4263e93O44K61m04m3P9j76M21j38M3j02q3o5M02r8j3j46P2K57l68J09m17L60m5
4286d3M97k28j24k59K88j00j70K22J54m34L63j92qM1m1J23j72q5k52L01k09K88
4308d0k61M06K48l84m44K66N5M21l26K34p0j52l08K24M53j04j74j57K41j22j09
4329a03K74l93K14j52N15j042N87k99J28J62p9N0J29p1nK88j81l59J16K69lj9
4351B6J06J6m11L04n7J19j97L99l85J94j30m62J8M83K59l8l53m9n0K48N1j01k65
4374b75J63k88L36k11K89J6K3j65q6M35j23J20o59J97K24n8M96p58L34l18J55
4395a53K5Q4K92K19r71L99J33J85j79k67N20k32l16K38J85k93N6L59J12k04Pl87
4417a88P0L5r5L80K19m32J19q2o1M64o93k41Q53o82J48P33o63K83k16k47J35M19
$$ plain form
4439 258 54 -131 -13 433 297 -3 90 -300 355 311 -150 -80 -292 277 35 88 361 341 106 -107 244 43
4461 43 -235 50 134 -19 77 -61 120 183 -182 -88 362 -207 -410 -508 541 -122 261 25 67 16 22 -187 -157
4484 -157 -190 51 91 -223 -152 -176 -117 521 -54 210 -210 2 -6 56 65 -36 -48 -139 -108 133 -71 265 278 132 141
4509 141 489 112 -322 229 -118 219 420 230 111 -8 132 67 -44 373 133 246 205 175 -243 71 201
4530 201 440 133 -209 367 107 -333 -260 -163 -82 206 224 -174 156 107 12 -369 152 -363 -59 -91 -30 697 215
4553 215 -175 21 134 -267 294 168 -65 152 351 -126 248 -405 -354 139 -331 550 113 357 -40 90
4573 90 196 -173 18 46 -22 23 137 29 187 -3 -305 -121 -95 -201 159 -365 -47 -648 291 -122 125 120
4595 120 249 172 84 -100 121 -190 -437 -433 -215 -24 -17 134 -102 2 115 179 373 -475 -3 146 191 -28 -98
$$ packed form
4439B58k04j85J18M46j36l00R3l90O55m4m61P0k12N69k42N3K73k0k35k13L51k01
4461D3k78K85Q4j53R6j38J81O3l65R4M50n69k03r8J049o63L83k36M2n1Ok09L0
4484a57l3K41M0l14P1k4N9O38n75K64m20K12qO2Rj01j2r1L1K41k04L36J3j46R
4509A41L48l77m34N51l47L37K01j90j19j19J40o5j11M17k40J13m1l0m18L14J30
4530B01K39l07l42N76k60m40P3R7Q1K88J8l98L30m9r5l81N21n15L04l2O1P27m82
4553B15l90J96J13m01N61j26k33K17J99m77L74o53N1M93m70Q81m37K44l97J30
4573I0J06l69J91K8o8M5J14j08J58j90l02J84K6j06L60n24L18o01R39m13K47n
4595A20J29p7q8j84K21l11k47MK18J91PJ51k36J04J13O4J94q48M72J49M5k19p0
$$ plain form
4618 -98 -67 -29 -151 -252 136 236 102 304 114 -232 -14 -271 -153 21 263 106 195 92 -7 18 429 41
4640 41 -216 -68 67 -351 81 -138 10 -137 -166 -217 397 -67 -338 -96 -387 -10 22 -40 -417 138 83 227
4662 227 126 -239 383 -219 131 371 76 181 -417 95 196 -77 -242 246 470 -61 273 -328 178 -268
4682 -268 -103 -101 -141 94 281 297 -214 195 -277 -233 140 313 209 109 -128 -83 189 -201 560 -155 19 58
4704 58 -141 -22 228 -52 126 356 77 -695 -102 -435 -252 -323 17 -184 -68 -162 335 -294 56 -157 -14
4725 -14 29 -6 -7 -289 7 -167 464 -88 145 23 201 -259 -79 69 -144 -3 103 68 -73 69 -416 -338
4747 -338 -103 232 -292 320 -19 -238 -140 -71 -236 76 31 182 251 325 293 -24 222 84 139 103 241 -302 199
4770 199 -469 -373 -209 -176 -235 -5 357 294 -12 -507 68 -63 -172 -137 -28 374 321 -5 -194 144 -9 -212
$$ packed form
4618i8L1L8j22j01L88J00j34K02j90l46K18k57J18J74K42j57Q9j03r9K5M11l88
4640D1k57J48J35m18M32k19J48j47k9n1O14m64k71K42k91L77L2o2l77N55n5J44
4662B27j01l65O22o02L50K40k95J05n98N12J01k73j65M88K24n31L34o01N06m46
4682b68J65Km0K35J87J6n11M09m72M4L73J73j04j00k37M5K72l90P61p15J74L9
4704E8j99J19K50k80J78K30k79p72N93l33J83p1L40k01J16r4M97o29L50k13J43
4725a4M3l5jk82K96j74O31n52K33j22J78m60J80J48k13J41J06l5j41J42m85P8
4747c38K35L35n24O12l39k19R8O9j65L12m5J51O9P4l2l17K46j38N5l6J38n43N01
4770A99o68R6J64L3n9K30L62o3l06m95N75j31j09L5J09M02n3l26j89L38j53k03
$$ plain form
4792 -212 116 -348 -29 -166 283 -53 139 -443 448 0 -179 -30 -170 -13 -324 -3 173 -166 -382 -177
4812 -177 167 -104 -170 27 -412 180 -157 78 -303 102 170 -168 -52 -1 -390 59 -209 -112 53 292 -143
4833 -143 264 -196 -314 -127 546 -313 -152 396 -88 17 -100 187 -104 -434 -113 138 114 162 620 -142 45
4854 45 -5 -25 102 53 80 -457 60 167 -2 590 325 -273 108 -306 -266 76 -377 457 -564 -166 245 -240
4876 -240 178 85 -193 403 -348 -152 -271 12 -596 61 146 223 -558 -73 -136 -234 -115 43 -54 -121 172 76 -207
4899 -207 91 330 -119 -442 322 252 281 328 22 360 -536 -197 -211 314 29 54 40 -367 252 -319 -134 53
4921 53 224 -168 30 428 37 -93 -195 42 287 -74 -341 -461 -24 317 84 -48 154 332 42 -236
4941 -236 10 -485 -332 481 44 -279 80 -299 -213 46 -183 222 -205 216 111 -60 -161 186 259 -39 173
$$ packed form
4792b12L28m64L19j37M49l36J92n82Q91m48j79J49j40J57l11L21J76l39k16K05
4812a77L44k71o6J97m39N92l37K35l81M05O8l38J16N1l89M49k68R7J65K39m35
4833a43M07m60j18J87O73q59J61N48m84J05j17K87k91l30L21K51k4M8M58p62J87
4854D5n0k0J27m9K7n37N17J07j69N92k65n98L81m14M0L42m53Q34j021L98M11m85
4876b40M18r3k78N96p51J96j19K83o08O57Q5P7p81M85o3r8J19J58r7o7K93r6k83
4899b07K98K39m49l23P64p0K9M7l06L38q96L39j4N25k85K5j4m07O19n71J85J87
4921E3J71l92J98L98l91j30j02K37K45l61k67j20M37L41k33j32K02J78k90k78
4941b36K46m95J53Q13m37l23L59l79Q6K59k29M05m27M21j05j71j01L47P3k98K12
$$ plain form
4962 173 510 -254 -34 110 -292 -155 426 -20 -101 75 -144 82 -152 -56 113 146 -165 -219 -69 -195 357
4983 357 446 292 -201 -139 70 13 175 275 -595 -100 -64 476 -251 -56 -16 -21 -172 -119 -68 -256 -310 -136 -8
5006 -8 17 126 -199 371 -276 32 416 150 -162 -52 -153 -86 142 79 72 169 111 155 85 321 -303 583 188 -333
5030 -333 166 -87 162 8 -100 -215 -220 85 -157 252 287 -4 -333 -261 258 20 82 19 -221 309 330 -27
5052 -27 -342 -96 370 263 -264 -345 57 -260 55 -9 -352 -48 277 7 103 -268 83 213 -75 -179 -11
5073 -11 -157 364 274 -170 108 174 -154 356 -419 134 -367 50 -10 -93 -243 7 -306 -26 56 -286 402 129
5095 129 -326 -24 -192 174 220 250 37 44 177 -29 -127 -62 -444 149 240 -112 -28 -344 107 -207 127 98 63
5118 63 -238 -349 189 309 199 -51 -577 -237 125 54 196 152 -316 -57 -162 -433 -296 -81 -288 -64 0
$$ packed form
4962A73L37p64K20J44m02J37N81m46q1J76k19K26k34R6J69L3l11n4J50j26N52
4983C57Q9j54m93O2K09n7J62J00q70M95L6N40p27J95M0nj51N3N1j88n4J74J28
5006hK5J09l25N70o47L08L84k66l12J10j01O7K28o3pR7n8M4p0K36o24Q86l95n21
5030c33M99k53K49j54j08j15nL05k42M09L5k91l29P2N19k38O2o3k40N30K1l57
5052b7l15K46M66j07n27q1M02l17L15o4l43L04L25k70R6l71L51J30k88j04J68
5073a1j46N21r0m44K78O6l28N10p75N53n01M17o0q3j50K50l13K80Q2l42O88k73
5095A29m55L02j68L66M6L0k13PJ33k06r8O5l82N93R1l52Q4l16M51l14L34k9l5
5118F3l01j11N38J20j10k50n26L40L62p1J42m4m68K59j05k71J37K15k07K24O4
$$ plain form
5139 0 216 154 56 -954 -213 -124 44 -137 -68 -286 -100 -430 -462 526 246 183 366 235 -356 -229 53 -329
5161 -329 -113 -65 -248 -216 151 112 -43 -236 220 -24 357 15 -268 -200 -275 -203 428 107 282 -174 170 162 155
5184 155 -122 332 -356 142 -57 69 -194 271 -11 -218 -181 -209 -119 175 -202 328 -56 250 631 -401 147
5205 147 164 115 86 -68 -232 111 38 -20 120 -47 -460 -210 154 -126 160 462 228 -30 -15 367 -91 52
5227 52 -181 14 -7 -11 82 13 482 12 -108 -111 -194 -87 295 -503 -54 0 -90 -93 -135 235 -23 198 98 -162 313
5252 313 -59 -113 34 -244 -294 213 -68 206 -221 157 21 -72 -585 -14 -142 -436 -103 337 232 -112 -59
5273 -59 -206 113 82 235 -51 -265 -401 299 164 -148 154 142 -140 -176 -166 -10 -160 235 -201 275 43 -266
5295 -266 135 12 -281 25 158 7 10 -333 244 -33 -19 10 135 163 -36 -2 229 -495 -118 351 -236 -195
$$ packed form
5139@K16o2r8j010P41Q9J68j81O9k18J86l30l2R88k80o3J83j31n91J27K82l82
5161c29K16M8j83L2L67l9j55j93M56k44L81l42k83O8p5P2O31l21J75m56L44qp
5184A55k77M54o88M98j99J26k63M65k82k07L7k8R0K94l77N30l84L06L81j032N48
5205A47J7m9k9j54j64L43p3n8J40j67m13K50L64k80K86L02k34k58J5L82m58J43
5227E2k33J95k1mR3o9M69m70j20lq3J07L82p98M49N4r0lm2L70k58K21j00k60M75
5252C13l72n4J47k78n0N07k81K74m27L78j36r3n13N71j28k94L33M40j05l44N3
5273e9j47L19l1J53k86k14j36P00j35l12L02j2k82l6J0J56j50L95m36M76k32l09
5295b66M01j23k93L06J33j51Ll43N77k77J4K9J25K8j99L4K31p24L77M69n87M1
$$ plain form
5317 -195 194 -147 29 158 230 -157 -49 -26 215 107 -164 -280 -147 -124 126 180 -276 255 -7 -152 492
5338 492 -30 -347 -67 24 211 -227 161 -90 -34 -334 252 -25 -16 -279 429 -344 -252 -530 -211 -618 -22 109
5360 109 278 330 -41 225 -192 -199 -131 151 170 111 -101 206 -115 131 141 279 208 -278 168 289 95 191 201
5383 201 416 -86 120 -13 -85 98 -120 -231 -200 340 184 69 518 -116 -54 -48 -105 -23 85 -266 306 -402
5405 -402 258 165 -106 106 249 323 602 102 204 -70 123 -182 -307 52 -38 -286 -58 -173 -291 -251 173
5426 173 -511 194 8 387 -135 85 249 289 -140 -35 242 -40 -88 -288 387 17 -8 177 -251 -139 -17
5447 -17 -215 -103 33 100 171 -321 -6 -554 91 273 -257 136 386 50 -714 572 36 36 -209 88 349
5468 349 399 -379 -114 7 186 -210 74 269 -1 432 -14 338 67 320 -178 56 -47 -251 118 202 -12
$$ packed form
5317a95L89l41J76J29P2l87J08K3K41j08k71j16J33K3K50N4m56N31k62j45O44
5338D92n22l17K80R1J87m38L88k51N6l00N86k77Rk63P08p73R2k78L19m07N96J31
5360A09J69N2l71K66m17pO8K82J9n9k12L07l21K46J0J38p1m86M46J21j94R6J0
5383B01K15n02K06j33p2J83k18j11L1N40j56j15M49o34O2On7Q2J08l51N72p08
5405d02O60r3k71K12J43P4K79n00J02k74J93l05j25L59r0k48K28j15j18M0M24
5426A73o84P05j86L79n22K20J64M0m29J05K77k82m8k00O75l70k5J85m28J12J22
5447a7j98J12J36O7P1m92L15n48O45J82n30L93K50l36p64J286n36%k45K97K61
5468C49N0p78K65J21J79l96K84J95k70M33m46L52k71K53m98K34j03k04L69Q4k14
$$ plain form
5489 -12 -292 -101 300 97 232 -197 216 298 74 -784 328 -270 112 51 -147 -263 -90 -73 490 52 -12
5510 -12 -413 -52 6 -221 228 0 -228 -67 -62 163 282 180 -95 -616 147 -655 -11 492 -429 -44 165
5531 165 -110 113 275 -18 -343 20 -311 -16 332 256 -189 -175 -255 58 -375 -318 -511 192 -320 -170 131
5552 131 -408 -76 186 51 297 168 31 121 -438 -377 219 228 -98 46 -70 -354 45 35 360 -336 270 -10
5574 -10 -188 76 -134 -165 -41 -10 -138 -185 -131 -383 -112 20 -63 86 215 -40 -97 142 32 -157 274 -225
5596 -225 -80 -108 -352 -143 -68 -268 -89 291 598 -335 -94 -15 225 55 83 330 1 377 -117 224 -648
5617 -648 -708 416 269 -152 13 147 -120 -27 -97 -30 279 -162 -159 267 -172 111 -250 -151 -252 288 -112 35
5639 35 -151 -338 37 310 -135 93 -82 -6 242 171 217 -259 -445 -32 226 -265 348 -97 248 269 161 50
$$ packed form
5489a2k80J91M01k03J35m29M13Q2k24q58J112n98L82o1j98j16J73J7N63m38o4
5510a2m01L61N8k27M49k28k28J61NK25J19j02k75n21P63q02O44N03r21L85K09
5531A65k75K23J62k93l25L63l31K95L48p6m45J4q0L13m33N7j93P03n12J50L01
5552A31n39L32K62j35K46j29j37R0n59O1N96Rl26J44j16k84L99j0L25o96O06k80
5574a0j78K64k10l1J24L1j28m7N4k52K71J32q3J49J29k55n7K39j10j89M31m99
5596b25J45k8k44K09P5k00J79L80L07r33K41P9K40j70K8K47l29L76m94L41q72
5617f48o0J124j47m21J65J34k67R3p0O7L09m41LM26m39K83l61R9j01N40m00J47
5639C5j86j87L75K73m45K28j75P6K48p1M6m76j86M13K58m91O13m45L45K1j08j11
$$ plain form
5661 50 -134 383 30 6 -80 -73 -52 3 21 -68 14 33 -133 -26 -215 17 -79 -221 295 -226 179 -378 -58 146
5685 146 84 431 135 418 467 91 178 -2 -306 -439 292 385 131 -99 425 -222 -19 65 -224 -239 104 321
5707 321 -19 -16 13 -344 -32 -251 242 111 519 329 -235 283 103 -61 -79 -34 -225 -3 123 -372 297 190
5729 190 328 38 15 216 -210 300 83 214 530 -106 97 321 -68 145 214 -223 -452 -133 253 -535 -388
5750 -388 -32 27 -162 97 -94 143 -21 -88 -276 -323 -50 385 108 -444 124 23 200 35 161 32 43
5771 43 -84 132 481 -434 72 -178 62 -46 436 124 -74 111 258 227 139 -16 -122 621 325 -406 217
5792 217 28 -393 -240 133 579 38 203 73 -80 -202 81 -3 -149 -56 -268 -385 -298 -511 -425 -209 -218 -197
5814 -197 -352 -217 116 291 -13 481 -188 -104 229 36 100 156 48 232 140 -419 -210 -81 205 -40 294
$$ packed form
5661E0j84N17l53k4q6PK1N5J8q9Q2J9j66J07j89K32r6j42N16n21M05n57L20K04
5685A46o2L47k96K83M9l76Q7j80l04j33P31R3k54k30N24o47K03Q4k89j5L43K17
5707C21l40LK9l57L12k19M93j31M08j90n64N18j80j64j8M5j91K22J26m95O69j07
5729A90J38k90k3K01m26N10k17J31L16o36K03K24l89K13O9m37k29L19L86p88J47
5750c88L56N9j89K59j91K37j64o7j88m7K73M35k77n52N68j01J77j65J26j29J1
5771D3j27K16L49r15N06k50K40j08M82l12j98J85J47l1q8j55j06P43k96p31O23
5792B17j89m21J53L73M46n41J65j30j53j22K83q4j46R3k12j17Q7k13Q6K16rK1
5814a97j55J35L33J75l04M94o69Q4L33j93O4N6j08J84r2n59K09J29K86k45L34
$$ plain form
5835 294 -352 -14 -211 313 254 331 -457 368 138 143 259 35 113 117 -65 -45 192 -74 187 -176 41 -196 -88
5858 -88 383 -202 -61 65 77 -193 299 61 -258 220 169 -136 11 -93 49 10 -159 -70 -72 -120 126 260 -73
5881 -73 414 24 321 -66 97 3 164 136 -465 -202 -143 -73 -264 -31 -104 63 -407 -138 -282 -290 -30 74 267
5904 267 -2 30 51 -222 389 -342 -85 298 82 346 91 43 104 -190 -3 -306 90 -198 218 108 69 163
5926 163 107 105 -155 103 59 91 -279 209 -19 -23 59 86 246 22 -179 -85 -130 337 129 -213 -112 9 255 -154
5950 -154 4 -431 -111 303 13 227 58 -21 0 86 161 27 -154 154 424 -183 -97 -21 -401 -175 169 -56
5972 -56 -298 267 76 262 64 -102 35 81 -342 82 -382 -20 -66 -104 82 250 297 -249 -263 -51 -300 -188
5994 -188 -209 -211 -25 -57 -213 -328 304 176 48 157 312 -380 -22 359 364 -95 417 28 47 -50 156 51 39
$$ packed form
5835B94o46L38j97N24n9P7p88Q25k30NJ16k24P8Mj82K0K37k66K61l63K17k37J08
5858h8M71n85J41J26J2k70M92k38l19M78n1l05J47j04J42l9j69Q9km8K46J34l33
5881g3M87l90K97l87J63r4J61k8o01K63N9P0j91K33p3J67m70K69j44qK60J04J93
5904B67k69L2K1k73O11p31K57L83k16K64k55m8O1k94J87l03L96k88M16j10l9R4
5926A63n6kk60K58m4L2l70M88k28mQ2K7J60k24k01R4m5M67k08l42J01J21K46m09
5950a54J58m35L20M14k90K14j69p9K1Q6P5j34j81L08K70o07Q6P6l80K26L44k25
5972e6k42N65j91J86j98j66J37M6m23M24m64L62m6l8J86J68M7n46j4K12k49J12
5994a88k1kJ86l2j56j15O32j28j28J09J55o92L58L81Nm59N12l89J9r7K06j05j2
$$ plain form
6017 39 -121 -304 121 35 77 -283 -644 -153 202 -8 -97 170 -345 298 -236 -104 321 184 370 -173 317
6038 317 -116 -64 228 -73 309 201 -94 294 -90 -107 101 -29 90 -446 290 -237 325 -193 -90 -176 -81
6059 -81 433 423 184 -157 -272 -27 -312 118 148 125 128 115 -90 -162 -112 -374 500 183 -256 -178 104 43 -278 -68
6083 -68 -162 -34 140 -5 -427 -394 268 214 -245 -191 169 168 335 156 187 -35 -115 -120 -437 -314 -22 56 -197 -71
6107 -71 -71 -226 -6 225 191 267 87 -79 -247 314 260 616 116 -260 -86 79 -91 204 186 55 -220 -14
6129 -14 -53 158 -332 202 -418 -356 190 -373 -103 17 -17 -64 452 -143 -2 150 78 -20 -35 13 -122 -2 -221
6152 -221 -88 -146 -72 211 -49 -14 109 193 44 -285 -31 -146 140 392 131 188 339 28 -266 111 4 -593
6174 -593 280 5 112 -123 304 -45 453 306 115 209 301 -45 -469 18 -37 433 149 -451 -283 39 -173
$$ packed form
6017C9j60j83M25q6M2l60l61M91L55k10q9K67n15O43n34J32M25j37J86n43M90
6038C17m33N2K92l01L82j08k95L88l84j7K08j30J19n36P36n27N62n18J03q6R5
6059h1N14j0k39l41j15K45k85M30L0k3Lj3k05p2N0k62Q74l17m39P8K82o1l21K10
6083f8r4J28J74j45m22L3O62n4m59N4L60jJ67j79L1k22q0nl17J23K92P8k53J26
6107g1%j55K20K31l4P6j80j66j68N61n4L56n00l76J74J65j70K95j8j31k75K06
6129a4l9K11m90N34o20O2N46n63K70J20l4m7N16n95J41J52p2r8j5M8j35J20k19
6152b21J33n8P4K83k60L5J23Q4j49l29K54j15K86K52k61N7J51l11k94L77j07n97
6174e93Q73k75J07k35M27l49M98j47j91R4R2l46m24M87n5M70k84o00J68L22k12
$$ plain form
6195 -173 -266 560 -197 -108 149 -295 -12 -556 209 -128 309 26 -110 -126 -208 177 337 540 373 -23 283
6216 283 89 -233 86 -61 -265 -136 -39 79 240 57 14 -95 205 355 44 -225 205 -24 3 126 135 -81
6238 -81 72 43 247 -485 359 -400 -86 125 -107 167 -548 483 -110 -171 283 -238 -242 -38 259 58 -74
6259 -74 -425 159 201 31 20 69 -185 -315 -139 -29 60 -78 31 62 349 -351 -328 -287 340 247 110 -133 103
6282 103 330 -149 283 -78 -119 -134 -41 -58 -472 53 33 -700 66 -331 -390 167 56 119 -204 300 36 12 10
6305 10 75 265 -572 204 -104 -165 -350 -145 -41 -346 82 32 354 -235 29 -232 -19 -180 -32 216 348
6326 348 -34 138 -60 135 286 203 -24 -32 110 148 -180 251 -128 -16 287 156 -273 115 -97 -251 -128
6347 -128 142 153 -46 -133 303 -388 58 165 -43 108 119 -114 95 174 35 -201 384 -291 -233 67 -18 174
$$ packed form
6195a73r3Q26p57Q9K57m44K83n44P65l37M37k83j36j6q2L85J60K03j67l96L06
6216B83j94l22L19j47k04J29R7J18J61j83m3j09L00J50l11k69M30k29K7J23Rk16
6238h1J53k9K04p32Q44p59L14K11k32K74p15J031n93o1M54n21mK04K97k01j32
6259g4l51N84M2j70j1M9k54j30J76J10Q9j38J09L1K87p00K3M1O27r3j37k43K36
6282A03K27m79M32l61m1j5R3j7m14N25k0p33P66l97n9N57j11O3l23N04k64k4k
6305A0O5J90q37P76l08o1j85K05J04l05M28n0L22n89K64k61K13j61J48K48J32
6326C48l82J72j98J95J51q3k27qJ42L8l28M31l79J12L03j31m29L88k12j54J23
6347a28K70J1j99q7M36o91M46J07k08J51J1k33K09P9j39k36N85o75N8L00q5J92
$$ plain form
6369 174 398 234 -111 394 387 -45 133 18 129 -142 59 61 -211 -135 398 460 -136 -600 324 162 -352 -24
6391 -24 -207 149 -331 293 -280 52 264 505 210 160 -4 -129 -591 225 -70 -262 -61 -36 63 -21 0 17
6413 17 8 76 -233 10 -275 -227 237 -27 -71 -72 80 -100 41 315 244 -147 -51 143 -100 124 -1 -157 3
6436 3 -118 70 111 325 375 -410 -53 33 82 -257 -560 409 -66 -106 70 371 236 -101 153 -19 -225 85
6458 85 365 136 484 396 36 -365 50 -143 -161 58 -381 -306 85 -103 220 -6 330 -192 -215 -314 43 101
6480 101 -35 142 -44 -17 -56 -65 71 -288 -45 -343 -153 44 201 218 -446 144 244 -308 -239 396 278 80
6502 80 -242 154 -111 123 138 -55 -114 -239 -173 -137 -1 -113 215 -183 -270 313 -149 243 -192 536 642 166
6524 166 -35 -40 -208 -493 -233 -315 1 -585 -34 -258 -83 -316 90 -68 -97 239 -117 14 89 -94 31 41
$$ packed form
6369A74K24j64l45N05pm32J78j15J11k71K01Kk72P6N33O2n96m64R24j62n14L28
6391b4j83L56m80O24n73L32K12K41k95n0j64j25m62Q16k95j92K01K5R9q4K1J7
6413A7rO8l09K43k85M8M64k64m4jJ52j80J41K74p1l91R6J94k43K24j25j56J60
6436Cj21J88M1K14N0p85L57Q6M9l39l03R69m75m0J76L01j35l37K54j72k06L10
6458H5K80k29L48q8l60m01M15j93j8K19m39P5L91j88L23k26L36n22k3r9L57N8
6480A01j36J77j86K7l9rJ36l59K43k98J90J97J57J7o64N90J00n52O9O35j18j98
6502H0l22L96k65K34J5j93n9j25O6L6J36j12L28l98q7N83m62L92m35P28J06m76
6524A66k01nj68k85K60q2L16n86N51k24J75k33M06j58k9L36l56J31P5j83J25J0
$$ plain form
6546 41 -70 -388 -452 -66 15 41 -124 -129 -355 435 214 377 -82 -271 114 576 -43 159 212 108 -87 12 -88
6569 -88 -323 75 -210 235 -429 -164 -14 64 -100 -137 -8 329 -146 -101 -227 190 260 -152 153 280 -54 39
6591 39 229 314 139 -106 45 117 -47 204 -13 185 195 -169 341 222 -502 146 133 265 -167 -20 -46 -147
6613 -147 -67 188 -157 -48 156 93 -312 167 512 -251 -70 144 -113 -74 -110 136 137 -138 149 -278 -284 153 128
6636 128 193 153 481 111 76 32 -397 -37 438 278 284 90 -392 -288 -248 109 -76 -162 -116 -399 -243 -235 80 -179
6660 -179 -14 15 -140 589 157 -166 159 91 -271 -260 367 -178 -254 -204 -141 124 -81 -124 -193 -122 453 73 59
6683 59 -169 204 -87 -137 -111 242 -57 -236 49 274 -113 -81 95 -169 1 -202 -102 190 -30 256 235 9
6705 9 -112 436 79 243 115 441 256 107 -164 -40 -5 182 205 -192 514 -178 -80 -1 -91 180 -346 -45
$$ packed form
6546D1j11l18o4L86Q1K6j65nk26P90k21J63m59j89L85M62o19K02N3j04j95R9j00
6569h8k35L98k85M45o64K65J50P8j64l7J29L37m75M5j26M17P0m12L05J27l34R3
6591C9J90Q5j75k45J51P2j64K51k17J98J0l64N10j19p24O48j3J32m32J47k6j01
6613a47Q0K55l45J09K04o3m05M79L45p63J81K14k57L9l6K46Jk75K87m27oM37k5
6636A28O5m0L28l70l5m4m29L60M75j60Oj94m82J04M0L57j85q6M6k83J56QL15k59
6660a79J65K9j55P29m32l23L25o8l62J1O27n45p6N0O3K65k05m3o9P1N75l80j4
6683E9k28L73k91n0K6L53k99j79K85K25l87L2J76k64J70k03J00K92k20K86k1k26
6705Ij21N48l57J64j28L26j85j49k71J24L5J87K3l97P06o92R8P9r0K71n26L01
$$ plain form
6727 -45 354 -63 -376 -335 92 362 68 -2 176 -181 -261 226 387 50 128 264 250 19 -206 -183 109 -298
6749 -298 516 182 -96 -200 361 -208 -165 -25 -315 -73 -138 572 150 312 256 131 -88 175 -255 96 395
6770 395 4 -279 -106 376 -418 245 -66 -171 -83 12 28 -173 -93 -83 198 425 -180 -98 25 -357 -162 -88
6792 -88 -107 244 158 138 -21 407 66 234 -257 -26 163 224 -86 -436 57 -185 -38 -56 -239 -347 286 378
6814 378 -116 47 136 303 -127 355 385 258 349 192 172 -404 134 -70 -381 107 -49 -59 83 121 -448 -63
6836 -63 -353 -285 -109 57 250 472 -529 -183 131 -12 94 86 64 89 -342 -105 -368 266 128 152 249 77
6858 77 -136 218 -229 -231 363 130 211 -104 230 285 -352 -108 -187 -269 -9 0 -57 -322 69 151 128 77 -85 -253
6882 -253 -68 -31 29 -365 -203 17 543 -289 -154 -317 -401 -182 -28 511 294 -169 453 -110 -147 -137 242 7
$$ packed form
6727d5L99m17l13M1M27K70k94p0J78l57q0M87J61l37P8J36j4k31k25K3K92m07
6749b98Q14l34k78j04N61n69M3J40k90K42o5P10m22J62n6j25k19K63m30L51K99
6770C95l91k83J73M82p94O63l11j05Q8R5J6k01Q0J0K81K27o05Q2J23l82J95P4
6792h8j9L51q6k0j59M28l41J68m91K31J89O1l10l50M93k42J47j8j83j08O33R2
6814C78m94J63Q9J67m30M82L0j27R1j57k0n76N38k04l11M88j56j0J42L8n69L85
6836f3k90O8J76J66J93K22j001L46L14j43J06qk2K5m31K37k63O34j38K4R7j72
6858G7k13L54m47kN94k33Q1l15L34N5o37K44p9q2K60Rn7k65L91Q2k3n1j62j68
6882b53J85L7O0l94J62K20N26q32J35j63q4K19J54N39k17m63O22n63l7J0L79k35
$$ plain form
6904 7 -155 101 186 575 22 -50 -262 -241 -303 -18 -128 393 178 -115 74 20 47 -7 -104 -150 220 -112 54 -179
6928 -179 -36 194 -12 477 266 -34 232 -163 -96 -2 109 -221 -119 57 114 -168 458 263 -470 258 258 199
6950 199 474 102 437 -151 42 -109 -33 333 -384 -81 -136 -328 373 60 269 -255 283 238 283 -34 28 170
6972 170 110 15 422 172 -265 -117 37 16 -448 -105 -12 264 -104 249 -93 -523 62 214 -214 -139 -4 247
6994 247 251 503 -281 354 -97 -89 443 -105 -247 89 -375 -200 689 -10 -167 -53 204 -121 93 263 -229
7015 -229 189 -79 12 -111 -557 -145 88 427 221 -134 -190 -134 -7 262 48 -166 59 -384 -320 149 -233
7036 -233 99 68 43 212 144 -238 -179 -349 92 -109 315 58 -282 506 -351 61 -329 25 68 228 -230 -80
7058 -80 -266 -152 -606 329 22 113 -31 -451 -267 -198 42 147 -303 -237 189 -186 203 24 -45 -491 15 146
$$ packed form
6904Gj62K56Q5L89n53p2k12K1o2K85j10N21k15k93J89n4K7n4r7m6L70l32J66k33
6928a79J43K30k06M89k11l00K66l95O7R4J11l30J02J76N7k82O26j95p33P28%n9
6950A99K75l72L35n88J93j51P6L66p17L03n5j92P01l13K09n24N38m5M5l17O2J42
6972A70o0r5M07k50m37J48J54k1m64L43R3K76l68L53l42m30N85J52m28P5J35K51
6994B47MK52p84O35m51QN32n48j42L36m64J75Q89o99j57J14K57l25K14J70m92
7015b29M18k68R1j23m46M12K33L39k06l55n6N6J27K69k14k14K25m43O4M69l82
7036b33L32l1k5J69o8l82N9j70M41k01M24k57l40P88q57M12l90L54M3J60m58J50
7058h0j86J14m54R35l07R1j44m20J84O9K40J05m50O6M26l75L89j79o9m46N06J31
$$ plain form
7080 146 -2 100 -25 -24 -144 -31 210 -199 -164 185 473 27 -119 -405 190 -122 -8 -213 319 -91 -14
7101 -14 243 -37 -412 254 -86 -194 -149 -34 -263 85 -10 -61 63 -211 -45 -150 149 -150 38 126 134 -106
7123 -106 -73 216 -368 -218 -533 -101 156 -76 -58 84 186 -106 -65 -400 214 -78 -13 -122 -140 -156 -314 149
7145 149 -230 477 -350 -153 -35 91 -239 -10 -23 249 -10 -64 -654 198 67 134 91 -482 -24 594 -35
7166 -35 -19 -169 136 -121 20 285 395 -33 20 -154 130 312 -583 147 186 -192 121 26 -47 -488 133 -256
7188 -256 20 208 150 -200 -165 285 -197 8 -36 -138 143 244 -160 -532 -185 -284 112 183 152 -26 324 353
7210 353 115 66 -208 -106 95 70 47 -471 83 -435 -170 -308 141 -110 -121 -8 -158 18 132 103 7 -147
7232 -147 74 -116 23 323 103 175 -347 250 -562 -30 196 -366 -408 138 -116 -185 -171 -215 55 129 -203 5
$$ packed form
7080A46j48J02j25Jj20J13K41m09L5L49K88m46j46k86N95l12J14k05N32m10P7
7101a4K57k80l75O66l40j08M5J15k29L48r5n1J24k74J66j05K99k99J88Q8Qk40
7123a06L3K89n84J50l15M32K57k32J8J42J02k92M1l35O14k92O5j09j8j6j58M63
7145A49l79P07q27J97J18J26l30K29j3K72k59n4n90Q52j31O7m3n73M58O18o29
7166c5J6j50L05k57J41K65J10m28N3j74K84J82q95P30L9l78L13r5p3m41O21l89
7188b56K76J88n8l50L5M50m82K05m4j02K81J01m04l72L47r9L96P1l1j78L50K9
7210C53k38m9k74J02K01k5k3n18N54n18K65j38M49k51j1J13j50J76J14k9r6j54
7232a47K21j90J39L00k20P2n22N97q12N32K26n62m2N46k54o9J4m4K70P4l32K08
$$ plain form
7254 5 -404 -171 -2 313 -343 -422 197 -166 94 325 125 -7 23 -118 -184 -235 -173 124 319 117 190 -46 217
7277 217 -407 495 -58 170 -81 346 -241 186 97 -70 71 -51 -46 198 418 -349 200 617 -26 4 -237
7298 -237 -238 175 -140 35 -86 -32 273 315 425 129 -389 -132 -391 11 119 -210 -106 58 212 285 -89 -160
7320 -160 294 -175 -51 131 389 283 -39 76 124 -307 200 -188 -125 -186 -85 472 112 268 78 167 5
7341 5 -120 359 129 188 262 35 -205 -98 314 -154 -161 284 385 -42 438 40 86 -116 -29 98 -77 130 537
7364 537 100 -172 -405 -402 125 -92 310 -12 -149 291 424 -35 -42 109 -402 -276 -211 -128 189 -200 -155 120
7386 120 -116 -39 -78 -21 518 111 -362 336 -181 -316 -146 448 60 398 104 283 246 -468 168 165 -221 -215 -209
7409 -209 -21 162 102 472 321 37 -278 7 70 314 142 -38 456 373 225 456 131 25 -302 329 -138
$$ packed form
7254Em09K33J69L15o56p9O19l63K60K31k00j32L0j41o6n1O2K97J95k02P3k36K63
7277B17o24R02n53K28k51M27n87M27q9j67J41j22NK44K20p67N49M17o43L0k41
7298b37jM13l15J75j21N4L05M2J10k96n18K57k59M02J08l29J04J64J54P3l74p1
7320a60M54m69J24J82K58j06l22J15M8m31N07l88O3o1J01N57l60J56j90Q9j62
7341Ej25M79k30N9P4k27k40J07M12m68pM45J01m27M80l98M6k02Q7J27j75K07M07
7364E37m37k72k33LN27k17M02l22j37M40J33m59pJ51n11J26O5Q3L17l89M5K75
7386A20k36P7l9N7N39m07m73O98n17j35J70N94l88L38k94J79l7p14O36ll86OO
7409b09J88J83o0L70j51k84l15K85O3K44j72j80M94q3j48K31l25j06l27O31m67
$$ plain form
7430 -138 -127 134 212 276 197 153 -44 -53 -276 -185 291 -36 -283 55 36 -231 151 329 -10 -499 173 -76 -246
7453 -246 -5 -175 -129 81 -43 124 140 -31 -431 -298 -241 -172 -61 -41 -98 391 125 163 -119 -135 -306 87 -243
7476 -243 -20 -87 140 -153 -190 -194 273 90 195 91 138 -92 -123 271 -67 -34 249 79 17 26 -363 87 -29
7499 -29 798 -406 88 -190 189 -249 -117 17 -289 -77 63 255 -137 203 -140 -166 -110 -225 68 315 241
7520 241 -296 144 -147 15 -188 -158 -178 29 -98 -562 -53 -281 -138 -260 -292 93 124 206 107 -227 -21 -458
7542 -458 60 46 -297 7 199 149 187 175 -180 -130 -61 49 -30 -538 -129 110 -134 107 -138 293 -267 -307 103
7565 103 -301 59 -423 136 45 246 -64 102 215 -62 -108 -193 -61 -49 208 -164 248 178 -593 -285 116 173
7587 173 178 -462 149 165 139 -598 -160 69 -167 -451 77 -83 41 -8 -182 -15 -98 136 13 -3 39 -48 112
$$ packed form
7430a38J1K61P8O4p9m4j97rk23R1M76l27k47L38j9k67L82J78l39m89O72k49j70
7453b46K41j70M6K10j24J67J6j71m00J33N7O9J11K0n7M89k66L8k82j6j71L93l30
7476b43K23o7K27k93l7mM67j83J05j04M7k30l1L94l38L3K83j70o2Rl89M50j16
7499b9Q27j204M94k78L79m38J32J34l06K12J40J92l92L40l43k6N6j15K93K47p4
7520B41n37M40k91J62k03L0k0K07j27m64N09k28J43j22l2L85L1Q2r9l34K06m37
7542d58N18j4l43L04J92n0L8j2l55N0O9J10p9n08M09K39k44K41k45M31n60m0M10
7565A03m04L60m82N59r1K01l10J66J13k77m6q5J32J2K57l72M12p0p71L08M01N7
7587A73No40O11J6k6p37M38K29k36k84N28j60J24m9j74J67q3K34j23j6M2q7J60
$$ plain form
7610 112 -37 48 -458 -404 -214 -170 -283 84 221 40 96 -265 -314 -130 -457 135 161 -104 -44 -165 158 267
7632 267 267 -2 11 86 114 -454 223 -27 209 225 -223 -16 -25 66 39 323 184 266 381 272 -360 -174 -155 460
7656 460 -355 25 152 159 -240 -393 135 30 372 40 -86 -443 259 108 207 216 206 61 -8 202 -101 -212
7678 -212 55 176 -18 276 234 -411 -223 -17 -413 180 -282 -41 -68 125 275 -175 115 -146 95 -66 37
7699 37 -72 -4 -232 -300 -161 -170 -5 -48 334 54 227 -96 -143 160 303 -41 105 -178 73 -240 116 -187
7721 -187 275 538 -42 -13 150 191 377 -46 -197 -33 -49 158 279 460 -290 -112 -364 -17 -171 13 189
7742 189 218 -334 282 352 462 -91 65 64 -354 -202 -433 -59 -45 -171 -2 -384 -80 -29 274 155 -283 58
7764 58 45 80 -381 -362 -371 50 133 -6 -367 -242 155 -43 -101 159 -264 129 -145 -217 114 -22 -67 105 -77
$$ packed form
7610A12j49Q5n06N4J90M4j13L67J37j81N6l61m9J84l27N92K6k65O0j21L23J09
7632B67%k69J3P5K8n68O77k50K36J6m48K07rR1k7K84j39Q2J15j09o32J86J9O15
7656D60q15L80J27Pl99j53N28j05L42l32j26l57P02j51R9Rj0j45o9K10l03j11
7678b12K67J21j94K94m2o45J88K06l96N93m62K41k7J93J50m50K90k61K41j61J03
7699C7j09O8k28o8J39rJ65m3L82k80J73l23m7L03J43l44J46k83K51l13L56l03
7721a87M62K63n80K9J63M1J86m23j51J64j6K07J21J81p50J78k52L47j54J84J76
7742A89K9n52O16P0J10n53J56jm18J52k31L74J4j26J69l82L04N1L03j19m38L41
7764E8j3L5m61J9rM21Q3j39l61J25L97j98n8K60m23L93k74p2L31j36m5J72j82
$$ plain form
7787 -77 -332 66 227 270 -93 88 407 -313 -2 97 -310 49 427 88 192 -205 509 217 -373 56 146
7808 146 423 155 -401 72 -202 -134 -46 -57 11 -203 -11 -132 314 -246 74 -473 -231 -552 -163 -80 -105 -61
7830 -61 311 -208 277 -231 -234 310 -469 223 -110 99 16 -78 -227 -324 -151 107 114 28 -150 -198 -80 108 -298
7853 -298 12 -239 140 -220 328 -179 -87 -127 -197 370 -112 180 -302 -107 -210 -249 -72 -2 60 -479 -45 -136
7875 -136 -406 -60 -14 -265 -254 -383 -47 -111 -313 -338 -421 112 -216 225 121 198 -547 301 -221 -125 -94 57 266
7898 266 -326 -126 -118 28 254 -66 -73 287 249 -157 -322 127 312 264 -8 166 -207 160 -212 -12 196 227
7920 227 111 -346 187 -480 213 -29 -85 4 512 58 -280 29 183 211 -227 -336 253 93 70 247 37
7941 37 48 175 30 -126 258 19 -30 146 326 -152 -318 247 -359 -113 350 114 -207 367 156 247 -121
$$ packed form
7787g7k55L98J61M3l63J81L19p20L11R9m07L59L78l39J04l97P14k92n90M29R0
7808A46K77k68n56M73k74O8Q8j1O8k14J92j21M46n60L20n47K42l21L89Q3k5M4
7830f1L72n19M85n08lN44p79O92l33K09q3r4j49r7J73K58Pq6j78m8J18J88m06
7853b98L10k51L79l60N48n07R2m0p0N67m82K92m82J95j03l9J77P0O2n39M34r1
7875a36k70L46M6k51J1j29L36o4k02k5q3N33l28M41j04P7p45Q48n22R6L1J51K09
7898B66n92K00QJ46K26l20pL60l8m06j65M49J85m8k72J74l73L67l72K00K08L1
7920B27j16m57N33o67O93k42n6Q9N08m54l38L09J54K8m38j09N89j60k3J77k10
7941C7J1J27j45j56L84k39m9J76J80m78j66N65o06K46M63k36l21N74k11R1l68
$$ plain form
7962 -121 217 117 338 19 -95 4 -85 119 117 -224 -39 37 222 -97 -192 -25 -440 66 -342 -19 225 160
7984 160 29 -130 -64 -166 -122 -186 640 39 -52 -305 97 -132 358 439 -571 201 255 102 -551 193 289 178
8006 178 -264 -96 147 -79 19 56 -501 -152 61 -380 -28 -24 -273 177 -312 122 96 172 -343 -496 176 -33
8028 -33 366 469 148 -355 73 -189 -165 -117 -8 199 100 -344 309 -99 -959 22 -404 77 34 -43 -226 -31
8050 -31 -64 161 298 97 -226 44 48 52 -352 -314 -214 231 0 1 317 -359 -276 -47 -170 -25 -183 -127 -163 393
8074 393 -181 54 41 0 -67 189 247 -169 -59 -44 292 -60 -148 232 -41 -85 194 -89 -125 524 -280 -88 206
8097 206 -97 -251 -53 -139 -242 -102 37 409 45 -95 186 74 25 225 -109 56 -202 -152 63 -281 -366
8118 -366 -4 -430 -18 -411 71 42 -179 230 -167 -153 -3 157 290 213 -21 114 -26 -56 -171 -431 70
$$ packed form
7962a21L38j00K21l19j14R9q9K04kl41J85P6J85l19r5J67m15N06m08L23K44o5
7984A60j31j59O6j02M4o4Q26o01r1k53M02k29M90Q1j010P72N4j53o53P44R6j11
8006A78m42J68K43k26R8L7n57L49K13m41L52Mk49M50m89M34k6P6n15j53O72k09
8028c3L99J03l21n03M28k62K4M8J09K07r9m44O53m08q60R81m26M81m3p7j83J95
8050c1l3K25J37k01l23K70MMm04L8J00M45k31JL16o76Q3K29j23J45j58N6l6N56
8074C93n74K35j3m1o7K56N8m16J10J5L36l52q8L80k73m4K79k83l6O49q04J92K94
8097B06l03j54J98q6j03J40J39L72l64j40K81j12m9K00l34J65k58N0K15l44q5
8118c66L62m26M12l93M82k9k21M09l97J4J50J60J33p7k34J35j40l0j15k60N01
$$ plain form
8139 70 -228 -76 180 -139 -329 84 -61 -266 -97 195 44 30 -38 -474 -38 -332 -91 24 -109 560 241
8160 241 431 312 -12 -218 -340 6 -124 367 -65 -470 -162 -243 -145 376 334 -202 -177 98 -73 33 -194
8181 -194 -188 41 -360 129 -27 203 29 -80 155 179
$$ packed form
8139G0k98J52K56l19j90M13j45k05J69K92j51j4o8m36M36k94K41J15j33O69l19
8160B41J90j19l24k06j22L46j30M91m32m05L08q1R8N21m2n36K5K75j71J06k27
8181a94OK29m01M89j56K30j74j09K35K4
8191A79
$$ Imaginary data points
##PAGE= N=2
##DATA TABLE= (X++(I..I)), XYDATA
$$ plain form
0 0 0 0 0 0 0 0 0 0 0 0 0 0 32 -32 32 -32 32 -64 64 -64 96 -96 128 -160 190 -206 249 -288 320 -377 416 -480
32 -480 544 -618 704 -793 891 -994 1114 -1240 1382 -1533 1701 -1884 2084 -2304 2539 -2802
48 -2802 3086 -3399 3745 -4128 4552 -5022 5544 -6142 6817 -7592 8489 -9546 10815 -12374
62 -12374 14327 -16873 20329 -25321 33188 -47469 81622 -350642 -3938 570268 -356755
73 -356755 -313590 385777 166867 -308514 121288 227214 -128378 -79438 131427 -25968
83 -25968 -27495 23540 -65807 3221 99757 -112660 -88899 137092 -11216 -159987 122649
94 122649 137671 -146867 -35737 175996 -29735 -141839 18367 13319 -63665 16614 12452
105 12452 -27088 68345 75745 -19590 25623 55375 -35709 -24564 23300 -42969 -43586 9390 -38728
$$ packed form
0@%%%%%%%%%%%%L2o4O4o4O4r6J28j28J60j92K24k88L50l96M55n37O08o97P93q96
32d80J024j162J322j497J684j885K108k354K622k915L234l585L968m388M843n341
48b802N888o485P144p873Q680r574J0566j1686J2959j4409J6081j8035K0361k3189
62a2374K6701l1200L7202m5650N8509q0657J29091m32264L46704N74206r27023
73c56755M3165O99367k18910m75381M29802J05926l55592M8940K10865j57395
83b5968j527N1035q9347O9028R6536k12417K3761K25991j48308j48771K82636
94A22649J5022k84538J11130K11733k05731j12104J60206n048p6984Q0279m162
105A2452l9540R5433P400r5335M5213K9752r1084J1145M7864o6269o17N2976m8118
$$ plain form
118 -38728 -26616 41912 -44160 -69980 84117 46305 -95381 45777 144576 -49561 -53204
129 -53204 141877 23646 -153494 11951 93513 -102171 -102753 71848 28981 -69387 13835
140 13835 64919 -6964 -20678 23638 15837 -13859 -16282 1481 16739 -1061 -18272 7384
152 7384 13953 -17836 -7085 21870 -4823 -17258 25192 26743 -14636 -10197 14902 -1960 -28969
165 -28969 -24049 -3570 -5254 -20071 -964 33093 13410 -9775 33125 41626 -22779 -13315 42134
178 42134 -8435 -55230 15557 30083 -54130 -33804 43725 -4511 -54971 10026 37717 -15070
190 -15070 -8973 35163 22023 -1202 8279 13207 2975 -12546 -20213 -1138 1461 -28665 -15056
203 -15056 26887 -420 -27686 20965 29385 -26911 -10618 36385 -4072 -30472 19381 19925 -23838
$$ packed form
118c8728J2112O8528q6072k5820J54097l7812j41686J41158R8799j94137l643
129e3204J95081j18231j77140J65445Q1562j95684n82J74601m2867r8368Q3222
140A3835N1084p1883j3714M4316p801k9696k423J7763J5258j7800j7211K5656
152G384O569l1789J0751K8955k6693j2435M2450J551m1379M439K5099j6862k7009
165b8969M920K0479j684j4817J9107L4057j9683k3185M2900Q501o4405R464N5449
178D2134n0569m6795P0787J4526q4213K0326P7529m8236n0460O4997K7691n2787
190a5070O097M4136j3140k3225R481M928j0232j5521p667J9075K599l0126J3609
203a5056M1943k7307k7266M8651Q420n6296J6293M7003m0457k6400M9853N44m3763
$$ plain form
216 -23838 -2902 20789 -9652 -13425 10696 1058 -5841 7511 333 912 15082 -7058 -17522
229 -17522 13872 1001 -35959 -1910 23275 -23010 -17248 38871 11466 -25329 23690 34283
241 34283 -21267 -8416 30779 -7985 -27938 10946 5239 -26840 -7663 7222 -13283 -10408
253 -10408 5132 767 2849 11800 5747 9378 17005 423 -1150 12523 -6076 -19454 5021
266 5021 594 -25215 -3327 16324 -13871 -13849 20904 5420 -19027 7623 18724 -9108 -5947
279 -5947 14062 3844 -7281 1055 1934 -259 -275 -6857 1338 11803 -5249 -9827 15309 6967
293 6967 -21529 -1193 15379 -16871 -20709 14078 4165 -21772 3975 22547 -3514 -5904 18756
306 18756 13354 -5735 299 10573 1478 -10284 -8676 2300 -3752 -19315 -8907 8731 -6568
$$ packed form
216b3838K0936K3691l0441l773K4121r638o899J3352p178N79J4170k2140j0464
229a7522L1394j2871l6960L4049K5185m6285N762N6119k7405l6795M9019J0593
241C4283n5550J2851L9195l8764j9953L8884n707l2079J9177J4885k0505K875
253a0408J5540m365K082Q951o053L631P627j6582j573J3673j8599j3378K4475
266E021m427k5809K1888J9651l0195K2L4753j5484k4447K6650J1101k7832L161
279e947K0009j0218j1125Q336Q79k193j6o582Q195J0465j7052m578K5136q342
293F967k8496K0336J6572l2250l838L4787r913k5937K5747J8572k6061k390K4660
306A8756n402j9089O034J0274r095j1762J608J0976o052j5563J0408J7638j5299
$$ plain form
319 -6568 -16595 11271 16057 -8863 955 25348 4694 -10821 11867 10977 -12935 -6074 6498
332 6498 -7168 -10836 -373 -2154 -3822 112 -3049 -204 7931 -1504 -6133 10114 5966 -12423
346 -12423 1747 14153 -8055 -9707 15282 5779 -12884 6974 14563 -8951 -5049 13189 -2780
359 -2780 -14562 3499 3028 -15412 -7366 6909 -4668 -9411 6061 8699 -1301 2850 11995 7379
373 7379 1513 2859 5208 1729 -5991 -7245 -2100 -3825 -11463 -7454 3302 -1611 -8597 2928 10757
388 10757 -877 -3606 11289 9515 -5885 -393 11941 -704 -10453 2427 5756 -8635 -6879
401 -6879 5564 1030 -6963 -265 4809 -471 -3755 -1055 1514 -786 -5411 -3026 5298 1154 -4241
416 -4241 5335 10728 -2158 -1535 11012 2371 -9454 3269 6196 -10805 -7210 6448 -5440 -13598
$$ packed form
319f568j0027K7866M786k4920R818K4393k0654j5515K2688q90k3912O861J2572
332F498j3666l668J0463j781j668L934l161K845Q135r435m629J6247m148j8389
346a2423J4170J2406k2208j652K4989r503j8663J9858P589k3514L902J8238j5969
359b780j1782J8061m71j8440Q046J4275j1577m743J5472K638j0000M151R145m616
373G379n866J346K349l479p720j254N145j725p638M009J0756m913o986J1525P829
388A0757j1634k729J4895j774j5400N492J2334j2645r749J2880L329j4391J756
401f879J2443m534p993O698N074n280l284K700K569k300m625K385Q324m144n395
416d241R576N393j2886O23J2547q641j1825J2723K927j7001L595J3658j1888q158
$$ plain form
430 -13598 2943 3562 -10243 -662 10549 1034 -529 10122 6799 -175 3767 2786 -3262 -1245
444 -1245 -2621 -6987 -949 -233 -8404 -1257 5997 -5098 -5734 9610 2438 -9953 5555 11320 -7613
459 -7613 -3956 13422 833 -11188 5150 7563 -9456 -3252 8681 -1528 -5333 4676 1767
472 1767 -5070 -553 -1572 -4363 -293 -914 -4896 3668 5864 -3486 2528 11308 5 -4722 9103
487 9103 4280 -9908 925 8503 -8657 -9123 7021 -851 -13394 865 6330 -6641 -3336 8920
501 8920 2914 -1681 6306 4734 -1082 1568 1839 -3061 -898 -178 -4565 -406 1957 -4523 -2173 6242
517 6242 -2652 -7643 6394 4900 -10100 151 11362 -3765 -7467 10280 4190 -10147 1846
530 1846 9522 -5121 -5233 8063 2340 -6735 1568 3574 -3660 -3065 -1002 -3223 -1053 -59 -3660
$$ packed form
430a3598J6541O19j3805R581J1211r515j563J0651l323o974L942r81o048K017
444a245j376m366O038P16q171P147P254j1095o36J5344p172j2391J5508N765j8933
459g613L657J7378j2589j2021J6338K413j7019O204J1933j0209l805J0009k909
472A767o837M517j019k791M070o21l982Q564K196r350O014Q780j1303m727J3825
487I103m823j4188J0833P578j7160m66J6144p872j2543J4259N465j2971L305J2256
501H920o006m595P987j572n816K650K71m900K163P20m387M159K363o480K350Q415
517F242q894m991J4037j494j5000J0251J1211j5127l702J7747o090j4337J1993
530A846P676j4643j12J3296n723r075Q303K006p234N95K063k221K170R94l601
$$ plain form
545 -3660 2839 5901 -2819 -323 10391 1462 -7412 6163 7719 -9410 -4057 9415 -3629 -11369
559 -11369 4612 3264 -10864 -3041 7044 -2721 -5068 6841 4616 -2052 2561 4465 -472 771
573 771 419 -3097 29 945 -4387 -688 4221 -3051 -3588 5276 -648 -7618 3576 4681 -7536 -1486
589 -1486 9329 -985 -7166 5935 6292 -6257 -1682 7219 -794 -3422 5123 2709 -3237 -288
603 -288 2009 -3188 -4719 -1672 -603 -1623 -2973 -616 5157 3136 -2642 2767 8215 -230 -4416
618 -4416 4575 4072 -5970 -1999 5326 -2633 -7271 1583 1492 -7009 -3821 5717 774 -5609 3606 8063
634 8063 -595 -3673 4806 4622 -3851 -3505 3506 1243 -4435 -671 4487 -395 -3101 1822 2383 -3506
650 -3506 -3993 1934 907 -4599 -1767 4297 1270 -5454 560 7000 -1161 -5021 5958 6841 -4464
$$ packed form
545c660O499L062q720K496J0714q929q874J3575J556j7129N353J3472j3044p740
559a1369J5981j348j4128P823J0085r765k347J1909k225o668M613J904m937J243
573G71l52l516L126R16n332L699M909p272n37Q864n924o970J1194J105j2217O050
589a486J0815j0314o181J3101L57j2549M575Q901q013k628Q545k414n946K949
603b88K297n197j531L047J069j020j350K357N773k021n778N409N448q445m186
618d416Q991n03j0042L971P325p959m638Q854r1q501L188R538m943o383R215M457
634H063q658l078Q479j84q473L46P011k263n678L764N158m882k706M923N61n889
650c506m87N927j027n506K832O064l027o724O014O440q161l860J0979Q83j1305
$$ plain form
665 -4464 -1432 7664 176 -8103 931 2974 -7755 -6223 3337 -398 -5636 1712 5519 -191 -1137
680 -1137 4115 3089 83 -505 1861 2939 -1473 -2791 1747 1745 -5721 -2562 4068 -2553 -6615 4234
696 4234 4820 -5622 -55 8778 -1375 -6069 4900 3721 -6144 -1712 5818 -383 -3424 3599 3262
711 3262 -2423 -508 2007 -849 -2297 -1703 -376 -503 -2251 -2221 2151 669 -4459 770 5611 -1324
727 -1324 -2639 6894 4698 -4336 1066 7073 -2691 -5836 2902 374 -7475 -2303 2892 -2460 -3889
742 -3889 2141 2958 -535 -169 2891 3022 -222 -1372 2583 2996 -2557 -1945 3661 -180 -5999 391
758 391 4088 -3949 -3696 4862 2038 -5148 738 5579 -2349 -4672 2946 2157 -3984 -944 4687 1397
774 1397 -2671 1217 4261 -511 -2520 2074 2625 -2581 -3256 2136 537 -5138 -1534 2899 -1480 -4004
$$ packed form
665d464L032R096p488q279R034K043j0729J532R560l735n238P348L807n710r46
680a137N252j026l006n88K366J078m412j318M538kp466L159O630o621m062J0849
696D234N86j0442N567Q833j0153m694J0969j179r865M432P530o201l041P023l37
711C262n685J915K515k856j448N94J327j27j748L0M372j482n128N229M841o935
727a324j315R533k196r034N402O007r764l145Q738k528p849N172N195n352j429
742c889O030Q17l493L66L060J31l244j150L955M13n553O12N606l841n819O390
758C91L697q037K53Q558k824p186N886M841p928k323P618p89o141L040N631l290
774A397m068L888L044m772k009M594N51n206o75N392j599n675L604M433m379k524
$$ plain form
790 -4004 2273 3511 -1777 -834 4906 3271 -2017 601 3758 -191 -3769 -558 1429 -3138 -3709 599
806 599 1380 -2755 -1878 3778 1297 -2681 1612 4318 -1133 -1807 3548 1871 -3693 -35 2880 -1562
822 -1562 -3490 1296 1344 -2903 -934 2456 420 -2126 522 1599 -269 -1738 95 1468 -979 -1706
838 -1706 1870 2498 -1834 -652 3669 846 -3388 1220 2947 -2762 -3241 2352 607 -5542 -1451 2623
854 2623 -1650 -3405 2011 2297 -622 -11 3159 2308 -602 407 1789 1016 -1711 -1392 300 -1352
870 -1352 -3306 -353 1022 -1938 -2108 2300 2287 -2074 891 3910 -144 -1903 2624 1866 -2880 -763
886 -763 2683 -871 -3291 674 1888 -2474 -1014 2260 541 -2167 314 1530 -1045 -2319 354
901 354 1220 -852 -1111 1481 1672 -908 -183 3120 1947 -1814 178 3134 -842 -3604 770 1294 -4264
$$ packed form
790d004O277J238n288R43N740j635n288K618L157l949l578L211J987m567n71M308
806E99P81m135Q77N656k481l978M293K706n451o74N355j677n564L658K915m442
822a562j928M786M8m247J969L390k036k546K648J077j868j469J833J373k447p27
838a706L576O28m332J182M321k823m234M608J727n709m79N593j745o149M091M074
854B623m273j755N416K86k919O11L170q51k910J009J382p73k727L19J692j652
870a352j954K953J375k960j70M408j3m361K965L019m054j759M527p58m746K117
886g63L446l554k420L965J214m362J460L274j719k708K481J216k575j274K673
901C54Q66k072k59K592J91k580P25L303j173l761J992K956l976k762M374N24n558
$$ plain form
918 -4264 -3059 2149 -685 -3908 964 3484 -593 -603 3393 2087 -515 1042 2332 -186 -1390 -554
934 -554 -549 -1290 -1633 -1846 -22 -817 -1376 1125 1638 -380 -353 2824 682 -2007 1336 2686 -2417 -1863
952 -1863 2998 -19 -2978 1447 2483 -1994 -1314 2567 -128 -2757 476 857 -1752 -1518 507 -927
968 -927 -1338 283 84 419 523 343 1785 2059 -213 -803 2053 456 -3310 -654 1548 -3105 -3166 1751
986 1751 311 -2908 272 3047 -691 -781 3327 2047 -834 1254 2557 -761 -1694 246 -290 -1680
1002 -1680 -1436 -874 111 -473 -1324 507 1311 -410 -1493 2307 936 -1964 -149 1816 -851 -1564 2111
1019 2111 1182 -1410 396 2266 -1155 -969 1368 310 -1756 -5 393 -1468 -1332 -104 -747 -736 293
1036 293 280 368 1152 991 892 1656 579 -376 656 465 -1808 -1452 554 -1338 -2730 -11 745 -1921
$$ packed form
918d264J205N208k834l223M872K520m077j0L996j306k602J557J290k518j204Q36
934e54Np41l43k13J824p95n59K501N13k018K7L177k142k689L343J350n103N54
952a863M861l017k959M425J036m477O80L881k695k629L233L81k609K34K025j434
968i27m11J621j99L35J04j80J442K74k272n90K856j597l766K656K202m653o1M917
986A751j440l219L180K775l738r0M108j280k881K088J303l318r33J940n36j390
1002a680K44N62R85n84q51J831Q04j721j083L800j371k900J815J965k667p13L675
1019B111r29k592J806J870l421J86K337j058k066J751L98j861J36J228o43J1J029
1036B93j3Q8P84j61r9P64j077r55J032j91k273L56K006j892j392K719P56k666
$$ plain form
1054 -1921 -467 2781 410 -951 1854 2281 -922 -169 2110 -157 -1547 107 771 -1832 -885 191
1070 191 -149 -417 16 690 185 154 -498 45 1267 -920 -1044 1652 368 -1355 752 2115 -840 -959
1088 -959 1774 946 -1884 391 1903 -1701 -1314 1020 -280 -2121 -575 408 -753 -468 911 412
1104 412 914 1637 666 887 1094 137 -475 617 -328 -1894 -413 -86 -1668 -1006 1353 -623 -1497 1894
1122 1894 1403 -1384 552 2865 364 -902 2256 1121 -1183 -493 931 -1172 -1204 196 181 -212 -276
1139 -276 497 169 279 -831 -215 702 -528 -1495 624 1036 -1190 -170 2021 296 -1321 1112 2031
1156 2031 -1287 -696 1459 -415 -2097 -22 561 -1638 -1234 455 -524 -889 225 903 645 1538 1115
1173 1115 872 988 190 -465 404 -90 -1649 -19 630 -1944 -1780 1084 -136 -1731 357 1460 -1001
$$ packed form
1054a921J454L248k371j361K805M27l203P53K279k267j390J654O64k603R47J076
1070A91l40k68M33O74n05l1o52N43J222k187j24K696j284j723K107J363k955j19
1088i59K733q28k830K275J512l604L87K334j300j841J546R83j161K85J379m99
1104D12N02P23r71K21K07r57o12J092r45j566J481L27j582O62K359j976q74L391
1122A894m91k787J936K313k501j266L158j135k304O90J424k103l2J400j5l93o4
1139b76P73l28J10j110O16R17j230r67K119M12k226J020K191j725j617K433R19
1156B031l318N91K155j874j682K075N83k199M04J689r79l65J114O78k58Q93m23
1173A115k43J16p98o55Q69m94j559J630O49k574J64K864j220j595K088J103k461
$$ plain form
1190 -1001 -275 1944 85 -1235 1479 1488 -1374 -585 1395 3 -1169 104 328 -184 -363 -10 621
1207 621 -357 -549 -563 596 -253 -1420 438 1608 -685 -500 2298 674 -1147 1049 1730 -913 -475
1224 -475 1694 206 -2440 -317 1188 -1333 -1195 630 365 -580 256 1418 566 248 637 1282 549
1241 549 -62 449 485 -470 -686 370 736 -1569 -905 438 183 -1656 252 1152 -1191 -1259 2084 859
1259 859 -1411 183 1004 84 -406 667 723 -297 -283 757 589 -754 -383 362 -278 -1100 -349 672
1277 672 -1069 -1256 418 799 -842 246 1628 294 -311 937 1259 -490 -583 889 10 -819 -485
1294 -485 104 -664 -1711 27 547 -1096 -816 1062 546 -742 608 1306 219 -981 1105 989 -733
1311 -733 -676 761 419 -1100 -474 1053 -130 -1562 500 585 -566 -715 951 666 -619 -733 851
$$ packed form
1190a001P26K219j859j320K714Rk862P89J980j392j172J273K24n12j79L53O31
1207F21r78j92j4J159q49j167J858J170k293J85K798j624j821K196O81k643M38
1224d75K169j488k646K123J505k521J38J825k65r45Q36J162q52l18L89O45p33
1241E49o11N11L6r55k16J056L66k305O64J343k55j839J908R00k343o8L343j225
1259H59k270J594Q21r20m90J073N6j020J4J040j68j343L71P45o40q22P51J021
1277F72j741j87J674L81j641J088J382j334o05J248L22j749r3J472q79q29L34
1294d85N89p68j047J738N20j643K80J878n16j288J350O98j087j200K086j16j722
1311g33N7J437l42j519O26J527j183j432K062Q5j151j49J666k85j285j14J584
$$ plain form
1328 851 162 -875 -37 679 232 -809 736 974 -780 -562 821 -480 -2003 -48 540 -1286 -956
1345 -956 1181 433 -708 105 1218 309 -401 539 944 -332 -664 417 76 -604 -978 -205 -491 -1131
1363 -1131 -321 583 -104 -904 769 1306 -516 49 1523 653 -725 481 1189 -903 -570 1140 50
1380 50 -1150 -163 931 -406 -1158 245 283 -512 -531 808 379 -591 -309 710 -37 -467 531 820 -179
1399 -179 -563 966 735 -751 -524 559 -215 -1904 150 151 -1196 -746 769 276 -743 47 1202 315
1417 315 -805 882 1178 -381 -798 493 -20 -857 -878 126 -340 -840 -100 432 -546 -821 262 772
1435 772 -576 -71 1087 -97 -724 497 1347 -671 -509 1281 791 -1163 -289 1305 -57 -1319 317
1452 317 396 -990 -640 883 -295 -1119 -192 855 -57 -73 481 705 -198 -131 383 389 -671 -669 539 249
$$ packed form
1328H51o89j037Q38P16m47j041J545K38j754K18J383j301j523J955N88j826L30
1345i56K137p48j141Q13J113r09p10R40M05j276l32J081l41o80l74P73k86o40
1363a131Q10R04o87q00J673N37j822N65J474q70j378J206P08k092L33J710j090
1380E0j200R87J094j337p52J403L8p95j9J339m29r70K82J019p47m30R98K89r99
1399a79l84J529k31j486K27J083p74j689K054Jj347M50J515m93j019P90J155q87
1417C15j120J687K96j559m17J291n13q37k1J004m66n00P40N32r78k75J083N10
1435G72j348N05J158j184o27J221Q50k018J62J790m90j954Q74J594j362j262J636
1452C17P9j386L50J523j178q24R27J047r12j6N54K24r03O7N14Oj060KJ208k90
$$ plain form
1472 249 -1600 -462 612 -690 -1092 448 805 -1352 -145 1539 428 -635 1064 1386 -1014 -505
1488 -505 1279 -249 -745 536 577 -852 -636 671 86 -208 -360 220 205 -281 -475 341 736 -768 167
1507 167 1398 -196 -810 1226 1444 -1374 -179 1767 -484 -1210 535 266 -1502 -813 827 -397
1523 -397 -991 133 724 -159 48 752 535 -190 429 97 322 230 9 216 -9 -729 -524 783 -481
1542 -481 -1056 530 819 -868 -490 1325 -338 -580 906 873 -743 -373 976 -550 -331 641 586 -852
1560 -852 -99 168 -363 -8 -142 587 -363 -285 -346 62 502 -676 129 630 187 -278 696 764 -427 -413 942
1581 942 93 -1039 249 178 -1101 -531 597 -144 -972 469 571 -511 385 486 208 -94 293 425
1599 425 445 582 -333 -187 -305 -346 -208 397 -148 -725 311 422 -943 -274 326 -166 -578 447 1091 -739
$$ packed form
1472B49j849J138J074j302m02J540L57k157J207J684j111j063J699L22k400N09
1488e05J784j528m96J281M1j429K16J307n85k94j52N80j5m86j94Q16L95j504R35
1507A67J231j594o14K036K18k818J195J946k251p26J745k69j768O89J640j224
1523c97n94J124N91q83K07P04k17p25O19l32K25r2k21K07k25p20K05J307j264
1542d81n75J586K89j687L78J815j663k42J486l3j616L70J349j526K19R72n5j438
1560h52P53K67n31L55j34P29r50P8o1M08M40j178Q05N01m43m65R74O8j191J4J355
1581I42q49j132J288p1j279N70J128p41q28J441J02j082Q96J01k78l02L87J32
1599D25K0J37r15J46j18m1J38O05n45n77J036J11j365O69O00m92m12J025O44j830
$$ plain form
1619 -739 -317 843 194 -491 -148 284 -423 -217 707 56 -409 -1 -14 -496 -463 -109 -43 -77 -81 -120 119 77
1641 77 9 298 920 -262 -437 391 20 -695 226 353 -351 -177 152 68 -761 -46 465 55 -90 201 345
1662 345 32 180 78 21 311 -31 236 347 77 -366 -145 -176 -292 -199 430 -352 -340 275 -56 32 -139 265
1684 265 -536 -509 119 156 -661 325 360 -244 -448 442 -220 -765 -85 -590 53 154 -428 -495 -322 165 -93
1705 -93 575 162 238 130 854 556 -308 401 102 -420 -367 624 -80 -836 -100 140 -723 11 389 -7 -146
1726 -146 36 608 406 194 418 144 -27 -376 163 36 63 148 157 -64 -374 267 29 410 -283 -158 -101 113
1748 113 -67 330 136 -262 278 469 153 59 354 407 -184 -324 -142 -69 -501 243 -442 -382 -296 -33 -24 -198
1770 -198 64 369 172 -96 105 504 102 32 424 -44 -339 14 240 154 -595 -94 442 -467 -109 120 -70
$$ packed form
1619g39M22J160o49o85L43M32p07K06R24o51m65M08j3m82L3L54O6l4ml9K39m2
1641G7o8K89O22j182j75Q28l71p15R21J27p04J74L29q4q29P15N11m10j45K91J44
1662C45l13J48j02n7K90l42K67J11k70m43K21l1j16R3O29p82J2O15l31Q8j71M04
1684B65q01K7O28L7q17R86L5o04k04Q90o62n45O80n05O43J01n82o7J73M87k58
1705i3O68m13P6j08P24k98q64P09k99n22N3R91p04p56P36K40q63P34L78l96j39
1726a46J82N72k02k12K24k74j71l49N39j27K7Q5Rk21l10O41k38L81o93J25N7K14
1748A13j80L97j94l98N40J91l16r4K95N3n91j40J82P3m32P44o85O0Q6K63Rj74
1770a98K62L05j97k68K01L99m02p0L92m68k95L53K26q6p49N01N36r09L58K29j90
$$ plain form
1791 -70 345 -116 180 90 169 -378 209 354 83 350 104 -638 -273 92 20 -154 93 -332 -196 -207 274 188
1813 188 -281 -351 175 -200 -200 61 117 -169 32 320 -13 80 241 0 -323 133 -507 -133 169 -82 227 89
1835 89 -31 -117 439 -99 -296 -231 346 75 -373 341 60 -120 -229 112 -226 157 -66 -327 -7 -486 -155
1856 -155 332 230 -508 90 -203 -407 -97 358 464 -163 285 403 86 -119 502 -85 -78 -516 175 -162 -280
1877 -280 261 -180 53 21 -253 -124 -16 149 32 -90 131 -149 313 452 -76 -93 613 -446 -215 218
1897 218 191 -393 -251 215 -180 -359 -65 571 -117 -216 -28 -249 -23 -164 26 38 -243 455 74 -139 58
1918 58 41 -125 -448 58 -404 159 82 -640 -180 -313 -574 789 192 109 166 296 69 -328 -277 659 -9 -347
1940 -347 297 322 398 -21 394 -295 -224 110 -122 -9 102 410 197 283 -79 465 35 -57 -80 -1 107 -662
$$ packed form
1791g0M15m61K96r0P9n47N87J45k71K67k46p42L65L65p2j74K47m25J36j1M81q6
1813A88m69p0N26l75%K61N6k86K01K88l33R3J61k41l23M56o40L74L02k51L09j38
1835H9j20q6N56n38j97O5N77k71m48P14k81j80j09L41l38L83k23k61L20m79L31
1856a55M87j02p38N98k93k04L10M55J06o27M48J18l17k05O21n87Pm38O91l37j18
1877b80N41m41K33l2k74J29J08J65j17j22K21k80M62J39n28j7P06j059K31M33
1897B18k7n84J42M66l95j79K94O36o88r9J88k21K26j41J90J2k81O98l81k13J97
1918E8j7j66l23N06m62N63p7p22M60j33k61J363n97q3N7J30k27l97N1R36o68l38
1940c47O44K5P6m19M15o89P1L34k32J13J11L08k13Q6l62N44m30r2k3P9J08p69
$$ plain form
1962 -662 -217 -23 131 -220 -21 210 -608 -32 794 -102 -323 345 595 337 271 364 -138 -424 -106 200 -247
1983 -247 194 336 -241 -164 -234 -345 585 -152 -595 -83 302 -329 119 524 -235 -355 151 21 -157 201 615
2004 615 294 -530 204 189 -163 117 232 129 -513 81 7 -728 -167 186 -314 -53 370 291 317 -455 -489 300
2026 300 -51 -212 121 249 -512 -768 128 379 -446 56 -186 -235 -167 1032 117 -136 422 472 -242 -345 542
2047 542 -134 17 -161 -157 35 -269 201 2 65 -119 82 84 345 -30 -180 351 73 -294 666 -166 -83 223
2069 223 612 146 -546 -206 52 -485 -389 350 -493 -413 178 -10 39 164 484 119 -271 34 332 -30 250
2090 250 21 -90 21 -249 -313 -355 -205 -616 33 201 -295 -232 96 -26 -379 289 77 108 182 328 74 -317
2112 -317 701 81 48 -144 410 -519 -326 51 -54 -286 201 -82 400 420 -713 314 237 336 353 583 -21
$$ packed form
1962f62M45J94J54l51J99K31q18N76Q26q96k21O68K50k58o6R3n02k86L18L06m47
1983b47M41J42n77P7p0j11R30p37m43N12L85o31M48M05p59j20N06j30j78L58M14
2004F15l21q24P34j5l52K80J15j03o42N94p4p35N61L53n00K61M23p9K6p72l4P89
2026C00l51j61L33J28p61k56Q96K51q25N02k42m9O8J199r15k53N58N0p14j03Q87
2047E42o76J51j78MJ92l04M70j99O3j84K01KK61l75j50N31k78l67R60q32Q3L06
2069B23L89m66o92L40K58n37R6P39q43Q0N91j88M9J25L20l65l90L05K98l62K80
2090B50k29j11J11k70o4m2J50m11O49J68m96O3L28j22l53O68k12L1P4J46k54l91
2112c17J018o20l3j92N54r29J93L77j05k32M87k83M82K0j133J027p7R9J7K30o04
$$ plain form
2133 -21 -168 -124 316 151 -6 394 601 -300 -274 -605 -418 -486 467 353 -300 247 -193 52 -230 -44 -172
2154 -172 60 179 225 -12 -62 82 73 222 -407 61 -74 272 -239 -209 229 -81 -258 177 433 -250 -174 446
2176 446 123 -229 644 -46 -285 -216 -20 73 -160 -239 503 -182 -486 241 261 -480 -121 -138 20 116 214 302 -43
2199 -43 51 313 441 -366 158 241 422 -299 54 -60 -27 -619 -156 26 142 -256 293 639 -241 308 -20
2220 -20 52 23 556 -193 569 -49 192 221 -22 87 27 -436 45 -366 -37 26 31 718 295 -353 229 295 288 -788
2244 -788 129 367 61 40 -29 49 188 -9 -159 -265 41 -26 93 -76 -115 223 201 71 388 194 -281 -105
2266 -105 261 347 160 109 241 -219 -412 -388 2 -156 -205 172 295 -6 113 94 51 -195 -27 -27 76 -319 138
2289 138 142 30 -183 137 290 -119 182 -284 -430 -109 0 64 207 62 404 -177 156 -83 -150 -214 -194 364
$$ packed form
2133b1j47M4M40j65j57M00K07r01K6l31J87o8R53j14o53N47m40K45k82J86j28
2154a72K32J19M6k37n0J44rJ49o29M68j35L46n11L0M38l10j77M35K56o83P6O20
2176D46l23l52Q73o90k39O9J96R3k33p9P42o85l04P27K0p41L59j7J58R6R8Q8l45
2199d3R4K62J28q07N24Q3J81p21L53j14L3n92M63J82J16l98N49L46q80N49l28
2220b0P2k9N33p49P62o18K41K9k43J09o0m63M81m11L29O3NO87m23o48N82O6pj076
2244g88R17K38l06k1o9P8J39j97j50j06L06o7J19j69l9L38k2j30L17j94m75J76
2266a05L66Q6j87n1J32m60j93K4L90j58m9L77J23l01J19j9m3k46J68%J03l95M57
2289A38Mj12k13L20J53m09L01m66j46L21J09O4J43j45L42n81L33k39o7o4K0N58
$$ plain form
2311 364 -61 -267 -167 260 82 -101 -128 270 258 -240 48 176 -103 -173 -126 -105 -44 75 230 105 517 36
2333 36 -97 245 173 210 -138 39 -390 197 -195 -413 -191 293 138 -215 12 205 -71 172 -446 76 54
2354 54 -64 174 276 145 -3 181 -42 8 159 285 -88 8 -6 -148 -357 -157 -216 -121 -208 92 62 578 196
2377 196 247 -7 -193 121 -600 168 -326 -243 -3 -72 71 -131 -193 -379 -168 119 -220 187 258 75 -424 -270
2399 -270 -15 146 119 -159 130 -226 218 265 -367 511 -133 -375 207 -388 66 61 52 281 182 30 -95 300
2421 300 135 295 309 43 149 492 -153 -90 287 -115 -85 164 82 -127 478 -433 -313 81 210 -485 -61
2442 -61 463 440 83 188 -319 506 292 123 45 402 -338 50 330 -309 -338 -265 -6 239 -98 363 -80 127
2464 127 160 353 -625 -313 189 4 95 56 393 80 163 -308 332 -266 316 -211 194 141 -514 -223 -76 63
$$ packed form
2311C64m25k06J00M27j78j83k7L98j2m98K88J28k79p0M7K1O1J19J55j25M12m81
2333C6j33L42p2L7l48J77m29N87l92k18K22M84j55l53K27J93k76K43o18N22k2
2354E4j18K38J02j31j48J84k23N0J51J26l73R6j4j42k09K00n9R5q7L00l0N16l82
2377A96N1k54j86L14p21P68m94Q3K40o9J43k02o2j86K11K87l39M07P1j83m99J54
2399b70K55J61k7k78K89l56M44M7o32Q78o44k42N82n95M54nrK29r9j52j25L95
2421C00j65J60J4k66J06L43o45O3L77m02L0K49q2k09O05r11J20L94J29o95M24
2442f1N24k3l57J05n07Q25k14j69p8L57p40L88K80o39k9P3K59K45l37M61m43K07
2464A27L3J93r78L12N02j85R1l9L37l13Q3m71O40n98N82n27M05n3o55K91J47J39
$$ plain form
2486 63 16 -307 -294 258 0 -43 128 -86 165 259 29 -175 -207 -262 118 163 122 -2 180 149 -37 247 -328
2509 -328 155 224 153 -397 23 -221 214 -344 69 12 177 -189 -369 -152 -88 10 -31 370 -178 647 -100 63
2531 63 31 -96 -613 26 58 -137 -2 -204 -170 -48 -387 -182 -123 -126 -64 163 182 162 170 120 51 20 -131 -222 -107
2556 -107 -387 248 -279 195 77 39 276 -205 -559 -23 -438 211 -10 95 -9 -46 118 -124 227 -267 469
2577 469 20 -16 -41 -8 375 -176 -184 -37 10 -73 168 319 119 -349 154 105 -7 312 -120 -160 30 214 237
2600 237 313 149 -139 -21 86 -131 -82 -119 144 -205 -44 -53 -152 -9 -81 -10 -363 156 -141 -173 -273 -174 304
2623 304 -38 185 -63 232 -128 241 -339 270 -88 -108 301 161 43 -357 -501 -298 523 21 -57 -83 -198
2644 -198 55 -353 -311 190 196 144 158 -100 -270 -53 -280 -148 73 5 -42 -31 276 76 -300 -70 18 -209 -25
$$ packed form
2486F3m7l23J3N52k58m3J71k14K51R4k30k04l2n5L80M5m1j24J82l1j86K84n75
2509c28M83O9p1n50M20k44M35n58M13n7J65l66j80K17O4R8m1M01n48Q25p47J63
2531F3l2j27n17O39L2j95J35k02L4J22l39K05N9lO2K27J9k0Qn0o9l1j51r1J15
2556a07k80O35n27M74j18l8K37m81l54N36m15O49k21J05j04l7J64k42L51m94P36
2577D69m49l6k5L3L83n51qJ47M7q3K41J51k00m68N03m9j12L19m32m0J90J84K3
2600B37P6j64k88J18J07k17M9l7K63l49J61rr9J43p2P1l53N19k97l2j00R9M78
2623C04l42K23k48K95l60L69n80O09l58k0M09j40j18m00j44K03Q21n02p8k6j15
2644a98K53m08M2N01On2J4k58j70K17k27J32K21o8m7J1L07k00l76K30Q8k27J84
$$ plain form
2667 -25 -195 154 486 326 -140 46 -90 -52 -241 -195 115 -87 34 -125 -53 149 23 -259 205 -18 5 -319
2689 -319 250 348 144 588 695 -20 107 -71 140 137 63 -102 50 -135 196 416 -101 460 121 -352 -475
2710 -475 25 188 90 254 -250 -89 -51 38 173 20 57 181 -104 20 -94 -90 -221 36 -302 -205 -85 -123 29
2733 29 69 -293 -242 -99 138 -15 44 -128 329 -442 -347 -27 348 43 135 -223 124 -117 115 203 511 -14
2755 -14 -327 -27 97 11 -34 -433 -77 -4 -316 254 -15 -212 -143 -75 199 220 -473 373 367 -442 56 30 244
2778 244 -181 -218 -149 259 393 55 -402 -176 38 41 -418 198 -187 214 -380 157 -57 36 -170 176 -148 -143
2800 -143 -8 98 16 -29 35 -39 207 67 -241 -159 348 -74 -4 168 139 -21 -132 -17 297 -89 18 -267
2822 -267 0 -138 -261 197 -137 107 37 127 136 77 183 -352 179 -30 -66 -49 -316 226 193 336 133 170 5
$$ packed form
2667b5j70L49L32j60m66J86j36L8j89M6L10k02J21j59P2K02j26k82M64k23K3l24
2689c19N69R8k04M44J07p15J27j78K11lp4j65J52j85L31K20n17N61l39m73j23
2710d75N00J63r8J64n04J61L8Q9J35j53L7J24k85J24j14Mj31K57l38R7J20l8J52
2733B9M0l62N1J43K37j53N9j72M57p71R5L20L75l05R2l58L47k41K32Q8L08n25
2755a4l13L00J24q6m5l99L56P3l12N70k69j97O9O8K74K1o93Q46oq09M98k6K14
2778B44m25l7O9M08J34l38m57K26K14Lm59O16l85M01n94N37k14R3k06L46l24N
2800a43J35J06q2m5O4p4K46j40l08Q2N07m22P0J72k9j60j11J15L14l86J07k85
2822b67K67j38j23M58l34K44p0R0Rn9J06n35N31k09l6J7k67N42l3J43k03L7j65
$$ plain form
2845 5 348 140 137 273 -186 97 -188 33 -88 -70 160 283 -265 526 597 322 2 -202 114 -518 -207 86
2867 86 23 226 271 64 100 32 -8 320 -145 -201 168 97 -107 -237 -274 -103 64 358 56 14 34 -93 -216 181
2891 181 30 103 279 -158 201 -32 154 -262 -277 69 19 174 -264 -315 63 -65 -31 119 -251 -9 293 271
2913 271 -43 219 15 -318 -399 87 246 -218 -97 126 -67 12 -91 -122 -118 248 189 230 -199 157 -214 -36
2935 -36 -148 289 251 -25 137 277 128 -17 -162 33 99 -25 -122 -44 -105 5 22 220 23 381 272 -412
2957 -412 169 -140 73 17 93 -4 68 111 -66 3 10 28 -135 47 -152 -266 -81 153 181 426 -123 378 -55
2980 -55 -244 119 87 -60 -243 -58 87 -70 113 295 -100 407 -253 191 158 -378 -401 -174 59 59 -358 -317
3002 -317 -140 15 -37 253 61 -199 3 -48 66 -74 -202 -158 81 -18 -370 241 -64 -343 -248 183 194 248
$$ packed form
2845EL43k08lJ36m59K83k85K21j21J8K30J23n48P91P1k75l20k04L16o32L11K93
2867H6o3K03M5k07L6o8m0L28m65n6L69p1k04j30l7J71J67K94l02m2K0j27j23L97
2891A81j51P3J76m37L59k33J86m16j5L46n0J55m38n1L78j28L4J50l70K42L02k2
2913B71l14K62k04l33q1M86J59m64J21K23j93P9j03l1ML66n9M1m29L56l71J78
2935c6j12M37l8k76J62J40j49j45j45J95O6j24r7P8o1J10J7J98j97L58j09o84
2957d12N81l09K13n6P6r7P2M3j77O9PJ8j63J82j99j14J85K34K8K45n49N01m33
2980e5j89L63l2j47j83J85J45j57J83J82l95N07o60M44l3n36k3K27K33%m17M1
3002c17J77J55n2K90j92k60K02n1J14j40j28M4K39r9l52O11l05k79R5M31J1N4
$$ [...]
8191B05
##END NTUPLES=NMR FID
##END=
