##TITLE=1H_DE-80H_X3
 200.13MHz, d2o
 8 sc
 
 19ns.26.2.2025
##JCAMPDX= 6.0         $$ Bruker NMR JCAMP-DX V2.0
##DATA TYPE= NMR FID
##DATA CLASS= NTUPLES
##ORIGIN= UXNMR, Bruker Analytische Messtechnik GmbH
##OWNER= pz
$$ XWIN-NMR		Version 3.5
$$ Thu May 28 15:21:52 2026 Russian Standard Time (UT+4h)  Yarkov@DPX200
##.OBSERVE FREQUENCY= 200.1313
##.OBSERVE NUCLEUS= ^1H
##.DELAY= (6, 6)
##.ACQUISITION MODE= SIMULTANEOUS
##.ACQUISITION SCHEME= undefined
##.AVERAGES= 8
##.DIGITISER RES= 18
##SPECTROMETER/DATA SYSTEM= spect
##.PULSE SEQUENCE= zg30
##.SOLVENT NAME= CDCl3
##.SHIFT REFERENCE= (INTERNAL, CDCl3, 0, 14.3821)
##AUDIT TRAIL= $$ (NUMBER, WHEN, WHO, WHERE, WHAT)
$$ ##TITLE= Audit trail, XWIN-NMR		Version 3.5
$$ ##JCAMPDX= 5.01
$$ ##ORIGIN= Bruker BioSpin GmbH
$$ ##OWNER= Yarkov
$$ C:/Bruker/XWIN-NMR/data/yarkov2/nmr/H-C/1/audita.txt
$$ ##AUDIT TRAIL=  $$ (NUMBER, WHEN, WHO, WHERE, WHAT)
(   1,<2026-05-28 15:20:29.73 +0400>,<Yarkov>,<DPX200>,
      <created by zg, POWCHK disabled, PULCHK disabled
       configuration hash MD5:
       00 E9 B6 7A A2 85 ED C7 34 08 36 98 17 FE 4E 26
       data hash MD5: 16K
       98 0C F0 9F 0E 78 B3 6C 53 0C 62 9D E6 CB 02 98>)
$$ ##END=
$$ 
$$ hash MD5
$$ 54 8B 51 5D 0B 97 12 C5 75 DD FD 64 05 7E 18 F6
##$RELAX= 
##$RELAX= 
##$RELAX= 
##$RELAX= 
##$RELAX= 
##$RELAX= 
$$ Bruker specific parameters
$$ --------------------------
##$DU= <C:/Bruker/XWIN-NMR>
##$EXPNO= 1
##$NAME= <H-C>
##$PROCNO= 1
##$TYPE= <nmr>
##$USER= <yarkov2>
##$AMP= (0..31)
100 100 100 100 100 100 100 100 100 100 100 100 100 100 100 100 100 100 
100 100 100 100 100 100 100 100 100 100 100 100 100 100 
##$AQSEQ= 0
##$AQ_mod= 1
##$AUNM= <au_zg>
##$AUTOPOS= <>
##$BF1= 200.13
##$BF2= 200.13
##$BF3= 200.13
##$BF4= 200.13
##$BF5= 200.13
##$BF6= 200.13
##$BF7= 200.13
##$BF8= 200.13
##$BYTORDA= 1
##$CFDGTYP= 0
##$CFRGTYP= 5
##$CHEMSTR= <none>
##$CNST= (0..31)
1 1 145 1 1 1 1 1 1 1 1 1 1 1 1 1 1 1 1 1 1 1 1 1 1 1 1 1 1 1 1 1 
##$CPDPRG= <>
##$CPDPRG1= <>
##$CPDPRG2= <>
##$CPDPRG3= <>
##$CPDPRG4= <mlev>
##$CPDPRG5= <mlev>
##$CPDPRG6= <mlev>
##$CPDPRG7= <mlev>
##$CPDPRG8= <mlev>
##$CPDPRGB= <>
##$CPDPRGT= <>
##$D= (0..31)
0 0.7 0 0 0 0 0 0 0 0 0 0.03 0 0 0 0 0 0 0 0 0 0 0 0 0 0 0 0 0 0 0 0 
##$DATE= 1779967229
##$DBL= (0..7)
120 120 120 120 120 120 120 120 
##$DBP= (0..7)
150 150 150 150 150 150 150 150 
##$DBP07= 0
##$DBPNAM0= <>
##$DBPNAM1= <>
##$DBPNAM2= <>
##$DBPNAM3= <>
##$DBPNAM4= <>
##$DBPNAM5= <>
##$DBPNAM6= <>
##$DBPNAM7= <>
##$DBPOAL= (0..7)
0.5 0.5 0.5 0.5 0.5 0.5 0.5 0.5 
##$DBPOFFS= (0..7)
0 0 0 0 0 0 0 0 
##$DE= 6
##$DECBNUC= <off>
##$DECIM= 32
##$DECNUC= <off>
##$DECSTAT= 4
##$DIGMOD= 1
##$DIGTYP= 9
##$DL= (0..7)
0 120 120 120 120 120 120 120 
##$DP= (0..7)
150 150 150 150 150 150 150 150 
##$DP07= 0
##$DPNAME0= <>
##$DPNAME1= <>
##$DPNAME2= <>
##$DPNAME3= <>
##$DPNAME4= <>
##$DPNAME5= <>
##$DPNAME6= <>
##$DPNAME7= <>
##$DPOAL= (0..7)
0.5 0.5 0.5 0.5 0.5 0.5 0.5 0.5 
##$DPOFFS= (0..7)
0 0 0 0 0 0 0 0 
##$DQDMODE= 0
##$DR= 18
##$DS= 0
$$ [...]
##$SUBNAM2= <"">
##$SUBNAM3= <"">
##$SUBNAM4= <"">
##$SUBNAM5= <"">
##$SUBNAM6= <"">
##$SUBNAM7= <"">
##$SUBNAM8= <"">
##$SUBNAM9= <"">
##$SW= 18.0517328524113
##$SWIBOX= (0..15)
0 0 2 0 0 0 0 0 0 0 0 0 0 0 0 0 
##$SW_h= 3612.71676300578
##$TD= 16384
##$TD0= 1
##$TE= 0
##$TE2= 300
##$TE3= 300
##$TEG= 300
##$TL= (0..7)
0 120 120 120 120 120 120 120 
##$TP= (0..7)
150 150 150 150 150 150 150 150 
##$TP07= 0
##$TPNAME0= <>
##$TPNAME1= <>
##$TPNAME2= <>
##$TPNAME3= <>
##$TPNAME4= <>
##$TPNAME5= <>
##$TPNAME6= <>
##$TPNAME7= <>
##$TPOAL= (0..7)
0.5 0.5 0.5 0.5 0.5 0.5 0.5 0.5 
##$TPOFFS= (0..7)
0 0 0 0 0 0 0 0 
##$TUNHIN= 0
##$TUNHOUT= 0
##$TUNXOUT= 0
##$USERA1= <user>
##$USERA2= <user>
##$USERA3= <user>
##$USERA4= <user>
##$USERA5= <user>
##$V9= 5
##$VALIST= <valist>
##$VCLIST= <CCCCCCCCCCCCCCC>
##$VD= 0
##$VDLIST= <DDDDDDDDDDDDDDD>
##$VPLIST= <PPPPPPPPPPPPPPP>
##$VTLIST= <TTTTTTTTTTTTTTT>
##$WBST= 1024
##$WBSW= 4
##$XGAIN= (0..3)
0 0 0 0 
##$XL= 0
##$YL= 0
##$YMAX_a= 116195
##$YMIN_a= -105537
##$ZGOPTNS= <>
##$ZL1= 120
##$ZL2= 120
##$ZL3= 120
##$ZL4= 120
##$ABSF1= 10
##$ABSF2= 0
##$ABSG= 5
##$ABSL= 3
##$ALPHA= 0
##$AQORDER= 0
##$ASSFAC= 0
##$ASSFACI= 0
##$ASSFACX= 0
##$ASSWID= 0
##$AUNMP= <proc_1d>
##$AZFE= 0.1
##$AZFW= 0.1
##$BCFW= 1
##$BC_mod= 2
##$BYTORDP= 1
##$COROFFS= 0
##$CY= 83.5205535888672
##$DATMOD= 1
##$DC= 2
##$DFILT= <>
##$DTYPP= 0
##$F1P= 10.8118882576601
##$F2P= -7.23987719738617
##$FCOR= 0.5
##$FTSIZE= 0
##$FT_mod= 4
##$GAMMA= 1
##$GB= 0.15
##$INTBC= 1
##$INTSCL= 1
##$ISEN= 128
##$LB= 0.25
##$LEV0= 0
##$LPBIN= 0
##$MAXI= 10000
##$MC2= 0
##$MEAN= 0
##$ME_mod= 0
##$MI= 1.114404
##$NCOEF= 0
##$NC_proc= 0
##$NLEV= 6
##$NOISF1= 3.799351
##$NOISF2= 2.8
##$NSP= 1
##$NTH_PI= 0
##$NZP= 0
##$OFFSET= 14.38212
##$PC= 1
##$PHC0= -6381.296
##$PHC1= 21.22195
##$PH_mod= 1
##$PKNL= yes
##$PPARMOD= 0
##$PSCAL= 0
##$PSIGN= 0
##$REVERSE= no
##$SF= 200.129724274929
##$SI= 16384
##$SIGF1= 3
##$SIGF2= 2
##$SINO= 400
##$SIOLD= 16384
##$SREGLST= <1H.CDCl3>
##$SSB= 0
##$STSI= 0
##$STSR= 0
##$SW_p= 3205.1282051282
##$SYMM= 0
##$S_DEV= 0
##$TDeff= 0
##$TDoff= 0
##$TI= <>
##$TILT= no
##$TM1= 0
##$TM2= 0
##$TOPLEV= 0
##$USERP1= <user>
##$USERP2= <user>
##$USERP3= <user>
##$USERP4= <user>
##$USERP5= <user>
##$WDW= 1
##$XDIM= 8192
##$YMAX_p= 0
##$YMIN_p= 0
$$ End of Bruker specific parameters
$$ ---------------------------------
##NTUPLES= NMR FID
##VAR_NAME=  TIME,          FID/REAL,        FID/IMAG
##SYMBOL=    X,             R,               I
##VAR_TYPE=  INDEPENDENT,   DEPENDENT,       DEPENDENT
##VAR_FORM=  AFFN,          ASDF,            ASDF
##VAR_DIM=   8192,          8192,            8192
##UNITS=     SECONDS,       ARBITRARY UNITS, ARBITRARY UNITS
##FACTOR=    0.0002768,     1,               1
##FIRST=     0,             0,               0
##LAST=      2.2672688,     0,               0
##MIN=       0,             -105537,         0
##MAX=       2.2672688,     116195,          0
$$ Real data points
##PAGE= N=1
##DATA TABLE= (X++(R..R)), XYDATA
0 0 0 0 0 0 0 0 0 0 0 0 0 0 0 0 0 0 0 0 0 -7 8 -8 8 -8 8 -11 16 -16 16 -23 24 -27 32 -35 40 -47 51 -57 63 -71 80
41 80 -89 98 -109 121 -133 146 -162 179 -198 218 -240 265 -292 321 -356 394 -440 491 -549 621
61 621 -710 819 -958 1145 -1412 1819 -2533 4146 -15772 25787 42206 -48102 -105537 -87835
75 -87835 -27982 5283 248 -42998 -75455 -45525 31815 56414 -626 -51092 -14395 52512
87 52512 60297 12845 -20376 -14809 11745 35149 32433 -10335 -48451 -22711 42404 55664 -379
100 -379 -41313 -12482 38550 50599 25098 -3608 -16093 -272 34499 42275 -3138 -50579 -38476
113 -38476 7131 11735 -31015 -60309 -46300 -19322 -6725 -8482 -20636 -32362 -19302 18182
125 18182 36376 12442 -11099 6906 39960 42676 22749 12488 14209 13309 13380 16478 7357 -11800
139 -11800 -14270 3309 8968 -8241 -18273 -5811 5488 -514 -6583 -1869 390 -4014 -121 9291
153 9291 4238 -11366 -13640 -3124 -2115 -11921 -13570 -8970 -13012 -18625 -6964 10506 8477 -6408
167 -6408 -7440 6914 18218 20044 18554 11812 2437 6610 24401 28404 5344 -16611 -10517 6498
181 6498 5485 -10960 -21121 -18480 -10832 -2753 -1066 -11519 -21842 -11245 11835 15307 -5167
194 -5167 -16631 -352 20560 21044 5902 -7157 -8680 2259 16215 14977 -6737 -23480 -10092
207 -10092 16623 19938 -2834 -18841 -9400 9465 17002 8609 -6351 -13073 -1089 19246 19764
220 19764 -4953 -23872 -11809 11461 12372 -9656 -25229 -19120 -1529 9474 4390 -12634 -21551
233 -21551 -7239 16057 18340 -2642 -15403 -992 20895 23138 7585 -5027 -3193 8641 17387
246 17387 11110 -7404 -18021 -5230 14153 12302 -9202 -21777 -11025 5938 9314 -1531 -13324
259 -13324 -14548 -1998 13146 13083 -3213 -14237 -4189 12450 12367 -2499 -11675 -5963 5015 8782
273 8782 3465 -5971 -9558 -1084 10241 8269 -6193 -12956 -1499 12330 11526 -79 -6590 -2965
287 -2965 5275 9393 5130 -5916 -11584 -4182 7253 7031 -5006 -11352 -5267 3493 4008 -1759 -6248
302 -6248 -5748 325 7068 7948 871 -4114 1808 10065 8692 -634 -5119 -1435 3302 3757 231 -4266
318 -4266 -6639 -3703 1419 995 -6272 -10083 -4705 2770 2921 -1431 -2936 -84 3548 4854 3999 34
334 34 -2540 510 5990 5852 165 -2958 671 4707 3689 -365 -2831 -2239 326 3313 3676 -487
350 -487 -3382 -91 4464 3247 -3027 -6177 -4215 -928 -1108 -3344 -5806 -6318 -3977 -178 -170 -4723 -7054
367 -7054 -2237 4119 4774 1454 558 3987 7835 9086 6946 2770 510 3443 7477 6158 -520 -4087
383 -4087 -712 3375 2246 -3482 -7445 -6639 -2914 140 -880 -5331 -7374 -2857 2918 2245 -3965 -7695
399 -7695 -4517 458 1501 -1588 -4452 -3820 534 4957 4176 -604 -2756 2259 8684 9196 5012 2519
415 2519 5559 10167 11290 7602 1890 -734 1041 4294 1906 -5056 -9175 -6791 -2607 -3475 -8941
430 -8941 -12297 -10955 -6738 -3455 -4257 -7108 -7139 -1952 4121 4090 -443 -2705 439 5046 5805 2720 208
447 208 609 3763 6513 6015 1940 48 2357 6151 6500 3566 2162 3990 6222 6103 3969 576
463 576 -1351 -1255 -670 -2563 -6711 -9058 -7717 -5549 -6045 -8535 -9730 -8442 -5929 -3684 -2644 -2334 -1196
480 -1196 1938 5396 6836 6095 5320 6059 6645 6147 5271 4364 3514 2683 2342 1970 917 -590 -1260 -1353 -1153
499 -1153 -1306 -444 346 223 25 763 1152 425 -1240 -2592 -2685 -2947 -3396 -4006 -4589 -5261 -4590 -3316 -3178
518 -3178 -4150 -4135 -1849 953 2378 2847 3678 5220 6782 7595 6759 4531 3164 3209 3669 2215 -799 -2900
536 -2900 -2500 -1811 -2510 -4627 -6125 -5598 -3731 -1669 -1323 -1805 -1303 1472 4260 4300 1997 781 2068
553 2068 3565 3471 1433 -816 -1413 271 1373 -365 -3441 -4608 -2579 116 403 -1339 -1771 116
569 116 2926 3677 2212 -438 -538 1268 1996 -184 -3582 -4717 -2387 -122 -1359 -5071 -6927 -4827
585 -4827 -872 1117 -645 -2817 -1602 3620 7867 7218 3264 1310 3863 7490 7162 3342 -758 -543
601 -543 2613 3813 298 -4856 -6483 -3437 -264 -1862 -6437 -7983 -4025 1237 2417 -1712 -5648
616 -5648 -4288 1308 4541 1499 -4195 -5382 -390 4944 4565 -1265 -5139 -2583 3401 5945 1888
631 1888 -3247 -2501 3825 9229 7400 770 -2150 2126 8114 8111 1549 -4329 -3185 3107 6489 1618
647 1618 -6460 -9056 -4011 1656 714 -6494 -10634 -6716 417 3296 -1186 -6648 -5226 1370 5999
662 5999 3146 -3372 -4647 1420 7882 7162 -29 -4894 -1605 5651 7776 1429 -5735 -5828 1608 7701
678 7701 5502 -2244 -6623 -2192 5093 6612 415 -5603 -4939 1842 5858 2772 -3828 -5952 -1241
693 -1241 3607 2105 -4285 -7924 -4291 2269 3854 -1228 -6195 -4808 1786 5947 2839 -3166 -4632
708 -4632 757 6806 6759 1111 -2873 -984 4186 5651 1583 -3720 -4318 -333 3035 1424 -3085 -5023
724 -5023 -2252 1784 2001 -1369 -4098 -2421 1914 4178 2497 -724 -1290 1211 3620 2881 -412 -2483
740 -2483 -1842 159 777 -840 -2213 -2127 -920 -310 -1347 -2215 -1504 365 1610 912 -116 234 2133
757 2133 3156 2087 624 -754 -423 324 457 37 -775 -1195 -1498 -1453 -887 48 397 -479 -1472 -962 1287
776 1287 3179 3481 1319 -579 8 1329 2653 1011 -1710 -2890 -1544 232 1 -2059 -3639 -2928
792 -2928 -911 -403 -1440 -2428 -1359 1405 3321 2125 -89 -257 2360 4456 3061 -490 -2214 -452
808 -452 2936 3432 -220 -3580 -3154 559 2781 275 -2974 -4130 -873 3027 3119 -883 -2710 -790
824 -790 2874 3443 -153 -3565 -3626 366 3336 1078 -3406 -4526 -1855 1900 2128 -1534 -4051 -2375
840 -2375 1821 4060 1986 -934 -1125 2209 4678 3459 -403 -1978 411 3577 3217 -287 -3720 -2328
856 -2328 1081 2289 -709 -4675 -5208 -1424 1779 1257 -1930 -3821 -2041 1551 2736 518 -2144 -2020
872 -2020 851 2680 1966 -316 -1337 190 1821 1660 -242 -1671 -734 1107 1724 451 -988 -382
888 -382 1390 2428 1443 -403 -908 261 1902 1711 462 -957 -730 403 786 -406 -1784 -2296 -1392
905 -1392 -786 -658 -1021 -1489 -822 -204 118 21 -285 114 652 1243 1625 1461 1446 1270 1314 971 640 216 -503
926 -503 -661 -793 -777 -473 -592 -859 -936 -759 -429 -201 -376 -354 124 635 892 700 417 221 336 333 -67 -497
948 -497 -1027 -1029 -520 -349 -512 -643 -551 -166 235 302 389 476 1035 1585 1443 1476 1121 909 462 -123 -396 -737 -930
971 -930 -1346 -1572 -1810 -1354 -943 -975 -1188 -1311 -453 259 486 407 557 1348 2155 2208 1429 229 239 1036 1352
992 1352 433 -1001 -1597 -654 813 759 -750 -2085 -1428 457 1565 953 -924 -1142 631 2294 1938
1009 1938 -295 -1842 -1076 391 818 -1230 -3219 -2957 -709 864 -248 -2323 -2745 -573 1967 2301
1025 2301 -91 -1406 120 3201 4263 2269 -474 -720 1467 3070 1763 -1337 -2639 -863 1745
1040 1745 1670 -1153 -3245 -2155 903 2197 139 -2479 -2548 896 2969 1957 -909 -3433 -1690 1079
1056 1079 1413 -785 -3395 -2477 -180 1768 360 -1644 -2474 -196 2324 1326 -131 -1167 495 2700
1072 2700 3782 1412 -499 65 1809 2752 1037 -2021 -2516 -579 1555 850 -1704 -2558 -1728 1003
1088 1003 1318 113 -1976 -1826 -145 1517 1138 -715 -1355 -390 583 194 -1061 -2069 -1370 -222 488
1105 488 -375 -1347 -784 435 630 504 -201 63 993 2126 2492 786 916 1336 1180 1016 -108 -438 -667
1124 -667 -368 -20 -695 -784 -564 -795 226 -40 -956 -298 -79 20 326 -331 725 -99 261 -652 -372 -623
1144 -623 119 -644 -975 -1296 -999 547 712 49 -778 -357 818 1917 1091 417 -41 1045 1654 1868 281
1163 281 -1454 -603 483 813 -772 -1725 -1541 -12 750 -312 -1399 -1783 -16 1608 1067 -714 -1183
1180 -1183 -291 1754 2286 62 -1386 -1618 944 1506 270 -2280 -2743 -865 1094 1380 -936 -2276
1196 -2276 -778 1304 2175 1412 -853 -976 1500 3046 2016 -387 -2022 237 1661 1412 -1022 -2505
1212 -2505 -1786 980 1067 -42 -2224 -2923 -182 2064 1023 -821 -2264 -369 2080 2479 622 -1551
1228 -1551 -1073 1194 2096 568 -2071 -2885 -629 1398 1165 -1117 -2516 -1319 1351 2203 461 -1385
1244 -1385 -852 1180 2840 2088 -46 -865 245 1870 1558 -31 -1947 -1607 42 1248 -703 -2103
1260 -2103 -2127 -796 869 382 -1755 -1806 -428 1519 1763 1064 -642 -427 1644 1943 955 -527 -1404 -288
1278 -288 860 90 -356 -2060 -829 -200 469 -317 -1027 -1123 533 1350 731 113 107 745 1054 858 260 -723
1298 -723 -102 -364 -199 -780 -1244 -1286 -813 -61 -575 -717 -1262 -426 394 990 541 274 640 1013 1533 968
1318 968 655 202 854 995 284 -568 -1230 -1026 -726 54 -704 -1085 -1048 -49 -312 -486 -486 123 158 405 817
1339 817 491 -9 53 218 220 280 139 -857 -517 -664 -478 -390 -499 -419 -385 -48 29 421 817 780 988 737 856
1362 856 737 521 778 544 334 -148 -584 -740 -788 -1041 -1151 -1525 -1601 -1252 -647 -242 -138 -158 -137 302 942
1383 942 1322 1161 592 704 741 909 840 329 -151 -403 -238 -351 -383 -720 -535 -539 -209 -183 14 216 674 806
1405 806 697 360 286 355 688 554 -85 -878 -870 -452 -571 -742 -1397 -1427 -1157 -123 11 -78 -160 362 1070 1257
1427 1257 1267 678 735 1190 1595 718 394 127 -785 7 70 -901 -1784 -906 -520 326 -477 -326 -702 -92 1098
1448 1098 450 -286 410 335 866 468 1154 -268 148 92 -128 -62 -1364 -711 -1197 -308 259 -172 -846 -830
1468 -830 598 1692 1276 621 184 661 970 905 730 -759 -723 -439 -113 -246 -1254 -521 -1462 -591 -726
1487 -726 -746 -983 -318 -323 749 393 -315 318 555 1114 1000 633 -327 553 872 229 -194 -792 -639 -105 -18
1508 -18 -178 -543 -735 -221 192 409 -2 -87 335 535 798 154 -298 50 99 383 352 -657 -906 196 -14
1529 -14 -92 -895 -716 -198 -60 418 2 -116 -268 299 67 417 -411 -107 274 1000 920 118 132 -131 477
1550 477 -355 -322 -561 -682 -619 251 -720 -1052 -404 -47 -4 592 -221 21 -95 296 1187 293 -62 211 170
1571 170 944 282 -310 -310 245 544 402 -249 -676 -169 -287 -149 -97 -1177 -363 206 558 560 -56 -463 -79
1592 -79 491 539 -425 -399 -168 363 -128 -538 -731 -609 -279 -457 247 26 -122 345 674 417 750 -113 315
1613 315 564 80 418 -112 -200 -165 653 -295 -390 -1033 -722 -461 -741 -370 -808 -702 -468 324 198 -135 58
1634 58 785 684 803 190 95 87 414 319 -32 -242 119 -135 -131 -666 -770 -559 -50 251 208 -48 271 65 867
1657 867 595 495 663 340 35 -85 -82 -255 -201 -325 -308 -1298 -239 -237 -177 1 -184 -74 467 355 977 1162
1679 1162 116 693 885 535 -372 -35 163 -104 44 -913 -128 -1007 10 -80 -252 -255 -480 -123 -58 567
1699 567 160 -132 141 460 513 235 -346 -334 -17 355 75 -461 -800 -207 104 182 -148 -460 -153 433 800
1720 800 526 -57 101 434 903 482 27 -230 -50 84 68 -289 -919 -784 -413 -43 -255 -677 -493 112
1740 112 397 328 45 -4 239 644 573 147 -152 -84 405 210 82 -532 -577 -144 163 208 -295 -396 -173 412
1762 412 607 191 -122 -48 139 412 316 37 -356 -298 4 -140 -440 -616 -511 -192 -8 -154 -321 -158 362
1783 362 576 426 257 206 467 711 546 287 -37 -47 219 -55 -3 -343 -399 -721 -161 -574 -447 -318 -442
1804 -442 207 -113 281 222 280 177 17 -20 75 -12 72 -163 -224 -324 -89 -126 -122 -207 -9 352 159 380 323 330 527
1829 527 706 381 147 -1 294 255 351 -133 -563 -276 18 -254 -610 -786 -601 -145 -18 -64 -230 -253 75
1850 75 421 455 -52 -33 -14 377 463 33 -234 -250 45 125 -18 -624 -720 -190 194 360 -1 -150 -99 622 611
1873 611 378 124 -149 165 452 344 -259 -394 -198 -78 -166 -496 -798 -687 -210 175 -139 -620 -355 241
1893 241 597 592 111 -53 288 620 584 260 -53 -143 77 411 72 -423 -673 -283 87 103 -274 -391 -114 152
1915 152 433 254 24 -70 179 415 374 -14 -168 -99 -51 45 -357 -479 -459 -154 -73 -312 -397 -197 115 149 269
1938 269 234 215 403 270 428 250 110 167 -78 -38 -40 -260 -275 -388 -371 -468 -403 -174 -352 -139 -52 284 144 300
1962 300 684 178 421 623 520 629 278 18 -180 -44 130 -275 -293 -216 -399 -744 312 -315 -134 282
1982 282 261 646 289 72 654 362 350 -39 254 45 -314 -205 -159 -435 -371 -145 -233 -269 -649 -238 -125 260
2004 260 244 295 -95 291 419 711 322 118 -26 352 446 188 -392 -528 -535 -43 -100 -567 -760 -456 -115 10
2026 10 -70 -266 -350 405 845 362 242 -28 454 483 417 7 -254 -306 -32 178 -164 -646 -408 -137 60 185
2048 185 -140 -252 205 671 575 228 145 78 519 488 196 -233 -443 -371 -42 -169 -534 -833 -592 -275 -22 -231
2070 -231 -207 -206 153 418 318 339 166 310 748 543 218 -19 -167 68 4 -99 -626 -592 -169 -103 22 -408
2092 -408 -359 -7 354 426 191 103 233 591 669 414 -44 -153 -10 18 29 -466 -594 -359 -256 -196 -273 -394 -200
2115 -200 -49 427 265 111 274 521 545 708 272 125 214 91 79 -43 -444 -371 -378 -223 -278 -365 -469 -161 123
2138 123 -4 46 134 337 374 636 318 270 101 186 128 -47 -92 -314 -441 -95 -246 -328 -405 -314 -355 -128 0 50
2162 50 253 270 344 262 293 194 316 95 -126 30 -35 -97 -298 -68 -414 -297 -251 -244 -245 94 98 205 287 257 368 428
2188 428 406 363 288 69 -110 47 18 -216 -570 -270 -120 -215 -89 -323 -358 -312 -88 119 56 110 27 165 472
2211 472 311 182 36 67 101 130 -215 -140 -278 -35 -124 -133 -288 -224 -82 166 240 9 -62 112 247 346 333 -123
2235 -123 -127 3 277 -44 -456 -432 -307 -156 -128 -532 -508 -362 78 74 -10 -70 111 219 396 182 125 195 59 338
2259 338 229 45 -42 -35 20 -42 -191 -378 -443 -128 56 -128 -176 -105 152 195 300 228 -52 -79 347 270 -10 -55
2283 -55 -192 -66 34 -63 -307 -253 -308 16 23 31 -100 82 25 333 278 83 58 134 252 160 -120 -69 34 -66 -44
2308 -44 -128 -231 -223 -244 -66 -103 -69 -127 -174 283 164 123 76 279 -16 250 309 138 147 25 32 -107 -93 -14 -145 -52
2334 -52 -43 -150 29 -59 38 91 72 311 279 165 305 210 -200 330 327 307 146 127 -146 -289 -436 67 -228 345
2358 345 -47 14 -5 16 224 66 -144 512 300 235 689 488 -339 -164 -140 108 272 -196 -288 -119 -604 -501
2380 -501 20 243 -171 -133 -435 187 324 81 56 27 245 -56 65 47 25 -320 -232 -369 -234 -14 -30 29 93
2403 93 -3 -34 -3 213 144 -129 242 92 -20 -70 -341 21 89 -389 -157 -324 -299 57 -324 -208 -337 -104 -11
2426 -11 -36 210 -26 107 246 395 554 139 124 185 200 462 -197 43 74 59 -344 -319 23 20 10 -243 -130 -16
2450 -16 215 10 213 186 -52 -82 -13 161 -47 -295 -205 -250 24 -216 -155 -148 -31 -10 -15 -27 -117 -7 150 196 133
2475 133 20 -66 17 242 225 19 -28 -61 118 -110 -92 -227 -179 -194 -181 -10 -109 -121 -130 299 -17 73 -23 113 -50
2500 -50 389 -26 -214 103 8 -60 185 -620 -396 48 -312 -166 -205 -119 -101 -31 -5 183 117 285 130 181 27
2523 27 -64 103 32 98 -161 -57 -69 -113 -177 -198 19 56 81 80 -13 115 129 150 120 52 250 23 86 173 105 79 -243
2550 -243 -2 26 -148 -105 -256 -77 73 -72 2 -27 -190 146 139 93 7 -194 88 256 96 -53 -180 5 76
2573 76 72 0 -199 -187 -107 132 35 -200 2 23 295 218 -133 -79 112 334 126 143 -183 -101 189 211 -125 -79 -125
2598 -125 -228 -74 -203 -263 -275 -251 -125 105 63 -122 -15 -43 292 176 320 21 58 196 238 137 -246 -129
2620 -129 28 212 156 -229 -157 -77 234 246 -89 -298 -84 29 295 117 -156 -26 -66 107 127 -329 -220 -160
2642 -160 239 -77 -17 -346 -325 395 627 -362 -60 -25 66 183 44 -19 95 188 17 78 88 135 195 24 -32 -98
2666 -98 286 -280 -341 71 -22 29 -181 70 178 30 337 -11 342 115 139 -359 -230 -233 -79 355 -256 201
2688 201 -371 73 -196 -63 -126 89 20 500 122 -126 -180 155 659 -215 360 200 52 111 145 0 14 -128
2710 -128 268 -84 74 -217 8 -227 384 -187 112 -60 -408 117 -476 227 84 418 152 493 559 -162
2730 -162 -289 321 399 352 2 -97 -89 40 356 169 54 21 169 172 -152 101 8 622 -160 273 66 -62 76
2753 76 201 -203 -4 312 -238 -264 204 77 157 -350 52 347 -315 -105 280 -199 93 246 34 15 22 -165
2775 -165 -309 -5 -486 -214 7 -242 -393 -200 -308 -23 202 32 -139 -154 156 138 -16 21 54 -106 117
2796 117 -36 -6 106 -112 69 -20 -43 -63 -58 -172 123 -44 -63 -95 -9 23 44 -16 159 -13 133 -40 56 124 -89
2821 -89 62 12 -101 48 -84 -165 83 45 -25 20 -91 89 -79 34 156 199 -68 35 -19 -98 -45 -3 -86 -94 83
2846 83 -120 -32 -97 -7 -73 -133 66 12 -19 44 -2 -9 131 85 148 203 153 18 -63 173 148 -108 99 113 34 136 -20
2873 -20 -63 -3 8 -225 -3 -38 -138 20 -38 35 -34 -178 125 -20 26 -52 11 -22 77 264 20 25 92 30 125 65
2899 65 -16 -52 33 220 4 -19 153 19 32 58 83 -37 -41 17 -59 -2 24 -35 -41 -18 -153 138 18 -82 -43 -26 -106
2926 -106 -14 -52 -201 -100 -242 46 -38 -197 -80 -129 -131 -143 -55 -161 -63 218 -13 47 64 30 93 42 41 70 82 31
2952 31 -25 -103 -76 1 88 52 143 69 103 -65 42 77 75 -149 74 24 81 54 -50 -63 -35 183 58 26 59 -4 71
2979 71 -18 4 -37 24 48 -30 67 -131 114 -54 133 46 17 -64 130 -85 -54 -50 -137 -130 38 -38 222 158 271 -56
3005 -56 -435 65 192 623 -65 396 344 -211 142 259 -85 -90 5 106 -244 26 -75 148 -246 -243 -177 -98 30
3028 30 9 293 105 58 415 -17 134 -117 -123 -264 -220 121 172 505 532 -64 -303 -96 38 -157 -129 283 512
3051 512 283 -293 121 -295 -29 -465 -421 339 -503 -146 -496 396 329 -41 -15 223 -404 -151 396 -598 -332
3072 -332 -14 -262 -176 22 -364 -148 -252 -62 532 -178 -58 -72 -33 -141 -423 -499 -296 -32 -1 -433 -61 -66
3094 -66 274 -227 261 -76 -135 543 -375 -225 -47 -23 -20 -83 -183 101 181 -39 -255 195 117 -109 134 81 -287
3117 -287 -274 319 460 -41 319 390 -110 -155 153 406 -39 171 -150 47 -126 -109 -504 204 238 126 -170 421
3139 421 369 319 -139 276 196 312 205 -396 -249 80 53 -191 -192 41 -151 -191 193 222 279 -377 -157 46 -179
3162 -179 -201 236 133 -188 33 1 329 -253 417 10 -139 -602 -137 -124 -376 161 453 -357 -210 289 55
3183 55 72 320 372 447 -101 -309 60 386 -907 -285 263 -612 41 -124 38 -190 -51 -142 847 -406 -26
3204 -26 -319 -264 -328 -72 165 59 -51 -217 81 154 -226 -14 -356 178 110 -502 167 -99 -38 -195 173 546
3226 546 -21 -152 42 -48 -84 121 -194 -143 -73 -37 63 -28 -60 -70 -55 157 -55 99 -36 -14 137 8 -111
3249 -111 -75 -79 46 -63 -79 56 38 70 118 -29 3 -56 -157 25 -62 23 -130 60 -40 -123 35 -189 -19 284
3273 284 128 107 25 -84 -7 17 61 -159 -24 24 97 57 -1 118 -16 133 -207 68 -199 -66 -39 54 -190 37
3297 37 -29 -40 -18 -84 86 2 29 -65 -66 -177 -89 -243 -25 -128 33 119 -31 -73 117 51 313 201 -72 52 -49
3322 -49 47 128 -36 -14 -63 -135 -15 -70 -67 -16 102 -55 39 -80 119 8 41 -16 27 40 41 -21 -58 176 58 139 -132
3349 -132 -149 -42 -147 15 -14 -174 33 -117 -345 31 -156 40 -418 -21 92 -261 -582 -412 -26 -68 43
3370 43 516 204 189 -472 -579 -262 52 -175 -23 -761 -563 251 -62 -58 -137 314 244 560 2 311 -25 601
3392 601 -461 97 -220 342 -338 55 -438 -603 268 -341 2 564 115 -74 52 285 351 400 171 596
3412 596 173 -10 190 -178 17 -162 40 -512 91 37 -283 -1 -51 -12 53 -126 189 103 39 -87 -49 225
3434 225 398 -152 186 -72 -246 -94 -118 -272 197 18 -170 313 247 126 -287 -249 -208 46 180 186 449 -151
3456 -151 230 -28 406 -175 -23 -180 339 -83 -291 60 32 -82 -249 168 -202 -256 -88 417 216 123 -5
3477 -5 82 21 -46 -179 64 -67 -50 -147 172 -51 -81 -260 47 -115 -6 -48 134 32 45 -29 289 331 -213 186
3501 186 52 332 69 152 -83 53 -119 -169 -197 -259 -39 163 -35 78 107 1 64 78 17 157 182 192 225 -81
3525 -81 -167 137 164 43 81 -44 88 145 -8 70 -27 4 71 -199 -63 -130 2 81 27 -343 52 -96 14 21 446
3550 446 399 -399 -145 -346 -372 1 -152 -36 -297 -34 424 128 115 -73 20 47 55 -497 564 -300 326 109
3572 109 -143 -201 -281 305 -157 -89 340 -16 213 230 211 0 -138 381 -180 396 -190 11 -362 -297 825 186
3594 186 -126 186 -7 -148 235 48 13 21 241 -111 61 199 33 8 308 82 -144 3 110 -138 14
3615 14 4 -8 -25 -87 -17 145 56 53 6 2 -149 23 10 4 91 -38 -8 -13 -13 -57 16 -17 12 44 21 -198 79 -71 244
3644 244 -94 25 -31 48 52 156 148 -5 -25 -32 -60 -85 78 -73 -11 86 134 3 117 25 110 -64 57 -73 11 53
3670 53 -66 115 -144 39 -101 -11 -91 192 44 -18 -29 -94 -127 -2 -114 -86 52 -100 57 15 -196 -25 77
3693 77 0 -102 -87 5 -30 45 85 65 96 -65 -47 -26 7 -15 -24 91 -69 83 96 -34 -234 156 -85 98 -69
3718 -69 -100 -18 -3 -27 -155 49 -36 -10 84 -8 116 -5 -120 35 -36 -14 88 68 -19 -101 -97 66 -112 -92 -26 -58
3744 -58 -18 -180 119 -7 -6 113 10 68 39 71 -87 46 -2 -134 -3 -2 -74 204 -72 85 -78 -15 189 115
3768 115 1 -9 229 6 -27 -91 -7 -103 -14 -59 -147 -79 -8 -44 -131 -6 19 121 143 175 29 8 11 -54 -46 97 -12
3795 -12 -265 43 76 -83 -139 5 -100 -77 -19 -67 27 189 -66 52 16 40 -45 -74 -53 -14 128 -145 -98 60 -89
3820 -89 -80 -112 -79 48 93 92 127 200 -58 -211 -35 -50 -96 79 -173 34 0 163 -142 -117 -3 -194 -43 -5 -101
3845 -101 -138 113 -5 -68 152 10 15 72 -67 13 -11 29 -34 131 -125 149 43 -22 -42 -175 48 -132 -323 -153
3869 -153 -24 153 196 32 -228 -119 13 -43 106 -32 -52 -175 -28 65 -164 -8 -56 -191 -128 -172 113 169 3
3892 3 -204 -168 -11 -148 277 195 -89 -110 -69 -20 5 -148 -48 -19 65 0 25 -31 -152 -78 -101 8 32 -146 49
3917 49 129 82 -28 -215 253 69 236 35 -175 108 -439 37 -190 145 -99 -139 175 -388 220 59 -74
3938 -74 -64 142 -271 125 131 53 -28 66 18 14 124 -13 -115 -209 70 -73 -270 -116 54 41 140 -101 -119 -63 -99
3963 -99 44 31 51 286 274 92 97 105 -141 60 288 44 -220 698 -259 44 -309 -259 263 -5 -515 -465 -375 566
3987 566 -4 323 113 193 -431 -10 478 -590 -407 132 -287 -45 -407 -154 -159 -353 705 200 74 163 59
4008 59 213 -159 -310 -339 192 -127 385 388 225 74 273 36 247 -262 252 786 170 711 -362 -193 -73
4029 -73 230 -389 -86 192 -424 340 72 104 138 656 403 -341 47 135 -73 -248 46 -423 190 -108 -47 150
4051 150 -127 141 575 190 -138 298 395 43 -177 -127 1 93 -45 -5 204 69 -220 -137 -291 307 135 56
4073 56 -120 -39 -52 47 -101 94 29 -123 -79 -74 -21 -1 288 -99 -99 -1 -67 38 -126 3 -43 -97 47 10 -81 -37
4099 -37 -23 57 72 250 129 74 39 66 132 17 -93 -84 -113 -10 -63 21 -35 -169 17 129 -83 -73 98 213 -35
4124 -35 -66 -92 -115 50 -55 11 -145 36 13 -122 161 -54 -165 -144 -107 57 34 -166 -5 2 173 149 19 26 89
4149 89 100 -19 33 -79 25 38 -54 -130 -67 -191 -79 -29 -279 -35 -40 286 8 -149 -240 46 -46 -78 60 84 104
4174 104 -98 -16 -51 59 25 -47 4 -102 -38 -75 7 52 -44 -61 -140 189 3 -81 93 40 52 -56 -60 -115 -89 47
4200 47 -107 -227 72 139 -323 -255 -627 -209 -110 171 53 -132 222 -392 29 -90 51 403 1 45 -19 629
4222 629 87 -16 154 -70 -119 -36 -475 -388 90 -149 48 13 124 191 -144 257 -215 258 -70 -27 20 18 21 8
4246 8 -101 -82 -14 121 -29 71 114 -22 -149 37 -145 -57 -37 17 74 27 38 70 -39 -2 -55 -30 162 -63 -72 -38
4272 -38 -191 -99 70 -69 78 108 51 17 160 -101 143 16 -7 -23 -102 22 -74 27 -43 22 -140 -355 58 -125
4296 -125 -43 -36 -73 99 51 62 45 140 57 119 -114 191 -47 -18 36 -154 -19 -114 71 -74 123 -65 -55 135 -206
4321 -206 261 -59 17 15 174 -46 28 -10 -21 -48 176 -90 -75 -11 -95 -206 -109 -248 -104 19 38 -15 -67 -154 103
4346 103 -86 237 -74 -124 -62 181 139 185 -5 -70 -188 -107 135 -170 -1 -62 -38 39 -32 125 -110 140 -120
4369 -120 135 -185 -97 161 -125 181 -151 -460 -4 143 -69 -68 -38 327 37 -14 135 121 34 150 -26 192
4391 192 -308 89 164 -219 34 270 210 -148 77 58 278 291 -284 261 -80 -167 112 -41 -412 -378 -14 -260
4413 -260 44 -250 205 -328 -144 -184 298 -262 -66 -52 -131 -355 -57 -52 -173 11 178 1 -241 -7 -41 -104
4435 -104 20 467 -332 106 36 88 -5 41 -57 -222 -70 -60 -498 264 -20 -60 -111 -242 267 84 45 244 40
4458 40 -66 76 104 266 233 -48 -408 -126 -223 -101 -41 -134 -159 -275 -344 -20 -2 83 26 -311 9 46 -48 -174
4482 -174 -61 -282 -145 -164 488 347 -196 55 -120 224 2 226 237 305 35 -129 342 407 -30 469 201
4503 201 -216 405 -269 6 4 -219 72 50 237 74 -715 -600 160 -360 -257 -53 -26 -275 -41 -357 24
4524 24 236 -105 -399 302 83 -42 -510 -445 193 152 371 -103 -1 -198 -277 -42 101 -41 -459 -411 561 -117
4546 -117 -665 189 -246 631 179 -641 -53 324 -151 191 -85 -197 -340 -255 -178 -100 -332 83 -23 -42 -17 -260
4568 -260 -127 -123 85 18 -56 61 183 -23 -154 34 -309 -252 -52 -268 -445 136 86 185 -22 -305 359 -209
4590 -209 83 450 133 -296 -647 -227 103 -92 -162 -1 103 273 120 -27 126 95 78 -173 249 -86 -46
4611 -46 119 -128 -65 -63 -48 -26 -19 295 -148 29 6 -164 -22 14 -50 1 -152 -294 32 -15 98 -65 -73 -82 -5 132
4637 132 95 224 208 -53 6 -61 42 -51 -90 3 69 8 -27 65 -8 -159 -62 69 19 -15 -232 40 9 6 14 107 -73
4664 -73 112 -128 42 9 -82 -66 -189 54 2 14 -135 -140 -271 -126 224 87 -74 88 31 54 -28 29 172 184
4688 184 73 -146 -32 70 6 -181 -148 -85 44 59 14 -134 22 120 35 -83 -22 -79 11 -46 319 3 10 167
4712 167 193 -286 23 -25 -319 -46 78 -333 -177 -102 -269 117 109 -504 -237 74 16 -348 115 -52 -20 -31 263
4735 263 18 -123 -225 -11 -119 119 -304 24 122 42 19 257 -16 -101 7 36 212 140 9 -358 17 -63
4757 -63 302 -39 245 59 304 157 151 -10 149 67 -65 -115 81 219 180 -111 10 172 -79 44 -75 35
4779 35 106 -8 -70 12 -9 -121 33 126 -47 -178 -17 95 138 15 143 96 -112 161 156 -89 120 -107 -269
4802 -269 22 194 -44 -45 131 212 -331 -109 -127 -54 -163 125 5 377 -239 172 71 -302 1 357 311 -258
4824 -258 -85 41 -79 -42 77 51 7 -284 -137 -495 -111 -399 -244 -332 262 -53 164 -215 -68 117 254
4845 254 -101 291 261 27 -143 38 40 -216 -4 -101 -30 63 321 26 36 -225 -177 189 140 69 -87 51 116 -366
4869 -366 376 -142 279 235 -232 56 273 -408 -18 -6 1 183 -299 202 421 -52 139 -163 -404 -381 -88 108
4891 108 448 13 -211 256 -202 199 -68 -222 -84 19 292 52 68 35 -100 169 -480 -291 38 64 -339
4912 -339 -91 -269 263 358 -48 -120 -33 -176 56 -329 231 106 -377 30 355 -436 399 262 3 -415 11
4933 11 -13 -147 505 88 24 224 120 -239 -54 -61 258 127 -67 183 -161 -503 160 -68 -500 0 -65 -4
4955 -4 -160 -70 -164 -50 226 0 -211 95 -94 -30 148 -151 139 105 -208 149 -341 -358 96 547 -100 490
4977 490 197 -161 -30 133 -31 335 -138 -240 -114 -628 -329 87 491 -181 -160 -554 -451 261 -335 -94
4997 -94 45 175 -8 -116 431 -129 -363 -92 290 -48 373 -32 -98 412 -23 -652 29 -299 -315 106 -47
5018 -47 -57 -136 -109 -7 -11 -82 -84 -256 -129 341 -482 296 -394 227 -388 -140 352 42 269 -164 168 -374 -303
5041 -303 255 -119 -229 -293 -96 -57 -413 -228 -246 2 -43 18 23 -79 180 -35 108 -7 569 -280 -19 -374
5063 -374 -246 -47 223 -85 -726 -32 -73 -382 35 2 72 93 183 63 -258 50 -141 97 -12 -59 24 163
5085 163 -39 241 -14 225 103 -34 210 164 89 -139 -121 166 138 -349 -53 23 -256 11 61 -140 -210 61
5107 61 -81 65 -24 -43 206 -20 -24 -93 78 -169 0 -29 119 -76 -78 15 134 170 97 -48 18 48 26 -37 -72 139
5133 139 -67 39 -65 -15 -35 6 -115 43 4 -174 74 -31 -42 7 -63 117 -95 -46 -41 58 -86 -19 -114 70
5157 70 202 -99 -8 -6 -30 -42 -93 -165 -41 -79 -112 6 89 -118 63 1 11 124 141 149 -25 189 -112 112 17 -36
5183 -36 101 4 -135 61 21 -58 -18 41 34 -248 -141 20 -26 116 -15 138 25 -33 90 -111 39 11 -107 41
5207 41 21 -8 87 -125 -138 125 -84 -35 -127 -50 179 -39 69 -110 141 20 213 169 59 -84 79 -20 -129
5230 -129 103 88 -50 -252 -96 78 -10 -39 43 56 28 8 47 -7 -18 -14 160 117 43 32 -166 -34 -11 91 -157
5255 -157 109 30 -63 153 241 -89 16 294 71 -167 -320 143 -85 10 -357 -85 -6 54 140 33 108 -199 67
5278 67 -1 -20 -88 146 -125 -25 -32 103 82 63 -15 81 -60 167 33 164 194 144 71 -100 -5 68 24 -57 -170 42
5304 42 29 -5 -29 145 -33 70 55 -115 168 -68 -15 81 36 -9 90 32 -48 -61 113 -50 -14 -93 68 -24 97
5329 97 78 -39 -112 112 103 154 -115 94 30 29 182 -4 -47 47 -50 -86 -156 -170 29 16 -138 -13 102 135 20 -19
5355 -19 1 169 132 47 -57 -110 37 18 -59 71 -16 83 -9 -21 -131 -23 -32 -30 123 43 63 -46 -12 -194 68 -173
5381 -173 58 7 45 -29 -29 35 167 -29 -3 54 -9 -99 113 18 -92 -31 -117 -98 94 61 113 -24 169 12 80 138
5407 138 -44 59 8 87 -153 93 68 163 -25 -49 -315 -101 419 70 127 241 217 65 -74 -15 -375 -38 -6
5430 -6 217 58 76 -103 92 36 -110 -137 -45 -49 -123 112 18 32 16 131 224 17 75 -118 52 18 -230 33 -44
5455 -44 132 -70 -8 -37 -44 22 30 -99 -69 -5 -58 60 102 -18 194 124 -28 7 115 -159 77 -65 -25 -72 -35 67
5481 67 105 -4 -157 -47 118 -10 91 192 21 -12 6 -27 36 36 11 -25 77 127 6 -191 -127 -12 111 -124
5505 -124 -114 60 1 -110 -13 -15 -6 27 156 119 121 54 101 91 21 9 -88 194 30 -56 77 -5 -155 123 86 -66 13
5532 13 9 43 92 -9 -105 -96 -66 -62 16 -12 -55 -57 -34 -119 51 81 -16 -48 134 79 -61 111 -20 -74 184 17 154 16
5560 16 67 200 16 -80 -56 2 -45 162 -58 -44 -114 79 -1 -18 -47 86 28 106 129 -67 43 -76 34 -1 -39
5585 -39 17 -90 -25 5 -16 -64 -113 -32 68 109 124 -225 9 7 153 -84 47 -50 105 74 28 126 -97 177 -50
5610 -50 174 65 5 154 -33 20 -100 -20 71 -24 -30 -130 -143 -32 63 -33 69 -176 37 -107 -54 -19 38 103 -132
5635 -132 -115 -61 -126 -63 -195 -10 -230 -199 98 77 71 144 90 119 66 78 -7 24 16 55 126 -208 -20 -197 -75 192
5661 192 -122 -19 38 -231 -98 103 32 -34 99 -66 -83 88 -50 -142 1 -119 33 43 33 1 -92 137 56
5684 56 48 24 -49 40 236 72 -97 38 124 -114 180 1 39 24 -30 54 27 -93 -4 -145 -26 62 44 -48 -208
5709 -208 -132 12 -31 -77 31 -39 -43 140 -14 197 106 43 127 -112 109 -85 -141 15 24 -107 -40 108 -42 -39 51
5734 51 0 34 8 107 125 184 -59 225 16 91 59 -94 -196 27 -6 21 100 -164 27 -51 24 80 -5 8 -33 -83
5760 -83 20 166 208 136 -72 -28 53 -58 -33 -69 -128 60 76 -29 -158 19 17 149 -33 -66 -123 -41 -52 -91 52
5785 52 -59 -49 107 -73 -183 3 -211 112 -123 -58 14 165 -47 -70 -70 85 17 96 -2 -156 101 75 138 120
5809 120 -126 -155 -180 -85 -30 -74 91 -99 -88 49 38 -108 -19 39 -29 216 -13 -11 5 23 -25 -41 57 -107 0 -150
5835 -150 55 155 -39 -47 -12 -18 116 99 -38 150 -2 51 -21 -60 8 32 0 55 -6 -76 -15 -34 -64 -137 -114 -112 3
5862 3 17 22 -10 37 -206 -70 21 32 -28 -25 108 -33 103 70 131 -80 122 -64 98 -16 12 -98 10 126 129 29
5888 29 -73 -34 77 16 -147 -269 181 116 -112 -286 288 -44 55 -148 139 319 -413 225 118 274 -171 -427
5910 -427 156 -62 -168 165 232 -319 145 65 -27 -286 213 96 -315 -184 -111 89 -196 -164 -97 -339 -84 -12
5932 -12 8 174 -152 -122 -146 301 95 -128 329 -42 -41 -21 263 145 74 309 325 467 204 -1 219 230 -340
5955 -340 -478 -129 -137 178 118 -197 -535 -10 -324 176 125 -148 -16 295 -18 -211 76 -215 -45 298 294 -123
5977 -123 111 -80 -294 -251 -213 -107 446 -126 -141 -131 -101 190 -184 -44 74 -202 106 -39 -70 124 -91 -86 116
6000 116 -87 -47 -5 76 98 104 96 -15 57 -56 -27 -44 -39 81 149 68 148 -43 -55 138 91 90 24 -10 -45 -10 65 103 49
6029 49 -24 -134 5 -31 63 -8 129 16 99 4 -90 2 -48 73 19 92 52 45 -64 3 114 42 -7 32 14 -35 82
6056 82 -11 -92 19 -66 39 -123 -42 -38 -45 -22 -45 79 -8 -23 30 -16 174 27 -94 -73 14 28 -120 -24 -145 114
6082 114 -162 19 -1 3 -57 269 -124 23 61 -167 -22 120 -27 -15 101 30 106 90 35 -116 -2 -6 -83 30
6106 30 7 70 47 15 -32 -49 -8 146 94 118 43 94 -53 -69 96 -142 56 -99 241 31 71 20 -50 -12 -106 145
6132 145 -114 46 74 -77 92 92 -40 -210 -8 -77 -21 -74 1 192 102 -40 -117 -132 -103 -117 62 -76 141 257
6156 257 72 160 31 100 92 81 42 46 -179 -49 -21 33 195 37 9 -182 -120 -184 72 -56 -39 -3 60 136 -146 13
6182 13 8 -103 -37 0 65 -138 10 119 50 -54 -109 169 -118 31 104 -38 -113 -67 -28 -78 -58 -19 27 -143 -121 -40
6208 -40 46 -168 -101 -159 -86 100 74 -67 44 -7 -69 -60 -118 -34 23 -209 29 -15 8 25 -113 33 75 -198 98 138
6234 138 45 -38 -39 -11 55 0 151 -112 -91 -4 -9 -28 6 156 -52 -33 156 229 -368 111 159 -57 -76 37 -79 -45
6260 -45 6 -128 -142 -203 -197 88 -122 -162 99 -18 -131 82 -81 -55 -8 -145 -65 147 108 -234 54 -50 127 -129
6284 -129 109 -23 40 -84 -73 -68 107 -36 157 115 -47 -190 -46 178 73 179 146 -10 -71 -120 -69 -74 -105 35
6308 35 49 -88 -39 104 48 7 144 80 228 -101 -128 -40 -101 23 33 203 -61 61 43 -55 69 52 150 -144 0
6333 0 -139 153 -32 -153 -74 180 206 -4 118 -78 32 -41 -11 54 138 124 -48 139 102 149 -109 -25 -31 -4 -22
6358 -22 -22 -26 -109 -103 8 65 -59 90 86 -21 -96 15 3 -64 -30 -267 7 -25 9 -58 -134 -138 -63 -49 161 34 -13 8
6386 8 5 -105 40 238 154 -51 26 -7 6 53 -85 22 -139 64 3 -9 7 -23 99 67 67 -39 96 81 38 -54
6412 -54 39 216 -199 34 -10 -10 -58 83 -20 -57 -119 -73 11 -110 -103 87 156 142 59 274 -25 56 47 -15 60 -85 262
6439 262 -74 -16 142 86 3 -125 -35 -257 16 -35 63 45 126 114 -21 28 -22 89 -46 91 301 159 -256 -91
6463 -91 -66 -137 -152 -67 -262 34 -21 -120 -48 -232 -20 68 -93 114 -8 48 150 74 43 -142 -295 -44 126 -129
6487 -129 172 -67 216 -63 -70 -201 193 32 187 235 274 -33 70 41 -80 121 141 -278 75 -145 -168 -171 -376
6510 -376 -194 23 -23 148 -50 -91 -155 -265 -73 -116 -44 -154 -288 -56 171 113 122 -84 -198 -15 -341 1 316
6533 316 -15 152 -43 -7 -127 200 199 -40 -346 312 217 331 49 165 -255 26 28 -17 -276 -53 172 26
6555 26 -244 -5 -165 242 -174 207 -274 18 7 226 -109 -210 41 244 245 162 -137 69 -109 -58 -38 -74 -100
6578 -100 -56 34 -139 -248 105 75 -92 -5 -8 341 -46 5 105 -119 37 5 10 46 -93 -47 -3 -16 -89 -6 182
6603 182 -108 13 44 -54 -140 45 -22 -114 116 164 -243 46 76 -156 -91 -68 -108 -110 -38 45 95 -184 -8 -47 38 176
6629 176 104 201 181 -89 84 10 93 -11 102 -21 -50 -97 117 215 -191 -353 160 219 593 -478 8 290 -331
6652 -331 -371 -254 -92 193 124 -371 10 169 -72 -291 -183 -162 -72 183 27 44 -36 -44 286 216 45 141 150 105
6676 105 143 -23 -110 60 -98 184 174 -164 93 15 125 12 125 -14 9 -43 -232 -84 -69 -144 55 -123 71
6699 71 55 -65 122 23 139 131 17 -31 27 89 -24 50 -81 -26 -45 19 45 96 55 -18 -115 -6 -74 -101 30 -47 -3
6726 -3 201 -227 12 -52 81 -64 -6 -129 8 123 44 103 -26 -88 37 87 -78 66 -73 111 93 78 -35
6749 -35 111 -100 86 -8 94 -125 -166 119 66 13 62 25 16 97 104 -99 25 -110 95 -149 104 -112 42 19
6773 19 29 -231 -86 -154 114 219 -129 -215 185 259 174 278 -146 -20 226 413 -210 -172 208 -253 -449 -255
6795 -255 -10 -306 -237 -94 82 298 44 -164 25 -326 129 46 171 -35 159 96 100 -141 -142 159 -692 -242
6817 -242 56 -87 370 -28 -133 -85 352 366 341 -19 249 -231 226 62 180 -163 -73 -166 -58 -131 196 200 -238
6840 -238 341 37 -243 -139 -159 206 -144 288 94 1 -37 109 -333 -211 197 -80 17 96 -63 -88 167 8
6862 8 95 15 -62 16 -44 45 -14 47 75 76 -51 -160 -131 6 196 114 168 32 33 48 3 100 132 -65 181 -77 -115 -107
6890 -107 -3 20 39 -113 -170 -83 -173 -119 43 99 18 71 3 143 48 -118 80 53 -56 177 13 198 -161 -45
6914 -45 1 -62 103 -106 7 -11 -55 -2 -74 94 -66 -229 71 135 -114 -183 -60 95 97 -38 123 -59 -63 217
6938 217 -75 -41 -14 -104 -138 58 27 15 54 95 29 76 -17 228 64 -9 0 22 112 -134 -135 0 1 -227 -63 0 7 52
6966 52 -189 -52 -82 52 102 122 65 -25 -44 88 70 122 168 -139 28 -38 -23 4 -74 -10 49 -46 165 36 -130 235
6992 235 127 164 256 73 158 -95 -35 -116 10 25 260 1 -48 28 55 -114 -63 8 -173 -87 53 -7 28 -77 -44
7017 -44 16 -36 -37 -85 34 102 41 -90 -151 -14 -189 -3 -64 -197 11 10 95 17 146 179 60 11 122 -42 67
7042 67 -93 -105 -21 64 -6 -16 129 115 74 -134 89 87 72 -1 -43 -22 6 14 49 -38 48 -97 19 -25 -172 56 134
7069 134 52 -163 -134 -77 -222 -107 -6 -23 189 98 27 290 -132 -299 149 139 -184 -65 -177 45 389 -437
7091 -437 -294 -129 111 82 -48 485 -448 167 314 -75 277 189 -55 362 -452 -315 602 190 452 215 150
7112 150 -178 45 -220 -570 152 -496 -322 389 538 -127 -518 -183 95 304 406 594 419 43 -371 361
7132 361 -185 670 243 -409 118 -325 -33 -519 618 622 634 -1066 -1723 -159 244 -55 -221 256 101 296
7152 296 -7 455 501 -236 -176 340 456 -214 140 -188 -676 -527 -280 -109 -75 474 337 313 -121 771 190
7173 190 117 -367 573 -52 205 -296 -400 -30 246 57 -126 58 17 135 74 180 -125 -167 -114 -278 -166 81
7195 81 560 -59 47 198 80 177 -232 86 -17 -439 -561 -189 -145 65 196 500 410 83 292 449 227
7216 227 430 82 338 557 -687 287 268 679 -437 -198 -778 142 366 -410 -116 10 -63 -1140 -212 -108
7236 -108 -152 -250 397 187 -278 -49 -215 -327 452 -367 -226 3 29 158 307 -423 -127 -181 404 248 -171
7257 -171 -249 36 559 78 -228 -470 116 -291 185 225 462 -139 80 -186 108 -321 -98 -125 -250 -128 -56
7278 -56 267 -85 -46 385 16 -222 -188 100 -78 96 352 -168 228 -134 -54 178 263 -82 41 178 -130 220
7300 220 -84 -248 79 -45 306 243 -36 -156 62 -114 -3 212 74 25 -44 80 -89 -84 -141 -38 -75 18 204
7323 204 -30 -20 240 25 72 -136 -10 30 133 -4 -6 -33 -17 76 -115 -7 -82 41 24 -139 -67 4 57 -8 62
7348 62 229 -3 26 111 62 -56 85 -10 -3 -62 67 -106 -99 -5 -166 -71 41 81 -34 -75 8 -162 -1 -74 -9 -48
7374 -48 26 -95 -96 -95 110 -84 -97 -60 -57 150 110 32 -116 -112 82 -27 195 -143 -203 -29 -406 -109 103 78 -32
7399 -32 -110 89 -35 -105 34 -201 -37 142 116 -129 -16 -141 -200 139 77 75 117 82 12 -209 -22 19 75 71 74 118
7425 118 -132 15 -122 -168 -62 122 -5 3 -17 135 -172 -90 -6 -191 122 -21 2 85 93 42 -116 -143 -58 282
7449 282 -98 -153 -42 -31 -32 -36 37 62 38 15 -95 13 -27 109 116 71 -31 -42 -70 -137 26 -120 -45 -94 -50 -91 45
7476 45 117 75 64 -20 7 30 104 85 -110 65 -27 46 109 22 -110 -86 -21 -254 -19 -19 -23 -112 162 -87 -120 -107 -204 -1
7504 -1 -157 44 173 -706 -131 -414 172 -168 -440 18 -368 163 -102 130 44 210 75 27 -30 127 -57 45
7526 45 -25 250 -270 -401 121 66 -584 43 -118 -31 -191 -317 159 -255 76 83 -79 374 198 -70 -8 163
7548 163 -418 -327 -47 -45 -235 -105 159 23 292 258 396 -22 -82 -113 498 285 269 50 -392 -692 -403 318
7570 318 200 -114 -467 410 -742 233 270 281 -148 35 126 -570 -205 223 -220 321 5 -294 155 278 334
7591 334 226 -33 357 -92 -184 612 817 -761 48 248 584 409 -180 28 151 75 58 -385 -242 82 26
7612 26 14 308 -86 -556 -22 -404 -36 -410 -249 -901 356 -114 -532 -230 -286 324 -249 -374 -203 -165 278
7633 278 -41 -399 -236 -607 -273 108 -477 355 163 3 144 -571 -896 -113 11 193 272 170 -941 -597
7653 -597 84 649 -429 -484 698 -820 -124 89 -315 563 -727 -314 -123 -276 -202 264 86 -333 335
7672 335 676 230 70 -1 46 5 510 650 -702 482 -959 -101 -168 -199 -527 -680 -214 -531 -76 788 168
7693 168 -361 -6 371 -355 -274 247 -400 -17 -785 1 -107 133 22 -65 -562 -781 -840 10 425 -394 996
7714 996 580 320 1029 -802 508 -409 -551 -91 608 806 -378 523 510 239 -373 303 -36 494 206
7733 206 189 -480 445 -140 300 -122 -27 -217 135 279 -316 -95 -185 -267 -441 486 -210 -282 1003 507 207
7754 207 -56 60 -576 -891 513 -14 0 294 93 -1114 69 298 850 -261 171 153 -212 511 252
7773 252 -113 -367 14 -320 616 34 -341 515 -11 -248 154 -161 134 -316 716 221 523 -14 16 -135
7793 -135 -282 -1 101 -46 47 742 -142 218 206 -586 -638 -373 109 21 146 140 447 -115 -333 -29 -100 -63 418
7816 418 -184 -4 224 -327 62 -381 302 -37 -146 272 -115 211 17 72 155 36 -239 29 -62 -50 -75 67
7838 67 -160 -168 -57 -92 -100 -110 161 -65 -251 -234 -198 -216 -186 -90 46 -81 -315 -375 13 -111 -8 -203 -318 283
7862 283 63 413 -65 -459 -80 -100 -59 -23 -304 -85 124 -104 -249 226 -117 -382 151 -74 -224 7 -252
7883 -252 231 -214 144 -26 -15 -279 -106 -436 116 370 -326 465 294 -436 -115 -8 -322 156 34 171
7903 171 183 -187 -35 87 -234 306 455 -136 159 -20 -1 246 51 -257 329 -157 -62 -125 -288 -445 125
7924 125 25 -184 -36 51 -292 312 23 -126 -79 -582 42 -96 -208 256 -436 -375 -203 44 602 36 -429
7945 -429 428 -568 -165 70 9 -373 170 94 175 256 80 -183 203 115 -127 -44 92 76 365 -94 -129 375 278
7968 278 -316 -197 -622 212 -75 -206 257 -88 -66 157 99 41 -240 -11 324 -290 -14 -181 -24 -86 -9 92
7990 92 177 -300 -408 321 49 177 55 345 -714 -165 -10 -353 -404 15 176 -596 131 37 163 -23 24
8011 24 -101 -338 161 -12 -190 -76 -295 -342 -436 181 -411 -60 -439 -184 74 -70 116 -74 -186 -91 439
8032 439 400 -549 151 -577 -317 -222 105 -302 307 66 186 20 9 4 149 45 38 -142 -30 -61 -197 -606 -358
8055 -358 237 600 -430 120 -42 -185 -135 36 -95 237 241 108 1 102 26 -73 74 -32 -64 -227 143 -22
8077 -22 -33 32 -138 46 22 -287 41 83 104 -48 -22 -65 -197 134 50 -67 -203 -199 -5 57 -107 -195 1 93 110
8102 110 -110 -81 -30 -309 -315 -25 241 27 -357 -107 -92 -100 -75 -243 432 -57 396 -143 -403 292 -294 -22 73
8125 73 -70 -375 -252 66 81 204 -496 336 96 -43 83 183 40 -44 -108 152 343 39 -309 -284 -1 -137
8147 -137 2 -130 152 102 8 48 62 86 155 15 -83 -61 -209 157 84 11 -135 -12 112 -77 69 -171 106
8170 106 -194 0 29 -153 51 68 58 -45 210 190 -120 81 -87 -123 -127 -86 -34 28 -114 15 -18
8191a8
$$ Imaginary data points
##PAGE= N=2
##DATA TABLE= (X++(I..I)), XYDATA
0 0 0 0 0 0 0 0 0 0 0 0 0 0 0 0 0 8 -8 8 -8 8 -16 16 -16 24 -24 32 -32 40 -48 50 -58 66 -78 88 -97 110 -122
37 -122 138 -154 172 -191 212 -236 263 -288 320 -352 388 -428 472 -519 573 -631 697 -769 853
56 853 -946 1053 -1181 1330 -1511 1732 -2010 2379 -2887 3632 -4846 7148 -13119 64916 116195
71 116195 -6808 -46009 -11851 48006 42135 1374 -54351 -71622 -37905 21352 15343 -52945
83 -52945 -91509 -36139 30578 24824 -30207 -46093 -14187 23259 34354 17292 -22473 -42598
95 -42598 -8428 43654 33713 -31437 -61086 -14702 37174 32751 -5307 -24966 -13988 16751 48104
108 48104 48021 8473 -17996 13512 61455 53918 1006 -25816 -5410 16428 8720 -14232 -34715
121 -34715 -44244 -32344 -7108 -4943 -35920 -55055 -28918 6859 6690 -13838 -14370 3066 14148
134 14148 18573 22321 16882 3819 4991 21198 22319 1697 -8670 4322 13954 3561 -6298
147 -6298 -2020 2200 -1189 1363 9687 6860 -3906 -885 13269 14817 2229 -2913 -266 -5533
161 -5533 -13646 -8200 676 -8471 -26327 -25558 -8506 189 -4236 -9183 -11365 -10687 558 19667 23803
176 23803 5585 -5358 11159 31700 26597 5786 -3167 2628 8738 8782 2299 -10095 -17958 -8105
190 -8105 7846 2609 -20712 -27904 -6936 12716 7151 -9694 -14792 -4876 10007 18906 11289 -9294
204 -9294 -18276 -867 21478 15368 -11209 -21915 -4658 14473 13523 -1341 -13698 -12152 4048
217 4048 20275 15158 -6769 -15351 5192 27710 20432 -5472 -17018 -4644 11161 12235 -1766
230 -1766 -18567 -21294 -4893 11489 4421 -19403 -27623 -8172 11906 7635 -9396 -14804 -2817
243 -2817 12957 18264 8970 -5809 -8365 7984 23034 14308 -8243 -14632 1797 16952 12245
256 12245 -4468 -15002 -11090 1728 10371 3927 -12299 -16783 -1451 14502 9886 -6973 -12277
269 -12277 -2001 8611 7599 -1458 -8632 -6943 3098 10741 4486 -9802 -12989 -30 10659
282 10659 4601 -8278 -10192 -895 8851 10244 3761 -4787 -5964 3158 11944 7468 -5969 -9270
296 -9270 76 8010 4577 -3943 -7955 -5636 -829 2270 -579 -7386 -8686 -229 8223 5865 -2594
311 -2594 -3863 3011 8187 6435 1829 -1290 -557 3485 7223 4735 -3227 -6545 -1435 3216 -495
326 -495 -7098 -8169 -3468 311 547 -1128 -3491 -3936 -170 4167 2681 -3359 -4423 1405 5949 3647
342 3647 -663 -1530 223 2304 3241 1727 -1977 -2877 1804 6802 5466 333 -922 3157 5970 3801
358 3801 -190 -2515 -2198 30 1974 -418 -5682 -7832 -4314 -766 -3640 -8911 -9397 -4715 -265 483
374 483 -1185 -2374 -905 3858 7715 5755 306 -521 5495 9999 7295 1905 -237 2172 5384 5044
390 5044 979 -4111 -4855 -121 4422 2017 -4219 -5689 -1052 2783 943 -4461 -7410 -5757 -2176
405 -2176 -16 -2794 -7810 -8532 -3299 1122 -1334 -6349 -7153 -1697 4360 5670 3448 1992 4234 9597
421 9597 12934 10427 4503 2900 7240 10782 7833 1367 -1385 120 2028 850 -4025 -8886 -9441
436 -9441 -5667 -2136 -4201 -8807 -8971 -4213 99 -913 -4302 -6409 -4505 -754 1429 -149 -3335
451 -3335 -3529 -238 3184 1932 -1571 -2129 1287 4759 5393 4543 4259 5780 8489 9929 8257 4728
467 4728 3300 4659 5560 3057 -914 -2956 -3009 -2787 -4384 -7035 -9547 -10287 -8939 -6753 -6136 -6610 -5701
484 -5701 -2798 -281 718 808 1255 2221 2845 3455 4241 4011 3358 3184 3231 2381 1547 1075 723 149 148 1167
504 1167 2588 2757 2316 2634 3369 3581 2605 1620 427 -317 -344 -610 -1842 -4105 -5308 -5122 -4748 -5812
522 -5812 -7142 -6851 -4941 -2784 -1012 -173 265 1595 4108 6068 5458 3848 3471 4827 5975 4666
538 4666 2171 475 75 215 -637 -3081 -5398 -5388 -3431 -1352 -1788 -3109 -2515 501 2776 2456 1032
555 1032 277 1203 3626 4239 2503 -48 -634 1224 2294 35 -2891 -3994 -2160 326 547 -819
571 -819 -1240 431 3349 4254 2299 -165 233 3032 4244 1687 -1843 -3224 -1314 757 -878 -5327
587 -5327 -8563 -7398 -3268 -847 -2823 -5796 -4764 99 4572 4289 1009 -273 2600 6756 7958
602 7958 4626 1207 1983 5601 7070 3049 -2519 -3790 -197 2852 936 -4246 -6501 -3473 2064
617 2064 3135 -1601 -6663 -5840 -8 3834 895 -4995 -6624 -1993 3338 2630 -3194 -7589 -5351 899
633 899 3656 -236 -5515 -4988 2065 7836 6047 43 -2860 1721 8572 10081 4139 -1815 -826 5985
649 5985 9778 5474 -2751 -5793 -1459 3796 2715 -4052 -8713 -5712 940 3055 -2259 -8259 -7231
664 -7231 -54 4442 1204 -5429 -6499 -200 6774 6430 -1050 -6490 -3694 4187 7614 2283 -5514
679 -5514 -6257 991 7325 5966 -1400 -5586 -2240 4698 6597 1572 -3848 -3172 3125 6903 3591 -2935
695 -2935 -4702 11 4539 2775 -3681 -7443 -3878 2284 3800 -1535 -7237 -6356 -37 4149 1797
710 1797 -4272 -5399 -232 5328 5879 1190 -2691 -1061 3776 5603 2166 -2662 -2810 876 3736 2008
726 2008 -2463 -4577 -2235 1379 1801 -1372 -3965 -2799 1270 3732 2588 -304 -1056 957 3022 2731
742 2731 298 -874 -211 1072 816 -705 -1890 -1452 -567 -802 -2151 -3233 -2026 68 1172 435 -311
759 -311 -244 956 2189 1957 1191 208 -143 -7 408 510 597 53 -1471 -2673 -2205 -468 499 -18 -1709
778 -1709 -1960 243 2801 3599 1970 1 -74 1938 3224 2302 52 -1387 -144 1044 538 -1923 -3539
795 -3539 -2620 -958 -566 -2401 -3782 -2682 913 2782 1368 -1869 -2095 1538 4349 3131 -575 -2484
811 -2484 -180 3125 3877 788 -3270 -3172 452 2857 1264 -2585 -3616 -201 4338 3463 -215 -2858
827 -2858 -1382 3056 3956 881 -3123 -3202 872 3497 1622 -2480 -4779 -2495 951 1258 -1895 -4428
843 -4428 -3076 887 3095 1018 -1943 -1946 1374 4327 3162 -368 -1746 964 4657 4569 949 -2480
859 -2480 -1652 1686 3372 770 -3305 -4081 -1297 1807 1547 -1574 -3579 -2380 490 1693 -235 -2225
875 -2225 -2094 307 1952 1141 -1138 -1480 -196 1320 747 -1047 -2110 -1141 908 1585 250 -1229 -1079
892 -1079 791 1984 1341 -177 -942 618 2064 2618 1249 236 158 924 1010 327 -945 -1424 -1133 -563
910 -563 -599 -1092 -1608 -1392 -1024 -738 -662 -696 -408 190 723 844 1283 1183 1138 926 838 968 654 221 -127 -152
932 -152 -29 22 -340 -732 -1140 -786 -597 -428 -525 -288 37 707 1054 816 304 234 376 510 272 -428 -800
953 -800 -648 -575 -344 -872 -1113 -1029 -963 -532 -268 43 602 922 1122 1441 1407 1498 1448 1142 491 164 135 135 -413
976 -413 -1193 -1219 -1220 -1025 -1472 -2008 -2063 -1305 -411 59 -313 -554 560 1737 2135 977 -159 -144 1056 1673
996 1673 1173 -580 -1475 -384 1046 1171 -648 -2122 -1486 637 1810 1182 -607 -827 1088 2697 2546
1013 2546 40 -1437 -702 1167 1592 -513 -2874 -2812 -688 943 -506 -3109 -3871 -1856 1085 1272
1029 1272 -876 -2352 -753 2228 3669 1676 -893 -1071 1677 3377 2242 -917 -2038 -122 2361
1044 2361 2564 -731 -2890 -1918 1021 2633 988 -1233 -2736 372 2841 2595 -126 -2178 -1258 1282
1060 1282 1624 -680 -3032 -2412 -361 767 -353 -2925 -2683 -1107 826 609 -1107 -1968 31 2415
1076 2415 3050 771 -753 -569 1979 3282 1433 -943 -1908 -3 1957 1919 -280 -1920 -1435 513
1092 513 880 163 -1267 -281 508 1707 925 -880 -623 -239 406 566 -1088 -1856 -1676 -363 -181 -1077
1110 -1077 -1554 -1386 -298 483 -268 -445 -583 511 1491 1125 709 296 944 932 1219 691 673 7 166 -65
1130 -65 -535 -558 -518 -561 170 -852 -407 310 313 378 220 116 996 1117 -103 -478 -1141 -307 35 -109 -1294
1151 -1294 -2302 -1345 -165 764 -236 -1728 -1428 -265 1157 803 -440 -372 369 1473 2291 740 -177
1168 -177 -427 1124 1239 72 -1410 -532 128 1447 154 -1858 -2271 343 1691 1831 -523 -2167 -207
1185 -207 2246 2376 652 -1344 -1548 -102 1607 713 -1971 -3312 -1045 1161 1327 -797 -2548 -1885
1201 -1885 1141 2095 701 -785 -1339 1338 3344 2343 -143 -1571 197 2118 2275 -441 -2111 -1760
1217 -1760 669 1772 419 -2040 -2086 -359 1520 1079 -1392 -2335 -717 2009 2389 551 -1870 -1073
1233 -1073 1035 2322 792 -1694 -2587 -630 1376 962 -1423 -2774 -1637 644 1793 247 -1507
1248 -1507 -1153 935 2590 1880 -29 -579 447 2182 1947 52 -1424 -817 1323 1109 51 -1438
1264 -1438 -1980 -703 111 -437 -1653 -1759 -680 1002 1271 441 -1230 -420 1581 1670 529 -263 -1162 533
1282 533 669 453 184 -1421 -887 127 -161 -346 -719 -1012 375 1165 778 117 337 -25 1392 848 408
1301 408 11 -79 553 326 -128 -746 -1079 -832 -382 -436 -1417 -1527 -913 -73 194 -50 -408 139 604 999 1364
1322 1364 502 220 1002 1065 944 297 -683 -459 -233 -175 -632 -973 -700 -813 -95 -115 56 -334 -86 288 323
1343 323 633 338 263 477 561 175 -11 -267 -388 -417 -651 -874 -642 -1026 -664 -421 -355 -61 215 516 739
1364 739 989 923 810 873 1009 1272 971 580 22 -222 -265 -223 -725 -1232 -1438 -1569 -1133 -581 -718 -611 -750
1385 -750 -347 289 869 769 471 474 520 904 866 486 173 29 -144 -196 -516 -893 -310 -215 -144 -408 -305 -28
1407 -28 587 887 818 597 354 830 1018 1165 496 -135 -541 -419 -359 -759 -1503 -1711 -1335 -561 -387 -744 -897
1428 -897 -501 396 965 692 724 295 627 1568 1471 938 356 322 1028 859 -118 -1281 -1106 -621 -176 281 -700
1449 -700 -87 -155 656 -188 603 117 -159 198 1294 23 252 54 -362 301 -228 -639 -1483 -1064 226
1468 226 500 -463 -1140 -1096 101 1410 1309 633 544 264 1132 1108 1291 1359 363 -1 962 -158 -852 -1551
1488 -1551 -328 -574 -730 -825 -1612 -861 -103 -57 -491 -702 -492 260 1356 562 -339 -381 294 894 859 102
1508 102 -547 -375 15 261 -58 -525 -438 -238 250 210 -66 -549 77 585 357 241 163 93 171 501 37 -683
1530 -683 -518 -106 108 -975 -692 -282 -632 -270 360 -174 -751 -110 365 887 775 289 -158 729 983 761
1550 761 -31 -351 135 999 369 87 -496 -332 -96 207 56 -936 -491 212 -364 -330 -130 -94 -395 352 579
1571 579 582 -73 50 453 655 320 -577 -77 753 186 87 -215 -581 -496 658 94 -208 -1056 -224 -150 25
1592 25 307 -482 -536 141 1062 377 186 -410 153 -152 450 -431 -580 -646 -514 -408 -370 -869 -377 -437 505 686
1614 686 380 305 619 672 836 870 281 61 -2 357 196 -128 -393 -451 -555 -598 -370 -334 -596 -388 -72 33
1636 33 197 186 100 391 78 216 347 -205 276 28 -329 -342 19 -289 -281 -79 -149 -217 -411 47 213 197 179
1659 179 492 637 665 588 606 208 130 236 -172 -86 -45 -292 -766 -678 -619 -644 163 -394 -716 -508 149 -239 215
1682 215 907 562 660 1088 476 329 501 405 376 -13 282 -793 -688 -372 -353 -365 -674 -740 -142 342 311 85
1704 85 -368 -36 592 709 194 -287 -455 -62 118 -69 -657 -664 -444 -35 81 -197 -673 -283 379 543 604
1725 604 -53 65 608 1005 775 128 67 211 295 314 -296 -752 -743 -281 -179 -280 -916 -577 -110 250 116 -15
1747 -15 -442 159 643 779 143 -529 -99 285 414 146 -444 -665 -471 84 18 -351 -412 -123 507 396 223
1768 223 188 37 448 482 580 149 -177 -120 24 14 -369 -555 -538 -309 -240 -142 -627 -216 67 246 281 112 127
1791 127 473 591 640 299 236 80 298 149 150 -437 -646 49 144 -566 -736 -295 -73 49 -94 173 277 352
1813 352 2 236 -96 204 195 -85 -283 -303 -270 -173 -168 -553 -633 -294 -15 -46 170 44 155 343 461 662 287
1836 287 264 403 518 528 207 -255 -40 -146 -99 -519 -605 -539 -231 -1 -121 -382 -520 -162 561 523 48 -219
1858 -219 -114 431 571 102 -394 -309 -26 287 -68 -599 -685 -278 34 160 -128 -274 -62 416 640 354 -76
1879 -76 136 508 695 393 -122 -149 -138 171 63 -492 -877 -668 -263 -31 -161 -668 -427 -167 515 351 -75
1900 -75 -164 264 465 645 169 -17 -28 138 371 190 -333 -575 -211 18 -3 -411 -393 -318 166 315 256 107
1922 107 33 246 578 380 54 -5 23 239 2 -163 -444 -433 -319 -342 -193 -401 -333 -203 181 -22 -107 190
1944 190 232 465 317 355 454 305 388 164 209 -38 -235 -237 -334 -362 -397 -272 -413 -360 -204 7 -169 138 216 42
1968 42 520 299 392 31 -246 -336 45 466 392 -737 -316 -440 -418 -87 248 -790 -823 -224 228 152 -69 -549
1990 -549 151 160 477 645 -79 271 294 112 -171 -329 -288 -251 -47 -246 -587 -592 -175 -118 110 5 -140 84 464
2013 464 785 435 316 337 566 605 352 98 -421 -24 -76 4 -558 -729 -521 -340 -156 -276 -402 -175 182
2034 182 444 363 73 42 257 441 398 191 -269 -98 10 149 -260 -607 -556 -257 -66 -73 -281 -281 2 439 599
2057 599 240 88 244 556 947 416 -51 -62 -64 20 93 -372 -735 -597 -303 -363 -359 -615 -478 -104 354 279 -64
2080 -64 45 465 683 551 334 -108 98 119 459 -20 -438 -448 -394 -30 -234 -496 -479 -352 240 277 306 153
2102 153 190 458 558 478 277 198 -78 261 101 -250 -439 -533 -440 -309 -517 -622 -374 -201 178 84 86 18 424
2125 424 573 444 258 455 177 257 215 -53 -231 -467 -270 -463 -313 -518 -521 -372 -164 7 -50 96 102 294
2147 294 560 563 196 387 227 131 344 82 -140 -239 -263 -302 -317 -398 -299 -299 -334 -123 -132 94 -54 207 208 169 335 308
2173 308 204 108 198 69 -106 -212 -238 -431 -261 -304 -323 -342 -219 39 66 140 174 33 248 471 631 398 222
2196 222 151 211 123 -29 -167 -270 -118 -185 -86 -250 -482 -245 -73 -3 19 -15 -71 53 338 194 -12 267 170
2219 170 495 398 -92 -27 -370 -269 -9 -189 -334 -137 -104 178 14 -43 72 271 408 467 269 108 56 137
2241 137 354 184 -33 -349 -87 -119 -27 -245 -653 -317 -84 30 -10 -174 -278 250 381 192 128 198 194 125 236
2264 236 160 29 122 185 -103 -87 -327 -132 -116 79 49 -138 -124 13 274 160 274 -16 -66 23 319 160 -43
2287 -43 -186 154 53 3 -150 -239 -282 -7 23 -166 -135 -185 71 86 127 200 46 108 322 215 154 16 16 -80 143
2312 143 -89 -206 -359 -59 -154 -242 -276 -207 -48 114 66 244 16 -8 77 180 102 -67 295 208 -28 119 -91
2335 -91 -195 -109 -146 -200 -138 -170 -389 -95 -102 252 -297 -38 81 406 328 -116 344 -38 83 171 176 33 -77 104
2359 104 -179 66 83 -357 -83 -96 -176 51 -152 -130 473 166 549 191 305 466 272 -116 -142 -47 -153 -151 -253
2382 -253 -282 -175 -91 27 -8 -297 -156 -129 93 -130 -301 158 -73 3 204 -219 -39 5 -50 -24 -121 -195 79
2405 79 -322 -229 -168 -8 -122 -218 218 358 62 318 588 -18 254 134 -24 68 -104 -359 -115 -418 -175 -361
2427 -361 -560 -352 -322 -157 -165 -244 -295 314 364 367 237 350 283 189 7 259 -309 -50 38 239 -246 -145 -67 116
2451 116 185 99 -114 -81 200 175 179 10 70 127 206 103 -154 -34 -10 30 -54 -213 -264 -470 -171 -154 -180 4 -135
2476 -135 70 142 62 -37 56 374 144 242 185 97 68 -26 -62 -6 -92 -56 -42 -159 -42 -172 -108 -168 27 210 -84
2501 -84 0 232 189 273 365 261 -201 -261 76 85 -13 -232 -65 -265 -155 -251 -122 -187 23 130 244 42 65 152
2525 152 14 -30 -21 67 -12 138 126 -97 39 -28 -161 -206 -153 -131 -28 -97 -219 -45 -1 -64 111 121 3 -16 268
2550 268 -16 156 105 -222 -121 -73 9 -132 -117 -139 -96 100 -40 -131 -38 124 333 -90 -198 -181 -25 179 166
2573 166 -51 -93 -107 18 173 -97 -182 -249 -93 103 4 45 -307 42 65 64 253 48 -14 232 238 396 33 64
2597 64 -25 11 150 -251 -327 -82 132 122 -289 -506 -33 5 158 95 -188 -211 -110 -67 179 -125 -73 23 173 165
2621 165 29 -41 -93 220 29 34 -24 -312 43 -19 42 -87 -24 -138 204 261 124 21 76 536 655 -10 -330
2644 -330 -340 -46 -160 -298 -303 -446 -377 156 384 -415 133 51 -141 115 20 19 217 109 526 156 227 -30 -156
2667 -156 321 22 124 -166 -392 305 50 -353 -29 -228 -84 -68 296 52 94 -19 179 10 274 284 -116
2688 -116 101 386 218 -602 -101 -153 -456 -222 125 -113 -18 419 122 -124 258 75 -63 86 -131 236 -102
2709 -102 162 205 392 2 2 314 -503 517 430 0 57 -230 23 -17 374 150 736 -367 84 -159 457
2730 457 116 276 -165 -44 -95 -219 -408 -58 72 -213 29 171 -575 -392 -227 159 321 100 -393 109
2750 109 42 403 -217 -16 -547 -264 43 474 -31 -68 79 120 260 36 81 -559 -134 -205 91 -212 -249 35
2772 35 -252 12 407 -122 258 -109 154 -67 137 98 73 137 98 -108 -74 -211 -133 215 106 82 94 45 241
2795 241 221 -53 -69 127 85 -126 4 -51 -117 -40 -111 23 -137 -109 -185 -77 -72 -114 71 12 -154 -17 48 -18 -4
2820 -4 -26 251 36 -91 41 85 -66 31 -8 -148 -157 -23 -22 -115 -119 117 181 173 34 205 156 217 25 -1 103 74 -65
2847 -65 -117 -73 -151 -74 -118 38 19 189 -153 5 73 -176 -37 160 -131 33 104 81 33 188 83 118 -37 -44 -43
2872 -43 -249 -69 160 91 -30 -2 -14 46 -103 -93 34 -40 -81 -67 55 -62 61 -21 147 56 -148 -227 -159 -83 -103
2897 -103 92 40 -49 46 153 91 5 70 -38 25 157 -8 29 176 52 174 0 61 -31 -46 60 -25 -214 -85
2921 -85 -77 -148 -26 -124 -59 -86 -29 -97 -110 -28 90 74 -14 -10 5 10 -55 -26 163 -34 -102 31 76 109 155 67 46 -3 18
2950 18 -72 165 -51 -78 -15 72 56 -23 15 15 -53 96 4 -160 85 90 -209 12 -185 9 -53 29 -57 -8 16 -69 -76
2977 -76 114 107 89 -50 -23 76 155 43 101 29 103 37 -22 36 -56 -24 128 16 -156 -66 -10 -54 113 80 -208 -101
3003 -101 -224 12 -207 -41 303 -251 289 -131 -725 80 174 263 19 -68 -170 328 49 -119 136 -14 321
3024 321 31 -18 218 -192 91 51 -144 16 3 -294 47 -267 372 156 352 520 -93 118 -173 -320 297
3045 297 -54 311 -728 -67 337 119 210 -219 132 -97 -96 -684 84 -139 -369 -325 -540 326 -382 -332 267
3066 267 -156 -165 -288 398 -650 -507 -341 -77 -173 237 162 -359 -22 42 -399 262 393 -67 -183 -557 -461 -164
3088 -164 -241 -210 383 -298 37 -258 122 -401 -327 344 -132 6 -28 289 -28 206 -494 21 -67 44 346 -585
3110 -585 355 -89 28 -229 -310 7 -64 -14 -481 -47 26 -286 -295 -291 48 -38 -109 -89 -210 -477 47 361 -258 -347
3134 -347 64 -38 -14 -62 255 -198 -117 95 -451 -382 40 -138 -310 301 68 -484 215 -455 127 276 353 155
3156 155 -257 -180 425 246 -239 -76 -296 96 -156 -193 58 305 355 -252 -149 -17 -66 438 327 -77 95
3177 95 -169 -363 83 431 393 383 -192 -247 -413 71 80 362 254 -12 -279 620 5 -73 -440 -177 -85 -221 -170
3200 -170 -225 -509 743 -87 -369 -544 262 0 -121 74 225 127 20 37 -81 -255 -429 -50 -59 -125 208 -77
3222 -77 4 -143 140 -95 -129 -182 73 4 49 -43 -29 343 -77 -58 184 166 7 -29 -162 138 4 -102 246 20
3246 20 -152 4 -68 112 -90 159 -81 0 139 124 111 -54 -12 -10 226 -5 55 -149 3 -114 228 114 -117
3269 -117 -103 2 -16 -69 -13 -54 137 -23 86 -178 -45 17 115 108 99 69 30 -96 56 -159 -47 -24 63 -1 -14 -47
3295 -47 -70 84 122 24 50 -20 6 44 -64 -16 -119 -28 -115 -41 -134 -27 45 -114 -70 -4 -74 -41 -62 -128 112 -74 132
3322 132 69 -36 24 111 102 -65 -10 112 45 -56 116 -124 -60 -184 11 37 -223 -190 118 111 72 59 48 119 -5
3347 -5 49 106 55 -43 -1 -63 139 -315 -125 -167 78 -173 262 -140 84 -371 418 -156 -151 -202 217 199 -625 123
3371 123 -406 164 -351 501 -292 673 281 -97 337 -260 -210 -202 -608 -432 -222 168 -353 -125 -479 -105 115
3392 115 476 602 146 56 49 -568 410 489 374 -477 -267 350 392 314 -313 -122 -3 434 -228 276 -182 -22
3414 -22 -21 -19 -400 -279 -347 1 -281 -612 -260 -238 -253 -326 -225 -292 -5 -17 -124 -16 -93 -316 21 140 14 -36
3438 -36 -4 -161 255 -201 -83 -175 -254 71 -108 -203 -176 -65 154 -288 -161 61 41 25 -77 321 184 -36 406
3461 406 -6 18 28 371 497 -144 -86 -236 107 -384 4 480 -80 294 115 6 88 112 -10 -49 163 -55
3483 -55 159 344 71 61 -270 37 -335 -181 313 204 -71 -163 -145 201 61 -170 138 -77 -142 -127 89 263
3505 263 83 -98 153 133 -151 -272 -55 -44 -71 -47 22 -26 99 -13 64 179 -172 -37 -94 -307 33 -4 10
3528 10 119 108 -286 89 289 -212 8 71 130 92 -50 -12 -99 -221 120 172 -182 -266 131 -276 -121 126 -264
3551 -264 -129 628 96 -109 -2 63 90 99 -254 -1 122 256 101 90 318 -695 18 33 229 -78 457 170
3573 170 -514 -205 -158 263 145 -146 -92 473 -200 95 133 -357 -263 -137 -263 -1028 -83 -33 -69 185 51 -237
3595 -237 -266 -167 273 -39 -228 78 171 -113 29 251 -122 171 107 -33 119 -26 111 57 42 -11 94 -59
3617 -59 -50 91 67 24 6 -24 -74 96 1 -86 -92 122 -153 10 63 -247 -76 15 -51 134 -63 -102 37 24 -99 -15
3643 -15 100 -120 90 -43 72 -36 -86 -125 -143 98 11 21 -91 -132 -25 164 8 97 -115 1 20 -47 -188
3666 -188 -89 38 -165 43 51 112 51 33 28 63 13 29 56 82 16 -61 -3 -140 149 88 100 31 -252 -6 61 91 -23
3693 -23 -73 86 46 73 -36 -4 -184 -109 -44 40 -36 -290 22 38 -4 -65 116 141 -228 110 51 -77 0 5 -18 -112
3719 -112 -137 -93 -16 56 -82 185 -106 -53 39 -46 63 -21 53 -191 97 -78 -40 -168 -108 -193 -1 -16 45 60 96
3744 96 -11 -91 -90 -63 73 -62 210 19 14 -3 92 111 163 35 -134 10 -131 -14 36 86 -81 -45 24 -87 -97
3769 -97 140 -107 -177 -30 72 3 -33 77 -82 -13 162 173 138 -98 -131 -28 133 166 6 -7 -80 -77 131 221 123
3794 123 -39 -146 66 -15 -33 19 139 -140 -123 158 15 -201 -192 -98 36 -117 -16 84 -38 4 59 66 -31 38
3818 38 -30 97 48 96 -46 -47 144 -127 143 -117 -74 129 3 -40 9 -42 172 -11 -69 -19 102 -173 46 87
3842 87 117 40 9 -74 29 -6 -175 -156 -105 35 -63 -181 7 71 -21 6 200 -273 388 172 8 17 -74 64 -79
3867 -79 50 98 -61 158 -180 41 -109 69 118 21 75 155 149 130 229 39 277 2 -84 -147 -176 263 0 358
3891 358 -117 -223 -61 -83 -47 -131 229 -15 -138 158 94 -87 44 -43 5 12 168 -41 -91 146 99 -46 -78 44
3915 44 -309 -175 70 -5 -83 78 -21 -61 -134 -71 -118 -33 83 345 141 99 -44 -148 146 -66 75 22 30 204
3939 204 102 241 14 -100 -129 -73 -61 -75 -31 25 -124 -88 212 92 -66 -74 16 -56 -73 -107 34 -43 9 -84 62
3964 62 -56 74 -35 141 -61 50 -118 43 -129 31 -223 -244 -85 -27 247 -202 155 289 262 24 192
3985 192 -377 -22 55 -480 -103 523 -298 -270 113 414 130 328 -265 -92 477 -702 150 243 -365 362 -279
4006 -279 52 322 374 445 114 -98 -932 -380 103 301 168 -200 58 -195 447 324 -240 521 -464 -380 399
4027 399 -220 26 -483 -479 119 -315 346 -6 45 -425 -191 -83 134 621 -189 149 -137 158 -207 59 325
4048 325 -346 -279 353 319 -204 271 23 -33 -121 -27 125 -140 68 -69 163 12 -66 168 -92 199 233 -300
4070 -300 -141 -27 -7 -107 122 38 78 -50 -87 -135 -16 -54 -103 -239 125 -64 166 69 63 63 -26 45 -140 -138 -6
4095 -6 28 145 3 -45 -102 -171 -7 134 -55 18 234 120 201 104 55 137 -14 86 203 1 -30 -73 -185 -176 -165
4120 -165 -25 0 -177 -40 -114 70 2 -64 24 -58 99 58 -57 -40 44 -126 125 41 132 -71 35 12 -135 46
4144 46 -38 -58 -69 -54 -247 49 271 200 0 0 -17 98 -18 -141 -246 83 -90 -62 -123 -61 -256 -77 -23 -88 128
4169 128 -117 -77 65 -48 18 -22 222 46 -38 -19 68 -72 -173 -198 -274 -13 7 -24 11 60 14 78 -92 -19 142
4194 142 112 54 114 153 -124 -46 109 71 95 -26 16 -35 1 307 173 -37 425 -65 -280 497 -42 -270 239
4217 239 312 301 440 -61 201 -185 37 337 644 -179 232 155 -57 159 144 -204 -207 -158 34 222 -450 14
4239 14 -215 255 26 -153 57 86 -106 -20 -39 -8 -34 -14 -242 -10 -24 27 -3 -53 -99 -68 -46 -12 13 -80 138 -128
4265 -128 56 156 152 -1 69 -25 16 -49 -168 -67 -145 -62 0 -165 -95 5 -50 89 -34 84 65 105 42 63 -92
4290 -92 -46 63 -61 118 -166 77 44 -22 37 -110 114 -59 -74 -138 55 -14 -16 196 42 158 19 4 66 94
4314 94 20 -77 -44 -126 126 227 41 120 -120 -91 -90 -66 -30 -35 -85 -33 -63 -164 58 11 0 -92 -42 -22 31 -32 -252 23
4342 23 -126 -169 34 -137 -76 -22 -88 -164 127 29 224 118 162 -62 78 230 10 -55 -69 137 330 -34 -102 -57
4366 -57 -157 -107 307 -54 -15 161 -211 88 -39 168 -235 -107 4 63 41 186 145 161 -78 0 -106 179 -69
4389 -69 -3 -55 209 225 104 -277 -40 -190 119 299 -10 485 412 198 -204 -591 69 -73 -153 -291 -43 -81
4411 -81 -297 162 -436 38 46 244 54 -181 102 279 181 62 -53 -277 -92 65 167 -403 -101 40 -472
4432 -472 -503 -220 167 -100 177 -206 218 40 307 206 95 -83 299 46 -133 268 -196 -63 129 -553
4452 -553 67 356 -225 -253 -27 78 -189 -321 40 151 161 -103 310 97 -161 22 -8 141 -58 259 266 -142
4474 -142 -97 -303 -216 -76 73 124 -409 424 5 -315 -415 158 66 -132 23 -414 357 -535 -10 457 -463
4495 -463 -117 -183 121 -33 8 -1393 220 -17 -427 -242 354 -74 116 310 68 167 -54 155 -134 193
4515 193 -262 -701 291 135 196 -466 -146 121 132 -129 112 -12 -482 66 215 354 219 -167 248 -277 -154
4536 -154 -26 280 -231 -176 -314 -347 -295 287 537 -429 -198 225 683 58 438 19 220 276 386 52 225
4557 225 -292 -53 -244 -75 585 -196 -34 223 -25 -425 251 -384 6 252 7 187 -16 -91 -425 -115
4577 -115 182 -108 -306 28 -288 113 -405 -15 611 -460 186 -502 -186 -648 125 548 -135 -35 -89 -78
4597 -78 -81 155 -293 96 208 -68 314 52 -217 -293 103 -30 106 -105 -130 23 -46 -68 129 -144 -69 40 28
4620 28 150 231 118 22 147 132 -86 -87 -72 -35 -108 49 -91 -48 -23 74 -2 -33 86 18 -24 77 37 -47 64 29
4646 29 136 -4 -62 29 -25 122 -24 1 -16 91 139 -39 46 -3 54 -66 -44 -15 148 22 98 143 91 -97 89
4671 89 -6 8 58 82 116 -55 -167 -106 -87 6 -200 51 10 -153 46 -98 49 72 124 147 58 160 160 35 8 22
4697 22 -108 10 51 54 -73 -61 -76 73 -8 12 123 -146 -265 31 55 179 -356 132 -234 -261 597 28 -335
4720 -335 -209 198 -85 -280 -231 238 -51 -353 36 54 345 -267 -117 320 221 192 432 43 4 -351 113 155
4742 155 35 -147 112 357 30 156 -139 -130 293 -23 -280 -73 -111 -60 75 -297 -380 10 213 -62 -352 226
4764 226 -46 88 241 53 -47 -75 -212 -181 48 -125 -41 169 160 39 129 -93 -21 105 173 109 101 -54 2 -7 -176
4789 -176 31 -96 -21 -12 -5 -9 -162 -47 -74 -65 132 -14 -172 246 -129 120 26 175 -128 -190 -105 -370 -224 255
4813 255 -296 125 20 -20 -232 11 -195 125 -384 -84 -66 68 191 151 74 -32 -403 -109 -179 -145 -386 -205
4835 -205 74 247 -123 192 216 283 273 -5 296 86 -84 -29 357 184 306 -208 -82 -289 175 66 273
4856 273 111 -257 -76 184 -209 -155 -13 79 131 5 -239 153 -121 -192 146 334 -273 -123 -106 -284 -164 -94
4878 -94 202 -541 182 -136 -27 -113 -437 290 323 -289 -336 -145 35 59 -19 21 331 334 -85 27 -237 -232 261 -168
4902 -168 -213 138 123 -140 187 -31 -242 61 630 334 72 297 3 -410 -330 525 -294 614 -262 -80 -99
4923 -99 382 128 -360 36 -72 134 -147 103 52 -246 -102 207 469 -231 -157 98 227 261 74 155 20 343
4945 343 310 49 55 -303 222 -96 -114 -31 79 -65 -138 17 189 -82 -122 -82 -6 39 200 78 202 138 -84 -151
4969 -151 314 -31 121 -113 283 142 605 -62 -324 179 -43 -1 131 -138 314 -421 327 194 797 898
4989 898 65 624 -498 290 6 34 120 -414 415 599 -607 49 -199 487 216 -62 92 122 -90 253
5009 253 -624 266 -695 247 -231 82 -182 -20 -177 -105 346 -172 -294 -173 -62 -137 -188 203 -175 -471 244
5030 244 205 -149 4 28 -326 9 -112 319 268 145 240 164 -252 -534 186 -99 170 -279 -38 -177 95 -420
5052 -420 48 -301 12 450 -24 266 32 -18 133 198 160 156 -204 -173 -25 -74 55 -137 144 492 256 -157
5074 -157 318 202 187 -368 60 -192 -76 0 -145 -26 -63 -111 -85 56 -116 58 -79 -154 -135 54 -300 -125
5096 -125 51 80 6 -105 -157 -33 -45 30 -107 94 267 -6 -125 42 13 128 -59 108 39 -152 129 -68
5118 -68 -74 76 131 -64 94 -25 -34 72 17 57 -83 14 -30 -59 36 85 -109 20 -34 58 69 8 138 64 184 65
5144 65 30 235 -19 148 -197 -165 -96 175 62 93 155 -77 136 -72 68 6 -43 -7 128 15 26 -19 -64 -17
5168 -17 -122 -170 -25 -25 -86 -55 -197 6 110 27 -23 -191 172 41 -110 85 -24 29 -115 70 -185 48 -48
5191 -48 -13 -43 -51 110 61 -9 -102 10 65 50 90 -70 -35 7 10 -28 82 37 68 -43 181 -41 1 -78 -215 -20 -129
5218 -129 -54 48 103 -10 32 -113 -15 -13 32 101 15 14 36 108 74 110 15 10 -106 42 0 -74 -33 -49 1 1 160 44
5246 44 114 82 -92 -9 -116 51 43 -12 71 74 82 -591 130 -215 -36 -239 144 469 -160 182 81 -84 -76 -31 47
5271 47 -171 107 -193 -197 84 14 -237 -91 -142 -186 127 -78 -88 -87 -31 -244 49 -51 -9 -29 35 -101 -143 -63 181
5296 181 -116 -29 -70 -23 68 21 -62 -48 -30 -14 23 -57 -167 5 293 60 -18 90 158 61 136 -58 124 -40 185
5321 185 -15 -85 74 -121 166 74 116 -65 89 23 -8 -46 -39 -86 77 -14 72 -58 9 73 29 181 239 95 -128
5346 -128 109 158 153 -67 -45 -94 -152 44 54 72 150 -61 -74 30 -21 -7 -195 -44 40 -105 114 142 2 18 -149
5371 -149 20 131 -63 1 -126 -183 -149 -49 152 -101 -129 28 159 36 -91 91 -117 46 54 59 22 35 55 -43
5395 -43 -31 -104 111 -77 81 -44 -11 226 1 149 -41 39 210 165 -2 -61 141 71 -32 333 305 -115 -207
5418 -207 -172 -24 44 -179 165 -149 -21 -173 -162 104 109 -43 193 25 26 358 388 259 64 -87 -66 -38 0 -154
5442 -154 -79 7 48 -76 -115 -180 64 24 28 196 213 115 107 13 -18 -22 -96 -168 -64 66 -5 -75 35 2 -22 -10 20 28 281
5471 281 -68 84 59 -17 -158 -56 -56 66 -21 93 -109 43 200 -1 19 127 235 3 86 79 31 -171 114
5494 114 60 -54 37 209 -88 12 67 -57 -273 133 -91 2 19 -60 -38 -88 -58 103 165 -21 -48 27 -140 88
5518 88 163 -93 -14 -49 134 -14 -13 49 -254 91 -33 46 -10 -104 6 -120 8 8 137 -15 -24 -56 48 17 17 127
5544 127 7 10 -140 -136 -14 73 -80 -174 60 -96 39 -112 -137 10 -22 -88 25 -46 -13 29 31 85 17 86 117 -108
5570 -108 -50 39 149 194 -41 -40 10 -213 -8 -66 95 -22 -126 -6 48 11 110 -73 32 74 -43 6 88 70 54
5595 54 95 58 -13 -57 -55 32 115 -77 -57 -47 11 36 140 161 0 157 25 188 181 -46 67 24 -116 24 -170 113
5621 113 70 -21 -21 14 69 41 102 75 8 36 -9 142 -72 33 54 -27 33 -103 -37 -6 134 -213 85 -12 -49 -21 84
5648 84 -22 -9 -179 -24 -56 29 189 -33 30 -17 -3 61 -30 52 -99 -93 -145 -143 -120 42 61 24 11 60 -47 -7 247
5675 247 216 3 92 27 105 -1 105 -70 -65 104 -175 42 30 -116 11 -52 -137 -109 109 -41 97 -206 152
5698 152 -118 55 -85 -133 85 -33 37 -31 -69 -137 -262 -88 11 162 -82 -12 6 -17 48 26 -74 18 72 -77
5722 -77 78 -15 46 -52 -91 -66 83 22 64 -42 176 59 -173 -38 -88 77 35 100 -19 87 -130 -1 -101 -15
5746 -15 5 80 12 -160 -255 35 34 -89 -78 100 16 -14 -65 23 -38 122 -78 67 6 -100 104 74 -136 85 108
5771 108 -52 -63 -7 -111 68 -32 135 84 -32 -74 -22 64 92 -24 63 36 -56 1 63 145 10 -7 92 88 39 -195
5797 -195 -36 216 -109 -9 -75 17 -50 76 95 63 -36 41 42 -30 75 -186 56 94 77 -221 -138 102 -81 -112 20
5822 20 -63 -47 97 -4 -12 19 67 -64 115 -58 179 24 -145 -107 -153 -28 -73 153 62 115 64 -34 20 -13 -62 -26
5848 -26 -134 -174 143 -76 -154 -116 100 83 -19 34 -29 -80 10 66 8 11 -51 -62 -35 -87 149 86 84 -60 14 -97 -83
5875 -83 63 -215 101 27 -121 1 184 -28 -149 -41 -89 -42 129 252 41 -124 41 113 -86 -161 -201 -181 -27
5898 -27 284 120 -121 51 -21 194 67 628 -77 -57 121 -80 -326 182 281 99 15 136 241 187 -50 523
5920 523 328 168 -51 212 228 88 171 99 177 -31 -45 -153 21 138 251 -240 245 121 41 -85 -135 14
5942 14 -71 360 -80 -323 156 280 44 -281 294 -141 -117 85 318 248 -48 -179 -222 185 44 -333 267 36
5964 36 -60 183 395 -156 429 -200 123 -55 -232 342 -290 29 252 -180 -582 -280 405 104 512 544 345
5985 345 -303 135 -35 2 21 64 35 302 -53 -87 -23 166 -24 19 84 -323 40 8 -44 39 88 18 114 21 39
6010 39 104 147 -135 93 -103 -37 136 -32 -179 66 -168 126 -56 -138 76 160 45 26 -38 103 -5 106 101
6033 101 -13 9 -181 22 223 -41 -66 -25 -116 -145 -37 121 73 1 -41 -147 -64 -15 13 25 58 85 54 73 -39
6058 -39 115 -13 30 174 110 -35 1 -40 -49 -9 90 -86 86 71 112 -61 27 -1 -43 -56 15 123 -32 96 -197
6083 -197 -72 68 110 133 111 55 -75 14 -5 -67 68 151 -41 -161 26 -60 -33 82 70 192 61 29 38 52 -128
6108 -128 -127 -67 166 48 26 -8 264 10 -108 -65 -168 6 10 -86 -100 -82 120 29 -25 3 -84 31 147 -132 -136 14
6134 14 -72 -42 34 -5 63 -36 34 94 71 161 15 67 189 77 -20 -96 10 85 106 -80 -108 -106 44 -59 87 -154
6160 -154 -18 97 128 -109 64 52 46 90 122 -56 -36 92 -28 -35 -10 -66 72 64 8 9 -80 -18 -51 40 73 -51 -62
6187 -62 61 162 -73 197 93 51 -19 -15 58 87 72 -89 -50 -62 -149 65 49 -24 158 -75 -89 -54 29 175 136 249
6213 249 118 -51 67 -85 14 -38 -2 -33 54 30 10 198 55 -164 -51 -130 -37 -26 219 17 -66 82 -115 46
6237 46 138 2 -8 92 12 -1 -58 -37 -19 -83 -14 70 -62 31 59 100 104 -1 22 84 71 -10 93 -68 82 4 46
6264 46 -22 -16 119 98 127 -208 10 143 34 46 42 -26 -228 -75 156 -57 -138 68 156 -55 -233 -72 30 102
6288 102 -67 -110 -113 -204 -41 -60 -18 -115 -23 -85 12 -114 119 72 39 129 8 165 -47 165 212 5 40 63 189
6313 189 -7 -140 -114 210 24 -61 -190 -39 106 188 -173 33 90 -126 -98 30 -77 -69 -39 -234 -81 -27 -46
6336 -46 -75 -57 -279 -168 -4 -4 -109 22 -100 -119 68 -58 -34 99 208 197 -105 6 -10 130 -1 -87 -36 -30
6360 -30 -3 110 111 -63 -54 92 -61 -5 -73 111 205 25 87 -187 11 -103 -30 64 33 -12 16 -219 73 -24 -15 -32
6386 -32 -175 -179 180 44 108 -64 -74 -97 -112 32 40 -27 -135 27 58 -59 34 -15 20 -27 -59 64 34 100 -73 -134
6412 -134 63 -71 -18 -50 90 44 -60 233 100 44 -16 44 -89 -5 71 -5 -109 -65 -40 -5 134 -29 26 13 -66
6437 -66 -132 -25 -187 12 49 50 -183 186 42 107 -37 -109 -84 40 27 -34 34 245 -1 163 108 191 -48 -44 149
6462 149 122 162 -63 51 -37 105 17 83 -188 246 104 -20 47 39 -16 41 -111 -15 50 11 129 -59 297 131
6486 131 -218 200 -29 -265 94 -129 -250 -85 -219 102 -30 -90 -311 138 2 -33 150 124 -99 -190 -160 -99
6508 -99 124 -177 -169 202 -99 -163 343 -346 6 88 92 -221 245 -84 195 -77 214 5 124 -15 116 -106
6530 -106 -449 356 -153 -387 -187 -108 151 11 101 60 -369 -193 -92 55 21 -96 -17 87 -170 -143 158 7
6552 7 175 -221 428 170 171 86 37 210 13 73 102 145 267 -78 -8 -87 116 -508 -23 295 140 196 -150 -39
6576 -39 -107 39 229 -121 36 75 -71 -14 168 -117 76 -19 73 56 144 128 118 82 -35 3 76 -15 29 -48 26 -82
6602 -82 80 -63 -237 -174 -19 102 -141 -47 44 12 44 -44 -33 27 109 37 -18 21 37 -19 -14 79 12 1 -61 -64 117 7
6630 7 -26 218 -163 -3 -133 -157 163 168 -200 535 -41 152 -182 -69 -22 -318 -197 125 464 -251 56 -464
6652 -464 -32 -105 96 -187 -110 72 -325 -114 525 25 -149 -335 165 120 -159 116 -36 19 -76 -86 -196 109
6674 109 26 -49 27 -100 41 -69 -126 -54 61 0 149 36 233 -135 102 -149 238 45 63 110 -138 -106 47
6697 47 -75 67 40 36 -6 78 -116 81 172 -21 22 110 213 110 10 -67 22 -33 20 63 29 -39 144 93 -74 51
6723 51 -21 -60 24 -33 186 66 -136 -142 23 152 166 107 39 -170 -5 -244 -7 129 -37 -29 70 134 26 -3 18
6748 18 103 75 192 -153 57 -89 22 -136 75 14 -29 55 -150 -48 0 -18 -2 -16 -93 9 -41 33 -90 155
6772 155 -4 -30 131 110 -113 -111 259 267 97 56 -16 -7 169 464 33 81 191 -7 310 -135 118 50 -144 308
6796 308 -70 -154 -127 -148 485 -82 -146 237 74 84 102 -208 -263 489 -13 630 280 54 32 -50 130 -112 -155
6819 -155 323 -72 -29 -53 283 -504 127 148 -66 -169 -56 -40 119 -204 106 20 197 -273 -83 -242 63 -63
6841 -63 38 -95 -125 -113 -25 95 -177 -110 -235 194 -320 -253 36 195 -107 32 -127 200 21 -188 -90 128
6863 128 124 195 -41 -13 -62 15 92 -80 7 -28 -25 31 21 -81 -48 -15 -14 8 123 96 36 9 3 136 3 -72 -34 -100 55
6892 55 -103 44 23 -219 -59 141 -125 116 8 177 -96 48 1 -154 -28 111 52 133 26 170 -79 -62
6914 -62 -105 112 -80 64 20 -99 -83 -79 110 78 107 18 -31 121 132 -82 -101 -119 -46 -49 6 -62 1 -23 16 5 29 126
6942 126 -11 -258 24 73 -72 57 0 -54 71 33 24 -62 95 10 -79 25 -65 -134 -56 -142 -31 44 67 139 39
6967 39 41 -4 -106 24 118 -50 -13 118 -156 -146 1 -139 191 103 -33 140 5 75 -73 -107 -95 -12 117 35
6991 35 -5 93 -49 162 193 2 -31 72 118 101 29 -210 93 44 89 137 57 -60 -54 -17 9 -7 39 92 52 -41 -120
7018 -120 57 57 -91 16 131 -15 47 115 2 84 -41 -115 89 -89 -106 46 -132 276 -40 206 61 -32 89
7041 89 -107 137 86 -61 -16 -5 11 -44 178 -11 -47 83 -83 -151 45 -144 136 47 190 114 -106 -38 -57 81
7065 81 11 86 177 -56 130 173 169 -108 57 148 -80 -120 -199 13 97 30 251 83 37 -222 -161 -58 399 283 151
7090 151 394 -50 -133 -345 190 271 760 -385 139 213 227 123 457 670 -201 -198 525 516 748 129 188 -224 -15
7113 -15 181 294 -519 184 262 166 -328 16 314 -204 62 -35 626 -196 -239 268 299 894 -691 -367 348 64
7135 64 -744 150 311 255 -358 857 -567 -788 -51 -152 351 -1004 -331 -970 -52 -353 245 -500 -968 -959
7155 -959 415 -150 31 -228 -48 420 351 -994 -108 -165 312 597 -844 668 -32 183 481 295 -802
7174 -802 504 254 226 359 111 5 -216 78 10 -435 229 235 -184 -167 78 63 -226 -44 14 500 -31 201
7196 201 152 -203 106 -166 261 -474 381 596 -210 164 247 503 -15 -22 -210 192 488 -22 114 -401 448
7217 448 -653 157 338 73 234 -164 -449 495 -650 -259 -246 -178 -158 -470 203 189 -464 -426 168 84 -311
7238 -311 -509 -81 -111 -137 -25 166 240 -106 -641 314 -34 -176 -192 150 -353 -307 -143 -19 -65 66 -713 -439
7260 -439 -355 -76 389 566 145 -312 -102 -219 -72 111 332 89 104 8 -171 -12 136 -125 6 41 -10 -358
7282 -358 -86 -65 158 98 314 -187 -92 -218 274 -364 6 -221 198 -32 158 8 -4 -53 281 157 -122 114
7304 114 1 105 134 -149 -33 16 -160 -81 11 82 218 -26 213 -20 -89 -57 -44 -50 -159 -33 -6 -54 74 121
7328 121 -142 13 -13 36 -72 99 93 -152 -75 76 -39 -78 -11 -137 176 5 -170 27 33 85 114 -9 -20 64
7352 64 143 119 -32 146 -120 77 113 -6 -34 76 88 -93 -111 -3 -50 -47 38 -66 142 158 -44 20 85 213 -40
7377 -40 32 94 -24 43 30 -78 20 -58 -138 -3 -53 96 63 -171 142 8 7 52 -116 74 -69 43 -85 -74 19
7402 19 24 31 -154 -93 71 -152 59 162 -85 116 -76 -118 70 37 -71 -45 50 55 -39 40 -128 -88 46 -65 57
7427 57 -152 -13 89 -111 -21 -165 31 34 28 -56 -8 0 -21 -59 -26 -107 27 156 58 -137 -81 -47 -94 4 56 -93 96
7454 96 43 -47 -9 103 -158 -171 99 149 -29 -93 -59 -37 -40 -11 52 154 129 -36 -19 -103 96 -87 -42 -37 97 -55
7480 -55 -56 -21 85 63 127 87 65 -1 16 -16 -19 -94 -67 169 -48 -133 1 -116 -183 -175 -67 67 -41 121 -39 65
7506 65 -17 158 347 283 -313 -276 -168 48 -21 448 158 -358 -160 83 67 -344 22 -23 -82 -48 226 18 -70
7529 -70 -66 80 136 165 -35 -4 17 147 -99 -79 102 49 203 207 -207 -13 152 -406 284 -527 450 178 -449 -155
7553 -155 -127 -386 -203 2 -178 407 34 -403 -273 339 -62 -418 -168 429 -61 152 283 579 -230 154
7573 154 93 176 122 -206 206 520 17 -555 220 577 324 -50 -110 -37 -808 303 -773 -33 422 -309 -214
7594 -214 -399 643 -61 -323 -192 314 252 74 362 2 -772 389 -50 -282 -286 -879 271 280 286 23 -348
7615 -348 -47 -546 -128 517 354 294 -276 162 -198 -57 -372 264 382 -394 14 326 -304 266 -191 109
7635 109 -359 257 -378 165 84 -239 -448 -93 -31 -412 39 -134 433 3 -123 -292 -320 -104 -66 -277 -711
7656 -711 348 382 -384 -175 -632 36 170 480 27 28 136 513 82 114 -319 129 -51 488 257 279 -260
7677 -260 225 -102 -570 203 -730 -235 25 -325 -156 412 65 597 -566 -807 -134 -1102 294 882 537
7696 537 110 -298 -311 -573 -78 -234 56 -10 115 -503 97 604 49 -461 -114 -589 -710 -174 -371 -391 -137
7717 -137 103 84 -1122 60 394 -36 -516 14 -406 70 -439 250 75 -394 -42 -446 623 -601 488
7736 488 523 -260 160 -330 -213 653 -16 -77 -735 -585 295 -442 -39 418 -345 175 -41 -1000 233 -5
7756 -5 417 394 -412 409 783 -1336 -687 115 -234 44 -146 428 11 -163 272 -85 -76 221 -63 162 487
7777 487 -413 277 10 543 373 -255 -185 -40 169 -99 19 101 167 254 -586 -56 288 474 -540 -208 595
7798 595 378 291 -509 49 358 44 395 566 334 499 46 204 -87 -33 418 -236 -248 548 -228 219 -279
7819 -279 367 130 -152 115 136 -178 -232 98 102 -74 34 -234 61 -233 -17 -125 -114 278 -33 -256 184 -202
7841 -202 -215 105 -233 2 -105 -275 -119 -6 -8 115 102 -305 491 29 136 -101 -291 -365 456 8 327 168
7863 168 174 65 -185 6 55 107 364 -617 115 -88 -29 -65 -82 72 109 -211 63 -323 -661 8 375 27 -119
7886 -119 110 -188 -182 312 119 -368 78 -289 -64 -234 -193 -45 -52 -193 -29 -4 -207 -29 -266 180 441 -210
7908 -210 34 215 -35 -104 95 330 -74 -205 -153 -7 226 -128 221 268 -116 -136 -421 -254 -149 144 -392
7929 -392 -74 -66 123 -126 -234 -389 309 80 402 -337 -257 225 -159 -84 -783 -220 -652 294 -169 -509 34
7950 34 216 418 177 -114 -374 100 -287 -110 104 45 -282 -212 -249 -181 -42 -246 108 95 -42 -90 -178 -153 -376
7973 -376 -97 -496 -125 -331 -123 -127 371 -113 257 -138 -204 456 -115 439 62 7 -276 -227 -357 -511 78 121
7995 121 286 -169 -238 361 173 -395 195 -211 44 321 191 -497 323 506 178 -217 -121 46 -111 -8 -173
8016 -173 71 -49 54 81 -52 -193 -157 26 3 37 47 -412 245 23 61 -155 184 290 310 -192 77 -356
8038 -356 293 -632 54 -177 55 -281 -163 18 -106 422 20 -36 498 25 162 -141 -295 -196 18 153 -132
8059 -132 -171 406 129 -192 349 -102 49 219 106 179 -36 -412 62 -231 179 144 -188 -19 7 -128 -36 -174
8081 -174 -138 235 -102 221 -174 102 122 -113 -1 53 88 -91 51 -49 39 83 -16 -139 -20 -132 13 -110
8103 -110 -28 67 -319 -21 -123 106 -165 223 -94 117 1 -40 -130 -610 134 -43 -422 26 -366 -5 -113
8124 -113 95 272 31 -70 307 86 -145 85 173 284 -9 205 -71 256 153 78 -56 -327 -121 -116 -183 68
8146 68 -102 40 218 -22 151 221 -193 -26 122 199 -66 -91 -73 -104 5 187 -66 59 -55 -12 71 -1 -17
8169 -17 147 95 -75 5 -20 24 -40 -50 -14 -10 49 179 60 173 -62 73 29 25 87 60 -53 180
8191A80
##END NTUPLES=NMR FID
##END=
