##TITLE=1H_VI
 200.13MHz, CDCl3,
 8 sc
 
 19ns.20.2.2025
##JCAMPDX= 6.0         $$ Bruker NMR JCAMP-DX V2.0
##DATA TYPE= NMR FID
##DATA CLASS= NTUPLES
##ORIGIN= UXNMR, Bruker Analytische Messtechnik GmbH
##OWNER= pz
$$ XWIN-NMR		Version 3.5
$$ Thu Feb 20 14:23:02 2025 Russian Standard Time (UT+4h)  new_Human@DPX200
##.OBSERVE FREQUENCY= 200.1313
##.OBSERVE NUCLEUS= ^1H
##.DELAY= (6, 6)
##.ACQUISITION MODE= SIMULTANEOUS
##.ACQUISITION SCHEME= undefined
##.AVERAGES= 8
##.DIGITISER RES= 18
##SPECTROMETER/DATA SYSTEM= spect
##.PULSE SEQUENCE= zg30
##.SOLVENT NAME= CDCl3
##.SHIFT REFERENCE= (INTERNAL, CDCl3, 0, 14.3821)
##AUDIT TRAIL= $$ (NUMBER, WHEN, WHO, WHERE, WHAT)
$$ ##TITLE= Audit trail, XWIN-NMR		Version 3.5
$$ ##JCAMPDX= 5.01
$$ ##ORIGIN= Bruker BioSpin GmbH
$$ ##OWNER= new_Human
$$ C:/Bruker/XWIN-NMR/data/yarkov/nmr/H-C/1/audita.txt
$$ ##AUDIT TRAIL=  $$ (NUMBER, WHEN, WHO, WHERE, WHAT)
(   1,<2025-02-20 14:18:58.43 +0400>,<new_Human>,<DPX200>,
      <created by zg, POWCHK disabled, PULCHK disabled
       configuration hash MD5:
       00 E9 B6 7A A2 85 ED C7 34 08 36 98 17 FE 4E 26
       data hash MD5: 16K
       98 F4 1D 33 2D 7F 00 17 C9 0A E4 EE F8 4A 00 03>)
$$ ##END=
$$ 
$$ hash MD5
$$ 7D 50 37 17 8B EE B4 83 64 9B A5 F9 E2 19 96 23
##$RELAX= 
##$RELAX= 
##$RELAX= 
##$RELAX= 
##$RELAX= 
##$RELAX= 
$$ Bruker specific parameters
$$ --------------------------
##$DU= <C:/Bruker/XWIN-NMR>
##$EXPNO= 1
##$NAME= <H-C>
##$PROCNO= 1
##$TYPE= <nmr>
##$USER= <yarkov>
##$AMP= (0..31)
100 100 100 100 100 100 100 100 100 100 100 100 100 100 100 100 100 100 
100 100 100 100 100 100 100 100 100 100 100 100 100 100 
##$AQSEQ= 0
##$AQ_mod= 1
##$AUNM= <au_zg>
##$AUTOPOS= <>
##$BF1= 200.13
##$BF2= 200.13
##$BF3= 200.13
##$BF4= 200.13
##$BF5= 200.13
##$BF6= 200.13
##$BF7= 200.13
##$BF8= 200.13
##$BYTORDA= 1
##$CFDGTYP= 0
##$CFRGTYP= 5
##$CHEMSTR= <none>
##$CNST= (0..31)
1 1 145 1 1 1 1 1 1 1 1 1 1 1 1 1 1 1 1 1 1 1 1 1 1 1 1 1 1 1 1 1 
##$CPDPRG= <>
##$CPDPRG1= <>
##$CPDPRG2= <>
##$CPDPRG3= <>
##$CPDPRG4= <mlev>
##$CPDPRG5= <mlev>
##$CPDPRG6= <mlev>
##$CPDPRG7= <mlev>
##$CPDPRG8= <mlev>
##$CPDPRGB= <>
##$CPDPRGT= <>
##$D= (0..31)
0 0.7 0 0 0 0 0 0 0 0 0 0.03 0 0 0 0 0 0 0 0 0 0 0 0 0 0 0 0 0 0 0 0 
##$DATE= 1740046737
##$DBL= (0..7)
120 120 120 120 120 120 120 120 
##$DBP= (0..7)
150 150 150 150 150 150 150 150 
##$DBP07= 0
##$DBPNAM0= <>
##$DBPNAM1= <>
##$DBPNAM2= <>
##$DBPNAM3= <>
##$DBPNAM4= <>
##$DBPNAM5= <>
##$DBPNAM6= <>
##$DBPNAM7= <>
##$DBPOAL= (0..7)
0.5 0.5 0.5 0.5 0.5 0.5 0.5 0.5 
##$DBPOFFS= (0..7)
0 0 0 0 0 0 0 0 
##$DE= 6
##$DECBNUC= <off>
##$DECIM= 32
##$DECNUC= <off>
##$DECSTAT= 4
##$DIGMOD= 1
##$DIGTYP= 9
##$DL= (0..7)
0 120 120 120 120 120 120 120 
##$DP= (0..7)
150 150 150 150 150 150 150 150 
##$DP07= 0
##$DPNAME0= <>
##$DPNAME1= <>
##$DPNAME2= <>
##$DPNAME3= <>
##$DPNAME4= <>
##$DPNAME5= <>
##$DPNAME6= <>
##$DPNAME7= <>
##$DPOAL= (0..7)
0.5 0.5 0.5 0.5 0.5 0.5 0.5 0.5 
##$DPOFFS= (0..7)
0 0 0 0 0 0 0 0 
##$DQDMODE= 0
##$DR= 18
$$ [...]
##$SUBNAM0= <"">
##$SUBNAM1= <"">
##$SUBNAM2= <"">
##$SUBNAM3= <"">
##$SUBNAM4= <"">
##$SUBNAM5= <"">
##$SUBNAM6= <"">
##$SUBNAM7= <"">
##$SUBNAM8= <"">
##$SUBNAM9= <"">
##$SW= 18.0517328524113
##$SWIBOX= (0..15)
0 0 2 0 0 0 0 0 0 0 0 0 0 0 0 0 
##$SW_h= 3612.71676300578
##$TD= 16384
##$TD0= 1
##$TE= 0
##$TE2= 300
##$TE3= 300
##$TEG= 300
##$TL= (0..7)
0 120 120 120 120 120 120 120 
##$TP= (0..7)
150 150 150 150 150 150 150 150 
##$TP07= 0
##$TPNAME0= <>
##$TPNAME1= <>
##$TPNAME2= <>
##$TPNAME3= <>
##$TPNAME4= <>
##$TPNAME5= <>
##$TPNAME6= <>
##$TPNAME7= <>
##$TPOAL= (0..7)
0.5 0.5 0.5 0.5 0.5 0.5 0.5 0.5 
##$TPOFFS= (0..7)
0 0 0 0 0 0 0 0 
##$TUNHIN= 0
##$TUNHOUT= 0
##$TUNXOUT= 0
##$USERA1= <user>
##$USERA2= <user>
##$USERA3= <user>
##$USERA4= <user>
##$USERA5= <user>
##$V9= 5
##$VALIST= <valist>
##$VCLIST= <CCCCCCCCCCCCCCC>
##$VD= 0
##$VDLIST= <DDDDDDDDDDDDDDD>
##$VPLIST= <PPPPPPPPPPPPPPP>
##$VTLIST= <TTTTTTTTTTTTTTT>
##$WBST= 1024
##$WBSW= 4
##$XGAIN= (0..3)
0 0 0 0 
##$XL= 0
##$YL= 0
##$YMAX_a= 46623
##$YMIN_a= -52649
##$ZGOPTNS= <>
##$ZL1= 120
##$ZL2= 120
##$ZL3= 120
##$ZL4= 120
##$ABSF1= 10
##$ABSF2= 0
##$ABSG= 5
##$ABSL= 3
##$ALPHA= 0
##$AQORDER= 0
##$ASSFAC= 0
##$ASSFACI= 0
##$ASSFACX= 0
##$ASSWID= 0
##$AUNMP= <proc_1d>
##$AZFE= 0.1
##$AZFW= 0.1
##$BCFW= 1
##$BC_mod= 2
##$BYTORDP= 1
##$COROFFS= 0
##$CY= -3
##$DATMOD= 1
##$DC= 2
##$DFILT= <>
##$DTYPP= 0
##$F1P= 0
##$F2P= 0
##$FCOR= 0.5
##$FTSIZE= 0
##$FT_mod= 4
##$GAMMA= 1
##$GB= 0.15
##$INTBC= 1
##$INTSCL= 1
##$ISEN= 128
##$LB= 0.25
##$LEV0= 0
##$LPBIN= 0
##$MAXI= 10000
##$MC2= 0
##$MEAN= 0
##$ME_mod= 0
##$MI= 1.114404
##$NCOEF= 0
##$NC_proc= 0
##$NLEV= 6
##$NOISF1= 3.799351
##$NOISF2= 2.8
##$NSP= 1
##$NTH_PI= 0
##$NZP= 0
##$OFFSET= 14.38212
##$PC= 1
##$PHC0= -1004.858
##$PHC1= 34.19226
##$PH_mod= 1
##$PKNL= yes
##$PPARMOD= 0
##$PSCAL= 0
##$PSIGN= 0
##$REVERSE= no
##$SF= 200.129724274929
##$SI= 16384
##$SIGF1= 3
##$SIGF2= 2
##$SINO= 400
##$SIOLD= 16384
##$SREGLST= <1H.CDCl3>
##$SSB= 0
##$STSI= 0
##$STSR= 0
##$SW_p= 3205.1282051282
##$SYMM= 0
##$S_DEV= 0
##$TDeff= 0
##$TDoff= 0
##$TI= <>
##$TILT= no
##$TM1= 0
##$TM2= 0
##$TOPLEV= 0
##$USERP1= <user>
##$USERP2= <user>
##$USERP3= <user>
##$USERP4= <user>
##$USERP5= <user>
##$WDW= 1
##$XDIM= 8192
##$YMAX_p= 0
##$YMIN_p= 0
$$ End of Bruker specific parameters
$$ ---------------------------------
##NTUPLES= NMR FID
##VAR_NAME=  TIME,          FID/REAL,        FID/IMAG
##SYMBOL=    X,             R,               I
##VAR_TYPE=  INDEPENDENT,   DEPENDENT,       DEPENDENT
##VAR_FORM=  AFFN,          ASDF,            ASDF
##VAR_DIM=   8192,          8192,            8192
##UNITS=     SECONDS,       ARBITRARY UNITS, ARBITRARY UNITS
##FACTOR=    0.0002768,     1,               1
##FIRST=     0,             0,               0
##LAST=      2.2672688,     0,               0
##MIN=       0,             -52649,          0
##MAX=       2.2672688,     46623,           0
$$ Real data points
##PAGE= N=1
##DATA TABLE= (X++(R..R)), XYDATA
$$ [...]
781a39o09Q62R50j001j473J033J854j184k593J588L112k153l163L003K765l554
797g02j725L912N94l344M19K064r61o26Q35q94n3J604j208j894K229J482k643
814i11j026K657P70k234o72J988J191j982j675K613J644l147j214L333K20l072
830a517P53J917j371o49J209q82j69J949j106k064K299J842l024j140L481L98
846A926l221j72K922P4k686k55K430J58k437%K232k84j754M91R81k46n0k17n88
865f96J211Q65k068n95K682J85l079J98L042n40k880M88K648n97k632P57K624
882A613j011k269J344J648j305o13R84k68j70R49j108j038K283M48l150K80L384
899B001j211l121J699K406j643j873J337J786q17j855O89K196q51k028J110J571
$$ plain form
781 -139 -748 114 1064 63 -1410 -377 1477 293 -2300 -712 2400 247 -2916 87 2852 -702
797 -702 -2427 1485 2079 -1265 -846 1218 257 -369 466 -428 -481 1123 -85 -1979 250 1732 -911
814 -911 -1937 720 1490 -744 -1416 572 1763 -219 -1894 719 2363 -784 -1998 1335 1555 -1517
830 -1517 -764 1153 -218 -867 342 -540 -709 1240 134 -1930 369 2211 -813 -1953 1528 1926
846 1926 -1295 -1467 1455 1529 -1157 -1412 1018 1176 -1261 -1261 971 687 -1067 -576 405 159 109 -108 -696
865 -696 515 1380 -688 -1283 1399 1584 -1495 -1297 1745 1205 -1675 -1187 1461 864 -1768 -1011 1613
882 1613 602 -1667 -323 1325 20 -593 391 123 -47 902 -206 -1244 1039 1487 -1663 -1383 2001
899 2001 790 -2331 -632 1774 131 -1742 -405 1381 564 -1291 -602 1594 743 -1285 -175 1396
915A396j321p94R24j17j00O07j260o69K553j04l349J362L333k260k832L036J970
932B375k882j124K298P56j621p88J074R64p26j361O19J206o09r74L18O08K90m46
950b3r97O95J936j360k218K187K235k792j818L068J159l006o41K508K87k068k71
967a119J541L21j092n18Q03O30m17n54o7Q30O89j221j073J708J320k311j271K858
985A057P71l210k22K957j97k582L41K023k50j505J14J252J86r89l61Q77N47n46
1003B63o65N9R76J57j331o69K013M36k576k46L010k70l073R15K791j272k151J422
1021b11J598j120j009P58N81j87m89l19L11O96l86j128L49J426m15j681M86J955
1039A215o16k075Q72K220j090k014J260J943j405j666J265J312j119r86Q82N20
$$ plain form
915 1396 75 -719 205 88 -12 595 -665 -1334 1219 1115 -2234 -872 2461 201 -2631 405 2375
932 2375 -507 -1631 667 1423 -198 -986 88 1052 326 -1035 -416 790 181 -793 -475 133 423 -23
950 -23 -1020 -325 1611 251 -1967 220 2455 -337 -2155 913 2072 -934 -1575 933 1220 -848 -1119
967 -1119 422 743 -349 -867 -64 566 149 -405 -472 358 1047 -174 -1247 461 1781 -530 -1801 1057
985 1057 1828 -1382 -1604 1353 1156 -1426 -1085 938 688 -817 -703 549 735 -254 -615 262 809 263
1003 263 -402 -343 633 790 -541 -1210 803 1239 -1337 -1583 1427 1157 -1916 -1001 1790 518 -1633 -211
1021 -211 1387 267 -742 16 597 410 -79 -398 -87 609 223 -905 -556 870 455 -1226 -740 1215
1039 1215 599 -1476 -604 1616 526 -1488 -228 1715 310 -1356 -91 1221 102 -884 -2 518
1055E18n72l11Q3J04M78j3j175L94J731q12j931J374J988j920j527K157R91k089
1073e32n74J613K32j144l01O94N10n34p14N29P34m02n26L06L17J34r3o89K35J295
1093A090p39j827J525J755k205j374K521N65k486J63J890n21j140M58N30j66J67
1110B06l81j83Q49P2r60M2Q99j6q25l81Q07P48j081j066J506Q97j867o34K276
1129I08J17k072L98J626o34q89O47K78k95J00k41l16O47L52j038l41J210K20j338
1148f61k47J455K57j585k00J886k8j849L79J703n78j336P26P73o18l95K90m1K31
1167A62J3n89m0Q12l8r74J44J073k3j121m9J437P1j689Q5J987n55j952R80J500
1187A234j301r03J052L36o82J13K7k51O10J45j025K42J348o44j206Q26J107p97
$$ plain form
1055 518 -54 -365 -282 -178 300 287 -888 -494 1237 425 -1506 -132 1856 -64 -1591 566 1557 -532
1073 -532 -1106 507 739 -405 -706 -12 498 -36 -750 -221 513 111 -415 -109 208 342 249 -440 -205 1090
1093 1090 351 -1476 49 1804 -401 -1775 746 1311 -1175 -1012 878 357 -783 -325 205 39 206
1110 206 -175 -358 491 563 -397 -355 544 528 -297 -678 129 877 -204 -1270 236 1133 -734 -1368 908
1129 908 1025 -1047 -649 977 343 -546 101 379 84 184 -57 -373 274 626 -412 -753 457 677 -661
1148 -661 -908 547 804 -781 -981 905 877 -972 -593 1110 532 -804 -78 695 77 -318 -28 -69 162
1167 162 175 -414 -454 358 320 -654 -510 563 540 -581 -630 807 878 -811 -726 1261 706 -1246 -266 1234
1187 1234 -67 -970 82 418 -264 -151 -124 -375 235 380 -645 -403 945 301 -905 -79 1028 231
1205B31j006O06J035m67j335N65J390q00j443J031J176j141p28J101K06o44K02
1222b1K8k02O08M0j112M07J326q64j338J149J152j409r86J363P44j177p88J200
1240A20O69j005n95R91O28q41m55O02L80l81k11k5K60L42n45o91P84P59j015p90
1260a019J247P36j414o41J654M08j521k91J521Q3j247K2J004j30p07J04K18J97
1278B24r1m33k06P25K28q88k31J136J43j256M4J282J05j330r5J395M6j398O5J323
1298G88l13j219M33Q27m28m21J86R0J18J48n35j23R42M3j132J86J218l02j199
1317f93L78J135m32j097K94J121l76j127M00J059o01p97O33N12m33k57K63P4J66
1336B22R0o50J18R46l96j112O35R83q53r00Q47P41p86o37O78O73n47p34O67O99
$$ plain form
1205 231 -775 -169 866 399 -936 -371 1019 219 -1224 -193 983 -158 -886 215 421 -223 -21
1222 -21 7 -195 413 453 -659 -252 1074 210 -1128 21 1173 -236 -1222 141 885 -292 -1080 120
1240 120 789 -216 -811 180 808 -33 -488 114 494 113 -98 -123 137 479 -66 -757 27 786 -229 -1019
1260 -1019 228 964 -450 -1091 563 971 -550 -841 680 763 -484 -462 542 412 -295 -191 27 224
1278 224 133 -300 -506 219 447 -441 -672 464 607 -649 -605 677 782 -548 -643 752 798 -600 -535 788
1298 788 475 -744 -311 516 88 -333 -147 -57 61 209 -326 -449 493 536 -596 -410 808 506 -693
1317 -693 -315 820 388 -709 -415 706 330 -797 -397 662 61 -736 -103 409 -24 -281 -18 56 222
1336 222 312 -338 -220 726 330 -782 -147 836 -17 -917 -70 671 -115 -752 -74 599 52 -682 -15 684
1356F84p13n07O94K83n75J03J52k29K39J06p49J75J017o76r63Q76R54j157n55
1375h41J137L75j010j09P68J63n35j85L83L22m18l75M45J58l84r4J64j9J35J4
1395I4n68K30Q32o08p64R85O28j192k26J236n6j070J82Q14l17m80K28Q9rj43j17
1416b32P0K84l9k47m5L19K19m19k36N70M00p66l71R03K60j068j40J012o3r75K65
1437b99O62k56n40K83L22k26O7l0j00K28K60n08j79O51J57q68OQ28m9r08R0Q71
1459D62k63q02K64P46k60n73K36N21k25k77K00J72j25L0j41o6K51J94n97j57P30
1480C20%q58Q7R63l32r06N37P72n30n58M78M68m04k87K89K66k20j95N7N6M9L6
1502H8k99m6N17j16o14K37O79k46q16M65Q03n52o15O43M71n97m21M91L20l74l00
$$ plain form
1356 684 -29 -536 158 441 -134 -31 121 -108 131 237 -512 -337 680 4 -959 -83 871 -286 -841
1375 -841 296 671 -339 -448 320 483 -52 -237 146 468 50 -325 120 278 -106 -200 -36 -55 80 94
1395 94 -474 -244 588 -20 -784 201 829 -363 -589 647 591 -479 -297 517 200 -280 -52 37 28 -115 -232
1416 -232 -162 122 83 -164 -209 110 329 -90 -326 244 644 -122 -493 410 670 -398 -538 474 411 -564 -299
1437 -299 363 107 -433 -150 172 -54 13 -17 -117 111 371 -137 -316 335 492 -376 -370 458 409 -499 -409 462
1459 462 199 -603 -339 407 147 -426 -190 331 106 -171 29 201 76 106 -35 -101 150 344 -253 -410 320
1480 320 320 -538 -451 512 180 -726 -189 583 53 -505 -27 441 37 -250 39 305 85 -110 -53 3 52 88
1502 88 -211 -257 260 144 -470 -233 446 200 -616 -151 652 100 -515 128 599 2 -419 72 392 18 -282
1523b82K04K53j74k68J01J51R5p9k99J22N86k83o53M88Q29q03o87J012L82j005
1543c10k13Q40L7p01R1L35L4j89j55P1L90r2m55K47L46j12k11j15K25L45k88n22
1565d02M55N83q20n34J118J60j139M9R79k06p31M07L11k05n7Nk1K80j0m66R5N59
1587D10k43n02K18L37n1m11j23N93J07o89j65Q82J11j063L23R26m49p26O07L17
1607D09m05j06K13k05J71Q6m22k6N33j24o35K95N60k21n37K56N31j44o04J72O82
1628D79j76p33L46N80l78n34L84K70l47M4O7q0J42N5l97R5N81k49n59M40M99m59
1650G0n17N65M13m87m90N27L19m87l38M55K70m63j54L68J39l16J7J07oJ30kk97
1672a77J21M38l60m05M55M47o83l46O98K07o74q0M79Q4m40%L44R0k61k9J43J61
$$ plain form
1523 -282 -78 175 1 -267 -166 -15 80 1 -298 -176 410 127 -526 -38 791 -12 -699 313 695 -310
1543 -310 -523 317 354 -347 -256 79 113 -76 -231 -160 230 138 -317 -70 276 164 -47 -162 63 408 120 -402
1565 -402 53 636 -184 -718 400 560 -579 -530 449 243 -488 -81 230 25 -32 -27 -48 232 222 -244 -149 410
1587 410 167 -335 -117 220 169 -242 -365 228 335 -354 -519 363 474 -589 -266 660 211 -515 92 409
1607 409 4 -102 111 -94 77 163 -259 -285 248 124 -511 -216 344 123 -414 -158 373 229 -375 -203 479
1628 479 303 -430 -84 496 118 -416 -32 238 -109 -65 2 -78 64 119 -278 -183 398 149 -410 30 529 70
1650 70 -447 118 531 44 -446 81 400 -87 -425 30 300 -163 -317 51 190 -126 -109 -2 -8 122 120 -177
1672 -177 -56 382 22 -383 72 519 -164 -510 188 395 -279 -359 120 204 -236 -236 108 198 -63 -92 51 212
1694B12j21j16M7O1P1j82j83J80L68l86l97N03L21o74j97P99l9o48K18N06k26
1715A17k93K03J91j85m0N4q7J47N5k98r5L48Nk91l9L38K4l94o6M69J84o33n2O76
1739C38Po74K03N25k94l83L13J26k38O9K1j23J39J18l97o7N65o9m92J34N41j57
1761B05m27J73L58j39m24J48L97j23m77J95L59k59k61K35Q9q5o2R6j31K25R7l64
1783a75L2M48j01n54K19N11l06m89L89M00m04l38L12L02k89k42K52J25j02j07
1803a17R5J49j38K5p1P4K06j29l07J28M03k60l84K37N16n26l51L95M08n50j41
1824c38M45J50k87r6K40O3q0j47J5J25M3k20j42K47K27l52k66L56L28l56l74N05
1846H6L03n34k30O23J42n82KM63l1l44l5J84N3j04j22QK21k5k60j5L33K6l45m3
$$ plain form
1694 212 91 -25 22 83 154 -28 -211 -31 337 -49 -446 57 378 -296 -493 306 267 -381 -163 343 117
1715 117 -176 27 218 33 -7 47 -40 107 162 -136 -231 117 122 -169 -208 130 154 -240 -306 163 347 -286 -338 338
1739 338 345 -329 -126 399 105 -278 35 161 -77 -8 13 -110 29 147 -250 -317 248 179 -313 -179 362 205
1761 205 -222 -49 309 170 -254 -106 291 168 -309 -114 245 -14 -275 -40 49 -36 -98 -2 -133 92 189 -175
1783 -175 -143 305 204 -350 -131 380 74 -415 -26 374 -30 -368 -56 246 -43 -285 -33 92 -10 -117
1803 -117 -22 127 -11 14 -57 17 223 94 -213 -85 318 58 -326 -89 427 -99 -450 -55 353 -197 -338
1824 -338 107 257 -30 -126 114 177 97 -50 -35 90 133 -87 -229 18 245 -107 -373 -17 311 -45 -419 86
1846 86 389 -145 -375 248 390 -192 -190 273 242 -102 -137 47 100 -4 -126 -118 103 78 -182 -197 136 162 -183 -226
1870b26M55M3m47l8N28j8n81k1N95p9n16Q9M41k12k25J13Q7J2P8k09OL42k2m64
1894b69J50M63j61m62J88L91k25l62O7M13L5m91NN90j34n61K10M84k98l31K91
1915gJ27j14J10j60n7L09K0n58J99N35l60m54L74L51m52j66K90J81j86k83J71
1936a30M18j69l61J68M18k66k94K57R6j96J1j9m6K72m6n06K77N18m77l96O27K12
1958C68n71r2M81L4l02m4J76J30q2k92J16L13k58k21J97J71k27lL2M7J98k05j89
1981b23K50M03n19k64N82J36n43k9M64j27l54J99J19r5r7n5O1J21Nk34J27J56
2003H3j06q6NJ75N9k09p4L24J32n34j7M82l2n15J25M68k19l58K13J33o5M3q1K9
2027b5J90j16j36Q6K46j27k28M1K00n7j93l9K52M1l79l1M41p0l47J37K98j31j26
$$ plain form
1870 -226 229 272 -175 -213 315 297 -284 -305 290 211 -305 -216 225 13 -212 -99 -12 0 78 -131 -125 217 195 -269
1894 -269 -119 344 183 -279 -91 300 75 -287 -220 193 228 -263 -258 332 198 -363 -153 331 33 -298 -7
1915 -7 120 6 116 -44 -101 208 228 -330 -131 404 44 -410 -36 315 -137 -303 -13 168 -18 -301 -130
1936 -130 288 119 -242 -74 344 78 -216 41 137 -59 -48 -67 -113 159 113 -393 -116 402 -75 -471 156 368
1958 368 -203 -295 186 220 -82 -126 50 180 98 -194 -78 235 -23 -244 -47 124 -103 -106 -74 -27 171 -34 -223
1981 -223 27 430 -89 -353 229 365 -178 -207 257 130 -224 -25 94 -1 -98 -153 -92 29 34 -200 -73 83
2003 83 -23 -109 -104 71 130 -79 -153 171 303 -231 -248 234 202 -313 -188 280 61 -297 -84 49 -16 27 -54 -25
2027 -25 165 49 -87 -1 245 118 -110 -69 131 74 -119 -158 94 135 -244 -275 166 96 -251 -114 184 53 -73
2050g3O6J45m5q2l9l5K07l7k58N6K98j46k71J44L03k09l09K23K83j68l18K05L03
2073B43k08k40K26K20j90k02J67J03k22rJ5J37J6r5j04LL00j08k83J83L30j91
2095I1l13K97K09l69r7L02O6j75r7R5J14j17q1oJ80p3j55K6J44P7j67l1J26J07
2119A53j09k49K86K13l10k78L44K35m77n2L89l7k69L9R2O6o9K3q9J74N0j82k9
2142h6K10O4k82k2K62O7l23q1K53J63l27j80L84R8m13J7L82l5k77O4K10m9j09
2165a0k0J2J12L1k62l4K97j9l55J50K50q4k48J6K69M0l52O3L94j89k70J06L08
2188B05j36k29J45J62q7p7l1j3J32p4j85J41K00j30k71J59L43k37k08J12K94j64
2210E1k13J11K80j27k93R6K64j51j70J50K8r1K3o7M9J78j5l21J65K83j75k63L19
$$ plain form
2050 -73 -7 138 93 11 -28 -63 144 107 -151 -95 203 57 -214 -70 233 24 -285 -62 221 53 -265 -60 243
2073 243 35 -205 21 241 51 -151 16 119 -103 -112 -97 40 56 -39 -143 -140 160 52 -231 -48 282 91
2095 91 -222 75 284 -85 -182 120 186 11 -86 9 123 6 -75 -81 99 26 -129 -103 41 118 -49 -80 46 153
2119 153 44 -205 81 294 -16 -294 50 285 -192 -244 145 108 -161 -122 -30 36 -33 -10 -99 75 125 -57 -86
2142 -86 124 188 -94 -116 146 213 -110 -191 62 225 -102 -282 102 200 -213 -196 186 151 -126 -62 148 99 -10
2165 -10 -30 -18 94 125 -137 -171 126 107 -248 -98 152 68 -180 -164 105 145 -207 -144 250 61 -209 -103 205
2188 205 69 -160 -15 147 60 -17 -48 -61 71 -3 -188 -47 153 23 -248 -89 254 17 -191 -79 215 51
2210 51 -162 -51 229 102 -191 -95 169 18 -152 -2 26 -65 -42 -109 -60 118 103 -218 -53 230 55 -208 111
2233A11J26k39j63K38J53k70j18J65J38j53j44J06J92j34j04P5J51j09q1L7L1
2254HR3j05j48J80J90k74j99K98K06l57j10K94M0k66k2K51l0l9k9K9R3j20j9j1
2278d7J45o7o5K7N9K4r2j15J66R4k64q2K57J39l45n1L92o2l47K12J83j70k4Q5
2302E2Ml9j1q4KJ44m0j25l0K10k8k05M8K33m6j87k4K49J5k33K0K53j26k55J24
2327g9J71q8q2M7%l7L3l3l9J84j8j74Q9J56p1j19mK38j11k34R1K64j54k21J97
2352FJ42j79q9J08N6o8l2O6pJ0rn6k6K20m7j90P3K44k08k17J68J68j92j09J64
2377dJ05k00p4J26Q6j5r1P2M6o9K4m7P5N1n4j07P9J34q2j93J14K14k16k02K26
2402bJ92k89l6K20Oj37p1K17M2r5q5N5P5l5p6o0N9M9q1k3R4O0j24j49K29Q3j17
$$ plain form
2233 111 237 -2 -165 73 226 -44 -162 3 141 -12 -156 -50 142 8 -96 -21 130 21 -60 -23 8
2254 8 101 -4 -152 28 218 -56 -255 43 249 -108 -218 76 116 -150 -172 79 49 10 -19 10 103 -17 -36 -47
2278 -47 98 31 -34 -7 52 76 -16 -131 35 129 -135 -217 40 179 -166 -217 175 113 -234 -22 161 -9 -33 52
2302 52 56 17 6 -78 -76 68 28 -97 -127 83 55 -150 -102 131 85 -102 -126 123 138 -95 -75 178 52 -203 -79
2327 -79 92 4 -78 -31 -31 -68 -35 -68 -107 77 59 -115 -26 130 59 -60 -64 174 63 -171 -80 184 30 -191 6
2352 6 148 -31 -120 -12 44 -24 -56 10 3 13 4 -52 -78 142 95 -95 -22 222 14 -203 -35 133 -59 -168 -4
2377 -4 101 -99 -173 -47 39 24 -67 5 51 -18 6 -41 34 85 31 -76 3 137 55 -138 -24 190 -26 -228 -2
2402 -2 190 -99 -135 85 91 -46 -117 100 142 47 -38 17 92 57 -19 -79 -20 29 -52 -75 19 79 -45 -194 35 118 1
2429Aj90K81J18k45p2K26l4j28K6J05n3n3M3p2K4Q6j66J5J43O1k25QK21l5j82
2454i7K6J63O1k52J1J64K2k39NJ74Rk76J51J13l4m9N7n5M9K5p1JJ21P0k87P8J80
2481A20p1j48O9J79r7j70J26Q1l1k02P1J62n0j44K2J60o8j5k0lR9m4n5pJ16o0
2507B0j67Q3J31m6k03J47N5o9j07J65J59k51K8N5J18j40l1R8K2j04PKN0J8p2q5
2533a17P0J65j30j40J02J96k28m8J96O3j70l3J16J8j42L1J06mp5m1R9J8n0o0l0
2558h8O1K9rp8P7J32j53q5J90Q5k53J9J72M4k42O7J50j01r5Q0kNp3kJ0N7K8o6
2586d1m9J88q7k5K5LJ05j61j4R9l2j65J02J68j11r5N0Q1l0j36J33O5m8jl0M7R7
2613A38m5j26L4Q0k1j75M5J23j8j17O1Q0m9q6N2J14p2o6R6Rm0j9K0L7m5pq9R4
$$ plain form
2429 1 -189 92 210 -35 -107 119 85 -43 -17 88 35 -18 25 -47 -23 63 -103 -88 55 116 -109 -101 120 85 -97
2454 -97 -71 92 153 -99 -88 76 98 -141 -136 38 47 -229 -78 35 1 -48 9 -46 3 28 -43 -42 79 149 -138 -60 120
2481 120 49 -99 -30 149 52 -118 8 89 58 -144 -73 89 39 -105 -83 77 9 -6 -26 -29 70 26 -29 -36 80 20
2507 20 -147 -64 67 21 -182 -35 20 -49 -156 9 168 -83 -55 0 118 -22 -53 45 67 -37 -30 -28 22 40 -32 -117
2533 -117 -47 118 -12 -152 -50 146 -82 -130 66 129 -41 -74 42 60 -82 -51 55 51 -24 -65 34 52 2 -58 -88
2558 -88 -27 2 -7 -85 -8 124 -29 -114 76 161 -92 -73 99 143 -99 -32 118 17 -78 2 0 5 -68 -70 -60 -3 25 -41
2586 -41 -90 98 11 -14 11 14 119 -42 -56 43 11 -154 -52 116 5 -90 -40 41 11 -125 8 73 25 24 -6 41 138
2613 138 93 -33 1 81 60 -115 -70 53 35 -82 -21 59 10 -76 -24 90 18 -48 48 57 17 -2 18 55 10 3 -86 8
2641HM0j9r1k6J79l5k50J36J48p7j67J71O3j03k9Q8P7j17l7J04pl2o1j3N5J1n2
2668c6l5L8O6k9j60J29P1mj74J50J17j14q6P8P6j63J0Q0O2r6n1Q7j6k0K7n2Q6
2695D1pj05J7K6O4J5j31J69Lj02p2J61N1j55j06K10k4j26k5J16m6lNRj5O3n3l6
2723e6R2J0j15RQ9L4o8n3J24L1j76lJ50l2j02pJ23l4l7n1J07L1j2p1%j5L3k6l7
2752f2J23j5j26o2J25O4j47M4J33l5j36N9R1M7j68J5J57q7j12J13Q1o6r2M3M9
2777C6o6J17j79oJ50k5q5n7J70p4q9J18J12j78m4Q2P9nk08J30P8oj43J09j5m1
2803d0j2k0M3L3o3k8Q5R2j22q0O8J67j11j24J96M7j79j1J58Lj09r5J44j2j12O3
2829a9J3J4n1L4m3O4M1k6r8Q4J14k44k1J47R0j68m1J58j0j06j6J12l2j3j4Q7j3
$$ plain form
2641 8 48 29 -62 -88 91 56 -194 -58 90 13 -154 17 80 -23 -52 36 113 -4 -41 63 56 24 -37 -50 5 16 -36
2668 -36 -71 -33 33 4 -156 -27 44 40 -134 16 133 19 -67 11 87 -76 -66 14 76 -20 -71 16 0 -20 7 -45 41
2695 41 34 -71 -54 -28 36 51 -80 89 92 -10 -82 79 130 -25 -131 79 55 -71 -96 20 -26 -29 -24 -15 -30 33 -20 -56
2723 -56 36 46 -69 -60 29 63 -5 -58 66 97 -79 -82 68 36 -66 -73 50 16 -21 -72 35 66 54 -17 -17 -32 1 -25 -62
2752 -62 61 46 -80 -142 -17 47 -100 -56 77 42 -94 -35 56 103 -65 -50 107 20 -92 21 102 36 -56 -13 36
2777 36 -30 87 -92 -98 52 27 -58 -115 55 -19 -108 10 122 -56 -100 -18 61 56 -152 -22 56 50 -93 16 1 -40
2803 -40 -52 -72 -29 4 -59 -87 -2 90 -32 -112 -44 123 12 -112 84 131 -48 -59 99 102 -7 -102 42 30 -82 -19
2829 -19 -6 8 -43 -9 -52 12 53 27 -71 13 127 -117 -138 9 99 -69 -110 48 38 -68 -84 28 -4 -17 -31 56 43
2856D3J9j29O6M4n0M0q2Q1L6n7q8J21k6r8J7J34J0j66j3J46o6n6P1P3k9q6N1p
2884aN4k9m0J4R1j00Kp3N7L3l9n8P3M7k8r2J93l1j31K5Q9K9r5MR9p9l8O1o3K0
2914fK5p9l0R7mj8m0R9rr1K5N0Q3j40L8N4m4j38J18K1o2n5O2L7k5nO5m2O7m4q
2945AqN2jj10O0J30p7p3MJ29j10m8N7M5m9j39J30P0j25k3J64m9k3o4M5K8nj8l3
2974d0J1O6qj03L7O2l5o3J11L2r9l6N5M9j02NR9rk7m7Q1OJ3l5m1K6M3n9o7P7L9
3005D1j22j00K30L2j05j9K2J00j21o5J82j1m4p5J12n0l2K9l7R7p0o8rJ26N6j90
3031i1J2Q1J23j31j1O3J9j20l0P9P8j48j8R9Ro1k2R4lk3m0M6qk9Qk3O1ro1L8J26
3062A08qj33k8J29qj39k1J08k6Lj1N8%o8n1N7J3J1k4QO6q3rN5M2k9j21J02J04
$$ plain form
2856 43 62 -67 -1 43 -7 33 -49 32 68 11 -77 44 18 -80 -63 71 81 -85 -98 48 -18 -74 -3 70 41 -45 6 -1
2884 -1 53 24 -16 -2 89 -11 -9 -82 -25 8 -31 -89 -16 31 3 -89 104 73 -58 -33 56 85 -10 -6 93 14 -24 37 -26 -6
2914 -6 19 -60 -90 7 3 -15 -55 44 35 -56 -31 19 102 -38 0 54 10 -128 -10 11 -51 -106 -44 -7 -32 -37 28 -14 53 9 1
2945 1 -7 45 44 -66 -6 124 47 -26 -22 107 -3 -51 6 51 2 -137 -7 63 -62 -85 79 30 7 -57 -12 16 11 -7 -40
2974 -40 -29 37 29 -74 -37 25 -10 -73 38 70 -29 -65 -10 39 -63 -58 41 32 5 -42 39 45 58 23 -18 8 51 -8 -75 2 41
3005 41 -81 -181 49 81 -24 -43 -21 79 -42 -107 75 64 20 -55 57 7 -25 4 -33 64 -6 -74 -83 43 99 -91
3031 -91 -79 2 125 -6 -17 46 65 -55 -85 -6 72 -76 -94 5 14 -47 -69 25 22 -1 -41 5 -3 -32 -24 -47 14 5 -56 -18 108
3062 108 100 -33 -61 68 60 -79 -100 8 -18 -15 -26 32 32 -36 -87 -30 -17 -6 -30 -22 44 -39 -48 7 49 20 -101 1 105
3091A05n1j51P0N5J5j39P5N9m1j04O3Q2m6J9k8P6k6k6%M0l8op5M9J01p7j52J33
3119a8N4j03l4Q9Q1oj82J32N8q2l6n0J97j29o1N3qM5j9r0R4M8m8p6J13l5K4j00
3147h9J19J15j58j10J69L9j63N5L4M8p7q5J08L0r5j5P1Q7m3n4KK5N4p7k0O0L8
3174F8p4m0J00m8p0j9J22Qr9k5J25o7o0L1N7J8j9l2L7N6J1p9l3P8j3n8o3J41K6
3203G9j52NJ56m1q7oM7J1j0j3P2q9P%J5J3o6JO8O6m9j01K9J10kj35K3J12q6PL4
3234A8K5q9RJ2R6p1k5K3l0M1qK5k0ONl9l1R4L0j86J24Pl1o4J21P6j33r1J63%q9
3265c2k6N6%m0k3P5K0m2qJ3L9j9k4jlR9q7o5Q8O1j44MJ8J43j42J2N4M0q7joO5
3297C7o1m7L5N9M5j05OQ6n4K1p0P5K9q5j05J51Mm1q0J12Q2j00o8O6R1j25l3J45
$$ plain form
3091 105 54 -97 -27 28 43 -96 -21 38 -3 -107 -44 38 -8 11 -17 59 33 7 7 47 9 3 -72 -23 78 1 -151 -18
3119 -18 36 -67 -101 -12 69 63 -119 13 71 -11 -47 -97 100 -29 -90 -37 -45 0 -19 -109 -15 33 -15 -91 22 -13 11 -89
3147 -89 30 145 -13 -123 46 85 -78 -23 11 59 -18 -103 5 35 -60 -75 -4 83 40 -14 -12 13 67 -10 -30 30 68
3174 68 -6 -46 54 6 -64 -83 39 47 -52 -77 48 -19 -79 -48 9 27 8 -24 13 69 80 1 -32 46 33 -25 -88 53 79
3203 79 -73 -68 88 47 -40 -46 1 12 2 -11 61 -28 -21 -21 -6 7 -59 -58 10 76 27 -74 -45 65 63 -72 -49 63 -23 -16 18
3234 18 43 -46 -37 -25 71 0 -25 -2 -32 9 1 26 6 12 17 -22 -53 41 71 -115 9 16 -15 -79 42 118 -15 -106 57 57 -32
3265 -32 -58 -2 -2 -42 -65 10 30 -12 -20 -7 32 13 -11 -12 -15 84 -3 -68 20 81 -63 -59 -41 102 -40 -28 26 66 -21 -22 -28 37
3297 37 -24 -71 -36 23 68 -37 -31 55 1 22 -48 27 56 -29 -134 17 21 -20 -100 12 94 -6 -74 -8 83 -42 -75 70
3325G0ro5k9L3M9J4l1l4Q2j8p1p4R5kj17JJ32pq9k5J65nj00l3P7N9m9m7M9K8K1
3356G0j30RJ08n7l0m8J34Mj28N7J40o9j48P3J18k2j48O2J16j00o5j4J36nn4j2
3382cjN4j03k5M2R6j17l6R5L6p7m3O1R1r9m1J5J16m3m6O6j3l2n2K8J50r6o2J9
3411b0P3K2q9KJ7J05j04m9M9R9q1r8L7P8m8l5O7k8j8m5L4J11j27Qk7P7J8k4p4
3440g0J15k4r3N8J00n7p6J4L7O9j36k2J04M8j36M5K7P0j06m5R4J9p6l1P4K5m0
3467a3j13J05M5k5n1k0R3J0o4j9M9O4j21O3M6R2j92J0N1P9j37L7O7nj12J1Q7l1
3495FmoJN9j8j72P3J09No8M3K8k1q0j8J63p8o3k7J42o0n5L8LK1j03N4L2j5J0j14
3526a15L8J08k0o4N1K6%j23P1J35o2k4j6O5p9k5k4P3J3n5l8J05n6m8N6N2pMn6
$$ plain form
3325 70 61 -4 -33 0 49 63 32 -2 80 62 -9 -83 12 10 -107 -106 26 19 -70 -95 70 65 -35 -68 9 68 19 -28 21 49 70
3356 70 -60 -51 57 0 -30 -78 56 60 -68 -11 129 60 -88 -15 103 81 -67 -5 111 11 -54 -68 68 63 9 -3
3382 -3 -4 50 -53 -78 -36 60 -57 -93 2 38 -39 -82 -21 70 -29 -70 -55 61 18 -28 38 25 -7 -59 -31 119 23 -39 -20
3411 -20 53 75 -14 -12 5 110 6 -43 6 105 24 -74 -37 41 -7 -42 25 -3 -21 -66 -32 79 -48 -40 -67 10 28 4 -70
3440 -70 45 21 -72 -14 86 29 -47 -33 4 73 -63 -85 19 67 -69 -24 3 73 -33 -78 16 35 -41 -72 2 27 -13
3467 -13 -126 -21 24 -1 -52 -72 21 31 -33 -52 -3 61 -60 3 49 141 -51 -41 10 89 -48 -11 56 51 -61 -50 37 6
3495 6 2 -4 -3 56 38 -134 -61 48 53 -15 28 56 35 -45 -63 100 22 -41 -68 74 14 -41 -3 0 21 -82 -28 4 -11 -1 -115
3526 -115 -77 31 11 -53 -2 24 24 -99 -28 107 45 21 5 70 -9 -34 -58 15 28 -27 -65 40 -16 -64 -8 44 37 41 -15
3555a5M8K2q3K1kL0q9j5P3M2o3nQJ05j12m9J07K1k0n9lJ18k9r4J6Q4M1j40K8J1
3585cN9k4j15O4J12j38l0O2J03r7%K5O9j33J2O2K5o4k0J0LN4n9m8P0L8j21P2L7
3614B5L5m7n1P7Q5j50jR1m0l0l2P9O3q5j01Q7O4n6ro7R2p5q1J20P3n4j06O1J12
3643G9M9j55K9N0l4l0n6J17J3j28j8J18m2n5j9J47o0r%N0M9p8q6L8Q3k8o1O0Q6
3672A09r5j22J37O3o6j56J49On0o3R1Q9q4j8JK2N9o8pM5mq6l5Q9mpp0O0J02j07
3702b0j15J53P7j31K3pQ1l7r3O7N1k3o5M5L4k5n0J6J3K4l8o4Q8K5k8q9Q4J18k18
3731a04K0R2R9j30m3J56q8lj14J49M0p0o9M2P5n0n8K0J16n7j7kQ6l5q2j8J19k1
3759E3j20L5O7Qn7o3J45l7p4K4L2J2o1k1K5L4N0j17M4R6o0n2L7J37j04j20J02
$$ plain form
3555 -15 33 55 -28 -7 -9 21 -68 -83 -10 32 -31 -36 -28 77 -35 -84 23 44 24 -35 -38 80 51 -43 -27 57 98 -42 -14 -3
3585 -3 56 32 -83 -19 93 -45 -75 -13 90 -7 -7 18 87 -46 -34 28 53 -11 -31 -21 -18 36 -23 -71 -1 37 -84 -12 25
3614 25 60 13 -38 39 124 -26 -27 64 24 -6 -38 41 104 19 -82 5 69 13 4 -63 29 -46 -127 -7 66 12 -94 -33 79
3643 79 128 -27 2 52 18 -12 -68 49 62 -66 -84 34 -8 -63 -82 65 5 -4 -4 46 95 17 -69 -31 52 24 -37 23 109
3672 109 14 -108 29 92 26 -130 19 25 -25 -88 3 92 8 -10 -9 13 72 4 -3 42 38 -48 -83 6 2 -5 -75 -15 87 -20
3702 -20 -135 18 95 -36 -13 -20 61 24 -69 -2 49 26 -39 6 40 15 -35 -19 -6 18 -20 -84 4 29 1 -88 -4 114 -104
3731 -104 -84 8 107 -23 -66 90 2 -1 -115 34 74 4 -65 -23 52 2 -56 -36 80 23 6 4 90 55 -27 -45 74 53
3759 53 -67 -32 35 43 -14 -77 68 31 -43 -19 13 25 -36 -57 -32 2 52 -65 -21 75 15 -37 0 137 33 -87 15
3786A5mJ1r1L5Q7l2m1o3J23n2k4L3P0q1K3m4QP4mj01O1J8j6j07P3P9l0n8l0J33
3816F5j0j10KJ46m5j54Q6L4j1j4L5P2q5n8L2P3l7n2kk8J30l7p7M8P0q3q4P8J00
3845H4p8l2J1L2m0k3K3O7L1j42L6R2lp8oJ6k4pJ1M3K1k5l1M8J1p6l7Q1P1q6l8
3876d8L8QK7l0nM9m4l2J0Q4n6j7k8O1L2o9OK9k9o6KR2R1j00q0O7N8n6o6M6M5m6
3908b7j9k7J21j2J1l9L6J7m8j0NL2n3J9M8j2j12N9J2O4q5J5J8N9o9n5J21Jj22
3937e2l2J26o7K5n4L1M4J2j45J05M3n9o1R9K4k0r7M3M9M6j04JJ05j6n8mJ16o6
3965C4m1n3P5M1l5o1k5J25nj49J34N1p5q2L0Q4Jk06J24J32j20r9R6Q5o5q0jR5
3993A0Mo6qJ35j2p9qN7L5o1j00L8J61j26j1P0j6k5l1O6K9o3k5KJ05l6j68J47%
$$ plain form
3786 15 11 22 -69 -34 53 21 -20 -83 40 -12 -36 -3 67 -14 9 -35 -27 47 43 -58 3 21 5 -102 -29 50 20 -38 -68 65
3816 65 55 -55 -53 93 48 -106 -20 14 3 -11 24 96 11 -47 -15 58 21 -31 -33 -61 69 32 -45 3 73 -10 -94 -16 84
3845 84 6 -26 -15 17 -23 -46 -23 44 75 -67 -31 61 58 -20 -26 -10 -34 -41 -30 13 34 9 -22 26 37 -39 -76 5 76 -10 -48
3876 -48 -10 -2 25 -5 -10 39 -5 -37 -27 57 1 -16 -44 17 49 -20 -14 15 -14 -80 -78 14 105 5 -75 -8 50 -6 -72 -26 19 -27
3908 -27 -46 -73 48 36 47 8 44 61 13 3 8 40 -13 6 54 42 -70 -11 1 65 -20 -5 13 72 3 -52 69 70 -52
3937 -52 -84 42 -25 0 -54 -23 21 33 -112 -7 36 -23 -84 15 39 19 -78 -35 14 60 -44 -43 62 46 -12 -16 100 34
3965 34 -7 -60 15 56 21 -40 -65 60 55 -94 40 91 16 -66 -36 48 49 -157 -33 99 -21 -120 -24 61 -4 -84 -85 10
3993 10 14 -52 -60 75 63 -16 -24 33 68 7 -93 -55 106 -20 -31 39 23 -2 -33 33 62 -1 -26 -24 81 45 -123 24 24
4022B4Km2k8P0on1l0O0K7j7k7N7l9k7j05J38O1j12m8R0Q1j24K6M9L1m6Oj7N2m6
4052Ik3j2J6rM3j8l1N4n1J2N2Nr0lP4o4k9J1N6L4m5mJ8j8J7o5P7l3J5lp4J11r
4085B3n8N7K5pn8pO4j0q5L4O9M4j14j2Q8p5k5J7Q0qq3k0L5O5n8Qo4J26n5k2j3
4116c9P5l9n5K1J02m5m1J2K6j4n1O2L3j3m1o7J47r0l3M1n6O2M3j06Q5J8l2k5K4
4145DR2p7o8J24On4j05O1Q5j42OL4K6M7q8Q0l3j0O5p3J6M4p6l0J09J7q1l7Q4L7
4175F3p0m0J29Ol1o5N3K7j48P8pJ07j21j5M1J6L0r1O0kl6k9NN2J1m5PQ0jo3k1
4206b0R2n2lo0L8M5nk8m8N6l2J1N4M4o7j10J06L5j7q5O0K4J5n3o7Q5jo9PO5l9
4237a9l9L5J2Qp6MJ01%k9n8L2J6M1j7k8L6Qn6jR8o5L5j02R0J2j17P8M3k3mm7Q6
$$ plain form
4022 24 26 -16 -44 26 20 -31 -61 -1 26 9 -18 39 0 -27 -132 6 67 -45 -93 -3 78 -46 -20 29 60 14 20 3 55 9
4052 9 -14 -26 -10 -19 24 6 -25 29 -22 -10 42 47 -43 -46 28 -36 -65 -54 2 36 -9 -13 5 -13 4 -61 16 -17 -2 -5 -79 32 23
4085 23 -35 22 47 40 -18 -25 39 29 -56 -22 47 91 -23 -35 53 -22 -47 -30 50 42 -41 -61 -26 39 -19 -11 -75 51 -4 -26 -39
4116 -39 36 -3 -58 -37 65 20 -21 -9 17 3 -48 14 47 34 -7 -74 73 -17 -50 -9 -65 -3 40 -66 19 37 5 -20 4
4145 4 96 19 -49 75 81 27 -78 -17 68 -74 -68 -34 -8 39 -49 31 -2 -12 53 -20 -4 40 -36 -66 43 60 -21 -58 26 63
4175 63 -7 -47 82 88 57 -8 45 72 -76 2 -5 102 -19 -34 7 23 53 -38 22 20 -16 -45 -40 12 23 -22 -15 65 64 1 -20
4206 -20 72 20 17 -43 -5 40 35 7 -41 15 -17 -6 48 92 25 -85 21 56 39 -46 14 38 53 0 -67 18 17 -52 -45 20 -19
4237 -19 -58 -23 -11 -3 -79 -75 26 26 -3 -61 -29 -13 28 11 -17 19 27 -29 -30 68 3 38 -64 26 38 -79 -1 42 19 15 -32 54
4269E4k2p1k7J22L7j19LP3k5k7n2L2M3l4JJ4K7k9j01J53j3m0o8N3J11j01j6K7
4297EL3k9q1P3mK5r0K5O8N4j36j3P0J17j13LlP5j35m4J04M5n0j4nO1l9m2L1%l
4328a2J0j8j5J1lK7M3k5k8j3J1Q2j02p0Q9R0p9n3P3J9Mp2N9L8q6l6R6m6j5oK1
4359fN9m5r2L6J04q4L7%J4N1q0k7J19p8qp3K8J28j73J06K9q2J0o3P7L5J2p8P2
4388B8j1l6j2J7N8p7QK1Q0j7j13N8K6K1p5KM4j8n5N4k2M4n5K2M1Lj5p6P1oRn4
4420c5j0O8J9o4RN9lj10Q3M4Kn2n5O6Mp0J1O2O2j30m0J02k5o1L4L8K9n5NNLN8
4452E3j23R0P4q3M3k3J6k9p0L8OJ8m1P6m1O3o8L3%Oqo2N2L4p0M1m7Q0j02O4jN3
4484G2j37K6N8K6p0l0P9J1Km0nM2p4J8KN2j8l4l1P1mJ1q5O1P1o2n0J16o1p8J4
$$ plain form
4269 54 32 -39 -66 56 93 -26 -23 50 25 -2 -54 -22 21 -13 -12 2 29 0 -101 52 39 -1 -69 -16 95 -6 -22 5
4297 5 38 9 -72 1 -3 22 -68 -43 25 79 -57 -70 0 117 4 7 4 79 -56 -100 4 49 -1 -15 -20 41 2 -40 -9 -9 -12
4328 -12 -2 -20 -35 -24 -27 0 43 18 -10 -23 -12 70 -32 -102 -13 77 -2 -55 18 37 41 -31 28 66 -20 -56 40 -6 -21 -27 -6
4359 -6 53 8 -84 -48 56 -28 9 9 23 74 -6 -33 86 8 0 -73 -45 83 -90 16 45 -37 -27 -90 -13 22 34 -44 28
4388 28 17 -19 -31 -14 44 -33 -25 -4 76 59 -54 4 30 51 -24 -22 22 4 -51 3 -19 25 -30 -8 33 36 21 -55 16 10 19 -35
4420 -35 -45 23 42 -22 -13 46 43 -67 16 60 62 10 -45 21 25 -45 -34 28 90 -40 -80 22 -3 -64 -30 8 37 -18 -13 -8 -5 53
4452 53 -70 20 94 11 54 31 47 18 -52 -14 -8 10 -31 45 4 67 -1 32 32 38 30 -32 20 54 -16 25 -22 58 -44 20 19 72
4484 72 -65 -39 19 45 -25 -55 24 35 37 -3 -8 34 -40 -22 -20 32 14 -20 -51 20 16 27 -58 3 74 12 -38 78 17 -61 -47
4515d7P1K1n4j2K6N8n7J7oK4Jp3K7K9m4L8p6Q0Om2k9K3R0j79N4R4rr9L2K7Q4j22
4547d7L0M7N1o4j68J43M6o7KL1O1o4l7NJ04J7j47N8P5n8m0j1P3Mq7LP8j2l8j5
4577b7J12n9p8k8J00Np9PK4Q8qj29Q4N2m0j05P9L8n5n2O4J03p5r8O3M4oo9l9J15
4607C1L0j06Q1l6N9kj02Q2Ql7n2P6K2n1n1Q2N4j11k8O6L8l3l1rJ29r1m2k9M7O4
4637E8q0l7J11M4j48M1L7K9j6j6LJ3p3JO9J1p6L3J7L7o6n7P7j9j5m1Q9k0l3K5
4667bm6P8n0m1RO5Kp8l9J67K5r9l1J00l9o6mP1L0p7jN3K3r5M9j6N1o5l4N4O8l7
4699B5m1oJ33j19k1nJ44q6n7l6J09m3p2N4K8k2l5K6O0J2o1j0N8P7q8m7M1N7l4
4728D1p7MNP2j08K1M9oo7K7N7K4r4pJ27l2q9j1Q1Pm5M2OQn4n8J24Mq1%M2k5om4
$$ plain form
4515 -47 24 45 -9 -21 5 63 6 23 17 41 42 -31 -4 25 -19 19 -57 23 29 -13 -42 -19 71 -108 -54 40 31 -68 -36 -9 75 -47
4547 -47 -17 30 81 17 -151 -8 38 -29 -27 4 65 1 -36 -31 73 90 -57 1 76 18 -22 -33 40 44 -43 -40 38 26 -12 -27
4577 -27 85 26 -52 -80 20 25 -54 -47 -23 65 57 -72 12 64 24 -81 -2 36 -19 -71 -7 96 21 -77 -14 30 24 -45 -84 31
4607 31 61 -45 36 0 59 57 -45 37 45 8 -44 32 54 3 -48 34 88 -23 -51 15 53 20 -11 -20 109 18 -24 -53 -6 58
4637 58 -22 -59 52 96 -52 -11 26 55 39 23 26 39 -34 -33 36 47 -29 4 21 58 -8 -65 12 -7 -22 -63 26 6 -27 -2
4667 -2 -48 30 -20 -61 -52 13 15 -63 -102 65 90 -9 -40 60 21 -45 -49 22 52 -25 -26 27 50 -45 4 -12 39 -26 -60 -6 62 25
4699 25 -16 -22 111 -8 -29 -34 110 24 -33 -69 40 -3 -75 -21 7 -15 -50 -24 36 48 -13 -23 35 112 24 -23 18 75 41
4728 41 -36 -32 -27 45 -63 -42 7 1 -66 -39 18 42 -52 -59 68 36 -53 -64 17 24 -21 21 27 35 -19 -77 47 51 -30 -30 12 -13 -19 -63
4762f3J23OJ4j31L3Lj5L4o3J25k8n0j7Q7l1o7K4M2N3j49MJ12j9r9J4R7m3M7j49
4791a06J20N9o2o1J9R7p3l6J9K1p6J07Pl3ln3J0R1lj7q8O5L6n2n2L9L3qk8K1n
4822a2o3j4L4M0K6n6M4K1ll7M1Om5oOP1j3p7j4J19o2nL3K3j7o5K7O8j1q1l0L0
4854b2L1m4J7L3M2j4q3P4J4k8n0K5K3%j06L0J20jr4KP8m3k3KP7n1l4mO3m8J9m9
4886d4N0N5p4pO9l3on8O0j9J0n0QO9Rn0qK1L2j04N4M9m2k2k5J12l4n1MK3kMp9
4919g9R8M2m8m5L4O4p6m6P8O9j14m1Q8Pk3o6N4O2Lj20L8M9Om4KQ4m0j26Q1L8k8
4950Am9m4J30k2q2N9N8k8l6j2N9Oq5nP0N7j37K6L1J29j50jL6M6j8p0nJ09p1j9
4980a7OR5j7j29Q1K9L2j04j4M4P1j41N3P7Rp2p3L9J19j14r2J68l2m8n4J31N6m5
$$ plain form
4762 -63 60 66 80 -51 -18 -15 -30 4 -59 66 38 -12 -29 58 27 -40 -16 26 79 -70 -66 46 27 -72 -58 39 -4 43 -106
4791 -106 14 73 11 -50 -31 66 -7 -43 -24 -3 -79 28 35 2 -1 -54 -44 47 44 27 -61 4 40 -12 -64 -25 8 0 -28 -7 -12
4822 -12 -75 -89 -55 -15 11 -45 -1 20 17 -20 21 27 -18 -24 -18 53 40 -37 -51 68 6 1 34 57 40 -25 2 70 59 -22 -52 -22
4854 -22 9 -35 -18 15 57 43 -40 34 48 20 -30 -5 18 18 -88 -58 62 61 -33 -31 47 4 -19 -17 60 9 -25 -29 34 -14 5 -44
4886 -44 6 61 -13 -20 49 16 10 -48 12 -7 3 -47 -39 30 39 -11 -19 2 34 -70 -16 33 -9 -31 -56 56 22 -29 -25 -2 -4 0 -79
4919 -79 19 61 13 -32 2 66 -10 -56 22 91 -23 -64 24 31 8 -58 -4 58 61 -59 -21 28 34 -10 -8 76 36 -90 -9 29 1
4950 1 -48 -92 38 16 -66 -7 51 23 -13 -25 34 40 -45 -50 20 77 -60 -34 -3 126 -24 -25 11 57 39 -31 -36 73 2 -17
4980 -17 -11 84 67 -62 19 48 80 -24 -38 6 77 -64 -11 66 75 3 -70 -31 88 -26 -118 50 18 -30 -84 47 103 58
5008E8r2K2R6q4n3J9R6p0l7M4J01j06l%L1j7o7N7P2n6l4pO4M3j03k0M6N6j5p6
5038c5M5L9o2l2R1mn6M2Oj6M5j12k7J14j4p3J2K7Nl7L6K4kk1k0O5Rl5p2J43k0
5069F5j07J2M6L1o6n1Q5j0jk4L3L1j7p5kN2Qk9l0R6lr1K3J5N3q5oL2P7j00k3R1
5101C0M8j15L9K2qj0pK0L0l3j02P8K0m8L8%rK0j17J47M0n4n3k0J01m6m5OJ5J9
5131Fk6k3N2mkKp4J15j4r8R3Lk6n4J9J13mq3J0R7j13j7ON9p0L0l2Q1jn0Rk1L2
5164A5p8J3M9J8on9J06j00N4l4K2l9R5q4k9Q0o0pO6J2o7n3P9k7N3k2l4J02j30
5193f5N0o8J76p8j1n5P8Qnl9L0l9Lj3P5J7j22MKJ57k3j07M9Llk4k0K0%r8Q5J4
5225AO3j02L7J7j6jm0J38r6Kn2P7QK0o4N1nn3o5O2N2k2n8Q2k2k1m0j9R3M4o6q3
$$ plain form
5008 58 -34 -12 84 0 -53 -34 62 -8 -45 -1 100 -6 -9 -9 22 5 -62 -5 67 11 -23 -30 34 77 -26 -46 0 56 41 -35
5038 -35 10 49 -13 -45 46 42 -14 28 34 18 63 -49 -76 38 24 -49 -37 -10 -5 -42 -6 18 16 -5 -25 40 49 14 -58 85 65
5069 65 -42 -30 16 47 -19 -70 15 5 4 -20 13 44 27 -48 -50 2 10 -19 -49 47 44 -47 -24 -9 44 -41 -47 -15 62 -38 -61 30
5101 30 78 -37 2 24 16 6 -1 19 49 16 -86 -8 12 -36 2 2 -7 13 -104 43 83 29 -24 -44 57 11 -34 -28 -13 6
5131 6 -20 -43 9 5 3 5 -69 46 32 -66 27 30 4 -50 -31 82 78 -5 5 102 -11 -28 -22 37 -33 -3 -35 46 45 -5 4 -17 15
5164 15 -63 -50 -1 17 11 -48 58 -42 12 -22 0 -39 56 -28 -57 23 -37 -44 22 34 -33 -86 -7 -34 19 -3 -37 65 -65
5193 -65 -15 -83 93 15 4 -51 27 35 30 -9 21 -18 -15 -28 47 64 -58 -54 -52 105 82 -25 24 27 24 0 -20 0 0 -98 -13 1
5225 1 64 -38 -1 16 0 -1 -41 97 1 3 -49 28 36 56 -8 43 38 -15 -80 -18 34 12 -46 36 14 -7 -47 -66 27 71 5 -78
5257g8J01j3nm1Q6Ql6k1J0jp0J2L6O2k3l0M4%k2r2M9Q8k7m3N6Kp6j8M7K6r3O0
5289bl0PqkJ4qM3m2K6K4j9l8l6Q8L2r4L4K2K1Jr5L1J22n8m0n3M0K0m3QP1p9K5
5322a8k5Q6o5pl6P9j4j4J0R9n2q0J8n5J06r2N5l6J38j45k6Q8N2p8j8M1K6l6jM
5352Dk4lJ0J4M1k8J0n6L4j6m9N2N1j1r0Q8O4j11j0oN3Kpl6K8o5LK9N3J1l5m1J5
5385b6NK3o5N4N1l8k9n1J24Mr2o3J65J8j34N3N0p3J5K7P1j15J20j06L9P4q7k7
5413a3QM7ro4L3N3o2l1k0O9n1k7K2P7l8p4M9K8O2n6j9L4kp2M4P7p9J9MN3pn4l3
5446c2R2k4l4n1O1Pjq5J08K4p9%k4Q3k0p0O0oK7r0O8L7oo7JlK3J3o5N5Qm6J1J3
5480a2K9J2Lj2N1o4o6J00j4l8L5n4LP1p7JJ2M7o3k9L1Q0j05K0O8nOm4oQ8r9j5
$$ plain form
5257 -78 23 10 5 -36 50 58 22 1 11 10 -60 -48 -12 50 27 -3 41 41 19 -73 -24 64 37 -6 50 52 -24 -42 5 31 -62 -2
5289 -2 -32 -25 -33 -35 -21 -29 14 -28 -2 22 3 -35 -71 17 49 -45 -11 11 32 33 -62 -31 91 33 -7 -60 -20 0 -43 -35 36 -43 -18
5322 -18 -43 43 -22 -29 -65 14 0 -14 -4 95 43 -37 -19 -74 32 -60 -5 -41 97 -48 -74 14 66 -12 -30 11 37 1 0 4
5352 4 -20 -23 -13 1 42 14 24 -32 2 -14 -63 -11 40 29 -61 27 91 -20 -30 -36 17 19 12 -24 4 -61 -58 -29 24 35 0 -41 -26
5385 -26 -21 2 -63 -9 42 4 -25 -76 48 52 -40 -103 62 80 -54 -1 49 -24 -9 18 89 -26 94 -12 27 101 14 -13
5413 -13 -5 42 33 -31 2 55 -7 -38 -58 11 -40 -67 -45 32 -6 -80 -31 -3 59 3 -16 18 16 -56 -12 65 -14 5 9 62 55 1 -32
5446 -32 60 36 2 -49 12 19 18 -67 41 65 -14 -14 -38 45 25 -45 15 9 36 -54 14 51 45 -22 -21 -24 -1 12 -53 2 10 -36 -25 -12
5480 -12 17 29 32 20 71 7 -59 41 27 -11 24 -30 -27 44 -33 -32 -20 27 -36 -65 -34 46 -59 -39 29 24 30 -14 -20 68 -31 -46
5512d6Q0o0Kj6J01j05O3o2N9Oj02M3L2Mj5k0RQ2jm8QK2J2p6m7J69j31K3MN9ln1
5544eMJ4pl3m0R2Ql5rK9L6o6n1Q3Q3p1p7J9Q5l8k0L0k9k6K0N4Ll3k2j9k1P8n9
5577b3QL9j7l5kM2nJ5n6M3m0lO4qJ9l6RL7m9nJ4j7nn4N4j4K1M3n1kM8K5q9PlK2
5613dj3KP0j6l3j9M2k9J2n2J9M3n1m8J30m0l0m3M5J6J4j7J6j0N4q9qJ9L0QmKO4
5646H0n1k6M1lj8j9N0k0l9%M9mK3o2K4K5n4K2rqOk9L6m8M5k7rO2n2Ql3L7L7j12
5680g8J4R3k1n6P9L1j9j3o1P7o4qj9R6mq7j9O3j1%k3J1J3P8j07j5L8%K5l9M9k9
5712fk8o0J25nm9J4j0k6L4K0j4L8k3n6Q3k1Rq2M1J5jPK2jor8M6P8J2o5k4J18o0
5745B7j6k8Q2p7n7O1M9N0j13Q5o7N4n0m1P0l8Nm9J10o6Pl1L5L1m9L8l5J17q0m8
$$ plain form
5512 -46 34 -26 -24 -40 61 -44 19 -43 16 22 -80 -37 -5 -1 -16 -36 -27 55 54 6 14 36 48 -28 -75 94 -37 -14 -10 49 46 -5
5544 -5 -1 13 6 -27 -67 25 33 -2 -11 18 54 -12 -63 20 103 32 -45 -26 59 21 1 31 2 -24 -4 50 53 20 -2 -21 -42 36 -23
5577 -23 -15 24 7 -28 -30 12 7 22 -34 9 -31 -34 30 22 41 5 14 51 2 -3 11 -6 -11 -65 -11 -25 -4 39 -12 -14 34 59 -30 -23 -26 -4
5613 -4 -17 -15 55 39 6 -13 29 0 12 -40 -21 22 -29 -77 53 13 -17 -60 -15 1 15 -2 14 4 58 -31 -39 -20 10 18 14 16 80
5646 80 29 3 44 41 23 4 54 34 -5 -5 44 40 63 1 25 50 -4 18 9 1 7 -22 14 -34 11 -16 -25 37 -15 -7 -40 -3 34 -78
5680 -78 -64 29 8 -48 31 62 43 30 -31 46 -18 -26 -45 51 47 -40 -59 4 -7 -7 -30 -19 -6 72 -35 -50 -12 -12 13 -26 23 -6
5712 -6 -34 -94 31 26 -23 -9 -19 -45 -11 9 -5 33 10 -46 37 16 25 -57 -16 -1 -2 5 27 26 20 -78 -32 46 58 -7 -31 87 27
5745 27 11 -17 65 -12 -69 -8 41 91 -22 63 -4 50 0 -41 29 -9 -4 -53 57 -9 -2 -33 2 33 -16 22 -13 104 24 -24
5775b4L1K0L7n0m3O1k7j1rM9j1j1n3L2k0K9k6O6q7P8l8K9%K2q1L8j7K4J2j01O9
5806a2j6PM9j4oj4%L2J6k0m1M5m3J2K2K0Jm0k7N3l7rNk7Q4l1lK3o6J2l5L0O7j1
5840B6m2J1oL7n9RP5m5j5%M1l8J7p6Q2L3j5m8L4J7r6K4N3N3j08N7q5J19k5m4O1
5871D7Np6mK4J05q1n5J9M3p9N6kJ9mm2kN1Qj8k7P6p2l2qM4N5p7K0M8Pn6K5l2K5
5905A0nj1K3Jmk5QL0k5K4K5o1L1l2k4J02j06l3j4J04Po5ML1K2n7l0Q7mm4J8LJ6
5938FJ8p7J9R0q1O0m8K8Rn6J4Nj4L5j2Q9l3j17O4Jlk5QL7j1k3k6LR9p8l7J37r9
5971a8Rl6O8k6Jk3j0N6J6p6QL0Rl5k3P0k0k0m0J16jo5M7pj3j5L9l8PJ6L7p4J6
6004EK8p0K2Q8l6n9PO2m8m2O0l1J1j1J9j1Rn9R7p1M2k4lO6l2o2K3J3O9j31O7L5
$$ plain form
5775 -24 7 27 64 14 -29 32 5 -6 -15 34 23 12 -41 -9 -29 0 -26 40 -47 31 -7 22 22 44 -37 1 -16 8 20 -81 -12
5806 -12 -28 -21 28 14 8 -6 -6 26 42 22 -19 26 -17 -5 17 37 38 -2 -29 24 -13 -22 -17 -44 40 9 6 29 -37 -25 -60 -30 37 26
5840 26 -16 -5 -11 26 -33 -24 51 6 -9 -9 32 -6 11 -65 17 50 35 -13 21 38 -58 -34 19 72 -36 21 -64 55 30 -14 47
5871 47 52 -24 -28 -4 101 20 -35 -16 27 -52 4 2 21 17 -25 -27 24 32 14 -13 63 -9 -41 -49 -5 50 -27 -7 41 48 -8 17 -15 10
5905 10 5 -6 17 18 14 -11 -3 27 2 26 51 -10 21 -11 -35 67 -39 -72 -86 18 25 -40 -36 -5 17 -40 -70 17 13 -31 -13 -10 6
5938 6 24 -53 -34 56 -25 35 -13 15 24 -32 -18 -13 -27 8 -4 85 52 -65 -1 0 -3 -28 -20 17 6 -17 -43 -40 59 -19 -56 81 -18
5971 -18 -9 -45 23 -3 -2 -25 -35 21 37 -39 -31 -1 8 -27 -50 20 0 -20 -60 56 55 -10 37 30 17 2 41 3 10 26 63 -11 5
6004 5 33 -37 -15 73 37 -22 -15 47 -1 -43 17 -14 -3 -14 5 -6 3 -56 41 -30 12 -12 -15 51 19 -43 -20 -7 62 -69 -2 33
6036C3l2l4m5J20k3J1l7j4L4j0k3NL6m1j3ML0j1M3J6j7q4k0K8Q1j7m6N6J2l0k6
6067a4M7m0onPj5P2o8L5p1P9m1j2MK5O0o5K4%rk1L2L0J5p1k8P0om9n6P2M1j08
6100g2J3M5%k8M4p1Q7k2pJ4L4k4m3O4n1O0o2j0LO2n4PO5n3K7Mn4N1q0J05q2J8
6132a0l6J5J9K0K2o7L6J3J3l5k8N5r6R0nPj7j4M9K7n2j9K9j1L8j6j25O4M0q6J10
6163C0j3l6K7k6P0m8j6rJ9Qk0J9j1L5q7pQ2l1M7j00Q3k4J4j0j8J6l7nR8mq6Pl
6196c6N4M8j6k9J7l3jOk1L4P1m1q9L3l6PM1q1J02o7Q2j3n0K7n0k3P8j3j9rO6m3
6228dl9L3Ll3j5O0J0k7j7P0m3J0J6k3j2J9J2k9N2rj6j9Q7o9l6K5pK5o4j1L0J5
6260fJ6o2O2j3l3M9n3K2l0K6J6k5N0J1Jl1j3M0q8L4R9p2J6Km6P8q8O2lo3K7pL0
$$ plain form
6036 33 1 -33 -78 42 19 30 -7 -21 13 3 -20 -15 21 -20 -33 -29 1 -10 33 49 32 -52 -72 -44 37 20 -26 30 42 12 -14
6067 -14 33 -7 -13 -18 -11 -26 46 -22 13 -58 21 -20 -32 -28 -3 57 -8 16 16 7 -14 18 48 63 -8 -36 34 28 -21 -77 -5 36 -72
6100 -72 -59 -14 -14 -42 2 -69 18 -4 -11 3 37 13 -30 34 -17 43 -19 -29 -26 36 -18 -11 54 1 28 32 -22 29 -51 54 -28 -10
6132 -10 -46 -31 -12 8 30 -37 -1 12 25 -10 -38 17 -79 11 6 13 -4 -18 31 58 6 -13 16 5 43 27 -98 -34 6 -80 30
6163 30 17 -19 8 -18 52 4 -12 -21 -2 6 -14 5 -6 29 -58 -65 17 -14 33 -67 16 -8 6 -4 -22 -6 -43 -48 50 46 -40 -33 -36
6196 -36 18 66 50 21 38 5 4 10 -11 23 94 53 -36 -3 -39 -32 9 -72 30 -37 45 32 -18 9 -41 -64 14 1 -18 -27 39 -4
6228 -4 -43 -10 -7 -40 -55 5 15 -12 -29 41 -2 8 24 1 -11 8 20 -9 43 34 18 -1 86 17 -19 6 -1 24 -40 -51 -21 -6
6260 -6 10 -52 10 -3 -36 13 -40 -18 -48 -22 -6 -31 19 30 31 0 -13 27 -61 -27 72 0 16 18 -28 50 -38 24 21 -42 -15 -22 8
6293Hjo9P4k9K1L6k3k0l9M9lJ0j8j5k0O5r6O3K2j7l7J6L6k4J9M4o3OJ6m6j6L6
6325a5K9JKM8p4M0k9j0M7n0jk0L9m2M5J4m1Ll7P9k0l5L2k9QQ3q2k0Q2o8K6l5M0
6358A0M0j7j09R8m2MJ1j2Mpj4Q4k5kk1J0j7O5jr1O8j1l2J3mP0o3k5LM8o9P3o9
6391c0M3j3m6N4k5j9k6M0m6L8L3mk1k2K3O2n8N8Ko8Q4j4Po2M7o0j5N1j2l1L3l2
6423b9Q0j00N4Lq5M3m6P0j4PM1j1m2k1N2j4k1j2N5o2O4QK0p5J06r4M3l4N1nr6
6454f4NM1M6k0Nj2RK9l3JJ6M9k8l0r1P5k4JL9j8n7R7om1mK1rJ6K9r7L9QMN9p8
6489b3k1N8k2L4K2l0m4J3K2M2n7Lj5N0o4J7K9j6Pj7kL9j8J6jK1nm3kO7p1n9N0
6522b0pK6k2M3k1l8K2pM6k2o4Q5k2m2N8k9M2m7NL6KN5m9jJ9n4M2o2J0M8Jo6mJ24
$$ plain form
6293 8 7 -62 12 -17 4 40 17 -3 -42 7 4 14 -4 -19 -39 26 -70 -7 15 -2 -39 -23 13 -11 8 52 -11 -5 11 -35 -51 -15
6325 -15 14 15 17 65 -9 31 2 -8 39 -11 -12 -32 7 -35 10 24 -17 -14 -51 28 8 -27 5 -24 -16 67 -15 -35 47 -21 5 -30 10
6358 10 50 33 -76 22 -20 -16 -5 -17 -13 -20 -34 50 25 23 2 12 -5 60 59 -32 36 25 -7 6 2 72 9 -16 -13 35 -34 39 -30
6391 -30 13 0 -46 8 -17 -36 -62 -22 -68 -30 3 -1 -22 -44 -21 41 -17 41 43 -25 59 45 52 -10 37 -23 -38 13 1 -30 3 -29
6423 -29 51 -49 5 8 -77 -34 -80 -10 -24 -17 24 13 -29 -50 2 -12 -33 -45 10 -52 12 20 40 -35 71 -23 20 -14 37 32 -64
6454 -64 -59 -18 28 8 13 1 10 39 6 7 23 72 44 14 -77 -2 -26 -25 14 -4 -61 36 30 -11 -15 6 -3 13 42 -55 -16 -8 -4 55 -23
6489 -23 -44 14 -8 26 48 18 -26 -13 9 51 -6 -3 -18 32 -32 -15 14 -2 5 -12 -14 25 7 23 22 43 38 -5 -7 60 -11 -70 -20
6522 -20 -27 -1 -23 20 -1 -39 -17 -24 22 0 -64 21 -1 -43 15 -14 28 -19 -14 22 24 79 30 29 48 -6 36 -26 -16 32 33 -33 -37 87
6556H7n7j8j7pl4J6k1J6M9l3J2mn%k1k3R1n8MP5n1j9K4kK0n0L7j9l9K7l1M1L8
6589B8rm0K9J9k7Kk1k9M4K1j9k5lJ6J5n2R5l8k6J8Kr7R2L0L8n5K3Mk3o8O5n4j1
6622e6J4M3k5P2k6j8O9q4rk4J25o1J5k3L0p8O7o4M6K9n0M6o5kR2p1L7l1K9L4q5
6653b4J4Lk4QKO6n6m1M9K5L7q9J0K2J1l%L2om3J8J4Kj9m7Q5j9k9j1J7m7L4J8K9
6687C8q4O3m2K1J4p3L2K4J0m7N5p1N8Rk4K8mOj3J4J0j9M2k0k6j5J7L9k9NOJ0k0
6720A4L9l7Mnl0Qj6M0J5jo4J8j5k7K3j4J13m4n2R6j31N9K1NNM5r9K8j8J5k5L1
6752Ak0K8L6o6J1K7Jk3K6J2m4J4K4m0L7j7L4o9K4j5l3L5m5O8n6M2n3K2klN3j5
6784fj1p%Qk0O8l7M0n9N7j3M4m1l1Pj1K7o4O0ljk0jK0l1M0qJ5J2k8%k8k1K0M0
$$ plain form
6556 87 30 12 -5 -12 -46 -30 -51 -35 14 -19 -7 -11 -16 -16 -37 -60 31 -27 -23 52 1 -18 6 4 24 -26 11 -8 -47 -20 -51 -10 28
6589 28 19 -21 8 27 0 2 -19 -48 -4 17 -2 -27 -30 -14 1 -51 44 6 -20 -2 0 -97 -5 25 63 8 31 35 12 -56 9 -45 -56
6622 -56 -42 1 -24 48 22 4 73 -11 -20 -44 81 20 35 12 42 -36 31 -33 13 42 -8 38 -27 -29 63 -8 29 -2 27 61 -24
6653 -24 -10 -7 -31 -23 -21 45 -11 -52 -3 22 59 -30 -20 2 13 10 10 42 36 -7 11 25 27 8 -39 46 27 -2 -13 4 -43 -9 9 38
6687 38 -46 17 -25 -4 10 -63 -31 -7 3 -44 11 -60 -2 7 -17 11 7 13 0 14 24 5 47 27 1 -14 3 42 13 18 24 34 14
6720 14 53 16 20 15 -15 -7 -23 17 32 31 -33 -15 -30 -57 -34 -48 65 21 -31 65 -66 -7 14 19 24 69 -30 -2 -20 -5 -30 1
6752 1 -19 9 45 -21 -10 17 18 -5 21 33 -11 3 27 -13 24 7 41 -28 -4 -19 -52 -17 -62 6 -50 -8 -61 -39 -41 -44 9 -6
6784 -6 -17 -24 -24 -16 -36 32 -5 35 -24 33 20 64 23 -8 -1 -12 15 -49 11 8 7 -13 -14 6 -25 15 7 22 34 6 6 -22 -43 -23 17
6819A7l7RM2qn1J5k4L7j0j4K1j0K1rm6J02l5mk6j2M1Ok1N1l9j9K4k4J2OK1Qm6
6852bJ1m4k9M8Km2N0L9l8k5K7m9NK8k3KN6L2o3l6R8qn5L5n4M1n3N9j4k6O2m8%
6885a4M%pk9N2lMj8O4q1N5l1M2J5l9K3k1j1k0L0j5J8Pk3K0j1J7m7L7j3PJkLJ5
6920B9k0Rp4J54q5L3l4L2n5K5om7L8pNk7l5J7R2k4ln8J20r8K9L0q5K6nJ3k7L2
6952fN7q1nL8j3M9k4l3K4J3JKL3m8o0Q0J0%m3L2L2j19PQ4m3K0lK3m8R4o0j7N1
6985D7p8n3M4K9L6k0k4K1N7p8j1M8ol7K4J2j8J6n2N1j5M8J0Ql2j9o2M2k9N3j5
7016cn1O4k0m6L1P1l9j2l9P2j9q8Q7J6k4oj5M2o4J6pPK8J6m2J0K7Pn6L4j8J8o2
7049f5J02m9j8M2OK2m7j1j0K1J6p0P1k9K2l3j9L1N2p0N1J4l8K3j6K4k4L5j06R7
$$ plain form
6819 17 -20 -11 31 23 -28 -13 -37 0 -10 -24 -3 -13 8 -1 -47 55 20 16 -10 -22 19 25 4 55 16 -3 21 -3 9 15 36 44 -2
6852 -2 9 -35 -64 -16 -14 -56 -6 33 -5 -30 -3 -52 -47 -19 -42 -40 16 48 -15 -51 47 39 -16 19 -35 6 -47 12 -2 -28 34 -14 -14
6885 -14 -10 -10 -17 -46 6 3 7 -11 53 -28 27 -4 38 53 14 37 16 5 -15 15 0 18 25 2 22 11 28 -19 18 5 12 13 11 14 29
6920 29 9 18 -56 98 13 46 12 44 -11 14 8 -39 -1 -8 -3 -30 -65 -48 44 20 17 -41 79 -19 10 40 -45 -19 -24 -11 -38 -6
6952 -6 51 -30 -35 3 -10 39 15 -18 6 19 20 22 55 7 -53 27 37 37 -6 26 58 -61 -54 30 -13 7 4 27 -21 73 13 -4 47
6985 47 -31 -84 -40 -11 25 5 -19 2 59 -19 -30 18 12 -25 -1 11 -7 9 -43 8 -7 41 51 59 27 8 -54 -12 -41 12 -3
7016 -3 -54 10 -10 -56 -25 46 7 -5 -44 28 9 -79 8 24 0 -6 -21 21 -43 -27 -34 -27 1 17 -25 -15 12 19 -37 -3 -21 -3 -65
7049 -65 37 -12 -30 12 18 40 -7 -18 -28 -7 9 -61 10 -19 3 -30 -49 -18 34 -36 15 29 -9 14 -2 22 -2 33 -73 24
7079B4N4r4K7J3j9l2M3kj2Rm4N3nKK0l3J8l1j1P1n3qj7J6N5l0K8m9Q8m7p4k8M6
7112b2lm6K1J8M0k5N2n4M7kk5NJ9l8N6o0O8l6J2j4%K2n7O4Nnm9l5M7Ml6j8L1P9
7146F5n4k2J8p4O4J2j6k6M4n1K5k2K3J1O4o4nJ2n2N5nKm0O3Qj9l8kN4n4N9Mq1
7179d2L3oL5LJ7n0jL0j6K5j5K9l8j6j9M5o1J4NL5k3JO7p4J04j09K8K0M8q3l8L5
7211a7j0nQ5m3L9p7l0J3R9l9rK6k9J7l0L8j3N3q1jN2j6K6r0L2K9l7L4j7m6N1k1
7243a7N8l1q3R0J2J7p4L9k4pO5Jj7J0j2k6kQJ1l2NmL1j2k2L1n0K2L4j8nLk7O8
7277D2p4%L0L9j8k9nL2%k5k7O1n8M6nm6O8l2kO9l7m8M7k9m9R6Mm3O6k0q2J6J9
7310FM4p7NL0p6K2N7K4Ll9%K9k7j8oM1k6mpM4jK7n0k7L0n1N2L0j6M4q4K0l4J09
$$ plain form
7079 24 78 -16 11 24 5 -27 16 14 2 11 -33 20 15 17 37 4 22 -9 -20 51 -2 -10 -27 -11 44 14 42 -7 81 34 -40 -68 -22
7112 -22 -25 -71 -50 -32 8 -17 35 -19 28 26 1 6 25 -13 43 -17 51 15 27 13 13 35 -22 42 47 42 -7 -42 5 9 -27 -45 -14 65
7146 65 11 -11 7 -67 -3 9 -7 -33 11 -40 -15 -37 -14 -3 61 -3 -8 4 -48 7 2 4 -36 27 35 16 -22 -24 30 -24 35 39 -42
7179 -42 -9 -15 20 23 40 -10 -11 19 3 28 13 42 4 -12 -31 14 -47 -33 -28 7 -16 -15 52 -22 82 -27 1 21 69 -14 -52 -17
7211 -17 -27 -32 53 10 49 -28 -58 -45 54 15 6 32 3 20 -10 28 15 68 -13 -14 38 22 48 -42 -10 19 -18 16 -1 -47 4 -17
7243 -17 41 10 -73 17 29 46 -28 11 -13 -20 45 46 29 39 27 1 -1 7 18 -14 -9 -13 18 6 -16 15 -35 -13 21 3 -2 1 -26 42
7277 42 -32 -32 -2 37 19 -10 -15 17 17 -8 -35 26 -32 14 9 -37 31 -1 -3 66 29 -19 28 -1 -50 46 50 7 73 53 -29 -13 6
7310 6 50 -27 -22 8 -68 -46 11 35 38 -1 -1 28 1 -17 -23 18 -8 -12 -19 25 24 51 1 -26 4 -47 5 35 19 63 -21 -1 -35 74
7344G4n8J2J3k8j6L2n1M7k4K1p4N1L2Qkk5J1k9m2R4l7m2K1L5m4P2n0L5r1j3Q4
7375A6r4O1K4k3J0K7n1N0j2m1N0l0P9j7p6N7o5L3K0k1M1ql3K8l1K6p6O7J6m6N0
7406C1l9lL6p8N9m1QK1KjjK6n0r9J13Q3n4pj1M3K6n8L2o3k0N9J6rmRl4j4j1J3
7440b0J0L5j1o6K6M3Mm4K0l1K5mK4l6k3N7m6Q5o5K9n1O2J5m1L7m6QJ6%m9J0L4
7472Gk7Q3k6lm6N9l9J5rM1p6pK6J8p8M5kK6M1n2j0rJ1rk2j4O8lm3M6n5K2QQJ9
7507A3J9o6K0O9m6k1mJ1P0o5M6o3NN9Nm5K0j1M0l2l8Q0r1M1l9L3NKo0L7NK5p8
7540e4J30p6k4K5J4k9N4l7N0k7k3k5K5j4K4rk6loM9K2n4KK6m4J24j08Q2m6k2O
7571FJ2o9M4L1L5p5J4nqqJ7jM6m7l7N1J3k5%j7lk0P3olnn2L9jM2l9P6j18Q5j00
$$ plain form
7344 74 16 28 41 13 -3 29 -22 25 1 22 -52 -1 31 39 37 12 23 -6 -48 46 9 -33 -12 23 -21 51 1 36 -55 -68 16
7375 16 -78 -17 7 -16 -6 21 -30 20 8 -33 17 -13 66 49 -27 30 -35 -2 18 -3 38 30 -3 25 -6 20 -56 11 27 -19 31
7406 31 -8 -11 25 -53 6 -35 -27 -6 -4 -5 -6 20 -30 -129 -16 67 13 6 -5 38 64 6 38 -25 -45 14 30 21 17 26 -8 -22 -33 -20
7440 -20 -10 25 14 -52 -26 17 21 -23 -3 -34 -9 -13 11 -25 -48 9 -37 48 -17 12 -39 23 38 -3 34 -12 -4 12 12 -37 -27 7
7472 7 -20 63 37 34 -12 47 8 23 14 55 -21 -28 -2 16 -62 -17 -19 7 48 -4 -14 -23 -12 -21 -43 -57 11 8 -35 11 -44 -22 -14 -6 13
7507 13 32 -34 -14 55 9 -12 -16 -5 65 0 46 -17 -12 47 52 7 27 16 56 24 -14 66 -25 16 -23 10 15 17 -43 -6 -1 24 -54
7540 -54 76 0 -24 1 15 -14 40 3 53 26 3 -22 3 -11 13 4 -22 -25 -31 18 40 -14 -12 14 -30 94 -14 68 22 0 6
7571 6 18 -51 -7 24 59 -16 -2 -7 -15 -23 -6 -7 39 -8 -45 6 19 -6 -6 -23 -26 -46 27 21 18 13 -39 0 -1 41 2 78 -40 45 -55
7606e5J02o5L1oj1k5R0l1n3M1k5l1P9o3l5L4%K4o4K6L9n3N3j1l8P2k5K8rm2NK2
7638DolM4k1q0K8KN1l2k1L7m%r1J18J5o5M3k2L1j8j1j3L8nnnj3j7jLk2ML2L0K0
7674D5k3k0K7ol9N0lQp8O1pOl3rJ9L9k5K3m3nK1k0L0Nj1nL2l5K3o2O8m8mJ5l4
7709c8L8kk9M9q9P4l1K1O1j6j05Q9m5P4n1L3J0l9oM3n9L5k9pK2qN7n9lkL5k1%
7742Bj5PQm5O0Pj3k0j8N2k0K3n9K0l3L0j9Q1p4m3Q2ro2M7M4j3m0RK4L6m3mP2p1
7776Ck8K1m9P4j0m1K7K3m8mL3N0j1p6oN8n3O5J2k3l6l2M1k5R3j12rO2j1O5o5O9
7808E7k0j7j0pRj1M1n2N2k3L5p8M0Rl5J1K1ml7O2q4N4n2N0m3M6Lp5Q2K5p2P2n8
7841iL9j5n5L1k3O1l4k3nQ7j5l7L5k5oK8K8k1j0J3n5L9Kr6P3n3mj3O4nK6m2m1
$$ plain form
7606 -55 47 -18 13 7 -4 -29 61 30 -23 18 -7 -38 41 -22 -57 -23 -23 1 -63 -37 2 -51 2 -9 -47 25 0 28 19 -23 -18 4
7638 4 -2 -5 39 18 -62 -34 -32 19 -13 -34 3 -1 -1 -92 26 41 -24 19 -3 28 10 -1 -14 24 19 14 9 -4 -21 -22 -19 -41 -37 -5 25 45
7674 45 22 2 29 23 -16 34 31 39 -39 22 15 21 -12 -21 -2 37 12 35 -8 -13 8 -12 18 23 12 7 39 4 27 -35 33 -15 -19 -4 -38
7709 -38 0 -2 -31 18 -71 3 -28 -7 54 38 -67 22 -23 51 0 33 43 4 -2 41 -18 17 -12 -19 3 -5 52 -7 -10 -12 23 2 2
7742 2 -13 -6 2 -43 17 24 11 -9 -27 25 5 28 -31 -11 -44 -14 -33 48 -26 -69 13 4 -58 -11 33 20 -20 -11 13 49 6 2 74 3
7776 3 -25 -4 -53 21 11 -30 -3 20 -28 -32 1 51 40 -36 -42 16 -37 28 40 17 -19 -51 -10 -35 58 -54 -63 -1 -12 53 -12 57
7808 57 37 20 10 3 12 1 42 -10 42 19 54 -24 16 25 -10 1 22 18 -19 43 -41 13 -39 11 -32 14 17 -58 24 49 -23 49 -9
7841 -9 30 15 -40 -9 -32 29 -5 -28 -33 54 39 2 37 12 6 34 62 41 31 44 -11 28 30 -66 7 -46 -50 -63 1 -4 22 -20 -61
7874f1J23m7On2j8M6k5K1on2O1j6OL0%k9qj5O5p1N3j9L3j8J8j6K3p0M4N5L0q9
7906BK5l0NN2l5L0q8O6r7J22o5j5kk5O4J0o1M9J4l1l0M0L3o3j7M1lk6P8m1J3k1
7938fk4M4jj8J5j2N3k5k9mOK0J5o8K4j4lN2n8K7jK3k8OK5p1M0Kk2rM2qK3k0K0
7973A6m9J11n8p0M6J6m5K9L5M6o7k4N7o9L9K4q3R4l7Mm2L8k4l3J4K7k2J9l9J4
8003c3J9%%m7L9l5O7K7m5N0q6K4O0m1L2l2K7l7k0M1JJ8K4o8RK2K5j7M4m8l3MM8
8036C9l5Jk2K8j6kPK1j9JL2j1n0R0m9l3J7j9pO7l8N9o1L2K4o5K4J2j6m7J2K7J7
8069B0J0j5lO2r8L4m6Q0l8lm2O1p0N2OOMl7M1k4M0n6Ol3J2N6k0Lk5K4K9k9j6J9
8103A0o2O5k8O6n5J9J9nj5Ol4L2lL9l0j5p4K8Q8j5k2olk7L8MNMOjrp2N6n0J8K4
$$ plain form
7874 -61 62 15 21 -31 -49 -3 -28 -7 -13 -65 -4 -20 -14 16 16 -13 -21 -36 29 -42 11 -8 25 7 25 9 32 -38 6 61 91 2
7906 2 27 -3 2 54 19 49 -39 27 -70 52 -13 -28 -30 -55 9 19 -42 7 21 -10 -40 0 33 -30 -47 -6 -9 -35 43 2 15 -6
7938 -6 -30 14 13 -5 10 -2 51 26 -3 -7 -1 19 34 -34 -10 -24 -27 25 -33 -6 -7 16 -12 -6 19 -52 -12 -10 -32 -41 1 -7 16 -4 16
7973 16 -33 78 20 -50 -4 12 -33 -4 31 77 10 -14 43 -26 13 37 -46 48 11 15 -27 11 -13 -46 -32 -5 -27 -8 -47 -33
8003 -33 -14 -14 -14 -61 -22 -57 10 37 -8 42 -44 -20 40 -1 31 -1 26 -11 -31 10 11 29 53 -15 -6 16 41 24 68 20 -13 -9 39
8036 39 4 5 -17 11 -5 -7 0 21 2 3 35 24 -26 64 15 -18 -1 -20 -27 40 2 61 0 32 56 -9 15 27 11 -36 -24 3 20
8069 20 30 15 12 74 -24 10 -36 44 6 3 -39 22 -48 4 10 16 20 -17 24 0 40 -16 -10 -43 -31 25 5 8 -17 7 36 7 -9 10
8103 10 -52 13 -15 51 -4 15 34 29 14 20 -14 18 15 54 24 9 -65 -37 51 36 14 8 5 -22 16 20 25 29 35 34 25 -47 9 -41 -23 1
8139AK6Jj8l2j2J7K3k9N0j3l5j1N3k9Ok1P9j0l0j5Lj0j8Q3r4L9l7P6p2J0J3l8
8171d4K3L1kK3m1L1o8M0PK8j7j9MOjJ7l5L2p5O8
$$ plain form
8139 1 27 28 10 -22 -34 -17 6 -23 27 14 -21 -32 21 -8 -2 -23 56 46 16 1 4 -6 -24 59 -35 4 -33 43 -29 -19 -6 -44
8171 -44 -21 10 8 31 -10 21 -47 -7 0 28 11 -8 -4 2 1 18 -17 15 -60 8
8191H
$$ Imaginary data points
##PAGE= N=2
##DATA TABLE= (X++(I..I)), XYDATA
0@%%%%%%%%%%%%%%%%jRj6J6j6J6k2L0l2L3m1M8n6O4p2Q8r7J06j21J37j54J75j98
39a04K19k44K73l04L37l70M08m54N02n50O06o70P35q08Q92r86J091j208J345j504
59g94J688j908K176k509K941l523M349n620P860j2947M5415l796p7085O1036K4435
74D1718n4367j4809L7816r124j4264K110m20P421J6235j7944q178K5005K828k2959
88h932O608J0945m348m55o625p720K2965L168l6109P355L9676k4485l3099L4920
102C864J8756l6496k376K7300o056r469Q993m971j900J3491r568j5788J8924J1879
116A6583k4637q621K2862O437j8409o995J6651J0932j8715j5032K3648J5668k8147
129g775j1260K9670L775k6519L725K0193o885j0983N163K528q88K841m993n605
$$ plain form
0 0 0 0 0 0 0 0 0 0 0 0 0 0 0 0 0 0 -1 8 -8 8 -8 8 -14 16 -16 17 -24 24 -32 32 -40 48 -49 57 -64 73 -81 94 -104
39 -104 115 -129 144 -160 177 -193 215 -239 263 -287 319 -351 384 -424 468 -518 573 -635 710 -794
59 -794 894 -1014 1162 -1347 1594 -1929 2420 -3200 4660 -8287 37128 33332 -43753 17283 41718
74 41718 -12649 -27458 10358 1234 -13030 -10920 -11340 -3919 12316 -5628 -13806 11199 14027 -8932
88 -8932 -2324 8621 4273 3818 -2807 -10527 12438 15606 -20503 -13148 26528 2043 -31056 3864
102 3864 22620 -13876 -16252 11048 4992 -4477 4516 -455 -2355 11136 1568 -14220 4704 16583
116 16583 -8054 -16675 6187 12624 -5785 -12780 3871 14803 -3912 -18944 4704 20372 -7775
129 -7775 -19035 10635 14410 -12109 -8384 11809 4924 -6059 -896 1632 744 3585 -1408 -7013
143g013Q531N919j0454o299J1977P872j3968j0101J7521J1688k1462j0168K4604
156H647N270k5138J642K2571o317j6127P085P524m284k00j887l860P953K878j3528
171g771J16J6702k447j6534L512J5463j951j4593O72J6075j26j9153J448K1155
185A2568n125k0791Q989J6318j2136r611J1966K140q242L307J816n295N848N038
199F790j1309k235J4657p64j5217L504J4768n458j4915N684J4460o232j4233O633
213c867J2593p572j0241Q196P771o576m761L806K735L56j378m108J819O815k989
228B599q904M046J0184n184j1981N387J3140o645j4115Q734J3887j1382j1469
241a1703J3874P942j3630k448J0924k173n400M702j270m144O736L46j0657M069
$$ plain form
143 -7013 1518 7437 -3017 -9316 2661 10533 -3435 -13536 3985 15673 -5789 -15957 8647
156 8647 13917 -11221 -9579 12992 6675 -9452 -2367 5157 873 673 -1214 -5074 2879 5757 -7771
171 -7771 -7655 9047 6600 -9934 -6422 9041 7090 -7503 -6831 9244 9118 -10035 -8587 12568
185 12568 7443 -13348 -4359 11959 -177 -9788 2178 4318 -3924 -617 1199 -4096 1752 6790
199 6790 -4519 -6754 7903 7139 -8078 -4574 10194 4736 -10179 -4495 9965 3733 -10500 -3867
213 -3867 8726 1154 -9087 -891 6880 304 -4457 -651 2084 2440 1062 -3046 -1227 5588 2599
228 2599 -6305 -2259 7925 2741 -9240 -3853 9287 2642 -11473 -2739 11148 -234 -11703
241 -11703 2171 10113 -3517 -5965 4959 2786 -2614 2088 818 -3326 3410 3756 -6901 -2832
255b832J1329q102j0218R577Q308r233p052Q148P976p234r521Q529J1117j0502
269B90j0436J2961P208j3980k641J1689k003p153L757K46k582N879j551r530P129
284g17J0144j1931p376J5041M168j4902j272J2863L03j0332r13Q536J845q399
298b942k711Q166K068q042o12O058p74k471J025j531J156N458m665o907R096O659
314I031j2777m562J4603J631j4670M17J3020j858j1414J765J0049j443q984J196
328c996Q060j351o390J791M314j051j179o21j485L887L052p882k897J1219O71
343F142j3872K004J4001m757j2651O387J0221o321p818N348O509l343n788K173
357a765N691j395n224J020M082k79k565j446N18L837J81p289K98J0307k418j2430
$$ plain form
255 -2832 8497 395 -9823 -246 8062 -1171 -8223 -75 7901 667 -8854 -325 10792 290
269 290 -10146 2815 10023 -3957 -6598 5091 3088 -4065 -308 -62 -2644 3235 1684 -7846 -717
284 -717 9427 -2504 -9880 5161 9329 -5573 -6845 6018 6321 -4011 -4924 3612 5457 -2942
298 -2942 -5653 2513 4581 -3461 -4073 1985 1211 -1260 -235 -1766 -610 4848 183 -6724 2372 9031
314 9031 -3746 -8308 6295 7926 -6744 -6327 6693 4835 -6579 -4814 5235 3792 -5192 -3996
328 -3996 4064 2713 -3677 -1886 2428 1377 198 -423 -1908 1979 5031 -2851 -5748 5471 6142
343 6142 -7730 -5726 8275 3518 -9133 -2746 7475 1154 -6664 -1316 5193 1850 -3938 -1765
357 -1765 3926 2531 -2693 -1673 2409 2130 -435 -1881 -1363 2474 2655 -4634 -4336 5971 3553 -8877
373h877N818J2772q824j0659J1144P625j1196m065R538J211o322J1K521L12L02
388A311k247k384M063K983n543k839N915K643n411k883N002M531m719o193N680
403i1P807p650p907R888O274j1764l582J1503j14r314K777N083l567l82K057l432
419b414J491N618n347m983Q567L135r942o05R318q42p714Q15N813J48n271k041
435d254N728K935p213k343Q202N97p621J879N556l059j755K634k151K81M757m316
451a43n217Q275L213j1215j85J1525l009j0175M756P523m757n110L591L972j661
466A383l599L96M318Rm510M25L864q62k353K88K27J123R91l711j273O166kp835
484d955K094Q280m023p006N363N369n347l393M525K254l130j745J701J581r72
$$ plain form
373 -8877 -3059 9713 889 -9770 1374 8999 -2197 -6262 3276 4487 -1835 -1824 697 1009 1311
388 1311 -936 -3320 743 3726 -1817 -4656 1259 3902 -1509 -4392 610 5141 422 -5771 -91
403 -91 7716 66 -7841 2047 8321 -3443 -7025 4478 4364 -4950 -2173 2910 -657 -1039 1018 -2414
419 -2414 -923 4695 -652 -5635 2932 6067 -3875 -4480 4838 3996 -3718 -2903 2910 3058 -2213 -4254
435 -4254 1474 4409 -2804 -5147 3055 3652 -3969 -2090 3466 407 -1348 1286 -865 -584 4173 -143
451 -143 -5360 2915 6128 -5087 -5272 6253 3244 -6931 -2175 5348 591 -4519 -928 3044 1383
466 1383 -2216 -1820 2498 2507 -2003 -1578 2286 1424 -929 -641 -414 709 1700 -2011 -3284 2882 2880 -4955
484 -4955 -2861 5419 1396 -5610 -247 5122 -225 -3618 907 3161 31 -1714 -13 1568 596
499E96j656J08J225N66q62j779L96L478o49m899J747O224l174o276M828N733n900
516b94m211N911K655n364j651M024R28k732j157J615J357j121j232N39J074M02
532G43n63j591O61L444j152m863K589N534m396n316N934L831o844k274O432M49
548B618n154O43L234p13j408K77O2R12R58j906j292K792J566l172j760L522J855
565C034m146k390M732K294n508k112O021J346o081l21N869o71m715J463L481j462
581H34j797J214L3m06J366j029k268K502K350m208k227N540J216o114k40O092
597B858o12n467J307M842j208l999J044L437n56l003J87K602j79k251k5J330L03
614F10m65j196n17K425J204m048p75N600j23o415J803O549l191n555L985L945
$$ plain form
499 596 -1060 -952 273 839 -23 -1802 -1406 2072 1423 -3476 -1729 4495 1321 -4955 -127 5606 -294
516 -294 -4505 1406 4061 -1303 -2954 1070 1998 -734 -1891 -276 1081 -40 -1272 -733 341 743
532 743 180 -1411 -750 2694 1542 -3321 -732 4802 406 -4910 1024 4855 -1989 -4263 2169 2618
548 2618 -2536 -1893 1341 628 -780 -503 -441 471 1429 -477 -1769 1023 2589 -583 -2343 1179 3034
565 3034 -1112 -3502 1230 3524 -1984 -4096 1925 3271 -2810 -3131 2738 2067 -2648 -1185 2296 834
581 834 -963 251 284 -122 1244 215 -2053 449 2799 -1409 -3636 1904 3120 -2994 -3234 2858
597 2858 2246 -3221 -1914 2928 1720 -2279 -1235 2202 1646 -1357 -1170 1432 1253 -998 -1023 307 610
614 610 145 -1051 -1568 857 2061 -1987 -2762 2838 2715 -3700 -1897 4652 1461 -4094 -109 3836
630C836m008k352L065J040j836q40M50P71O07r86j335J140J898q05k420Q87L300
647B412q05m382J469N307k489n649L469N036m541m030M868K651m526j633L320
662D77J070j912r70R41J241M1j538l22J780R51j863j769K078K556k649l356L401
679A57L452m622l097N573J901n761o10N058m20l445R93J848n39l77m87k88J813
696A149M01k692k73K759lk427n10K196J174k684k070L701K578m912k015N946Q24
713C142o064R77N341k219l666K603J488j815J31K08j181J495R78k983k04L571
729A802o49l610J236L283r73k870O15K925n5l319L6L988m62m352J089L884j864
746G04k864J902J526j701k78N82m29R85P22k484j79L577m52l986J467L983k217
$$ plain form
630 3836 -172 -2524 541 1581 -255 -1095 -645 126 733 -253 -1588 -448 1450 645 -1775 -888 2412
647 2412 1607 -2775 -1306 4001 1512 -4137 -668 4368 -173 -4203 665 3316 -1210 -2843 477
662 477 1547 -365 -1335 -394 847 888 -650 -972 808 1759 -104 -1873 205 2761 112 -3244 157
679 157 3609 -1013 -4110 1463 3364 -2397 -3007 2051 1631 -1814 -821 1027 488 111 -376 -664 1149
696 1149 1550 -1142 -1415 1344 1341 -1086 -1596 600 1774 -910 -2980 721 3299 -1613 -3628 2318 3142
713 3142 -2922 -1945 3396 1177 -2489 114 1602 -213 -82 126 -1055 440 1418 -1565 -1769 1802
729 1802 1153 -2457 -1221 2062 1089 -1781 -1166 1759 1704 -1615 -1579 2409 1947 -2405 -1316 2568 704
746 704 -2160 -258 1268 -433 -711 -129 -558 427 1149 -1335 -1514 2063 1611 -2375 -908 3075 858
763H58l722K724L116k853k731K622K111k512j490J926J040j380q41Q72R18j18
779E40q44l84R58Q23q63j182Q51J683j087k327J304K814j865l209K526K955l294
796f01k342L927J220l657pK791p49j266R73r9m53J297n69j925J713J658k595j315
814a999K717P97k409p84K044J051j994j372K341J758k797j516L436P12l239K88
830i66K559j189j306J334k45q56J486n35k171J816K048k751j522L333P96l292
846a461j45L073J54k719j71K504K91k538j52K367j91k110L99J343m73n00K1l24
864f32P09Q55j563p15K401M46k802L8L058l40k973M99K742n70k702N48K615q68
882G46k519J056K049j361j127J270J48o34P67l85r99J781P72k796p7L380q29l322
$$ plain form
763 858 -2864 -140 2976 123 -2608 14 2125 -387 -1877 49 1089 -291 -1132 -260 658 540
779 540 -304 -688 270 1093 230 -952 -101 1582 495 -1832 -528 2286 421 -2788 -262 2693 -601
796 -601 -2943 984 2204 -1453 -1460 1331 582 -684 289 190 -263 1034 465 -1460 253 1911 -684 -1999
814 -1999 718 1515 -894 -1678 366 1417 -577 -1949 392 2150 -647 -2163 1273 1985 -1254 -966
830 -966 1593 404 -902 432 187 -669 817 282 -1889 -73 1975 -776 -2298 1035 1831 -1461
846 -1461 -1606 1467 1621 -1098 -1269 1235 1526 -1012 -1164 1203 1012 -1098 -699 644 171 -329 -308 -632
864 -632 77 932 -631 -1346 1055 1501 -1301 -1263 1795 1455 -1518 -1019 1723 1153 -1549 -1001 1614 746
882 746 -1773 -717 1332 -29 -1156 114 262 -372 395 10 -989 792 1564 -1232 -1309 2071 1242 -2080
900b080J415K733j757k195J504J767j080j786O73K072o47k085J032J860j176j235
916i85J215L90o10M85p03o75J943K54l033O78L293j795l225K683K455k968j535
933b133K666R54j925o86J380Q71q36j131P04J305p39j126M10P04o6m86p44N66
951c12J441r81k030J729K281k417k097L041J571l097p39K795M23k301l63J786
967G30K85j330n45R19N22o43n98J95P08L26q94r02J480J362k045j347K697J068
985A988l080n44L161m1k896K54K287l10j779J41J285P8j046l26R87N08p49n36
1003f18M11Q01J46j127m68J665N61k306m43K883j11l142N51K932j131k483J358
1020e21J890j297j259J086P23l44n51QM34M57l34r03L90J223n01j566M13J799
$$ plain form
900 -2080 -665 2068 311 -1884 -380 1387 307 -1479 -806 1266 619 -1466 -434 1426 250 -985
916 -985 230 620 10 495 -208 -883 1060 1314 -1719 -1041 2252 457 -2768 -85 2370 -598 -2133
933 -2133 533 1487 -438 -1124 256 1127 291 -840 -136 1169 430 -696 -286 418 352 -134 -878 -312
951 -312 1129 148 -1882 -153 2128 -289 -2386 655 2226 -871 -1610 1185 1608 -693 -1056 730
967 730 1015 -315 -860 59 581 -62 -660 -465 243 569 -325 -1227 253 1615 -430 -1777 920 1988
985 1988 -1092 -1636 1525 1484 -1412 -1158 1129 819 -960 -819 466 544 -502 -828 159 667 -82 -618
1003 -618 -207 594 740 -387 -855 810 1371 -935 -1378 1505 1394 -1748 -1197 1735 604 -1879 -521
1020 -521 1369 72 -1187 -101 622 278 -273 -265 169 626 292 -611 -221 1002 501 -1065 -652 1147
1038A147n34k138O90K256r59k148J202K023j276j682J325J475j147j170J013Q30
1054I07p79n09L96J13J96j25r63K03J499n44j929J120J968j657j694K122J320
1071A644k167p17J875M18j351k93R00L72o44o30M71P13n21o63L29M68j19j76l20
1090d11J22J009l52j535J049J855j824j623K444R32k618j90K245m49j593O37O55
1107C53l32j32j45k07O91J77r13Q2R97l4p88j64P50M66q25r17J177J040j748q86
1127a358K088M05k254J48J837m99j254P40O16m70j0M4k80N75L48r22k94J130K31
1146H21j318l32J382K72j612k54J734J77j901J35J816m15j570Q02J096o52n50
1163c69M11K21p7K4m22k9P19j11r47N1J050q0j101j23J381J25j612J03J831l19
$$ plain form
1038 1147 613 -1525 -835 1421 462 -1686 -484 1539 263 -1419 -94 1381 234 -936 77 907
1054 907 128 -381 15 128 324 199 -764 -561 938 394 -1535 -415 1553 -104 -1798 324 1644
1071 1644 -523 -1240 635 1053 -298 -591 309 681 37 -593 -122 591 70 -593 -264 204 85 -91 -411
1090 -411 -289 720 368 -1167 -118 1737 -87 -1710 734 1666 -952 -1142 1103 654 -939 -302 353
1107 353 21 -111 -256 -463 228 405 -508 -426 571 537 -251 -415 335 801 -24 -941 236 1276 -472 -1358
1127 -1358 730 1135 -1119 -971 866 367 -887 -147 469 -1 -11 33 -247 328 676 -246 -540 590 821
1146 821 -497 -829 553 825 -787 -1041 693 870 -1031 -896 920 505 -1065 -263 833 181 -369
1163 -369 42 263 186 210 -212 -241 478 367 -580 -529 521 441 -660 -783 598 723 -889 -786 1045 726
1183G26j887Q02J679j107j228J209O55r86j03L02k40L26J07q66J16J118l72j226
1201i75O44J248q03r40O99J001n68j105N80J298n77j493P88J307j084j028J171
1218A63M64r82qM27k97L02K82r11J76J319o56j346J078J289j320j117J411P66
1236A040j255p44J126O96j124o89R87O24q93n06Q33M03n16k86K14L51J71m23m65
1255d56O45P10r57q82J183P89j370q03J563N50j687k64J580J22j358OJ193n6q60
1274c52J51M38M1j57k98n4N70J36r24k05J088J39j230j32J323P6j272l9J309J22
1294G30j414J06J352j56j243L28J046m61p06L38L10j93M4l06k49P52O5r41L8J208
1314F48k00j195L32J197l68j106M49J105n06j096M94J009n10r61N58O26n55l10
$$ plain form
1183 726 -1161 -359 1320 213 -1015 194 849 -137 -240 62 -178 148 255 -611 -495 623 251 -975
1201 -975 -331 917 114 -826 -127 874 306 -799 -219 1079 502 -991 -203 1104 20 -1008 163
1218 163 627 -355 -363 64 -233 69 351 -560 -384 935 279 -1067 11 1300 -20 -1137 274 1040
1236 1040 -215 -959 167 863 -261 -950 37 661 -232 -738 95 498 -18 -304 -90 261 432 9 -456
1255 -456 189 899 -58 -940 243 1032 -338 -1141 422 972 -715 -979 601 723 -635 -629 564 508 -352
1274 -352 -201 237 278 121 -177 -231 339 475 -449 -654 434 573 -657 -789 534 610 -662 -701 608 730
1294 730 -684 -578 774 618 -625 -297 749 288 -418 -80 230 37 81 -225 -474 278 343 -598 -560 648
1314 648 448 -747 -415 782 414 -692 -243 862 356 -740 -246 763 253 -708 -150 476 -79 -389
1332c89L74K3L1K1m17O3Q25k05r88N59J014p43r34Q58P59q40o77O19O85o20p07
1353f89N83O94o71n88O62M26n76o8L76j10N8K47o29O3R48n39j027P91R95j149
1373b03q00J229M70j142j77Q87J47o53k62N71L54m34l78N49L01m83j24K46K6p4
1393E0J03n10J84O86n11p99Q22P62j182m11J284J62j126J31R18k37o08K27L15
1412B60j07j40j00N5J74k0k86p9K66J70l83k26N02M11o60l65Q29L75r69k47J121
1433E81k3j033J09R27l35p03L85L16k54j28M6n1J38K11m01j78O70J09p30j03R18
1454D71l0q49N4R05k05q20J63P13j90o71K10N93l05m49K62K76o5j20M2l8J39K09
1476B95m53j75O91R7q49jR21k53q84L93P67n06o80N35M93m30l94L70L13k61j78
$$ plain form
1332 -389 -15 8 39 60 -357 -294 531 326 -662 -103 911 168 -766 92 851 11 -666 -47 638 18 -689
1353 -689 -106 588 -83 -671 -9 417 -159 -227 149 39 97 344 -285 -222 726 187 -840 -49 946 -203
1373 -203 -1003 226 696 -446 -623 264 411 -242 -504 67 421 -13 -391 158 459 -24 -148 98 124 50
1393 50 153 -357 -173 513 2 -797 25 787 -395 -806 478 640 -486 -355 563 326 -282 -55 260
1412 260 153 13 -87 -32 142 122 -164 -243 23 193 -190 -416 86 497 -163 -528 301 676 -293 -540 581
1433 581 558 -475 -366 561 226 -477 -92 224 -30 -158 -112 -163 -25 186 -215 -393 277 386 -344 -447 471
1454 471 441 -408 -354 551 346 -474 -311 402 212 -459 -249 344 39 -410 -148 128 63 -57 -15 -53 86 295
1476 295 -158 -333 358 455 -394 -395 526 273 -611 -218 549 43 -637 -102 391 -39 -433 -63 250 -11 -189
1497a89K13J63p2o0j32L8K86L7o24R4P24l65o91L35Q18n19p47O27O07o08l31N20
1519A24K80l43l74L23L12k45k64J33J37Kj61j22N3L83j61o84M16Q25o99o98Q76
1540A13N99r43k83R53Q4p73j0M91M8l11j36J42J66q7l94J99L51j82k50J05J82
1561F4J81k16m23M59N84o96o02R41M38j194j00J124k26q51L07N16k96j45L5L2
1581f8J85M2l40lN54j36n53J92N30k03l86mM03R8n85k14Q41J14j020J33R64l39
1603B05q16N30M92m81j59L52n9n1J53k83q0N02o5o41J96O48l83n35K80N85l24
1624F6n19K50N68k05n89K76O80l75o11N04M12m55j50J74K9o2R8k95j8M85k07n75
1646e19L86N94m66n20N88M62o23k95M92L22m48l56M91K67m06k43L28J01k83m9
$$ plain form
1497 -189 24 187 115 55 -77 -39 247 284 -340 -246 478 113 -578 -243 575 56 -691 -64 543 -65 -396 124
1519 124 404 61 -313 10 322 77 -187 -54 83 85 -76 -198 -145 238 77 -607 -191 634 -65 -763 113
1540 113 712 -231 -514 439 523 -250 -260 231 279 -32 -168 -26 140 53 -341 -142 209 27 -223 -118 64
1561 64 245 29 -394 65 649 -47 -649 292 730 -464 -564 560 334 -517 -210 306 10 -135 -100 -68
1581 -68 117 159 -181 -184 370 234 -319 -127 403 200 -186 -190 213 311 -274 -488 353 467 -553 -420 544 205
1603 205 -611 -81 411 -70 -229 123 64 13 166 -117 -197 305 240 -401 -205 443 60 -475 -195 390 66
1624 66 -453 -203 365 160 -429 -153 527 152 -459 45 457 2 -148 26 55 -7 91 -204 -222 263 56 -519
1646 -519 -133 461 -5 -525 63 525 -98 -393 99 421 -27 -383 108 375 -31 -274 54 155 -128 -177
1666a77J23K4l4J5j22M4L84k19m37M40M65n57m11O83K44o19j55N65L7n16p2M20
1688A25J7l03j05K72Q9j27j21J00J68M7j42j44J49L01k89l79L76M17o40k84P43
1709B70K8p05pP12k05m10K18L18j71j34J61q2J20M5k08nK27lk74r9M09Pl77q3
1733b48L87J36n76j05O76M1o62J43N50j84m91L24L00l01l2J87j66N0J70l67l8
1754b06M10o7m99J33N22j69n16K76M92j95m26J49M57j56m24J56M07k64l07K47
1774B0J12k04o4J38n9O4J18l17o6M92q3m96J69N90l15n38M50M43m34l39L41K76
1796B98l46j97J78K63k18j67J00J63n2j16k6J27J47o5k37J13L41j49m59K95M38
1817D31l87m63M41M12n30l11M50K03m19o5K47J09j91k7O2J12L3j21j55K51J96
$$ plain form
1666 -177 -54 -30 -64 -49 -171 -127 257 38 -399 41 506 -51 -462 221 465 -154 -309 256 293 -223 -295 125
1688 125 142 -161 -266 6 95 -32 -153 -53 115 162 20 -124 25 326 37 -342 34 451 -189 -473 270
1709 270 298 -407 -414 298 93 -317 -99 219 48 -86 75 -7 113 158 -50 -55 172 169 -105 -204 205 212 -165 -248
1733 -248 139 275 -301 -406 270 311 -351 -208 342 158 -333 -9 291 -10 -42 145 -21 29 199 -168 -206
1754 -206 204 137 -362 -229 293 124 -392 -116 376 181 -245 -96 361 205 -219 -63 344 80 -227 20
1774 20 132 -72 -136 2 -57 7 125 -192 -258 234 151 -345 -176 414 99 -439 11 454 20 -319 22 298
1796 298 -48 -245 -67 196 -22 -189 -89 74 22 -94 -120 7 154 89 -148 -35 306 157 -302 -7 431
1817 431 44 -419 22 434 -96 -407 43 246 -173 -238 9 118 -73 -100 -38 74 107 -14 -169 82 278
1838B78l30k42L40L44m86l09M63L40n95k50O04J36n16r0M96R1m29N6K52M8j34
1859F7q8J0J28K5k55n2L01L1m02q6M74N6m57n7M91Q7n63J4N87l9n23Q8M50j05
1883A82l71J20K19p1j15r1MK01M0l96P9M61j51l86J62M02j36l52P9L83j9m58K
1906b12N36j25n43J98M64k63l45K35J94k22k1Q4n6K39n8l93J20N16k40n09M73
1927G2K74m05k14L49J38k13j92J67K34j17l56J39L99k25l12K05L02k31o8Q4n7
1948b7J82j2m21K19M42l49m84M75L41n71k26N65J02l99p4K91J11j78j55J48K46
1969B26j06l12K15J68j54j11QJ12M4j01k05J51L78m61j83M48K01n32o2N44k2m59
1991b13K01J82j02j45k9O8J42l1k21P6J73j02j85O6J66Q7j83j46K80K31m21j43
$$ plain form
1838 278 -52 -294 46 390 -96 -405 58 398 -197 -447 157 293 -223 -313 183 274 -155 -99 153 201 67
1859 67 -21 -11 117 142 -113 -165 136 167 -235 -321 153 209 -248 -305 186 273 -290 -276 311 272 -251 -163 287 182
1883 182 -189 -69 150 79 -36 -127 -123 78 118 -278 -199 262 111 -275 -113 289 153 -199 -120 263 244 -214 -212
1906 -212 324 199 -344 -146 318 55 -290 -55 139 -83 -104 -20 -76 163 105 -288 -168 348 108 -401 72
1927 72 346 -59 -273 76 214 1 -191 -24 210 93 -263 -124 275 50 -262 -57 245 14 -54 30 -27
1948 -27 155 143 -278 -59 383 34 -450 25 366 -205 -431 134 236 -163 -237 54 165 -13 -168 -20 226
1969 226 120 -192 23 191 37 -74 -66 46 90 -11 -216 -65 313 -148 -331 117 318 -214 -276 268 246 -213
1991 -213 -12 170 68 -77 -106 -38 104 73 -148 -72 101 -1 -186 -120 46 133 -50 -196 84 315 -106 -249
2013b49M96J8m74M9M41j90l22J97K05j44j11j2Q6L6j6j36R5J89j57j53J15K21
2035A84n8k03k6K88M0m18J9M47q2m81J07L75j46k90J85R1k5q3M1M9Q7K8k05N8
2059a8J89k1l60J79K11j28k63J81K23j89k92K08K67j58k85J86L16k22j75J84J54
2080A87j22j75J04R6Kj00q7L8J61r6k25J09L05k14l04K83K88l76j52L44J84k63
2102a3r1J62J58j62r9J7J27K1k01p4K38Rj89j03J72J78j43k70K62K85l33k25L83
2125A09K25l82k03L94J07m45Q6K38n6j21NL4L2M8j77l3K36L5k51K6K13M6j67j16
2149a17K60J12l24j83M28N1l42p7L26Jl06LK85o6j33O0o1J65Oj44mK63Nl94P9
2174a07L13o1l47O7K96j34k34OL91n1m38K13K62q9k49J09J88j68J5K9K8Q7o6j98
$$ plain form
2013 -249 247 265 -209 -160 281 91 -231 -34 171 27 -84 -96 -10 26 10 -126 -31 158 1 -152 -37 184
2035 184 126 -77 -103 185 225 -193 -174 273 191 -290 -183 192 46 -244 -59 32 7 -76 -35 14 101 129 -76 -18
2059 -18 171 150 -210 -31 180 52 -211 -30 193 4 -288 -80 187 29 -256 -70 246 24 -151 33 187
2080 187 65 -110 -6 90 92 -8 -95 -57 104 8 -217 -108 197 -17 -321 -38 250 -126 -278 66 250 -13
2102 -13 -104 58 216 54 -45 -28 99 120 -81 -155 83 92 -97 -200 -28 150 7 -263 -1 284 -49 -274 109
2125 109 334 -48 -251 143 250 -195 -109 129 73 -48 -43 -9 23 71 -106 -139 97 132 -119 -93 120 166 -1 -117
2149 -117 143 255 -69 -252 176 227 -115 -192 134 135 -171 -168 117 51 -82 -22 -83 82 88 -56 -60 203 208 -186 -107
2174 -107 206 145 -202 -135 161 27 -207 -201 190 139 -299 -86 176 87 -162 -53 135 -33 -18 11 39 126 60 -138
2198a38O5K72j54k82J58K67j93k52K24J31k7k78J54K50r4l52K07K79j81j75J33
2219A4J50k06nK5M6QK1k29O7L74k30l52L67K04l29j58L24J66k48j53J91J17j78
2242a4j55J99R8p7j75J27Q9j58j05J43M4J5qj60J23K72k81j86K27K19l39j40L73
2265A31O9k98k2K09Lj65n0J16L4nj69J07J18n1n1j5J67o3o0q9J40L1j62o4K65
2290A26J06m02l9L40nl10J17J83j18q0J32M8r1M0n7pJ13k2j69J4J35J3j82M5J34
2315F4N4k44o8L11lk75K7L11p9k57J22J96r2j24O0J01j06l6j8nM4Q7k20L9J98
2340H7l6k29Q5K09r6j51M5K29q8k26J27J94j20j60J30O4j22o6J55m3j4L1p9L2
2364d2J65m8j75M2J58k8k16J15K25k14j33J93J09j72j42J83N3q2j26R0P7q0k8
$$ plain form
2198 -138 -73 199 45 -237 -79 188 -5 -257 -33 98 71 -207 -53 197 103 -249 -42 237 56 -119 14
2219 14 164 -42 -47 -22 24 32 53 -176 -109 265 35 -317 50 254 -75 -233 91 257 9 -144 47 164 -14
2242 -14 -169 30 128 51 -124 3 92 -66 -171 -28 16 31 23 -137 -14 258 -23 -209 18 237 -102 -242 131
2265 131 200 -98 -120 89 92 -73 -123 -7 27 22 -147 -40 78 27 -24 -39 128 65 5 -84 56 87 -75 -139 126
2290 126 232 -170 -209 131 126 -184 -67 116 -2 -82 50 98 7 47 -10 -17 96 74 -95 -81 54 67 -115 -70 64
2315 64 118 -126 -194 117 114 -161 -134 177 98 -159 -37 159 67 -57 3 104 -2 -38 -56 -61 -17 70 -150 -111 87
2340 87 51 -178 -93 116 20 -131 -86 143 55 -171 -44 150 30 -130 0 64 -58 -124 31 -12 -26 5 -74 -42
2364 -42 123 75 -100 -58 100 72 -144 -29 196 -18 -151 42 151 -21 -163 20 73 -9 -135 -45 32 -48 -76
2387g6R7j7J4L6p7j0J97j28j76J41K18j97k25K42J64k71j39K64L1j58j8J08m3
2410b3n3KR3L0l4m6PM6Q3j11l0N0J06j84j05J45Q5j29j09K23Q0j94r5K62K0k41
2436a22Q2J99m7j97P5JM2P6j38k1P6O1j50K6J31p2j68N2K34n0j82j8K24M1k75
2461a20L3K54j05k22J78R2j36m1L8kJ7pK8j35J55O7k47Q5K43j19j70P2K11p4k37
2486a42Q9K31j51j83J42J38j33r9N8J49j26l9MN0j1M2p5m3J63J1j76O3J69j34
2510co8R6J27j65j28J66J67k91m7J36J11j05k1M2P2m3k1j7Q6k8n7p5R2J00j15
2535A1j31J23J37k21r6K46O8j74j35K12kj07k7K06m5j46M5N2J9ol7K7rK7k7n9
2561d9M3J21j62n2J71lj43m6K06k6j68J05J61j54m8JP4l6k2PP0l9m7j9lR4k3o1
$$ plain form
2387 -76 21 4 18 54 -23 -33 164 36 -140 1 219 22 -203 39 203 -68 -207 57 88 -70 -88 20 -23
2410 -23 -76 -74 19 49 15 -31 -24 22 105 -6 -36 14 120 -64 -169 -24 61 -68 -177 46 126 -68 -163 99 119 -122
2436 -122 -40 159 112 -85 -10 -9 33 109 -29 -50 26 87 -63 -37 94 22 -146 -94 140 90 -92 -110 114 155 -120
2461 -120 -87 167 62 -160 18 110 -26 -67 -29 -31 -14 -21 7 -128 27 94 -153 -68 175 56 -114 -42 169 95 -142
2486 -142 -53 178 27 -156 -14 124 -9 -108 -50 99 -27 -66 -62 -12 -23 19 -56 -99 64 75 -101 -38 131 -3
2510 -3 -71 25 152 -13 -141 25 192 -99 -146 -10 101 -4 -25 17 89 46 25 8 94 66 9 -66 26 126 11
2535 11 -120 3 140 -81 -177 69 137 -37 -172 40 38 -69 -96 110 65 -81 -36 16 35 29 -8 19 10 37 10 -49
2561 -49 -6 115 -47 -99 72 69 -74 -120 86 60 -108 -3 158 4 -44 -43 31 -5 -27 -20 50 11 -36 -55 -58 36 13 -48
2589d8p4J74k0r8J2J58Ok25O8J69n1j79Q2M8l0o6O7Jl8N9l1j7M0K6q9oJ17mo6
2618a5KQ2J3j73k1K11j50n9O9O3Jk35K16J0n0l7O0M2l8kPm4J01po9k3R1k7j08
2647i0NJ85o6j25N5J04o8p5P4J48r9j41J22K3l0o4K5Q1r6M3l4PN1j8r4L1J54n8
2675E0k11J15J20j49o5J15J58j60o2Q5O7r0O0rk1L2k2m6L3L6m9l1O3N1j36j2R6
2702A8N8j10mJ35Rj19j13K42k7j53N4Q0l3j21L2Q4n1l3pl0N7O2q8l3J12J10j85
2729e4k2J58K9j76j0K03rj74QJ60m3o8p1J16l3q4L3O4n4K6n5J2O0Q2j56l3J93
2756A02j3j72N9J39q7j50N7J38n5j21QJ98j35n1O9N4o1o4J04O0k1N3q8m5Q5L0
2782I3j91k8K57p7j93J53L9n1j07R6J51j14o7N8J32q8j24O8P0q0J3m9R5n3o8J5
$$ plain form
2589 -48 -122 52 32 -66 -54 104 110 -115 -47 122 71 -108 -26 22 -8 -74 -7 -6 -44 15 -16 -33 7 33 -56 -62 55 51 -15
2618 -15 -13 69 82 -91 -112 99 -51 -110 -41 22 23 -212 4 14 -36 -73 -13 29 -9 -11 -4 -48 53 46 -23 -46 45 18 -90
2647 -90 -85 100 34 -91 -36 68 0 -75 -1 147 48 -93 29 52 22 -42 -17 64 -32 11 -23 -16 35 17 -77 -46 108 50
2675 50 -161 -46 74 -75 -140 -25 133 -27 -89 -4 63 -27 33 24 3 35 13 -33 0 36 -13 -44 19 70 -66 -78 18
2702 18 76 -34 -38 97 106 -13 -126 116 89 -64 -10 70 37 -84 -52 32 -19 -52 -59 -89 -32 30 -58 -91 21 131 -54
2729 -54 -76 82 111 -65 -75 128 119 -55 -47 113 70 2 -69 47 14 -70 -37 27 -27 -1 -56 -44 16 98 -58 -91 102
2756 102 89 -83 -24 115 28 -122 -65 73 18 -103 -95 103 -32 -83 -14 40 -21 -85 19 79 58 111 23 -22 63 93
2782 93 -98 -126 131 54 -139 14 53 2 -105 -9 142 28 -39 19 151 63 -61 7 77 -3 10 -39 56 3 -65 -50
2808e0nJ15o3r9N4J20p9r9J37R1j95J3J59M6j44p3J37J5j24m3J14L0m9q4K7M0
2834iR6l5j27Q2L6q6n3J16N0j17n2J49L7j00k3Q0j4r2j3J66j06J8nK9j8l4P7k2
2862C0J8j5Op7J23J8k02L0J13M6j88k1J84l8j37O6J43j41k9N8O4j8l8jJ3J10q5
2889C2o4K9jJ6m4K2K7j6o6MJ35o0r0L2J47l6j22L5R4k4m8M8j8j0r9R9j4N0k8j12
2919h2RJ25p0o2O9K6Jr7qJ26l1o8M9%M3r5O8L6l3Pk6l3N7l3q9Q7P5J7o1KP6l1
2951E4j61J08N7m0q6Q6N6oj25J08K1p7j5L4Q0j03n7KR5j2j0m9L0Q0l6j01N1J24
2979A08o7j25M0J51j13j18Q9J03o6q0J19pq4K9K4qM3m1k2N9K7q3J9J16l3o6q3
3006f9J40J9o2j46J83j3r0m5J28j0m2n3P0L6k4q5J03K2n5o0J4J25Jl8j36J31L5
$$ plain form
2808 -50 -55 60 -3 -102 -48 72 -7 -106 31 122 -73 -60 99 145 1 -72 65 80 -44 -87 27 57 8 -76 -49 -9
2834 -9 87 52 -75 7 43 -43 -96 20 70 -47 -99 50 87 -13 -36 44 30 -62 -75 91 -15 3 -2 27 9 -25 52 30
2862 30 48 33 39 -38 85 103 -99 -69 44 90 -98 -119 65 27 -110 -44 99 -42 -71 -13 51 33 -5 -6 7 117 32
2889 32 -32 -3 -4 12 -32 -10 17 1 -65 -61 74 14 -76 -44 103 67 -55 -20 74 50 2 50 32 22 -77 22 8 58 30 -82
2919 -82 -73 52 -18 -80 -11 15 16 -81 -89 37 6 -62 -13 -13 30 -65 3 39 6 13 -13 -46 11 -22 -111 -24 51 68 7 9 85 54
2951 54 -107 1 58 18 -68 18 74 68 -57 51 72 -5 -20 14 94 -9 -66 -64 31 19 9 -40 -10 70 34 -67 -16 108
2979 108 41 -84 -44 107 -6 -124 -35 68 2 -78 41 34 -50 -21 3 -5 38 -3 -25 34 61 -22 -3 113 80 14 -69
3006 -69 71 90 28 -118 65 52 -38 -83 45 35 -7 -60 10 46 22 -63 40 62 7 -53 -39 86 87 49 -87 44 79
3033G9j36%R3R3j57l6Q1P6j36j0O9R9j67oO0Q0j2l9p6O4J8j15m3J51lq7L8R7o0
3062A5j10J02M0J5j17J8R5k8n2J5J11p3m1n6J32j0q6QQK5K3p5j3J96j33p9K7J25
3090H2n5j25O0J09p6j17R7J36o7j74R3O2n7j9M8kOn3P8k1O6m5n6N0J18j35q6R6
3118A3kJ1j13J09N1r5p9J31J1r0RJ26J0j10k7N7N4K3n4p6R0K6m2j05O1M1l1j88
3146a89J51J35j42K7N8M5j19J3J1N8r6RO5Om5Jj2O8o5j3k3Q1k4k6j3Q3M7j33m7
3175h9N3J24j31pR8J3j30N5K7Om9j7J2K1K0l6PP7mm6p5J51j2j08k2J90m5m4r4
3204e5R4M2j00m7J34k2j52O5J03o5n2L1NO6k5j15J10J00p2q0p5J24J1m2j1P1j
3231D2j04k5J20p9J5j2J33r6q0Q2Qk8L2k7O9j8k2Jp2O5jl1j7Q4k7j05N3J00r4
$$ plain form
3033 79 -57 -57 36 129 -28 -64 17 93 -43 -53 16 115 -52 -58 2 82 70 31 -45 19 37 -78 -121 30 27 -60 -22 75 15
3062 15 -95 7 47 62 -55 -37 58 30 -22 -7 104 31 -10 -66 66 56 -30 -22 -14 11 34 -41 -54 142 9 -70 -43 82
3090 82 27 -98 -38 71 -5 -122 -25 111 44 -130 -37 25 -32 -51 -3 -5 1 -52 26 5 71 26 -30 20 138 3 -83 13
3118 13 11 22 -91 18 69 -26 -105 26 37 -53 -44 82 92 -18 -45 12 66 89 35 -41 49 75 33 -72 -11 30 -1 -189
3146 -189 -38 97 -45 -18 40 85 -34 -21 -10 48 -48 -39 26 32 -13 -12 -24 44 -21 -34 -57 24 0 -26 -39 44 91 -42 -89
3175 -89 -36 88 -43 -50 48 61 -69 -14 13 19 -30 -47 -35 -14 6 -30 -23 54 50 4 -71 80 68 -40 -62 128 83 39 -55
3204 -55 39 81 -19 -66 68 46 -106 -41 62 -3 -55 -24 -19 47 22 -93 17 117 45 -35 -110 14 25 -17 -28 43 42
3231 42 -62 -87 33 -46 -31 -43 90 -6 -86 -4 4 -24 8 -19 50 32 10 11 -61 4 3 -28 -45 39 12 -93 -40 60 -34
3260c4j2j7O2Mo6N2K5jn3j2Q3pp9M8lKmJ6n7J03r7n7J25M2pj59J41P6k20R1M9
3291C4M1o8p6P9mJ6m0J1O6l4o9QL4Nl2j0M5Pn1L0nP6r2m2J19Rj40L5L4M9r5QJ1
3324d1J11p7p8O5L2K7m7j0Q1Pj40J8R6J7j52pJ29Q6j42l2J02K9j42J5J01n0j5
3351a7lK7K8l6o1P6J9k1r5R0L3K5o3l9J30n1j31LJ42rj90J24J13q6m6m2J56k0
3379E6q4j4Q0j6l9J0L5M5j09o7O6R9q8%nJ17j16p3J15Q2p7j22O8K03j38j14P8
3406hO3o1r6L3J04k5j6k1J4N3l7q6O3J03r9j7K3P4m6o1R5Kn3j03J08K8n5l7K9
3435b9M7j0p4L1J07o7j3n3J06qr4J4M5K2lj34J25P6j23p0J66M0j31o2J14K8l6
3462A4m4O0J8n1jJ8O8kj27K2J08j00k6J4L4K0q1J6O7nj10K2O0K1j07M6Q5mp9p
$$ plain form
3260 -34 -46 -63 -1 3 -63 -11 14 13 -40 -52 31 24 -55 -7 -10 -8 -12 4 -53 50 -47 -104 21 63 56 -103 38 114 -106 -15 34
3291 34 75 7 -69 10 6 22 -18 -7 59 25 -44 -36 -2 3 -29 -39 6 13 -38 -8 -13 63 -29 -71 48 57 -83 -48 -14 35 -60 -52 -41
3324 -41 70 -7 -85 -20 12 39 -8 -18 63 70 -70 -52 44 61 -91 -98 31 117 -25 -57 45 74 -68 -53 48 -2 -17
3351 -17 -20 7 35 -1 -62 14 33 12 -83 7 40 65 2 -37 93 42 -89 -86 56 47 -143 -19 94 8 -38 -80 76 56
3379 56 -28 -42 38 22 -17 -7 28 73 -36 -103 -37 62 -26 -26 -31 86 -30 -103 12 94 17 -105 -37 166 28 -86 -8
3406 -8 55 -6 -102 -69 35 10 -6 -27 -13 40 3 -83 -20 83 -16 -33 -10 64 18 -43 52 54 1 -102 6 34 -21 -58 -29
3435 -29 18 8 -66 -35 72 5 -8 -61 45 37 -57 -43 2 24 21 -113 12 88 -35 -105 61 101 -30 -92 22 50 14
3462 14 -30 30 48 -3 -4 14 82 80 -47 -25 83 -17 -43 -29 5 25 -56 -40 27 22 -88 -66 -6 15 -92 -46 39 35 -44 -51
3492e1J46j3o9pm8M4Q1j79J10K8j9p4N1P6o0m6p4J91q4j5l9J23p1M6p8L0J6m4
3520b9RK2K0l8j8Q0k6r3nO0J08n8p6J4J04qr7nJ18k2j24O7N1J6p1m7P9K3n3p8
3550g7J30o9N5o5N1J6K3j17N8J11j01o2J08N0j84n5J64%p1l3J6P2J8r1L8M5j1
3577A9m5J22mp1p1J4M0P3p2m9N4L9r0N1j1N2m4p6N4R4j21jN6N9j09j2O4R2j9q5
3607Cm9P2Po1J2M1K8j04l2J00J0l0j3M3j0m9L4O8j7j05lO7O9q0r5R5LK6k1l8O6
3638C7k3q6j4J79q8p4N4Q6k9j10K4P2Qn4r5J06Lj0k7K1J19r5p9Q5R1p6j1m2J24
3667I6j01nJ7J6K2q2Q0M1l1j18J02olj12L2P9j4Kn8Q4k8n5n7J00M1p8kN0J09j72
3697e1J0QR1n6j07J16N6p4j18J59j4l9K4J8J0j2q6J9J10jj70Q0N7k7J6p0M1O8
$$ plain form
3492 -51 95 82 13 6 -42 2 83 -96 14 42 23 -51 0 76 16 -30 -104 87 3 -12 -51 72 1 47 -31 -1 15 -29
3520 -29 -20 2 22 -16 -34 46 20 -73 -78 -18 90 32 -44 -30 74 66 -31 -36 82 60 -64 3 54 70 -1 -48 31 54 1 -77
3550 -77 53 -16 39 -26 25 41 64 -53 5 116 15 -47 61 111 -73 -128 36 36 -35 -68 -52 20 38 -53 -15 30 19
3577 19 -26 96 92 21 -50 -36 4 77 5 -44 10 49 -41 10 -1 51 7 -69 -15 79 -42 -43 13 72 -37 -49 15 107 88 3
3607 3 -46 26 33 -28 -16 25 53 -51 -83 17 27 -3 -16 27 17 -32 2 70 53 -52 -55 12 81 1 -94 1 4 30 9 -29 37
3638 37 14 -72 -86 93 5 -69 -15 71 42 -68 -44 28 36 -18 -113 -7 -4 -14 -41 -20 99 4 -75 10 101 25 14 -28 96
3667 96 -5 -10 7 23 45 -37 43 84 53 -65 37 31 28 -84 -52 27 13 15 -43 41 13 -42 -99 1 42 -36 -38 12 121 -51
3697 -51 -41 -33 58 2 -105 11 67 -7 -125 34 20 -19 5 23 33 21 -65 -46 64 63 -107 -27 30 3 19 -51 -10 58
3725E8j21K3O4j8k4m3R1N1j24m2J00O8o2r0J2J19k6r6j8J07j4j8j2J04k0j35P5
3752IO2p8n9n4J38L6n4m5M5R2j21l9P6M5r6%K5K1j4p3N1O8k1m3%J19n0p1K2M8
3782C9o5J6nR1m8q0k5J44j5q4m6J21l4n6J5J03nj79J12J2J2l2k9L6M4L5j09MP5
3811D7n8q0L6P9K2n7l0Q8p3Ro3J60l0j30RJ38q8qrO6K3m7m9L9O8q8l8K7J14n0
3841B7j00M2L5k3J4M0L6j4o6MO6j9p0n6J44o2qk3M2J6j03j4J22rm7o9O7J05p8
3870an6J18j2q9pK5R1p6m7M2N3p4K8k6Q0l2k7m1J27oj59R0M3Kq8q3J31M6o7l4
3900d9M4M6q0m1P6Q4o3j00J11ln8J4j4K0Lm2O5M7k3o5J3J01k9n9L5k0K7l8m1J04
3930F5J3j43J3Q0J8j03N3M9L5l6n1lM4j9j8j2K1k9m8L7P7jj08L1J12p5p0O2L4
$$ plain form
3725 58 -63 -40 24 6 -18 -61 30 81 -43 -85 15 83 21 -69 -57 62 36 -60 -78 29 15 -3 -15 89 69 -66 9
3752 9 71 -7 -66 -120 18 54 0 -45 0 92 -29 -68 8 53 -43 -43 -18 3 -11 -84 -33 35 14 -29 -29 90 40 -31 -9 39
3782 39 -26 -10 -15 76 28 -52 -77 67 52 -32 -78 43 9 -47 -32 71 66 -113 -1 11 23 -9 -38 -2 42 77 -32 -28 47
3811 47 -11 -91 -55 24 46 -11 -41 47 -26 -17 -80 80 50 -80 -71 67 -21 -29 -38 28 51 4 -45 -6 62 -26 -64 -37 77 27
3841 27 -73 -31 4 -19 -5 35 71 57 -9 -5 61 42 -28 -84 60 -2 -10 -33 9 25 -78 -92 30 21 -26 -95 -28 77 -1
3870 -1 -57 61 49 -40 -47 -22 69 -7 -54 -12 41 -33 -5 -31 49 17 -10 -51 76 70 -89 1 44 46 -42 -125 6 52 -15 -49
3900 -49 -5 41 -39 -80 -4 80 17 -83 28 25 -33 -19 -33 -13 -10 -52 13 60 37 -28 -15 86 57 -2 33 13 40 2 -39 65
3930 65 78 -65 -52 28 46 -57 -4 45 80 44 -7 -10 34 15 -3 -15 6 -23 -71 -34 43 42 -66 -35 77 2 -68 -6 28
3959B8k5mk0k1L8n1L3k7O9l4o6Q5P5p3n2K5Q5m4q7J17Mm6m3J8R4n9j3J1K8l3o1
3990d9pN9N4j14PO9j4l9KL0M0j06jJ10K2n4n1nJ53j65J9M2k1K5m3N9N0j09O6q1
4020e2Q3k5p0P3NJ0j7m7Q1q9M0pJ4P1j03q2J26P2r8o2J15J5j23K1O9K3j9o0QR4
4050F6j06%L8N1n0p2K5J02j0n4j9N3rn4k9R2k1l5j9Q4rj02QJ18rp5m3L1Q3J6m7
4081Dk6Q0o4l3J0J26r3j5j7M7M4j48N5J34p4o3L3J22j00m2KL3J7n4l0N9Oo6j8
4110g1P0n1K1J4J6Q7j15p4L8Q9m4j5MQ2n0k9M2L2k0j0nO1p7l0k2L8Q7l7j0J1o
4141B6o0LO7Jj6o1P5L7lj17nP1Mj0n1J4K6p1J2O0N1j01L9M6j4q0M6k0K1J8o7R6
4173C7J1o0l9J24On0o0J11kp3j8K0M7q6k6J10J2m0p1N6oj9j8jN4Nj15O9L7O4q9
$$ plain form
3959 28 3 -1 -21 -42 -4 -55 -22 -49 20 -14 -80 5 80 7 -45 -20 65 21 -66 51 55 9 -34 -16 78 19 6 17 45 12 -49
3990 -49 -56 3 57 -57 -50 19 5 -34 -32 -2 38 -68 -69 41 63 9 -42 -47 106 -59 -40 2 -19 6 -37 22 72 -37 29 -52
4020 -52 31 6 -64 9 14 24 7 -40 41 -48 -8 -15 -1 70 -33 -115 11 83 -15 -77 38 53 -70 -49 20 43 24 -36 -28 66
4050 66 -40 -40 -2 49 -1 -73 -48 54 44 -10 -29 24 15 -39 -68 24 3 -32 -51 33 24 -78 -70 48 39 -36 -79 -48 35 51 4
4081 4 -22 58 -6 -39 -29 97 4 -11 -28 19 63 -85 -30 104 30 -33 0 122 22 -20 -18 15 32 -22 -52 7 13 -53 -71
4110 -71 -1 -52 -31 -17 -1 86 -29 -103 -65 24 -20 -35 -31 51 1 -28 14 46 26 16 11 72 -5 -35 -57 -19 68 31 21 32 26
4141 26 -34 -31 36 37 21 -40 35 72 69 -48 -53 18 22 12 -39 -25 1 -70 -58 2 53 -48 -9 37 23 -57 -11 -31 -10 8 -59 37
4173 37 48 -12 -51 73 79 29 -31 80 78 5 -13 7 54 -32 -58 52 64 24 -47 9 3 -16 -34 -35 19 24 -91 -22 15 79 -10
4204a0m0P6j8Km7P1K2p9n8J17L9l4q6N4K9j6j7k5L3J6q0L2P1k0p5L3Q4l7q3K9
4234a7O8rp4QQ6l6n9K4k6L3op5J11rK0q0N6P0m1j04M1Q2n6o6N7L7kp2L6P9m2j5
4266A9k4L3Kj15O6J5L1m8%M0M0l6n9N4jon5J5N5l6p7J04M5q8l5M8M4l8l4L0L7
4297B6l9qJ4N9j7k6r6J41k5m6j9L8L2q3K0P4Qn8p7Q3J0k4J1l9J34j39M1lK4k2
4327fJ2r%Jo0N7K3l2m6R8N6m8n5j9O3K5r5k5O5M6r7J2R4K7j14J1K7Q1j29j7O0
4358FJj2n1K2Q9q8J7k1O2qq2M3M6K8j26L3M4L1o9MKJ8K7p7Q6n9QKJ1L7k8n1LR6
4392D4q3N1m4R7l9r3M7P5n9m0NN8j2r5O4J8M2l5m0L8J1J3m5J5Q0n5k3Lk5N2o7
4423d2K3P4m0q5J25k7l0m4LR3l7l6O0M4m6r0K7L5N9r4j1M6J2o6NJ1J36q7j04J05
$$ plain form
4204 -10 -50 26 8 10 -37 34 56 -23 -81 36 75 41 -45 9 38 22 5 -20 13 29 -51 -19 52 32 -43 -10 74 37 -46 -17
4234 -17 51 42 -32 -24 62 26 -33 -9 -35 -2 -8 -83 28 19 39 -41 15 85 44 -60 -19 63 7 -59 -2 35 33 -39 -3 76 34 19
4266 19 -5 28 30 -85 -19 -4 27 -21 -21 19 59 23 -36 18 17 11 -44 -29 26 -10 -87 17 62 -26 -61 -13 31 -7 -41 -11 26
4297 26 -13 -21 -7 52 35 9 -87 54 29 -17 -36 2 34 -49 -29 45 53 -5 -82 1 11 -13 -2 -41 93 -46 -5 -8 16 -6
4327 -6 6 -3 -3 -2 -62 -5 18 -14 -60 38 94 46 -9 -28 35 60 -35 -60 5 51 -46 -34 60 87 -27 -16 11 92 -37 -54 6
4358 6 7 -5 -56 -34 55 -33 -16 -37 25 17 -65 -22 24 52 -74 -41 3 34 -35 -31 -29 -11 16 -61 25 -34 -26 -24 -13 24 -4 -55 -52 44
4392 44 -39 12 -32 65 26 -67 -20 55 -4 -44 -39 19 7 -88 -24 -6 36 1 -39 -1 10 23 -22 -7 73 18 -5 -2 -27 25 -42
4423 -42 -19 55 15 -70 55 28 -2 -46 -43 50 13 -23 37 81 35 -55 -28 7 66 -28 -39 7 19 -47 -42 -31 105 18 -86 19
4453A9M1j24l3R2N7q0jL6L5l9o2O4L3jj41P2J4Q7r9n0P7Q0j05j3N2J3Ll4L9M1
4483G3j23L1N4j0n9k3L3J03j00%M3M6n9p0M0J16m8q8J7P7k5n0k3J12k5p4QN1M9
4512G6p5j3L6N0l1r4J01k1j15R2M8k9K3n5j4M7l6j7k6R7k6r3L5P0l4m4N0M4m2
4541Dm1n7J22Kp8KJ00p8L1l4L0j0J9Rj0N1j18oM8O6J0p1JJ4k6j4KN9m3k5L5O6
4573F0n9k2OP0k2m4n9P8L0q5J7qQ9r7J5J3L9Oj19Q8J08m4r6O1N9r3rk0J06j3n6
4604aN2m8P5r9jN6Kn6k0J12m5p1N4qM1n1j9M3L7k7r1J6Q6q1l6Q4k8L1p4J4R6l1
4636A2k3k4N7J0p1L5Q3m8p0k7J55k1p7m7P9j7rl5J00k4o8j7M9Lj0m0N2on2J8O9
4667C6Mk9j4NnOl5j5L4J8l2jP1N3p9k3Q2k4m3k1N5k9%j4J9ln9nj6L6N1o9L0L6
$$ plain form
4453 19 60 -64 -97 -5 52 -28 -29 7 42 3 -59 5 38 37 -104 -32 -18 69 -30 -80 -3 77 -28 -41 11 24 27 -7 32 73
4483 73 -50 -19 35 25 -34 -57 -24 79 -21 -21 22 68 9 -61 -21 95 47 -41 -24 53 28 -22 -45 67 42 -32 -24 27 76
4512 76 1 -12 24 74 43 -51 50 29 -86 6 54 25 48 -7 -21 26 -10 -27 -53 44 18 -75 -40 30 -4 -48 2 46 4
4541 4 -37 -94 28 30 -48 -46 54 -24 7 -27 3 -7 12 21 11 62 -56 -62 -14 52 62 -9 -8 6 -20 -34 -32 27 -16 -41 -6 60
4573 60 1 -21 -15 55 33 -11 -70 8 38 -47 -30 -38 51 -46 -31 -18 21 27 -92 -4 104 60 -36 25 84 -9 -18 -38 68 55 -1
4604 -1 51 3 78 -21 -22 34 36 -20 -40 72 27 -44 10 2 43 -8 -27 16 53 26 -65 -49 37 -44 -80 4 -24 7 -67 -53 43 12
4636 12 -11 -35 22 32 -39 -4 79 31 -39 -66 89 68 -9 -56 23 6 -3 -38 62 38 -30 -47 2 5 -5 -45 7 1 -51 -33 36
4667 36 40 11 -3 2 -3 3 -32 -47 -13 5 -27 -28 43 96 17 -6 76 52 9 -12 43 14 14 0 19 16 -43 -48 -64 -28 23 -46 -16 20
4701B0O6r7j4M7Qr3pR4Jp2n1J55j5o1JK6PK5k7j9L6p6RQ2j3l0p9P6K0lj03P4J4
4734Aj9k8M8N7p5n1L9M7M5j16%O1j1jo7Q4Rk0n7O0K7m8r9Q1L4K8q5J6Q7j04j7
4765g4P8NL6o6rR1r1K3oL8qj2k3j4N0p7L9J7j0k9K4M8L6n0j34J15Lnm6R0M0r6
4797a7j5j4O7j0k7j0N4l6k4J5J23o5p4j3N2J1k2j4M9Mq4O6j2M3n0k5M1K3n0m3
4827e7N9N5j20j1J12J9n3q7P4M5qp0K3R8n1m7k5O9Rk7q2J40p4n2MJ50q6K8p1K1
4857a5Q3r8JQQ1q1qrR5p4n3R2J8p7m1J6J20k8o7MK3Q9j41j8J32j8n8p8J31N4j32
4888d9J0M8L1q6L5N9n5Qn4M4M2J7j68O8J21j24J6P8n5K6n2J0J01K6j32m1J35l6
4916B3p2j0P2rm6m9J27k3n9LO4J4l0p6J21k6m9M6JO4j07l5P7j6J4p6M9J27j03
$$ plain form
4701 20 86 -11 -25 22 30 -63 -70 24 25 -47 -98 57 42 -19 -18 8 15 40 13 -6 30 -46 -37 45 32 2 -77 -1 19 16 -87 -13 1
4734 1 -18 -46 2 59 -16 -67 -28 19 64 -52 -52 9 -2 -3 -70 14 23 3 -54 6 33 -15 -114 -33 1 29 -56 -40 47 -57 -74
4765 -74 4 9 45 -21 -30 61 -30 -7 -13 25 17 5 -18 -32 18 -59 -20 -3 -13 -42 -18 30 66 16 -118 -3 0 -5 -51 39 79 -17
4797 -17 -32 -46 21 11 -16 -26 28 -8 -32 -17 106 41 -33 -46 6 17 -5 -19 30 34 -50 16 4 47 -3 -28 13 36 -14 -57
4827 -57 2 57 -63 -74 38 57 4 -83 -9 36 28 -42 -19 79 28 -19 -44 25 34 7 -75 65 -9 -61 -57 93 7 35 -36 -15
4857 -15 68 -30 -29 -21 60 -21 -29 -38 57 -17 -70 22 40 -37 -78 -62 58 30 -37 -33 -10 79 -62 -80 52 34 -24 -102 29 83 -49
4888 -49 -39 9 40 -46 -11 48 -7 1 -53 -9 33 50 -118 -50 71 -53 -37 41 -14 12 -40 -30 71 97 -35 -76 59 23
4916 23 -49 -59 13 4 -42 -91 36 13 -46 -43 21 35 5 -71 50 24 -25 21 22 86 -21 -56 21 5 19 -57 -8 119 16
4945A6j6QL5Op1k8J10q6k7K3P2mn2L8j9m0m1j4N9N1rm6M3Qk9l9O2RL9q0J4O3m1
4978A4j00RQ1O9q7o2P8L5q8L5M4k9k3J0M7nj26O7K1M6qr8N8O6n6r0J00pj6qRK4
5010A0j7j8QJ9M2n6k5N5J5n8k4J04j8r3L5Q1o0M8j14Q7jn9jQ4J1r9m6R1O3l6l8
5041a0kM0k1j25J56m6l1nM1j7O2o5m7Q1N8n1p9R9m3M5r6Q2nm4j9J7N1kj15J06
5071A5jop8O6L4No2M6mo6P1o8P4k1q2Q2J9K0l3KRn5mPL4J8n9jJ05j7j25m8J05
5104a8J03o8Oo3R5J9j20L1R7m3j00L7R8j6j72J27oj8m2N6K8K2j34qJ16J1n6L5
5132A7K0j9j9l1Q1J4Jj29L8K5l0M0j3K4q0OO3M3l5qKM7k2r4K8N9J4l8nN1n0j9
5164a9qJ06p8p8kJ09j5j6rM2K8o6K6nK7m4mj1J24n7m7lN6j0p9n7Q6L7j05O1M9
$$ plain form
4945 16 0 8 43 49 -22 -50 60 -26 -53 -30 42 38 -14 24 5 -35 -76 -90 -31 20 11 -35 8 16 -13 -52 10 19 58 -22 -8 55 14
4978 14 -86 -77 4 73 -14 -76 2 37 -51 -16 28 -1 -24 -14 33 28 -98 -31 -10 36 28 -70 -12 54 -2 -92 8 1 -15 -23 -14 10
5010 10 -7 -25 -17 2 44 -12 -37 18 33 -25 -49 55 37 -56 -21 60 0 48 -66 21 20 -39 -40 44 55 -44 -90 1 64 28 -10
5041 -10 -12 28 7 -118 38 -8 -39 -44 -3 -20 42 -23 -70 11 69 18 -61 38 -5 40 -56 26 21 -23 -42 -25 26 24 -91 15
5071 15 14 8 -70 -4 30 35 -27 19 15 -51 20 -48 26 5 -77 5 24 44 11 13 22 -33 -37 -30 4 22 -37 -38 67 50 -75 -123 -18
5104 -18 85 17 23 -40 55 74 -46 -15 82 39 -61 -24 74 58 -114 13 7 -11 -53 3 31 53 -81 -89 27 38 -18 17
5132 17 37 18 -1 -32 49 63 64 -65 -27 -2 -32 8 -5 19 -61 -55 8 51 16 8 10 57 35 -59 -31 28 42 4 -1 50 0 -19
5164 -19 -27 79 1 -77 -79 30 15 -1 -10 32 60 -6 20 15 42 -2 -6 -17 107 50 3 0 56 46 -33 -90 -4 33 -72 -11 38
5195C8J2q5MQ4n1p1O7j5O6r6k9P7L1p9n8J04M7p3NO7J5o4k2M2L4k4o5K9O2j3n2
5226a3m4R3N0j73L9P8M0n0l3J6J2No0P7j5m7k8M9N2l9o0Q2k3J6r9J14n0N1j06
5255f6Q1l0l4J6JP1kq3J7R8p2k6j2N4N0j27K2K9M1m7J2j5Q2n9p9Q9K3m8mK3M2
5286D7k1j3k4Q7q0m7J8Q4l4o3L1N2j6kq1lL9nK6K8Qp2J6J2N7qo5P3Rn7K0nL5o7
5320b1l5J10J2n5%M1m9J4p2P0M2p1K3n8Q0J9j2p1L5L7lq8Q6l4k4j6L0N2p5j6N9
5351A0N2j9o2L6K5k2m3K1R0j08j5L0L4l5n0nNQ8q6O8L5q4K3p2J13k3J6p3K8O6
5381D3q0R6j06P5kq3K9O5o2j0k1N5K9j10J02l1J5q3O8j2M0l5M4m3N4n3JkL8l3
5411a2K0JJ6p6M5L8m0Ok5L4P2j29O9j5L2k0j3K8K9p3k3%P3n9m2J40r5O9r2O6P9
$$ plain form
5195 38 50 -35 -31 53 2 -69 -2 -17 49 -47 -76 1 32 -47 -105 -1 46 -27 -22 45 60 -4 -26 16 50 26 -39 -10 52 39 -13
5226 -13 -57 36 86 -87 -48 30 70 20 -13 3 15 20 -40 37 22 -25 -53 -4 48 9 -51 31 8 24 -75 39 -11 40 -66
5255 -66 15 -15 -49 -33 -32 39 37 -46 -29 69 -3 -29 -41 13 63 -64 -42 -13 28 -19 -7 -22 60 1 -78 11 34 -14 -18 5 47
5286 47 26 13 -11 76 -4 -51 -33 51 17 -46 -15 37 21 19 -62 -65 -26 -31 -5 23 31 -41 -25 -13 44 36 -29 44 53 -4 16 11 46 -21
5320 -21 -56 54 66 11 11 52 3 17 -55 15 57 -14 9 -49 31 50 38 -33 2 39 36 -52 34 0 -24 -40 -10 42 -33 -49 10
5351 10 62 43 -19 17 42 20 -23 -2 88 -20 -35 -5 29 -6 -56 -61 -56 32 -54 14 49 -35 -12 -84 29 6 22 -51 -23 43
5381 43 -37 59 -47 28 26 -57 -28 37 -25 -35 -56 -1 28 -82 20 -11 4 -79 -11 -23 17 -18 26 -17 37 -16 -15 -17 21 -12
5411 -12 8 9 25 -51 -6 32 -8 -2 -27 7 79 -50 19 4 36 16 3 31 60 -13 -36 -36 37 -22 -64 76 -19 50 -42 24 103
5442A03n9Mk2j7N8o1qJNql5K9K8Jq6Q9L4l8o0L4K3Kpn0N8L8r8JR8k7J5j16P9L1
5476C9j4r7N6Q5j07m2P1K3o9O6j8L5J7o8OQ3q5K1J9Ok1m5O8K3k9l3P1p2K4r8N1
5507c4P3n1K7l3K5M3p4j8M6rJ1l6M9k4jm4J6J01o8p3P0O4o5rj2N8L6r7RO8j9m
5539B5m1kL7o4k9N5Q8q9n8R4J3q7k7Q1O7p2l3LNQ9j06J02k3Mm9j6O0J5n0j1N8
5570C9p0m8J07j1mm1J5J04r8Lk2L3N6q0j7L8O9j10K0K8n1K5kJ6L4o2m5R4K3p7
5600c4L0j3L0n7J8J4M1Km8k9N9j7J0j2K5k4k1jM9Oj2OJ1j8k4RL9n1M0r6P4M1p9
5633c2l7J32n7k2L7n7J17p0n5L9j7J1K0k3O1o9J5M1Ll3n8N1K8qml2j5M1K3l2N2
5664E0Mr6N1k0J8K3k0l4J04r4P2j13L0N5l7k9K9L6l7K7qk6J2J2O0o3Pj4K8j8N0
$$ plain form
5442 103 44 48 26 9 67 6 -2 -1 4 -4 -39 -10 18 19 -67 22 56 18 -42 -8 15 17 10 -40 18 56 -42 -41 57 30 45 -71 8 39
5476 39 25 -72 -16 69 -38 -80 -9 14 -55 11 -7 28 45 -23 -17 66 -19 2 21 27 6 -39 29 52 23 -10 61 -11 13 -85 -34
5507 -34 39 -12 15 -18 7 50 -24 -42 4 -5 6 -30 19 -5 -6 -50 -34 67 -1 -74 -4 60 -5 -14 -26 32 68 -29 -20 48 29 25
5539 25 -16 -18 19 -45 -74 -19 69 -20 -78 16 29 -58 -85 -4 63 -9 -42 -39 -34 55 -51 51 28 32 -17 -33 27 42 -8 -19 39
5570 39 -31 -79 28 17 13 -28 -13 91 -7 -4 -26 7 63 -17 -34 4 73 -37 -17 11 -40 -15 -17 -1 33 -29 -74 20 43 -34
5600 -34 -4 -17 13 -44 -26 -12 29 31 -17 -46 13 -4 6 -6 19 -5 -26 -27 22 28 16 22 33 15 -9 0 39 -12 28 -68 6 47 -32
5633 -32 -69 63 6 -16 21 -36 81 11 -44 -5 -22 -11 9 -14 47 -22 -7 34 37 4 -54 -3 25 17 13 -19 -34 7 30 -2 50
5664 50 54 -42 9 -11 7 30 10 -24 80 -14 58 -55 -25 30 -7 -36 -7 29 -8 19 11 -15 -3 9 69 6 13 -1 27 9 59
5695E9k8nO3r6K8l5J5j1n4RL4J6m5M9J3K6m5J6oLn3M8K7q2K5K7L8o9lj3O8j1o9
5728f1J3M1O6m5o3L7M1o3m7J09l0M9m2K0jj6rP5j4j9q1jRQ5q8K9O7l6l4n2P3j
5760A1k3m2N8lQj3l0J8j7L1mOMo1Q5mL5n6k5O3m7oJJ8j0J5k4K8J0r3L6P5o0n1
5794f7PN3N5l2k1j3O4q2kR0j4l3k7j7O0k2n3QP1q8J9OK4ll6M1K6k1nM3m4L9Lj1
5828A8J8k9n1J5NP4o9k7L6N5m6j0k9Q2m8j6O6l6k5K6JJ4l0l4oN9L3o2j4M3L2k5
5860B0m6J2nO6j20R9Rn4lO0j3lmj3J6l6j7QQ0n2k2J9N6m3o5Q2k0J0m4k2P4ml9
5893a4L5j4K9p4RlQ0o0Nj6%N3j0J1k5j2n0N1L5k2l4L8P6k6o9Q8m6k6J1l6L8lm6
5926b7l6M1N4n1OK6qp1O9J3k4m6O6n3N8k9PJ9K3l9J0J0j6k8m0N1l2O5rl9P8m9
$$ plain form
5695 59 31 26 89 -7 21 -14 1 -10 -64 -55 -21 -5 -50 -1 12 38 -7 9 3 6 -47 1 28 -54 -29 -2 36 -33 -36 -49 19 8 -61
5728 -61 -48 -7 59 14 -49 -12 29 -34 -81 28 -2 47 5 25 24 8 -1 74 60 41 -40 -41 -32 53 -35 -6 61 25 -9 -61 12 11
5760 11 -12 -54 4 1 9 -4 -34 -16 -33 -2 -6 0 4 -57 28 24 59 3 -22 41 -6 -12 -11 7 -3 12 -12 16 26 -67 -31 44 -16 -67
5794 -67 -60 -7 48 16 -5 -18 46 -36 -38 52 38 5 -22 -39 21 -1 -54 -46 25 -63 -44 -38 -14 -17 -53 -12 14 -7 -12 31 -13 26 29 18
5828 18 36 7 -44 -29 -24 50 -19 -46 -10 45 -1 -11 -40 42 -6 -22 44 8 -17 9 10 24 -6 -40 -46 13 46 -16 -30 13 45 20
5860 20 -26 -14 -19 47 -73 26 35 -19 -22 38 25 22 18 5 21 -15 -32 -24 56 4 -18 1 57 14 -51 31 11 21 -23 -45 29 25 -14
5893 -14 21 7 36 -38 -29 -32 48 -12 -7 -23 -23 30 20 31 6 -6 -56 -5 30 8 -26 12 88 62 -7 81 35 9 20 -16 22 19 -27
5926 -27 -63 -22 32 -19 -13 13 5 -66 3 16 -8 -54 12 -41 17 -12 -5 14 37 -2 8 18 2 -26 -66 -15 -47 18 9 -30 48 -1
5958apl9N2Jj9K9n5K8O7J5m4j0n0JJL2m4K7l0J05p4K0Lk2M3k2n2J04j8q6OJ2L0
5991CN2m6K4L1r6M7J6j7j7k8L5K9k4L9j6j4q4J17Ql6L2p3J3jJJ0o6M3Ql7K3L7
6023A3K8l9l7J3P0q0Q0p0L9l2j8N9L3k7jk4o0J7j1P0%l3j3M5j3L0J2kn7k7O2l3
6055fM2o4M8rM1l6j3KJ3jl4k9R2l0k3j7L3%RPmM2j37N3J4ML9r9J00Ll9m4j7R6
6089C6M5p1o0O6J8m8J6L4j9m6k1O0K5oJ6n3M8j7k9L8Pl4p1J5L7N4qJ5ok0l7M5
6121B9j5m6mL2KN0o4lK4K0k4l7L3P7j01%L2j8k8O6m6K6K5k6Q%MLk5j8K2J5%lj8
6156hK3L1q4LQ5n6LO2p1nP8j1j16O3N9p3J5k2k5P6k5p2L8K3N9o1K7l1jJ7K7m2
6188a4P0l7l8QO0o0k0N2k5Lk2J7m9j0MN0K4J9J2Km6j9j6J03p4K8j4%l3L3J3m2
$$ plain form
5958 -1 -8 -47 5 6 -13 16 -39 -11 56 71 27 17 -33 -32 -31 1 -43 -16 -46 59 -15 5 8 -14 29 7 -45 59 41 -45 -39 -27 3
5991 3 55 9 33 64 -32 15 31 14 -3 -31 4 33 9 48 32 18 -66 51 59 23 55 -18 -5 -6 -5 5 -61 -18 -10 -47 -24 13
6023 13 41 2 -35 -22 48 -32 48 -22 17 -15 -33 26 59 32 31 7 -53 -36 -47 23 23 -10 -23 22 9 39 51 49 -8 -35 27 -6
6055 -6 36 -28 20 11 52 16 3 5 18 17 -17 -46 46 16 -7 -24 9 9 18 25 21 63 -74 -21 -7 -3 36 -63 37 40 1 -43 -60 36
6089 36 81 10 -50 16 34 -14 2 36 17 -29 -50 10 35 29 45 -8 40 23 -6 32 39 5 -66 -51 -14 40 32 47 41 21 -16 29
6121 29 14 -32 -36 -4 -2 48 -16 -19 5 25 1 -36 -3 74 -27 -27 5 -13 -41 25 -21 5 30 4 12 12 16 19 -6 -24 -2 13 13 10 -8
6156 -8 15 46 -38 -35 50 -6 -3 59 -12 -17 61 50 -66 -3 56 -17 -2 -24 -49 27 2 -70 -32 -9 50 -11 16 -15 -16 1 28 -14
6188 -14 56 19 -19 -11 49 -11 -31 21 -4 -1 -23 -6 -55 -65 -61 -11 13 32 44 46 0 -19 -35 68 -6 22 8 8 -25 8 21 -21
6220b1J9Rk2j3k4M2j0JmK9j7L3Jk1n9L6k2N6o2J00m1K6K6m4L4n6L4q9R6k1Nk1
6252@N6mm8l6Q2m2L5n5LPO4k7m5K8q0L7k4N6J2k3k2k7J31p8j7L2m0N0j9JL9r9
6284e3J7qM3J0l3M0Rp6P5l7K8Kk7N8j3j6k4l2K3M0On2L4j3l8K7mPj7J10r9K3J8
6317B8%J5q0P4o8O0l9k3m6P4K6J6p7k3P8j5MMm1M5M7q2mK8K1l6M2pk1P1o6K2J0
6350C7n1L7m5O1p5P1j3j0l3P2l8J1Jm7K9N8p2O6n1k4%M2n2O5m2M2l7NK1m3N9n3
6382iJ4NK7pl0l2J5K4l4M6L2l8J9k1o0O3j8R1p2m7L8l1P1L6p3K4m4Q2n3K1o5M0
6414A4j8L1p3N7J2j7l7J9K0o0N2J6onJPkj2PL3%p8M6J8jM5o5mK5lJ6n5N9m3pM
6450dP1m9k6m5K1Q0r2RK4%K8n1k0O3J2L%m7K8MK5nQ%n8M6O2m4k5k1l2P9l4j7N8
$$ plain form
6220 -21 -2 7 -15 -28 -52 -10 -20 -19 -23 6 -11 22 23 2 -57 -21 -43 13 -49 51 10 36 62 18 52 -4 30 -59 37 16 21 0
6252 0 56 52 4 -32 50 8 43 -12 -9 -2 62 35 -10 18 -62 -25 -49 7 19 -4 -26 -53 78 0 -17 15 -25 25 6 7 46 -53
6284 -53 -36 -44 -1 9 -24 16 25 -51 24 -13 15 17 -10 48 35 19 -5 -37 -14 26 32 -20 14 1 -37 -10 -14 -7 -24 86 -13 10 28
6317 28 28 43 -37 37 -31 29 -10 -33 -79 -5 21 37 -40 -63 15 0 4 8 -33 12 59 -23 -27 1 22 -14 28 21 0 71 5 27 37
6350 37 -14 23 -22 39 -36 35 22 12 -21 51 13 24 25 -22 7 65 -7 59 8 -16 -16 26 -26 39 -3 39 2 7 28 -15 44 -9
6382 -9 5 10 37 30 0 -32 -17 7 -27 19 51 13 32 11 -49 14 -4 87 15 -32 6 -25 46 82 9 33 -11 71 18 39 -26 14
6414 14 -4 27 -46 11 23 6 -31 -12 8 -52 0 16 10 5 6 13 11 -1 6 39 39 -39 7 25 24 69 4 0 25 22 38 -17 42 -1 -8 -4
6450 -4 67 18 -8 -53 -32 48 -44 -35 -11 -11 17 -34 -54 9 21 24 24 -23 5 9 34 29 37 37 -21 25 87 43 18 -3 -35 44 10 -7 51
6485E1n8K6j10O3N7p3L2O0q2O0j8l6M4k8K6mM1K1m7J7l2M5o7NN6r2J6kJ0L7N5
6516G3o6L5l4nK3M2k8n3N3n0NK5j2j0oK3J6k6k8L7j9K4j3nm0O3j6j5n4J7M3No
6549blM7L8p0Nl6Q0m7qjk6L9n0l5J25p3K2j6L5n8J4jP4n6Rl4j0Pl3P7l0l2P5k4
6583Bj5P3j30R8%n6M4j8M6l3k0K0p0M7kj9J0P0n6k5N6J6m6Rk8K9n7M3QJ5m4K2
6615a1O0p0J7j9OK2pk8L2O3m7L9o0Pn6L7L6L5o4n6N2K7k8O2q2P6k6j8j0Pj5L4
6647A5rk1j1Pj6M9m5J2N7q9P0o4N3l3O3l2kOj8j1j0P8m8k5O3l7k2Oj7N3L7k7m0
6680hj8PK6K0j2K5l0Jm1QN2Kl3l1O3K8o5P5K9j03L2j9l1J39j03J5m1M1o2nM8j8
6712iLL7o8Q6m7J3Ol2L7k5l9J4N3m8lQ8k5l7m5M2p2Q5n0MMM1q4R0j1l4L4K0l9
$$ plain form
6485 51 -7 19 -91 -28 29 -44 -12 48 -34 26 8 -28 16 -12 14 10 51 72 25 42 10 55 -12 -7 49 -43 -27 -29 -19 18 73
6516 73 7 42 8 3 26 68 40 -13 40 -10 -5 20 8 -2 -8 15 31 5 -23 14 -5 19 6 1 -39 24 8 -7 -61 -44 -1 4 -2
6549 -2 -5 42 80 10 15 -21 59 12 4 3 -23 16 -34 -69 56 -17 5 -11 24 -34 -20 -21 53 -3 6 -28 -38 -31 -64 13 -17 -49 26 2
6583 2 -13 60 -70 28 28 -28 16 -2 44 11 -9 11 -59 -12 -14 -33 -23 47 -9 -34 22 38 -8 1 -27 2 -55 -12 -4 11 -33 -11
6615 -11 49 -21 -4 -23 -17 5 -2 -30 2 65 18 57 -3 4 -52 -15 21 56 -8 -64 -12 15 -13 49 -33 43 17 -1 -11 -4 -19 15
6647 15 6 -15 -26 -19 -35 14 -31 -19 38 -51 19 -45 8 -25 38 6 4 10 -8 -19 -29 49 1 -24 39 2 -20 -14 -31 22 59 32 -8
6680 -8 -26 -19 7 27 15 40 10 11 -30 -22 30 32 -1 -32 31 59 -6 69 98 -5 27 8 -23 116 13 28 -13 28 -34 -39 9 -9
6712 -9 -6 31 -37 49 2 15 21 -11 26 1 -38 -24 29 -19 -22 66 41 4 -41 1 -71 14 -36 -32 -28 13 -71 19 8 -26 8 28 -11
6745a1j4M7k5N0K9r6j3P3l9m1L5J7l3J0k1L7J0j6l0R5On0J2J3n3k2K7K2q7J33
6775F5j30P9%k4qj4L7ok3O2j6m3k2k5P9q7J03o2M4M8j08J09q5K4l6KN5m3nL8n0
6806d2M3k1KM1l5N1j1m5j4N5On0Q1o4n3N0K5p2J5N0m3P8r9P7j5j9mM8j1l6Q3j09
6838c8N2qj8J7j8M6k9%JN7k0m2J3M7r6L4kJ6o6M1pO8o2k6K6RK7l6k3Jml2M5j4
6872d1R1n2K2N0r2M4p4O3R1r9M4q6O3j6K5p3L8L0Jj7j9l3j1P3L5j2k3MJPq9L4
$$ plain form
6745 -11 -25 22 -3 47 76 -20 -33 40 1 -40 -5 12 -21 -11 -32 5 15 -1 -31 64 70 20 32 45 -8 -30 -3 19 -68 65
6775 65 -65 14 14 -10 -18 -32 5 -1 -24 38 22 -21 -43 -68 11 -76 27 -35 9 57 -51 58 -27 -3 -39 -37 18 -25 -30 8 -42
6806 -42 1 -20 -18 23 -12 39 28 -17 -31 24 30 -20 61 -3 -56 -6 19 -53 -38 12 -31 47 -52 25 10 -9 -13 35 24 -12 71 -38
6838 -38 14 6 -12 5 -13 33 4 4 5 62 42 0 13 60 -36 -2 -4 12 -54 -13 -20 48 -14 -40 -14 -5 22 -14 -37 -36 -40 -72 -27 -41
6872 -41 50 -2 20 70 -22 22 -52 11 102 3 47 -39 24 8 33 -40 -2 28 29 12 -7 -40 -51 22 57 45 22 26 27 34 -55 -21
$$ [...]
8191g5
##END NTUPLES=NMR FID
##END=
