##TITLE=1H_V
 200.13MHz, CDCl3,
 8 sc
 
 19ns.20.2.2025
##JCAMPDX= 6.0         $$ Bruker NMR JCAMP-DX V2.0
##DATA TYPE= NMR FID
##DATA CLASS= NTUPLES
##ORIGIN= UXNMR, Bruker Analytische Messtechnik GmbH
##OWNER= pz
$$ XWIN-NMR		Version 3.5
$$ Thu Feb 20 14:34:04 2025 Russian Standard Time (UT+4h)  new_Human@DPX200
##.OBSERVE FREQUENCY= 200.1313
##.OBSERVE NUCLEUS= ^1H
##.DELAY= (6, 6)
##.ACQUISITION MODE= SIMULTANEOUS
##.ACQUISITION SCHEME= undefined
##.AVERAGES= 8
##.DIGITISER RES= 18
##SPECTROMETER/DATA SYSTEM= spect
##.PULSE SEQUENCE= zg30
##.SOLVENT NAME= CDCl3
##.SHIFT REFERENCE= (INTERNAL, CDCl3, 0, 14.3821)
##AUDIT TRAIL= $$ (NUMBER, WHEN, WHO, WHERE, WHAT)
$$ ##TITLE= Audit trail, XWIN-NMR		Version 3.5
$$ ##JCAMPDX= 5.01
$$ ##ORIGIN= Bruker BioSpin GmbH
$$ ##OWNER= new_Human
$$ C:/Bruker/XWIN-NMR/data/yarkov/nmr/H-C/1/audita.txt
$$ ##AUDIT TRAIL=  $$ (NUMBER, WHEN, WHO, WHERE, WHAT)
(   1,<2025-02-20 14:31:06.06 +0400>,<new_Human>,<DPX200>,
      <created by zg, POWCHK disabled, PULCHK disabled
       configuration hash MD5:
       00 E9 B6 7A A2 85 ED C7 34 08 36 98 17 FE 4E 26
       data hash MD5: 16K
       1C 47 C8 4A 69 4E 2E 84 23 3B 42 4B 40 66 DB 2C>)
$$ ##END=
$$ 
$$ hash MD5
$$ 9A A8 12 8E B4 00 B2 D6 B1 41 7F 7C B5 0B 95 ED
##$RELAX= 
##$RELAX= 
##$RELAX= 
##$RELAX= 
##$RELAX= 
##$RELAX= 
$$ Bruker specific parameters
$$ --------------------------
##$DU= <C:/Bruker/XWIN-NMR>
##$EXPNO= 1
##$NAME= <H-C>
##$PROCNO= 1
##$TYPE= <nmr>
##$USER= <yarkov>
##$AMP= (0..31)
100 100 100 100 100 100 100 100 100 100 100 100 100 100 100 100 100 100 
100 100 100 100 100 100 100 100 100 100 100 100 100 100 
##$AQSEQ= 0
##$AQ_mod= 1
##$AUNM= <au_zg>
##$AUTOPOS= <>
##$BF1= 200.13
##$BF2= 200.13
##$BF3= 200.13
##$BF4= 200.13
##$BF5= 200.13
##$BF6= 200.13
##$BF7= 200.13
##$BF8= 200.13
##$BYTORDA= 1
##$CFDGTYP= 0
##$CFRGTYP= 5
##$CHEMSTR= <none>
##$CNST= (0..31)
1 1 145 1 1 1 1 1 1 1 1 1 1 1 1 1 1 1 1 1 1 1 1 1 1 1 1 1 1 1 1 1 
##$CPDPRG= <>
##$CPDPRG1= <>
##$CPDPRG2= <>
##$CPDPRG3= <>
##$CPDPRG4= <mlev>
##$CPDPRG5= <mlev>
##$CPDPRG6= <mlev>
##$CPDPRG7= <mlev>
##$CPDPRG8= <mlev>
##$CPDPRGB= <>
##$CPDPRGT= <>
##$D= (0..31)
0 0.7 0 0 0 0 0 0 0 0 0 0.03 0 0 0 0 0 0 0 0 0 0 0 0 0 0 0 0 0 0 0 0 
##$DATE= 1740047465
##$DBL= (0..7)
120 120 120 120 120 120 120 120 
##$DBP= (0..7)
150 150 150 150 150 150 150 150 
##$DBP07= 0
##$DBPNAM0= <>
##$DBPNAM1= <>
##$DBPNAM2= <>
##$DBPNAM3= <>
##$DBPNAM4= <>
##$DBPNAM5= <>
##$DBPNAM6= <>
##$DBPNAM7= <>
##$DBPOAL= (0..7)
0.5 0.5 0.5 0.5 0.5 0.5 0.5 0.5 
##$DBPOFFS= (0..7)
0 0 0 0 0 0 0 0 
##$DE= 6
##$DECBNUC= <off>
##$DECIM= 32
##$DECNUC= <off>
##$DECSTAT= 4
##$DIGMOD= 1
##$DIGTYP= 9
##$DL= (0..7)
0 120 120 120 120 120 120 120 
##$DP= (0..7)
150 150 150 150 150 150 150 150 
##$DP07= 0
##$DPNAME0= <>
##$DPNAME1= <>
##$DPNAME2= <>
##$DPNAME3= <>
##$DPNAME4= <>
##$DPNAME5= <>
##$DPNAME6= <>
##$DPNAME7= <>
##$DPOAL= (0..7)
0.5 0.5 0.5 0.5 0.5 0.5 0.5 0.5 
##$DPOFFS= (0..7)
0 0 0 0 0 0 0 0 
##$DQDMODE= 0
##$DR= 18
##$DS= 0
$$ [...]
##$SUBNAM0= <"">
##$SUBNAM1= <"">
##$SUBNAM2= <"">
##$SUBNAM3= <"">
##$SUBNAM4= <"">
##$SUBNAM5= <"">
##$SUBNAM6= <"">
##$SUBNAM7= <"">
##$SUBNAM8= <"">
##$SUBNAM9= <"">
##$SW= 18.0517328524113
##$SWIBOX= (0..15)
0 0 2 0 0 0 0 0 0 0 0 0 0 0 0 0 
##$SW_h= 3612.71676300578
##$TD= 16384
##$TD0= 1
##$TE= 0
##$TE2= 300
##$TE3= 300
##$TEG= 300
##$TL= (0..7)
0 120 120 120 120 120 120 120 
##$TP= (0..7)
150 150 150 150 150 150 150 150 
##$TP07= 0
##$TPNAME0= <>
##$TPNAME1= <>
##$TPNAME2= <>
##$TPNAME3= <>
##$TPNAME4= <>
##$TPNAME5= <>
##$TPNAME6= <>
##$TPNAME7= <>
##$TPOAL= (0..7)
0.5 0.5 0.5 0.5 0.5 0.5 0.5 0.5 
##$TPOFFS= (0..7)
0 0 0 0 0 0 0 0 
##$TUNHIN= 0
##$TUNHOUT= 0
##$TUNXOUT= 0
##$USERA1= <user>
##$USERA2= <user>
##$USERA3= <user>
##$USERA4= <user>
##$USERA5= <user>
##$V9= 5
##$VALIST= <valist>
##$VCLIST= <CCCCCCCCCCCCCCC>
##$VD= 0
##$VDLIST= <DDDDDDDDDDDDDDD>
##$VPLIST= <PPPPPPPPPPPPPPP>
##$VTLIST= <TTTTTTTTTTTTTTT>
##$WBST= 1024
##$WBSW= 4
##$XGAIN= (0..3)
0 0 0 0 
##$XL= 0
##$YL= 0
##$YMAX_a= 22173
##$YMIN_a= -20392
##$ZGOPTNS= <>
##$ZL1= 120
##$ZL2= 120
##$ZL3= 120
##$ZL4= 120
##$ABSF1= 10
##$ABSF2= 0
##$ABSG= 5
##$ABSL= 3
##$ALPHA= 0
##$AQORDER= 0
##$ASSFAC= 0
##$ASSFACI= 0
##$ASSFACX= 0
##$ASSWID= 0
##$AUNMP= <proc_1d>
##$AZFE= 0.1
##$AZFW= 0.1
##$BCFW= 1
##$BC_mod= 2
##$BYTORDP= 1
##$COROFFS= 0
##$CY= -3
##$DATMOD= 1
##$DC= 2
##$DFILT= <>
##$DTYPP= 0
##$F1P= 0
##$F2P= 0
##$FCOR= 0.5
##$FTSIZE= 0
##$FT_mod= 4
##$GAMMA= 1
##$GB= 0.15
##$INTBC= 1
##$INTSCL= 1
##$ISEN= 128
##$LB= 0.25
##$LEV0= 0
##$LPBIN= 0
##$MAXI= 10000
##$MC2= 0
##$MEAN= 0
##$ME_mod= 0
##$MI= 1.114404
##$NCOEF= 0
##$NC_proc= 0
##$NLEV= 6
##$NOISF1= 3.799351
##$NOISF2= 2.8
##$NSP= 1
##$NTH_PI= 0
##$NZP= 0
##$OFFSET= 14.38212
##$PC= 1
##$PHC0= -974.4493
##$PHC1= -6.207764
##$PH_mod= 1
##$PKNL= yes
##$PPARMOD= 0
##$PSCAL= 0
##$PSIGN= 0
##$REVERSE= no
##$SF= 200.129724274929
##$SI= 16384
##$SIGF1= 3
##$SIGF2= 2
##$SINO= 400
##$SIOLD= 16384
##$SREGLST= <1H.CDCl3>
##$SSB= 0
##$STSI= 0
##$STSR= 0
##$SW_p= 3205.1282051282
##$SYMM= 0
##$S_DEV= 0
##$TDeff= 0
##$TDoff= 0
##$TI= <>
##$TILT= no
##$TM1= 0
##$TM2= 0
##$TOPLEV= 0
##$USERP1= <user>
##$USERP2= <user>
##$USERP3= <user>
##$USERP4= <user>
##$USERP5= <user>
##$WDW= 1
##$XDIM= 8192
##$YMAX_p= 0
##$YMIN_p= 0
$$ End of Bruker specific parameters
$$ ---------------------------------
##NTUPLES= NMR FID
##VAR_NAME=  TIME,          FID/REAL,        FID/IMAG
##SYMBOL=    X,             R,               I
##VAR_TYPE=  INDEPENDENT,   DEPENDENT,       DEPENDENT
##VAR_FORM=  AFFN,          ASDF,            ASDF
##VAR_DIM=   8192,          8192,            8192
##UNITS=     SECONDS,       ARBITRARY UNITS, ARBITRARY UNITS
##FACTOR=    0.0002768,     1,               1
##FIRST=     0,             0,               0
##LAST=      2.2672688,     0,               0
##MIN=       0,             -20392,          0
##MAX=       2.2672688,     22173,           0
$$ Real data points
##PAGE= N=1
##DATA TABLE= (X++(R..R)), XYDATA
0 0 0 0 0 0 0 0 0 0 0 0 0 0 0 0 0 0 0 0 0 0 0 0 0 0 0 0 0 0 2 -8 8 -8 8 -8 8 -8 8 -13 16 -16 16 -17 24 -24 25 -30 32
47 32 -34 40 -42 48 -53 57 -65 69 -77 86 -94 105 -118 134 -150 168 -192 225 -264 320 -383 442
69 442 -1018 22173 3022 -20392 6653 15199 -5890 -8132 4338 1751 -1932 -3069 -5288 671
83 671 7384 -997 -4145 5571 5499 -3251 -3076 -389 1163 972 -6658 -7318 7221 5811 -10696 -2392
99 -2392 14038 40 -12118 4077 9404 -5274 -5153 3664 1128 -119 2400 -1110 397 6258
113 6258 -359 -7379 1537 6762 -3737 -8236 1184 5543 -2203 -6917 1844 9075 -859 -8985 2963
128 2963 10102 -3273 -7729 5421 6414 -4922 -3586 4159 1997 -1946 -1030 -973 -446 1129 -1404 -4131
144 -4131 -120 3727 -708 -4858 1152 6886 3 -6477 2446 8798 -2349 -7504 4394 6512 -5537
159 -5537 -4958 4780 2198 -4203 -1598 637 -342 609 -887 -3022 1734 3966 -2573 -3562 4415 5005
175 5005 -3056 -3480 4123 4686 -3409 -4805 3686 4462 -5378 -5306 4680 2960 -6061 -2484 4464 282
191 282 -3174 1043 1646 -567 1397 850 -1942 1642 4290 -1723 -3944 3009 3785 -4045 -4040 3631 2614
208 2614 -5185 -3778 3995 2438 -4403 -2113 4007 1730 -2887 -306 3003 1434 -650 -603 287 1717
224 1717 1023 -2007 -1772 2013 1335 -3423 -2827 2815 2119 -4295 -3233 4355 2853 -4808 -1643 5989
240 5989 1551 -4642 866 4776 -768 -2266 1606 439 -1155 885 -774 -2747 1306 1834 -3768
255 -3768 -2407 3719 1304 -4109 -957 4154 1527 -3202 -781 4419 2058 -3908 -1159 4909 821
270 821 -4859 -104 3650 -1565 -3246 809 443 -1265 260 -776 -1651 2357 2058 -3321 -627 5087
286 5087 635 -4295 1152 4801 -903 -3779 964 3053 -1094 -3463 8 2358 -942 -3110 204
301 204 1888 -568 -1168 342 608 925 974 -1105 -379 3289 1030 -3547 128 4386 -813 -4732 898
318 898 3725 -2085 -4162 1292 2952 -1882 -3097 1538 2726 -1149 -1721 1645 1814 -463 -301 455
334 455 465 1124 62 -2207 -15 2777 -1269 -4104 1260 3387 -2852 -3766 2647 2775 -2760 -2004 2846
351 2846 2234 -1601 -1277 1925 1945 -860 -1277 988 1278 -664 -1189 -345 408 430 -1026 -2150 560 2365
369 2365 -1640 -3073 2504 3425 -2957 -2409 4256 2314 -3446 -614 3734 395 -2531 26 1272 -372
385 -372 -839 -745 -563 662 141 -1895 -764 1996 652 -1906 -320 2400 1139 -1612 -764 2539 1809
402 1809 -2489 -1660 3117 1310 -3782 -1021 3279 -455 -3477 399 1779 -1209 -834 685 -281 443
418 443 1509 -1029 -911 2810 1247 -2771 55 3300 -459 -2898 430 1972 -803 -2287 -393 1588
434 1588 -35 -2473 -490 2459 110 -2238 691 2209 -555 -624 1146 273 177 1032 -1029 -1275 2095
451 2095 597 -3495 -317 3246 -1316 -3692 1371 2596 -1801 -1970 1698 1739 -885 -884 1032 1617 -197
468 -197 -1016 523 1175 -341 -794 -33 15 42 -298 -1468 -413 1661 -482 -2541 877 2540 -1297 -1883
486 -1883 2209 1978 -1546 -821 1832 1061 -990 -656 561 517 -596 -948 -111 230 -333 -712 -643 140 936
505 936 -202 -1375 778 2145 -823 -1807 2048 2272 -1799 -1329 2242 836 -2043 -636 1229 -30
521 -30 -1398 -773 314 360 -460 -737 197 674 71 -182 98 637 1121 -80 -1199 850 1999 -1230 -2050
540 -2050 1725 1414 -2699 -1492 2211 188 -2401 -217 1447 -346 -747 461 424 328 473 -265 -196 1219
558 1219 916 -1089 -731 1333 497 -1749 -910 1528 371 -2278 -911 1827 410 -2101 -228 2064
574 2064 8 -1494 631 1679 -124 -558 543 351 37 322 -361 -814 532 511 -1721 -1054 1620
591 1620 444 -2346 -385 2260 -51 -2017 666 2147 -214 -1243 628 1458 46 -953 -27 855
607 855 61 -1134 -532 487 111 -702 -670 -77 532 154 -1062 -222 1816 440 -1850 382 2690 -287
625 -287 -2085 1111 2004 -1195 -1489 1073 681 -1101 -745 62 1 -112 -371 -505 256 837 -175 -820 535
644 535 1525 -36 -1337 538 1994 -567 -2005 906 1941 -1511 -2106 1187 1172 -1737 -1164 1101 461
661 461 -921 -386 563 592 249 -165 -72 730 730 -323 -588 684 950 -896 -1497 830 1303 -1567 -1721 1405
681 1405 1022 -1980 -814 1838 375 -1324 115 1007 236 45 69 -39 594 437 -900 -455 1005 135
699 135 -1361 -638 686 364 -957 -949 918 1074 -1299 -1097 1936 1269 -1790 -354 2301 183 -1570
716 -1570 579 1099 -664 -450 120 -474 31 312 -1067 -865 1100 299 -1515 -58 1448 73 -1112
733 -1112 196 1357 501 -985 -280 1391 406 -1469 -332 1368 -194 -1577 54 696 -543 -509 144
750 144 -191 138 489 -550 -344 1312 637 -1351 18 1868 -24 -1544 440 1490 -712 -1406 459
767 459 827 -788 -1025 311 488 -362 -427 125 355 197 -6 -23 443 675 28 -512 113 833 -81 -1030
787 -1030 -32 963 -383 -1564 156 1239 -689 -1416 700 1074 -855 -544 1029 404 -361 278 326 -13
805 -13 526 115 -775 86 794 -568 -1203 451 665 -928 -998 485 685 -545 -775 621 1076 -404 -700
824 -700 911 944 -656 -388 849 266 -489 -19 -74 -397 173 -128 -875 35 916 -571 -1139 759 1055
843 1055 -771 -720 1116 914 -709 -511 1002 687 -778 -502 726 262 -765 -413 266 -144 -241 -192 -309
862 -309 134 546 -333 -563 852 864 -617 -424 1081 551 -799 -388 876 299 -921 -516 676 188
880 188 -980 -347 709 -22 -767 119 367 -59 213 227 -351 460 833 -536 -617 1138 623 -1348 -339
899 -339 1145 -102 -1269 -116 738 -161 -833 -133 656 270 -639 -130 786 350 -437 116 508 113 35
918 35 -46 -213 335 408 -916 -674 1026 240 -1557 -149 1287 -319 -1228 514 1003 -300 -564 470
936 470 654 6 -286 78 500 87 -390 -259 179 149 -280 -575 -162 456 -126 -959 -11 1083 -119 -1022
956 -1022 555 1259 -392 -765 707 861 -464 -531 439 419 -364 -488 18 130 -191 -374 -309 44 289 -196
976 -196 -495 265 830 -186 -776 669 1100 -514 -769 782 673 -794 -567 596 225 -670 -457 181
994 181 217 -285 -367 93 397 106 -217 23 415 396 -120 -233 440 653 -440 -712 605 598 -955 -776 772
1015 772 332 -1129 -377 824 100 -630 -31 495 143 -49 134 115 269 254 -266 -185 472 310 -594 -517 528
1036 528 250 -976 -416 738 113 -885 -188 850 169 -694 34 815 79 -520 189 620 -8 -284 67
1055 67 -90 9 117 -281 -535 261 257 -831 -377 913 120 -1039 168 1009 -198 -535 567 605 -226 -217
1075 -217 214 193 42 -208 -317 66 70 -399 -311 95 144 -135 -209 -150 441 415 -419 -197 981 246 -860 283
1097 283 1050 -398 -855 442 383 -560 -384 181 -99 -159 -151 -218 94 339 -106 -250 259 441 2 -170 181
1118 181 574 24 -607 7 715 -205 -892 123 578 -636 -714 483 337 -521 -159 341 133 -5 140
1137 140 27 130 310 -30 -368 241 460 -208 -573 116 453 -418 -781 309 572 -654 -619 556 460 -555
1157 -555 -117 585 166 -163 203 131 70 252 -54 -361 200 271 -429 -456 221 217 -484 -390 353 483 -335 -414 542
1180 542 629 -479 -299 847 421 -509 -110 506 -48 -290 59 -115 -101 70 -269 -446 283 264 -613 -357
1200 -357 606 271 -465 -96 723 376 -405 -201 652 363 -526 -288 517 80 -623 -209 287 -191 -320 -36
1220 -36 -20 -18 196 -177 -160 479 362 -414 -222 753 270 -680 -119 728 -16 -802 -147 580 -195 -776 -59 334
1242 334 -113 -339 41 276 95 -83 -18 170 370 113 -291 76 520 -30 -601 -50 499 -149 -825 -61
1262 -61 625 -186 -732 94 636 -228 -436 373 449 -185 -131 250 175 92 10 -196 -32 302 -165 -581 25 424
1284 424 -325 -670 219 450 -250 -438 288 604 -189 -368 419 632 -218 -322 397 304 -291 -192 89 -25 -108
1305 -108 -190 -294 30 315 -176 -512 330 534 -278 -389 504 568 -279 -360 485 483 -420 -395 307 269 -513 -337
1327 -337 289 -3 -343 -87 -1 2 102 -91 -181 314 391 -259 -266 516 390 -408 -126 458 84 -418 -236 271
1349 271 123 -440 -268 281 137 -433 -147 305 10 -198 180 117 67 313 25 -297 277 428 -445 -365 552
1370 552 147 -679 -125 459 -166 -502 -4 277 -32 -166 2 254 226 -89 7 283 80 -139 10 49 -30
1391 -30 92 -134 -361 64 249 -481 -371 450 112 -603 -9 584 -87 -382 227 413 -54 -80 106 110 -44
1412 -44 -96 -137 -52 20 -110 -279 -111 132 -67 -294 -67 329 101 -374 -36 493 119 -346 113 568 -84 -437
1434 -437 215 275 -298 -325 39 -32 -226 -128 -102 -169 124 37 -228 -47 412 91 -334 181 547 -89 -337 203
1456 203 384 -226 -337 121 133 -213 -330 40 99 -155 -234 41 152 47 -4 3 95 297 29 -231 65 408
1478 408 -78 -488 122 392 -294 -431 148 265 -305 -310 229 194 -142 -91 193 178 -14 -46 139 182 92 -5 -102
1501 -102 73 156 -141 -301 65 286 -281 -461 210 241 -433 -228 353 300 -263 -73 255 269 -117 -63 181 190
1523 190 -43 -93 9 -51 -68 -158 -171 5 179 -182 -361 274 313 -323 -267 560 244 -429 53 511 -3 -250
1545 -250 112 127 -101 -170 -102 -65 65 -87 -269 -60 206 11 -199 72 175 110 -196 -57 388 332 -294 -174
1567 -174 467 105 -524 -41 421 -196 -412 67 108 -152 -56 -10 -55 130 31 -239 156 390 -1 -213 202 265
1589 265 -48 -136 -21 195 -56 -344 -217 313 -112 -460 29 338 -176 -281 266 210 -76 4 103 78 157 129
1611 129 -107 36 255 -116 -311 4 174 -183 -411 16 238 -154 -324 150 277 -140 -233 262 313 -135 -87
1632 -87 270 102 -177 8 61 -65 1 -83 -313 -30 145 -161 -244 135 260 -258 -187 322 235 -144 -106 268 153
1655 153 -144 -62 215 91 -196 -159 51 -8 -171 -52 -116 -77 23 -36 -154 90 284 -133 -201 308 282 -200 -110
1678 -110 309 135 -284 -26 184 -13 -240 -149 39 -40 -154 -82 120 46 -100 12 8 122 140 37 -34 135 236
1701 236 -127 -186 168 175 -434 -159 287 -35 -405 7 173 -138 -142 149 145 -35 59 -10 57 159 140 -74 -1 212
1725 212 5 -217 -59 134 -27 -271 -183 160 63 -258 -87 311 19 -302 97 334 -26 -97 234 105 -92
1746 -92 98 48 -107 82 143 -277 -169 235 -36 -297 -62 252 -96 -213 95 234 20 -128 117 229 69
1767 69 -90 61 159 -68 -181 20 51 -103 -11 -137 -83 78 44 -176 -28 338 -3 -248 116 386 -34 -226
1789 -226 143 213 -131 -246 129 113 -145 -185 -17 12 -105 -102 -8 37 45 34 7 74 187 26 -166 157 292 -30
1813 -30 -206 112 276 -144 -281 229 133 -275 -179 77 40 -172 -83 55 92 46 -3 -5 146 139 -31 -91 177 199 -122
1838 -122 -111 189 99 -273 -213 145 98 -303 -177 247 152 -240 -58 298 84 -113 64 123 18 38 -66 -23 67
1861 67 65 -132 -111 95 14 -269 -91 128 65 -181 -85 223 162 -186 -59 307 96 -209 91 167 -33 -153 -14
1884 -14 8 -37 -40 -136 -141 99 50 -236 -31 165 20 -208 73 335 91 -73 -8 174 71 -166 -27 223 -8
1907 -8 -276 -74 138 -139 -132 34 -39 -74 -5 -74 -80 173 122 -185 -23 348 0 -223 146 247 -138 -131 86 27 -142
1932 -142 -148 -79 58 -70 -187 -26 94 -71 -48 87 116 14 85 10 -1 156 109 -208 -35 303 -133 -327 110
1955 110 108 -318 -127 176 99 -169 -94 145 89 9 -11 52 141 13 -63 43 60 -60 -11 -112 -56 54 -51 -218
1979 -218 3 198 -127 -215 166 158 -160 -51 192 87 -25 25 90 60 17 -66 -40 -15 26 -155 -81 35 -50 -71 -83
2004 -83 6 115 -71 -107 143 274 -109 -108 306 90 -187 -45 165 -29 -141 -42 23 -86 -18 -14 -86 15 44 -105
2028 -105 -19 109 142 -51 -13 115 119 -59 -2 123 106 -186 -191 108 7 -170 -40 144 -122 -127 38 41 -23 84 -8
2053 -8 4 151 142 -71 -60 223 92 -214 -7 143 -39 -158 -25 29 -78 -179 -84 18 -5 -122 -19 136 50
2076 50 -52 55 67 45 14 26 75 17 4 -118 -98 78 34 -163 -108 161 -4 -236 -10 241 -47 -152 48 92
2100 92 19 -1 82 82 37 -48 -3 42 71 -85 -159 -51 -18 -50 -132 -11 98 -37 -157 1 206 14 -128 119 255
2125 255 -105 -83 152 34 -124 -73 -12 -100 -61 -25 -99 -25 81 -65 -125 101 145 -88 -13 89 118 17 -70 37
2149 37 127 -50 -118 38 116 -198 -112 47 13 -171 -70 13 -40 1 11 -50 87 134 -57 -100 154 102 -87 -7 118
2174 118 16 -88 -87 45 50 -159 -143 15 71 -126 -26 202 26 -79 54 52 94 66 46 -41 66 55 -42 -120 39
2199 39 40 -180 -87 89 -54 -176 -44 125 26 -102 -55 101 55 -111 -31 172 74 -74 44 21 -47 -22 -25 -105 8
2224 8 11 -169 -126 160 -28 -129 -6 170 -28 -120 83 142 -40 -59 26 9 -22 1 -2 -34 -66 -118 -68 -18 -41 -56 44
2251 44 -65 68 38 -75 58 104 79 -91 -6 185 -26 -104 36 34 -92 -39 23 16 -22 -35 -17 -26 9 42 -30 6 29
2278 29 -44 -28 38 68 82 -56 11 68 -12 -134 65 51 -122 -150 97 -40 -167 -31 79 -12 -32 -43 68 33 46
2303 46 41 -25 28 86 11 -83 49 20 -95 -84 -19 35 -49 -49 36 98 -43 -36 106 61 -80 68 71 24 13 9 -12 13 66 -38
2333 -38 -71 -23 15 -63 -71 58 66 -105 13 76 38 -26 -30 157 71 -19 2 38 24 -72 1 -21 -46 -62 -63 -67 4 -44 -39 -65 80
2364 80 107 -57 -40 189 63 29 -6 137 64 -134 -10 11 -30 -116 -75 5 -10 -71 -49 -12 19 -35 -7 11 -15 67 31
2391 31 -17 92 126 -34 -16 183 -13 -122 19 121 -33 -126 34 28 -43 -79 2 27 -20 53 42 1 92 32 -67 57
2417 57 82 2 -82 45 68 9 -104 -57 67 -56 -118 -8 110 -70 -65 78 68 6 34 77 28 33 72 29 -13 52 38
2444 38 24 -16 -7 -8 -129 -28 84 18 -57 64 86 27 -82 66 97 1 -69 28 53 -23 -65 56 -16 6 -15 -68 -63 -1
2472 -1 -23 -79 -27 82 -62 -13 137 84 22 -4 139 87 -23 -72 49 10 -64 -72 18 30 -85 -60 -17 -42 -42 -31 44 13
2500 13 36 53 -37 104 137 -64 -76 59 49 -57 -24 49 50 -73 -63 8 44 -70 -35 75 3 45 15 55 62 7 56 -2
2528 -2 65 91 -27 -11 56 -15 -83 -69 129 -20 -143 -27 56 -63 -84 -39 57 34 -34 37 35 -19 -18 35 -3 25 18 -56 -48 48
2558 48 -19 -38 -23 116 48 -80 -32 71 4 -107 39 96 5 -13 55 8 42 28 48 30 -6 -36 -50 -63 0 -43 -81 -27
2586 -27 30 69 -65 -53 62 -33 -87 71 82 6 -47 83 14 -49 -79 80 6 -74 10 9 -86 -51 51 -91 36 60 50
2613 50 3 49 103 90 -78 17 76 -49 -51 2 43 -58 -76 -26 45 -32 -26 10 4 -22 62 32 17 42 15 -32 -3 32 21 -38
2643 -38 78 60 -47 -46 25 30 -85 -77 3 -26 -23 20 11 8 -16 0 5 28 -13 63 18 2 32 -4 -20 -15 5 -72 -32 -27 22 -69 -61 -18
2677 -18 18 -72 1 129 33 3 -28 35 30 0 22 14 -19 -18 -42 -34 -54 -30 -36 -48 26 43 -15 -21 60 36 -102 -28 131 24 -31
2708 -31 44 56 -20 -21 -47 45 -61 -26 9 -66 30 19 -23 -74 84 77 -49 34 94 -4 -30 13 42 5 -81 22 94 -38 -62
2737 -62 26 -43 -62 -64 35 -2 24 19 21 19 106 14 -47 49 105 25 -74 15 -2 -19 -129 40 -29 -45 -9 -17 12 -69 -121 -25 76
2768 76 -56 -40 75 -35 61 0 21 -21 29 11 -28 66 92 -13 -53 9 -48 -35 -54 9 -27 -34 25 108 85 -19 31 16
2796 16 -2 -32 46 -5 8 -35 -83 -26 -54 24 -72 -74 45 -37 3 -55 101 12 -37 -16 79 43 -24 33 32 7 -40 2 21 51
2826 51 -43 -6 -21 15 -17 -16 -44 -5 -22 -38 -24 33 23 -42 15 62 22 -10 10 64 -7 -76 19 0 -11 -37 -58 49 -83 -26
2856 -26 6 32 72 60 14 54 35 100 16 -13 38 2 -10 -73 41 18 -79 -1 4 -32 -86 -33 19 -31 -17 -31 -41 43 63 -54
2886 -54 24 17 32 -20 -57 -65 -51 -20 -64 15 -20 8 20 52 -57 -74 69 20 2 -43 34 41 0 47 46 9 16 -6 24 -36 -53 -36
2918 -36 -67 -31 -33 -25 -100 -8 51 -61 -33 45 35 6 40 43 74 10 -75 -28 -35 -24 -11 -54 -23 -5 -21 -94 -52 13 -17 -48 41 42
2950 42 12 -72 81 69 8 21 14 68 1 -64 8 -23 -63 9 4 5 -48 -52 -55 51 27 44 4 6 17 -35 -24 105 54 -51 -39
2981 -39 44 27 -110 -41 50 4 -66 -28 -31 19 -16 6 -30 20 29 8 2 33 43 1 -39 48 39 -17 -46 -8 -23 -16 -22 -3 -10 -52 -42
3014 -42 51 46 -5 5 29 33 -6 35 43 34 19 -39 -17 30 16 -30 -8 48 -9 -38 -21 38 28 -21 -19 67 7 -38 9 28 39 4 -13
3047 -13 62 -26 -13 -48 -25 10 -19 -65 17 52 78 -14 -19 47 -21 -42 41 65 -7 12 9 65 -55 -20 4 14 -21 -38 36 -22 -46
3078 -46 -66 -37 -4 -18 99 5 21 47 -57 -15 8 67 -47 -24 -10 43 -55 -4 -82 20 -42 -36 1 -28 -24 27 11 1 45
3107 45 41 38 0 45 -14 -6 12 31 -49 -39 -10 -17 -44 -54 96 -35 -50 -46 -37 -12 -44 47 99 -21 26 4 -3 4 67 60 5 6 -8 -17
3141 -17 -59 5 -85 -37 -79 39 11 5 25 -6 46 -17 5 75 73 -17 -6 -8 38 -46 -32 5 -58 41 -57 22 12 -36 -29 -17 1 21
3173 21 -39 22 52 12 -15 -59 85 -7 -20 -33 36 -20 -35 -12 -23 14 -28 -54 -28 0 -17 22 -39 68 23 -1 5 46 35 -18
3203 -18 38 10 24 -32 -32 -5 -24 -37 14 -2 -40 -9 -6 -14 39 23 29 16 -24 76 -27 41 114 5 -6 30 7 -36 -43 -55 0
3234 0 -29 -57 19 23 18 30 53 16 60 45 4 12 -17 -9 -51 -45 40 25 -36 15 39 -50 -55 19 27 -19 -10 -22 -18 46 6 31 27 -1 -38 -16
3270 -16 12 47 18 -23 11 59 9 -40 -65 4 -45 -36 -30 45 -28 -38 56 33 21 -80 98 -4 22 2 4 -24 -9 -17 -26 -68 10
3301 10 -4 -25 16 -49 -72 -51 -22 55 8 -49 58 17 -43 10 42 36 -25 -32 -7 11 -11 -22 65 -31 -46 -30 -8 -10 -6 25 -14 80
3333 80 21 4 47 67 9 -33 -54 34 8 -84 14 59 22 -43 -38 -30 -18 -39 -7 9 -9 -19 23 15 -21 19 -39 -71 20 -50 -81 -3
3365 -3 6 -13 -44 -8 75 -40 -22 -8 31 -6 4 -13 44 16 -50 -57 1 7 62 9 -3 -12 27 -62 -28 3 -14 -17 -2 33 -5 52 6
3398 6 -5 4 17 -22 28 -21 1 19 0 -24 -61 13 -23 -44 -3 -8 -37 -59 43 -7 28 27 68 -14 69 42 21 26 -1 6 -46 -20 20
3431 20 -49 -34 -26 -80 -59 -25 -60 13 -10 12 -17 21 49 1 -41 -11 -40 9 37 -47 5 25 0 -12 21 -44 -9 5 26 22 -46
3462 -46 -5 59 20 30 18 25 -8 -5 -18 46 50 69 7 32 -20 -10 -50 -48 -31 60 4 -83 43 39 -58 44 11 -53 -41 15 21 64
3494 64 -17 -42 -76 15 -9 -24 -29 63 69 -26 6 74 22 27 -9 57 11 -2 -45 16 4 21 -21 31 -30 -35 -39 -43 33 5 -57 -59 15 70
3528 70 7 -53 44 -24 4 -1 7 -52 -24 -6 24 29 -31 13 -8 -6 -7 -11 -40 -24 -61 -56 -56 18 -10 18 -11 71 17 -24 -34 35 -63 -6
3562 -6 -31 15 0 -66 -83 -40 -64 17 -3 1 37 -8 11 23 -37 -69 -25 -2 50 -8 -30 15 12 -1 6 43 19 -23 -52 -42 -5 -26
3594 -26 -43 0 -31 -36 -11 38 4 48 38 -12 25 66 -4 -60 -31 55 -24 -41 23 4 -7 -37 9 32 -4 -5 42 -47 3 -30 48
3625 48 37 62 21 -18 24 9 -5 -22 -27 -43 -18 -11 -32 53 -25 -68 53 34 -2 40 -6 20 4 -38 60 -11 52 -14 70 -10 -5
3656 -5 -41 12 -34 4 25 39 9 15 41 4 30 24 -1 -33 26 48 4 9 34 117 -19 27 -27 92 -29 -4 18 13 19 -13 15 -34
3688 -34 -20 6 35 26 22 15 -53 24 -24 16 11 56 22 -91 -11 62 -53 -17 -51 -45 16 43 -58 -12 13 8 -9 -59 11 31 -24 8
3720 8 9 -7 -55 0 -77 -38 22 -46 -12 -26 -26 -19 56 6 -5 31 -2 -31 80 -18 2 42 -15 -2 -2 -21 -50 12 26 21 14 14 55 -2
3754 -2 28 -59 25 25 4 -63 23 28 13 -18 -30 32 -55 3 2 -50 15 34 -7 -61 3 -6 -33 0 16 -11 -37 68 7 43 -5 31
3786 31 -33 -51 -19 -3 5 1 30 27 9 11 35 -16 13 81 -7 53 -26 48 42 -9 -8 66 -35 42 5 -26 -7 19 -34 -11 -39 5 -24
3819 -24 -25 33 -33 71 67 -43 -5 -22 -22 8 39 -32 85 -15 -18 18 -38 -1 -2 -43 -10 13 30 12 -29 -16 19 -22 26 -6 20
3850 20 1 27 22 -52 -3 -19 41 -19 -50 -49 25 8 -33 -30 4 30 12 6 75 19 36 -17 30 -25 49 -10 -20 0 28 -2 -16 -8 -70
3883 -70 -21 -43 -12 3 19 32 17 69 -40 42 55 26 -6 -18 56 -13 -46 -3 74 11 55 -1 -28 -44 -72 6 -36 42 18 -31
3913 -31 -3 -15 -5 22 16 65 -28 -29 18 -19 3 -7 14 -2 -40 60 -3 -37 -21 16 32 36 -17 -10 92 58 -12 -22 -25 -2 -22 -9
3945 -9 -9 13 -6 11 -33 39 3 18 -53 4 36 18 -53 3 9 4 28 -16 -55 27 27 -40 -50 -23 -41 13 56 4 -61 4 20 13 -2
3978 -2 -33 38 30 22 -19 -13 18 -73 -36 -8 62 -4 -32 0 -15 -21 -85 0 42 -38 19 -36 -50 -19 -13 9 99 -33 16 11 69 7 -5
4011 -5 -19 20 53 -8 16 -13 -21 11 9 33 -15 -15 24 60 19 39 -18 11 7 -34 -32 -2 -42 1 -74 -18 47 -64 -52 -39 7 -57 31
4044 31 18 40 -9 43 26 -43 19 10 5 3 17 1 54 15 5 8 -40 -20 72 49 -16 -32 22 -46 29 -14 43 20 47 -19 -35 25
4076 25 32 -17 47 -5 -23 -5 -42 -21 -25 -6 32 1 31 -24 30 1 -29 47 35 36 27 30 -8 -27 -23 9 -13 -4 -50 11 -39 18 -65 -18
4110 -18 -10 -16 34 26 -38 4 14 -41 -7 -26 1 28 -35 -17 12 42 19 41 -34 -19 -5 -1 -2 23 10 -10 28 -34 8 -9 -3 3 3 -9
4144 -9 21 2 -29 -25 23 67 -16 17 1 29 -19 -15 12 19 37 10 -55 -40 6 -26 39 -15 40 -65 -25 -40 -29 -27 -43 55 7 13 13
4177 13 8 57 -36 -25 63 59 -41 18 -10 26 14 3 -44 35 53 -35 -66 -6 -49 -30 -30 -48 31 -48 13 -8 -35 -32 77 47 -2
4208 -2 -51 -33 -18 13 31 -49 18 -25 12 -2 -9 -27 -44 19 45 14 25 -8 -4 17 -8 -17 5 40 -3 -60 32 -24 1 -34 39 26
4240 26 -70 -32 -32 0 14 21 -22 -9 19 31 -26 34 54 26 29 -9 -14 -2 17 -10 -11 -15 -35 -39 -10 33 -30 -12 -4 -41 -16 -25 28 27 -26
4275 -26 -34 43 17 -9 -10 27 53 -2 11 40 -5 -34 0 31 2 -18 -12 27 0 -7 -4 -14 55 42 24 -24 21 36 -4 59 38 -2 -54
4308 -54 22 0 26 18 3 36 11 6 -26 33 6 -5 25 41 0 82 -18 23 0 -51 21 -16 -6 -26 -43 -2 14 9 21 -11 -23
4339 -23 50 34 -33 -5 35 -19 26 -14 -37 -20 -18 -18 21 -9 31 -5 2 -27 -24 -35 -10 42 -5 21 14 41 -18 -11 18 3 27 -16 -38
4372 -38 -21 -11 -64 23 -37 59 1 -7 -23 -30 54 41 19 10 6 -14 32 -48 -18 44 20 -45 -10 21 -12 11 -26 55 9 -20 3 47
4404 47 13 11 48 -39 -22 4 -7 21 3 2 28 1 -7 -17 -15 -58 25 25 33 -31 13 -8 15 -8 -13 2 37 17 51 5 -28 -5 -38 -22
4438 -22 0 11 27 -27 -20 4 -11 -8 8 16 60 10 2 11 56 -6 -5 15 -35 -37 -45 -33 55 -28 24 22 11 -5 42 -5 2 -13 31 20 7
4473 7 21 -46 38 16 2 37 -18 -30 -44 -16 16 -11 -23 60 -39 2 -13 -34 -11 -22 52 6 6 12 -26 -19 9 18 31 -68 67 23
4505 23 -2 -23 18 -50 17 3 23 -24 -25 29 -16 32 37 -10 3 -3 53 -7 11 -14 -2 -40 4 -1 -48 14 18 25 6 -50 38 84 -28
4538 -28 24 -39 -4 -18 18 38 17 -4 9 -42 -6 0 27 -41 -29 -25 -35 12 29 -31 14 -12 -17 70 -12 -52 8 -6 -4 17 67 54
4570 54 -11 50 -26 -31 -16 -28 19 -28 -26 16 -19 8 -32 54 -14 47 -39 7 7 0 -21 -45 -18 -41 9 -17 -11 -33 -21 2 22 -29 -42
4603 -42 -43 -3 -31 -2 -3 35 4 20 5 3 54 34 9 31 46 -48 -91 24 20 50 -8 28 42 -33 30 23 15 -17 -10 22 -20 -2 -4 39
4637 39 -26 15 20 2 -10 -63 -18 -33 -8 43 -17 37 15 23 44 -6 7 -36 -45 -67 -11 22 9 -15 -42 3 -43 -29 0 22 -49 11
4669 11 -15 -59 11 0 -46 -21 16 -32 11 25 -3 -8 4 -8 25 29 23 -6 -20 -38 41 20 29 -53 19 1 -7 9 18 -26 -17 -38 -2 -11
4703 -11 12 0 -17 -52 27 -19 -8 53 -18 2 -8 -7 -2 -32 13 24 12 56 -13 33 -23 -25 3 20 43 59 33 25 5 3 -86 12 -31
4736 -31 17 50 46 23 6 -68 15 10 -2 -25 4 34 1 5 1 -16 -2 -7 16 -6 -30 -23 10 -8 -10 -5 18 -17 20 -7 7 -58 8 -5
4770 -5 1 32 0 -9 2 16 33 -25 -17 74 10 -23 1 27 -1 -49 -19 25 25 -53 -10 53 27 8 30 2 -12 -13 -96 -52 34 -34 -24
4803 -24 32 -20 48 -3 -6 44 39 -29 -32 12 -47 -4 39 44 -24 -68 -5 2 -46 23 29 28 -61 -16 25 0 -9 -22 14 12 -43 -35 28 1 2 -39
4839 -39 -7 46 21 20 -35 -16 -35 37 -17 17 -60 -11 -2 41 -32 -8 6 -8 -18 -8 -29 19 -4 -4 23 12 -2 -32 -3 -43 34 3
4871 3 -48 -60 10 -19 -37 28 49 -34 31 8 -50 -19 10 -47 11 -39 1 26 31 -31 72 -25 -43 -24 20 20 -10 3 -9 9 30
4902 30 8 47 6 20 -12 -7 7 -11 -34 -28 51 -2 1 -16 -27 18 13 -67 8 1 -32 39 5 16 37 0 -21 -32 8 16 14 7 47 -47
4936 -47 23 -27 -3 13 -38 -29 41 23 26 -5 9 58 14 -46 12 -17 2 -16 16 -3 -5 -7 12 17 -32 25 3 -7 12 -39 22 -37 -12
4969 -12 -10 31 32 -6 -5 -10 24 34 -7 16 -34 31 24 21 -24 27 -20 63 21 -19 13 19 29 8 2 -23 36 -19 -42 60 29 -18 -30 -41
5003 -41 1 -34 21 7 2 -70 51 28 11 1 -18 26 -20 12 2 -10 -9 -16 -4 2 -26 30 7 18 49 75 -8 24 50 11 12 3 -40
5036 -40 -19 16 23 40 42 -6 -59 -55 -19 16 27 29 -1 -32 -4 7 3 25 -50 -10 -21 10 41 -13 -2 0 2 22 7 -14 -23 28 -13 6
5070 6 27 -47 -21 23 3 5 -14 18 24 -30 0 0 -7 11 42 19 23 13 -41 25 9 -19 -12 36 8 5 -30 -64 -17 -42 52 19 6 12 -33
5105 -33 17 -2 -20 8 -23 -17 -38 41 -28 -1 48 -13 4 -13 -61 58 -60 -24 -16 -55 -38 -16 13 15 15 7 -21 20 1 -2 -29 -27 3
5138 3 13 38 -15 -11 -44 -22 21 -5 -18 -8 -10 -5 36 26 28 35 86 24 -20 -19 19 7 8 15 -4 -36 -43 1 -20 -31 11 6 33 20 11 13 -8
5175 -8 -18 -40 -6 -15 36 20 -5 1 14 50 -2 25 -16 62 -21 -21 11 50 -29 -19 46 -5 1 38 -1 2 -13 -16 82 36 33 -6 -8 -13 5
5210 5 25 -12 45 12 43 -2 3 -39 -23 -17 11 24 58 -26 -52 57 30 -70 16 -20 7 -2 -37 8 -10 7 -18 29 9 18 7 39
5242 39 38 24 31 -1 78 -47 16 -13 6 -10 -6 43 -20 14 -60 -59 56 9 22 32 37 -25 -55 -19 11 -7 41 -16 -13 16 -28 55
5274 55 -47 -20 4 46 44 -10 20 33 16 -16 11 18 31 -15 -10 16 -12 -39 -35 -35 3 -38 -31 10 -86 28 -32 11 -1 -40 -4 -18
5306 -18 32 11 27 -8 -24 -8 10 -4 36 30 -17 0 5 -32 -14 42 64 -25 33 -29 -21 7 48 16 -25 53 -23 15 14 -58 2 -33
5338 -33 -32 -5 21 -4 41 -31 17 37 -32 42 29 12 25 3 7 33 -15 21 -29 40 -5 32 -16 -33 -3 12 -22 -23 18 24 -12 7
5370 7 22 17 49 17 23 68 -7 17 34 21 25 -6 -5 0 -61 -57 0 30 38 -17 2 1 18 13 -19 -7 -39 34 26 -49 11 26 37 -6 -24 12
5406 12 2 4 58 15 63 39 -14 21 48 14 -10 -26 10 -68 12 -19 16 -23 1 -22 -3 -17 -15 -24 -38 27 1 -8 4 35 21 -25
5438 -25 -54 5 -23 -9 -10 3 44 33 -9 7 46 26 -8 -17 22 53 -2 -36 -21 5 60 -1 -17 0 65 -4 16 -21 43 -1 -6 23
5470 23 51 18 0 -22 -10 -46 -6 8 3 -6 46 33 -33 -61 -12 -49 24 47 23 -14 34 57 24 -26 41 92 113 44 55 11 -2
5501 -2 54 -32 -3 -31 38 70 28 -7 -34 -83 7 45 -2 12 40 5 -40 8 -29 30 16 3 27 20 3 -67 12 12 20 13 17 22 20 35
5535 35 30 -31 22 -47 10 -5 34 44 35 11 -26 42 -47 8 -8 37 12 -5 27 -23 -26 -79 26 -6 -14 12 -7 -47 -12 33 3 61
5567 61 -25 27 19 -5 -42 10 23 59 -42 -4 -87 -7 -19 -15 -11 -1 -37 -9 -21 17 -16 0 -24 15 -9 -14 1 24 11 63 -39
5598 -39 -54 -42 -33 34 -2 -32 -15 17 20 4 6 -12 -43 -33 -10 -49 42 33 56 1 -4 41 13 -22 16 31 -22 -22 -25 6 -21 17 -15 -26
5632 -26 59 31 -27 -12 -4 -36 -37 10 -56 -60 13 -12 -20 -28 25 50 -14 29 -12 -2 17 20 -54 -26 -5 -41 -18 38 19 -11 -30 -29 1 -31
5666 -31 2 20 16 22 9 48 4 -16 88 -14 72 1 -1 -25 21 58 22 -6 57 38 -34 -30 -5 -17 -24 33 15 26 -15 1 -27 -18
5698 -18 -46 41 8 55 21 0 -4 17 -1 -35 56 77 40 37 -47 -44 21 1 -3 32 0 9 -42 3 -3 71 17 -9 0 -28 37 -4 36 -35
5732 -35 -14 -47 61 -8 -63 45 42 -10 35 15 35 44 -13 17 38 37 17 7 60 34 -4 4 3 53 -1 -7 -5 38 2 33 -6 16 -26
5765 -26 -28 12 0 5 -12 52 21 -16 -15 -31 -42 34 30 -33 18 10 62 11 -8 32 -2 16 -37 20 20 24 70 42 -1 14 24 -7 -4 -38
5799 -38 16 18 -5 -13 -11 5 15 -8 -66 -8 2 -13 25 -3 6 7 -21 8 -23 -24 3 45 -81 9 -8 11 39 0 13 7 3 -24 -27 -17
5833 -17 32 -4 -41 -17 -24 49 8 15 13 30 32 -5 9 -1 7 -16 -17 -28 -31 2 -44 -73 27 -28 -31 46 22 25 2 15 -36 17 17 4 -19
5868 -19 -1 -31 36 -31 6 7 40 43 -21 -36 50 23 -28 21 3 63 19 -11 59 -21 11 17 -1 -30 -8 0 -15 11 44 23 50 5
5900 5 2 -7 58 -36 -4 29 36 31 -22 -34 -69 -21 25 -19 -27 67 11 -4 -16 18 -41 81 -21 -5 36 -40 -9 -45 38 0 27 -28
5932 -28 -21 6 6 67 -18 -58 18 -13 -25 33 -58 -12 7 20 -31 -6 -34 5 39 -38 6 54 -3 -11 36 -50 -37 36 14 -33 14 -89
5964 -89 -7 21 8 -1 65 62 34 3 22 16 -35 -35 -27 3 6 27 -37 -24 38 2 -21 -8 -5 46 80 11 -30 -27 8 -1 25 -10 -10 7 -12
5999 -12 70 9 -2 6 -12 -21 25 21 -10 2 8 -1 -63 -24 -21 -52 -32 -22 -51 -60 -13 26 -10 -24 1 -13 -10 -16 32 -20 0 -21 -24 -25 -16 -4
6035 -4 39 -39 -22 -10 -48 45 6 -13 -4 12 -2 9 25 38 -37 61 4 39 46 -3 -8 3 -40 -30 -1 4 -31 10 -32 -10 44 10 1
6068 1 19 23 25 58 8 20 -16 37 0 26 2 3 29 48 -37 0 -75 8 12 -13 20 0 32 3 -22 -15 -23 -6 20 0 23 -23 18 15
6102 15 -11 -18 13 -45 -15 45 9 47 -33 -14 11 -29 -23 22 -8 5 -27 -85 -2 -9 50 3 15 -4 -3 -1 -11 25 -24 -9 1 -15 63
6135 63 -1 50 16 3 12 -38 -13 -10 -21 41 5 23 5 -29 24 -49 16 22 10 -7 21 24 -27 37 -30 30 0 37 -31 -22 2 15 20
6168 20 48 29 -5 3 33 5 -14 -14 19 25 37 -57 32 34 -23 -28 21 -52 14 -17 4 -55 0 14 -34 0 -9 -11 13 -81 -4 -19 -44 -13
6202 -13 -7 0 -56 32 -70 -17 -3 1 29 -32 9 8 1 -35 -13 -11 -12 -51 -41 6 12 45 31 -4 54 -49 -4 26 -12 16 -11 9 39
6235 39 12 -16 0 -9 1 46 -4 -47 -36 -11 -25 -31 -45 -26 -11 31 -20 -23 -38 -39 21 -40 23 -12 -10 3 11 35 -17 -30 23 20 30 38
6269 38 -27 50 -2 47 -43 11 9 -60 23 -37 47 23 -93 20 -5 4 53 17 -48 -11 -7 -10 18 14 21 -66 -1 -32 31 17 -12 5
6301 5 -21 -16 50 -5 -24 -36 -38 -2 -10 53 1 32 48 -34 34 -24 -76 -43 -19 20 46 44 44 15 -19 4 13 10 -15 23 -6 3 92 31 13
6336 13 61 -28 34 37 44 -8 7 -44 -8 -40 9 5 -29 70 7 6 -41 37 29 -28 -26 19 3 -17 6 -11 -23 -16 29 -21 -49 7 -20 21
6370 21 30 -37 22 -62 12 -71 8 15 -36 10 12 -11 7 16 20 5 -79 8 1 -33 38 22 24 -6 5 -28 -27 9 1 -21 2 18 8 -54 82
6405 82 -33 -16 34 -6 6 -5 10 15 32 26 -12 9 -26 12 44 -41 14 -2 -8 -13 -17 -40 26 -11 -47 -4 14 -8 23 -60 -29 2
6437 2 32 0 2 2 -28 5 8 41 57 39 -30 -18 21 -25 -9 -30 -7 2 8 -1 -38 -1 -12 -11 0 -25 -3 -5 8 28 36 -49 4 -11 24
6472 24 0 -33 59 23 -14 -8 -1 55 21 -24 20 5 -2 -11 -21 29 18 53 7 -49 2 15 20 -38 37 17 20 23 19 21 -26 -10 -17 33 -28
6507 -28 32 -36 48 -15 65 24 -13 39 -43 -27 12 -3 83 14 25 -35 -5 -78 -42 6 53 -1 -4 -37 -1 -7 -16 -31 -12 42 0 47
6539 47 5 2 25 49 7 -19 9 -17 71 46 -52 43 56 -14 -2 -6 -41 8 -47 -3 -51 28 3 54 -53 1 -36 16 -23 -1 40
6570 40 9 -15 -20 -28 50 -25 -56 15 -42 -32 1 14 40 16 -22 -20 -50 25 -11 18 0 -29 16 4 -1 21 -23 42 -15 12 -39 29
6602 29 0 47 20 27 -42 0 -45 -25 49 8 -7 -8 1 -22 -12 8 -30 0 -64 -26 20 -31 8 -63 -3 34 -15 9 26 0 -8 4
6634 4 47 -32 20 -5 32 -7 23 39 36 16 -11 39 -4 -35 -22 20 15 -24 -25 -20 -28 9 -7 -34 -16 5 44 -5 -5 9 18 43 -9 -15 -11
6669 -11 26 -4 -25 50 1 -30 36 -54 44 51 11 8 -23 28 31 70 11 -11 -22 -58 -5 17 71 45 -8 -8 -44 18 30 8 -25 -54
6701 -54 14 14 -48 -60 18 23 -14 22 -19 26 1 -11 1 5 -31 16 -44 11 -3 -42 7 -13 9 18 13 -37 -21 33 -24 -4 -6 7 -30
6734 -30 -7 3 14 -14 33 -22 -35 2 -41 15 -42 16 7 -27 -6 -42 70 32 -34 -24 -14 24 16 -13 55 28 -13 17 11 -33 53
6765 53 -26 19 51 -14 20 14 2 38 8 8 24 19 -28 55 -16 -13 -9 46 -39 -17 -42 -16 2 -25 -15 -18 -40 10 2 -18 -15 -10 -1 36 21
6800 21 33 -29 -40 60 40 18 1 -50 2 -1 -79 -49 -2 3 39 26 -2 14 -22 64 25 5 16 50 19 10 3 -33 9 7 8 14 -62
6833 -62 26 -5 10 -6 -7 -22 13 -33 11 -11 -66 -15 -19 29 35 2 23 -53 -11 42 15 30 0 -32 -22 57 -20 27 -3 36 28 13
6865 13 -24 24 5 15 -14 -12 -4 29 -12 -51 5 -19 24 14 -2 21 -39 -45 15 -17 7 -45 5 -10 -68 -22 -23 25 28 49 -18 16 13
6898 13 0 -7 15 30 -12 -9 -20 37 -21 21 35 6 -1 58 -48 25 24 -19 -26 7 5 -23 13 33 -8 -5 21 1 1 61 58 39 20 41
6932 41 36 -16 58 -8 2 8 -39 -26 12 18 1 10 64 3 -31 -19 -37 17 29 -8 -14 0 2 49 -16 -24 16 43 -30 -12 30 -18 -78 -5
6966 -5 -51 17 0 37 6 47 -47 -6 24 4 29 41 20 1 12 45 21 26 50 8 3 -63 -13 8 21 -7 -30 8 6 -54 -3 27
6998 27 -32 -16 -17 13 0 5 17 10 33 23 -8 -32 5 3 3 -21 -17 -14 16 85 -18 51 13 7 36 -27 24 59 -8 47 12 1 -16 83
7032 83 16 0 -2 -24 -29 -8 -3 -35 -7 -17 -15 1 -13 8 10 -45 -68 -38 -40 5 52 -13 20 -42 34 24 -61 -31 -16 2 35 -32 24
7065 24 -18 -9 -51 23 -25 6 48 -69 -8 46 13 20 2 39 -1 -10 31 -59 5 -35 -45 -36 -8 18 4 -2 -42 71 39 -51 38 46
7097 46 -37 -5 18 34 -52 38 -21 3 3 -42 21 -3 -36 -14 -11 -32 -16 66 30 -13 15 10 66 24 48 -4 17 -42 40 3 46 35
7129 35 19 -5 -49 -56 -26 -8 46 -3 0 -9 -9 -25 15 1 -5 -9 -4 19 15 31 10 -39 -8 2 -31 7 -43 -24 17 -57 -27 14 -37 37
7163 37 53 -17 6 -21 7 -31 -27 26 3 4 0 35 61 48 -20 -5 -23 13 75 23 -35 18 -33 -23 41 7 -17 17 -19 -1 -21 -48
7195 -48 1 2 60 16 -5 40 -4 -11 -28 17 7 50 68 1 12 29 -8 -23 31 -12 -33 -3 -15 -8 -17 -40 -19 -35 12 -3 0 -10 44
7228 44 -43 0 43 17 0 40 -21 13 -42 -21 -16 17 30 -13 0 44 45 -23 -21 -24 -28 27 12 40 -5 -7 29 7 -13 6 -34 82 10
7261 10 3 9 41 44 34 -35 28 22 21 20 1 -15 44 -32 43 60 16 21 -15 -9 -58 -3 21 21 35 -8 38 18 -52 -15 60 11 -24 21 14
7296 14 28 20 -11 25 17 -16 25 18 16 59 18 -44 67 13 -27 26 23 6 -42 -51 5 38 9 45 -5 18 -33 -52 -2 -31 -28 -11 36
7329 36 20 -40 -19 -57 5 -62 -50 3 -10 19 -7 3 33 4 -15 22 -14 -1 4 -29 32 75 17 16 -12 -44 -61 -25 31 -27 57
7360 57 -12 -39 -12 -18 -2 14 -26 35 -10 -49 -54 10 14 -40 19 -64 -89 -15 -19 -21 4 59 -45 -4 47 -22 9 39 -9 -6 -14 -44 -8
7393 -8 -17 -13 22 5 16 -43 41 34 17 -74 -9 6 -10 6 9 -60 10 9 -14 -24 19 -27 12 -28 -35 -10 -54 -43 25 7 -51 -52 -33 -2
7427 -2 -5 -18 -11 -42 -41 -10 -22 -7 10 3 -26 -1 -54 -4 31 4 -5 11 -10 24 -29 -15 13 -5 -13 84 11 2 -38 -62 -36 9 22 13 8
7462 8 -8 -14 41 13 -91 -23 -41 18 14 -24 -28 -1 18 -12 -26 33 7 -25 -22 5 26 14 17 16 -5 21 17 -4 -48 10 -6 -43 -14 -34
7496 -34 -11 -15 2 26 40 -20 -3 -9 -6 -42 2 -22 -37 4 -22 -9 50 -51 33 -17 -7 31 47 2 43 21 16 -43 9 44 14 -2
7528 -2 4 6 -12 27 -6 0 -3 -30 -12 20 -13 -6 -29 7 29 12 -19 -1 34 12 21 13 -3 -27 -94 -14 -47 -31 -8 -51 -38 6 53 61 -14
7563 -14 -33 11 -6 -20 8 -13 -22 49 -3 -20 22 1 -17 -35 -16 -19 -52 38 -30 -34 2 -23 45 -58 17 -13 15 -27 -31 -35 -32 -85 31
7596 31 -10 -59 -12 33 14 -12 -33 -67 25 10 5 29 -40 -33 -6 -34 -27 60 -21 -13 15 29 58 -12 -9 -1 -14 -11 -44 -38 -15 4 -12 -16 27
7631 27 31 25 -10 -11 -58 69 24 5 -6 15 7 7 28 10 -15 15 16 39 -3 8 19 9 23 18 34 51 10 16 33 65 16 -27 43 -11
7665 -11 6 42 15 38 17 25 -11 35 -24 -50 -37 8 21 33 -42 17 -36 -26 -7 33 -53 -34 -42 -1 -40 -16 9 5 -9 -3 1 -12 13
7698 13 3 33 -13 1 -26 -1 -18 -2 -16 6 -8 -13 4 8 8 -11 -10 46 -14 16 5 -15 -32 21 -44 -61 -3 -37 -36 -57 1 -21 -63
7731 -63 -5 -24 -10 46 27 45 9 -12 -49 -5 3 -30 6 14 21 -26 37 11 -22 -54 -50 11 35 1 21 36 2 -20 4 49 -8 -5 -15
7764 -15 25 9 -22 -10 31 20 47 2 33 21 28 -2 0 16 24 -16 -13 0 36 -31 1 -38 68 -3 36 -10 -47 -37 -11 3 3 24
7796 24 11 54 -19 -52 -20 -7 -43 -30 40 -21 22 6 12 16 -15 0 11 35 3 -52 16 -32 -35 4 -38 -5 -28 -23 -16 -17 22 19 2 8
7830 8 23 -36 -52 22 31 3 -45 -5 29 -28 -24 -24 3 1 -25 0 24 -59 37 -47 -10 -43 10 6 -31 -24 -41 12 21 -10 10 -13 7 10 65
7865 65 31 22 31 5 17 -78 -24 26 -39 24 13 -59 7 3 35 8 -7 -41 17 -20 -48 60 80 -39 45 -12 -38 12 -9 -21 17
7896 17 30 -11 -50 -31 -7 82 32 -24 51 17 -17 -9 9 -2 -32 -26 -6 -36 37 -6 84 -32 2 -30 26 16 -47 17 -42 -34 29
7927 29 -53 -12 26 -24 -17 18 6 25 -57 -9 -10 0 -88 -21 -16 -28 63 11 -13 -33 -20 37 47 27 -7 16 52 45 -6 10 -2 -12
7959 -12 -13 38 -4 7 16 19 7 -26 2 49 1 -17 -36 -27 19 10 24 -48 25 -59 -95 -3 -43 -37 11 -76 24 -36 20 76 -14 68 -30
7992 -30 2 7 22 -26 -8 -22 -4 2 -25 13 76 -1 -5 11 36 -12 -26 -41 -29 -33 15 16 25 7 -13 13 15 -3 -1 -44 -1 -9 -25 -28 -52
8027 -52 -23 12 48 22 13 -4 21 4 -22 -96 24 55 72 -112 -64 17 21 16 16 50 37 -2 -10 -5 -8 -28 -44 -33 4 10 -71 -4 -49
8060 -49 -40 34 -20 6 24 -16 24 13 100 18 40 47 13 29 -38 -48 -55 14 -9 40 2 63 16 4 51 -47 -37 -34 -8 -30 3 -28
8092 -28 20 -15 -31 51 -16 43 17 -37 -27 47 1 -41 6 -10 7 3 15 -15 -43 -92 31 -21 5 -16 -34 -3 3 17 6 14 -27
8123 -27 30 72 60 39 25 -2 -34 -23 -44 21 -5 6 -22 -36 -77 -51 -19 -18 14 15 2 54 -14 -67 -23 55 24 8 -34 22 29 42
8155 42 50 -27 -44 -43 5 16 -32 -29 30 13 -31 1 -18 6 -30 -14 31 -7 -41 -38 -7 -23 24 16 28 -21 -8 -1 47 -17 30 2 -2 -4
8189 -4 1 -17
8191a7
$$ Imaginary data points
##PAGE= N=2
##DATA TABLE= (X++(I..I)), XYDATA
0 0 0 0 0 0 0 0 0 0 0 0 0 0 0 0 0 0 0 0 0 0 -8 8 -8 8 -8 8 -8 16 -16 16 -18 24 -24 31 -32 39 -40 48 -51 57 -64 72
42 72 -80 88 -97 106 -119 130 -144 160 -176 193 -210 233 -258 287 -317 354 -396 446 -508 581 -676
63 -676 798 -965 1212 -1604 2337 -4174 19532 18716 -17477 9766 20915 -3102 -11078 6431
77 6431 3496 -3686 -3565 -2258 713 6710 -1103 -5903 2993 4818 -5127 -4113 1681 2585 1391 -2464
93 -2464 -3172 8370 7914 -8203 -4309 12206 72 -14966 266 9128 -6717 -8691 3824 2719
107 2719 -1708 1724 533 -131 4904 759 -6040 1869 7911 -2255 -7194 2720 6845 -1825 -6514
122 -6514 1318 7084 -2340 -10288 696 8820 -3704 -9319 4590 7735 -4461 -3835 5913 4004
136 4004 -1962 -450 1172 506 1155 -708 -3256 -3 3147 -1215 -5132 16 5016 -1236 -7197 880
152 880 7623 -2117 -7810 4068 8018 -4035 -4820 6281 4302 -4142 -1570 2416 166 -578 -920
167 -920 -2863 261 2705 -2970 -4565 3078 4042 -3773 -3978 4112 4722 -2943 -3927 4409 5470 -3763
183 -3763 -4440 5397 4305 -5610 -3109 4765 565 -4811 -420 1551 -1701 -695 477 -1743 526
198 526 3616 -1114 -3562 3214 4743 -2752 -3183 4389 3613 -4344 -3271 4282 2642 -4899 -3077 3472
214 3472 1078 -4190 -1503 2640 610 -1822 -726 964 1726 1112 -1001 -641 2729 2112 -2322 -1843
230 -1843 3162 2225 -3994 -3356 3585 2361 -5341 -3059 4818 1175 -5692 -382 5037 -473 -3017 1941
246 1941 2066 -682 1036 809 -1455 1333 2449 -2770 -2486 3392 1228 -4617 -1810 3499 600 -4084
262 -4084 -1406 3689 1618 -3839 -1216 5002 1770 -4249 170 4929 -357 -3115 1455 1824 -1447
277 -1447 -485 -266 -1789 886 1349 -3523 -1879 3957 537 -4742 516 5000 -534 -3739 1560 4012
293 4012 -455 -2761 938 3109 -450 -2927 202 2106 -999 -2118 -72 256 -340 -94 -1169 -798
309 -798 2303 1084 -3051 64 4604 195 -3982 1389 4674 -1212 -3880 1624 3269 -2067 -3555
324 -3555 1197 2391 -1996 -2789 1011 1500 -1137 -966 664 701 761 357 -1101 496 3053 -132 -3266
341 -3266 1354 3807 -2186 -3924 2395 2757 -3363 -2911 2283 1655 -2516 -1918 1738 1787 -1134 -1246 1389
358 1389 1880 -296 -774 668 1063 558 -629 -1429 502 1931 -1515 -3297 1529 2812 -3191 -3254 3404
375 3404 2287 -3852 -1266 4009 926 -2682 397 2437 274 -652 111 229 631 197 -1581 -843 1518
392 1518 173 -2434 -939 1774 423 -2152 -954 2199 1577 -2163 -1340 3318 2037 -3041 -826 3859
408 3859 437 -3433 393 2433 -1249 -1732 623 -278 -661 527 -1041 -1507 1936 1256 -2655 -214
424 -214 3459 229 -2623 956 2851 -330 -1905 277 1860 39 -2271 -674 2055 -135 -2922
439 -2922 -126 1912 -912 -1566 911 535 -304 831 -96 -784 2088 1406 -2543 -245 3546 -462 -3648
456 -3648 1125 2873 -2074 -2709 1372 1273 -1593 -1552 802 1296 -495 -1165 591 1597 -17 -595 544
473 544 725 341 120 -692 -143 1424 -304 -2527 254 2184 -1512 -2662 1406 1823 -2003 -1375 1845
490 1845 1223 -1040 -452 1166 980 -202 -406 496 765 -147 -670 -386 153 373 -578 -1564 45 1490
508 1490 -1014 -2181 1440 2154 -1808 -1519 2515 1577 -1654 -334 1980 535 -1141 -342 784 370
524 370 -631 -904 -55 291 -446 -705 -174 220 426 -295 -1025 693 2029 -621 -1730 1809 2129 -1943
542 -1943 -1213 2615 799 -2568 -431 1722 -489 -1495 21 204 -376 -190 -353 -341 834 774 -899
559 -899 -398 1600 977 -1176 -450 1812 783 -1921 -755 1926 439 -2329 -690 1708 -184 -2126
575 -2126 84 1433 -444 -1037 473 685 26 344 189 -253 781 933 -977 -726 1705 622 -2280
592 -2280 -716 2030 -192 -2527 -17 1818 -599 -1775 477 1534 -77 -889 335 1232 402 -605
608 -605 -7 903 417 -604 -479 102 376 -211 -1186 -591 1105 54 -2065 -260 2302 -207 -2281 934
626 934 2369 -855 -1350 1534 1418 -869 -577 599 286 -160 -384 -493 0 330 -582 -1145 203 1097
644 1097 -431 -1414 410 1913 -198 -1665 1064 2329 -943 -1813 1524 1727 -1506 -1277 1223 516
660 516 -1401 -780 435 159 -429 -600 -257 476 534 -339 -444 745 1075 -514 -1013 1077 1634 -1112 -1612
679 -1612 1400 1242 -1898 -1156 1630 262 -1889 -298 995 -147 -502 -58 -12 471 535 -442 -158 1288
697 1288 527 -1016 -250 1114 431 -943 -836 637 727 -1324 -1369 1338 1092 -2039 -985 2059 391
714 391 -1759 471 1594 -413 -494 673 168 149 491 -591 -750 948 294 -1528 -400 1170 -237
731 -237 -1507 -92 1088 204 -1070 -194 1336 587 -1190 -104 1697 221 -1335 208 1152 -385
747 -385 -753 163 -110 -331 49 -563 -736 707 344 -1368 -272 1641 157 -1512 473 1837 -271
764 -271 -1227 771 1291 -512 -935 485 607 -502 -723 -6 160 -201 -426 -276 143 412 -158 -438 336
783 336 896 180 -608 214 1156 24 -1141 228 1362 -569 -1564 499 955 -1063 -1089 748 292 -845
801 -845 -65 418 -4 208 356 -460 285 1046 -139 -806 574 968 -709 -898 516 661 -815 -948 317
820 317 703 -633 -1014 553 862 -778 -558 954 502 -412 208 493 1 244 235 -617 -37 746 -452
839 -452 -1255 428 861 -1024 -1043 803 695 -925 -632 970 761 -695 -338 1035 610 -487 -219 596
857 596 168 -255 -144 -189 -64 178 -467 -760 413 627 -849 -692 956 600 -794 -273 1104 578 -692
876 -692 -324 930 441 -789 -376 823 12 -892 -133 260 -345 -258 -32 -481 85 706 -403 -709 1048
895 1048 849 -988 -265 1509 311 -1128 91 1057 -105 -886 -169 555 -43 -855 -403 588 66 -735
913 -735 -150 554 113 -85 154 -28 374 588 -471 -455 1064 469 -1320 -303 1302 -214 -1464 188
931 188 907 -549 -967 330 568 -167 -375 203 534 246 -198 58 448 374 -132 -275 69 497 -38 -884
951 -884 -135 766 -265 -1264 122 992 -469 -1048 586 909 -483 -592 686 695 -213 -321 318 358 -41
970 -41 -231 -86 47 108 -254 -588 18 578 -396 -957 395 964 -488 -781 889 922 -669 -415 895 571
990 571 -565 -309 330 242 -335 -439 13 211 -241 -595 -185 217 79 -302 -257 324 665 -313 -513 705
1010 705 859 -637 -617 924 534 -982 -412 854 16 -1008 -195 442 -82 -486 -73 130 115 116 -164 -44
1030 -44 539 394 -381 -269 760 463 -670 -335 739 215 -992 -390 725 78 -963 -239 651 -5
1048 -5 -669 75 658 82 -252 174 317 85 164 -20 -212 323 376 -675 -415 788 52 -1220 -149 928
1068 928 -248 -836 364 587 -316 -277 436 373 110 -28 -92 236 227 -165 -213 167 8 -273 -291 -223 144 102
1090 102 -586 -359 660 222 -765 89 1138 -160 -780 551 783 -336 -261 516 123 -288 -118 -123 -11
1109 -11 98 -276 -456 50 223 -223 -243 153 422 27 -363 131 790 14 -684 247 839 -357 -722 420
1129 420 453 -668 -451 317 -38 -273 -81 -43 -57 183 30 -250 239 596 -70 -412 321 667 -231 -533 310
1150 310 613 -522 -719 449 351 -730 -415 476 57 -456 74 206 15 202 49 -126 287 463 -184
1169 -184 -277 335 351 -391 -407 291 277 -514 -630 265 421 -550 -496 695 396 -602 -114 677 175 -229 241
1190 241 242 55 162 -71 -318 269 316 -627 -484 458 211 -730 -311 474 221 -540 -196 577 330 -372 -177
1211 -177 696 319 -517 0 469 -36 -394 -59 71 -92 -42 -241 -340 217 215 -471 -291 636 307 -622 -46
1232 -46 859 259 -559 34 792 43 -651 15 501 -141 -508 26 169 -120 -285 -131 38 216 35 -253
1252 -253 86 533 117 -406 90 711 83 -557 38 661 -92 -758 39 542 -282 -723 182 460 -306 -330
1272 -330 235 201 -2 53 32 125 397 88 -349 183 576 -194 -581 222 470 -419 -611 101 410 -384 -588
1293 -588 225 510 -316 -414 412 444 -204 -224 256 216 11 -3 -141 20 245 -204 -498 93 400 -428 -572 313
1315 313 399 -381 -403 471 485 -309 -288 515 488 -296 -170 397 213 -315 -111 71 -78 -23 -150 -346 43 282
1337 282 -367 -447 387 338 -416 -177 574 261 -349 -69 450 263 -282 -232 349 184 -408 -283 253 6 -388
1358 -388 19 72 -77 109 33 -230 244 512 -165 -280 669 399 -578 -108 587 33 -584 20 244 -124 -393
1379 -393 -84 66 -28 -210 -102 259 175 -146 37 221 107 90 37 -80 174 288 -282 -365 413 107 -650 -176
1401 -176 577 -113 -544 144 407 -191 -219 180 203 25 10 63 108 215 24 -112 25 207 -44 -281 -138 201
1423 201 -8 -471 -150 354 6 -461 14 545 -51 -375 324 455 -101 -200 257 199 -123 -49 94 -96 32
1444 32 19 -225 -111 262 -22 -434 31 456 -50 -340 305 465 -110 -242 257 340 -149 -271 186 199 -117
1465 -117 -248 -25 13 -105 -141 -96 -55 113 41 -154 11 417 68 -305 172 493 -119 -336 318 360 -298 -295 235
1488 235 123 -300 -227 100 69 -199 -133 64 158 65 -24 34 111 296 1 -137 170 368 -175 -370 235 238 -385
1511 -385 -295 266 104 -376 -228 211 110 -209 -136 199 202 -9 25 155 190 73 -28 -12 98 147 -187 -359 156
1534 156 244 -396 -355 391 192 -549 -72 581 34 -319 90 333 10 -36 71 77 68 -47 -185 -30 185 -88
1556 -88 -299 -33 97 -30 -257 -149 222 202 -256 -222 519 224 -388 93 578 -75 -345 225 311 -159 -193 -27
1578 -27 -149 -10 -1 -252 -77 215 -68 -260 175 302 -3 -164 141 308 26 -192 11 324 -53 -419 -18
1599 -18 347 -156 -458 104 151 -276 -170 103 4 -32 81 -65 23 301 43 -176 138 400 -82 -260 158 286
1621 286 -142 -318 37 213 -234 -383 163 277 -228 -238 237 160 -145 24 253 35 126 13 -56 -24 220 -56
1643 -56 -332 104 172 -249 -329 202 139 -320 -208 199 204 -113 -67 248 195 -129 36 235 97 -117 8 -10 -75
1666 -75 48 -58 -223 -41 180 -181 -309 201 230 -315 -155 321 112 -243 7 376 46 -151 -14 160 93
1687 93 -117 -109 44 -34 -177 -101 18 -10 -61 -90 -70 53 179 -79 -124 234 279 -281 -92 401 80 -333 -33 254
1711 254 -124 -277 27 34 -182 -38 -4 -110 70 42 -115 51 158 116 -129 35 232 142 -152 -93 205 44
1733 44 -312 -108 242 -77 -375 -52 220 -100 -204 179 130 -100 127 148 69 154 197 -95 -38 246 46 -255
1755 -255 8 231 -146 -360 52 173 -148 -243 -47 192 -63 -159 100 222 -9 -123 114 134 29 14 46 -16
1777 -16 59 18 -212 -198 125 -64 -312 16 270 -86 -279 153 318 -109 -137 198 232 -62 -56 142 149 -13 -124
1800 -124 -33 20 -67 -122 -101 -20 -13 -91 -171 70 230 -40 -224 132 310 -76 -189 253 301 -186 -178 188 132 -162 -97
1825 -97 92 -7 -149 -33 1 30 26 31 -72 142 179 -61 -25 183 302 -89 -157 203 175 -202 -137 204 40 -314
1849 -314 -170 138 5 -201 -9 140 36 45 52 7 148 117 -73 -15 231 34 -172 -145 150 75 -220 -123 218
1872 218 85 -246 -124 292 115 -255 50 228 59 -89 100 136 39 49 -11 -59 148 -9 -236 -94 148 -86
1894 -86 -346 -13 237 -40 -217 -10 220 100 -113 0 306 67 -170 56 238 15 -145 65 65 -133 -1
1915 -1 -79 -129 18 19 -226 -108 246 21 -248 143 299 -13 -125 149 176 -94 -87 36 126 -5 -164 -48 89
1938 89 -98 -198 20 85 -117 1 -37 -26 116 117 -193 50 330 81 -237 194 267 -206 -176 182 81 -217 -80
1961 -80 43 -18 -88 -105 -57 31 -32 -73 30 118 30 80 95 50 99 5 -177 -3 225 -142 -277 83 117 -197 -139 116
1987 116 23 -160 -11 148 79 10 63 79 74 74 -68 -18 23 -1 -68 -61 -11 34 -53 -249 13 182 -55 -163 206 135
2013 135 -147 7 280 6 -161 131 145 -58 62 41 -89 -27 -7 -61 -91 18 -30 -126 -105 68 84 -52 -26 176
2037 176 143 -67 -32 127 150 -111 -9 181 -16 -138 13 61 -54 -1 -13 -114 59 64 -69 -106 127 105 -97
2060 -97 52 253 18 -110 24 197 -20 -124 16 109 -27 -145 -38 22 -28 -80 15 58 47 3 51 45 68 121 -3
2085 -3 -49 101 114 -82 -25 191 8 -265 -56 116 -84 -173 21 47 -74 -49 24 66 16 -93 18 76 13 23 35
2110 35 55 71 -25 -123 -10 51 -49 -222 -26 123 -35 -206 43 195 -97 -152 164 149 -47 63 139 -8 -29
2133 -29 61 -37 -48 57 -22 -154 -12 108 -148 -157 85 65 -51 -85 80 174 -4 -85 129 155 -68 -40 114 93 -94
2158 -94 14 86 -47 -45 -29 -23 30 47 -45 -111 99 161 -54 -16 188 119 -3 15 126 73 -64 -96 114 113 -122 -65 31
2185 31 -27 -150 -27 95 -68 -14 17 -9 41 107 -44 -62 178 108 -69 -59 61 45 -105 -47 80 2 -136 -20
2209 -20 123 59 -144 -67 146 48 -34 124 98 26 17 78 -37 63 47 -78 -65 91 -16 -204 -34 137 -116 -189
2233 -189 61 131 -73 -31 19 64 53 47 37 90 5 -44 -2 45 -13 -5 -36 -14 -2 39 -59 -86 116 1 -152 36 178
2260 178 69 -32 98 170 -32 -17 97 96 -15 -52 -123 33 -69 -135 -58 57 6 -135 -43 -11 36 35 -56 52 130
2285 130 68 -76 32 185 -40 -143 116 108 -128 -104 23 -20 -65 -54 3 -79 -58 -33 -24 -3 83 26 -35 47 48 -33 -53
2312 -53 74 107 -78 -131 18 22 -137 -107 -10 -1 -136 10 73 13 -84 6 92 37 32 48 -11 49 78 -13 -74 53 49 -110
2340 -110 -25 24 52 -89 -77 92 59 -65 35 93 94 4 10 97 12 -48 49 -33 -3 17 8 -70 14 99 -56 -87 57 126
2368 126 -114 -12 137 72 -84 54 151 92 37 -33 68 11 -23 -14 -10 33 -47 -7 -68 -5 -58 5 -43 58 44 -28 -69
2395 -69 82 141 -84 16 157 -15 -122 71 105 -33 -46 -27 14 -73 -44 -37 -36 24 -70 -47 10 54 45 20 50 91 35 -26
2423 -26 61 135 29 -133 -23 83 -99 -174 -7 65 -101 -76 4 18 -31 66 37 38 89 17 -40 39 57 -5 -103 17 80
2450 80 -59 -157 -4 83 -99 -76 4 101 -31 -65 61 143 -1 4 91 44 31 16 -14 12 46 -51 -71 40 81 -28 -78
2477 -78 -6 69 -99 -72 30 104 -33 -22 92 33 32 13 139 39 -60 -27 44 -23 -69 4 -23 -85 -18 11 -77 18 57 -32
2505 -32 -24 123 106 -134 35 98 43 -36 8 100 1 -66 -18 45 -84 -73 -22 0 -81 24 -1 -3 26 45 -20 -51 25 66 -23
2534 -23 2 141 33 -87 -37 14 -105 -134 -10 70 -68 -91 9 36 56 -32 -30 -11 78 20 13 5 84 40 -34 98 79 -6
2562 -6 -88 -39 65 0 -91 -6 75 10 -92 73 23 -25 34 -5 75 58 19 27 47 60 20 6 -15 8 -23 -87 -40 78 -16
2591 -16 -64 -72 35 14 -66 28 74 -26 -21 25 34 -38 -18 40 -61 -47 -13 -41 -28 -8 -43 -95 -15 65 -112 -52 68 52 15
2620 15 -15 47 104 23 -10 38 19 -30 -12 33 -6 -37 6 -3 -3 -12 -50 -53 65 72 41 -32 55 101 -17 -7 59 82 -50 -54 -15 -28
2652 -28 -73 -54 17 60 -92 -39 -24 -47 2 4 -17 -12 19 38 32 40 60 68 -27 86 85 -75 -84 30 29 -101 -78 23 12 -112 8
2683 8 69 39 5 15 68 27 -8 2 -30 23 -21 -24 -38 -37 -1 -63 -38 -9 64 -160 -119 68 -17 -63 28 138 9 16 61 67 14
2714 14 71 -20 -29 13 -12 51 -75 82 18 -30 0 42 -21 24 3 24 -19 -80 58 94 26 -8 42 49 21 -20 -33 19 -65 -58
2744 -58 23 -43 15 -56 -73 -63 67 9 -8 47 57 -9 14 63 125 25 12 45 73 43 -34 -7 36 -42 -28 6 20 1 -21
2773 -21 11 4 0 46 7 25 128 -10 -69 35 70 -20 -64 72 73 -17 -22 60 30 -16 22 11 45 12 31 60 59 -40 73 -23
2803 -23 31 42 4 -48 35 9 -16 -51 8 31 -9 -77 74 51 -73 11 41 14 -10 21 59 49 15 -23 -2 6 -50 -39 11 -62
2833 -62 -58 -108 -55 30 48 -25 -10 104 33 -25 -18 91 -13 38 -6 60 25 -13 30 -21 -39 15 -68 -12 20 -31 -45 25 -12 9
2863 9 -11 22 16 -14 -47 31 83 43 15 40 52 -28 -5 32 -43 -82 -27 25 -14 -36 -3 19 -20 17 32 -9 28 62 14 77 -3
2894 -3 64 15 -35 -3 34 -26 -57 2 21 -60 -52 30 -26 -8 49 20 -40 8 43 -39 -8 84 40 -8 -9 -13 -9 -42 -47 10 -39 -40 -18 6
2928 6 -11 4 31 41 -19 45 83 70 30 40 30 -1 73 26 -33 -41 0 -69 -54 25 38 -4 -34 -37 45 4 -128 18 55 -51
2958 -51 -18 53 32 47 53 70 -14 -49 3 13 -18 7 -87 14 -4 62 -16 -37 20 19 -59 -6 19 78 -26 28 41 16 -29 39
2988 39 54 -32 -54 -36 -18 -42 9 -8 -44 -14 73 13 -44 23 79 4 -47 27 31 -38 -5 0 9 -53 26 48 -14 1 8 21 78 1
3020 1 39 43 40 14 -13 42 96 40 -33 30 38 44 -74 -5 -14 -59 -15 -12 18 -29 -46 -10 49 -25 -28 18 41 55 50 -7 -13 46 57 33 19
3055 19 56 25 16 12 -3 -12 -37 -30 52 62 -61 55 46 25 -75 18 -17 14 -12 -67 40 -38 -54 -10 -56 -48 -30 -39 -81 -51 18 -7
3087 -7 27 83 -20 -54 27 115 66 -41 71 25 16 19 -1 -3 2 -11 -19 -63 -2 -6 -35 -23 58 -2 -35 30 76 -51 -59 15 12 15 -30
3120 -30 31 -5 -49 -52 -35 -11 -47 -11 -33 -11 -3 5 94 3 54 -33 -7 27 94 -3 -3 36 64 -12 -35 41 28 -47 -40 1 -76 -6 -46
3153 -46 59 -8 -58 8 -12 29 83 15 -4 23 0 50 -7 -12 14 -10 -5 5 8 16 -34 -3 21 -29 7 38 61 -49 14 99 21
3184 21 32 27 69 -26 -9 42 -39 -20 29 -26 -33 54 -40 -37 23 51 7 -30 -44 39 -25 -25 32 40 12 11 34 -5 -51 -8 -2 8 -11 -10
3218 -10 32 -21 -14 -40 -66 -24 18 41 -49 -1 -4 -23 5 56 -28 21 -7 -29 11 -6 -43 -8 -3 -58 -31 -52 -12 42 -26 -3 5 43
3250 43 0 -10 -27 -9 -3 -83 17 2 1 -34 -61 -14 -44 -61 31 -3 -29 56 21 54 40 78 9 81 87 -55 4 17 76 2 -106
3281 -106 -19 52 -89 -24 21 -25 -1 12 17 -7 12 29 6 48 52 42 -5 39 23 -19 13 -36 -19 6 -76 43 9 -42 -8 18
3311 18 96 7 3 54 -26 -19 -24 28 48 -45 25 30 2 -7 -31 24 25 52 -44 -39 22 -69 -30 -38 52 48 -50 10 29 24 3 20 42 67 -45
3346 -45 -5 -41 27 -16 26 32 -24 11 21 45 45 60 15 36 -1 12 -37 -25 43 49 -56 -18 56 -22 1 -31 -13 28 -31 4 22
3377 22 -67 -16 -19 31 6 23 33 14 44 -20 -17 -65 50 89 -36 25 -1 -3 -65 47 41 -39 10 -5 27 62 21 9 23 13 41
3408 41 -2 35 39 -14 21 -20 11 23 -71 37 -6 -43 -97 -4 22 -50 -33 -24 16 -34 -47 18 31 -25 -25 -14 60 38 -67 23 -21
3439 -21 8 29 -48 -37 13 -14 -29 58 69 41 -25 8 5 46 -13 37 65 -66 -8 -42 -41 -23 -22 -4 -7 12 -5 -99 19 8 42
3470 42 1 58 47 -20 62 11 36 -35 -40 -11 9 -23 15 14 49 -22 11 25 24 1 13 26 41 -5 -33 4 71 17 39 -23 36 -24
3502 -24 -12 -32 12 -17 -11 -41 -4 8 -31 6 -30 -12 -36 23 -2 26 0 -3 12 47 34 -40 -57 84 -15 -26 38 -1 21 -56 35
3533 35 9 29 -16 -38 43 11 -7 -32 8 -60 -12 30 32 -21 8 33 -12 17 -30 -35 -69 11 42 7 -16 -16 18 -69 17 20 18 32 17
3566 17 51 17 12 0 51 -35 -11 -24 17 -23 -20 -19 -13 12 27 -31 18 26 -4 12 -23 5 -37 24 -6 -26 -42 -14 -27 -57 -35 -44 41
3599 41 11 6 1 25 -10 72 12 -16 56 94 -44 30 17 37 4 -19 44 68 -34 -32 17 20 -21 -47 82 16 -10 -45 -13 -5 5
3630 5 -2 20 20 42 49 28 46 -2 -84 -40 48 86 19 -49 12 54 -4 -9 41 42 35 42 99 63 -25 -3 77 -3 -3 -55 -18 -33 -11 -42 -44
3665 -44 29 19 0 -75 54 25 -3 -56 -12 7 -32 -45 57 -44 1 18 54 93 4 25 12 -27 -1 -7 60 -7 8 -30 45
3694 45 -12 38 -20 -58 0 7 -37 42 37 -28 33 66 21 -33 18 -17 13 4 -13 53 39 -81 17 -35 34 53 34 -6 -30 37 -31
3725 -31 -48 54 25 -20 -14 33 -9 -20 -19 -40 40 -64 52 -1 28 23 -20 -3 23 33 21 28 8 -32 10 -49 -17 -12 -23 19 -27
3756 -27 -45 31 -5 -24 -31 -31 19 56 -6 10 41 -49 -69 11 34 -27 -5 -3 -33 -41 17 59 7 49 43 27 16 -24 43 38 39 6 53 -5
3790 -5 -19 46 -1 -20 1 -18 -20 -50 -29 -21 -50 2 -2 -68 -41 1 50 35 57 35 -29 -34 44 8 18 -13 -6 -49 25 -68 -11 -14 -4 -57
3824 -57 11 -6 3 28 23 33 45 65 21 -95 -11 60 28 -24 -39 -27 1 -1 21 -42 -27 1 -44 -13 -82 20 -18 10 16 -26 -5
3855 -5 52 -14 -23 5 -32 29 35 39 24 -1 24 8 8 4 9 13 23 13 20 -11 38 15 29 36 5 -43 -67 12 -1 -3 -39 -21 5 -10 -14 -25
3891 -25 -21 44 12 -27 -48 57 -10 -34 45 11 37 -1 18 10 -26 6 -43 -27 25 1 2 15 13 -21 -42 20 33 36 -5 -12 -14 26 31 55
3925 55 2 -16 -21 16 -21 14 -49 3 31 -10 -58 -33 16 -5 39 28 4 50 -9 -11 24 43 20 -70 61 68 -1 0 -18 5 33 -29
3957 -29 9 5 48 -36 23 49 -47 -17 28 -34 -27 14 15 -7 45 -44 -79 -13 -49 -2 -6 25 1 -24 -29 -30 31 76 1 -22 24 26 10 26
3991 26 -18 -39 5 9 -25 40 -11 17 -55 40 -10 -34 10 -36 -47 10 -2 69 -23 43 17 31 -7 -12 50 -7 -61 -30 1 19 -33
4022 -33 6 -10 -1 -47 7 17 -20 13 -40 27 18 53 -5 1 2 42 58 45 -10 28 -20 -12 -73 14 14 4 -13 -15 -11 -20 -40 -10 -26 42 5
4057 5 21 -26 -54 -9 4 -27 -57 -6 -7 -19 -51 14 2 21 70 20 -22 -21 8 30 52 18 45 29 65 31 50 15 -40 21 6 3
4089 3 5 -44 -10 -28 1 53 -3 45 -7 -12 21 -18 -5 28 -12 -32 -26 3 -8 -29 -19 -10 56 9 -32 13 2 44 -20 2 -68 -41 14
4122 14 41 -30 42 17 11 -2 -10 -48 8 18 -24 -13 -16 -16 -17 56 -31 -57 -65 0 -4 -19 -22 -10 10 -10 59 -23 4 26 10 64 -11 38
4156 38 -52 -36 -44 0 -27 40 -18 -28 39 85 20 43 15 46 -15 -30 -7 -19 -21 -24 -36 -12 -35 -16 -6 -66 0 -31 -3 -30 -2 -32
4188 -32 2 22 -12 -41 4 8 -12 -34 35 9 31 -7 -16 -57 88 -26 46 29 11 34 8 91 11 -10 -43 66 38 88 4 0
4218 0 14 21 -68 -16 -18 -11 2 4 -6 -29 -2 -14 6 -26 -12 -4 54 -24 52 -2 -15 18 28 50 -37 -7 4 -38 -8 58 -23 -8 -40
4251 -40 -19 -30 29 16 5 11 37 59 49 17 -10 -22 -17 52 -46 -42 -37 1 23 48 43 -3 -9 46 12 -26 -1 -18 68 -7 45 -26 6
4284 6 -3 -10 43 51 54 -39 25 -38 27 -61 -29 2 16 -5 -12 -10 15 -33 44 57 -54 63 4 7 -32 8 25 -65 -35 -29 -46 -50 3 -17
4318 -17 -17 1 -35 39 10 82 -20 5 -1 17 -25 -4 57 -48 -16 -3 4 21 19 11 -44 -19 -4 -10 17 16 -17 33 -37 44 -14 16 -10
4351 -10 -5 11 -20 10 -19 16 6 -39 -36 -51 -17 20 -5 -26 10 -7 -8 14 49 31 6 -36 -14 39 11 -18 -36 -24 6 -54 44 5
4383 5 -26 -3 11 26 28 2 -1 2 7 -43 3 -18 22 -19 7 -13 19 -6 22 -10 -9 -2 11 -6 -32 9 -2 13 -10 31 0 -6 -23 41
4417 41 -45 -26 8 -5 8 -42 -23 0 -2 1 -32 -68 4 -26 56 29 -35 23 6 22 -43 -15 -14 2 -1 17 -33 47 -2 18 -24 36
4449 36 -43 9 4 -24 -51 43 62 65 56 43 71 -13 22 -19 4 1 52 -44 -27 50 -20 26 37 -53 32 4 -60 -22 -41 34 4 -41
4481 -41 27 34 -20 24 -28 14 -47 -28 -9 8 8 23 9 -51 -8 39 -21 57 -23 13 7 4 -50 33 71 28 -3 20 -7 2 -13 7 24
4514 24 -30 20 -53 17 -31 -21 4 35 7 -65 8 -20 20 -42 22 7 -50 28 -31 -22 -57 19 -39 8 11 0 -44 53 29 -19 5
4545 5 26 -19 -18 0 19 37 -29 76 -8 -28 37 -12 16 -10 8 3 11 -23 -2 -19 -23 17 20 -67 -27 33 -15 92 11 -42 -46 -37 -13
4578 -13 30 21 5 10 27 18 -14 -39 -33 -49 -57 43 23 18 28 -48 -8 52 17 14 -25 8 -4 -35 -38 -44 25 -63 -17 -27 -22 -9 -26 -28 -19 0
4614 0 37 14 19 40 -2 2 28 -39 -20 -40 -6 -1 -27 30 17 4 59 -32 -16 -9 -3 0 -2 9 6 33 -8 -9 16 -24 -44 -26 5 21 -29
4649 -29 24 26 -27 24 -9 -21 -10 -4 -60 -61 -10 2 17 19 6 22 24 20 -27 36 -31 -1 51 -38 -20 62 3 48 15 76 64 14 6 57
4683 57 72 36 44 1 29 7 -47 -3 14 -99 40 -83 -12 -5 -13 -43 -2 -5 15 -5 59 113 -28 29 -56 15 31 13 68 -13
4713 -13 -25 -54 42 -15 -34 8 2 -31 -13 -46 12 -10 -54 48 -22 5 -39 23 -54 -48 -23 -8 -6 -7 -3 -19 -15 -12 15 20 50 4 -42 27
4747 27 7 21 -9 55 8 13 -7 42 57 78 -12 -19 11 -4 -41 -7 16 -4 -39 -22 -11 58 66 43 10 -18 39 -73 27 13 -22
4778 -22 8 -1 0 -24 -35 -4 49 -5 8 66 -4 -14 26 53 29 -4 62 -15 45 8 2 41 40 28 72 -42 14 -14 -2 -6 12 -5
4810 -5 -25 21 -23 14 12 -26 -39 -4 -25 15 -24 53 -12 -21 12 50 -21 -33 -14 -4 -3 5 -19 10 -14 -35 39 30 53 21 18 16 14 46 14
4845 14 0 -26 17 9 58 -56 0 -20 -6 3 -15 -39 -52 -28 -32 -27 -28 32 33 -13 -58 29 13 10 9 -8 16 39 -45 -11 -17 -32 25 3
4879 3 -10 -22 29 75 13 -6 48 -8 -9 -6 -6 19 21 -41 1 -17 -20 10 40 -18 -42 -63 -31 -41 -41 21 28 6 -5 -35 57 9 -26 73
4913 73 -4 30 6 -26 -7 42 33 35 46 27 -30 -24 43 20 -1 -31 -15 18 -46 -17 8 38 16 -25 47 1 -26 -3 -26 -19 30 2
4945 2 -69 -19 31 -46 -11 -54 10 -4 11 17 -35 -6 -42 -2 -23 10 33 19 -35 35 34 -37 -5 75 35 17 -31 55 63 -27 -12 10
4977 10 12 11 -14 -27 21 -34 -41 50 -27 40 11 -11 16 -3 -46 -20 33 5 -49 -16 4 -5 58 50 27 32 39 -25 -12 25 1 13 48 -16
5011 -16 30 -41 12 -40 2 29 -16 7 76 -6 -9 1 -12 -33 -32 7 -36 8 35 6 28 -30 1 -7 28 -26 -16 10 44 -45 25 -8
5043 -8 -14 37 30 -33 63 54 38 1 -6 17 0 25 -22 -19 -26 -12 13 11 55 55 -38 -27 -28 26 -8 35 2 52 -3 -22 -19 15 -21 -43 -23 35
5079 35 -10 36 26 -58 -20 -3 -20 23 53 -19 -43 26 -19 8 -23 36 31 39 -10 -7 72 -26 -10 -3 26 20 28 1 -34 12 -38 -10 -6 50
5113 50 36 53 -72 -63 -44 15 -46 15 6 13 -3 17 -42 -15 -32 18 59 20 14 -14 3 11 11 31 -12 -19 -13 46 -3 -30 -17 24 7 -43
5147 -43 -38 -3 -4 -23 19 -100 -11 8 -1 42 -15 19 23 -51 -31 -21 32 -8 39 -2 -63 -31 0 6 -3 18 -25 -2 34 50 -1 16 37
5180 37 -12 40 50 4 21 -15 -49 33 35 3 -14 -2 -70 -22 46 1 -37 -21 -22 23 -7 -45 44 -85 -5 21 13 -62 13 -84 27
5211 27 -3 44 -4 -27 -12 5 -8 33 -49 30 50 1 -28 11 2 -16 62 43 -13 -7 -23 0 38 -8 -52 24 4 -23 34 29 29 -25
5243 -25 -17 -6 -33 -14 25 -17 -4 -4 48 8 -17 6 9 -14 -32 21 6 42 25 -18 3 -70 6 95 74 31 -9 44 25 -46 2 -26
5275 -26 30 -33 -9 22 2 -37 7 31 -7 -27 2 -23 44 20 27 -39 -63 -17 -41 -13 13 -23 38 -38 7 17 -48 35 -11 19 -26
5306 -26 -17 26 5 37 4 -16 -11 43 19 11 91 40 -18 5 -37 -9 5 -4 26 -15 -43 -32 -3 -23 -22 37 -15 -34 -9 42 9 11 37
5339 37 36 6 -35 20 38 -24 30 10 21 -31 -4 -32 10 -72 -21 -34 46 50 8 -25 1 -5 -21 -3 7 27 8 16 -31 -25 19 -55 -19
5372 -19 26 -7 10 37 -42 -1 11 -50 -20 38 11 -14 -26 22 42 0 28 1 -2 34 48 12 33 36 55 -16 13 -2 16 15 -52 35
5404 35 39 7 22 -6 -8 -46 27 18 -8 8 8 38 -54 -13 60 23 12 -35 14 -17 56 7 -29 67 31 -1 1 -6 8 -48 -3 -4 8 -10
5438 -10 20 9 -34 9 39 51 -16 -39 42 0 23 -28 -20 -2 -23 22 43 -26 19 -18 79 0 29 16 -4 7 42 -13 5 87 18
5469 18 -21 -95 3 3 -3 14 21 12 -19 12 -12 23 -42 19 -5 10 26 0 10 -15 -13 14 9 -35 -2 -14 4 -32 -1 -5 -38 -5 -29 26
5503 26 27 -43 22 -20 9 -8 42 31 25 37 13 -5 5 -3 -15 -39 42 33 37 47 -41 17 -71 -43 18 -5 48 -2 -15 1 9 -42 9
5536 9 -6 33 23 -15 34 -20 18 -47 -44 25 -10 15 52 -2 -36 0 -66 -11 -10 18 82 -10 7 -3 21 -11 2 -26 10 7 25 16 -33
5569 -33 -20 54 6 36 16 -10 -27 -41 24 -25 -5 70 40 -36 -31 -4 38 -29 32 34 -2 -2 0 -42 -18 30 6 55 13 41 -30 26
5601 26 32 -17 29 -10 36 -60 11 55 21 -42 35 27 -31 -6 9 38 -12 -36 17 -35 -2 -70 -29 -22 14 98 -34 -61 97 -33
5631 -33 11 17 -15 -42 -16 29 3 27 9 13 48 7 16 -71 -46 71 47 7 -10 19 63 -33 -25 13 23 -32 -20 -20 23 -52 -12 -26
5663 -26 -21 -40 24 1 -20 19 -4 -55 39 -23 -5 12 20 25 -58 -2 11 8 17 52 2 26 16 31 16 36 37 44 -51 17 -8 22 -29 -22
5697 -22 8 14 14 -18 -34 12 -28 -4 49 -36 23 12 20 -8 43 21 -2 56 40 -4 24 -50 7 0 14 67 -26 13 42 -19 68 29
5729 29 39 -25 30 4 58 -91 19 -7 4 57 -13 -52 -17 8 6 6 33 0 -16 1 34 -26 -26 11 62 21 -7 -5 9 24 -21
5760 -21 -26 -3 -28 49 -35 4 -31 29 -7 9 16 40 -3 6 26 9 44 24 44 26 -31 54 -49 41 -45 1 1 -5 15 -60 22 -23
5792 -23 34 -69 77 -17 -34 -23 -3 -38 30 -14 -5 25 -61 -7 -8 -4 -31 24 -30 27 30 -10 -17 19 -5 19 12 14 -52 -5 40 51 20
5825 20 -38 7 -13 2 16 23 -20 -47 -4 -5 -37 5 -9 -18 -9 -7 -9 -6 12 87 92 12 46 14 -13 -2 -35 -4 7 34 34 -20 26 35 38 11
5861 11 -6 31 -7 -47 15 -37 -62 -5 -38 -15 4 12 -18 14 5 -9 27 4 -8 37 64 24 48 -51 -25 -17 50 -29 32 -45 -55 -4
5893 -4 4 50 17 -13 5 34 13 -14 -93 -12 17 13 13 43 -9 -36 -36 -57 -38 37 -10 -2 11 -74 -36 -32 12 -17 36 -82 35 -40 29
5926 29 4 -17 5 -18 3 29 -2 -13 42 -4 -40 45 -28 40 23 -2 -27 -12 -8 32 4 -10 31 68 35 -30 56 -74 19 -4
5956 -4 41 12 35 15 20 -30 -55 46 -3 -6 -30 -49 12 -67 -51 9 -20 -26 -27 7 25 -2 -17 33 -27 -29 -7 -21 3 21 23 20 22 -56
5990 -56 16 30 7 -3 21 -31 5 11 -39 -11 -18 8 17 45 -11 27 46 -8 -16 14 -20 5 -28 38 40 -12 14 59 28 -8 -7 0 25 -54
6024 -54 26 -9 22 37 29 4 59 -23 -34 5 -6 26 -10 7 5 -13 -15 -28 -12 5 -47 -13 -17 -10 -4 -11 -15 -18 -14 -4 -7 8 -47 -2 -19 2
6060 2 6 18 -21 -8 -27 26 38 -27 -25 -12 -33 12 22 5 -16 9 -32 -47 46 -28 -30 -10 -50 -5 -13 25 -46 14 -4 -19 -62 -3 -6
6093 -6 -46 3 -10 -80 7 2 -14 6 -12 -23 39 0 25 -17 7 22 -8 27 17 74 46 -2 12 -16 -20 11 -47 23 52 2 47 -18
6125 -18 -26 15 10 -8 -20 -10 -91 -27 -39 -56 -39 -8 -41 47 3 2 -23 -43 35 7 48 -57 -76 -3 -9 21 -20 21 -39 10 51 36
6157 36 -31 -13 -5 -31 -6 55 11 5 -25 7 14 2 38 25 18 30 -8 22 6 24 30 19 -36 -49 5 -2 40 -1 24 -24 14 45 -30
6190 -30 25 -14 2 32 -27 -52 7 -15 57 -14 -52 0 -35 3 -26 6 62 10 37 2 -6 -13 56 -46 -49 30 7 13 -11 -57 23 8
6222 8 -9 0 25 4 0 9 7 24 -19 -43 -4 42 -13 -2 29 -25 2 -7 32 -27 -57 49 -27 5 -20 -14 -5 -33 -13 57 -14 24 -77
6255 -77 30 25 -4 15 9 48 10 12 -4 43 18 -17 -40 2 -25 10 26 -65 54 46 -3 0 -11 -17 32 5 39 30 -26 -28 -12 -18 -21 0
6289 0 -12 -20 -54 -18 -6 -38 -2 -26 -78 -9 21 -101 -42 54 -21 2 4 30 -13 -41 21 -14 -6 27 41 45 -27 21 -43 45 -25 41
6321 41 8 23 -14 32 18 1 -24 39 30 43 4 49 3 11 2 22 -2 10 10 -16 -13 -8 -62 33 -28 -35 23 -43 -25 -15 6 -2 -16 -11 44
6356 44 -4 25 41 -28 -2 6 42 37 8 34 10 34 31 18 27 19 73 12 44 5 2 -23 -53 42 2 -14 -13 -33 -15 -65 -31 9 32 7
6390 7 -13 1 2 -17 46 -16 27 3 38 -9 6 11 -19 7 32 28 3 10 -4 55 20 15 -34 50 15 12 3 10 36 34 -10 -22 68 -34 -17
6425 -17 35 11 -37 -30 -60 -4 -6 -22 6 21 -71 5 -29 -59 -50 -39 30 -11 -34 3 30 -29 60 -49 -16 -1 -14 45 -27 36 56
6456 56 31 48 36 30 28 -28 -35 6 -3 -17 14 13 34 -6 29 3 11 -16 29 -1 -14 43 -4 54 1 -19 -16 -8 27 21 6 11 20 7 75 49
6492 49 84 42 41 -78 -17 -18 -1 -1 9 -14 51 6 17 -46 21 7 -9 -3 -42 -53 -50 -16 22 55 -2 14 33 32 32 0 18 45 -11
6525 -11 2 -22 -17 -60 37 55 -11 36 59 -48 -20 -22 8 56 20 33 -17 2 -44 41 4 18 -24 30 28 -61 14 34 -48 -43 -45 2
6557 2 13 -27 36 -9 7 -25 9 -4 -32 -19 11 66 13 67 5 -4 1 -14 31 3 -34 13 -17 34 31 46 -3 1 19 10 24 -23 9
6590 9 -3 -36 80 19 5 4 33 -30 -23 -10 13 20 27 -56 -6 -3 -5 13 -23 -6 -32 18 -25 48 -4 13 -37 54 -4 -25 -29 22 -9 -26
6624 -26 31 -31 21 76 54 -40 -7 -26 30 3 -10 -39 32 -20 -52 9 -8 -69 -16 27 -21 2 -50 17 -15 14 -24 58 10 -36
6654 -36 -2 21 -19 35 43 38 24 16 3 -32 22 39 20 29 73 47 14 6 -15 7 -25 -48 -4 47 -21 -2 -28 -5 -34 3 -34 -42 -19
6687 -19 1 -41 46 20 31 43 -44 45 -20 25 10 21 -16 44 23 53 35 2 26 26 2 33 45 -26 22 31 21 11 -15 6 -18
6718 -18 -54 -6 -34 -20 89 -28 -2 -42 -36 16 -16 18 5 18 -35 11 38 -30 63 -37 -1 -27 -18 15 -19 73 27 7 42 18
6748 18 86 62 26 6 51 46 -1 57 25 2 -11 -29 6 -10 44 -12 23 -20 2 -8 -22 20 16 -41 -16 -31 -8 19 35 -67 -5
6779 -5 6 10 3 4 9 18 -6 8 41 11 -27 23 28 -31 37 -3 15 19 11 13 -29 39 52 8 1 45 -22 -40 22 -28 -6 7 -56 37 -6 -35
6815 -35 -30 44 -18 11 26 0 -39 14 12 12 -16 -38 28 29 -53 -55 29 -5 1 6 -6 14 3 12 -14 48 1 64 -10 4 -11 54 -15 -20 -14
6850 -14 -29 22 -36 32 13 34 36 5 40 -12 -2 47 6 13 34 -8 65 -15 -19 30 -35 41 -9 44 27 21 -21 -24 48 26 15 36 1
6883 1 7 26 -4 24 -43 -10 -15 -26 83 3 4 4 -38 -14 54 18 -3 -26 -36 -43 -11 -55 -42 -29 -38 4 35 62 11 -31 55 -11 41
6916 41 15 12 -14 10 -40 30 19 26 -37 -19 37 -27 8 40 27 9 -53 2 -16 4 39 51 -44 -14 -36 -13 8 -7 -41 -8 -32
6947 -32 -15 9 47 55 6 -27 13 -7 13 16 13 49 8 1 -39 14 33 21 1 11 -15 35 40 57 2 45 -11 -35 -75 -54 -34 -38 -56
6980 -56 -52 -55 67 12 19 -46 -24 -43 36 -54 42 -11 -63 -4 48 25 18 44 31 1 50 10 -27 27 68 8 -2 -49 -32 1 18 40
7012 40 19 -7 -3 12 -13 -1 -4 -51 45 43 46 -5 22 -48 -21 6 -14 -56 -1 69 4 8 22 10 -14 7 -1 64 -79 -4 22 22 -51
7045 -51 6 11 5 -13 11 -83 6 -10 12 3 5 2 -19 -49 24 4 55 -84 -11 5 10 -103 -5 -3 70 12 -14 -14 -49 23 30 10 -28 -28
7079 -28 5 -34 11 17 -14 102 -18 22 -3 51 35 29 0 22 -13 -14 5 39 -4 -17 -14 32 -30 0 -31 -28 65 17 30 -35 -60 7
7111 7 -3 -58 36 -62 -41 11 -62 36 -2 -24 -2 41 34 35 26 30 34 -24 -25 65 21 4 12 -63 9 4 27 1 11 -26 -19 -7 -18 63 15
7146 15 23 -20 55 -33 -37 2 37 32 6 51 -26 -57 -14 2 -12 -24 15 -5 20 23 41 -22 19 26 -25 5 16 -1 -26 54 25 0 -20
7179 -20 0 10 -36 23 21 -39 -33 -13 35 9 -28 -2 -2 -35 20 -10 -12 -25 14 20 -32 -48 6 16 25 9 14 48 -36 -37 -25 40 26 -24
7213 -24 36 60 41 -33 -40 -29 -1 58 -4 -18 29 15 18 24 -26 3 -21 -22 7 -18 -9 3 5 24 -43 -9 38 8 43 -22 3 -68 -16
7246 -16 -1 -28 17 -27 -49 -63 39 -10 0 13 35 40 42 5 8 -58 31 55 0 2 -41 15 -54 -20 -4 12 11 -66 -19 -29 -5 -27
7278 -27 8 -39 -8 -5 13 -26 6 -7 -13 80 4 -20 -50 -31 38 22 9 -3 -14 8 37 -47 15 25 8 42 24 5 12 14 -39 -76
7310 -76 1 -11 6 8 40 -23 34 -25 -19 47 25 14 -28 56 24 52 34 -36 -62 -6 23 -8 -12 41 50 26 -4 79 -5 -12 -7 71 13
7343 13 63 -21 -2 21 10 5 68 -92 26 33 12 15 -4 -23 14 -6 -45 -59 -52 32 -12 -23 34 -24 47 -12 27 -4 -83 -43 -7
7374 -7 37 36 -32 66 -16 51 -35 10 23 16 27 20 22 -7 -2 1 -32 0 27 44 21 45 44 48 -53 -29 82 -54 -44 -32 0 -46 -39 -25
7408 -25 24 40 48 28 17 3 3 51 37 -18 3 48 -57 55 46 -21 -53 6 -50 -8 -16 -32 7 -34 42 40 44 -22 -3 -12 40 7 -1
7441 -1 -29 -3 -18 -24 11 -42 1 3 6 13 23 -18 10 -6 46 -18 -19 -15 5 27 -7 18 -8 -25 -33 57 -70 -14 9 44 -12 11 29 29
7475 29 15 50 -34 -40 19 -33 -43 -28 -19 30 1 -60 -6 -7 -48 12 -14 -27 -16 -10 38 -28 -18 -5 49 -50 -3 -9 -59 22 43 1 22
7508 22 31 -19 55 8 8 -11 20 19 -7 14 -38 16 43 -24 9 -41 -9 -3 55 15 -19 17 -16 -1 36 39 -43 -28 -37 -101 -52 31 -66
7541 -66 28 2 -26 43 34 11 30 -33 6 16 25 4 32 -8 -4 -26 1 35 27 -6 18 13 -39 -8 -68 14 -17 -18 -8 -26 -39 -1 -34
7574 -34 -27 -7 43 -18 22 28 31 -71 56 34 -32 -3 -20 3 7 -38 43 -21 20 36 -20 10 1 13 -18 -32 15 -27 -50 9 71 36
7606 36 22 19 18 -46 44 17 -10 -44 12 16 -43 10 -49 -38 -4 2 19 -42 17 -64 -17 2 -44 66 -45 -2 34 -2 -50 36 34 16
7638 16 31 51 26 10 22 44 15 60 -46 -20 41 14 -33 -4 -24 57 -17 26 -41 -44 -11 -11 0 -46 -14 27 31 -23 -41 -40 0 -50
7670 -50 34 2 15 -32 0 8 -16 24 46 3 11 36 44 18 47 29 -38 30 22 -36 22 -1 25 14 -17 -70 -16 -17 8 -20 5 -39 -14
7703 -14 -28 11 -10 -17 2 15 29 -7 20 -13 4 -33 -44 -14 -12 36 -36 -10 19 12 -51 -23 13 9 44 13 49 15 21 -2 -50 -27 0
7736 0 41 -8 -33 -8 -22 19 27 -45 7 20 -5 -7 73 -23 -13 -46 24 -28 16 -14 16 13 -30 5 27 -16 -17 -22 16 19 42 49 -16 -12 -44
7771 -44 11 20 40 -6 -39 -11 11 28 -39 21 -42 -22 16 -39 4 -20 62 -22 42 -18 19 8 34 -18 14 41 29 63 8 68 22
7802 22 1 28 -2 -19 34 -36 -13 -17 13 2 83 24 -9 -8 -3 -2 -12 -16 9 38 26 -22 -17 2 11 11 -47 9 -18 4 22 16 -21 -7 77
7837 77 -5 -13 28 21 9 15 0 -5 16 -30 -20 12 -2 6 49 -6 45 22 50 55 48 8 6 30 -18 25 45 -3 -41 16 43 -80 -46 11
7871 11 -1 -12 -23 -30 5 41 -55 11 -25 15 -12 -21 -15 -15 13 -2 96 -1 32 44 -30 -21 24 28 -23 -67 -19 -27 14 -14 -22 -34 30 30 -15
7906 -15 26 -33 -7 -48 -58 5 -60 13 -48 -9 54 -25 -4 -46 21 -43 -47 -14 -12 -45 -3 -9 0 7 50 78 45 24 39 -17 60 22 10
7939 10 25 -4 5 -2 18 44 -1 37 -3 -63 -17 11 -50 -19 42 -43 -60 -59 -13 9 -4 -22 0 10 -5 -28 -33 57 -17 -18 14 26 25
7972 25 -17 -12 0 29 -14 37 59 -1 -37 -34 6 -4 -12 -38 -21 8 29 -13 7 17 -15 -74 -22 13 10 -16 22 -14 29 8 -72 -26
8004 -26 16 6 -18 5 10 22 13 20 6 -30 17 -20 34 -10 -14 60 17 17 18 -15 -13 -19 42 15 10 26 69 -54 -52 33 7 -37 -1 -57 15
8039 15 -48 -55 -19 -65 4 23 -27 -58 -22 -15 0 4 1 -38 54 62 -4 0 -25 42 13 -9 10 44 20 1 -30 -33 82 34 42 13 -7 -35
8073 -35 51 0 -81 27 -26 4 -25 -34 -42 -27 10 -23 5 -11 -27 14 -13 59 49 -76 14 68 -2 -9 12 -6 16 32 18 -34 48
8104 48 -32 8 23 -27 4 16 14 2 0 1 10 -30 -41 -6 17 -4 -60 -33 -4 -56 -40 -9 -27 -48 20 11 -36 -28 24 3 28 -22 -3
8137 -3 -5 1 -41 -9 73 44 17 9 19 17 -20 -25 36 -1 55 17 46 36 22 25 -13 -76 -3 9 21 -4 -33 -32 -74 -28 48 -20 1 -26
8171 -26 2 -31 2 26 -21 -9 -2 -42 -32 -16 -10 48 39 21 -35 -41 -27 26 -15 15
8191A5
##END NTUPLES=NMR FID
##END=
