##TITLE=1H_DE-80H_X3
 200.13MHz, d2o
 8 sc
 
 19ns.26.2.2025
##JCAMPDX= 6.0         $$ Bruker NMR JCAMP-DX V2.0
##DATA TYPE= NMR FID
##DATA CLASS= NTUPLES
##ORIGIN= UXNMR, Bruker Analytische Messtechnik GmbH
##OWNER= pz
$$ XWIN-NMR		Version 3.5
$$ Mon Oct 20 12:02:56 2025 Russian Standard Time (UT+4h)  Yarkov@DPX200
##.OBSERVE FREQUENCY= 200.1313
##.OBSERVE NUCLEUS= ^1H
##.DELAY= (6, 6)
##.ACQUISITION MODE= SIMULTANEOUS
##.ACQUISITION SCHEME= undefined
##.AVERAGES= 8
##.DIGITISER RES= 18
##SPECTROMETER/DATA SYSTEM= spect
##.PULSE SEQUENCE= zg30
##.SOLVENT NAME= CDCl3
##.SHIFT REFERENCE= (INTERNAL, CDCl3, 0, 14.3821)
##AUDIT TRAIL= $$ (NUMBER, WHEN, WHO, WHERE, WHAT)
$$ ##TITLE= Audit trail, XWIN-NMR		Version 3.5
$$ ##JCAMPDX= 5.01
$$ ##ORIGIN= Bruker BioSpin GmbH
$$ ##OWNER= Yarkov
$$ C:/Bruker/XWIN-NMR/data/yarkov2/nmr/H-C/1/audita.txt
$$ ##AUDIT TRAIL=  $$ (NUMBER, WHEN, WHO, WHERE, WHAT)
(   1,<2025-10-20 12:01:57.37 +0400>,<Yarkov>,<DPX200>,
      <created by zg, POWCHK disabled, PULCHK disabled
       configuration hash MD5:
       00 E9 B6 7A A2 85 ED C7 34 08 36 98 17 FE 4E 26
       data hash MD5: 16K
       3C A4 41 F8 C4 A1 58 66 18 D3 08 2A C1 31 D7 F2>)
$$ ##END=
$$ 
$$ hash MD5
$$ 0E 74 32 B6 54 10 23 33 A7 6B 9B 95 81 09 80 DE
##$RELAX= 
##$RELAX= 
##$RELAX= 
##$RELAX= 
##$RELAX= 
##$RELAX= 
$$ Bruker specific parameters
$$ --------------------------
##$DU= <C:/Bruker/XWIN-NMR>
##$EXPNO= 1
##$NAME= <H-C>
##$PROCNO= 1
##$TYPE= <nmr>
##$USER= <yarkov2>
##$AMP= (0..31)
100 100 100 100 100 100 100 100 100 100 100 100 100 100 100 100 100 100 
100 100 100 100 100 100 100 100 100 100 100 100 100 100 
##$AQSEQ= 0
##$AQ_mod= 1
##$AUNM= <au_zg>
##$AUTOPOS= <>
##$BF1= 200.13
##$BF2= 200.13
##$BF3= 200.13
##$BF4= 200.13
##$BF5= 200.13
##$BF6= 200.13
##$BF7= 200.13
##$BF8= 200.13
##$BYTORDA= 1
##$CFDGTYP= 0
##$CFRGTYP= 5
##$CHEMSTR= <none>
##$CNST= (0..31)
1 1 145 1 1 1 1 1 1 1 1 1 1 1 1 1 1 1 1 1 1 1 1 1 1 1 1 1 1 1 1 1 
##$CPDPRG= <>
##$CPDPRG1= <>
##$CPDPRG2= <>
##$CPDPRG3= <>
##$CPDPRG4= <mlev>
##$CPDPRG5= <mlev>
##$CPDPRG6= <mlev>
##$CPDPRG7= <mlev>
##$CPDPRG8= <mlev>
##$CPDPRGB= <>
##$CPDPRGT= <>
##$D= (0..31)
0 0.7 0 0 0 0 0 0 0 0 0 0.03 0 0 0 0 0 0 0 0 0 0 0 0 0 0 0 0 0 0 0 0 
##$DATE= 1760947316
##$DBL= (0..7)
120 120 120 120 120 120 120 120 
##$DBP= (0..7)
150 150 150 150 150 150 150 150 
##$DBP07= 0
##$DBPNAM0= <>
##$DBPNAM1= <>
##$DBPNAM2= <>
##$DBPNAM3= <>
##$DBPNAM4= <>
##$DBPNAM5= <>
##$DBPNAM6= <>
##$DBPNAM7= <>
##$DBPOAL= (0..7)
0.5 0.5 0.5 0.5 0.5 0.5 0.5 0.5 
##$DBPOFFS= (0..7)
0 0 0 0 0 0 0 0 
##$DE= 6
##$DECBNUC= <off>
##$DECIM= 32
##$DECNUC= <off>
##$DECSTAT= 4
##$DIGMOD= 1
##$DIGTYP= 9
##$DL= (0..7)
0 120 120 120 120 120 120 120 
##$DP= (0..7)
150 150 150 150 150 150 150 150 
##$DP07= 0
##$DPNAME0= <>
##$DPNAME1= <>
##$DPNAME2= <>
##$DPNAME3= <>
##$DPNAME4= <>
##$DPNAME5= <>
##$DPNAME6= <>
##$DPNAME7= <>
##$DPOAL= (0..7)
0.5 0.5 0.5 0.5 0.5 0.5 0.5 0.5 
##$DPOFFS= (0..7)
0 0 0 0 0 0 0 0 
##$DQDMODE= 0
##$DR= 18
##$DS= 0
$$ [...]
##$SUBNAM2= <"">
##$SUBNAM3= <"">
##$SUBNAM4= <"">
##$SUBNAM5= <"">
##$SUBNAM6= <"">
##$SUBNAM7= <"">
##$SUBNAM8= <"">
##$SUBNAM9= <"">
##$SW= 18.0517328524113
##$SWIBOX= (0..15)
0 0 2 0 0 0 0 0 0 0 0 0 0 0 0 0 
##$SW_h= 3612.71676300578
##$TD= 16384
##$TD0= 1
##$TE= 0
##$TE2= 300
##$TE3= 300
##$TEG= 300
##$TL= (0..7)
0 120 120 120 120 120 120 120 
##$TP= (0..7)
150 150 150 150 150 150 150 150 
##$TP07= 0
##$TPNAME0= <>
##$TPNAME1= <>
##$TPNAME2= <>
##$TPNAME3= <>
##$TPNAME4= <>
##$TPNAME5= <>
##$TPNAME6= <>
##$TPNAME7= <>
##$TPOAL= (0..7)
0.5 0.5 0.5 0.5 0.5 0.5 0.5 0.5 
##$TPOFFS= (0..7)
0 0 0 0 0 0 0 0 
##$TUNHIN= 0
##$TUNHOUT= 0
##$TUNXOUT= 0
##$USERA1= <user>
##$USERA2= <user>
##$USERA3= <user>
##$USERA4= <user>
##$USERA5= <user>
##$V9= 5
##$VALIST= <valist>
##$VCLIST= <CCCCCCCCCCCCCCC>
##$VD= 0
##$VDLIST= <DDDDDDDDDDDDDDD>
##$VPLIST= <PPPPPPPPPPPPPPP>
##$VTLIST= <TTTTTTTTTTTTTTT>
##$WBST= 1024
##$WBSW= 4
##$XGAIN= (0..3)
0 0 0 0 
##$XL= 0
##$YL= 0
##$YMAX_a= 216401
##$YMIN_a= -267295
##$ZGOPTNS= <>
##$ZL1= 120
##$ZL2= 120
##$ZL3= 120
##$ZL4= 120
##$ABSF1= 10
##$ABSF2= 0
##$ABSG= 5
##$ABSL= 3
##$ALPHA= 0
##$AQORDER= 0
##$ASSFAC= 0
##$ASSFACI= 0
##$ASSFACX= 0
##$ASSWID= 0
##$AUNMP= <proc_1d>
##$AZFE= 0.1
##$AZFW= 0.1
##$BCFW= 1
##$BC_mod= 2
##$BYTORDP= 1
##$COROFFS= 0
##$CY= 83.5205535888672
##$DATMOD= 1
##$DC= 2
##$DFILT= <>
##$DTYPP= 0
##$F1P= 10.8118882576601
##$F2P= -7.23987719738617
##$FCOR= 0.5
##$FTSIZE= 0
##$FT_mod= 4
##$GAMMA= 1
##$GB= 0.15
##$INTBC= 1
##$INTSCL= 1
##$ISEN= 128
##$LB= 0.25
##$LEV0= 0
##$LPBIN= 0
##$MAXI= 10000
##$MC2= 0
##$MEAN= 0
##$ME_mod= 0
##$MI= 1.114404
##$NCOEF= 0
##$NC_proc= 0
##$NLEV= 6
##$NOISF1= 3.799351
##$NOISF2= 2.8
##$NSP= 1
##$NTH_PI= 0
##$NZP= 0
##$OFFSET= 14.38212
##$PC= 1
##$PHC0= -4079.816
##$PHC1= 14.22191
##$PH_mod= 1
##$PKNL= yes
##$PPARMOD= 0
##$PSCAL= 0
##$PSIGN= 0
##$REVERSE= no
##$SF= 200.129724274929
##$SI= 16384
##$SIGF1= 3
##$SIGF2= 2
##$SINO= 400
##$SIOLD= 16384
##$SREGLST= <1H.CDCl3>
##$SSB= 0
##$STSI= 0
##$STSR= 0
##$SW_p= 3205.1282051282
##$SYMM= 0
##$S_DEV= 0
##$TDeff= 0
##$TDoff= 0
##$TI= <>
##$TILT= no
##$TM1= 0
##$TM2= 0
##$TOPLEV= 0
##$USERP1= <user>
##$USERP2= <user>
##$USERP3= <user>
##$USERP4= <user>
##$USERP5= <user>
##$WDW= 1
##$XDIM= 8192
##$YMAX_p= 0
##$YMIN_p= 0
$$ End of Bruker specific parameters
$$ ---------------------------------
##NTUPLES= NMR FID
##VAR_NAME=  TIME,          FID/REAL,        FID/IMAG
##SYMBOL=    X,             R,               I
##VAR_TYPE=  INDEPENDENT,   DEPENDENT,       DEPENDENT
##VAR_FORM=  AFFN,          ASDF,            ASDF
##VAR_DIM=   8192,          8192,            8192
##UNITS=     SECONDS,       ARBITRARY UNITS, ARBITRARY UNITS
##FACTOR=    0.0002768,     1,               1
##FIRST=     0,             0,               0
##LAST=      2.2672688,     0,               0
##MIN=       0,             -267295,         0
##MAX=       2.2672688,     216401,          0
$$ Real data points
##PAGE= N=1
##DATA TABLE= (X++(R..R)), XYDATA
0@%%%%%%%%%%%%%%%oJ4j6J6j6J6k1K9l2L6m4N0n8O8p6Q8j01J13j28J44j61J80
$$ 0 0 0 0 0 0 0 0 0 0 0 0 0 0 0 0 -6 8 -8 8 -8 8 -13 16 -16 20 -24 26 -32 36 -40 48 -53 60 -68 76 -85 95
37I5k03K26k50K80l10L42l81M22m65N12n64O22o87P57q34R20j013J120j243J382
$$ 95 -108 118 -132 148 -162 180 -201 221 -244 268 -296 326 -361 396 -438 482 -531 589 -654 728
57G28j541J728j952K223k559K987l555M344n518P448j1149K0660r0330j90809
$$ 728 -813 915 -1037 1186 -1373 1614 -1941 2403 -3115 4333 -6816 13844 -76486 -267295
71b67295K26738J82684j13842r9911Q9039K3391p2119J5142O1847m7317m6661
$$ -267295 -40557 142127 28285 -71626 17413 40804 -31315 -16173 45674 -1643 -48304
82d8304O5301M6696q1690o0330P5709Q4559n6700j02562J6669J00251K3901n9666
$$ -48304 16997 63693 -17997 -78327 -2618 81941 25241 -77321 -60652 39599 63500 3834
94C834l6021P836Q985K6370L4444k2539n4553O000L8303o021j2077K3086k740
$$ 3834 -32187 -24351 -15366 11004 45448 22909 -31644 -25644 12659 6638 -5439 17647 14907
107A4907l7808J722K8064j1211r900L6398J0428n1797k6634L9868L7479o924k4075
$$ 14907 -22901 -21179 6885 -4326 -14226 22172 32600 -19197 -45831 -5963 31516 24592 517
120E17j5112K472J4153P514J02k970j6749j2757K7904K6562l7086l6188M1914
$$ 517 -14595 -12123 2030 9544 9646 6676 -10073 -22830 5074 31636 -5450 -41638 276
133B76M0033m3101l7577M2308L4841l4659k9744K0189J9868m204j158k94j3908
$$ 276 40309 -2792 -40369 1939 36780 2121 -27623 -7434 12434 8230 7072 6778 -7130
146g130r833J3209K0397j814k3708q358K2252J0662k6845j0663L1135J3674k9537
$$ -7130 -16963 -3754 16643 14829 -8879 -17237 5015 15677 -11168 -21831 9304 22978 -6559
159f559j3046K1704P265j2326K572O966q468k315J0133j248q240K834L093k184
$$ -6559 -19605 2099 9364 -2962 -390 6576 -1892 -4207 5926 4678 -3562 -728 2365 181
173A81J903j657r089M872J2363r118j2558J3562J1232j5104p198J4089L084q541
$$ 181 2084 427 -8662 -3790 8573 -545 -13103 459 11691 -3413 -10611 3478 6562 -1979
187a979L359M171o885m55O218l487l442N426j440p792M868M934q737m10J1331
$$ -1979 1380 5551 -1334 -1789 4429 942 -2500 2926 1486 -6306 -1438 3496 -5241 -5651 5680
202E680k889j1570N787R863n966l519P098j620o360N070M502o762k242M456j405
$$ 5680 2791 -8779 -2992 6871 905 -2614 4484 2864 -3496 1574 6076 -686 -2928 1528 123
217A23j758M103l607o094P297N382r626k730J1503J072j0823J059Q643j903k412
$$ 123 -1635 2468 -1139 -7233 64 5446 -4180 -6910 4593 5665 -5158 -4099 4544 2641 229
232B29L469k812o245L842O557j037l119k505l076K509N386l920l577P290J769
$$ 229 3698 886 -5359 -1517 5040 4003 884 -1621 -4697 -2188 3198 -722 -4299 2991 4760
247D760j0933j991J1530J938o308J683K012n749Q07P941j166p289N85L862p04
$$ 4760 -6173 -8164 3366 5304 -1004 679 2691 -3058 -2251 5690 4524 -2765 -2180 1682 978
262I78j84L07m033m69L867j608k195N512K473q050l144P070L317k075J718K30
$$ 978 794 1101 -2932 -3401 466 -1142 -3337 2175 4648 -3402 -6546 524 3841 1766 3484 3714
278C714n952k334N056L748l02k140m877j791L654K211k518J610K936n228m698
$$ 3714 -2238 -4572 484 4232 3930 1790 -3087 -4878 -1224 987 -1531 79 3015 -2213 -6911
293f911O485N446m323k305M185j047l950K974M440k823m733K69L027J596p38l486
$$ -6911 -426 5020 697 -1608 2577 1530 -2420 554 4994 2171 -2562 -2293 734 2330 1592 -1894
309a894j364J511N07m52L229K106m562l850L328L570r80N13J664k447l754J195
$$ -1894 -3258 -1747 -1240 -1692 1537 3643 -919 -4769 -1441 2129 1149 1662 3326 879 -2875 -1680
325a680L525P37j277j860j145Q71J119j530p17K757n8l334P91M006j313l109J754
$$ -1680 1845 2582 1305 -555 -1700 -829 290 -1240 -1957 800 742 -2592 -1801 2205 892 -2217 -463
342d63L306j292k227J272J166j555r42J002J492j350j882n28J792M67j426k00
$$ -463 2843 1551 -676 596 1762 207 -735 267 1759 409 -1473 -2001 -209 258 -1168 -1368
358a368J447p2j311M73K263l11k178K43L125J129l078j974J491J277j161j28K020
$$ -1368 79 7 -1304 -831 1432 1121 -1057 -814 2311 3440 362 -1612 -121 1156 -5 -133 1887
375A887r74m133q15L477K332j669j181R18l70j313J419L331N79l700k256K480
$$ 1887 913 -3220 -4035 -558 1774 105 -1076 -158 -528 -1841 -422 2909 3488 -212 -2468 12
391A2K795j180j826P12p81k786J341M426n18m424j288K489J176j50R17q5j104
$$ 12 2807 1627 -199 513 -268 -3054 -1713 2713 2195 -2229 -3517 -1028 148 -2 915 830 -274
408b74j035L75K014K333j063l665n25K264L87l67J517j146m295l52M511J676k393
$$ -274 -1309 -934 1080 3413 2350 -1315 -1840 424 811 444 1961 815 -3480 -3832 679 2355 -38
425c8j379J59k90J385J690l44n22K6j655l82L626J075l692r94J900j092j715L217
$$ -38 -1417 -1258 -1548 -163 1527 1183 661 687 -968 -1350 2276 3351 -341 -1335 565 -527 -2242 975
443I75J901m479k297K999J491m10M16n91j444R36J597n98O67P82k348j484L458
$$ 975 2876 -1603 -3900 -901 590 180 596 5 -1439 -503 1094 496 1163 1945 -403 -1887 1571
460A571J001l835r6L269k432k925L193K710l115j643K001j73m92K070P7k100J298
$$ 1571 2572 -1263 -1359 1910 -522 -3447 -254 2456 -659 -2302 -301 -474 -966 1104 1181 -919 379
477C79R27j492R04K112l078k679M202J645m250n28L940k093l727K782K395k335
$$ 379 1306 -186 718 2830 -248 -2927 1275 2920 -1330 -1858 2082 -11 -3738 -956 1439 -896
493h96k69K431j518r34K176j09j778J863P60k833J123L605l567l802M246K238
$$ -896 -1165 1266 -252 -1186 990 881 -897 966 1726 -1107 16 3621 54 -3748 498 2736
509B736m677l40M640j960l810K882J945k777N72K601k009j228K708j50j820K250
$$ 2736 -1941 -2281 2359 399 -3411 -529 1416 -1361 -789 1812 -197 -1425 1283 1133 -687 1563
525A563O85m387P98M383k460m142L869K732m972r36M310p87l229K428J593k533
$$ 1563 2248 -2139 -1341 3042 582 -3560 309 3041 -1931 -2867 1443 656 -2573 -145 1448 -1085
541a085N84K170j626n30K282j441j838L056J087m526p0M299j878l466L179J648
$$ -1085 -501 1669 43 -487 1795 354 -1484 1572 2659 -1867 -1937 2362 484 -2982 197 1845
557A845m112j21L697p64k191K249P75k556R31J512j765P77K833k487l337L147
$$ 1845 -2267 -2388 1309 545 -1646 603 1378 -1178 -247 1265 -500 277 3110 623 -2714 433
573D33J823l740k9L378j591l015K546J370k710M31K520j543j228K045j08j403
$$ 433 2256 -1484 -1513 1865 274 -2741 -195 1175 -1535 -1104 1416 -127 -1355 690 582 -821
589h21K514J28l681J258L648k846k827L600J328m188L26L703k271l130K933J714
$$ -821 1693 1821 -1860 -602 3046 200 -2627 973 2301 -1887 -1561 2142 -129 -3259 -326 1388
605A388k564R21K114k304q40K472q16j491L034N54m018L06L606k318k388L831
$$ 1388 -1176 -255 1859 -445 -1285 1187 371 -1120 1914 2468 -1550 -1244 2362 44 -2344 1487
621A487O54n041N02M200j472k514K956N63l216J094K584j629p22K368j373k172
$$ 1487 2141 -2900 -2398 1802 330 -2184 772 1335 -1881 -787 1797 168 -554 1814 441 -1731
637a731K730J322l757L57L227k536k533L678J771m607j11L450j179k141L098M67
$$ -1731 999 2321 -1436 -1079 2148 -388 -2921 757 2528 -2079 -2190 1260 81 -2060 1038 1505
653A505l210J201K275j732k13K313k087k319K846J887l551j4L247k514l277L400
$$ 1505 -1705 -504 1771 39 -174 2139 52 -2267 579 2466 -1085 -1099 2148 -366 -3643 -243
669b43K430l242k49K516j463j831K738J114k241L68J245j928J56K799j365k729
$$ -243 2187 -1055 -1304 1212 -251 -2082 656 1770 -471 -103 1142 -786 -630 2169 804 -1925
685a925K405J229l256K45K981j639k519K456J637k746J8J992j109j027K067M47
$$ -1925 480 1709 -1547 -1302 1679 40 -2479 -23 1614 -1132 -1114 878 -231 -1258 809 1256
701A256j362J031J21k394O82K888j901k131K614N23l507P69L103j609j919K229
$$ 1256 -106 925 1046 -1348 -666 2222 321 -1810 804 1327 -2180 -1411 1692 83 -1836 393
717C93P90k385O55J729j014o33J684m38j776J722M76k192L65K574k058k129K666
$$ 393 1183 -1202 -547 1182 168 -465 1219 781 -995 727 1203 -989 -624 1950 -108 -2237 429
734D29Q28k874N24K401j235j720J845P52j644P71J113j668J3K228j248j394J761
$$ 429 1257 -1617 -1093 1308 73 -1647 198 950 -694 77 1190 -478 -465 1763 515 -879 882
751H82L65k715Q28K520j987k333K561P95k151K81K395j505j436J666L67o92Q13
$$ 882 1247 -1468 -640 1880 -107 -2440 121 916 -1235 -954 1441 -64 -1500 166 533 -159 654
768F54N05j939L26J787j260r55J893O6k877N41K874j333j985J763O31j936M21
$$ 654 1159 -780 -454 1333 73 -882 1011 1077 -1800 -1259 1615 282 -1703 60 691 -1245 -824
785h24K106q39r74P19jn73J288L49j598J58J254j219j080K011M89k776N7K503
$$ -824 1282 443 -531 188 187 -386 902 1251 -347 -189 1065 -154 -1234 777 1266 -1510 -1453 1050
803A050r53j439J538O44j815M0J778k52o73N66m41n33J195L68j395M00Q33j534
$$ 1050 97 -1342 196 840 -975 -935 843 591 -82 484 43 -490 705 1073 -322 78 911 -623
821f23p55J842N65k110K13J295p54o83J379K65r70K7P78m92L03O64p61n81R20
$$ -623 -1378 464 1029 -1081 -868 427 -327 -1010 369 634 -336 -309 469 -23 280 944 183 -398 522
840E22M6j295K83J357j073j121J544K92j454Q5J250p47m39J001K83o56K74K37
$$ 522 568 -727 -444 913 -160 -1281 263 555 -899 -814 436 -311 -750 251 534 -122 152 389
858C89o12L90O94p43n67Q35J30j347L61J194r82q82R74P74j332j0J135j55o19
$$ 389 -223 167 861 118 -449 386 516 -831 -470 724 -258 -1140 -166 608 -724 -734 401 246 -373
877c73M64J70QP4Om24N12L19j072j67R74k26j039L31J051p60q51P74M99p72K65
$$ -373 91 261 269 343 349 -75 437 756 -316 -483 491 265 -774 -443 608 -152 -1003 -229 270 -502 -237
898b37M79p6k37J20O3J83J79q4m83K46K75o07m13R28j1j039R7J016l83o98L97
$$ -237 242 166 -71 49 112 295 474 390 -93 153 428 -179 -592 336 325 -714 -617 399 16 -682 -285
919b85O00j00m38M36K79o4m05O0J31M50o64k81M45J29o47j64O52J47r22M3O61
$$ -285 315 215 -223 213 492 428 23 83 214 664 0 -281 164 293 -354 -518 134 281 -641 -598 63
940F3J83p79N19L28k06r3R8L92j2k96k52K88o8k02k69L91k7l12k10M25J14k40
$$ 63 246 -533 -14 314 108 15 113 505 493 197 -55 233 165 -37 -306 85 58 -254 -464 -39 75 -165
962a65l56M43L42k81k75N72L04m38k78L43L08l13k76J80J86m20k01K17R6k29j92
$$ -165 -521 -78 264 -17 -292 280 584 146 -132 211 519 206 -70 110 296 -124 -325 -108 -12 -241 -433
983d33L7N06J11o34K25P30k37m88K50O62l39p42O48K21p47j17L85P2k28k42k8
$$ -433 -396 110 221 -413 -188 542 305 -183 67 729 390 -352 296 517 -230 -347 38 110 -118 -360 -388
1004c88J12J84m2j87M45L18o34j47Q35N6j022N67Q19o47m80N02Q9n41l03M83J5
$$ -388 -276 -92 -134 -321 124 442 -192 -339 496 552 -470 97 916 269 -211 291 380 -161 -464 19 34
1025C4k85K70j85k02M82j55l93O80L87q46k45J117J57j062J99P36o63m58O34O0
$$ 34 -251 19 -166 -368 114 -41 -434 246 633 -213 -458 659 816 -246 -47 689 26 -432 202 262
1045B62m86O6J23l52K54L83o10o7O86m1p15M93R21j057l74J008m3o63J22N16n09
$$ 262 -224 -158 -35 -387 -133 250 -360 -427 259 218 -497 -4 917 -140 -514 494 451 -212 -90 426 -83
1066h3m11P72q0o04K71J81n18L35M74n83k24J063k06q13M48R80q99p08J097J34
$$ -83 -494 278 198 -406 -135 46 -472 -137 337 -246 -470 593 387 -426 22 1002 103 -605 492 626
1086F26j012K77M93l98n42O87j14n12M49l8n12M84P01o98k67R03J1j050N12J169
$$ 626 -386 -109 384 -14 -556 131 17 -495 -46 -84 -596 -112 589 -109 -376 527 538 -512 0 1169
1106A169j011q70J144K08r56K84N73n68n65O20j42l31O33mo78N05O58q82k94R31
$$ 1169 158 -712 432 640 -316 -32 541 -27 -592 28 -114 -445 188 184 -494 11 669 -213 -507 424
1126D24J03j218N22J146j042m78Q01lr43M46P34n95n69Q02l51k59Q24J05r71L64
$$ 424 527 -691 -169 977 -65 -543 258 255 -688 -242 492 -103 -672 130 -221 -480 344 449 -522 -158
1146a58R34p48m09J186j11j193L54Q57o52n51J067l72p92M50L98o34J4O31n87
$$ -158 776 28 -381 805 694 -499 -145 712 60 -491 576 204 -588 -138 260 -374 -360 271 -316
1165c16j66J056n4j047N94Q87j159l03J115K2j294N94P49q86l89J126m83o46P03
$$ -316 -482 574 520 -527 67 954 -205 -508 607 629 -665 -71 678 -208 -597 529 46 -600 103
1184A03J76q67N17N59p94j18R95j76r51P24P21j089m12J003Kr66O07O14p56l79
$$ 103 279 -588 -71 488 -306 -424 571 395 -556 168 889 -200 -612 391 393 -573 34 648 -108 -487
1204d87O45k49m11P99J2q87L97P73p92l55J113K1j125N99Q72j151m01J254m6j268
$$ -487 158 -91 -502 297 309 -578 -181 592 -200 -555 558 579 -546 53 925 -226 -627 627 581 -687
1224f87O04N83r65p6Q42m09m17R74k53q02N09Q18r06j79J167j05j322O09R72j170
$$ -687 -83 500 -465 -541 301 -108 -525 449 196 -606 -97 721 -185 -364 803 698 -624 -15 957 -213
1244b13m19Q97r5p96M93M14p52O8R09n99l23P14k80o64O48Q09r29l40J078l20
$$ -213 -632 265 170 -626 -133 281 -471 -403 506 -93 -416 298 18 -646 2 811 -118 -458 620 300
1264C00r45M64Q84q34l58Q17m64p55J041N9m29K49M24o67k83Q88m0p04O14O83
$$ 300 -645 -181 703 -131 -489 328 -136 -891 150 209 -220 29 453 -214 -497 391 351 -353 261 944
1284I44j223k22J055r6j153O18M28n27l66O26j79l53O14p5m99L69M81p73k24J159
$$ 944 -279 -501 554 458 -695 -77 351 -176 -542 84 -95 -448 166 91 -408 -39 442 -331 -555 604
1304F04j50q61N76M52p39l33R51l9j008M82M81o26j67O73k75l58M56k21m40N44
$$ 604 454 -407 169 621 -118 -451 500 461 -547 -65 416 -210 -377 296 21 -337 119 -102 -542 2
1324BP92j055k02J029k65p83N60N67q24j65P01k54n55L73L07n41J28N58o83k48
$$ 2 794 -261 -463 566 301 -482 78 645 -179 -344 357 103 -452 -79 228 -313 -185 373 -310 -558
1344e58Q00K0o82N33O46j012K1O60j00q28N45N32o91k79O15l74m61N14K32m27
$$ -558 242 262 -420 113 759 -253 -232 428 328 -500 45 577 -114 -393 222 -152 -613 -99 133 -294
1364b94NM43l45j36Q26m13n30N56L68p50M3N89M0p16K85L96m04k76N42k57l30
$$ -294 -289 154 -191 -327 499 86 -444 112 480 -270 -227 362 402 -314 -29 367 -37 -313 229 -28 -358
1385c58L77J0l50K52L45n87K9O27j75n97P84J43o41r1N10r9n15M84J36m97M0L39
$$ -358 19 29 -321 -69 276 -311 -282 345 170 -427 357 500 -141 -232 278 179 -336 148 284 -213 -173 166
1407A66r3m98L91K8k37L74L16m60j79N85m52l44O51K93q14O2O74k94n48J99L16
$$ 166 73 -425 -34 -6 -243 131 447 -13 -192 393 -59 -403 248 541 -273 -211 463 169 -379 -180 136
1428A36k35k43M54j28j95J36M8j36L83J64o24R7M97j91l31M64K9m89j13M27k14
$$ 136 -99 -342 112 -16 -211 -75 -27 -163 220 384 -240 -143 354 163 -168 296 325 -164 -277 150 -64
1449f4k23J7L78k92L3J27o3k2K40q9k48M38J64m58M4L68k23k51K04J36k82j79
$$ -64 -287 -270 108 -184 -151 -24 -87 -109 131 42 -206 232 396 -62 -18 350 127 -124 80 216 -66 -245
1471b45L34j86j60J68q1J7P6J91j50R2J77k32m0K25O0m79J82L54o1m08K32K08
$$ -245 89 -97 -257 -89 -170 -153 -77 114 -36 56 233 1 -39 186 246 -233 -51 303 242 -166 66 274
1493B74m31j50L20Jk16J02QK2o6J00J4J37J38k27j78K1K17j53R6O6Q8j03j19L61
$$ 274 -157 -307 13 14 -202 -100 -92 -70 -136 -36 -22 115 253 26 -152 -131 86 -67 29 95 183 80 -39 322
1517C22m55P4n5j6n8K80j25R4N5j5j10L9J76l68K69J4M4k22j12K35L2j12r7N4
$$ 322 -133 -59 -114 -130 -188 92 -33 61 116 101 -9 30 206 -162 107 121 165 -57 -169 66 98 -14 -111 -57
1541e7N9j22j58K16L63k97l8K35j62j8J6J36j6k3j44q3K43n1k84J95K05j33k10
$$ -57 2 -120 -278 -62 301 4 -34 201 39 21 37 173 157 134 -10 -93 150 99 -185 10 215 82 -128
1564a28J5J95k5k08K19J04j87j5J96k4K5M7j22J16l92M27r0k89J38j91M9Q8R8
$$ -128 -113 82 57 -151 68 172 -15 -30 166 142 167 214 92 208 -184 243 153 -136 2 -189 -140 -52 46
1587D6k44P4J77j05k06K27J83j25L6J65k21K47k78M9q4K59J34l94o2M02j32l93
$$ 46 -198 -124 53 -52 -258 -31 152 27 63 228 7 254 -24 25 -59 200 334 -60 -122 280 148 -245
1609b45L21J39l07j15K46L7k39L16J2j01J65p4r7jJ09j3k71L36k17k68K91K6j05
$$ -245 76 215 -92 -207 39 76 -163 153 165 64 229 155 58 57 166 153 -118 218 1 -267 24 50 -55
1632e5k64N10k7l89N1J46L12k94J25l1l4J8R6k42J19K66l84k3K87r6k76J27L00
$$ -55 -319 191 164 -225 -174 -28 284 -10 115 84 50 68 164 -78 41 307 -77 -100 187 91 -185 -58 242
1655B42l99j21L60N3j06k47M46k70j63K64j3r5K26J59m82K6L28j95k56M43l12
$$ 242 -157 -278 82 135 29 -218 228 -42 -205 59 46 -49 177 336 -146 -120 208 13 -243 200 -112
1676a12j72J29M54l60j11L70p9l53J86K50j37m2K36j46k18K53J9j58j16J90l14
$$ -112 -284 -155 299 -61 -172 198 119 -234 -48 202 65 23 259 113 -105 148 167 9 -107 83 -231
1697b31L3L77n9l69J5L61j05k25M38nj38M6O2k33k9N49l32l76K66J5m06K07K02
$$ -231 -198 179 120 -249 -234 127 22 -203 235 230 92 138 200 -33 -62 487 155 -221 45 60 -346 -139 63
1720F3l47K6L31k9k57R5N16n09p6M03n7k78K03J60l02P4J97j59l27L84n3l49J00
$$ 63 -284 -258 73 44 -213 -118 398 -111 -187 216 159 -119 84 244 -58 16 213 54 -273 111 58 -291 -191
1743a91L61k75r0N93k27l63J67K23j25m99O56J0l61K02O4l11J88J98l27q9K34
$$ -191 170 -105 -195 398 171 -192 -25 198 73 -426 230 240 -121 81 145 -166 22 220 -107 -196 38
1764C8K42n53J79L13j99l36M42l1l48K66K49k61p4K59m9m80L81m7k7j19L33k10
$$ 38 280 -273 -94 219 20 -316 126 95 -253 13 262 1 -73 186 137 -343 38 -9 -36 -155 178 -32
1786c2j08L04j39j97M2L82m38o6M21Km14L42K30l92j16L35j17j15L83k01l95J09
$$ -32 -140 164 25 -172 -130 252 -186 -252 169 171 -243 99 329 -63 -179 156 39 -76 307 106 -289 -180
1808a80M27m68j2N58k23m52M16P1m84J09O22l26k79K73J51m76K29N31o54o5M33
$$ -180 247 -221 -233 325 102 -350 66 137 -347 -238 384 58 -221 52 203 -273 -44 487 -167 -232 201
1829B01L9m52J93J57l20n2O16l63l12K64L15m76n2O64l01j78J18L6k65J51J11
$$ 201 240 -212 -19 138 -182 -234 382 19 -293 -29 286 -190 -242 422 121 -57 61 97 -168 -17 94
1850I4j15l17L68mk77K19K50l09k96O55j79m13L70R9l04M2K21mr0K8J25j80J5
$$ 94 -21 -338 30 26 -251 -32 218 -91 -387 268 89 -324 46 145 -159 -117 104 100 10 38 163 -17 -2
1873bJ71l54N2K90j25j96J07K08k61j35L99K9l28K80Q8l61P0K27p2k04K84n2l72
$$ -2 169 -185 -133 157 32 -164 -57 151 -110 -245 154 183 -145 135 223 -138 -68 159 87 -117 167 115 -257
1896b57J17K48j79m8J77j74j47J24K35k65M2K48j5j63J75k5j80K29o8P7k17jJ41
$$ -257 -140 108 -71 -119 58 -116 -263 -139 96 -169 -127 121 106 -57 118 93 -87 142 74 151 -66 -67 74
1919G4l83K84k2%j33K55o8j59J49K76l28q2L30jm35M19J33n10J04K44k17RoJ7
$$ 74 -309 -25 -47 -47 -180 75 7 -152 -3 273 -55 -137 193 192 -243 176 309 -201 -97 147 -70 -61 -67 -50
1943e0k39M85rn04L20K36k76j83L12K74m49r1K29R1k33K79k56M8J10n3j16N8J76
$$ -50 -289 196 187 -317 3 239 -37 -220 92 366 -83 -174 55 146 -87 192 -64 -16 94 41 -75 -17 159
1966A59j56l38M72m1k75k18O72k40l24L45J22k29O9J84j01j21J1N7j94K62M7k57
$$ 159 3 -335 137 96 -179 -397 275 35 -289 56 178 -51 18 202 101 -20 -9 48 -146 116 163 -94
1988i4p9J62O7j92J31M5k25P1J32o7l7K62Q9l42J88j40o5R8J66k34%J48j30Qq7
$$ -94 -173 -11 56 -136 -5 40 -185 -114 18 -49 -86 176 265 -77 111 -29 -94 4 170 -64 -64 84 -46 -38 -125
2013a25L09j56j52J67Q7j68Q9k5%j15J50J01j10O6L2j35n2J81r7k21K33j11j6
$$ -125 184 28 -124 43 130 -38 51 26 26 -89 61 162 52 118 150 15 -37 144 47 -174 59 -52 -68
2036f8R3J74l10rJ32K3j72J01J60j87Q3J71j33o2K6p8o6R9L9R3j62K05n5k16P5
$$ -68 25 199 -111 -120 12 35 -137 -36 124 -63 20 191 58 -4 22 -56 -122 -23 16 109 -53 152 97 -119 -44
2061d4K12l9k06J83pO2K7J08m0k90Mj8j9nJ33j74L6J54k60J43m0K46l81J99k0
$$ -44 168 129 -77 106 99 161 188 296 256 -34 -30 -48 -67 -72 61 -113 -77 77 -183 -40 -80 166 -215 -16 -36
2086c6M8j81K48j1j74K04J5M1k13Q0n1jn3N9j76K32m4m1j63J61K09k76K8N0K26
$$ -36 12 -169 79 68 -106 98 113 154 -59 21 -30 -31 -84 -25 -201 31 -13 -54 -217 -56 153 -123 -95 -45 181
2111A81l20J43J35Q9j93n4m9qm9J23j03O5N3r0JK55j75n1m6J77j20l5J90o5j51
$$ 181 -139 4 139 228 35 -19 -68 -76 -125 -2 -105 -40 13 -77 -76 179 4 -47 -93 84 -36 -71 119 54 -97
2136i7J68Q8j27m8o2K20k20M3n3R5qo3J23k24q3K68j12K73k8O6k73P2L1M2r1J87
$$ -97 71 159 32 -16 -78 142 -78 -35 -88 7 -1 -64 59 -165 -248 20 -92 181 153 219 -54 18 49 91 0 187
2162A87o4N1k32P2j49K4l7m7J48j53J63jL5Rn6M6J71N1k59K3r4L66l41K4N6k0
$$ 187 123 174 -58 14 -135 -111 -148 -195 -47 -200 -37 -38 -3 6 -50 -4 167 218 -41 -18 -112 254 -87 -63 -7 -27
2188b7r6K36q0j26K57k37l2o1K30j65P6Q2j13o7K19j7j29M1L7Mr3rL20k48k20
$$ -27 -123 113 33 -93 164 -73 -105 -166 64 -101 -25 57 -56 -123 96 79 -50 -9 28 32 -61 -70 250 2 -218
2213b18K90P1l01j16J82J3M2J7J2j23K83j52J67j15j24J15p7K38j40j53k0J89
$$ -218 72 143 -158 -274 -92 -79 -37 -20 -8 -131 152 0 167 52 -72 43 -34 204 64 -89 -109 80
2235H0q4j04J25R0k47J96Kl4M0o7L3L3j19J17j77Q0K82k57J01Q8ql06J57J51m18
$$ 80 -4 -108 17 107 -140 56 58 24 64 -3 30 63 -56 61 -116 -36 246 -11 90 178 170 -136 21 172 -246
2260b46J10K03j41L2m9J31k74L89j10J5j28O5j1j11Q9K02j59p7P3J54j68m7M5
$$ -246 -136 67 -74 -42 -91 40 -234 155 45 60 -68 -3 -14 -125 -36 166 7 -70 3 157 -11 -58 -13
2283a3k13K17Q8j76J01k0Q4j21n6L02q2k31J46l4n5P8J48k76q7J37Mj42K02N0
$$ -13 -226 -9 79 -97 4 -16 68 -53 -109 193 111 -120 26 -8 -63 15 163 -113 -200 -63 -59 -201 1 51
2307E1r2K4K40j27m5J70k04J5K1Qn6m5J46j43O9N7j64o6q5K85j29O2J5%p1j45
$$ 51 -41 -17 223 96 51 221 17 32 53 61 5 -40 106 -37 32 89 -75 -141 -226 59 -70 -8 7 7 -64 -209
2333b09L32o1j20J61n3k39K71J42r5j25k1rj9K56k12j93J64K35j84j07M9J40q2
$$ -209 123 62 -58 103 50 -189 82 224 129 4 -17 -26 -45 211 -1 -194 -30 205 21 -86 -37 103 21
2356B1J55k89M7J05M6J54k64P9K07k83J6J25k46J05m7J37m09K12J28J15j21Q8
$$ 21 176 -113 -66 39 85 239 -25 54 261 -22 -6 119 -127 -22 -69 68 -341 -129 -1 114 -7 81
2378H1Jj29M6P8j69J49rP2l52J49K20k11O4J09j29k41L05J12j15r9J89j79P2N6
$$ 81 82 -47 -1 77 -92 57 48 120 -232 -83 137 -74 -10 99 -30 -271 34 146 31 -68 121 -58 14 70
2402G0N4j56Q2J63l48P4J58p1n9J2K44k47q2J48o4j91K76j38np1J33K3jO8k46
$$ 70 124 -32 50 213 -135 -61 97 26 -33 -21 223 -24 -106 42 -22 -213 63 -75 -80 -151 -18 5 4 72 -174
2427a74O8J76l2k11O4K55j95j90K83J10j06l5J76k63j04J56R2k14L31j82J0o8
$$ -174 -106 70 38 -173 -109 146 -49 -239 44 154 48 13 189 -74 -178 -22 70 -144 187 5 15 -53
2449e3J24p7o6K32O6l54L09o2j08j58P7k2n8R4J01n7n4l2K46k07J5J3Qn2J96L8
$$ -53 71 -6 -72 160 226 -128 181 119 11 -147 -70 -92 -150 -56 45 -12 -66 -98 148 -59 -44 -31 -23 -75 121 159
2475A59j76R6j26J41j89J78k43J20J79M3k52Q1L1j05k8K27j61j26J84m0K5j5R4
$$ 159 -17 79 -47 94 -95 83 -160 -40 139 182 -70 11 42 -63 -91 136 -25 -151 33 -7 18 3 97
2498I7k26J55J68k23J29j22J03M8r2QR6j64L4M2k8j04R3RKk8J64j77l4J11j86
$$ 97 -129 26 194 -29 100 -22 81 129 37 45 141 -23 11 53 25 -79 14 23 25 -3 161 -16 -50 61 -125
2523a25R9J64j06j18J70on8k36J18N6p7k8K6P6n6J29N2k07L17q4j38J11o1j15
$$ -125 -26 138 32 -86 84 78 20 -216 -98 -42 -119 -147 -121 -45 -101 28 80 -127 190 106 -32 79 18 -97
2547i7J72L8k9m3K4J08j98N8K13j45k48K71m8j64K15N9k6l04L67j61m5j65L99
$$ -97 75 113 84 41 65 173 -25 33 246 101 -147 124 76 -88 127 186 160 -144 223 62 17 -148 251
2570B51k46j79K49k0l9m0j8q7K18M8j50k6L2L5P9j85L9LL2K9j46j1J42J66k36
$$ 251 5 -174 75 55 16 -24 -42 -129 89 137 -13 -39 -7 28 107 -78 -39 -36 -4 25 -121 -132 10 176 -60
2595f0o4Q7r3J10r8J06J9m6R1L5j18j35J54jJ16rL3k69K49o2j21k8L27k98N7j87
$$ -60 -124 -37 -130 -20 -118 -12 7 -39 52 87 -31 -166 -12 -13 103 94 127 -142 107 45 -76 -104 223 -75 -18 -205
2621b05J69M8LJ6p2K1q3Q0n5K9J63j98J62j4l9n1J0K45l04J20j80M1mJ50K4j70
$$ -205 -36 12 15 31 -41 -20 -103 -23 -78 -49 114 -84 78 64 25 -26 -16 229 -75 45 -135 -94 -98 52 76 -94
2647i4J71j13MN5J43knL2j44k07L05K0j05k37K84jm3j70P0n6J14L7j16O3J26j85
$$ -94 77 -36 -32 23 166 164 159 191 47 -160 145 165 60 -177 107 106 63 -107 -37 -93 21 58 -58 5 131 -54
2673e4j30K32k04J49R5r8q3P7jj0L2j10N8J15Qm5nJ57j63M8N9NQj20RQ1j23j3
$$ -54 -184 48 -156 -7 88 -10 -93 -16 -17 -27 5 -105 -47 68 76 31 26 183 20 68 127 132 140 20 29 110 -13 -26
2701b6p9j2K21k20J42J6J3o6J06r3j17K8J08j85Q8K3m5K85M3k83J27j55J19j52
$$ -26 -105 -117 104 -116 26 42 55 -11 95 2 -115 -87 21 -164 -76 -53 -98 187 230 -53 74 -81 38 -114
2725a14K8P6q2K82l34J83M7p7K24r9q2j13N9R8k5M3o1Nj58N5K0J89mk66Q1qK8
$$ -114 -86 -10 -92 190 -144 39 86 9 233 134 52 -61 -2 96 71 114 53 58 -100 -45 -25 164 160 -106 -25 -33 -5
2752ej89J46o6J92q1J3p4J8J26n1n4MK9p2O0l1J67m4rJ7j23l7K4K16k01j43K3
$$ -5 -194 -48 -114 78 -3 10 -64 -46 80 29 -25 -21 8 -64 -4 -35 132 88 79 96 -27 -64 -40 176 -25 -168 -145
2779a45M1K23k82J00M4J96l1Mj64Pj38K54q7j36P7M9j35J34k17J55j10J83L7j77
$$ -145 -104 119 -163 -63 -19 177 146 150 -14 -7 -145 109 22 -114 -37 12 -123 11 -206 -51 -161 22 59 -118
2803a18R2q5K56r2j5jl3j11J38q9R4R3j84K7j0M4L7K2k9j32J1J39j57J63Q3r6
$$ -118 -26 -111 145 53 38 37 4 -107 31 -58 36 129 -55 -28 -38 6 43 65 36 -96 -85 54 -103 60 143 47
2829D7j8J24j25j19L29j55j57N9J58j4k1k51J50r1K11m6k79J39P2q2k7J32K8n7
$$ 47 29 153 28 -91 238 83 -74 -15 143 129 108 -143 7 -84 127 81 -198 -59 13 -69 -96 36 64 7
2853GJ8j6o3K08r0p0l6M3J%j41L1J11k6p4K9Q5k2j2k11J26J31K7o1k06K93j13
$$ 7 25 9 -54 154 64 -6 -42 1 2 2 -139 -108 3 -23 -97 -68 17 -5 -17 -228 -102 29 56 -5 -211 82 -31
2880c1n9K11j30J1j76K14J3o8R5j7l7k7J34q0n3Lo8K6O1j8J1r9J78j49K06m0l7
$$ -31 -90 121 -9 2 -174 40 53 -15 80 63 26 -1 133 53 0 3 -65 -39 22 4 15 -84 94 -55 151 111 74
2907G4m4o1k3j0q3J22L8k07J99j78R0K9Q3m4j71K48J33k80J37R9r7J9m5j92L29
$$ 74 30 -31 -54 -64 -147 -25 13 -194 5 -173 -83 -54 29 -15 -186 62 195 -85 52 151 54 73 28 -164 165
2932A65j93R7n2l1M3M2K3k44J65n1n1J92o1j73p6L46j26M4Lj19O6j0J1Qj22J74
$$ 165 -28 69 17 -14 29 71 94 -150 15 -36 -87 105 44 -129 -205 141 15 59 62 -57 9 -1 10 18 -104 70
2958G0N1j55K82j89p9p4J72m8Q7n1L7j83L0K57j37k42Q5J07l37M24r2k10J62J26
$$ 70 121 -34 248 59 -20 -94 78 30 117 66 103 -80 -50 207 70 -172 -87 20 -317 107 15 -195 -33 93
2982I3k3k06K47l9j15R1OL3J0P8k81K3J22O8j35J9n1j4L5NJ56k26J57o9l35L55
$$ 93 70 -136 111 72 -43 48 54 87 97 175 -106 -83 39 107 -28 -9 -60 -74 -39 -34 122 -104 53 -16 -351 4
3008DNj5O1j49J42L1lk2p8KJ90p7J56m34K72k31R6N9Kj32M5K76j83l7K48k52j39
$$ 4 9 -6 55 -94 48 79 76 54 -24 -22 168 91 247 -187 85 -146 -50 9 11 -121 -76 200 17 -20 228 -24 -163
3035a63K32J12j46K3l4n2j06J78j25n6J07P5j40J6K44j40J08l2M4r6k91L03L7
$$ -163 69 181 35 58 24 -28 -134 44 -81 -137 -30 45 -95 -79 165 25 133 101 145 49 -242 61 98
3058I8k12K1L00k35N3K7j10N2j60K57Q5n7M4j38j08N9m4J93j51J80j13J14m6j96
$$ 98 -114 -93 207 -28 25 52 -58 -6 -166 91 176 119 163 25 -83 -24 -68 125 -26 154 41 155 109 -87
3082h7J53N1L0j70r9Q7M4r4J24r1j51K96J2j27o5j3J33l6P4M6On3P2J6q0o5J02
$$ -87 66 117 147 -23 -122 -35 9 -85 39 -52 -203 93 105 -22 -87 -100 33 -3 71 117 123 70 142 158 78 13 115
3109A15j48j10J22K7k16P7L5J30j18J42j69K61j57O2o6J16m2P4N6j32J06p0m7
$$ 115 -33 -143 -21 6 -210 -133 -98 32 -86 56 -113 148 -9 53 -13 103 61 135 191 59 165 95 48
3132D8r1r0R3K28j23k29J15q1J15Q7j74J93k86J63P8o6P6NQ0n8Mj32J08j1K2j0
$$ 48 -43 -133 -40 188 65 -164 -49 -130 -15 72 -102 91 -195 -32 46 -20 56 61 141 83 87 -45 63 52 74 64
3158F4r7J53k39O1k33K64M6Q3J23k36m1J76r2rj60K16r9n9K2N2J03J2j16M0k09
$$ 64 -33 120 -119 -58 -291 -27 19 102 225 -11 -52 124 32 23 -137 79 -20 -79 -57 -5 98 110 -6 34 -175
3183a75K42r4LJ9Q6qJ47j71O7j60J78j97J03r0J31J64j09r4j83J69o0L9n8J91
$$ -175 67 -27 -24 -5 81 73 220 49 116 -44 134 -63 40 -50 81 245 136 42 -141 28 -32 7 -51 140
3207A40q7m0M5j69P6P7oJ51j76J14n3k41J93j03J45m2j59K66k31R3J14j87n6J22
$$ 140 53 13 58 -111 -35 42 36 187 11 125 72 -169 24 -79 66 24 -135 131 -100 -7 107 -80 -136 -14
3231a4K02k76j0J62L7lMj42j08J30N4M4j20q4J7j14K85oj41j34J61j9K7J65q3
$$ -14 188 -88 -98 64 101 98 102 -40 -148 -18 36 80 -40 -124 -107 -221 64 58 -83 -217 -56 -75 -48 117 34
3256C4k9j20Q6j8J23n4N6j04J57j30k4O1n8o3P0o8J44p4J93m5n2q8J0k1Om3J79
$$ 34 5 -115 -29 -47 76 22 78 -26 131 1 -23 38 -20 -83 -13 -81 63 -11 182 137 85 -3 7 -14 -8 -51 128
3283A28k6o4q1K37j82q5K42k60J35K7j05k01K18j08Q6m0J13N7q7o0J46j48l3J9
$$ 128 102 38 -43 194 12 -73 169 -91 44 71 -34 -235 -17 -125 -39 -79 34 91 4 -56 90 -58 -91 -72
3307g2J72k2j17J40n5J3J49l41K13j17L7J3m7N0J69j80Np0j53J37R4OP6k20J41
$$ -72 100 78 -39 101 46 59 208 -133 80 -37 0 13 -34 16 185 5 10 -60 -213 -76 18 24 100 -120 21
3332B1J81k09M4J7j36l3J81n4p8J6J54j26l4O5j07Q4o1K7MM1P7k35J32P1j62J59
$$ 21 202 -7 37 54 -82 -115 66 12 -66 -50 104 -22 -56 9 -98 -14 -75 -48 -44 -3 74 -161 -29 42 -120 39
3358C9j05Q7j7m7O3M8k09J88l2Q2k13J15jj10J66j7m2p8j2N8o8J02R5o6p4M7j83
$$ 39 -66 21 4 -43 20 68 -141 47 15 97 -116 -1 -2 -112 54 37 -5 -83 -95 -37 -105 -3 92 26 -48 -1 -184
3385a84K20K31k64p2k3J66rM2j74J03L1p8R6j68k3r1K18R8J9q3j28L2j52K53j0
$$ -184 36 267 3 -69 -92 74 65 107 -67 36 67 -11 85 -83 -106 -197 21 119 138 55 -73 -41 -193 60 50
3410E0k9k0p3J04J2p3K32k58K96k93R3N2k67J55N3k9k94R2K15q5q2L61l58K03
$$ 50 21 1 -72 32 44 -29 203 -55 241 -52 41 93 -174 -19 34 5 -289 -197 18 -67 -149 212 -146 57
3434E7r9j21L54j87M2j07M6J46rk18R5J22k30J7R6m2K7Q6j18j12O3J14Jj02lO2
$$ 57 -42 -163 191 4 46 -61 -15 131 122 -96 -1 121 -109 -92 4 -38 -11 75 -43 -155 -92 22 23 -79 -82 -20
3460b0L6Jj8J1j37J47k3m3l6R0j6p5K63k07J11o4J46k71R7n0J5L3J9N9j32J09
$$ -20 16 17 -1 10 -127 20 -3 -46 -82 8 -8 -83 180 -27 84 20 166 -105 -8 -58 -43 -10 9 68 -64 45
3486D5j1j44Q8Ok0N2j56J58k93K22L0j42J05j04K24N7r2n2J4n1Q6j7RQ2k32l2
$$ 45 34 -110 -22 -16 -36 16 -140 18 -275 -53 -23 -165 -60 -164 60 117 25 -27 -13 -64 22 5 14 96 -136 -168
3512a68Q9J28o1j69J16M2n7k7J52j39K59k26j6J02l2p6M9l9K53j45J7P2j62n2
$$ -168 -79 49 -12 -181 -65 -23 -80 -107 45 -94 165 -61 -77 25 -7 -83 -34 -73 180 35 52 124 -38 -90
3536i0M8J00j53M0K1K20m25M9J76j90K60j7o1J15k02J53k6j16J25n0j47K40j37
$$ -90 -42 58 -95 -55 -34 186 -239 -190 -14 -204 56 39 -22 93 -109 44 18 -98 27 -23 -170 70 -67
3559f7k4J74l3O7j50J88k50Jj45K36O7J15j23j21O0J28K7j39J0Q7L3k66Q7l1p4
$$ -67 -91 83 50 117 -33 155 -95 -94 -239 -3 64 179 56 -65 -5 123 150 11 21 108 141 -125 -38 -69 -143
3584a43K25O6k12j04R8k0J44q6k1o8K17l1n1j03R6j18L7O0r9J16j5K06j06j69
$$ -143 82 148 -64 -168 -70 -90 54 -32 -53 -121 96 65 14 -89 7 -111 -74 -14 -113 3 -12 194 88 -81
3608h1nO8J0j20K40o4j56M8K24j86p2J65j48Q2K9Q3k50Q1J34o3q2O5Oj89K44j28
$$ -81 -86 -18 -8 -128 112 48 -108 -60 164 -22 -94 71 -77 5 34 117 -133 -52 82 19 -63 2 8 -181 63 -65
3634f5l5MR1k0k5J95k5j08r1J24J3K4l2q9Q4RM4j05j59J53J81k28N3Q0j50L7j
$$ -65 -100 -96 -5 -25 -50 145 120 12 -79 45 58 82 50 -39 45 54 98 -7 -166 -13 168 -60 -7 73 -77 -40 -41
3661d1O7j10K3M1O7oK0j59J64j86J57o8J50j38Jl5J2L2J8n4K15k93K15M3j46L8
$$ -41 26 -84 -61 -20 47 41 61 -98 66 -120 37 -31 119 -19 -18 -53 -41 -9 9 -45 170 -123 92 135 -11 27
3687B7n9J78j91k3K47l24Q9j8L9j51J94J9m7JLq3J45M6q7k8Pl0R0j48J29o8l0
$$ 27 -32 146 -45 -68 179 -145 -56 -74 -35 -186 8 27 -20 -19 -16 -99 46 92 5 -23 -16 -46 44 -104 25 -43 -73
3714g3o5M3O6j16rK51K3j78J17o1n8Q9o2o0J46O4k02J46q8M9j60J18K1J22r7O4
$$ -73 -138 -95 -29 -145 -154 97 120 -58 59 -2 -60 29 -33 -93 53 117 -85 61 -27 22 -138 -20 1 123 26 90
3740I0q1L7r8mJ10j15J28l9j44K58j09J39k70K02p2o4L8M2j61RP6J22o4j35J94
$$ 90 9 46 -52 -56 54 -61 67 28 -116 142 33 172 -98 104 32 -32 6 48 -113 -104 -28 94 30 -105 89
3765H9j08N8O6k47K11p1J56q3J52k92R7Q2q3j3k4K0m5J3K14j56J2l8Nj37O8r4
$$ 89 -19 39 105 -142 69 -2 154 71 223 -69 28 110 27 14 -10 10 -35 -22 192 36 48 10 15 -122 -54 -148
3791a48J19J37P1r3K9L0l37K00q4J99k00J78o3o3O4k1r5l4J70k64J97l7J08Q1
$$ -148 -29 108 179 86 115 145 -192 8 -76 123 -77 101 38 -25 39 18 -77 -111 59 -205 -8 -45 63 144
3815A44j91J43p3j54K66j56p6O2l9M4N9J03j15j01K32o5j18J37j22J5M8kkp2j01
$$ 144 -47 96 23 -131 135 -21 -97 -35 -74 -30 29 132 17 -84 148 83 -35 102 -20 -5 43 41 39 -33 -134
3840a34K62j96J7J98j75J22jj31J69p4j18Q0J26j27p8j05J64P5j91K19k53J00
$$ -134 128 -68 -51 147 -28 94 93 -38 131 57 -61 19 145 18 -60 -165 -1 74 -117 102 -151 -51
3862e1rl9J63j52m0J11j80J80j22J54j82j05J82R9l6R9j71J12J05k01J32q5l3
$$ -51 -60 -99 64 -88 -128 -17 -197 -17 -139 15 -167 -272 -90 9 -27 72 -99 13 118 -83 49 -36 -69
3885f9J45q8MOM2M5q7q5r6R7Q3L2l5q3n1K87k75J26K9j0j07J09j07OJ79j35j6
$$ -69 76 -12 -8 -2 40 85 -2 -87 -183 -86 -3 29 -6 -89 -140 147 -128 -2 27 17 -90 19 -88 -82 97 -38 -54
3912e4PK54l10J30nj57L6r2K65q8k1J45j77M7J28j04M5j97J70m9J74n8k01K30
$$ -54 -47 207 -103 27 22 -135 -99 -191 74 -14 -35 110 -67 -20 108 4 49 -148 22 -27 147 89 -112 118
3936A18j56L7J89q5k01J59j5Qq6MP4N4j34K7J07Lj14l7K1J03p4Q8j13mL1o1J07
$$ 118 -38 -1 188 103 -98 61 46 54 -32 -28 46 100 -34 -7 100 103 -11 -48 -27 76 2 90 -23 -27 4 -57 50
3963E0j00J48p7Kp9L1m9J23n7j1O2k00n0K39P4m3Q0j49n4O1J47j88j2j00J88j79
$$ 50 -50 98 21 23 -56 -25 -74 49 -8 -19 43 -157 -207 32 106 63 143 -6 -60 1 148 -40 -52 -152 36 -143
3989a43N6R7k23K76j40j9Rr7J64j9N4p2J07m9o7k2k3J09j25P9J82j94J28j8j12
$$ -143 -87 10 -213 63 -77 -96 -87 -184 -20 -39 15 -57 50 1 -66 -88 -111 -2 -127 -48 134 -60 68 50 -62
4014f2M5j86J33K1J19L8r5K30k45J14k20R8J03j92K41j70k2Q3M4k87K65p5l2J22
$$ -62 -17 -203 -70 -49 70 108 13 243 -2 112 -108 -10 93 -99 142 -28 -50 33 77 -210 55 -20 -52 70
4038G0j65J85m3q2n5J74j22m3L4J7P5R5j80J14k05J02j26J27m8J8oqJ44o2j6j4
$$ 70 -95 90 47 -35 -90 84 -38 -81 -47 -30 45 140 -40 74 -131 -29 -155 -28 -76 -58 -64 -72 72 10 -6 -20
4064b0m7m6RJ39j9LL0o1J82r8q0j12J22j37R2L1n0J21p9O0L5N8j24j17M7K71j79
$$ -20 -67 -113 -104 35 16 19 49 -12 170 72 -8 -120 2 -135 -43 -12 -62 59 -20 40 75 133 9 -108 -61 210 31
4091C1j22K28k36M9P3j0J13j79j87L13k07JL14j86pJ60j78O0J3Q0q3l7J31j08
$$ 31 -91 137 -99 -50 23 13 126 -53 -240 73 -134 -133 181 -5 -12 148 -30 30 43 123 40 3 134 26
4115B6o3j4R1n4r1L20k09l1L4n0J10l3n8O3K00j95j10J38J3j28k8J9J5j39J85
$$ 26 -37 -51 40 -14 -105 215 6 -25 9 -41 69 36 -22 41 241 46 -64 74 87 -41 -69 -50 -35 -174 11
4140A1P2j44J5L7N7o4M1j06K1J4J75L9k52Q8j65J84k2m6J6l9L1l7r7R8J00Q4j21
$$ 11 83 -61 -46 -9 48 -16 25 -81 -60 -46 129 168 -84 4 -161 23 1 -45 -29 -68 -37 -74 -171 -73 27 111 -10
4167a0m3J94j39o8m2K19k91J58l2j21J73l2OL5J83J7j65O6k08J82j11K9J2p2K1
$$ -10 -53 141 2 -66 -108 111 -180 -22 -54 -175 -2 -34 -28 7 190 207 42 108 -100 82 -29 0 12 -60 -39
4192c9N0n9J93k61R4o8J88j34n2J50%l3j20k5K16p5o1R1j22O7K8j65K00j40N6
$$ -39 11 -48 145 -116 -22 -90 98 -36 -88 62 62 29 -91 -116 100 25 -36 55 -67 0 28 -137 63 -77 -21
4217b1rj6L4n0O7Q4R9k06O2J00k25J29L5k35J89m3l5P8j31J49K4m9K0j40K54k47
$$ -21 -30 -46 -12 -62 5 89 188 -18 44 144 -81 48 83 -152 37 -6 -41 37 -94 55 79 30 50 -90 164 -83
4243h3O9K24k78J34k4k5p6J06o1J41j44J2K6o0k4Q3m1L6p7k6J38p9P9j41R3j04
$$ -83 -14 210 -68 66 42 17 -59 47 -14 127 -17 -5 21 -39 -63 20 -21 15 -62 -88 50 -29 50 -91 2 -102
4269a02n4J29N7j1p9R5j89Q9O9p6J5K31k65K75j95K8K8Oj22K69k50J84j15q4J72
$$ -102 -156 -27 30 19 -60 35 -154 -65 4 -72 -57 174 -91 184 -11 17 45 51 -71 198 -52 132 17 -67 105
4294A05l3Kj76J59R5k97J89J00k80K57k52R6R2l7J2O7k11N6K00k15o2Q2K6R4p
$$ 105 72 74 -102 57 152 -145 44 144 -136 121 -131 -35 57 20 32 99 -112 -56 144 -71 -133 -51 -25 69 62
4319F2%r5L3J24k5k33J10K1K1k37K85p2L6N4l5J2p7m6R7k7J61j6j82L6m0jO2M
$$ 62 62 -33 0 124 99 -134 -24 -3 18 -219 66 -6 30 84 49 61 -16 -62 35 8 169 153 -29 7 -33 -34 28 32
4347C2j20J7mj8J06j8Qm4j7K1K3J34n7j81K01j70J5Q6j38K87k96J48L1L6j05J2
$$ 32 -88 -71 -75 -93 13 -5 3 -41 -58 -37 -14 120 63 -118 83 -87 -72 14 -124 163 -133 15 46 82 -23 -11
4373a1l9pR4j88R0K0J25K05j74k50J24O9o6q3J22j8Q5k47J81r1j18J38KJ12q3
$$ -11 -50 -57 37 -151 -61 -41 84 289 115 -135 -11 58 -8 -91 31 13 98 -149 32 -59 -177 -39 -37 75 -8
4398hQN3o0L6l1k2k0J08J74k15q1r4N3J75j14nJ69j90J2N6j02J90j53K4m7k8k2
$$ -8 0 53 -7 29 -2 -24 -44 64 238 23 -58 -152 -99 76 -38 -43 126 -64 -52 4 -98 92 -61 -37 -84 -112 -134
4425a34J03l5J73k06k4J49o1M0P7m8pj7K7Q8j02j36K07m6m1k1q7J25J6j18K8q
$$ -134 -31 -66 107 -99 -123 26 -35 5 82 34 27 10 37 125 23 -113 94 48 7 -14 -101 24 40 -78 -50 -58
4451e8L3M7M4J05j47n7j4J21k8k7R7k58J80J2j23J72k59J10K06o3N9j61J14r7
$$ -58 -25 22 66 171 24 -33 -47 74 46 19 116 -142 38 50 -73 99 -160 -50 156 93 152 -9 105 8
4475HO2m7n7M8K2RMl17K85Mm0j26J21M8p8K9J06L1k18j32R4K79k35R3r9Q9O5j2
$$ 8 70 23 -34 14 36 45 49 -268 17 21 -19 -145 -24 24 -54 -25 81 112 -106 -238 -144 135 -100 -7 -106 -17 48 36
4503C6O7j82M9P7R9j73N0M6j18P5Q3k4j3J1j30N3j9N8J60j17j29Q6j23P2J25j43
$$ 36 103 -79 -30 47 146 -27 23 69 -49 26 109 85 72 83 -47 6 -13 45 205 88 -41 45 -78 -6 119 -24
4529b4l1J21j9j32K46j55N4l0J1pK0Q0j86l4MJ03J20j01L0j07k1J2j02j10K16
$$ -24 -55 66 47 -85 161 6 60 30 41 34 54 134 -52 -86 -82 21 141 40 70 -37 -58 -46 -148 -258 -42
4554d2j13K38j29K17j63r1J73k7l8j11J37j8Q9l2j36j42J25P4k7J33o8m1Q7j64
$$ -42 -155 83 -46 171 8 -83 90 63 25 -86 51 33 122 90 -46 -188 -63 11 -16 117 49 8 95 -69
4578f9O2MLj73J37j6PO8K61l70NR2J17j11j11Q8On9J40j25o6P2Nk3M2J03r3l8
$$ -69 -7 -3 0 -173 -36 -52 -45 23 284 -86 -81 11 128 17 -94 -6 0 -59 81 -44 -110 -38 -33 -56 -14 89 -4 -42
4606d2Q9NJ5j30Q0M4q9R2n2q0o3J52J45n8j48k2J01ok2j32J18N4j16K14r9M8o0
$$ -42 47 52 67 -63 17 61 -28 64 12 -68 -131 21 166 108 -40 -62 39 33 11 -121 -3 51 -65 149 50 98 38
4633C8P1j74J24j37J05j58O7J08p0Op2Q8J02o1M0n9p6K74l64qJ44q0K14m7k2N3
$$ 38 109 -65 59 -78 27 -131 -64 44 -26 -20 -92 -4 98 37 77 18 -58 216 -148 -156 -12 -92 122 75 53 106
4659A06r4k53J8K56j21k2K60o4p2Q6k8j60K09j25k6J00j50J46j57n8N7K47j80
$$ 106 12 -241 -223 33 -88 -110 150 86 14 100 72 -88 121 -4 -30 70 -80 66 -91 -149 -92 155 -25
4682b5K2o5J00J49j98j14L9M7r4L80k11J7j25J41o8P5p9q4L28l23N3%N2K1j40
$$ -25 -3 -68 32 181 -17 -131 -92 -45 -139 241 30 47 -78 63 -5 70 -9 -93 235 -88 -35 -35 17 38 -102
4707a02J45r4J18J4l45J48O7Q0p8J06K6N9k04J60k01J09p7J26K2j01o5Q6m6O5
$$ -102 43 -51 67 81 -264 -116 -49 31 -47 59 85 144 -60 100 -101 8 -69 57 79 -22 -87 -1 -47 18
4731A8o8p0J61k8L9o9o4Q5j5jk23K69n0k8J84k9j50o1L2K19k01K10j42j41J30
$$ 18 -50 -120 41 13 52 -17 -81 4 -11 -12 -235 34 -16 -44 140 111 -39 -100 -68 151 -50 160 18 -123 7
4756Gj46J66KJ26p6r7J15k64K91j27J17j79J09L8k45K23j34J60j22J75k00OK03
$$ 7 -139 27 29 155 79 -18 97 -167 124 -3 114 -65 44 82 -163 60 -74 86 -36 139 -61 -55 148
4779A48k53l9J64j8L6q0L7j7P4Q7o5l0k01K01Qj96K18j3Q3o0k00K47k17R0J72
$$ 148 -105 -144 20 2 38 -42 -5 -22 52 139 74 44 -157 44 52 -144 74 61 144 84 -116 131 -86 4 176
4804A76l7k72K92j87m8J23O0j18J16j95J33n9O3j2O8k11J07J45j75r8K5J00j02
$$ 176 139 -133 159 -28 -76 47 107 -11 105 -90 43 -16 47 35 103 -108 -1 144 -31 -129 -104 -4 -106
4827a06J92q3j10J55j52q2K09rMM7O8n0j06J08Nj81K03j51J81l37J57K01l31J82
$$ -106 86 3 -107 48 -104 -186 23 14 18 65 133 83 -23 85 90 -91 112 -39 142 -195 -38 163 -168 14
4851A4j02k2J5N9J44k78K52l2pJ6q5k0O3r8J08j83J7P8M5J3j02J56m9MJ58p5J
$$ 14 -88 -110 -95 -36 108 -170 82 50 43 59 -26 -46 17 -81 27 -156 -139 -61 -16 -3 -105 51 2 6 164 89 90
4878I0k04K18o9p9J43j4r4Q8o5p4J17n4P4j59K79m10L88j64n0Mm1J17k96K49m
$$ 90 -114 104 35 -44 99 85 -9 79 14 -60 57 3 77 -82 197 -213 175 11 -39 -35 -76 41 -255 -6 -10
4903a0MP4m7O8k46P4J58j4j49N0k6N5q1O5J12k0N7k52J41J10j36o9M3K5j03n3
$$ -10 -6 68 21 89 -157 -83 75 61 -88 -38 -64 -9 -90 -25 87 67 124 -128 13 123 -13 -82 -39 -14 -117 -170
4929a70K17K1k70K12K6j2n8J68m6j92J46j0o6M7p9j09K39J38j45O3j41N6m4n5
$$ -170 47 68 -202 10 36 24 -34 134 88 -104 42 32 -34 13 -66 -175 64 202 57 120 -21 35 -9 -64
4953f4J12l9j60K71j31J6j19K23P9j07j95J69m4Q2Nj39ll4P1PJ0J09j04j47P4
$$ -64 48 9 -151 120 -11 5 -114 109 188 81 -114 55 11 93 98 -41 -44 -78 -7 0 10 119 15 -132 -58
4978e8mR1l0o8J81O1j64J47j85J09J5j08nL34k33Mk09J47l4Q6kj10K0L3L9p4J43
$$ -58 -62 29 -1 -69 112 173 9 156 -29 80 95 -13 -18 316 83 87 -122 25 -9 77 75 -35 -15 18 57 -17 126
5005A26o5O5j09Q1p0J40k41P6J63k83j11J18J89J04k07j08J60j57j9MJ27N1r3
$$ 126 61 126 17 98 28 168 -73 3 166 -117 -228 -110 79 183 -24 -132 28 -129 -148 -144 -17 34 -59
5028e9l4J85j19j35J78J27j91m7P4j34K58o6o3j4K5K32k20k9Q1L7n1j31J24n2
$$ -59 -93 92 -27 -162 16 143 -48 -95 -21 -155 103 37 -26 -40 -15 217 -3 -32 49 86 35 -96 28 -24
5052b4K24L4k28R8l15L70q6P5j22j38J94q4k28L15p7n0Q1L8%Kk50P0K23j86p8
$$ -24 200 234 6 104 -211 159 73 148 26 -112 82 -2 -230 85 8 -42 39 77 77 79 -171 -101 122 -64 -142
5077a42N5O1Q0lJ34k29J27O1o3n9N1J21l13Q0J81k39O5L5m4oK7L4K9npj12J43
$$ -142 -87 -26 54 51 185 -44 83 144 81 22 73 194 -119 -39 142 -97 -32 3 -41 -47 -20 14 43 38 31 -81 62
5104F2M1Lj24j48M2R7k9N1r1J08J17k62J07q0K78q2L7q2o0L2M9PM3k43M3Q4J96
$$ 62 103 106 -18 -166 -124 -27 -56 -5 -96 12 129 -133 -26 -106 172 90 127 45 -15 17 66 73 116 -127 -84 0 196
5131A96j23j37N0N8N9om0q2J2M4J08r1j59pJ09j4J04L1q6P0j24kR9j80Q8m9j40
$$ 196 73 -64 -14 44 103 97 57 -25 -13 31 139 48 -111 -118 -9 -23 81 112 26 96 -28 -30 69 -111 -23 -72 -212
5158b12K17K3O7r3Ll8j3R7Pn4Q6r0kJ06Q9j44o8rJ11m3kN9j57J34j23J55J4j53
$$ -212 5 28 95 2 5 -33 -46 51 58 4 90 0 -2 104 193 49 -19 -28 83 40 38 97 -60 74 -49 106 120 -33
5186c3j21J62R7M0p6m4n2P2n5j42N8J36L2l6Lj2Qj08J04n3J11l7q8J00j02J85
$$ -33 -154 8 105 145 69 25 -27 45 -10 -152 -94 42 74 38 41 29 37 -71 33 -20 91 54 -34 66 -36 149
5212A49j16P7k25K84k26Q9n6J25j95M1M0p0j5m5K13o6J05O4k49M7O9L5pk4J07
$$ 149 33 110 -115 169 -57 32 -24 101 -94 -53 -13 -83 -98 -143 70 4 109 173 -76 -29 40 75 68 44 151
5237A51j37l3m1m0J9P5J87p0k4q5j96J45J3n3R6Q9n3J7j65J11k3O9o6p1N9L1L7
$$ 151 14 -19 -60 -100 -81 -6 181 111 87 2 -194 -49 -36 -89 7 96 43 60 -105 6 -17 52 -14 -85 -26 5 42
5264D2k0j27J32j59l6J24Q4j47L20k34m2O4M1J3j31J19J22j41L7j03n5K33j39
$$ 42 22 -105 27 -132 -168 -44 40 -107 213 -21 -63 1 42 55 -76 43 165 24 61 -42 -97 136 -3
5287cPN4m0k2K36k95J45j6j22J28r8L9j04R3J57l21J66j85L24k42J83J12r4j26
$$ -3 4 58 18 -4 232 -63 82 66 -56 72 -26 13 -91 2 159 -162 4 -181 143 -99 84 196 102 -24
5311b4N5Q5j74J82n3q8KJ42j46N0Q8l44K28JR2l24J67o5K04j29l4J16L9l9R5j3
$$ -24 31 116 -58 124 71 -17 -15 127 -19 31 119 -225 3 4 96 -228 -61 -126 78 -51 -85 31 70 31 126 113
5337A13j53R2o3O5n5P6j70J11K22m51J16lJ83o3m6J54j72O6K4M7q5P8Q1j45j99
$$ 113 -40 52 -11 54 -1 75 -95 16 238 -213 -97 -100 83 20 -26 128 -44 22 46 93 8 86 167 22 -177
5362a77J31p8N1J76N1k13l7J58OL0J1j81O0K7L2l7o3n1J15n1K25k67K66j43Pp6
$$ -177 -46 -124 -73 103 154 -59 -96 62 68 98 109 -72 -12 15 47 10 -53 -104 11 -40 185 -82 184 41 48 -28
5388b8j25K11J7k18J37L0j07Q0m9O6L4j35N3J42O1j65N8j2n4J8Q1k67J08J4J2
$$ -28 -153 58 75 -143 -6 24 -83 -3 -52 14 48 -87 -34 108 169 4 62 50 -4 14 95 -172 -64 -50 -38
5413c8Q9j2j06R4Q5o5R0j59j4j90L36j60l7K2N5K4k5J65J4o0j34J78j82l2J04
$$ -38 51 39 -67 27 112 47 137 -22 -36 -226 110 -50 -87 -65 -10 14 -11 154 168 108 -26 152 -30 -62 42
5438D2k2m9j18J62j01J12J3l7j2lJ7J24k59L29j5j67rM3m6j47J28j40J26lr7J24
$$ 42 20 -29 -147 15 -86 26 39 2 -10 -13 4 128 -131 198 183 16 7 50 4 -143 -15 -155 -29 -32 -129 -5
5464eJ20j06p0j04J72m8N1j01k7P8O7R8k19R6L8N4n8r9J45o8J8j85L15p6J6j54
$$ -5 115 9 -61 -165 7 -41 10 -91 -118 -40 27 125 -94 2 40 94 36 -63 82 14 32 -153 162 86 102 -52
5490e2k7J92j88R8j03ON3j21L22q8lj17J07P5k20J89j73M2J1j20P7L7j2q0J31
$$ -52 -79 113 -75 23 -80 -74 -21 -142 180 92 89 -28 79 154 -66 123 -50 -8 3 -117 -40 -3 -15 -95 36
5515C6o1J15k05N5J03j44O1M4P0j5j7pj77J57N4j00M6K4j10J21j14R9J10k47Q9
$$ 36 -25 90 -115 -60 43 -101 -40 4 74 59 42 35 -142 15 69 -31 15 39 -71 50 -64 35 145 -102 -13
5540a3J56j51j42J31P7j44O9Q8k8o3O9ok22L18m7K4j78J76j26j26J2J95J13k44
$$ -13 143 -8 -150 -19 58 -86 -17 71 43 -20 49 43 -179 139 92 116 -62 114 -12 -138 -126 69 182 -62
5564f2J67j17nK14j69pp9J42l57J65J17p2L5j32K80k23J60q5J01j56J50kq3p2
$$ -62 105 -12 -17 197 28 21 -58 84 -273 -108 9 -63 -28 -160 120 -103 57 -28 73 -83 67 65 -18 -90
5588i0O9lk37J50P7J24j51q1J08j7j7k0J12j32J52J32j87L02j99j92K17j06r6
$$ -90 -21 -24 -261 -111 -34 90 -61 -142 -34 -51 -68 -88 24 -108 44 176 -11 291 92 -100 117 11 -85
5611h5Q5J51j36j10J19o6j0p8N0J29q9P0J25j57l9J65M6k04K5m1J62j46J54j69
$$ -85 0 151 15 -95 24 -42 -52 -130 -80 49 -40 30 155 -2 -41 124 170 -34 -9 -50 112 -34 120 -49
5635d9O8l3p1J03l2L1k0P4j27KQ4n1%jR0j22M1J0l3K73k50j93K56r3J94k9Q0k23
$$ -49 19 -14 -85 18 -14 17 -3 71 -56 -54 30 -21 -21 -22 68 -54 -13 -3 -36 237 -13 -206 50 -43 151 122 202 -21
5663b1Q9j61K14r7Rj15O5R9p8J9j01K65j91L7K9R9j89P8p5j17K10j46O9J55k01
$$ -21 68 -93 121 24 33 -82 -17 82 4 23 -78 187 -4 33 62 161 -28 50 -25 -142 68 -78 -9 146 -55
5688e5J94n9k1n4j05N9Q8j07J27M2O5j38N7j27J32l35J69R1mj40J75Kq4j22J06
$$ -55 139 80 59 5 -100 -41 47 -60 67 109 174 36 93 -34 98 -237 -68 23 19 -121 54 56 -28 -150 -44
5713d4l3J92j92J84k76J02j9J20q6J58k0j27L7m7J91k23K25l07J28O2m7nJ1Q6
$$ -44 -77 115 -77 107 -169 -67 -86 34 -52 106 86 -41 -4 -51 140 -83 142 -165 -37 25 -22 -27 -16 70
5737G0l7N5q4j18K9Kj30J21R3K6l4M0L8K9%j74O0l5J00lp2m7J04l0n4J39J5j24
$$ 70 33 88 4 -114 -85 -83 -213 -92 1 27 -7 33 71 100 100 -74 -14 -49 51 48 -24 -71 33 3 -51 88 103 -21
5765b1N2J0j73K34m3j70J34m7K48j76j26J22j82J71%j32R3N0n5k3J02p0L7JQ9
$$ -21 31 41 -132 102 59 -111 23 -24 224 48 -78 44 -138 33 33 -99 -6 44 -11 -34 68 -2 35 36 125
5790A25k3j28k7k6J59P4j5j8p7L5p3n8K8p0k9J67O2M1k33J25l6rl3j0m7J86j30
$$ 125 102 -26 -53 -79 80 154 139 121 44 79 6 -52 -24 -94 -123 44 106 147 -86 39 3 -6 -39 -49 -96 90 -40
5817d0J35j79M8r5J65n8j37L22k5k10J97j65J3j03J74P9n7o4J0m1J3r1N9J25j17
$$ -40 95 -84 -36 -131 34 -24 -161 161 136 -74 123 -42 -29 -132 42 121 64 0 10 -31 -18 -109 -50 75 -42
5842d2l0K4P0n7K2j17N0k3m4L9o1J72j04rl9J42r6J91j87J50o8K4j1k15K89O1
$$ -42 -72 -48 22 -35 -13 -130 -80 -103 -147 -108 -169 3 -101 -110 -149 -7 -103 88 -99 51 -17 7 -4 -219 70 131
5868A31m6k8Jj89K13L4j00j01p8K58j97j6Q2J17j25l6n6J25r6J93J0q9r1J40j71
$$ 131 85 57 58 -131 82 116 16 -85 -163 95 -102 -118 -36 81 -44 -80 -136 -11 -107 86 96 7 -84 56 -115
5893a15P0N4J1K9q3pQ1j17nJ21Jj08P1QO9m2J1J18j23l0o4K06j18l6P8J13k78
$$ -115 -45 9 20 49 -34 -41 40 -77 -82 39 40 -68 3 11 80 38 49 167 44 14 -50 156 38 2 80 193 -85
5920h5J31P0n0n7kN3qk4k55K74Q6j90Pm8R3M4k7P3j9j83J71K8j05M4j25J16K8
$$ -85 46 116 66 9 7 60 52 28 -227 47 133 -57 -50 -98 -5 39 12 85 66 -117 54 82 -23 21 -104 12 40
5947D0k10R0L1Mq0O7J25j5j72J8K01j33K3l7N8R5o0n0p1K9m1M2O2p1k0J77o6q1
$$ 40 -170 -80 -49 -45 -125 -58 67 52 -120 -102 99 -34 -11 -48 10 105 45 -5 -76 -47 -88 -46 16 -55 -75 102 36 -45
5975d5J53j10j71J29J81j64o1K52j13j81R7L7J27j08mj3l4m3J55j30L7l7j5N3
$$ -45 108 -2 -173 -44 137 -27 -88 164 51 -130 -33 4 131 23 19 6 -28 -71 84 -46 -9 -46 -61 -8
5999hn6J00p6Q0k9K7m5j15K21k31J27L4r4J30J12k29Q9o2l0k3k11K13Q5L3j19
$$ -8 -64 36 -40 40 11 38 -7 -122 99 -132 -5 29 -65 65 177 -52 37 -25 -55 -78 -289 -76 9 42 -77
6024g7j16J09l3O7R8L7j03J8j09j8J58Q7j23m2n1J76q7p5J22j06K57j71j30K16
$$ -77 -193 -84 -117 -50 48 85 -18 0 -109 -127 31 118 -5 -47 -98 78 -9 -84 38 -68 189 18 -112 104
6048A04K6r0k5O2k2j06N0k63K08K5J27j15M7K8l1n1J00j84O4O5m9K75l76J59o5
$$ 104 130 40 15 77 55 -51 -1 -264 -56 -31 96 -19 28 56 25 -26 74 -110 -46 19 -30 245 -131 28 -37
6073c7J27j5m9Jm9j46O6J49J4j21m8n5J53l4J42o9P0j79L9k4o3K00j58J54j07
$$ -37 90 75 26 27 -22 -168 -102 47 61 -60 -108 -163 -10 -44 98 29 99 -80 -41 -65 -128 72 -86 68 -39
6098c9K5O9o7M5Q8k68K42j74%J10O0q2j7J9Lm7M8j5N0l6m0j4Q2j39O2j9q0J28
$$ -39 -14 55 -12 33 121 -147 95 -79 -79 31 91 9 -8 11 14 -33 15 0 50 14 -26 -40 42 -97 -35 -54 -134 -6
6126fj8l5M5J00J27k45n5K88j55rM9j6J6j17L3k2j1j14K82j36O8n1l4J04q8m5
$$ -6 -24 -59 -14 86 213 -32 -87 201 46 37 86 70 86 -31 2 -20 -31 -145 137 1 69 18 -16 88 0 -45
6152d5ll9K23j59J24rj10%R0N2l9p8RP3l7j1n9R8j1j61J00k5J30K2j64K31k70
$$ -45 -48 -87 136 -23 101 92 -18 -18 72 124 85 7 16 89 52 41 -18 80 69 -92 8 -17 113 135 -29 202 -68
6179f8Q8J34p8j90PQ5N7O2n6p4OPJ44k4k35J86m7k75M02k82J46L9L9M2j68L8L1
$$ -68 20 154 76 -114 -107 -22 35 97 41 -33 -27 -20 124 100 -135 51 4 -271 131 -151 -5 34 73 115 -53 -15 16
6206A6q8n3J24Q5j14L6NM2K6P5j76R2jK3j12J69j40O2j24J2J22N9r0j21nN7Q8
$$ 16 -72 -125 -1 84 -30 6 11 53 79 154 -22 70 69 92 -20 149 9 71 -53 -41 81 140 50 -71 -76 -19 69
6233F9P0j19L3LN3o6O5k8r2k8J47k0j88P5J47n6J7k33J96L4q3R2j29K7L3k04K37
$$ 69 139 20 53 56 109 43 108 80 -12 -40 107 87 -101 -26 121 65 82 -151 45 79 -4 88 -41 -14 19 -185 52
6260E2k33J13L69k74q1N0J03j82N2J41j12j0p4J33r4o7K36k21J56J1j05J53r6
$$ 52 -181 -68 301 27 -54 -4 99 -83 -31 110 -2 -12 -86 47 -47 -114 122 -99 57 68 -37 116 20
6283B0J4j28J39nj05L0K5k8K4L6o6N5J6nj26J34n5M2p2l6k2O4N9j00K43j09m8
$$ 20 34 -94 45 40 -65 -35 -10 -38 -14 22 -44 11 27 22 -104 30 -25 17 -55 -91 -113 -49 10 -90 153 44 -4
6310dj8K4k3k9J32r1o3L5Q8o2q7J79j72j8k7K88p2l3j39M8q0L69k27j43K74q5
$$ -4 -22 2 -21 -50 82 -9 -72 -37 51 -11 -98 81 -91 -109 -136 152 80 47 -92 -44 -124 245 18 -125 149 64
6336F4J42l62K96R9j43l3pj25J61j03P0Qk6r0J55k8q3J17j06rK5%P8k76L01p7
$$ 64 206 -156 140 239 96 63 56 -69 92 -11 59 67 41 -49 106 78 -5 112 6 -3 22 22 100 -176 125 48
6362D8j79O7P1M4j58J73jp0P2p3K07k52o6O9M7Q0k9j8J1j27J22J06j58L8R4j01
$$ 48 -131 -64 7 51 -107 66 65 -5 67 -6 201 -51 -117 -48 -1 79 50 32 43 -84 38 144 -14 24 118 17
6388A7R3k19J13j20N6J47j83K03j47K5r4J38o8p1J61R6l07K7PJ41M3q7J70L3j88
$$ 17 110 -109 4 -116 -60 87 -96 107 -40 -15 -109 29 -39 -110 51 147 -160 -133 -126 15 58 -29 141 174 -14
6413a4r4J94jp2N4N0j45l0m3J15J9j73L07j43M7J03p2k43J35j79K11J7l2m3J28
$$ -14 -108 86 85 13 67 117 -28 -58 -101 14 33 -140 167 24 71 174 102 -141 -6 -185 26 43 11 -32 96
6438I6j44J8K2J42j26j04J50K7o8j06O8j53K80k9o2k4Q2k5j02n3J61Q9o4j22L1
$$ 96 -48 -30 -8 134 8 -96 54 81 13 -93 -25 -178 102 73 11 -13 69 44 -58 -111 50 139 75 -47 -16
6463a6K25k48j24L51r6j82R5M0P1J22k98K1R3n2K24l04J57m0n1J6nj21J38J36
$$ -16 209 -39 -163 188 92 -90 5 45 116 238 -60 -39 54 2 226 -78 79 39 -12 4 -1 -122 16 152
6487A52j92J16j60J77j76N8p0R4Q2oq4q9J26N5r0j25K12r1J79j68k1J4j07j6L2
$$ 152 -40 76 -84 93 -83 -25 -95 -1 81 75 -9 -98 28 83 -7 -132 80 -11 168 0 -21 -7 -114 -130 -98
6512i8J77P2l38J50J63q2J1K4P6l10Q4L0j05J41L0k8J0R1qj65K16j23p4J6J48
$$ -98 79 151 -187 -37 126 44 55 79 155 -155 -71 -41 -146 -5 25 -3 7 98 90 -75 141 18 -56 -40 108
6537A08l6j64R8R3j32J24m7j12N2r6J13L8L7p8l6MN8r7J62l5o2l3M8L0n0j45R0
$$ 108 72 -92 6 99 -33 91 44 -68 -16 -112 1 39 76 -2 -38 -34 24 -73 89 54 -8 -41 7 37 -13 -158 -68
6564f8j17N0J05K7p4J73p4j4J49j76P4j97P1J05M2M8k08K92k05lk15J08pK0K01
$$ -68 -185 -135 -30 -3 -77 96 22 8 157 -19 55 -142 -71 34 76 124 -84 208 3 0 -215 -107 -114 -94 107
6589A07j34J9L7p2R5j45K09pPj47M9O0r9j10M5J23j12r9J80pq4m6P6Q4j74J92
$$ 107 -27 -8 29 -43 52 -93 116 109 116 -31 18 78 -21 -131 -86 37 -75 -174 6 -1 -85 -131 -55 29 -145 47
6615D7p7K6J78k27n5J27j12L1J43J42n6k33K0J25Pk18K4m4K46j52K09j05N5j40
$$ 47 -30 -4 174 -53 -108 19 -93 -62 81 223 167 -66 -46 79 86 -132 -108 -152 94 -58 151 46 101 -39
6639c9J5j0%K30k51n9J69O2j55p4K56q1l2lM5Ml6j43K4K17j74k3K67j71k19k4
$$ -39 -24 -34 -34 196 -55 -114 55 117 -38 -112 144 63 31 28 73 77 41 -102 -78 139 -35 -58 209 38 -181 -205
6665b05L26Ln5P3j25j32J7K06j19m5m2J68J71j09j33l1K4q9J63Oj69J72l9l1o3
$$ -205 121 124 69 142 17 -115 -98 108 -11 -56 -98 70 241 132 -1 -32 -8 -97 66 72 -97 75 36 5 -58
6690e8J98j1k29n9J39P6j60N4J01r2j01j1J58j26R8L3O8j24K11j73p7R5N6O6r3
$$ -58 140 129 -100 -159 -20 56 -104 -50 51 -41 -142 -153 5 -121 -23 10 78 -46 165 -8 -85 10 66 132 39
6715C9Q6j73oJ79r0l5O1m6k24K33p2K42j52o6P9m2Q6n9j35J54o3Q8j17Q5j62J23
$$ 39 125 -48 -54 125 35 0 61 15 -209 24 -48 194 42 -24 55 13 99 40 -95 59 -4 84 -33 52 -110 13
6741A3k25J87j22N1J00p9J79n1k3j48K29j47K12k73P5m0K7J41p8k1q1o6Q0J64
$$ 13 -212 -25 -147 -96 4 -75 104 53 30 -118 111 -36 176 -97 -22 -62 -35 106 28 7 -74 -140 -60 104
6765A04k07J20q4O0K9j07O4O9j07j66K39k00L04j71J18r2L5J43j76R2J2j01O3
$$ 104 -103 17 -67 -7 22 -85 -21 48 -59 -225 14 -186 118 -53 65 -27 8 151 -25 67 79 -22 41
6788D1K7l2j44J53P4j1k2q8l0q9J07P2J24p0j73J23j35K01k17O5P5o0N0q1K14
$$ 41 68 36 -108 45 119 108 86 -2 -32 -121 -14 58 182 112 -61 62 -73 128 -89 -24 51 -9 41 -40 174
6813A74j43j56P5P5o6k3M0r9J35n9P3P1l18K80K6o5J47l9J2j60Q1l8mj24J11n5
$$ 174 31 -125 -50 25 -41 -64 -24 -123 12 -47 26 97 -221 59 85 20 167 128 140 -20 61 23 19 -105 6 -49
6839d9l9RM5LM2P4j34r0J38j43P7J70j0q7q6K3J87p7m7P0k0QM9j70L2o9K9N8J46
$$ -49 -88 -79 -34 -31 11 85 -49 -139 -1 -144 -67 103 93 6 -80 -57 130 53 6 76 56 64 113 -57 -25 -94 -65 -7 139
6868A39j97jR8j09N8mN4J37j98O3j75M5M3l1M3J33j50J27p7q4O6P6Jp4L9L0j10
$$ 139 -58 -59 39 -70 -12 -16 38 175 -23 40 -135 -90 -47 -78 -35 98 -52 75 -2 -86 -20 56 57 -17 22 52 -58
6895e8o8J50r3K11j11q7P9M7o7r6P5j3O6j38J43R1j69J04j07n4P5q1N1k0k8l2
$$ -58 -126 24 -69 142 31 -56 23 70 3 -93 -18 -31 35 -103 40 131 -38 66 -41 -95 -20 -101 -50 -70 -98 -130
6921a30K30P0k54J44L7j6R3j02j12J13k4k%Q8j49o5J9l9R3j1O2k6l1P6j6P8p6
$$ -130 100 170 -84 60 97 81 174 72 -40 73 49 47 47 135 -14 -79 -60 -99 -6 -17 45 19 -12 64 48 126 50
6948E0j13J2L3N7K7n9rJ15l20J05J54j01l6J63k28OM5J8P8Q3q8j25K69j33j54
$$ 50 -63 -51 -18 39 66 7 -2 113 -207 -102 52 -49 -85 78 -150 -144 -99 -81 -3 80 -8 -133 136 3 -151
6973a51K01j09R0l3J63j71o1OJ61k1n0P3O0j50%M5r9J43j13Q7K4R2l0K2j38qj25
$$ -151 50 -59 31 -2 161 -10 -71 -65 96 75 25 98 158 8 8 53 -46 97 -16 71 95 187 157 179 41 33 -92
7000i2J36J3J5j8l2J08q2J5j83J41o1p5R8J05M1r0N5j82K4N9K2J11m7n4NJ36q6
$$ -92 44 57 72 54 22 130 48 63 -120 21 -40 -115 -17 88 129 39 94 -88 -64 -5 17 128 81 27 32 168 82
7027H2m5j71J68j5q5j01J46J54j99j3k0J47J04j32k20J80K24k94K42p7j24J13
$$ 82 37 -134 34 19 -66 -167 -21 133 -66 -79 -99 48 152 20 -200 -20 204 -90 152 75 -49 64
7049F4R1l5k15K19j01O7j34J47j78J35m3o7N8%j45J50OK9K70k55N2j99J41q2p3
$$ 64 155 120 -95 124 23 90 -44 103 -75 60 17 -50 8 8 -137 13 19 48 318 63 115 -84 57 -25 -98
7074i8K0J33p6j06J29k6L2J73j73O7n8j69J38Q4j86K33j31Kj8J55j3k18P5j29
$$ -98 -78 55 -21 -127 2 -24 8 181 8 75 17 -152 -14 70 -116 117 -14 -12 -30 125 112 -106 -31 -160
7098a60K34j50K28l6k67P1J98j43J12p5p2k0J79l30J40J77j98ok9K93j34j20o7
$$ -160 74 -76 152 116 -151 -80 118 -25 87 12 -60 -80 99 -231 -91 86 -112 -118 -147 146 12 -108 -175
7121a75J86l1q5L05j15j69M9J50k2j59N3M3j00k1J7J06n5m9N7P3m7k05P2K11n2
$$ -175 11 -20 -105 200 85 -84 -35 115 93 -66 -13 30 -70 -91 -74 32 -23 -72 -15 58 11 -194 -122 89 37
7146C7j22J22l4lo0J07j56K33m41K81j9l3J25K9Rj46L8J29n6N4j68J09J1o5O0
$$ 37 -85 37 3 0 -60 47 -109 124 -317 -36 -55 -88 37 66 75 -71 -33 96 40 94 -74 35 46 -19 41
7171D1M8KO0q4J07j84p2L17l77M1J64j41J13j11L0Q5M4j56J25K05j95N7j17M4
$$ 41 89 91 151 67 174 -10 -82 235 -142 -101 63 -78 35 -76 -46 39 83 -73 52 257 62 119 2 46
7195D6j73K66q6j13j6j0J63j96Q8M6n3J7P8n8K88k65j7L0l1l4J17j55m6J29lr8
$$ 46 -127 139 53 -60 -76 -86 77 -119 -31 15 -38 -21 57 -1 287 22 5 35 4 -30 87 -68 -114 15 12 -86
7221h6J28J5j04k5J06j57l5R4J12o4q9J38j68N5k0J15j11K51k78N6J61l6j63J0
$$ -86 42 57 -47 -72 34 -123 -158 -64 48 -16 -105 33 -135 -80 -100 15 -96 155 -123 -67 94 58 -105 -95
7245i5J35j57J72r7J19j05l3OK47k00qO1J48k34jO0n7J83m0J18k72k9J92j2j20
$$ -95 40 -117 55 -42 77 -28 -61 -55 192 -8 -16 45 193 -41 -42 18 -39 144 104 222 -50 -79 113 101 -19
7270a9L4j1K14j97O2j39j24K17j39N3K37j16k78K25J4k4k4p9K15n6P9p7O3j13
$$ -19 15 4 218 21 83 -56 -180 37 -102 -49 188 72 -206 19 33 9 -15 -94 121 65 144 67 130 17
7294A7j86K74j77P7MR3n3k34K10O2q4L5p8J18k36Q3K8P0Kn2Q9jr1j09K16k5n8
$$ 17 -169 105 -72 5 9 102 49 -185 25 87 3 38 -40 78 -158 -75 -47 23 25 -27 62 61 -30 -139 77 52 -6
7321fj7R2J04k17mK5K04j61J42L0k11M8k6K70j96j47j2J90j35P6n4KQ0j00q0K32
$$ -6 -23 69 173 -44 -48 -23 181 20 162 192 -19 29 3 273 77 -70 -82 108 -27 49 -5 -3 77 -23 -103 129
7347A29k12k1K64k19Q8k77K01j3pm7Q7k67L88j15j63J16k9J62q7p8J7Q6nq9Q1
$$ 129 -83 -104 160 -59 29 -248 -47 -60 -67 -114 -27 -294 94 -21 -184 -68 -97 65 -22 -100 -83 3 -2 -91 -10
7372a0O1j76J97m2k19J05n9J80J51j66P1k2p1mQ3r3l9j32K40L1k4o1m6qN9J01
$$ -10 51 -125 72 30 -189 -84 -143 37 188 22 93 71 0 -4 79 -14 -53 -185 55 86 62 1 -45 -53 6 107
7398A07j27J5nj28lK29k92K51O7j76L6k1J10J4j11J12J20k76P0l5N2N7n4j4j09
$$ 107 -20 -5 -10 -138 -141 88 -204 47 114 -62 -26 -47 63 77 -34 78 198 -78 -8 -43 9 66 12 -2 -111
7423a11l2K00Lj64qJ06n2M3o4J77j69K64k56K18j12Q4j48k7P8j71J53k1j92J70
$$ -111 -143 57 60 -104 -112 -6 -58 -15 -79 98 -71 193 -63 155 43 127 -21 -48 30 -141 12 -9 -201 -31
7447c1J5J38r5j94K11p7M9N9l9J17j16J6M1j72M3PR2j82J05K2j7m4Q2J79l04J24
$$ -31 -16 122 27 -167 44 -33 16 75 36 153 37 53 94 -78 -35 -28 64 -118 -13 9 -8 -52 30 209 -95 29
7473B9N1Qm6M6L0j36J07j35K74l07k7n5K89j75p6J69mj87k9Q6P6l8J33j11K01
$$ 29 80 88 42 88 118 -18 89 -46 228 -79 -106 -161 128 -47 -123 46 42 -145 -174 -88 -12 -50 83 -28 173
7498A73k50J62o8n0K3J08j68J28J3j87L29k32n1J24j03n6J00J46O0j43j25K15
$$ 173 -77 85 17 -33 -10 98 -70 58 71 -116 213 -19 -70 54 -49 -105 -5 141 201 58 -67 148
7520A48j57J88m41K33J7o4N8l6K5kP8R4J1k7l03K01Lo0j17K54m1ll0q0n6R9N3
$$ 148 -9 179 -262 -29 -12 -76 -18 -54 -29 -31 47 141 152 125 -178 23 26 -34 -151 103 62 59 29 -51 -107 -8 45
7547D5j0p5J32r5l6K43j06K0k28J43j20K39l4j49K2J39K5j42J43k98J73m9k8J45
$$ 45 35 -40 92 -3 -39 204 98 118 -110 33 -87 152 118 -31 -9 130 155 13 156 -142 31 -18 -46 99
7571I9n9j4n6N5K77k64L5r4l6J98k39K15j65l2J92p7k9k6J4J05p3j6j4j1M4R6
$$ 99 40 26 -30 25 302 38 73 -21 -57 141 -98 117 -48 -80 112 35 6 -20 -6 99 26 10 -4 -15 29 125
7597A25k13J26r0m5J68jl8lPj53J77m6j16J69k7j77N5P6r3R3K87k80J07j96J80
$$ 125 -88 38 -52 -97 71 70 32 29 36 -117 60 14 -102 67 40 -137 -82 -6 -99 -6 281 1 108 -88 92
7622I2j31q9J27K6L1l5R1k06J37R8j80q5K27J9j45J40l6r0n7J38L8r8n2lj0OK3
$$ 92 -39 -128 -1 25 56 21 112 -94 43 141 -39 -124 103 122 -23 117 81 -9 -66 72 110 12 -40 -43 -53 -47 -24
7649b4RN7J07j46o1K24J58j97Pj41l0K3j02K55p5J1j76J74j26n5N2PK43k36o9
$$ -24 -15 42 149 3 -58 166 324 127 134 -7 -37 -14 -116 139 64 75 -101 73 -53 -108 -56 -49 194 -42 -111
7674a11O0O3J85k65J45o4K2M0k0k54K05q2N1K48k27P5l14J61J29M8q0jQ5j54J69
$$ -111 -51 12 197 -68 77 13 35 75 55 -199 6 -76 -25 223 -4 71 -243 -82 47 95 15 14 99 -55 114
7699A14j17J74j69J5j56J47l5M0j0j45Q9J30j7J1rk0q9L5P3j27J45j26R1K8j22
$$ 114 -3 171 2 17 -139 8 -27 13 3 -142 -53 77 60 71 62 42 -47 -12 61 -66 79 -47 44 72 -50
7724e0P6k1R2l8r3O3J04j65q8K15K9m6m1j00L1j9O3j00J59q9P8j48J92j84Q8j5
$$ -50 26 5 97 59 -34 29 133 -32 -120 95 124 78 37 -63 -32 -51 12 -88 71 -18 60 -88 104 -80 8 -7
7750gJ7MK09k98J79p9k19L54j80J4m7J97j80J35J26l97j7K16j78L25k30J74M5
$$ -7 10 14 223 -75 104 25 -194 160 -20 -6 -53 144 -36 99 225 -172 -189 27 -151 174 -56 118 163
7773A63n5j36O1o1m1J54q2O5M3%k76J88Oj57J68n3r2O9K0O6j16K48j32j58J54
$$ 163 108 -28 33 -28 -69 85 3 68 111 111 -165 23 29 -128 40 -13 -105 -36 -16 50 -66 182 50 -108 46
7798D6J2P5r5j87K44J3j51M6M0M9j68J52N4j97Q4l5m0J8j68J69rJ56k50j16L26
$$ 46 58 133 38 -149 95 108 -43 3 43 92 -76 76 130 -67 17 -18 -58 -40 -208 -39 -48 108 -142 -258 68
7823F8n1p7J10j77J4K02r8P8k9n4J37k47J71Q3k84J80q9J40r8K8p6J73j84K3J03
$$ 68 17 -60 50 -127 -113 89 -9 69 40 -14 123 -124 47 130 -154 26 -63 77 -21 7 -69 104 -80 -57 46
7848D6j93K19p8j9k8K48l22N5J58p9N4Ol2j57L45k81j26J82J15k18J74JM2j33
$$ 46 -147 72 -6 -25 -53 195 -127 -72 86 7 61 67 35 -122 223 -58 -184 -2 113 -105 69 70 112 -21
7872b1j4O6J85k10j15M0O2J54j74p5J76j39J21j12J58J7N1j39j77K37j39J4m5
$$ -21 -35 31 216 6 -109 -69 -7 147 -27 -102 74 -65 56 -56 102 119 170 31 -146 91 -48 -34 -79
7895g9P7J75j11j13j14K28p7Q8m6q2Q6j07K6O5J21k67J67j94L84j43m1j23L5L2
$$ -79 -2 173 62 -51 -165 63 -14 74 28 -54 32 -75 -49 16 137 -130 37 -157 227 84 43 -80 -45 -13
7919a3j7J37R4l13J83k2mJ37j17q5qQ4j45N1q7O6J05p5q8K10K6j84q7J98n2O3
$$ -13 -30 107 201 -112 71 49 45 182 65 -20 -28 56 -89 -38 -125 -59 46 -29 -117 93 119 -65 -152 46 -6 57
7945E7m4k03K74j47j23J58J46p0m7L7K5k0M0P9j85n3J14j51J37jJ16j07pO3J6
$$ 57 13 -190 84 -63 -186 -28 118 48 1 38 63 43 83 162 -23 -76 38 -113 24 23 139 32 25 88 104
7970A04j64J64K9j32j7O2L3j63K5K49j01K5k63J33N9j51R2J99j16j89K23j9j48
$$ 104 -60 104 133 1 -16 46 79 -84 -59 190 89 114 -149 -16 43 -108 -16 183 67 -122 101 82 -66
7993f6K9j3q8K68k32J96N7l44K31RO6l3n4JJ06j03J2K9l5P0j06k8r4J78l7J9l3
$$ -66 -37 -50 -138 130 -102 94 151 -193 38 47 113 80 26 27 133 30 42 71 36 106 0 -28 -122 56 19 38 5
8020Em8k0O4p4jK10j57N3nk5J3K4j53N1R0j41Q5O4L7m1p0J0J20k74J08J46k18
$$ 5 -43 -63 1 -73 -74 136 -21 32 27 2 15 39 -114 -63 27 -114 -29 35 72 31 -39 -29 91 -183 -75 71 -147
8047a47J3L23j65Q7j30j3P3p5k07M01j15J9m1k07K29j16n5J78r4j29K83L8k07
$$ -147 -134 189 24 111 -19 -32 41 -34 -241 160 45 64 23 -184 45 -71 -126 52 -42 -171 112 150 -57
8070e7N1L7o8j60J25k3M5m8K6r2J79J40k34rJ23n7l1MK06m4o7K4j54J16j04kJ81
$$ -57 -6 31 -37 -197 -72 -95 -50 -98 -72 -164 15 155 -79 -88 35 -22 -53 -49 157 113 46 70 -84 32 -72 -74 107
8097A07K3l4j77N8j4o3J29j41K25j99j2j10K18j45O3n4Q5M9J6l0N6r1n6L8O7o1
$$ 107 130 96 -81 -23 -37 -100 29 -112 113 -86 -98 -208 10 -135 -72 -126 -41 8 24 -6 50 -41 -97 -59 8 -53
8123e3J35j30K5R9l7j40J72k72j3J85n1J06r2K26j63j15J68o1j0J36j99Q6l4j7
$$ -53 82 -48 -23 76 39 -101 71 -201 -214 -29 -80 26 -66 160 -3 -118 50 -11 -21 115 -84 2 -32 -49
8147d9ok1k2J85L0j66J18J6j67jJ21o1J91m1j07K6m5j39J48m1j0J94p1j45J31
$$ -49 -55 -76 -98 87 117 -49 69 85 -82 -83 38 -23 168 127 20 46 1 -138 10 -31 -41 153 82 -63 68
8172F8n5P9M5j22RJ8k5N3Nq1R2j76r0J72R3k27J01N0k11
$$ 68 13 92 137 15 24 42 17 70 75 -6 86 -90 -180 -8 85 -142 -41 9 -202
8191b02
$$ Imaginary data points
##PAGE= N=2
##DATA TABLE= (X++(I..I)), XYDATA
0@%%%%%%%%%%%qJ6j6J6j6K4l2M0m8N6o6P4q8J04j28J52j76K00k24K62l02L44l92
$$ 0 0 0 0 0 0 0 0 0 0 0 0 -8 8 -8 8 -8 16 -16 24 -24 32 -34 40 -48 56 -72 80 -96 104 -120 142 -160 184 -208
34b08M40m94N57o24O97p80Q71r68J074j192J319j457J609j774J956k156K375k615
$$ -208 232 -262 295 -329 368 -412 459 -509 565 -627 692 -765 844 -930 1026 -1130 1245 -1370
52a370K880l179L512l883M306m786N338n990O765p703Q869j0365J2362j5179J9488
$$ -1370 1510 -1669 1843 -2040 2266 -2520 2818 -3172 3593 -4110 4759 -5606 6756 -8423 11065
67A1065k6967M3561j48205Q0176K56771j86580j21420Q1402P0098r0354P595N9923
$$ 11065 -15902 27659 -120546 -40370 216401 29821 -91599 -10197 59901 -30453 -22858 37065
79C7065k4856n8929O2619L9898p1115n6634Q3679O7745o6331r8035M0368J03607
$$ 37065 12209 -46720 15899 55797 -15318 -71952 11727 79472 13141 -84894 -44526 59081
91E9081P081q6025l3569L1699K7969J3166J5567k8378m7206J3677N0679l910k4414
$$ 59081 66162 -19863 -53432 -21733 6236 19402 34969 6591 -40615 -26938 23741 19831 -4583
104d583J2411K849l2915L006L5380m479j9180K2284O299m7324j7908M9689L4715
$$ -4583 7828 10677 -22238 -19232 16148 11669 -7511 14773 21072 -26252 -44160 5529 40244
117D0244k3599l3273o637J3203J7656N315p185n927q169m246K2719J9593l3488
$$ 40244 16645 -16628 -23265 -10062 7594 12909 5724 -203 -8372 -12618 10101 29694 -3794
130c794l2410L9404L8746m3325l9767M2613L5481l9986l2885K8188K6329j0666
$$ -3794 -36204 3200 41946 -1379 -41146 1467 36948 -3038 -35923 -7735 18594 7928
142G928r913O24p357l356J6295J6029p699k2786m285K2662R301k4884j1172K8575
$$ 7928 -1985 -1361 -8718 -12074 4221 20250 12551 -10235 -14520 8142 17443 -7441 -18613 9962
156I962J1730l1711j4121K6288J1051j6749k305R257n532l905J0601J393q929
$$ 9962 21692 -10019 -24140 2148 13199 -3550 -5855 3402 -2130 -6035 4566 5959 -2970
169b970K478N791k984r09k45n986L019J0932p215j3272J0794J1394j4756r389
$$ -2970 -492 5299 2315 1406 1161 -4825 -1806 9126 1911 -11361 -567 10827 -3929 -13318
183a3318J5147N929j0989N11O529n332k015P117j020m682M962J137o872K713O162
$$ -13318 1829 7758 -3231 -2720 3809 -1523 -3538 3579 2559 -2123 2839 3976 -2896 -183 5979
198E979p473l414R946j283j2186M468J0748o184p050O522J509o489M417O093n825
$$ 5979 -1494 -4908 5038 3755 -8431 -3963 6785 601 -6449 73 1582 -4907 -490 5603 -222
213b22l365O161M62l438K953p56n335N039N690r270m938J0032J798j1762N34J0228
$$ -222 -3587 2574 3036 -402 2551 1795 -3540 1499 7189 -2081 -7019 3013 4811 -6951 -6417 3811
229C811j270n560K741k54m609M634P256k146m979q99m53K467M411l179n106N097
$$ 3811 2541 -3019 -278 -532 -5141 -507 6749 4603 -376 -1275 -1728 739 5150 1971 -3135 1962
245A962J918r872j829J1250J982r136j69M336l077nP768p58q006J173N922m52
$$ 1962 3880 -5992 -7821 3429 5411 -3725 -3894 442 -2635 -2640 5128 4370 -3636 -2463 3459 3007
261C007j813K49k271n82L674j004l472L132J838p026l059Q255L933m771j072Q55
$$ 3007 1194 1443 -828 -1410 2264 1260 -2212 920 2758 -4268 -7327 928 4861 90 -982 -127
277a27l663o15O908L678k637l373l115m0M516K538l118q55K092m182m183N799
$$ -127 -3790 -4405 2503 6181 3544 171 -2944 -2984 1532 4070 952 97 2189 -1993 -6176 -377
293c77N333n537l870M172J037l616K406M354k744m678K193M244J060k028k782
$$ -377 4956 -581 -4451 -279 758 -2858 -452 3902 1158 -3520 -1327 2917 3977 1949 -833
308h33r44J894J302j168Q95R33m204l624M175M158k028j406J175j477k429K657
$$ -833 -1777 117 1419 251 1146 2079 -2125 -5749 -1574 2584 556 -850 325 -1152 -3581 -924
324i24M553l66k388j379k22J593J017j117j180J762m73l465L24L254r77l029J526
$$ -924 3629 3263 875 -504 -726 867 1884 767 -413 1349 876 -2589 -2265 989 12 -3017 -1491
341a491L388j567k557J405K047r31p15J801J190j426j628J17J440L40j699o57
$$ -1491 1897 330 -2227 -822 1225 294 -421 1380 2570 1144 -484 -367 1073 1413 -286 -943
357i43J260j33j746J58J617m87j959O99L123M14k719j662K349K226j087n52J317
$$ -943 317 184 -1562 -1404 213 -274 -2233 -1534 1589 2003 -716 -2378 -29 2197 1110 558 1875
374A875o54l068m2L752J123l101j989R58L57q75J120K322n53l721j332L801L282
$$ 1875 1221 -1847 -1889 1863 2986 -115 -2104 -1146 -789 -1664 -544 1778 1225 -2496 -3828 -27 3255
391C255j620k113N54N71j727J267L702j170m935p14L543Q98j194p24m71j253o5
$$ 3255 1635 -478 76 647 -1080 187 3889 2719 -2216 -2930 613 1511 317 -407 -878 -2131 -2196
408b196J312J825J267j625l211K71L491J051j009O55n81l391K54M510P29l791
$$ -2196 -884 941 2208 583 -2628 -2357 1134 2185 1176 1831 1250 -2141 -1887 2623 3352 -439
424d39j973R52N74P84P57p31j288Q2j57L10L034J253l704j188K744l7j651K494
$$ -439 -2412 -1460 -886 -102 655 -76 -1364 -1282 -1439 -1129 1905 3158 -546 -1734 1010 973 -678 1816
442A816J343l975k295L379J848j945r15k16j025J078J743n97m84O49j685p28L262
$$ 1816 3159 -816 -3111 268 2116 171 -744 -960 -1985 -907 836 239 -245 404 -1281 -2009 1253
459A253J889l789m00L609j292l231K575K595l529k265K607M64j502R99K88k188
$$ 1253 3142 -647 -1047 2562 1270 -1961 614 3209 -320 -2585 22 486 -1016 -17 271 -1917
475a917O35J927j219M60J882j874k516L879K379m148j096M124j043m048K276L024
$$ -1917 -1282 645 -574 -114 1768 -106 -2622 1257 3636 -512 -1608 2516 1473 -2575 -299 2725
491B725l039j482K213q47j627K075N78k372J274J491k077N66L534k564l577L955
$$ 2725 -314 -1796 417 -430 -2057 18 596 -1776 -502 989 -1088 -522 3012 448 -3129 826
507H26L094m493j438M480p72m318K106K555l036q23K551j243j999K700R96k239
$$ 826 3920 -573 -2011 2469 1697 -2621 -515 2040 -996 -1819 732 -511 -2510 190 1186 -1053
523a053J187J310l275J95M994j493m391L257L349m935k077M443j03l693J605K474
$$ -1053 134 1444 -1831 -1636 3358 1865 -2526 731 4080 -855 -2932 1511 1408 -2285 -680 1794
539A794k778o48K304j078j482K412L3j942K471J602m053k09M391j038m002K526
$$ 1794 -984 -1632 672 -406 -1888 524 557 -1385 1086 2688 -1365 -1574 2817 1779 -2223 303
555C03K531l720r82L747r81k977J653J321k579K00K439j165l49K108j208k823
$$ 303 2834 -886 -1868 1879 898 -2079 -426 895 -1684 -1484 955 -210 -559 1549 341 -2482
571b482K825K680l295j033L456p59l438K094K059l054m41K520j115k128K000O02
$$ -2482 343 3023 -272 -1305 2151 1392 -2046 48 2107 -947 -1388 1132 17 -2111 -111 491
587D91j821J429J069k876N72L843j828l292L408K291m046n88L776j470l846K679
$$ 491 -1330 99 1168 -1708 -1136 2707 879 -2413 995 3286 -760 -1348 2428 958 -2888 -209
603b09K291k907n01K509j634j751K380J59j741K045J310l608R0M141j393l027
$$ -209 2082 -825 -1326 1183 -451 -2202 178 337 -1404 641 1951 -1657 -1567 2574 1181 -1846
619a846L213J316m646k52M947j009l952K093J310l216K56L170j434j529K217o
$$ -1846 1367 2683 -1963 -2215 2732 1723 -2229 -136 1174 -2042 -1786 1384 -50 -1579 638 632
635F32k447K154K114l298o19L898j421l106L357J919m411j239M165q75k906K259
$$ 632 -1815 339 2453 -845 -1464 2434 1013 -2093 1264 3183 -1228 -2467 1698 823 -2083 176
651A76Q09k787Q2L147j627j164K349n73k622K637K570l358q83L165j449l118L086
$$ 176 985 -1802 -1720 1427 -200 -1364 985 412 -2210 427 2997 -361 -1244 1921 472 -2646 440
668D40K992l961j393K861q28k460K337J411k446j94J895j372k05K709q76k491
$$ 440 3432 -529 -1922 939 111 -2349 -12 1399 -1047 -1241 654 -718 -923 1786 910 -1581
684a581J997J890k760q09L171q91l145K142K245l010j106K355m72j446J567P65
$$ -1581 416 2306 -454 -1263 1908 1017 -2128 14 2259 -751 -1857 498 26 -1420 147 912
700I12j680N40J015j807J80L049j249k449K168J226l149O5L328j267l060K089
$$ 912 -768 -228 787 -1020 -840 2209 960 -1489 679 1905 -1244 -1179 2149 882 -2178 -89
716h9J245k391j40K302q66j353J817j7j903J413J460j867J1K442j444k370K222
$$ -89 1156 -1235 -1375 927 61 -1292 525 508 -1395 18 1478 -389 -378 2064 620 -1750 472
733D72J436k578k08K558j259k300J729J024j812J15J376j173l23J751k96k018
$$ 472 1908 -670 -878 1680 421 -1879 -150 874 -938 -823 553 -620 -943 808 512 -1506
749a506K060J033k297K43K616j358k667K063J663k429o67K444r54k153J509J130
$$ -1506 554 1587 -710 -467 2149 791 -1876 187 1850 -579 -1246 1198 244 -1909 -400 730
765G30j247K16Q89j515K0K166o44j526J791N31k603L77K851r98k510J524R16j959
$$ 730 -517 -301 588 -927 -907 1259 615 -911 880 1411 -1192 -815 2036 1038 -1472 52 968 -991
783i91q7K115o45j880J062O50q09P73M51j411J50J535o61q71J758N09k750J51
$$ -991 -1078 1037 392 -1488 -426 224 -585 188 639 -772 -622 913 252 -619 1139 1648 -1102 -951
801i51K441q23j778J043Q87j582l83J743l91q80N66J72o99J012Q35j415M0J078
$$ -951 1490 667 -1111 -68 819 -763 -1146 597 206 -674 -108 64 -635 377 1212 -203 -163 915
819I15p27p96J561M74j962l25J714p92j031J101N90j228m66R74k71p3O95l73n63
$$ 915 188 -608 953 1427 -535 -860 854 62 -969 132 722 -506 -972 2 -269 -342 353 -20 -583
838e83Q19O06j093K37J098q69j218J648L29j514k31J161k06j215Q02M68p87P8
$$ -583 236 842 -251 -14 1084 215 -1003 645 974 -540 -771 390 184 -1031 -229 239 -548 -470
856d70N98m43J22R20n57n78Q53K56j089K21J211o33j233Q18O62j066l45P65J77
$$ -470 128 -315 -193 727 170 -408 445 701 -388 -167 1044 411 -822 -4 658 -408 -753 12 189
875A89p80J05M79l29K6J47j28M23L38o79K8O94J52r33J79J031o69r88O04O82j010
$$ 189 -591 -486 -7 -336 -310 -163 -291 132 470 -209 -181 513 665 -268 -89 942 273 -715 -111 571 -439
896d39L9M04J15n85L14J09lO1K13k52J99M55l78m79O85J95j012L7P97j30j077
$$ -439 -400 4 119 -466 -152 -43 -46 15 228 -24 175 630 252 -227 458 653 -359 -322 475 345 -732
917g32M36N31l07n27L90M3q7q6J24M64K04n07k38M61L05l32l07M76J57p53j48
$$ -732 -296 235 -72 -599 -209 -166 -253 -339 -215 249 453 -54 -292 169 474 142 -165 311 468 -285 -433
938d33N71j10m90k5N71j95l70K62K09J22l42J55K01M31n65kJ13K05l14j0J31L02
$$ -433 138 28 -462 -487 84 -111 -481 -219 -10 112 -230 -75 126 557 -8 -10 103 308 -6 -16 115 417
960D17o30k22L25K35r4o90M95L28k54l67M26K85j10l70M55J17l90R9P5K29k83
$$ 417 -213 -435 -110 125 31 -659 -164 164 -90 -457 -31 254 144 -226 229 346 -44 55 130 359 76
981G6l21m1L77nm65J37M56k71m60l6R92l52n24O86M53p51j75N81O3j91j85m0j9
$$ 76 -245 -286 91 86 -379 -242 214 -57 -517 -553 439 87 -437 249 702 -49 -224 357 420 229 44 4 -15
1004a5J72o8l25K08kl12m03J037j08o51J22Q24k14q52P35N92p44m2N95j48k85
$$ -15 157 89 -236 -28 -30 -342 -745 292 184 -467 -345 479 265 -587 148 740 -4 -46 549 401 116
1025A16j41J7k11J82P3m39K62L08l88l53P29K24q14J48Q43l08m33N84K94o11l7
$$ 116 -25 -8 -219 -37 36 -403 -141 167 -221 -574 155 379 -435 -287 556 248 -185 399 693 82 45
1046D5K61j97k60L59l89k77N87P9q24L32Q30q79n62J121L62q91J66P62m21o45
$$ 45 306 109 -151 208 -181 -458 129 208 -616 -284 546 -333 -895 226 588 -303 -137 625 204 -441
1066d41O93N8l46R2M11o65j31P47n99m89P74Qq30L34J113q15q50J216L16q67R9
$$ -441 252 310 -36 56 467 -198 -329 418 -181 -670 104 112 -718 -384 729 -86 -936 280 596 -271 -172
1087a72Q05l68n60O15jn24O6L30n41J77N26l69p34J006n2r06L12J131q38n84J018
$$ -172 633 265 -295 320 319 -205 -139 191 -350 -173 353 -16 -750 256 204 -702 -390 741 -97 -681 337
1108C37N00j108M3R60o30o02P87L9n80L69J59p81R9P35n13m25P46K45j123N06
$$ 337 837 -271 -228 732 102 -500 287 326 -254 115 274 -507 -408 327 -186 -611 135 380 -743 -237
1128b37J221q30q02Q15M11q48K62Q37n17p90O74k42m68P04m6p83R3R47m84n33
$$ -237 984 154 -648 167 578 -270 -8 829 312 -478 196 -46 -514 190 144 -639 -546 401 -83 -616
1148f16J149Oj105L14J072m71q90J016J8q81M14L62n60p5N66l63o28R57J9j148
$$ -616 533 539 -566 -252 820 349 -541 475 493 -388 26 388 -172 -247 319 -44 -672 285 304 -844
1168h44M62J099j009n13J048N06j271L68R65p85m74Q13pq65O88K31o97j4Q55r30
$$ -844 -382 717 -292 -805 243 749 -522 -154 811 26 -448 365 358 -507 181 412 -285 -299 556 -374
1188c74m64J109kr87O60Q34r74p07J287L46j202N26R44q37o71R77k23o82L99M13
$$ -374 -838 271 269 -718 -58 776 -198 -905 382 728 -474 52 996 159 -512 465 242 -440 -41 372
1208C72r76L04P18o94m38R93L13j360P40P68q85n93J375J18j104L42O46o69m43
$$ 372 -604 -300 418 -276 -714 279 592 -768 -28 740 -145 -738 637 755 -349 -7 639 -30 -473
1227d73Q37k39m67N92L1r51K36J042p28m96J096O6j372N21J166p75l21P01J15
$$ -473 364 125 -342 250 281 -670 -434 608 -120 -616 480 546 -826 -305 861 86 -235 466 581
1246E81j040K41O70p01j43Q39n37n94P07m0o77M38P09m91n48R12J63j117M77R57
$$ 581 -459 -218 452 -249 -392 447 -90 -684 23 -17 -694 -256 453 -38 -586 326 489 -628 -151 806
1266H06o22o81R25j27n91M70M79o71k90N30n53l85R73l0p70L10P41p23m62J144
$$ 806 184 -497 428 301 -290 180 659 -12 -302 228 -325 -710 263 233 -537 -227 514 -209 -671 473
1286D73J73j179N74O72o96k92O56r0o24M59J44n98Q1L93l95l54R00L8j068N08
$$ 473 646 -533 41 713 17 -275 381 291 -333 126 270 -328 -247 146 -249 -603 297 335 -733 -225
1306b25Q52r56r7J065P8j021K99N22n33k64Q09m56m60L98J29p17L46O31q20k08
$$ -225 627 -329 -426 639 717 -304 -5 517 -16 -280 529 73 -387 11 140 -577 -231 400 -420 -628
1326f28R08n3q46O08O96q02l27P80R5p47L76M19o30j31N26k91l51O11k7p15L81
$$ -628 280 227 -619 -11 685 -117 -444 336 431 -316 60 479 -151 -282 244 -47 -398 213 186 -529 -148
1347a48M64n26k70P84M5j048O37P62n95l77P06j9o49J82N77o89p4N76m11l26M58
$$ -148 316 -210 -480 304 349 -699 -62 700 105 -272 434 415 -234 -52 525 -164 -238 338 -73 -399 59
1368E9jp10M11O52o55LN96j35n96L89M35m08m29O59j4n27L04K62l91PK06l41j05
$$ 59 58 -652 -241 411 -244 -241 355 220 -376 13 448 40 -389 270 256 -271 33 295 -96 -89 117 -224 -329
1391c29L89Qn51M88K60m87j61O90Q7o92L86K70k44k97M60j16l48J05J96m05K30
$$ -329 60 68 -483 5 265 -222 -383 307 394 -298 88 358 114 -183 277 161 -187 -82 114 -291 -61
1412f1J91m61q7P01k28l19K54K78m68j86P53j5l16J1L69n08n8L57j32j73J25O
$$ -61 130 -331 -418 283 55 -264 -10 268 -200 -386 367 352 36 47 416 -92 -150 207 75 -98 27 33
1434C3l99K59L46n48J06K53q3k46M22K77m68j49L79K9l39N5K42l51K9R2p6j70
$$ 33 -366 -107 239 -309 -203 50 -33 -279 143 420 -48 -197 182 211 -128 -73 169 -182 -153 -61 -137 -307
1456c07L64k58l0K39j02k2l56Q40k68k80L15K88k27k45J87J0k35J60K41n38J03
$$ -307 57 -201 -231 8 -94 -116 -472 368 100 -180 135 423 196 -49 138 148 -87 73 314 -224 -121
1477a21q9j0J16J24q9j75L98R8l23r2M68j57l86M42K54k41l38K14P4j87J63k80
$$ -121 -210 -220 -104 20 -69 -244 154 252 -71 -163 305 148 -238 204 458 217 -121 93 167 -20 143 -137
1499a37L0Kpn1R7J00J5k40K0K18r1r7K78J06l36J85N4P6j69j19J26L1k17J37j00
$$ -137 -107 -105 -112 -163 -66 34 49 -191 -171 47 -44 -141 137 243 -93 92 146 222 53 -66 60 91 -126 11 -89
1524h9J68k76j51L88n9Nq9J56J29j49j14N9L24k27k76J99K40l03N4LP7j80P2q2
$$ -89 79 -197 -348 40 -19 -14 -103 53 182 33 -81 -22 302 75 -201 -2 238 -65 -11 -8 69 -111 -39 -121
1548a21n3m6O3N5Q8J53l27L21k13J69j79K4L72k43j36J33Jj52j7L7K24k97K5K10
$$ -121 -174 -220 -157 -102 -14 139 -188 133 -80 89 -90 -66 306 63 -73 60 61 -91 -108 -71 153 -144 -119 91
1572I1j05k44K57k19J99M5j12J31J24J36k80j50J24J06j47k9K10q9l23K27O3j37
$$ 91 -14 -258 -1 -220 -21 24 -88 43 167 303 23 -127 -3 103 -44 -73 137 48 -275 -48 15 -122
1594a22J79j02K39o7o9P3m6k7L5l4L4n0M8j37J19O8j26k45M75j39l53R1K28j83
$$ -122 57 -45 194 127 58 131 85 58 93 59 93 43 91 -46 73 141 15 -230 245 106 -247 -156 72 -111
1618a11Q0L9on3K64j40o0l4J93k58J35J63j32l57K30l6p9J25M4J9l58L89j58m4
$$ -111 -31 8 2 -51 213 73 13 -21 172 -86 49 212 80 -277 -47 -83 -162 -37 7 26 -332 57 -101 -145
1642a45j33M05j80J71kJ9k02K00M0m33K33L52m77k45M09K39m46R5K82l42n8M05
$$ -145 -278 127 -53 118 116 135 -67 133 173 -260 -27 325 -152 -397 12 251 -195 -100 182 -160 -218 187
1664A87j1j49k02N21l45n0L74l00j17J0M33k97q8L05m83j33K89K66m17J38K42
$$ 187 176 27 -175 346 1 -49 325 25 -92 -82 351 54 -34 271 -212 -345 -56 210 -207 -69 173
1685A73j21j96M9K88m40J76J41j07L04j13j63j62K93O7m29J46L18k08l77L60O3
$$ 173 52 -144 -95 193 -247 -71 70 -37 267 154 -9 -171 122 189 -240 -94 224 16 -361 -1 62
1706F2l25J09K14j03r5K60J7k36Q9K54k75k8L30k61k64L59J01m77N7M51m30p6
$$ 62 -263 -154 60 -43 -138 122 139 -97 -8 246 -29 -57 273 12 -252 107 208 -269 -212 239 -191 -267
1728b67L81o2j67JJ61l3j17J96qk21M25mo66K89L50l38j65M28r8m13K30L29m16
$$ -267 114 52 -115 -114 47 14 -103 93 85 -136 289 285 -381 -92 258 -80 -245 183 85 -328 -98 231 -185
1751a85l7K77J77l42K41J23k51l2L68j96l90L16K2l30K58M33m48k92M65o9l63
$$ -185 -222 55 232 -110 131 254 3 -29 339 143 -247 69 91 -239 19 452 4 -288 177 108 -255
1772b55J19M64m23k94N68k06j49K21K08l85N9K41o9k58M22j0n20O8K99j08l33
$$ -255 -136 328 -95 -389 179 -27 -176 45 253 -132 -73 168 99 -159 263 253 -267 -199 100 -8 -341
1793c41N40q1m27J18M87m24j34M00n5j2R0J60m38J45J53j96k31M74j20l44J06
$$ -341 199 118 -309 -191 296 -128 -262 138 83 71 161 321 -117 28 181 -15 -246 228 108 -236 -130
1814a30L74m66JK71L2k68J04K67k79Q8K98j68k28J52K49m37J76K20l13k26N69
$$ -130 244 -222 -221 50 82 -186 -82 185 -94 -6 292 124 -104 48 297 -140 36 256 -57 -283 286
1835B86k22m46L77J88j62k02L48j35k13J46L34k66mJ58j83j86K58N9k25J17K65
$$ 286 64 -382 -5 183 21 -181 167 32 -181 -35 299 33 29 187 4 -182 76 135 -90 27 292
1856B92l55j81L02n2k45K09K30k16k52M41j24k29K41N9j67Q4J65j89j50M50k22
$$ 292 -63 -244 58 6 -239 -30 200 -16 -268 173 49 -180 61 120 -47 37 202 13 -137 313 91
1877I1j92J21J95l61n6L56Qm52K62J91n61L64K02Lk04J70Q2l17J26J81k46l8K82
$$ 91 -101 20 215 -146 -202 154 162 -290 -28 163 -398 -34 168 171 -33 137 219 -98 28 209 -37 -75 207
1900B07J14n73J91L08l83M4J49o5k68K01K86l47J10L36k30k34K34Q9k86K22J68
$$ 207 321 -252 -61 247 -136 -92 57 -8 -276 -75 211 -136 -26 310 80 -154 80 169 -117 105 273
1921B73k42l03L72j89k01L56O8j92k66M62k04j54J64L90m19J06J24j0j42q7OR7
$$ 273 31 -272 100 -89 -290 66 134 -58 -324 138 -66 -220 -56 334 -85 21 145 135 -7 -94 -88 9
1943IJ54L5k36j45L63j07j98J76J06k74j59L51L6l44K62R9j25J2J18j03l62M41
$$ 9 163 198 -38 -183 180 73 -125 51 157 -117 -276 75 111 -233 29 128 3 15 133 30 -332 109
1965A09j05o6J37J61m03m3M64l57j45K33J45l67l1N73p2k14N8QPj89K85j26j30
$$ 109 4 -62 75 236 -167 -210 254 -103 -248 -15 130 -237 -268 305 233 19 77 85 92 -97 188 62 -68
1988f8L37l20k24K07J09j46M9JJ43k51J79J15l81K77J73l35J03k2P9j04L3J46
$$ -68 269 -51 -275 -68 41 -105 -56 -55 88 -163 16 131 -250 27 200 -135 -32 -54 25 -79 -46 100
2010A00o5NJ36k79j76K44P7rj33L13j43k31J66J25k01L9K40k15M5J21k75m0J55
$$ 100 35 40 176 -103 -279 -35 42 33 -100 213 70 -161 5 130 -71 -32 208 -7 38 159 -116 -156 -1
2033aJ99j07o2R0M9l52K11O6l24K53k1K3m2k4J41l73L05k8Op6J10Q4pk35L19k10
$$ -1 198 91 29 119 168 -184 27 93 -231 22 1 24 -18 -42 99 -274 31 3 9 -67 43 127 120 -115 204 -6
2059fk17N85m60j75M27o2l12J61J06k8j88L01k18J78r4K05j50m7K9M3k24J09o4
$$ -6 -223 362 -98 -273 154 92 -220 -59 47 19 -169 132 -86 92 -2 203 53 6 35 78 -146 -37 -101
2082a01N1Q3l1nk83L61l5j91J69q4J34m7QK01m1j06l3%q7K07o8j18J37R6k40j61
$$ -101 -50 33 2 -3 -286 75 40 -151 18 -66 68 21 29 230 189 83 50 50 -37 170 102 -16 121 217 -23 -184
2108a84M21j75Qj91J80O3l21R0K5J85p9P7j67J14J2j22o2p9J75o6J37r8J04k56
$$ -184 237 62 70 -121 59 122 -199 -109 -84 101 22 99 -68 46 58 -64 -126 -205 -30 -96 41 -57 47 -209
2132b09K13l1j80J93J14M9l8k11J58P9j22k8o3M1R1Lm1K3l0l4l2j6j4M0J79j91
$$ -209 4 -27 -207 -14 100 149 111 -100 58 137 15 -13 -76 -35 56 59 18 41 11 -23 -55 -71 -85 -45 134 -57
2158e7Q2M6J7J72k36O6j24J62k02k8R6K2l3J16N1j56l6O9j61N9J85k29P9M7L4
$$ -57 25 71 88 260 24 90 -34 128 -74 -102 -6 16 -17 99 150 -6 -42 27 -134 -75 110 -119 -40 7 41
2183D1l9KJ6J7j2J25j98j47K07p2J2K3J81j05k26P5J37j30J00J14j77J63ml1m6
$$ 41 2 4 20 37 25 150 -48 -195 12 -60 -48 -25 156 51 -175 -100 37 -93 7 121 -56 107 103 72 26
2208B6j87K05k7j71J69J1P5N5m5o2j5l3L0k01L08j38k1j46J98j86J96pJ76j96
$$ 26 -161 44 17 -154 15 26 101 156 111 49 34 1 31 -170 138 0 -21 -167 31 -155 41 34 210 14
2232A4n2J94r0o5J74k21j68L52m8j08n9J52m2j96Kl8K65m4O3k6n9R5l1j18P3j3
$$ 14 -38 156 66 1 175 -46 -214 138 90 -18 -77 75 33 -163 -161 -199 66 22 85 59 0 95 64 -54 19 6
2258Fm1R1l9J0r6J53J8k14J41n9Lj77K36J9r4N2J26j43j11J86n6o5J96k6r6j62
$$ 6 -35 56 17 27 -69 84 102 -112 29 -30 -27 -204 32 51 -43 9 135 -8 -119 67 11 -54 142 116 20 -142
2284a42J3J30j71J44p0J66k14J21j16N2J52J67m05J27K37k59kK49j84M8j09K20
$$ -142 -129 1 -170 -26 -96 70 -144 -23 -139 -87 65 232 -173 -46 191 -68 -70 179 -5 43 -66 154
2306A54k75J20j04Qr2J32J29j14J52k6j71k12O61l75j48P4K64j79j85J62J31k48
$$ 154 -121 -1 -105 -97 -189 -57 72 -42 110 84 -87 -299 362 -13 -161 -87 177 -2 -187 -25 106 -142
2328a42K35J05j96l2P0k27M0K33l9K2p9K33k78r6J28P2o0N8J96k60M2o4n2Q2j25
$$ -142 93 198 2 -30 40 -187 -147 86 47 69 -10 223 -55 -151 -23 49 -11 47 243 -17 25 -39 -91 -9 -134
2353a34K30n8j55K45j82m2J95k32k1K5K99j66j09L28j55k91M70K6m80j55K89q0
$$ -134 96 38 -117 128 -54 -96 99 -133 -154 -129 170 4 -105 223 68 -223 247 273 -207 -362 -73 -153
2375a53O1j8Q8l08K30L8l3m1J36j8o7P9Q2j78J28j12J01j34J83Pk30J15J49j66
$$ -153 -92 -110 -22 -330 -100 -62 -95 -136 0 -18 -85 -6 76 -102 26 -86 15 -119 64 71 -159 -44 105 -61
2399f1jq6K23j24j67L97j16k76K52K60l30J31R7j40o3K61j98j88O9R3j90J79N7
$$ -61 -62 -148 75 -49 -216 181 65 -211 41 301 -29 102 199 59 -4 257 59 -129 -60 33 -157 22 79
2422G9j86j18J66J05j84J49J15j19r6J50J40l17K01K29l82m7K41j09p2J41K7j76
$$ 79 -107 -225 -59 46 -138 11 126 7 -89 61 201 -116 85 314 -68 -115 126 17 -55 86 113 -63
2444f3J70nq3j20J04m3l7Kk5Q6k29L54j6j84J51n6j0lJ7L4j67J90O4l33J31J48
$$ -63 107 102 19 -101 3 -40 -77 -75 -100 -14 -243 111 95 -89 62 6 -4 -7 10 44 -123 67 131 -202 -71 77
2470G7j24j18L36k3l79L49Q0k79j0J27pj22K24n4k12K8K02k14l5K34L4k43Q5J02
$$ 77 -47 -165 171 148 -231 118 198 -81 -91 36 29 -93 131 77 -135 -107 95 -119 -154 80 114 -129 -44 58
2494E8k31R1J95l5j65L16o9l56K48Oq5j09J89M6j98P8J66k87L3J27k09O6j2M14
$$ 58 -173 -82 113 78 -87 229 160 -196 52 58 -27 -136 53 99 -99 -21 145 -142 -109 18 -191 -125 -137 277
2518B77k07j80L76k16m4J79k66R6r7K42q7j44L18k23j03O8j0j08J6K95j51k55
$$ 277 70 -110 266 50 6 185 -81 15 -82 160 73 -71 247 24 -79 -11 -21 -129 -113 182 31 -224
2540b24L75j74J21p0J63j05j87N5k8K04j63J91j05k37L80o8j06k9J62o0j25n9
$$ -224 151 -23 98 28 191 86 -101 -46 -74 130 -33 158 53 -184 196 128 22 -7 155 95 -30 -89
2562h9J57k24J64J8p2m4J28n2L5J3r8N3J3n2m4P9j0Jj46K39k3q8L5K29k70k9J65
$$ -89 68 -156 8 26 -46 -90 38 -14 21 34 -64 -11 2 -50 -94 -15 -25 -24 -170 69 46 -42 -7 222 -48 -77 88
2589H8m0r6m3K63J3k76J19J0j99L0N8n5Q7j48K00o8J24J3j6j04R9j34J02J03M0
$$ 88 48 -48 -91 172 185 -91 28 38 -161 -131 -73 -128 -41 -189 11 -57 67 80 64 -40 59 -75 27 130 170
2614A70k60q0K52K5k17J0K55k96j5K22q3n1PJ17j36QJ25l09P2K41R1j5l46L23
$$ 170 -90 -170 82 107 -110 -100 155 -141 -156 66 -17 -68 -61 56 -80 -72 53 -256 -184 57 148 133 -213 110
2638A10k87L21j81L5o9J9K09m14K50j1j7J16J4Q9j81J46j01o4J22O7j29o0M3R0
$$ 110 -177 144 -37 -2 -71 -52 157 -257 -7 -18 -35 81 95 184 3 149 48 -16 106 173 44 -16 27 117
2662A17n9J10k35J88m6r8J94j06K9m4m9m3lQ3l3m8K09j82j05k4L05j36R4j46p8
$$ 117 58 168 -67 121 75 -23 171 65 94 50 1 -42 -45 38 5 -43 166 -16 -121 -145 160 24 118 -28 -106
2687a06M0j09K83N0j77%k7N9J3J2r7O0L3l5J46J7j48J00M5k90J74m8K4q8L6J03
$$ -106 -66 -175 108 158 -19 -19 -46 13 26 38 -59 1 34 -1 145 162 14 114 159 -131 43 -5 19 -69 -33 70
2713G0j09p1K22j81L9oR4j04n6J20J30j11q1N1J08k78J88J66k90J85j84Q9n1J
$$ 70 -39 -110 112 -69 -30 -36 58 -46 -102 18 148 37 -44 7 115 -163 25 191 -99 86 -98 -9 -60 -59
2737e9K4J11o6k0M1jj35K2R8K7K3j48m4J10l2n0J08j58J23L3j4J36l4m3l3m2R9
$$ -59 -35 76 10 -10 31 30 -105 -83 15 42 65 -83 -127 -17 -49 -99 9 -149 -26 7 -7 129 95 52 19 -23 76
2764G6j85J37J12l51K86p5P5M2j77Q0J38j14j78J72k15K46n4j59Q4l6J66l1j29
$$ 76 -109 28 140 -211 75 0 75 117 -60 20 158 44 -134 38 -177 69 15 -144 -60 -96 70 39 -90
2787i0P5J4N8j22M8Rlo8j7J00K9K1p5Q3K1k00R0q1j83K76j11j1K05q1KJ42k4m6
$$ -90 -15 -1 57 -65 -17 -8 -11 -79 -96 4 33 54 -21 62 83 -117 -27 -108 -291 -15 -126 -137 68 -13 -11 131 107 61
2815F1k5n1o4K69kj49J17j46K07k50Nl6J1r1J73R2j00J51l9j54o5N0k9Q2NR4j64
$$ 61 36 -15 -79 190 188 39 156 10 217 -33 -28 -64 -53 -144 29 121 21 172 133 -21 -86 -36 -65 17 22 116 -48
2842d8q2P6J5l4K46j71k2r4N7J62j50J88m5Lq1k4r6J73k02K76k71J64Lq0m5J92
$$ -48 -130 -54 -39 -73 173 2 -20 -114 -57 105 -45 143 98 101 20 -4 -100 73 -129 147 -124 40 43 -37 -82 110
2868A10q2k29O8k7L3J36J49k17j37K54j28PM1J22l6r8Q4j07J6J12J7j4q8l8n9
$$ 110 28 -201 -133 -160 -127 9 158 -59 -196 58 -70 -63 -22 100 64 -34 50 -57 -41 71 88 74 -14 -52 -111
2893a11%O2J63P3l36P6O2M9r1J65nl44M30l17O9K2L2j43J52M6j46J25o3J7k0o2
$$ -111 -111 -49 114 187 -149 -73 -11 38 -53 112 107 -237 193 -124 -55 -33 -1 -144 8 54 -92 33 -30 -13 -33 -95
2919i5k1J81j38J12k21J11J47j86J4K33j04l1j47LOJ60r1M3%L7J38j14j80J13
$$ -95 -116 65 -73 39 -182 -71 76 -110 -96 137 33 2 -145 -142 -136 24 -67 -24 -24 13 151 37 -143 -30
2943c0P4K7j43M7j67Q1O7J81p7p8J21j14PJ9k9m4o9J57j8k7j24M2p3L5J89Q9j30
$$ -30 44 71 -72 -25 -192 -111 -44 137 60 -18 103 -11 -4 15 -14 -58 -127 30 12 -15 -139 -97 -170 -135 54 143 13
2970A3J27j72L1l5Q1k25J80R0j39J40j80J32l7L9N6k51J39O7j47P2J41pj76J17
$$ 13 140 -32 -1 -36 45 -180 0 90 -49 91 -89 43 6 45 101 -150 -11 56 -91 -19 122 115 -61 56
2994E6J06j79L9J18j65m8M5N9o0n2J48P3k20Q7j66L4R5J82j41R9R9l7j17p3J6
$$ 56 162 -17 22 140 -25 -73 -28 31 -29 -81 67 140 -80 7 -159 -125 -30 152 11 110 209 172 55 -18 -2
3019bl4k6N7N1j00J02N5j61J6K55j45j88J12J16j45KnR6n9j1O0j90J90p7j65K46
$$ -2 -36 -62 -5 46 -54 48 103 -58 -42 213 68 -120 -8 108 -37 -35 -40 56 -3 -14 46 -144 46 -31 -196 50
3045E0j1N4J03j08j73P7m8J99j79j04Q3N2j27J89L1j2j93K82j30j25O7j09K6N
$$ 50 39 93 196 88 -85 -8 -56 143 -36 -140 -57 -5 -132 57 88 76 -117 165 35 -90 -23 -132 -106 -101
3069a01J35j16m7J89k4l0M2O6k10J52Qn1j06K6J65ro9j13K03n5j52J47O1k7j0
$$ -101 34 -82 -129 60 36 6 48 114 -96 56 64 13 -93 -67 98 89 20 -93 110 55 -97 50 111 84 74
3094G4j37L7J57K5k66P3L14m69L7K25m3k00P5K48j24q1J64k2o8Nn2J82k39M27
$$ 74 -63 -26 131 156 -110 -37 277 -192 -155 70 27 -173 -98 150 26 -55 109 87 19 24 -28 154 -85 342
3118C42l63N0M6j09j89K70mj08P5N9j2l1l06L22j81K45p9j23J09k5L3j24L24k78
$$ 342 -21 29 75 -34 -223 47 43 -65 10 69 57 26 -280 42 -139 106 27 -96 13 -12 21 -103 221 -57
3142e7o6J82O7k77K39k9j16Lj77K94p1j58L05r5k2n3rJ76j25oK58k93r1J46L9
$$ -57 -123 59 126 -151 88 59 -57 -54 -231 63 -8 -166 139 44 22 -31 -40 136 11 5 263 -30 -121 25 64
3167F4k35K76m7J3R8kj09n5j47K00n0N5J02q3j84J50Oj78J57P8j11M9P4k09K2
$$ 64 -171 105 58 71 169 167 58 3 -144 56 6 61 163 80 -104 46 52 -126 31 109 -2 47 121 -88 -66
3192f6R8k5k04K55j2O6p7k3N1q0J77j74P5j40M5k7JJ29j4j51RJ59j11J08J3j59
$$ -66 32 7 -197 58 46 112 35 12 63 -17 160 -14 61 -79 -34 -61 -60 69 55 -96 -87 72 -39 69 82 -77
3218g7J92l3l6K9q7J19j41K4L4j04J39j40L6n3P3J27J31k53R6M6j76K4j90K7J75
$$ -77 115 82 46 75 -12 107 -34 -10 24 -80 59 -81 -45 -98 -25 102 233 -20 76 122 -54 -30 -220 -193 -18
3243a8q4J85K8j53M0j71K33m5r8Q5o6QP4r2j4p7K19k7Q8m8j65J00j1J10o2o3l0
$$ -18 -102 83 111 -42 -2 -173 60 15 -83 2 -64 -56 18 -74 -88 -165 54 27 115 67 -98 2 -9 101 39 -24 -54
3270e4O3N7m0j54N7J94m7j01l5J65j44K4J54k23K26j59M1o9Q8j39J04J19j90n1
$$ -54 9 66 26 -128 -71 123 76 -25 -60 105 -39 -15 139 -84 142 -17 24 -45 43 -96 8 127 -63 -114
3294a14O0M0j69P7K78k93J28o0J86Qj56M2Q9j34K6o5J80k7k49J80q9O9M1J18j35
$$ -114 -54 -14 -183 -106 172 -121 7 -53 133 141 -15 27 116 -18 8 -57 123 96 -153 27 -62 7 48 166 31
3319C1q0R0p7J32k44O1N0L1M5l8r1P0O8PN7l78K60J30j95J04l9m8m3N2k0J93j31
$$ 31 -49 41 -36 96 -148 -87 -37 -6 39 1 -90 -20 48 55 112 -266 -6 124 -71 33 -6 -54 -97 -45 -65 128 -3
3346cJ62L8k36n6K1J25oq1J80k43Q9N8P8Jk18O8j22K55j9m0j12J74k40j5J64q1
$$ -3 159 197 -39 -95 -74 51 45 -36 144 -99 -10 48 126 127 -91 -23 -145 110 91 51 -61 113 -127 -142 22 -59
3372e9jj02J15q7J09K20j01k27J48j06K28j85J13j15L9l7O7j41l5J35K7jo3j7
$$ -59 -60 -162 -47 -134 -25 195 94 -133 15 -91 137 -48 65 -50 -11 -48 19 -122 -157 -22 5 4 -59 -76
3396g6J81j2r9J45p9J4qj5j01l7L1K58l23R4Q8K9k37L70q8p1o4K0k30L29k8j73
$$ -76 105 93 -6 139 60 74 66 51 -50 -87 -56 202 -121 -27 61 90 -147 223 135 64 0 20 -210 119 91 -82
3422h2R8J4k0m6L4j24L0J25K69l30j01J01qP8P5j89J97j13j27K29r2p8l6n8J97
$$ -82 16 30 10 -36 -2 -126 -96 29 298 -32 -133 -32 -40 38 113 -76 121 8 -119 110 18 -60 -96 -154 43
3447D3p3Q3j12K20j91n4J55j77Q3j32J71q5m6l8O7n2J53j19J71n0j76K13r4J20
$$ 43 -30 53 -59 161 -30 -84 71 -106 -23 -155 16 -69 -115 -153 -86 -138 15 -104 67 17 -159 54 -40 80
3471H0k98L16m3KJ9q3n6K53k21J8L4j67J71J62j23j3j17R2k15J48RN4n2m6J56
$$ 80 -218 98 55 57 76 -7 -63 190 -31 -13 21 -146 25 187 64 51 -66 26 -189 -41 -32 22 -30 -76 80
3496H0k44Q7J98j87L9J01l4R1k57J58j23k7J67j2J74j82J7n2J4P7j28J9M3J15
$$ 80 -164 -77 121 -66 -27 74 40 131 -126 32 -91 -118 49 37 211 29 46 -6 8 85 -43 -24 19 134
3520A34j35M7p6j40n6J74r0n8o6K02JlJ45j66KJ06L9j48J70p6J0Lp1J03m1l9j20
$$ 134 -1 46 -30 -170 -226 -52 -142 -200 -266 -64 -63 -66 79 -87 -85 21 60 -88 82 6 16 19 -52 51 10 -29 -149
3547a49J45mR7P6j05k82O8L51j51m4J99k99R4Rn3M0mm6P8k8J5M4Rp9n8N5QO6l
$$ -149 -4 -8 89 165 60 -222 -154 197 46 2 201 -98 -4 5 -48 -8 -12 -58 20 -8 7 51 60 -19 -77 -22 -14 52 49
3576D9o4J34j35J90q5j46J27j31Q0j46J90j40l2j21K99o0MJj82J53j47J11J09
$$ 49 -15 119 -16 174 89 -57 70 -61 19 -127 63 -77 -109 -230 69 9 13 14 -168 -15 -162 -51 58
3599E8o4RJ60j66n2J08j33R6J45p7K0j65q7J11j22R8J49j71K9L0m6l1J47J17k16
$$ 58 -6 3 163 -3 -55 53 -80 16 161 84 104 -61 -148 -37 -159 -61 88 -83 -54 -24 -70 -101 46 163 -53
3624e3P0j47ON7pJ58j58J69J8j84L6J05j24J0mL5J29k02N9q7j5K37k46J41j34
$$ -53 17 -130 -124 -67 -74 84 -74 95 113 -71 -35 70 -54 -44 -48 -13 116 -86 -27 -114 -129 108 -138 3 -131
3649a31K36j19q5J25N8j46J44L6j84J31j69J45p8m7K41l14Q9J93m4M3j28K7j66
$$ -131 105 -14 -99 26 84 -62 82 118 -66 65 -104 41 -37 -84 157 -157 -68 125 81 124 -4 23 -143
3672a43L70l02K04j96L7J22j68N7lR2k41L29j14K1J61j86j01J99j10k15K34J6
$$ -143 227 -75 129 -67 -30 92 -76 -19 -22 70 -171 158 44 65 226 40 -61 138 28 -187 47 63
3694F3Q5k15L1J64n3j00K4J13j63Q4k0p6J01Mq1pK56l36O3J95j82j46J80R9q3
$$ 63 148 -67 -36 128 75 -25 -1 112 -51 33 13 -63 38 42 -39 -46 210 -126 -63 132 -50 -196 -16 83 0
3719@Lj2K1r0k8Q1J7k3n1J55q9Q1j37n0J25j24K78j51j48J99j68J29k6J69l50
$$ 0 3 -9 12 -78 -106 -25 -8 -31 -82 73 -16 65 -72 -122 3 -121 157 6 -142 57 -111 18 -8 161 -189
3744a89K95l1k53K11n5r0J18LJ01r8j14j2O2P0k9P5k03R5K17k93J55k1n6N3J39
$$ -189 106 75 -178 33 -22 -112 6 9 110 12 -102 -114 -52 18 -11 64 -139 -44 173 -120 35 14 -42 11 150
3769A50k01j31Q0K13n0j78J54k06K64j09J67k22J49K3j26J17jR8j94J82k14l3
$$ 150 -51 -182 -102 111 61 -117 37 -169 95 -14 153 -69 80 103 -23 94 93 191 -3 179 -35 -68
3791f8K27k03R8j75K08j47J43j07K33l3j30j08jP3j27P8Qj9K52k63J52j67K0O2
$$ -68 159 -44 54 -121 87 -60 83 -24 209 176 46 -62 -63 10 -117 -39 -31 -50 202 -61 91 -76 -56 6
3815Fj33L6J81j04OL6n9N7lN1j62K4J32j26p0j00J41L5m5M1k0l5M1O7j01P3L2
$$ 6 -127 -91 90 -14 -8 28 -31 26 23 74 -88 -64 68 -58 -128 -228 -87 -52 -97 -56 -76 -111 -70 -3 -104 -31 1
3842Aj76K2L37j98j3R0k8m7j2J1o0J9J5n1J90j08P1K6k7q7k41J89J29rN9l12K53
$$ 1 -175 -153 184 -14 -27 63 35 -12 -24 -13 -73 -54 -39 -90 100 -8 63 89 62 -25 -266 -77 52 43 102 -210 43
3869D3n6r7K69K6k33k2J80l12L44K0k28L6J44j07j21LJ97k07Q7l8J0r7J82M9j11
$$ 43 -13 -110 159 185 -48 -70 110 -202 142 162 -66 -30 114 7 -114 -111 86 -121 -34 -72 -62 -159 23 72 -39
3894c9J28p2j2M3K0j48j69L33j3n2p8P4O6m6j12K49j54MnJ5J01q1n5K%j70K31
$$ -39 89 17 5 48 68 -80 -249 84 71 19 -59 15 81 35 -77 172 18 22 17 32 133 52 -3 -1 -1 -171 60
3921F0q8K10L2j11j58Q5j6j24K68k81O8j5M0J19j66P4lJ96j41k22J56Q9j32J68
$$ 60 -28 182 214 103 -55 30 14 -110 158 -123 -55 -70 -30 89 -77 -3 -6 190 49 -173 -17 72 -60 108
3945A08k02J41j38p3J47o3O6J35Mj36J5J01p7K4J70n2l22K51Q6m16K87k04K75
$$ 108 -94 47 -91 -164 -17 -80 -14 121 125 -11 4 105 28 52 222 170 -152 99 185 -231 56 -148 127
3968A27j50L2J6p3J02P6j11P4j12j11K38j48J55j40q2J82j88N4N9mL9R8j66q9
$$ 127 -23 9 25 -48 54 130 19 93 -19 -130 108 -40 115 -25 -107 75 -113 -59 0 -4 35 133 -33 -122
3992a22K40q0k14Q9J07K3o7R9k11J52m8M1R0r0oj21N7j6J68q2J3O9j48J4oR1j25
$$ -122 118 38 -176 -87 20 43 -24 75 -136 16 -32 9 99 9 3 -118 -61 -77 91 9 22 91 -57 -43 -49 42 -83
4019h3J99j07l0K9K12j30j00K0K24k06o6K8M2l0P5q3L7j00R4kK2J23k01m0J25
$$ -83 116 9 -21 8 220 90 -10 10 234 28 -38 -10 32 2 77 -6 31 -69 25 23 45 168 -33 -73 52
4044E2j31J24Q1l12K15k6k11J62j21P7kK8K7J05k18M8J48qLj45J37N7r0R3k14
$$ 52 -79 45 126 -186 29 3 -208 -46 -167 -90 -92 -64 -37 68 -150 -102 46 38 41 -104 33 90 0 93 -121
4069a21K56k37N0J60K7n1j0N7j71l9J24p3m3J67m7K0j3k20J38j03O8m2Q6K40j78
$$ -121 135 -102 -52 108 135 84 74 131 -40 -79 45 -28 -71 96 49 69 56 -164 -26 -129 -61 -103 -17 223 45
4094D5q8K2Q3O0J4lj55N0Q5j51J82l62J37J85k24K2R8j45J44j70L07k01J56j33
$$ 45 -43 -21 62 122 136 133 -22 28 113 -38 144 -218 -81 104 -120 -98 0 -145 -1 -171 136 -65 91 -42
4118d2j4O4N8k0J02k67J02O6j70K63k31P2M4k01Q4J54o7J51k25NJ29q8K4n7M4
$$ -42 -56 8 66 46 148 -119 -17 49 -121 142 -89 -17 27 -174 -90 64 -3 148 -77 -72 57 -31 -7 -64 -20
4143b0M2L6j25R9J55k72l5O3M2R6k67K49Ko0J01k9o4j80J56j29J89l9j76J26R0
$$ -20 22 58 -67 32 187 -85 -120 -57 -15 81 -186 63 65 5 106 77 13 -167 -11 -140 49 10 -166 -40 50
4168E0N2r2K1m3p2L3j42O1J46r0K15r4j12K08j35J54L2j27p0m9N8n2RR9k09K40
$$ 50 102 10 31 -12 -84 -51 -193 -132 14 -76 139 45 -67 141 6 160 192 65 -5 -54 4 -48 -39 60 -149 91
4194I1k67J80p0JL10l35M4J33r9n2rJ13J3Qj59N6J28n3J2n8RM6mj14o4K2N6j1
$$ 91 -176 4 -66 -65 245 -90 -46 87 -12 -64 -73 40 53 61 -98 -42 86 33 45 -13 -4 42 38 -76 -140 -118 -62 -73
4222g3J10p3j94L49r4P1k07J69m7r7J87j23J85j02L0m3k22K01q5j36J99k7j0j3
$$ -73 37 -36 -230 119 25 96 -111 58 11 -86 101 -22 163 61 91 48 -174 27 -58 -194 5 -22 -32 -45
4246d5J11j16j60J48K24j00K44m11J46q3N4%J6k28J98Pn5K15j89J6j73P5J7P5
$$ -45 66 -50 -210 -62 162 62 306 -105 41 -42 12 12 28 -200 -2 5 -50 165 -24 -8 -181 -106 -89 -14
4270a4J0R2l50L91r5o8k9j75K96r8n9O4J18j52K33k11Q0N5j04n4O1n9J30j71J3
$$ -14 -4 88 -262 129 34 -34 -63 -238 58 -40 -99 -35 83 -69 164 -47 33 88 -16 -70 -9 -68 62 -109 -96
4295i6Q2r0J48m6J23j67l4J86RO9q6p4N9l3n4J43J1j17q1J75j32R2m7OK3r1J99
$$ -96 -14 -104 44 -2 121 -46 -80 106 115 184 98 24 83 50 -4 139 150 33 -48 127 -5 87 40 46 69 -22 177
4322A77N1l02jN9L9J8j74K03r7Q0kK6m2J47m2k31J10j3O7j12R3M8j99K31j92M2
$$ 177 228 -74 -75 -16 23 41 -133 70 -27 53 51 77 35 182 140 -91 19 6 73 -39 54 102 -97 134 -58 -16
4348a6J8J06k26J84J6k1qp8o5Q0j73J69J5rM1l5k1J06j42K02n4j38n1J18n3Mj27
$$ -16 2 108 -118 66 82 61 53 -25 -90 -10 -183 -14 1 -8 33 -2 -23 83 -59 143 89 -49 -100 18 -35 -31 -158
4375a58L05k13J7K7L8On9K00j95O6n2J28j41Q9p0l5K5N4J1Jl3l0K7j20N4K71k20
$$ -158 147 -66 -49 -22 16 22 -37 163 -32 34 -18 110 -31 58 -12 -47 -22 32 43 44 11 -19 8 -112 -58 213 -7
4402gJ42r9qL2k53J54l8J16m4J56m0pp7Q6n6l8o6K72k80JN6K06j73j07J23j49
$$ -7 135 36 28 60 -193 -39 -77 39 -5 151 111 104 27 113 57 19 -47 225 -55 -54 2 208 35 -72 51 -98
4428i8L05n3l54J10j02K55pK3j19J29k54K90k34J28qO0kl4j40J6K05j02l5lk0
$$ -98 207 154 -200 -90 -192 63 56 79 -40 89 -165 125 -109 19 11 71 69 35 -105 -89 116 14 -21 -24 -44
4453d4K35m0l23K12R3q4j36P9p3K24k39j36MJ92mK26k95K45j44Qj3M6P2j88R0
$$ -44 191 151 -172 40 133 49 -87 -8 -81 143 -96 -232 -228 -36 -40 186 -109 136 -8 0 -13 33 105 -83 7
4478GK6p9J75j6p6P4Qk62M0J09j14J18P4m3m9R8j59J27on2j57K9K32j29j0l5K7
$$ 7 33 -46 129 113 37 111 119 -143 -103 6 -108 10 84 41 -8 90 -69 58 52 0 -157 -128 104 -25 -35 -70 -43
4505d3j90J46J36j0k5q1N5k5O9j29R8KP9o7m9P6M9j16Q9Lj83J25oo4O1rj8J28
$$ -43 -233 -87 49 39 14 -67 -12 -37 32 -97 1 3 82 15 -34 42 91 -25 64 67 -116 9 3 -61 0 -9 -27 101
4533A01j52KN9O1j62J62o7q7m6J26M0J01k64Q8P6j6R2j76J49j70L3J80j20j41
$$ 101 -51 -49 10 71 -91 71 4 -83 -129 -3 37 138 -126 -38 38 22 114 -62 87 -83 -50 130 10 -131
4557a31M4N6M9qj2O2pj05J43K7o8n1j26M0P9J00o5N9p7r4Q4M8k0p2J2O3q1p7J8
$$ -131 -87 -31 18 10 -2 60 53 -52 91 118 50 -1 -127 -87 -8 92 27 86 9 -85 -1 47 27 -45 -33 30 -51 -128 -110
4586a10k1J06r8L07n1j43L4q2J38j43P6J17l82L20q3m6Q4q4J08j94J19L0p6q0
$$ -110 -131 -25 -123 184 133 -10 24 -58 80 -63 13 130 -252 68 -15 -61 23 -61 47 -147 -28 2 -74 -154
$$ [...]
8191d0
##END NTUPLES=NMR FID
##END=
