##TITLE=1H_DE-80H_X3
 200.13MHz, d2o
 8 sc
 
 19ns.26.2.2025
##JCAMPDX= 6.0         $$ Bruker NMR JCAMP-DX V2.0
##DATA TYPE= NMR FID
##DATA CLASS= NTUPLES
##ORIGIN= UXNMR, Bruker Analytische Messtechnik GmbH
##OWNER= pz
$$ XWIN-NMR		Version 3.5
$$ Tue Oct 21 12:04:09 2025 Russian Standard Time (UT+4h)  Yarkov@DPX200
##.OBSERVE FREQUENCY= 200.1313
##.OBSERVE NUCLEUS= ^1H
##.DELAY= (6, 6)
##.ACQUISITION MODE= SIMULTANEOUS
##.ACQUISITION SCHEME= undefined
##.AVERAGES= 8
##.DIGITISER RES= 18
##SPECTROMETER/DATA SYSTEM= spect
##.PULSE SEQUENCE= zg30
##.SOLVENT NAME= CDCl3
##.SHIFT REFERENCE= (INTERNAL, CDCl3, 0, 14.3821)
##AUDIT TRAIL= $$ (NUMBER, WHEN, WHO, WHERE, WHAT)
$$ ##TITLE= Audit trail, XWIN-NMR		Version 3.5
$$ ##JCAMPDX= 5.01
$$ ##ORIGIN= Bruker BioSpin GmbH
$$ ##OWNER= Yarkov
$$ C:/Bruker/XWIN-NMR/data/yarkov2/nmr/H-C/1/audita.txt
$$ ##AUDIT TRAIL=  $$ (NUMBER, WHEN, WHO, WHERE, WHAT)
(   1,<2025-10-21 12:03:22.32 +0400>,<Yarkov>,<DPX200>,
      <created by zg, POWCHK disabled, PULCHK disabled
       configuration hash MD5:
       00 E9 B6 7A A2 85 ED C7 34 08 36 98 17 FE 4E 26
       data hash MD5: 16K
       D8 B3 D8 83 EE BA A3 E9 15 F8 C9 5D B8 B4 C7 7E>)
$$ ##END=
$$ 
$$ hash MD5
$$ 6D 89 3C EE 5E 81 F4 50 64 1E CC BB 95 3D C5 84
##$RELAX= 
##$RELAX= 
##$RELAX= 
##$RELAX= 
##$RELAX= 
##$RELAX= 
$$ Bruker specific parameters
$$ --------------------------
##$DU= <C:/Bruker/XWIN-NMR>
##$EXPNO= 1
##$NAME= <H-C>
##$PROCNO= 1
##$TYPE= <nmr>
##$USER= <yarkov2>
##$AMP= (0..31)
100 100 100 100 100 100 100 100 100 100 100 100 100 100 100 100 100 100 
100 100 100 100 100 100 100 100 100 100 100 100 100 100 
##$AQSEQ= 0
##$AQ_mod= 1
##$AUNM= <au_zg>
##$AUTOPOS= <>
##$BF1= 200.13
##$BF2= 200.13
##$BF3= 200.13
##$BF4= 200.13
##$BF5= 200.13
##$BF6= 200.13
##$BF7= 200.13
##$BF8= 200.13
##$BYTORDA= 1
##$CFDGTYP= 0
##$CFRGTYP= 5
##$CHEMSTR= <none>
##$CNST= (0..31)
1 1 145 1 1 1 1 1 1 1 1 1 1 1 1 1 1 1 1 1 1 1 1 1 1 1 1 1 1 1 1 1 
##$CPDPRG= <>
##$CPDPRG1= <>
##$CPDPRG2= <>
##$CPDPRG3= <>
##$CPDPRG4= <mlev>
##$CPDPRG5= <mlev>
##$CPDPRG6= <mlev>
##$CPDPRG7= <mlev>
##$CPDPRG8= <mlev>
##$CPDPRGB= <>
##$CPDPRGT= <>
##$D= (0..31)
0 0.7 0 0 0 0 0 0 0 0 0 0.03 0 0 0 0 0 0 0 0 0 0 0 0 0 0 0 0 0 0 0 0 
##$DATE= 1761033801
##$DBL= (0..7)
120 120 120 120 120 120 120 120 
##$DBP= (0..7)
150 150 150 150 150 150 150 150 
##$DBP07= 0
##$DBPNAM0= <>
##$DBPNAM1= <>
##$DBPNAM2= <>
##$DBPNAM3= <>
##$DBPNAM4= <>
##$DBPNAM5= <>
##$DBPNAM6= <>
##$DBPNAM7= <>
##$DBPOAL= (0..7)
0.5 0.5 0.5 0.5 0.5 0.5 0.5 0.5 
##$DBPOFFS= (0..7)
0 0 0 0 0 0 0 0 
##$DE= 6
##$DECBNUC= <off>
##$DECIM= 32
##$DECNUC= <off>
##$DECSTAT= 4
##$DIGMOD= 1
##$DIGTYP= 9
##$DL= (0..7)
0 120 120 120 120 120 120 120 
##$DP= (0..7)
150 150 150 150 150 150 150 150 
##$DP07= 0
##$DPNAME0= <>
##$DPNAME1= <>
##$DPNAME2= <>
##$DPNAME3= <>
##$DPNAME4= <>
##$DPNAME5= <>
##$DPNAME6= <>
##$DPNAME7= <>
##$DPOAL= (0..7)
0.5 0.5 0.5 0.5 0.5 0.5 0.5 0.5 
##$DPOFFS= (0..7)
0 0 0 0 0 0 0 0 
##$DQDMODE= 0
##$DR= 18
##$DS= 0
$$ [...]
##$SUBNAM2= <"">
##$SUBNAM3= <"">
##$SUBNAM4= <"">
##$SUBNAM5= <"">
##$SUBNAM6= <"">
##$SUBNAM7= <"">
##$SUBNAM8= <"">
##$SUBNAM9= <"">
##$SW= 18.0517328524113
##$SWIBOX= (0..15)
0 0 2 0 0 0 0 0 0 0 0 0 0 0 0 0 
##$SW_h= 3612.71676300578
##$TD= 16384
##$TD0= 1
##$TE= 0
##$TE2= 300
##$TE3= 300
##$TEG= 300
##$TL= (0..7)
0 120 120 120 120 120 120 120 
##$TP= (0..7)
150 150 150 150 150 150 150 150 
##$TP07= 0
##$TPNAME0= <>
##$TPNAME1= <>
##$TPNAME2= <>
##$TPNAME3= <>
##$TPNAME4= <>
##$TPNAME5= <>
##$TPNAME6= <>
##$TPNAME7= <>
##$TPOAL= (0..7)
0.5 0.5 0.5 0.5 0.5 0.5 0.5 0.5 
##$TPOFFS= (0..7)
0 0 0 0 0 0 0 0 
##$TUNHIN= 0
##$TUNHOUT= 0
##$TUNXOUT= 0
##$USERA1= <user>
##$USERA2= <user>
##$USERA3= <user>
##$USERA4= <user>
##$USERA5= <user>
##$V9= 5
##$VALIST= <valist>
##$VCLIST= <CCCCCCCCCCCCCCC>
##$VD= 0
##$VDLIST= <DDDDDDDDDDDDDDD>
##$VPLIST= <PPPPPPPPPPPPPPP>
##$VTLIST= <TTTTTTTTTTTTTTT>
##$WBST= 1024
##$WBSW= 4
##$XGAIN= (0..3)
0 0 0 0 
##$XL= 0
##$YL= 0
##$YMAX_a= 308231
##$YMIN_a= -344902
##$ZGOPTNS= <>
##$ZL1= 120
##$ZL2= 120
##$ZL3= 120
##$ZL4= 120
##$ABSF1= 10
##$ABSF2= 0
##$ABSG= 5
##$ABSL= 3
##$ALPHA= 0
##$AQORDER= 0
##$ASSFAC= 0
##$ASSFACI= 0
##$ASSFACX= 0
##$ASSWID= 0
##$AUNMP= <proc_1d>
##$AZFE= 0.1
##$AZFW= 0.1
##$BCFW= 1
##$BC_mod= 2
##$BYTORDP= 1
##$COROFFS= 0
##$CY= 83.5205535888672
##$DATMOD= 1
##$DC= 2
##$DFILT= <>
##$DTYPP= 0
##$F1P= 10.8118882576601
##$F2P= -7.23987719738617
##$FCOR= 0.5
##$FTSIZE= 0
##$FT_mod= 4
##$GAMMA= 1
##$GB= 0.15
##$INTBC= 1
##$INTSCL= 1
##$ISEN= 128
##$LB= 0.25
##$LEV0= 0
##$LPBIN= 0
##$MAXI= 10000
##$MC2= 0
##$MEAN= 0
##$ME_mod= 0
##$MI= 1.114404
##$NCOEF= 0
##$NC_proc= 0
##$NLEV= 6
##$NOISF1= 3.799351
##$NOISF2= 2.8
##$NSP= 1
##$NTH_PI= 0
##$NZP= 0
##$OFFSET= 14.38212
##$PC= 1
##$PHC0= -4079.816
##$PHC1= 14.22191
##$PH_mod= 1
##$PKNL= yes
##$PPARMOD= 0
##$PSCAL= 0
##$PSIGN= 0
##$REVERSE= no
##$SF= 200.129724274929
##$SI= 16384
##$SIGF1= 3
##$SIGF2= 2
##$SINO= 400
##$SIOLD= 16384
##$SREGLST= <1H.CDCl3>
##$SSB= 0
##$STSI= 0
##$STSR= 0
##$SW_p= 3205.1282051282
##$SYMM= 0
##$S_DEV= 0
##$TDeff= 0
##$TDoff= 0
##$TI= <>
##$TILT= no
##$TM1= 0
##$TM2= 0
##$TOPLEV= 0
##$USERP1= <user>
##$USERP2= <user>
##$USERP3= <user>
##$USERP4= <user>
##$USERP5= <user>
##$WDW= 1
##$XDIM= 8192
##$YMAX_p= 0
##$YMIN_p= 0
$$ End of Bruker specific parameters
$$ ---------------------------------
##NTUPLES= NMR FID
##VAR_NAME=  TIME,          FID/REAL,        FID/IMAG
##SYMBOL=    X,             R,               I
##VAR_TYPE=  INDEPENDENT,   DEPENDENT,       DEPENDENT
##VAR_FORM=  AFFN,          ASDF,            ASDF
##VAR_DIM=   8192,          8192,            8192
##UNITS=     SECONDS,       ARBITRARY UNITS, ARBITRARY UNITS
##FACTOR=    0.0002768,     1,               1
##FIRST=     0,             0,               0
##LAST=      2.2672688,     0,               0
##MIN=       0,             -344902,         0
##MAX=       2.2672688,     308231,          0
$$ Real data points
##PAGE= N=1
##DATA TABLE= (X++(R..R)), XYDATA
0 0 0 0 0 0 0 0 0 0 0 0 0 0 0 0 5 -8 8 -8 8 -8 16 -16 16 -24 24 -30 32 -40 44 -52 57 -65 76 -84 93 -107 117
37 117 -132 147 -163 181 -202 224 -247 273 -301 332 -366 403 -443 488 -538 596 -658 728 -810
56 -810 901 -1006 1133 -1285 1470 -1703 2004 -2414 2999 -3900 5447 -8616 17641 -97721 -344902
71 -344902 -19104 236124 28045 -177247 -37522 113167 70848 -7115 -21312 -40877 -39859
82 -39859 14350 56843 10098 -62986 -41317 70216 91002 -37929 -120185 -21055 83973 37561
94 37561 -46297 -33241 16785 38837 37738 -10085 -73277 -29658 68728 34823 -64544 -19580
106 -19580 73001 17441 -56177 5415 37013 -50427 -56086 57986 67370 -42401 -57223 37528
118 37528 59658 -21213 -62671 -4109 47868 8933 -35506 7973 47385 -11839 -51319 19575
130 19575 50113 -38787 -67014 34684 71857 -19756 -58897 11362 45983 1919 -27255 -17832
142 -17832 -3224 18959 27753 -7566 -28340 12769 36704 -9774 -41534 -3712 27668 3556
154 3556 -20538 -1534 23985 8983 -24586 -16310 23884 14897 -34452 -20165 43040 30236 -34603
167 -34603 -21203 36024 15940 -36027 -15492 26083 7766 -20735 -2054 20608 6997 -14612
179 -14612 -12940 3965 9787 -6600 -17203 4309 26271 9336 -16197 -7337 10248 3393 -8947
192 -8947 -6093 1599 7912 10198 -1284 -8933 2907 4620 -14786 -11209 14883 7057 -18250 1342
206 1342 29720 1906 -30843 -4776 25799 3419 -24128 -6422 23141 17210 -11975 -18602 7269
219 7269 18979 -12009 -29563 6563 30530 -4240 -25887 9380 27045 -9598 -27592 3224
231 3224 19909 -359 -12558 572 13942 10917 -6865 -18022 -611 17501 -1787 -22904
243 -22904 894 26478 2609 -22642 -2945 16957 -182 -16471 -4201 11844 9830 -3544
255 -3544 -8022 5801 14340 -6394 -20842 4355 21484 -7141 -22669 11049 25330 -10693 -25194
268 -25194 6587 18265 -7751 -17912 2890 16261 5816 -8910 -7679 8343 11251 -9146
280 -9146 -15539 8481 16763 -7350 -12982 11024 11957 -12541 -12448 8017 6651 -8237 -6495 5332
294 5332 9245 2499 -8656 -8125 9556 12166 -12638 -16363 15032 21347 -11604 -19200 10902 17058
308 17058 -9991 -17641 2823 12611 1255 -9653 -4008 9582 8061 -10315 -11994 9785 11662
321 11662 -11281 -10195 15504 12270 -13436 -9751 12640 7300 -12250 -8337 7138 8304 -1815
334 -1815 -8205 -2185 9254 5110 -12798 -9962 12786 11461 -11740 -9459 13834 10487 -10979 -9215
348 -9215 7389 6749 -4918 -6512 1428 8117 2876 -9237 -6396 9577 5969 -14026 -8050 15125
362 15125 8689 -14032 -6020 14578 5937 -12718 -5817 9244 5820 -5490 -5895 3921 8850 -859
376 -859 -12374 -2650 12540 1653 -15973 -3002 16904 4148 -15165 -4192 12911 4406 -9527
389 -9527 -5115 6117 7300 -884 -6908 -798 8731 2161 -10703 -3689 10404 1504 -12192 -529
403 -529 12308 -17 -11839 -267 9821 665 -8126 -2604 6956 6703 -3351 -8353 2256 10987
417 10987 -1508 -13454 78 13561 -371 -13005 222 11278 -360 -10134 -1457 7009 2724
430 2724 -4506 -4328 3349 7333 -814 -7922 955 9603 -1375 -10285 1322 9483 -2193 -8439 2599
445 2599 7253 -3251 -7444 565 5765 1165 -5531 -3635 6771 8797 -5599 -11099 5040 12438
459 12438 -4830 -13030 4135 13149 -1607 -10706 -569 6621 967 -5105 -3712 2534 4723 -1627
473 -1627 -5138 2986 6676 -4029 -7579 4950 7852 -5916 -7086 7983 8863 -5577 -8718 2488
487 2488 6776 -777 -7143 -3588 6118 7095 -4454 -9108 3275 8723 -4785 -9425 4998 10022
501 10022 -2996 -6527 4263 5129 -4607 -5675 2260 5358 483 -5081 -2975 5349 5151 -6484 -8037
516 -8037 5496 7775 -5770 -6764 6695 7397 -5419 -5668 4915 4455 -4425 -4123 3374 5381 -963
531 -963 -6262 -1460 7547 3425 -9671 -7438 8362 8678 -6736 -7398 6521 6870 -5563 -6344 3266
546 3266 4991 -965 -2134 1464 2845 -1077 -4978 -727 6367 1256 -8411 -2566 10160 4132 -10576
561 -10576 -6465 8362 6579 -5802 -5675 4576 6321 -1290 -5203 -791 4878 1800 -4487 -1717
575 -1717 4976 1030 -6626 -1477 7603 1277 -8867 -2822 7539 3428 -5931 -3023 5164 4151 -3133
590 -3133 -4870 1048 5225 615 -4460 -390 5309 327 -5792 -980 4866 -106 -5383 -80 5570
605 5570 1603 -4451 -3042 2140 3063 -1511 -2866 2092 4864 -798 -5038 367 4674 -876 -4876
620 -4876 967 5244 -467 -5226 -470 4698 1485 -4943 -3973 3572 5374 -1937 -5474 1613 5900
635 5900 -670 -5450 483 4790 -359 -3519 640 3003 -555 -2562 -539 1616 78 -3187 -2130
650 -2130 3827 4222 -3141 -5286 2771 5269 -2308 -5275 2038 5511 103 -3635 -845 2437 1324
665 1324 -2205 -2720 1442 3160 -1406 -3514 1812 3384 -2720 -4373 2905 4483 -2468 -3523 2730
680 2730 3515 -1685 -2824 750 2386 412 -2589 -1866 2450 2809 -2871 -3622 2922 3219 -4011 -3765 4257
697 4257 3379 -3660 -2691 3037 2589 -1758 -2423 376 2322 1233 -2207 -2261 2717 3055 -3450 -3880 2852
714 2852 3227 -3241 -2867 2895 2362 -2623 -1813 2034 1559 -781 -1536 113 2089 1207 -2741 -2068 3344
731 3344 2528 -4304 -3217 4238 2898 -4307 -3008 3402 2345 -2387 -2196 1159 2101 256 -1953 -1107
747 -1107 2442 1964 -2503 -2140 2984 2077 -3310 -1791 3406 1043 -3592 -1334 2534 904 -2061 -1229
763 -1229 1011 1812 -62 -2161 -514 3270 1278 -3439 -1422 4026 1604 -3910 -1249 3369 1113
778 1113 -3175 -1128 1987 1082 -1423 -1625 450 1994 -47 -2338 -222 3461 630 -3505 -243 3891
794 3891 246 -3450 8 3102 103 -2529 -560 1772 687 -1054 -1613 828 2455 -306 -2991
809 -2991 242 3327 -50 -3460 365 3621 -96 -2996 4 2542 456 -1891 -914 1002 1276 -688
825 -688 -2154 251 2379 -282 -2883 282 3009 -425 -2820 492 2628 -296 -1973 430 1694
840 1694 113 -1322 -744 985 1256 -1127 -2184 983 2345 -1195 -2924 1056 3060 -793 -2742 875
856 875 2577 -255 -1813 111 1437 746 -965 -1060 828 1640 -1000 -2192 1040 2142 -1459 -2513
872 -2513 1454 2151 -1388 -2008 1109 2008 -558 -1621 124 1590 739 -1356 -1195 1585 1818 -1641 -2016
889 -2016 1836 2022 -2148 -2029 1627 1784 -1789 -1601 945 1574 -249 -1224 -334 1412 1120 -1317 -1281 1506
907 1506 1710 -1650 -1515 1622 1136 -2049 -1197 1560 730 -1564 -880 887 1027 -446 -1375 -71 1761
924 1761 1001 -1545 -1071 1985 1740 -1956 -1477 1724 1113 -1470 -963 916 620 -721 -755 223 831 247
942 247 -1234 -587 1945 1037 -1976 -905 2402 1139 -2389 -991 1927 855 -1265 -597 614 537 -515
959 -515 -949 64 981 127 -1520 -123 2113 292 -2221 -326 2274 184 -2321 -56 2107 609
975 609 -1316 -741 403 708 -59 -1124 -587 1511 449 -1876 -565 1917 577 -1996 -131 2198
991 2198 114 -1779 204 1578 100 -1123 -495 773 1027 -367 -1646 32 1666 -186 -2334 267
1007 267 2357 -363 -2167 718 2191 -416 -1555 97 1235 -47 -748 -453 581 1150 -180 -1562
1023 -1562 59 1469 -330 -1788 379 1709 -648 -1448 694 1161 -782 -1164 382 1017 362 -628
1039 -628 -556 692 794 -918 -1661 780 1713 -874 -1732 892 1529 -833 -1591 527 1273 -353 -906 127
1057 127 891 680 -632 -707 602 966 -718 -1142 1140 1128 -1034 -1066 967 752 -1216 -1093 699 884
1075 884 -313 -434 69 1023 291 -1162 -662 1003 1181 -969 -913 1260 1013 -1175 -1054 838 928 -768
1093 -768 -849 348 690 -44 -764 -507 698 349 -1045 -467 1341 588 -1027 -663 1109 335 -1109 -350
1111 -350 987 300 -714 -379 481 465 -32 -993 -276 1018 395 -1121 -247 1581 385 -1346 -682 1017
1129 1017 243 -559 -270 432 334 -298 -562 -246 638 112 -969 -221 1061 543 -1112 -202 1068 87 -988
1148 -988 -24 1295 486 -893 -196 593 601 -235 -742 209 919 -138 -1073 -15 1222 11 -1280 -278
1166 -278 1117 59 -997 152 736 104 -549 -394 386 471 -150 -511 -56 912 7 -1007 -34 1211
1184 1211 -262 -1280 188 1042 -74 -816 6 723 54 -581 -278 462 674 -383 -900 101 954 -325
1202 -325 -1094 125 1110 -268 -1061 316 995 -154 -865 -72 643 205 -345 -387 462 486 -323 -615 446
1221 446 741 -534 -620 333 622 -520 -742 350 775 -424 -577 38 593 256 -337 -465 385 740 -472
1240 -472 -651 547 864 -655 -942 489 749 -352 -747 114 697 -192 -657 -159 471 267 -428 -565 534
1259 534 622 -460 -510 595 595 -586 -564 740 460 -543 -632 387 367 -75 -348 -189 492 157 -608 -431
1279 -431 792 432 -813 -573 775 492 -444 -405 560 332 -415 -453 14 393 69 -445 -311 665 402 -739
1299 -739 -372 598 230 -692 -110 709 356 -635 -82 568 315 -283 -362 270 368 -32 -511 -19 618 367 -754
1320 -754 -209 687 361 -801 -323 734 251 -376 -232 305 298 -88 -340 -11 281 -48 -462 -171 538 55
1340 55 -639 41 799 -20 -623 -11 542 -19 -424 -46 270 191 -172 -475 305 458 -86 -609 167 655 -147
1361 -147 -717 -55 685 14 -653 -26 292 160 -316 -160 276 265 -200 -378 -70 460 -93 -467 104 401
1381 401 -126 -631 359 521 -288 -477 -19 344 89 -281 -28 427 337 -332 -462 232 554 -267 -435 220
1401 220 501 -411 -357 464 310 -169 -356 25 312 19 -255 -93 268 356 -316 -491 190 488 -423 -455 339
1422 339 401 -317 -317 340 334 -245 -198 189 284 31 -404 -266 238 363 -335 -222 318 270 -463 -371 574 343 -272
1445 -272 -267 179 300 -201 -173 -67 351 0 -361 -108 424 242 -515 -375 365 272 -577 -341 574 236 -189
1466 -189 -200 113 470 -217 -202 -122 327 -10 -495 -238 246 39 -240 8 457 92 -469 -297 355 101 -71
1487 -71 32 38 225 -57 -418 102 279 42 -512 -159 555 -37 -518 15 393 -7 -314 -4 300 136 -423
1508 -423 -56 246 471 -143 -370 60 199 -50 -206 -18 330 65 -509 64 329 -7 -364 -12 351 -52
1528 -52 -192 -89 183 110 -95 -291 137 273 17 -295 76 369 -265 -235 -24 123 -135 -254 -66 235 108
1549 108 -186 -232 246 14 -191 -258 176 194 -146 -353 162 463 -163 -435 104 402 57 -324 -32 50 230
1570 230 -222 -183 83 240 -271 -147 261 151 -146 -264 196 327 -138 -259 66 -15 -73 -210 76 247 151
1591 151 -202 -114 346 307 -300 -161 188 133 -426 -109 48 27 -80 -122 78 186 1 -137 1 155 136 -410
1613 -410 -112 179 90 -285 -99 160 55 -151 6 155 30 -145 -230 -82 225 -44 -356 -87 261 -49 -140
1634 -140 -1 172 6 -178 -84 174 -123 -127 -44 129 90 -66 41 338 186 172 -164 -16 284 -22 -315 -207
1656 -207 304 -93 -302 143 258 -124 -244 -77 168 13 -251 -125 116 344 -96 -260 94 229 -242 -217
1676 -217 14 189 -111 -293 -87 63 -72 -91 40 -22 116 -81 -231 113 230 -40 -231 124 286 -273 -280
1697 -280 55 268 -106 38 61 -6 -30 -169 -10 94 79 -159 64 141 129 -145 -127 63 -131 -160 -295 -24 189
1720 189 -178 -158 325 107 -129 -251 -96 163 151 -139 -42 144 194 -5 -116 182 151 -181 -47 209 362 -174
1742 -174 -209 87 218 163 -100 -36 151 -67 -292 25 207 125 -285 -127 268 -41 -374 -92 213 26 -42 -38
1764 -38 -74 335 -2 -306 136 101 -102 -184 36 412 106 -302 -45 62 103 -116 -129 89 78 -216 -177 -97 130
1787 130 -43 -277 37 155 25 -240 141 243 -114 -172 -4 227 -74 -250 -146 313 117 -40 -222 90
1807 90 137 -99 -215 77 305 -82 -216 91 150 -47 -204 -52 237 68 -49 -22 157 274 -190 -203 152 272
1829 272 -99 -173 73 216 -106 -208 177 133 -203 -111 10 257 109 -328 -62 174 172 -155 -17 300 139 -136
1851 -136 -300 303 188 -230 -196 129 121 -165 -186 -120 144 -96 -204 3 96 187 -191 -21 356 139 -142 -245
1873 -245 290 102 -119 -192 251 76 -151 -134 42 58 24 -64 -55 206 -126 -296 -95 275 153 -200 -98 415
1895 415 155 -209 -177 154 173 -123 -94 60 275 -95 -274 -37 197 0 -331 51 258 -6 -199 85 329
1916 329 201 -147 -135 279 131 -122 -191 167 184 -179 -261 41 231 -81 -198 82 246 -134 -277 -74 276
1937 276 62 -264 -142 54 153 -31 -182 75 74 -124 -371 90 352 -95 -171 25 219 -51 -187 6 207
1958 207 -88 -41 -107 246 -73 -98 -350 -6 205 -87 -181 110 74 -154 -261 -55 197 -21 10 124 216 81
1980 81 -317 -138 241 -12 -132 -197 234 260 -152 -192 59 218 -245 -305 163 55 -21 -272 54 356 92 -293
2002 -293 -185 303 79 -252 -9 287 56 -265 -75 153 121 -238 -317 71 257 24 -141 -122 226 129 -210
2023 -210 -139 129 134 -74 -26 189 141 -79 -120 190 56 -72 38 -9 189 69 -380 -93 340 68 -183 115
2045 115 386 5 -315 24 97 33 -56 -5 17 119 -20 -273 16 284 -47 -377 -57 211 -9 -234 -56 434
2067 434 70 -211 -2 289 199 -209 -151 84 -34 -41 -379 78 176 -69 -107 26 356 -86 -193 51 238 -12
2089 -12 -253 -99 143 -158 -76 -110 54 339 -71 -116 84 299 -92 -245 273 260 -89 -221 87 179 -172 -236
2111 -236 -58 169 -61 -57 90 31 211 -87 90 -58 385 1 -259 203 130 20 -308 -114 200 -144 -175 85
2133 85 260 84 -81 61 113 154 -179 -252 114 237 -233 -159 143 285 -58 -143 156 195 25 -178 119 143 -34
2156 -34 -202 -26 39 216 -184 -75 70 160 -13 -273 277 294 -6 -144 218 57 -82 -228 -117 332 -45
2177 -45 -77 -47 126 26 -218 -134 254 251 -84 -117 91 165 -61 -223 186 149 -1 -67 72 102 -45 -300 -5 126
2201 126 125 -220 -160 327 121 -204 -46 201 78 -203 -35 92 168 -166 -274 -32 217 -42 -396 -16 311
2222 311 -12 -139 -11 135 169 -3 -60 140 144 -143 -136 -56 307 -235 -236 172 216 228 -263 -64 215 -169 -27 -24
2246 -24 105 128 20 -58 156 21 -103 -37 42 168 -98 -87 80 56 -256 -192 22 176 -63 -314 -82 -93 49
2269 49 -209 -27 413 314 -53 -250 282 152 94 -124 165 65 -2 -232 168 256 -47 -100 -18 253 85 -85
2291 -85 -222 210 16 -86 -306 119 233 -108 -232 139 176 41 -171 212 227 31 -327 50 217 -47 1
2312 1 5 191 98 -47 -10 55 85 9 -116 164 420 -82 -207 41 174 112 -15 -179 -20 -38 -26 -41 255 59
2336 59 -115 -107 -5 66 37 2 126 -7 28 -172 133 95 -5 -58 114 121 222 -140 -61 40 -13 -116 -125 186 23
2361 23 -37 -204 180 68 -52 -104 -53 218 -23 -152 -161 99 39 -184 -114 171 -48 -189 -244 155 177 -17 90
2384 90 141 125 -140 -120 265 88 -114 -176 -80 135 48 -162 -8 73 60 12 -27 21 -36 -194 116 200 109 -75 -53
2409 -53 92 149 -231 -175 -11 108 -53 -366 -76 265 -75 -192 41 70 31 14 -23 95 140 32 -63 26 179
2432 179 41 44 -10 89 -146 -262 206 52 60 -215 205 93 -65 -138 -156 188 3 -161 -120 256 57 -123 -32
2455 -32 100 205 -184 -31 -20 135 76 -115 -10 159 29 -139 2 243 86 -14 -8 98 12 5 -160 200 3
2478 3 -170 -62 -16 187 1 -44 169 50 -126 -9 48 172 60 -111 -273 95 75 -90 -56 79 76 -100 -125
2501 -125 184 97 -131 -99 -60 276 -117 -63 93 30 34 -92 -13 440 117 -255 -76 47 45 -59 -64 94 102 -86 -51
2526 -51 117 24 40 -155 -76 298 -19 -149 64 18 62 -128 -41 239 54 -213 33 -121 140 157 -56 186 17
2549 17 -43 -36 -161 62 16 -81 7 -66 210 -101 -179 43 -10 -126 33 41 47 104 -144 -196 109 104 108 -97 154 8 -65
2576 -65 119 10 -3 -66 -143 114 11 -230 -40 190 218 15 -72 103 178 13 -252 149 129 -130 -39 134 148
2599 148 18 20 145 182 7 28 -11 123 -49 -37 -38 61 111 10 -77 79 31 -114 -58 159 72 28 -135 164 -46
2624 -46 95 -62 37 72 109 1 42 -3 51 -168 -15 -92 -3 19 -24 44 -9 -92 -32 -93 139 124 -187 93 49 86
2650 86 132 -110 109 239 -70 -80 38 41 20 -225 104 115 44 -74 -82 117 38 47 -49 -68 -137 -43 61 116 -16 -110
2676 -110 22 143 17 67 -194 46 192 27 -48 16 101 -20 -96 178 118 94 -261 -21 85 17 -129 -68 32
2699 32 -42 -78 -10 -49 -133 -14 -110 5 211 69 -159 3 -65 -72 76 59 90 -113 -146 -73 148 36 -80 95 -167
2724 -167 235 70 -96 2 247 109 -173 -46 52 22 -125 159 -49 -9 168 -36 31 62 141 -2 111 44 96
2747 96 19 17 -66 -130 -122 84 25 126 67 -167 117 57 71 29 -39 -94 27 -75 25 98 -77 53 -106 44 153
2772 153 96 114 99 -66 -45 88 -20 22 -80 -49 -64 73 -111 36 171 11 10 -63 120 -65 57 -84 19
2795 19 -90 -68 -3 83 -76 -52 -111 -100 86 -195 -101 -9 62 69 -131 64 121 54 -16 157 166 -9 11 -105 5 -101
2821 -101 -91 20 102 14 -9 3 -100 -115 109 -1 90 -18 57 -65 -35 -19 -51 -12 64 -2 -134 -51 19 -110 -54 86
2847 86 -55 -34 66 -14 7 -81 114 -141 -127 -92 4 41 -109 -53 30 37 72 -186 -28 91 -162 67 20 -28 -25 -167
2873 -167 1 82 -46 -21 -65 -64 45 -92 -18 84 61 12 -81 75 -30 -6 92 71 -44 -43 -154 82 26 -153 42
2898 42 -42 96 73 30 -7 -1 10 -72 68 84 10 -188 -89 149 109 -102 -79 152 5 -144 -36 -8 51 76 105 -182
2924 -182 60 238 49 38 168 -129 -170 30 2 -19 1 70 17 139 -45 196 32 88 -56 -221 -1 138 47
2947 47 -137 -6 -81 -9 121 48 -100 -101 -174 90 110 -63 -199 145 -103 80 -65 121 -46 10 -78 -74 98 20
2971 20 44 -22 -6 32 41 58 -148 -82 -53 37 25 -139 28 -91 -67 -20 105 -160 0 -5 50 94 -80 42 9 -86 -118
2998 -118 33 -66 112 51 -65 2 -58 -98 57 -79 99 -71 87 185 -107 -250 78 67 158 -149 101 76 205
3021 205 88 -84 -1 15 53 -98 60 2 -56 -132 21 205 11 -119 121 63 60 -45 -76 230 146 -34 -25 -19 -5
3046 -5 -25 -37 23 82 -28 -197 39 7 -77 -85 -48 -97 -49 89 -23 146 18 -3 -45 -51 -87 29 70 -12 -212 95 -65
3073 -65 -9 276 -45 104 -106 -56 55 -68 -81 31 -104 112 -31 79 -17 44 -10 -63 103 8 65 -67 -28 147
3097 147 -142 -46 -167 25 -77 -188 -41 193 -9 9 -35 -29 48 81 22 161 10 -132 -26 149 0 -102 -187
3120 -187 162 -50 73 -64 25 13 34 -147 -32 108 -121 -58 -92 168 -76 -43 12 217 -130 -108 10 -78 -37
3143 -37 166 -81 -43 84 -24 25 47 152 36 -60 108 77 90 8 -107 36 20 -43 1 84 17 -73 -99 -69 213
3168 213 -54 111 -29 126 9 61 4 -9 -21 40 -20 40 -3 -9 -346 125 147 -225 12 223 189 3 51 0 114
3193 114 3 -102 -15 -21 71 -137 -143 107 -54 -102 148 -122 -99 -18 -53 -44 21 -250 -90 -32 74 115 -25 239 50
3218 50 98 -115 -199 -41 -60 -188 16 -16 -121 -88 -94 5 -43 -140 -147 -46 17 11 -71 -224 -88 113 -96 10 99 23
3244 23 -32 1 89 -77 -172 65 84 30 -104 -166 122 265 116 12 -123 233 190 -268 -91 150 86 -79 -159 215
3268 215 69 47 -84 -144 50 11 -117 14 144 54 35 -1 -8 -99 -93 9 16 -3 -86 -70 -29 99 -29 -107 112 4
3294 4 -44 -192 -13 -28 50 -56 -25 158 166 -111 0 94 65 -73 9 -42 127 61 -159 89 124 60 23 123 126 122 -65
3321 -65 -5 9 -109 -91 52 254 15 -90 48 -180 155 19 -71 3 175 -9 -127 211 -37 -48 -50 103 36
3344 36 14 -151 12 -36 53 -237 -85 99 37 -104 -85 20 117 131 -78 92 107 -25 -47 -70 290 23 -94 -79
3368 -79 38 29 -127 -170 -44 155 -110 -47 -56 27 -62 -74 25 111 -149 24 -126 87 18 60 -171 76 82 -48 -96 254
3394 254 -21 -112 -48 58 211 -128 -148 90 190 -215 -118 -34 -44 -36 87 32 103 149 -81 -27 113 -59 -98 111
3418 111 43 -55 -191 -44 66 136 -5 -134 -34 -14 72 -52 -82 206 -52 -256 -192 297 37 -184 -39 97
3440 97 48 -35 -111 19 31 82 -3 61 260 27 -125 -31 117 189 -151 -229 156 42 -270 -69 189 184 45 52 112
3465 112 -102 -31 -14 105 28 35 -31 2 -17 51 -148 88 187 -127 -109 -125 154 142 -141 34 109 97 -10 -235 -1
3490 -1 314 -119 -149 -38 245 -131 -168 157 54 82 -134 -112 113 21 -109 -156 110 321 -11 -79 -89 -63 -31 -78
3514 -78 31 143 -90 29 123 222 17 -120 -68 125 163 -73 53 317 62 -89 -78 56 98 16 -176 84 -167
3537 -167 14 -79 -4 13 94 -45 20 -20 -66 26 -75 21 146 -20 -190 -34 -13 -90 -253 -90 79 42 -90 -81 31
3562 31 -20 -119 29 46 56 -128 -88 137 110 10 -102 85 33 -77 -33 148 143 37 -153 -56 -79 -63 -27 -113 113
3587 113 -34 -12 -206 137 126 -178 -218 -78 12 53 -102 22 74 -229 -54 118 184 108 -176 47 232 -2 -179
3610 -179 10 68 -18 -112 80 107 119 23 5 141 131 -1 -23 54 10 61 -228 93 92 -118 -125 -53 354 -63 -100 -20
3636 -20 -1 5 -132 -116 77 65 -11 -96 5 131 162 -171 -4 46 -142 -261 2 -28 -79 -124 1 201 85 -104
3660 -104 -148 163 176 92 -287 -39 64 -20 -119 -13 131 12 2 -9 167 -49 -99 -128 36 -81 51 -187 36
3683 36 8 -28 -126 -70 96 1 -114 100 158 -165 -265 119 247 -29 -142 -52 60 3 -59 18 -25 81 -125 -205
3707 -205 -35 132 -50 -341 159 -80 -132 -160 2 175 10 -189 -142 155 79 -108 -192 -1 89 -212 -92 48
3729 48 65 31 -221 110 194 86 -14 42 197 -61 -106 -65 -34 175 -250 0 93 139 -263 -147 182 218 43 -90
3753 -90 189 226 59 -26 -140 40 -7 -231 -15 215 73 -125 60 -21 0 -93 -6 50 112 -145 -123 -6 18 -16
3777 -16 -227 131 190 50 -188 -4 18 37 -184 -166 142 104 -149 -50 -126 141 -66 -169 62 76 -15 -86 45 93
3801 93 39 -326 -35 58 114 -105 98 258 76 -135 -76 -7 210 -64 -276 -21 124 -3 0 30 93 -166 -174 -105
3825 -105 259 -60 -11 114 29 119 33 -62 123 -1 -123 10 42 157 16 -189 70 210 5 -180 -56 298
3847 298 44 -103 -164 102 -19 -163 -88 -23 84 -127 -106 -26 76 -75 -256 111 18 1 -103 87 159 -22 49
3870 49 -87 -6 18 -235 -232 15 139 -113 -11 -25 -8 62 -128 138 56 -56 -229 88 93 -5 -54 -47 107 17 -184
3895 -184 -18 17 9 140 -2 59 127 79 80 27 108 -316 48 10 84 -182 -99 67 -107 7 -102 13 83 -7 -181
3920 -181 -43 187 117 -70 -266 5 67 -68 -149 -30 107 -22 -54 39 -55 186 -222 -79 -83 -75 -9 -208 130 159
3944 159 -211 -18 19 -41 -53 -90 -97 0 -26 111 -80 37 25 129 45 189 82 -68 -63 82 24 -125 -28 -94 72
3969 72 -19 -175 152 -1 -62 -179 -9 140 14 -12 47 84 42 -63 -59 303 118 -126 -64 20 24 -29 -55 98 174
3994 174 -188 100 48 -66 118 -3 -1 130 77 -212 -22 -48 -25 -112 -80 53 46 -137 22 -100 31 -2 -148 53
4018 53 126 80 3 -82 61 -63 -106 -27 119 51 -49 -238 0 -19 25 -44 -62 -53 -97 -176 11 113 -14 -15 -9 152 -78
4045 -78 -116 130 149 -83 -90 -43 92 137 -169 -99 -28 75 35 4 -149 -119 -202 -85 60 85 -108 -72 -60 20 -35 -63
4071 -63 150 -253 7 -120 -96 147 9 -104 -128 30 33 -145 -52 152 244 36 -51 -47 180 149 28 -78 -189 -25
4095 -25 -39 20 120 51 -73 -72 -33 48 41 37 69 141 -48 -205 -135 82 -22 -213 39 46 176 -16 -114 60 10 38 -38
4122 -38 39 240 69 -44 19 -102 49 -155 27 14 -107 -119 -237 -49 153 51 -138 -35 -15 57 -104 90
4144 90 116 -43 -137 155 155 137 64 -42 54 73 2 -5 -10 14 179 -228 -5 145 -43 -76 9 20 -278 -94 -15 105
4170 105 -32 51 70 -21 73 33 -62 -83 14 -50 -49 47 -51 -130 44 -44 177 -14 -30 99 -12 -32 -165 138 -110 61
4196 61 -76 -76 67 136 6 -173 -70 117 -120 -116 -26 179 20 63 7 -54 40 -227 -42 -123 -64 84 -79 25
4220 25 54 -90 60 41 58 -153 -15 -162 -108 -5 2 14 -26 -77 88 144 -38 -44 -70 -72 138 -65 -102 52 208 113
4246 113 -6 106 32 -103 66 45 -66 137 150 -77 -104 132 -80 100 -333 42 111 -68 -153 110 -51 -65
4268 -65 -90 52 -28 -21 -4 -100 89 92 29 -25 167 -40 -100 -9 -70 31 13 -130 134 -39 -55 -185 3 4 12 -219 98
4295 98 91 101 22 34 3 -39 29 -104 178 78 -71 54 145 -70 105 -149 58 184 6 -148 151 36 -73
4318 -73 87 -221 19 -56 22 -101 -83 51 19 -16 -43 233 -189 83 -123 1 79 -44 114 -51 -241 64 64
4341 64 -46 -107 -239 -37 -132 14 139 60 120 -76 -98 -136 121 -85 -129 -103 48 -33 49 -71 -67 -48 -146 125 -17
4366 -17 6 -10 -109 75 1 -123 -109 9 -100 167 -40 -77 77 126 -72 32 112 -39 -90 -26 32 85 106 -134 -166
4391 -166 23 -4 60 -52 -95 -81 -50 -119 -8 14 57 -51 -8 97 -235 64 -115 20 -55 129 -134 -120 -151 -76
4415 -76 -6 80 69 -19 13 -12 99 31 200 -37 -20 -49 -56 -31 108 1 -40 72 7 9 49 -122 -60 100 77 25 -28
4442 -28 -76 -23 -217 -42 98 56 27 103 97 12 -28 89 -33 97 -133 -37 2 43 -82 91 -4 60 43 41 160 33
4468 33 -235 -136 -86 -12 -129 -38 130 172 -116 -283 -73 170 -22 71 -46 71 -55 29 35 -102 22 14 -56 113
4492 113 -9 132 143 -64 16 46 13 98 9 -12 44 96 66 -37 -55 -20 81 -34 185 27 -65 24 17 -11 120 186
4518 186 20 108 21 -110 -29 -40 -83 51 56 43 53 -34 134 -56 -101 214 173 12 -78 -45 25 -9 -36 -103 -117 132
4544 132 108 -98 125 -130 178 -145 53 -38 -54 -13 -40 -47 -62 17 -27 2 299 85 -99 -115 -8 40 -31 35 -19
4569 -19 -84 0 224 -27 75 -77 70 -74 24 -120 -92 99 97 51 -112 32 -15 -186 -21 97 -104 33 -16
4592 -16 44 115 -91 -84 -9 -61 182 -26 -65 -28 194 27 28 176 -83 -45 144 6 -81 -65 -34 -88 -34 107 52 -16
4618 -16 -175 -114 144 60 -306 -6 -96 -121 -7 64 -126 39 9 -138 -18 -40 73 55 0 188 42 -161 -49
4641 -49 33 97 95 -58 160 -82 -33 111 37 55 -33 8 -171 -130 24 -61 81 191 131 90 -73 -104 16 30 -95
4666 -95 -59 24 -68 -42 190 139 -272 47 139 64 -7 -170 35 -147 -59 12 59 17 157 69 -161 -76 -48 -73 73 117
4692 117 -29 130 36 -121 -48 -168 -36 61 -35 -14 -125 23 -15 -3 60 -33 -82 177 -3 -15 -52 37 170 -83
4716 -83 -63 127 47 18 -39 -17 -94 -131 117 -240 7 163 97 62 -20 146 -14 -22 -45 192 -125 -56 -38 61 65 16 126
4743 126 -57 244 61 50 -145 -39 22 63 45 57 88 51 -85 -92 31 -161 -24 -43 52 -1 -74 -200 76 -2 -207
4768 -207 -111 -177 33 -18 171 95 -78 -51 -96 13 -49 -82 -44 -108 -75 18 -66 193 -93 78 37 17 -75 -36 58 65 -40
4795 -40 117 -3 69 -12 9 -32 48 4 -197 -16 -4 -88 -109 -4 -69 69 127 -23 -51 -138 -126 16 -146 80 -75
4820 -75 8 -121 -23 45 -43 88 -4 124 3 46 46 46 -141 -27 -104 -19 -67 -23 27 122 -99 49 84 -180 -12 37
4846 37 32 -147 -87 -64 -4 -101 -79 -11 103 -82 -120 150 134 -20 -18 19 78 -54 -263 -7 85 67 -36 84 39 -67
4872 -67 52 -138 -21 12 -32 -5 135 49 -115 -30 -102 19 -110 -36 19 -38 127 -140 40 107 -58 34 177 37
4896 37 158 37 17 138 -121 101 86 27 -2 -276 -115 100 -211 -106 -4 -65 90 68 -50 64 89 150 109
4919 109 -73 137 157 93 -46 -179 63 18 -12 -22 -28 -108 48 1 -187 7 20 -59 30 -31 185 -122 -5 -39 50
4944 50 -319 -15 52 -21 8 150 -5 -8 -98 -294 98 -46 94 49 -20 97 132 -101 -60 23 -151 85 80 -210 -75
4969 -75 -28 83 -26 230 -47 -270 -234 -77 -55 -162 102 140 34 105 -33 82 -24 -74 86 110 -70 -28 -37 67
4993 67 -32 89 -39 -14 -77 -71 122 75 -8 4 -18 65 93 197 -141 48 -26 71 -113 -63 44 11 -25 -15 123 36
5019 36 -99 -163 -78 -44 -121 -89 -82 -124 -8 -61 -93 139 112 44 32 -131 -79 -87 48 61 107 76 -148 -53 -52 -139 50 40
5047 40 68 -6 122 -81 67 -48 -115 38 114 71 -111 -112 10 43 -81 88 125 43 -25 -64 131 -84 -14 -127 48
5072 48 10 153 85 -26 -33 143 -105 47 70 16 -13 189 16 -159 -47 -178 -11 6 -88 -129 -30 264 -82 105
5096 105 122 100 0 -174 42 100 24 -5 -93 123 -57 55 -19 -81 -36 -92 57 -116 -19 -27 -79 147 223 -92 -166
5121 -166 -59 136 40 93 -20 14 -46 -53 22 140 -114 -63 45 35 42 -133 -184 5 49 -46 -40 -28 -38 147 120 -53
5147 -53 118 107 93 0 71 53 217 -105 -42 -29 -18 -84 130 -30 110 -171 -191 27 -127 -192 -122 -10 21 89 69
5172 69 40 95 -13 203 -164 38 135 -22 -145 35 88 -30 16 -47 143 -122 -20 128 52 93 64 -63 -45 -56
5196 -56 -55 64 -37 -10 53 68 -45 20 -11 -12 108 102 -49 -60 -174 140 53 62 98 -1 22 -68 2 80 8 78 -76 45
5224 45 9 35 -6 -15 -86 -109 48 160 -5 -124 49 -29 -32 -152 -61 -26 24 -99 -112 4 18 120 -67 79 100 39
5250 39 27 -130 -75 218 1 30 73 -5 -28 -119 -16 34 -120 -231 -38 -42 -106 -88 -68 29 -81 -28 -63 72 175 90
5276 90 -140 8 179 34 100 15 8 136 -83 -89 28 136 -90 -61 171 -86 -104 -55 1 -29 -99 -236 19 29 23
5301 23 103 131 -101 46 -98 -26 102 -22 -138 -187 -2 36 111 -224 106 99 -163 -8 -24 42 -33 91 17 158
5325 158 77 -103 10 -35 8 -111 -106 4 73 -87 -107 106 34 13 -4 -8 121 -55 -56 106 170 30 37 223 -123 21
5351 21 -53 134 58 -87 88 110 78 -16 -46 -26 -41 -188 182 89 75 217 68 40 27 104 -100 49 88 -31 15
5376 15 -6 -70 154 95 -88 53 54 22 176 -99 -59 76 -22 -87 20 -88 138 85 23 144 -132 -132 -43 123 83
5401 83 130 3 95 41 37 -125 143 180 5 -155 24 7 -115 -147 36 -23 215 -136 140 -105 -52 -28 17 90 15
5426 15 27 -53 135 42 -4 -200 18 82 37 -45 55 -87 4 0 -89 73 193 -126 -41 27 -1 -32 -10 123 129 54 -20
5453 -20 71 -81 -67 -118 41 62 -33 80 54 51 -10 49 -42 67 7 18 3 -53 48 -75 63 -65 -116 -80 -69 18 -78
5480 -78 -7 -100 -29 147 -18 -222 14 51 73 -121 -58 -62 -131 -61 27 149 90 -7 -52 61 109 -31 -13 -67 -9 -79 -26
5507 -26 -218 116 69 -262 242 -80 1 34 24 102 152 24 140 97 -14 74 30 -90 -33 -101 -158 -85 -98 133 -247
5532 -247 53 130 143 -116 163 120 -85 -8 -64 -50 61 -121 -6 54 -38 -45 -156 -19 -36 -50 -68 -58 -19 -95 16
5557 16 88 -121 32 58 85 -32 -172 -35 -67 -22 93 -47 19 -139 70 39 -73 56 30 -54 59 -111 112
5580 112 33 -53 -37 -62 69 -67 61 3 85 54 39 163 17 22 4 48 165 20 -63 -51 -119 -81 -141 -54 67 -87
5606 -87 -81 0 -81 -66 20 -63 -38 129 -45 -77 65 228 -32 -89 -52 261 -49 -67 41 101 -11 123 80 -70 31
5631 31 66 -43 -36 -137 93 26 28 -72 -97 152 -72 -121 213 -6 33 13 22 -88 -213 74 48 61 -1 -47 -141 165
5657 165 -153 -72 -35 -95 -29 -194 118 88 -108 -94 -57 208 -10 -67 47 154 138 31 12 217 71 -137 -13
5680 -13 155 -139 -23 72 26 111 237 118 -7 -72 105 -130 167 293 -103 2 21 -20 -69 7 81 94 26 -89
5704 -89 54 89 64 -40 73 -11 -98 -132 -53 25 -30 77 51 -149 150 -109 -198 -41 -66 -81 94 -202 3 -71 -15
5729 -15 -19 77 102 4 -57 3 -50 -31 19 -51 160 -96 104 -6 100 -116 129 -43 48 220 96 -94 -57 30 -85
5754 -85 -25 34 179 -25 -57 8 230 -31 -62 -169 75 90 -96 12 -217 118 39 -239 -109 -5 -12 -49 -57 -42 13
5779 13 -28 154 68 114 -135 -103 -4 99 -83 -60 79 -102 -11 51 88 -93 -65 -40 -154 149 -114 -174 -123 60 -125
5804 -125 -171 -56 138 69 97 -53 -48 -75 42 -20 -207 103 -34 46 71 59 -58 -150 5 10 36 -60 8 32 138 -225
5830 -225 73 155 -29 35 -131 81 191 -85 121 7 -96 -70 -32 -2 -108 97 -84 14 146 -88 -76 -10 36
5853 36 131 81 -93 180 -84 31 -59 -34 133 -12 -149 68 143 46 -195 47 -24 108 -93 16 5 76 -116
5876 -116 144 113 -6 -66 -51 135 -24 -72 -12 47 17 -8 -197 1 102 -5 -114 -37 88 17 153 -29 -11 -19
5900 -19 -27 86 -78 75 -58 45 -101 77 -82 -27 -141 83 -4 -106 -17 113 23 45 -11 -149 41 -81 -119
5923 -119 5 -84 -92 127 -153 -40 -207 -71 110 130 -27 -157 -14 -107 102 -7 -25 42 7 -203 -100 -140 23
5946 23 31 45 -2 105 -4 17 -163 21 119 -126 13 -39 -67 15 -131 15 104 70 1 113 70 -126 64 -7 -61
5971 -61 -137 -173 18 -18 -114 -127 44 79 -101 -126 107 100 -53 -210 -82 103 188 39 7 26 83 33 -32 -118 50 -49
5997 -49 -144 113 -74 -71 -64 11 189 -53 -27 102 119 2 -3 -66 -76 -42 -81 103 47 94 -133 -140 155 -10 -46 67 -40
6024 -40 52 67 -42 -108 -67 48 -75 -39 119 76 -63 144 118 -86 -82 179 81 -28 11 -47 17 60 -35 6 197 -51
6050 -51 83 -31 9 -34 -7 45 -129 -30 -32 -58 78 -68 37 -13 -198 -128 54 -60 9 146 -74 44 -91 -42
6074 -42 -17 46 -72 37 166 -10 -149 -109 71 13 20 -44 -119 -3 -149 114 -36 122 27 13 -108 -84 174 -110
6098 -110 -46 54 -169 -267 -46 -17 -25 -85 -115 0 55 14 -25 131 -98 -157 -94 62 39 6 -7 -110 86 42 108 -203
6124 -203 106 100 -109 -61 87 -17 49 -103 -161 96 45 -178 -227 -9 44 64 -134 19 117 -257 53 210 124 -68
6148 -68 -33 -2 -341 -49 85 1 -107 52 -10 80 -7 -46 178 -46 -37 -90 48 84 -69 219 127 -6 -116 -176 -155
6173 -155 -5 -85 134 95 -134 62 -59 176 -9 62 10 23 -84 -94 -23 39 95 -96 23 -21 59 -58 150 150
6197 150 117 -125 -20 102 -21 78 63 -112 64 -136 87 23 -74 -64 -2 64 -85 61 -134 -6 4 -35 11 0
6221 0 -44 89 83 110 69 -37 -106 -5 306 58 -98 1 8 160 54 42 54 -84 -111 -89 58 114 65 61 2 165 83
6248 83 -76 66 -134 28 41 -79 -137 55 -220 -147 -19 103 45 -26 163 -65 -70 39 81 112 76 -112 45 15
6272 15 -158 -132 -237 111 -145 15 72 155 72 62 -178 155 100 -25 -199 -28 39 -36 -26 44 -89 56 95 -9
6296 -9 17 -22 102 99 -64 -81 -66 -85 43 -190 -90 -8 8 94 -19 -65 -32 157 -3 79 -107 120 -84 -81 -101 61
6322 61 7 18 -102 -185 -15 -114 89 -75 -1 73 -47 36 184 39 73 95 34 76 -11 29 169 72 -93 -58 -9 148
6348 148 -154 30 94 132 -178 -50 54 106 -38 -196 11 -101 149 238 -23 160 44 -83 -5 -99 -41 40 31
6371 31 170 5 71 -138 -135 18 -12 -145 -41 3 -121 -88 116 162 33 18 -40 1 -154 10 2 -75 -43 -24 -89 36
6397 36 196 12 -26 -168 -72 79 -26 -60 45 97 -90 -35 86 127 -99 127 -46 -97 54 -29 45 65 74 132 -221
6422 -221 -113 54 40 -57 65 79 -106 -56 135 -29 -154 -172 146 -61 -88 -27 33 -66 120 -76 -82 -2 133 72
6446 72 -148 -74 58 -134 -60 134 -118 -24 -67 62 160 36 -52 -94 -112 3 -26 -61 25 94 12 -60 70 16 -55 73
6472 73 -85 10 13 -10 74 -119 -104 21 41 -4 62 57 12 78 -91 -1 32 -107 -16 -23 -36 29 12 132 93 -171 -59 17
6500 17 -35 -74 101 69 141 -20 41 54 35 -149 123 -79 -72 -101 18 44 -242 42 -180 -19 -150 -39 86 -116
6524 -116 -19 -95 85 -8 -64 -50 -18 194 -52 -118 115 78 119 16 1 46 173 1 -36 -5 78 -6 131 -6 42
6549 42 -228 -13 29 125 -3 -48 -61 108 179 11 202 13 47 16 -78 25 157 63 91 -6 -70 -36 40 93 -45
6574 -45 -48 -37 -30 138 3 51 1 132 103 -44 -172 -228 15 -81 -48 -34 119 48 -36 -19 -23 -27 79 16 -85 -2 51 -38
6602 -38 -53 -14 52 -45 25 -17 -20 -92 -23 -204 28 -117 -173 -40 46 47 87 -31 38 -180 -91 102 -131 -26 -134 -149
6628 -149 -54 -13 -97 112 175 125 -71 -186 64 8 38 -73 -83 15 -114 22 -296 -9 21 7 -9 107 104 -93 21
6653 21 10 -23 -13 -69 18 11 -232 -53 -73 62 100 86 124 65 72 46 209 -43 168 55 -136 30 27 116 -120 136
6679 136 30 -174 -8 181 86 79 -20 -122 10 -69 -10 42 56 130 -34 142 60 46 -66 -244 79 -94 14 27
6703 27 49 134 67 90 -122 -78 5 -33 -19 -101 -55 22 -75 14 -132 18 -99 0 -4 -9 -86 -152 87 -112 -204 -104 103
6730 103 73 13 83 -82 -40 -70 -59 242 -30 -55 -148 67 62 76 88 34 -21 -115 131 225 111 -41 89 -147 9
6755 9 -3 -72 21 67 133 53 -55 -19 -98 -261 104 -94 48 3 334 -40 122 34 -17 99 53 -48 65 198 45
6780 45 106 -65 -67 139 217 -90 -17 33 73 -38 -65 -39 -40 96 -76 -15 -129 11 37 -53 52 -23 133 -8 -55 4
6806 4 -21 183 -59 -90 8 -17 97 -29 21 -158 10 -176 95 -74 143 31 19 -74 -196 -92 -24 -133 82
6829 82 -86 -107 55 6 76 88 -32 -32 54 34 43 -8 -71 -59 -88 -91 -90 27 -81 -114 97 77 -34 78 -7 -216 -1
6856 -1 -124 -82 -62 45 56 30 38 3 67 -91 95 98 -54 -90 31 7 78 25 9 -8 -7 -15 27 123 -26 -20 -157 -78 181
6885 181 -78 25 117 92 31 10 -42 120 56 12 -176 17 -86 -76 95 121 90 -22 -92 -20 -80 43 89 -152 129
6910 129 91 17 -41 128 -21 -5 50 -60 5 47 66 -48 -60 200 126 -72 -115 6 -57 -62 -37 103 -86 -111 64
6935 64 53 65 -31 99 -47 -33 25 -34 62 -39 -81 6 -161 116 148 103 149 77 -72 50 44 -67 -151 -99 -66 -63 26
6962 26 68 -134 95 44 57 89 59 63 73 122 -3 63 -79 12 110 31 -160 -95 -29 124 -16 45 -78 -114 14 -48
6988 -48 -110 78 -103 -190 -35 -41 -75 -67 -31 -101 -116 -101 98 20 -72 81 -37 -31 -117 -28 173 -4 100 76 4 -91 97
7015 97 64 175 -36 40 113 -12 -62 10 -38 64 -10 -167 -38 -38 -1 -100 18 40 145 -96 -28 -78 55 -12 0 29
7041 29 -40 -57 -187 117 -49 -32 -3 32 -44 -88 -53 -87 85 -33 -69 -65 37 -178 45 43 -17 38 96 89 9 -74 59
7068 59 60 107 16 88 -77 -96 -19 44 91 -236 25 89 51 -54 47 -56 -82 152 142 152 89 24 95 51 129 -29 -147
7095 -147 -17 -97 42 75 152 -69 -28 8 85 43 66 -89 83 22 -31 -25 -15 0 -31 111 -29 -56 -111 -74 34 140
7121 140 -27 -107 48 -29 29 13 -66 -72 -37 66 35 54 64 -173 -82 22 63 -121 -36 3 46 -2 -177 -3 62 -38
7147 -38 -67 -244 75 -74 -38 -105 187 30 47 80 -29 -108 65 -25 137 4 -125 -86 32 108 7 -59 -23 79
7171 79 -140 -112 -50 -11 -70 126 184 19 64 -33 8 92 12 163 79 -119 -165 -82 -132 109 -83 -39 96 27 161 -48
7197 -48 -151 -93 -77 199 -73 116 -36 168 59 66 13 119 115 -106 60 159 -48 -69 47 -41 -65 -160 84 -152
7221 -152 -82 49 -10 95 -97 19 -5 8 32 -100 -89 -177 38 -1 -94 -118 -56 -19 80 18 97 -12 81 -104 25
7246 25 48 -54 3 67 -32 53 87 -19 80 3 68 -34 -133 2 -90 -180 259 87 -85 -39 61 -54 29 -42 78
7271 78 62 -42 3 50 7 108 -100 66 59 4 -133 -166 22 26 -43 -26 37 -89 94 -180 -28 203 -133 68 138
7296 138 22 -144 -176 -119 -55 16 74 -112 -78 -144 -3 -12 -77 -29 77 -28 109 79 13 131 61 83 73 19 31 116
7322 116 -64 6 -167 -9 -49 0 -141 -19 38 103 69 113 125 30 38 8 176 2 -64 69 47 -124 -91 -23 58 125
7348 125 -61 75 15 11 -59 34 9 -33 -107 -19 94 77 -172 -189 72 -80 -72 109 49 189 -109 26 46 109 0
7373 0 -71 -44 -88 -73 57 102 -20 67 1 2 106 86 58 -12 -29 -33 -92 7 -180 118 70 -85 -141 42 4 7 2 17 129
7402 129 -37 -141 123 -13 -22 -10 16 108 114 -33 -94 199 -137 106 25 88 38 -51 67 16 108 42 11 -164 -46
7427 -46 63 -36 107 100 19 -107 50 6 -126 -79 0 -73 -48 -71 158 43 82 33 7 -42 -88 18 98 -13 85 132
7453 132 65 108 -33 -53 -32 -204 109 162 104 -36 7 207 -177 -74 48 99 14 -229 196 1 124 -188 -11
7476 -11 -29 -92 27 62 -82 82 -107 95 0 0 -17 -37 77 67 114 -6 -44 1 211 94 53 44 -87 -50 -14 115
7502 115 46 -108 8 116 -2 115 91 63 216 -70 234 -43 88 -36 -142 156 39 52 23 -23 155 -80
7524 -80 -137 -10 -102 188 -26 -63 -50 -32 -80 -24 47 64 150 -25 -21 -193 41 -112 -57 84 20 13 -128 15 -74 -99
7550 -99 -91 20 -3 -29 108 93 -33 -64 117 -72 -73 -4 -42 -181 -190 -126 69 86 18 -36 119 10 -26 -50 28 -147 -59
7577 -59 -16 158 -167 -10 11 50 -30 15 -113 -118 -1 -23 150 76 46 -97 115 50 53 -163 86 24 -226 -35 -40 7
7603 7 100 15 -153 49 -90 -91 -86 93 -69 62 -14 26 97 59 44 20 -28 -23 53 48 -4 33 92 -40 41 99 86 78 -44
7632 -44 26 -30 -22 39 50 -108 42 80 -53 -102 -173 81 -49 -110 -98 8 -166 -51 145 12 -71 38 92 41 98
7657 98 -73 -121 -48 -91 -8 -6 103 10 162 96 -36 30 -26 -68 5 36 -189 -59 -115 49 22 -38 65 24 -56 45
7683 45 -181 5 48 -187 -22 60 44 199 -58 -12 2 -20 95 -13 -105 56 -137 -116 -112 43 35 -95 71 50 -113
7708 -113 44 -58 51 -1 118 82 18 66 -23 -51 -2 -78 118 -146 -117 118 92 -346 -57 -8 108 109 -65 132
7732 132 76 47 -247 16 -38 58 -73 -165 -6 42 -141 95 -52 38 23 -24 -173 -38 -21 202 32 -215 -50
7755 -50 -110 -69 57 14 -2 8 -163 -100 -22 -156 -55 15 92 11 172 153 58 10 -102 -157 39 33 -71 -54 -131 76
7781 76 -33 -19 -119 27 -192 -26 10 -62 162 216 17 -86 63 -100 93 162 70 -18 33 52 -116 98 -41
7804 -41 2 44 80 9 78 -61 -33 -53 -71 114 69 -17 79 -90 -50 -156 49 26 33 -66 91 -41 -39 148 -26 -183
7830 -183 -45 22 132 36 -224 5 -10 95 -23 17 -47 -140 -39 -54 59 199 40 -29 128 -67 -53 -15 -96 -50
7854 -50 -195 107 75 59 -16 13 -41 -151 49 -96 -139 7 -55 69 44 -24 12 -13 19 42 -73 111 -70 -20 153
7879 153 -6 38 -45 91 -43 -187 -110 120 -69 114 -152 -156 212 81 -63 -54 89 -117 -99 -15 7 -41 -29 13
7903 13 -44 -114 -112 -118 98 -63 84 -128 91 -193 117 74 29 -43 -33 -13 -156 -62 184 22 -47 181 112 -15 -32
7928 -32 231 61 10 -108 6 54 5 -119 -121 -17 -61 78 -35 -12 -102 12 -42 -18 -197 -87 -112 -95 25 99 -221
7953 -221 -10 -90 -130 -235 -115 169 105 -39 26 124 -100 -137 -33 -9 -88 116 14 76 -42 61 -126 42 -138
7976 -138 -65 106 288 -68 89 40 -30 107 -74 -238 30 130 -34 27 -20 88 -11 44 -198 -74 297 28
7998 28 -138 -181 -14 -63 113 127 54 14 48 61 55 -134 -57 4 28 -21 -96 -109 -62 59 -23 90 -116 30 -80 -226
8024 -226 2 -77 54 65 -153 56 46 142 -107 51 119 -80 76 -49 65 33 28 120 -28 -159 -56 169 103
8047 103 -77 -97 -18 -95 -62 126 -178 -67 -51 -22 82 86 -27 -8 8 95 -63 43 -26 -38 11 -64 40 -93 86
8072 86 45 -11 -76 57 82 -166 103 43 47 -13 55 -87 7 175 1 21 -32 69 -28 28 -101 21 118 57 -133 136
8098 136 -127 16 -39 -85 -138 -55 -33 -5 -96 -83 11 -73 50 -25 87 42 -29 31 15 -65 85 -33 -93 -83 55 -140
8124 -140 116 56 42 -93 -26 84 -36 0 -10 150 17 -17 55 -100 29 22 12 47 63 69 -17 -238 -110 -58 -20 -76
8150 -76 76 37 121 -18 70 -18 -55 61 28 105 -10 20 -46 -119 26 85 -11 -45 -51 31 -136 154 56 133 144 144 -58
8177 -58 -15 -42 116 -59 -152 109 -79 208 -31 85 41 88 95 -221
8191b21
$$ Imaginary data points
##PAGE= N=2
##DATA TABLE= (X++(I..I)), XYDATA
0 0 0 0 0 0 0 0 0 0 0 0 8 -8 8 -8 8 -16 16 -24 24 -32 40 -48 56 -64 75 -88 103 -119 137 -157 181 -206 233
33 233 -264 298 -337 377 -423 472 -528 589 -654 726 -804 888 -982 1086 -1197 1319 -1452
50 -1452 1598 -1762 1942 -2142 2368 -2620 2908 -3239 3623 -4073 4615 -5278 6114 -7200 8676
65 8676 -10815 14195 -20370 35298 -150919 -27608 308231 12918 -190772 -35894 158655
76 158655 52867 -56134 -60320 -24221 -15438 37033 52350 4246 -59849 -20717 66569 66395
88 66395 -62279 -112693 3763 106306 31677 -64800 -38519 31832 34952 7825 -31041 -61110
100 -61110 -12699 74756 37755 -61950 -24719 71627 18974 -67593 -11359 42206 -30084 -44003
112 -44003 59083 64241 -51663 -64608 36738 53665 -34182 -64240 7523 57289 11079 -38071
124 -38071 547 41103 -10381 -50031 14952 50214 -29579 -57303 39569 71249 -27992 -67675
136 -67675 13724 50299 -7815 -40180 -12280 11962 20667 18628 -11453 -28036 9756 32301
148 32301 -12629 -40028 4110 36943 6922 -21500 -1580 20829 2923 -26801 -15671 21623
160 21623 14368 -29509 -17182 40090 26159 -39499 -26999 34700 18322 -36118 -14676 32864
172 32864 14119 -20672 -2393 21717 3596 -19155 -12017 7091 9883 -5608 -13082 5922 22435
185 22435 1801 -23452 -10699 11988 5040 -9122 -2690 8074 9709 6417 -3601 -10150 670
198 670 5890 -9219 -7866 15639 9903 -16314 -3254 22644 -2241 -32998 -4943 27893 4212
211 4212 -23731 -2999 25664 13092 -16916 -18067 8770 18361 -9470 -23374 10660 31589 -4667
224 -4667 -28746 5182 24282 -12134 -29319 5935 24287 -885 -14806 1740 13744 5039
236 5039 -10667 -14622 3117 18951 1205 -18685 2864 25881 680 -25887 -4757 18223
248 18223 23 -17779 -2314 14044 7326 -7276 -9054 3970 10527 -6234 -17483 6176 23208
261 23208 -3739 -20504 10414 24557 -11513 -26311 7814 21011 -8003 -18355 5355 16887
273 16887 933 -13519 -8003 7441 9015 -8654 -12928 9992 17879 -6503 -14070 9968 12852
286 12852 -12021 -12423 10519 9681 -8123 -6237 6689 7010 -2587 -10242 -6671 7989 9713 -11015
300 -11015 -13843 15043 20106 -12673 -20163 11603 18386 -10185 -16927 7126 15866 -261 -10827
313 -10827 -3063 8504 4985 -11130 -11189 9512 11881 -10350 -10681 13929 11583 -14548 -10964 13312
327 13312 8668 -11949 -6814 10790 9114 -4092 -8182 -793 7988 2846 -12094 -8193 12531 10765
341 10765 -12433 -10674 12843 9812 -12726 -9908 9465 8528 -5100 -5589 4086 8003 1028 -8657
355 -8657 -5182 8911 5960 -12296 -7486 14294 7987 -15079 -7784 13801 5524 -14077 -5812 11237
369 11237 6572 -6462 -4955 5284 7816 -1941 -10432 -1018 12678 2388 -14421 -2587 16366
382 16366 3184 -17090 -5205 13337 3705 -11759 -4800 8263 6539 -2909 -6608 190 8144
395 8144 1831 -9463 -2657 11184 3215 -11238 -1011 11985 -357 -12780 -756 10291 -216
408 -216 -9273 -1542 7426 4716 -4898 -7402 2891 9969 -1381 -11913 1326 14118 397 -13022
422 -13022 472 12187 -545 -11418 -967 8078 1629 -6061 -3775 3684 5669 -2036 -7695 762
436 762 9056 -966 -9486 1867 10715 -1250 -8573 2655 7554 -3372 -7501 1594 6103 -139
450 -139 -5679 -2807 5779 5683 -6379 -10150 5109 12134 -4811 -12191 5401 13939 -2380 -11811 739
465 739 8491 904 -5679 -2381 3717 4007 -2073 -5357 1635 5371 -3958 -7527 4200 7728 -5213
480 -5213 -7033 7346 8347 -6707 -8627 4416 7826 -1097 -6469 -1107 6827 5426 -5655 -8973
494 -8973 3031 8269 -4532 -9320 5186 10109 -4068 -8313 3323 5474 -4323 -4874 4134 6141
508 6141 -312 -4784 -1488 5060 3955 -6179 -6966 5767 7876 -5821 -7676 5962 6820 -6433
522 -6433 -6658 4991 4784 -4334 -3692 4536 5221 -1740 -5465 100 6643 2237 -8801 -5650 9276
537 9276 8231 -7737 -8496 6186 6544 -6616 -6806 4520 5980 -1565 -3086 1249 2334 -1241 -3478
552 -3478 779 6102 1262 -7144 -1709 9434 3176 -11082 -5887 9162 6154 -7103 -6034 4970
566 4970 5780 -3002 -6051 219 5382 1883 -4255 -1436 5048 1628 -5658 -1039 7168 1272 -8695
581 -8695 -2290 7979 2917 -7014 -3441 5176 3330 -4515 -4780 2056 5263 263 -4676 -175 5137
596 5137 564 -5570 -398 5806 633 -5039 253 5407 304 -5420 -2838 2768 2868 -1823 -2768 1800
612 1800 3698 -1544 -5094 509 4930 -189 -4355 1351 5357 -694 -5270 -38 4836 875 -4951
627 -4951 -2755 4214 4566 -3067 -5757 1305 5404 -971 -5769 696 5242 107 -3764 762 3424
642 3424 -527 -2686 84 2197 238 -2605 -1073 3394 2904 -3733 -5348 2344 5322 -2776 -5290
657 -5290 2493 5550 -872 -4403 -350 3223 1077 -2022 -1659 1909 3058 -1159 -3406 1098 3215
672 3215 -2508 -4216 2643 4303 -2817 -4234 2383 3590 -2162 -3098 1327 2814 -32 -2118 -941
687 -941 2722 2564 -2439 -3160 2764 3301 -3723 -3627 4028 3390 -4053 -3512 3161 2465 -2438 -2306 1152 2495
705 2495 708 -2051 -1755 2609 2725 -2890 -3346 3112 3620 -3315 -3062 3087 2404 -3111 -2336 2268 1422
722 1422 -1547 -1472 514 1702 681 -2255 -1640 3336 2587 -3628 -2878 4312 3106 -4348 -3035 3853
738 3853 2493 -3101 -2368 1851 1760 -639 -2031 -707 1972 1570 -2194 -1970 2792 2235 -2943 -1615 3664
755 3664 1520 -3367 -1113 2950 745 -2601 -1070 1471 1276 -902 -2213 -308 2560 911 -3208
770 -3208 -1305 3671 1572 -3787 -1378 3861 1340 -3205 -969 2540 1052 -1759 -1474 597 1652
785 1652 -390 -2366 -251 2997 224 -3619 -402 3703 273 -3641 1 3532 261 -2549 -58
800 -58 2051 599 -1450 -1386 756 1789 -498 -2682 -11 2923 -213 -3439 50 3454 -91 -3261
816 -3261 109 2801 410 -2036 -451 1443 1311 -717 -1552 525 2203 -318 -2999 338 2843 -618
832 -618 -3065 449 2613 -701 -2196 636 2053 -138 -1420 -266 1385 835 -918 -1835 1160 2463
848 2463 -1025 -2924 953 2812 -1268 -3008 747 2578 -706 -2167 291 1747 383 -1051 -708
863 -708 940 1549 -708 -1963 991 2181 -1265 -2382 1350 2374 -1585 -2269 1258 1998 -781 -1632
879 -1632 233 1513 548 -1318 -931 1527 1638 -1394 -1786 1840 1965 -1965 -2152 1827 1937 -1812 -1860
896 -1860 1227 1570 -728 -1583 -86 1321 628 -1586 -1089 1653 1600 -1588 -1469 1714 1318 -1550 -1161
913 -1161 1870 904 -1583 -937 1223 735 -867 -1237 75 1674 761 -1854 -1030 1996 1507 -1934 -1324
930 -1324 1857 1424 -1562 -904 1260 899 -1148 -777 203 669 -110 -1134 -564 1502 739 -2061 -866
947 -866 2239 969 -2117 -886 2233 965 -1507 -361 1109 771 -619 -614 235 948 149 -1358 -199
964 -199 1800 127 -2227 -391 2327 390 -2376 -280 2333 509 -1535 -610 850 868 -129 -846 -176
981 -176 1279 433 -1851 -724 1760 226 -2115 -248 2082 -46 -2093 22 1635 -21 -1279 -234
997 -234 1033 709 -321 -1229 126 1497 -120 -1873 195 2169 -404 -2523 320 2273 -555 -1785
1013 -1785 280 1332 -159 -798 8 766 836 -395 -1343 215 1525 -230 -1596 501 1765 -386
1029 -386 -1688 619 1225 -852 -1211 537 1331 -154 -666 -410 649 840 -743 -1057 912 1944 -694
1046 -694 -1881 736 1798 -1032 -1838 824 1403 -524 -1080 124 959 294 -658 -537 559 635 -812
1063 -812 -910 960 1191 -863 -1112 1140 909 -975 -1077 977 827 -698 -607 230 564 -152 -1029 -604 1043
1082 1043 1072 -817 -828 1118 948 -1257 -901 1141 971 -536 -753 467 628 -279 -713 -373 657 262
1100 262 -903 -295 1045 501 -1238 -728 1052 561 -1102 -174 1106 332 -797 -401 743 436 -400
1117 -400 -840 -187 836 321 -969 -330 1248 541 -1382 -584 1163 541 -810 -191 706 575 -305 -538
1135 -538 20 722 366 -812 -147 1028 270 -1246 -475 1084 238 -1037 -63 1178 136 -926 -178
1152 -178 687 535 -469 -549 326 897 31 -1109 -105 1128 -21 -1425 -113 1230 147 -1088 -23
1169 -23 971 132 -741 -260 461 339 3 -504 109 849 -29 -923 -34 971 -14 -1111 89 1125 -109
1188 -109 -998 -128 618 -66 -654 -50 479 491 -446 -640 469 924 -243 -1052 292 1232 -209 -999 242
1207 242 884 -305 -870 66 702 94 -505 -199 294 314 -351 -565 370 782 -298 -808 430 1018 -310
1226 -310 -839 268 613 -429 -557 198 463 69 -678 -534 306 414 -406 -613 595 881 -525 -861 608
1245 608 846 -306 -906 328 632 -221 -574 -150 369 114 -539 -314 546 627 -510 -516 462 585 -645 -613
1265 -613 671 625 -510 -538 463 391 -267 -565 -27 691 165 -574 -402 750 444 -661 -405 775 571
1284 571 -736 -464 645 524 -379 -255 180 508 -120 -430 -156 461 44 -656 -300 676 406 -703 -209
1303 -209 623 250 -931 -207 685 122 -489 -199 297 598 -111 -422 14 698 35 -608 -271 618 84 -714
1323 -714 -286 687 269 -675 -85 592 223 -56 -189 131 493 102 -406 73 669 -19 -562 -235 669 -249
1343 -249 -692 -51 643 175 -569 -124 448 288 -246 -419 279 370 -52 -593 22 726 -258 -852 -2 770
1363 770 -189 -693 50 304 -27 -276 -45 127 335 -181 -430 167 573 10 -400 316 505 -298 -497 69
1383 69 465 -197 -676 76 397 12 -264 -154 366 282 -226 -309 479 543 -81 -515 282 837 -215 -664 367
1404 367 386 -32 -496 59 368 -157 -355 -107 254 179 -370 -303 400 512 -218 -516 452 456 -332 -327 409 244
1426 244 -280 -454 87 294 123 -204 -74 139 176 -365 -251 407 333 -462 -431 460 261 -300 -348 306 253 -22
1448 -22 -283 23 296 28 -313 -73 197 152 -259 -104 355 270 -388 -342 391 166 -353 -120 343 204 -55
1469 -55 -102 141 297 -50 -182 -48 227 100 -561 -119 374 263 -512 -374 402 46 -384 -146 140 171 -142
1490 -142 -174 -55 93 -132 -308 40 229 26 -343 34 413 -158 -395 -142 277 161 -449 7 236 9
1510 9 -157 -311 54 315 -154 -309 131 314 134 -396 -81 238 -86 -201 -156 234 11 -160 60 124 195 -149
1532 -149 -226 140 316 -134 -324 132 335 -224 -398 24 417 -61 -193 -57 227 76 -101 -260 219 107
1552 107 -123 -123 189 300 -167 -330 89 229 -102 -191 154 321 -348 -292 -179 38 111 -106 -30 150 158 -213 -199
1575 -199 186 69 -305 -305 268 180 -176 -47 -35 36 -133 -271 53 404 163 -136 -41 406 98 -259 -219 254
1597 254 167 -342 3 235 100 -107 -124 42 311 -155 -234 80 355 195 -262 -18 236 13 -254 -102 281
1618 281 122 -219 -63 276 197 -215 -102 -179 244 87 -114 -64 416 -33 -235 -52 260 -70 -298 178 194
1639 194 -97 -231 -35 -57 46 41 91 33 198 173 -111 26 307 -136 -299 30 379 -42 -240 143 155 -47
1661 -47 -360 -93 37 290 -183 -152 94 182 -33 -314 180 358 -8 -263 112 137 -147 -147 182 142 54 -25 -140
1684 -140 214 -86 -207 -176 -7 113 -89 -87 75 187 -114 -338 264 126 -288 -236 215 114 -177 -76 158
1705 158 182 58 99 -107 81 150 -125 -44 206 377 -317 -142 -8 198 -25 -62 0 174 -41 -85 -64 164 -86
1728 -86 -259 -116 268 71 -319 -96 275 51 20 5 203 95 -280 -7 117 225 -101 -113 -183 80 -38 -269
1750 -269 109 262 -18 -317 -65 199 65 -51 -45 312 45 34 61 232 182 32 -169 -73 268 -103 -422 -6
1772 -6 255 -64 -225 -14 161 2 -133 -45 67 97 -45 -154 172 158 -46 -268 19 155 -116 -188 57 217
1794 217 0 -181 -94 79 -16 -334 -106 -182 -25 3 -216 51 301 -17 -184 8 122 39 -151 16 95 -39
1816 -39 -186 108 263 116 -90 114 164 86 -229 -143 255 307 -145 -96 106 214 -270 -429 138 110 -104 -185 65
1839 65 32 104 -124 -146 264 21 -249 -73 94 156 -265 -202 133 17 -226 -196 -5 77 -2 -240 93 148 -75
1862 -75 -101 1 169 23 -181 -56 92 87 -280 -117 227 128 -249 -126 188 23 63 -136 169 291 4 -270
1884 -270 -70 311 -59 -188 -180 191 177 -220 -64 238 11 -290 -256 105 78 -254 -373 40 -30 -92 -322 -26
1906 -26 156 24 -436 -123 182 -79 -341 72 303 62 -248 -46 92 89 113 -91 166 287 -143 -140 -28 327
1928 327 -58 -274 -55 -50 -91 -327 -131 387 130 -165 -134 107 94 99 -230 94 206 -96 -109 41 259 -59 -224
1951 -224 148 111 -236 -239 -51 187 -22 -67 24 131 87 -154 -109 89 276 -321 -126 20 143 -5 -169 156
1973 156 221 81 -182 -84 170 -33 -313 -94 174 435 -121 -218 251 84 -202 -209 374 198 -111 -139 229 35
1995 35 -49 -253 -35 249 35 -355 -133 190 199 -98 -110 322 161 -344 -6 121 163 -141 61 94 293 27
2017 27 -128 -77 135 17 -252 -146 121 106 -288 -183 241 -21 -228 143 29 90 -245 -76 144 285 22
2038 22 -37 109 76 149 -207 -82 356 39 -328 -75 340 205 -231 -154 190 48 -17 -121 -40 220 32 -137
2060 -137 -125 25 -128 -428 -95 351 -242 -366 -48 270 91 -26 -100 366 80 -214 -96 -34 227 -58 -216
2081 -216 87 174 48 -266 159 306 8 -259 43 227 -17 -265 -18 152 120 110 -39 165 224 -198 -18
2102 -18 79 350 73 -336 163 396 -190 -225 33 203 -15 -122 57 205 127 -305 -178 2 5 -167 -175 29 299
2125 299 10 -234 334 219 -119 -215 -19 104 -21 -134 -82 216 116 -188 -79 29 248 -104 -194 1 229
2146 229 -152 -238 72 82 -27 -14 51 80 160 -20 -116 169 -136 -287 -58 135 319 -128 -89 151 107 -106 -181
2169 -181 86 283 -139 -115 173 125 96 -276 -41 101 291 -104 -244 318 -76 -300 -162 7 133 -173 -189
2190 -189 125 88 -228 108 -5 203 -132 -36 -125 93 83 -323 -191 282 -84 -135 67 82 251 -172 -85 144
2212 144 132 -46 -151 61 215 -29 -182 -65 273 170 -100 104 236 171 -82 -65 215 123 -61 -46 13 298
2234 298 -45 -286 183 192 -20 -134 -165 182 73 -286 27 232 -11 -55 -78 -20 1 -124 -74 190 263 -253 -175
2257 -175 8 140 1 -212 86 151 -87 -235 12 138 28 -114 56 95 116 -96 -184 112 70 -70 -300 315
2279 315 86 -157 -212 -91 -1 -139 -115 118 190 -82 -99 -101 47 -12 -88 -24 75 162 -358 -42 217 243 -41 -234
2303 -234 -9 106 -52 -15 -115 10 -79 -134 28 -14 59 -217 -137 253 224 -234 -157 182 226 -27 -190 42 26
2326 26 -104 -35 19 21 -35 -88 77 195 156 -104 -177 328 -6 -209 96 60 145 170 -194 68 -48 -23 -81 -128 74
2351 74 44 -250 41 50 -5 -105 -10 168 -45 -207 -104 201 98 -133 -169 291 204 -86 -295 179 205 -77 -264
2374 -264 -5 26 25 2 101 135 62 -125 -6 184 49 -15 58 71 162 -192 35 147 182 -121 -135 -4 273 -126
2398 -126 -114 -16 101 -86 -185 -125 144 -74 -52 -118 93 20 -67 -68 140 280 -38 -382 62 176 -69 -201 -64
2421 -64 187 29 -88 -171 104 171 -74 -70 183 192 47 -109 124 105 23 -64 133 179 33 -80 26 76 67 -153 -11
2446 -11 -49 46 -138 -3 -17 25 93 -236 108 -17 -112 -192 157 70 -74 41 -305 158 94 -198 -88 21 82 -205
2470 -205 -15 144 96 -94 -65 139 180 -189 -278 14 -64 -107 -132 -68 87 -130 -247 -112 146 40 -263 -61 -79
2493 -79 36 -176 -51 -15 18 -139 39 4 125 -50 -78 86 15 -62 -222 -16 45 151 -19 -127 241 102 -171
2516 -171 -160 -72 -79 -198 70 195 24 13 13 75 99 -132 -206 18 170 -58 -191 -116 1 -85 -70 -100 122 -20 112
2541 112 -5 89 74 -208 -43 57 193 13 -30 -24 50 96 -153 3 84 -79 54 33 93 6 68 -84 -35 127
2565 127 -17 -166 -32 -53 0 -143 -70 75 21 -55 -83 186 -85 -152 -15 130 -19 -77 -128 -11 36 -66 -141 0
2589 0 121 -47 -83 -17 76 -58 80 -19 -1 -152 -64 16 -10 68 -29 -264 82 -60 32 -66 -65 -7 -103 -202 67 196
2615 196 -118 -56 -1 131 -92 -81 106 7 2 -86 62 147 2 50 -140 -23 97 -31 -21 56 128 -28 -66 -76 -91
2640 -91 -137 -29 135 10 -137 -89 -104 -40 -33 -167 -44 -89 163 -109 22 42 51 -30 -47 -39 279 191 225 74 209 -11
2666 -11 -141 73 -34 44 60 137 49 62 64 64 73 112 -53 71 292 70 27 -93 -80 114 -72 -90 167 109 -77 -88
2692 -88 -103 28 -31 2 -23 53 -36 -114 46 150 55 -5 -230 -7 10 45 -133 -22 69 49 -82 -43 -16 -60 14 2
2718 2 34 -14 100 -156 2 -73 -1 88 163 20 -46 -155 29 66 48 -183 55 201 48 103 -11 -78 -21 -208 79
2743 79 -40 -27 -8 -87 -100 -24 66 16 58 136 39 -174 70 14 -35 -254 -72 42 16 9 0 -12 28 -112 -39 75 13
2770 13 -31 -65 47 -25 16 96 -76 65 -122 -49 34 -103 -1 43 167 106 38 -95 -114 125 28 -75 -24 93 80
2795 80 24 -99 40 41 43 173 -16 152 110 -61 64 54 14 77 -158 68 66 69 -20 101 -48 -44 -113 -49 -8 -3 -60 -27
2823 -27 -9 49 -21 169 117 -38 -48 -32 -18 -221 -17 91 22 -107 -57 -73 61 70 -43 112 185 -92 -27 71 -35
2848 -35 -77 34 176 -109 103 -19 -58 -133 -75 189 75 -11 -53 90 18 10 -42 -73 -131 -19 -135 76 -47 -75 44
2873 44 332 92 41 -73 154 -50 -116 -41 2 -80 -27 -19 59 160 -115 6 -38 -27 -90 -77 -121 87 94 -2 76 169 -149
2900 -149 11 -142 92 -58 -64 32 -90 88 -77 8 67 103 -107 25 -42 16 -175 -95 18 123 -24 -41 0 -34
2924 -34 146 50 130 -44 -12 -3 -43 56 -46 -12 -175 33 302 3 -56 32 226 -54 -8 -189 127 120 80 -32 -125
2949 -125 49 -48 -12 -57 -50 -42 -4 88 238 -123 -149 47 -16 3 88 167 66 -37 -117 -155 70 -72 -5 -29 13 113
2975 113 182 37 -216 -10 128 144 22 41 -77 -24 15 6 -133 -71 -92 30 36 -7 30 -42 158 34 64 9 101 11
3001 11 -169 104 30 -140 96 71 -26 -171 0 190 -159 25 -125 114 78 54 110 225 -39 110 -282 -218 124
3024 124 36 8 -86 224 31 14 16 54 61 -52 -103 100 2 -7 5 39 -29 100 -231 -231 19 -10 -83 0 24 -72 88 -238
3052 -238 -86 191 25 -87 -135 -57 44 37 -108 -61 1 37 -14 146 77 88 49 1 155 -146 79 61 136 -44 -69
3077 -69 18 -126 -11 -68 85 17 -110 -1 -132 18 -11 92 114 110 -58 -37 -7 -79 89 103 66 64 37 -78 91
3102 91 157 162 37 -33 68 -6 82 -156 30 -7 50 53 -35 -28 241 -44 -21 19 53 27 49 -60 74 -14 -153 81 23
3129 23 19 -107 25 -168 68 -54 -5 -48 -29 -114 -198 35 123 -8 -105 208 -66 73 -49 28 29 70 -21 -33 64 34
3155 34 -122 40 -29 122 24 -98 14 -63 88 -130 -136 33 -91 -57 -13 -38 239 -99 -6 80 129 59 9 -13 88
3180 88 217 -178 -97 157 39 -19 186 -64 -167 35 -39 11 134 -122 -6 -23 -5 -134 -7 98 -41 -6 16
3203 16 59 22 38 39 -109 132 -193 -96 116 36 7 -105 26 38 45 -149 -22 85 152 -84 -138 3 -45 -60 -220
3228 -220 -3 142 59 -82 9 83 166 21 -79 -31 23 -149 -136 -136 -65 44 -36 82 64 -170 -79 16 83 -22 -289
3253 -289 20 143 47 -102 39 128 -16 27 26 -15 52 -108 -123 166 -57 -100 167 61 147 -54 -195 -68 179
3276 179 62 -269 -101 -42 -37 -103 40 44 -83 85 -22 237 -150 -71 90 -95 76 -86 15 -30 141 131 55
3299 55 28 78 34 -315 78 245 103 -101 28 200 0 -86 58 52 4 -219 -217 39 87 157 -117 45 95 18 -144
3324 -144 68 66 115 36 9 166 39 -21 -88 -111 -25 -83 36 178 119 -97 -149 147 112 78 -133 -127 91 -157 -119 -22
3350 -22 196 184 107 74 -15 98 -208 12 -8 129 -157 -154 32 0 43 -211 158 56 -108 -61 -57 22 -139 -33 110
3375 110 0 3 -103 -48 -34 30 -35 -21 173 61 6 -61 33 57 79 131 8 -66 90 -126 -202 99 -49 -153 -116
3400 -116 6 58 -7 -95 28 30 -75 -260 -199 153 -4 -43 79 152 -75 -86 -75 22 -66 -131 81 45 94 31 -76
3425 -76 115 179 33 -35 -100 227 -42 42 -67 78 19 0 92 264 59 -170 -166 149 17 59 45 -142 255 95
3449 95 -88 30 58 -73 -140 69 177 -90 -81 54 216 -116 -75 -114 102 -53 12 105 -45 85 40 -164 -73 149
3473 149 190 34 117 246 166 -264 -156 187 -47 9 -173 175 204 -271 -47 23 13 -3 -238 100 70 11 -241
3496 -241 -230 12 30 -98 23 271 39 -91 -111 103 172 -21 37 -10 88 156 -166 72 60 -154 -147 -17 113 -13
3520 -13 -225 8 24 -38 -10 0 30 68 -54 -219 102 305 -33 -70 -89 60 -57 -56 -93 162 89 -326 12 155
3544 155 68 -32 -166 183 62 -63 -169 46 164 -164 10 -20 23 -158 7 -176 138 -170 -24 -42 159
3565 159 3 -211 -58 96 70 -17 2 225 275 -133 -173 114 88 -52 -230 39 105 0 87 45 -5 -82 -138 -28
3589 -28 149 26 -35 24 84 -24 -129 -71 200 -56 -9 -81 -78 172 85 -210 43 136 178 -136 -292 45 98 -175
3613 -175 -177 106 -148 -204 -54 -25 115 -159 -176 156 213 48 -205 -125 -55 -54 -88 -60 402 25 26 52 177 38 53
3638 53 -45 12 56 -31 -196 24 251 -11 -2 -12 249 44 -58 -65 112 -103 -29 31 171 -9 15 -116 125 158 -162
3663 -162 -45 -18 26 85 -157 56 151 102 -22 -102 -11 3 -242 -123 87 2 -12 -172 -28 77 41 -74 91 217
3687 217 -34 -149 85 68 -38 -86 12 194 -89 -37 -24 62 -82 -312 -330 7 98 -155 -37 139 223 -74 -72 145
3711 145 237 -131 -218 -95 74 131 -39 105 345 37 -89 -64 172 -11 -62 98 62 158 4 -74 118 -75 -15
3734 -15 -61 55 172 -184 -94 -63 114 100 -66 34 -21 7 -171 -220 98 42 -160 -216 66 -14 -81 -281 59 131
3758 131 96 -90 -29 102 84 -127 -154 215 145 71 -90 -80 6 -150 -74 234 189 -90 -75 76 237 147 -51 -102
3782 -102 11 3 3 -131 163 -49 -211 -81 200 111 -14 -296 -194 263 -53 -115 83 -35 -71 -175 105 127 -59
3805 -59 -52 -17 57 44 -137 -176 24 142 -239 -20 86 7 -82 -146 9 162 -37 -206 -12 12 -46 -216 29 12
3829 12 59 -187 -150 109 -7 46 -239 36 59 -140 -94 64 160 -116 8 98 33 -77 -235 -60 81 117 81 42
3853 42 247 26 -38 28 -82 81 -171 -209 -57 179 -60 -288 -49 68 -198 -164 43 162 -49 -80 -115 185
3875 185 7 38 2 177 50 -246 64 130 164 -104 -87 160 252 24 -153 107 -63 -6 96 8 12 79 -66 -58
3899 -58 -93 90 -77 -156 65 -107 32 -25 31 74 -98 -170 87 55 78 -164 81 171 34 4 -99 147 14 -190
3923 -190 -180 72 0 -46 -71 -30 154 -107 -49 -14 129 -73 -201 35 46 76 -305 19 -7 39 -30 -50 114 -100
3947 -100 -185 -219 7 124 -52 35 -70 -25 90 -69 -240 49 -128 -139 -104 165 71 -14 -103 53 113 -29 -51 2
3971 2 227 -33 -41 150 132 142 -132 -100 44 126 -50 215 81 -48 -97 -183 137 172 -97 23 46 150 55 -111
3995 -111 -114 88 -105 -211 -142 38 33 -206 -32 78 -97 -157 114 130 -22 -94 -22 178 -70 -110 -61 6 122 -1
4019 -1 -85 38 121 -32 76 -2 108 -19 -47 -11 -75 39 -30 -142 75 46 -5 -296 229 19 -49 -56 52 47 -186
4044 -186 -130 102 216 132 -109 121 78 76 50 -28 -25 151 143 -20 62 80 56 -93 189 141 25 127 -73 87 -134
4069 -134 -174 36 -13 -21 -5 -45 -14 -23 -169 -175 -114 2 -24 -154 3 27 -28 -37 95 42 22 -41 2 117 47 -25 -65 27
4097 27 -119 -59 0 146 21 -102 42 -39 144 -123 -94 10 -12 54 122 -125 241 -40 -136 -149 -43 163 -167
4120 -167 -93 -73 77 -52 -32 -46 150 -16 -103 -102 39 -70 -12 26 -167 -16 -297 15 114 45 -59 -21 141 74
4144 74 -28 -150 33 42 -119 -82 -46 -212 -3 -75 -18 154 -18 -105 -46 -70 -49 -95 -57 -76 43 -52 -46 105 130 -66
4170 -66 -75 51 17 62 -18 24 134 89 33 67 159 63 -44 0 153 182 -309 -131 126 -77 -86 -19 -14 31 72 -29 -131
4197 -131 -110 -69 11 -162 -22 -99 -52 62 117 -85 -24 43 1 -28 150 127 -119 -33 -37 86 -1 97 37 -132 12 -114
4223 -114 118 -60 244 172 43 103 17 -27 72 87 0 -157 126 -134 5 307 -34 -73 53 -16 -24 -26 3 62 10
4248 10 46 -28 -116 76 -12 -50 -90 -59 52 -129 90 -102 10 23 -49 38 -5 19 101 -32 15 70 -36 -238 17
4273 17 49 -102 -53 0 -73 -132 -65 40 48 -55 -98 -89 -19 32 -168 -72 100 104 -33 -219 -69 82 -61 67 -103 -30
4299 -30 -74 -127 94 10 -248 -46 0 75 28 -225 -104 -28 110 101 -52 178 83 -16 37 -142 -33 -96 -45 68 57
4324 57 -31 -69 -282 44 -17 85 -173 130 39 89 -66 83 183 -129 -23 117 124 152 124 23 -7 -55 -115 -36 -102
4349 -102 34 -7 58 66 36 -2 36 69 38 -19 -245 94 42 -196 -163 94 -61 2 -53 -84 -9 -278 -77 77 120 -67
4375 -67 -51 -57 -115 -91 10 -5 33 74 26 81 -121 24 147 52 57 139 -37 -132 -74 31 55 23 13 10 -46 -71 -129 -29
4403 -29 107 -206 1 113 -37 -12 47 -116 145 -35 -9 -45 -119 -31 13 -33 101 34 88 -157 44 131 -56 101
4427 101 15 -58 -97 -214 -61 96 -51 -47 25 -60 45 -10 -25 2 20 -31 -185 45 0 -88 -118 -110 66 -70 5 5 72
4454 72 120 -43 83 -183 -7 92 33 48 51 33 37 37 -165 28 -94 79 102 -85 101 -124 113 49 -27 -6 35 -22
4480 -22 -151 -167 -40 -120 -54 -66 17 63 -13 99 -27 -16 63 47 -33 31 -53 -135 47 -58 -154 16 101 79 -64 87
4506 87 -159 -58 131 82 -67 -88 -30 -50 -141 -36 95 132 -68 -3 38 -106 -62 75 14 69 -67 -52 -220 -54
4530 -54 0 27 -34 19 -125 -103 -8 -54 -64 -181 -77 -7 59 -41 -71 -11 -27 -114 -9 -57 -14 34 11 28 -142 -52 26
4557 26 27 -40 97 121 74 93 47 3 -203 -33 52 52 -20 -122 -44 125 84 33 87 42 -26 46 -69 -197 141 305 99
4584 99 26 -38 60 6 -212 -84 -62 165 1 -81 13 4 16 -106 107 -13 -114 -50 48 -67 -116 -47 15 -39 102 -74
4610 -74 71 39 -14 -66 36 3 -2 41 92 -80 -47 -77 -59 -2 -19 -145 89 -3 15 8 46 259 186 3 173 95 -35
4637 -35 170 -40 -6 -7 -35 -130 -138 -16 33 -28 154 25 -85 -31 146 4 -42 25 -95 13 -44 -3 6 107 121 36
4663 36 -144 -136 88 24 -35 64 -37 8 62 -9 95 -123 -104 66 44 -151 4 53 -176 -37 -117 -112 41 4 67 -73
4689 -73 -103 180 69 151 -142 256 -219 -50 -45 -44 -85 48 132 -4 -87 38 -13 71 61 47 87 73 5 -155 58 -85
4715 -85 5 -160 3 -25 161 -125 -94 114 72 -59 14 5 -9 46 63 -145 -48 -29 -47 -67 -35 -97 -7 -49 -74 -29 -260
4742 -260 17 60 31 37 -49 -125 137 -95 -16 95 42 -108 -9 24 66 -124 66 37 85 189 -56 15 -39 6 -84 -7
4768 -7 -92 -14 55 105 -147 -79 -46 51 79 123 -130 -30 -37 -84 -143 -118 -119 -40 167 -43 27 10 -23 -43 -119 -54 122 -100
4796 -100 66 27 -309 148 17 -13 166 205 1 -104 -2 146 -4 109 71 43 22 30 66 -86 47 -14 -118
4819 -118 55 -5 -81 4 -94 99 -10 -173 62 -33 -127 2 -65 31 88 -137 -142 106 -5 11 -77 111 148 119 17
4844 17 66 -40 -58 -71 -4 60 -8 -149 76 193 78 33 -67 19 62 102 -130 165 -26 -51 -47 135 -62 -160 -5
4869 -5 -202 -106 -112 -12 -116 95 -44 -52 -40 -70 -15 -71 -101 116 39 -1 64 24 -28 -95 84 -33 39 -19 -90 158 -64
4896 -64 22 -277 -110 74 31 194 4 72 -23 -40 -19 -39 80 -12 146 81 26 105 4 -100 7 72 -179 16
4920 16 -72 149 -14 -30 6 84 -139 -41 68 -24 -43 -120 -61 -4 73 21 -86 94 -37 4 57 -38 36 -14 95 32
4946 32 43 -127 19 -107 86 189 -93 -13 22 -59 67 -104 -21 25 -81 18 -92 -126 -46 26 -24 -55 42 51 85 -4
4972 -4 39 180 27 73 121 21 87 -48 155 75 72 130 -209 -44 152 -109 -145 123 35 -49 89 69 -88 7 -5
4997 -5 124 -38 -2 293 -117 55 -13 74 30 -3 86 -186 -103 -113 -31 103 80 -127 -200 146 157 -42 122 5 -128
5022 -128 -55 -134 -127 14 104 142 -81 164 89 -105 -70 -25 -25 105 -85 -42 209 -152 -154 -115 -35 12 -66 -58 91 44 -85
5049 -85 151 165 -42 -14 13 85 69 131 132 70 -45 -37 -169 29 96 10 50 -35 -54 161 -104 30 -2 166 -116 -77
5075 -77 115 -17 -20 -225 118 -95 -99 -41 151 58 97 8 -29 93 187 -44 61 181 -30 -6 -18 50 -31 107 52
5100 52 103 113 -70 30 147 63 -79 -26 58 -51 -117 -48 -225 -35 0 61 147 -90 26 -63 79 10 21 -34 -22
5125 -22 125 161 -7 99 24 13 -34 -85 132 -82 -124 33 16 -78 -76 27 -58 22 -187 80 17 141 -166 -31 -125
5150 -125 -72 79 -127 147 19 210 -41 -106 83 -20 -14 -91 -42 -8 122 -176 -31 131 65 -28 -37 262 203 156
5174 156 -134 -63 57 -24 -106 51 97 80 39 110 -67 3 -84 -79 51 -10 -63 -21 -64 -12 117 76 -20 33 -27 -17 -33
5201 -33 63 -143 -29 -163 117 90 112 -13 -38 -67 -220 -15 -127 -152 15 41 39 42 22 -134 55 184 72 -85
5225 -85 76 -10 39 68 12 64 102 -136 -92 -108 78 -48 -18 50 171 -104 -63 -25 -30 107 4 33 11 -137 7 -20
5251 -20 84 -39 133 -94 75 206 41 74 -106 1 68 -101 120 -29 63 38 -57 142 -37 128 56 -16 53
5274 53 -39 45 29 55 94 -78 55 -43 30 31 -31 42 -134 109 -191 116 -14 -23 73 165 -79 -77 26 126 -74 -172
5300 -172 59 91 -40 88 -79 263 82 -175 49 48 -11 -47 52 -69 -49 80 94 101 -37 -14 -55 -26 58 -89 -87
5325 -87 -264 -55 -133 -45 -80 -80 59 -64 14 -36 -6 -16 50 13 134 56 -12 -61 71 -155 -102 -112 -118 120 43 -81 0
5352 0 41 151 -217 16 23 -25 38 117 140 51 34 -137 38 52 48 163 50 207 194 8 64 33 121 -164 -18 115
5378 115 64 -78 -9 -94 -26 -63 130 50 40 -31 9 -56 144 -41 30 -24 15 132 41 -13 -119 78 -129 -37 158
5403 158 121 30 21 -22 -27 158 -253 -3 76 -158 29 8 13 -44 -122 -124 135 6 -33 -75 164 129 -175 -56 -22 168
5429 168 -74 -6 -65 4 0 18 -71 126 -45 18 -4 -58 -137 162 -20 62 21 36 201 179 20 -134 47 35 40 -20
5455 -20 65 42 144 -137 -54 -71 -100 32 120 -56 8 -27 2 -64 16 51 -11 -86 -93 25 -78 -46 12 290 -48 -56 117
5482 117 74 133 42 -30 -47 -9 -30 -100 14 128 -37 66 -130 128 190 -19 100 247 -105 46 11 90 85 -91
5506 -91 -16 118 -48 69 103 73 77 -79 49 218 41 2 -221 -39 38 0 -90 -141 -26 17 -106 -39 14 24 -31
5531 -31 -33 -53 -33 -93 -11 -19 -186 -163 -150 56 89 -66 -53 -86 77 37 171 -9 110 -49 57 87 25 -43 83 18
5557 18 35 35 -133 -34 124 84 -51 -5 -79 -9 -66 -140 -33 43 40 -95 -37 -6 -82 20 -136 6 174 -21 -101 7
5583 7 35 138 -157 27 -67 26 -8 -19 54 -66 62 34 -7 37 -1 -50 -93 52 -8 -133 -69 105 -22 10 10 22 -1
5610 -1 56 23 91 116 66 -179 312 24 -282 -39 -8 84 -7 -139 -131 -156 -102 -52 225 -4 78 -205 37 95 -7 106
5636 106 -38 150 -18 -164 135 -14 140 32 -81 -59 1 13 19 58 -10 89 -157 52 7 -97 0 28 -55 144
5660 144 3 9 150 1 -80 -50 211 78 -7 -60 -6 -15 -57 -87 -129 165 39 -149 2 -67 110 -104 -84 105 56
5685 56 29 19 63 -105 91 -98 -60 -33 -64 12 -169 107 21 34 13 -152 -48 -114 11 -14 -42 -222 69 29 -52
5710 -52 86 -100 6 80 -11 137 -72 109 -30 14 53 122 95 175 8 77 -289 -201 -23 35 -158 -47 -131 -129 138
5735 138 -140 -151 -46 89 -71 -3 -107 111 122 -241 -96 -61 -39 49 -178 -97 20 -116 -32 -91 143 42 -1
5758 -1 -69 -9 -93 -45 85 214 42 -112 -57 88 29 34 25 -106 65 -108 -97 -5 -30 63 -29 58 74 -66 7 6 -110
5785 -110 61 38 7 35 27 70 10 130 -2 -94 -95 7 24 -56 87 6 106 -277 -55 11 68 -10 -59 -71 60 -97
5811 -97 5 126 -78 71 111 -15 -7 -2 25 -38 -90 60 -5 -84 81 140 41 66 -42 96 105 -46 -8 -16 218 143 -107
5838 -107 51 42 85 -54 -9 24 -167 -79 4 40 -2 53 22 197 -117 40 -99 231 18 -36 129 -9 140 22
5862 22 -75 153 170 -6 46 191 -32 229 132 -68 140 39 -109 -168 48 85 -35 -190 -171 47 116 256 -16
5885 -16 47 -15 216 -27 282 15 -118 26 26 17 79 -56 -37 93 -38 -87 123 -11 -208 -32 61 -135 -17 -151
5909 -151 90 -51 36 -89 -26 -54 -24 -81 -20 -10 -45 -102 -70 -25 170 -42 -111 -31 -14 -32 -85 -82 -57 206 148 -18 40
5936 40 42 101 -24 -38 -43 -32 -13 36 -55 -39 -56 81 -28 17 -62 -10 -49 -21 -29 2 -73 -103 -122 -59 23 -71 43 81 -60
5965 -60 -19 -59 -132 50 -29 -71 -5 14 44 33 158 130 -57 136 13 -140 114 -174 -63 76 142 38 -106 -154
5989 -154 -90 9 -86 -17 -34 -67 -110 -63 119 -17 12 -38 54 94 46 -142 12 135 -63 144 -47 -57 152 118 -123
6014 -123 64 -2 -66 -115 -47 6 50 -66 18 -113 137 -39 64 42 13 58 -129 129 148 -17 -50 85 -86 -175
6038 -175 15 -19 92 -136 -132 66 -55 36 96 -33 125 14 -108 -62 38 80 -85 -92 -33 11 44 39 35 10 -67 -44
6064 -44 57 30 100 -55 -22 110 45 -57 -99 54 191 -15 35 -61 -101 -52 -45 -20 -91 -86 -136 82 3 -59 -142 42 -120
6091 -120 205 -27 -12 63 -55 -174 -85 42 -127 -174 -134 -37 -133 64 -87 183 112 -38 29 -73 3 -46 -14 35
6115 35 165 50 24 51 -12 -53 -68 111 66 112 -203 60 11 -2 45 31 117 112 -48 -120 -25 -47 -18 -54 68 103 105 133
6143 133 -134 117 -120 124 20 -93 160 115 210 -14 87 1 -19 11 98 60 -142 92 30 25 -131 28 125 -80
6167 -80 182 -47 8 129 -87 -73 86 20 -86 -205 -100 186 53 93 -71 -8 23 10 -123 53 33 6 66 100
6191 100 137 -9 57 70 -22 157 78 -104 -6 -37 123 37 -17 -65 -50 -103 24 37 15 -63 48 -32 30 25 19 -117 21
6218 21 6 -71 -98 14 -7 -36 21 80 -57 -50 96 81 102 9 51 -44 -19 -44 -68 182 -42 70 122 24 -74 9 9 79
6246 79 -33 -29 71 -134 24 -2 109 118 106 35 55 -25 5 68 -95 32 -20 -62 15 78 186 -35 -1 59 138 -155
6272 -155 46 31 84 83 -87 -114 68 -9 73 -10 216 106 -47 -100 -55 -11 -62 -3 -42 4 -91 86 52 49 28 171 -76
6299 -76 154 -34 27 74 70 -77 -46 83 -107 37 -80 -90 71 27 -154 -73 -25 44 -4 -31 -118 -99 116 55 -17 113
6325 113 119 -80 62 -64 20 71 -17 -124 0 75 -123 -12 168 153 -237 29 204 -64 20 66 61 -59 -49 138
6349 138 -120 20 117 -96 6 72 -45 -73 66 37 149 -55 -21 59 -176 74 -47 -72 47 -49 -113 6 70
6372 70 -80 97 71 35 7 -16 32 185 177 95 -7 -93 1 33 -77 -11 151 25 83 33 23 -93 76 -54 177
6397 177 -122 8 129 -30 -74 67 -47 22 3 -19 -15 3 -138 103 125 119 -102 4 -119 -216 -141 -164 -4 94 62
6422 62 -69 -134 -82 49 -186 10 -84 1 -164 -29 75 -7 22 164 -141 60 81 -46 69 3 60 -73 131
6445 131 -58 49 24 -42 234 -7 -57 10 -19 -37 0 -88 -72 -223 -45 154 -192 -137 -49 8 62 -2 128 -85 -188
6470 -188 117 103 -30 170 -3 74 50 -126 -70 181 57 28 -67 175 -102 150 113 133 82 -121 -110 119 146 -165
6494 -165 -67 -117 -122 7 44 -92 16 121 79 -116 -49 135 -68 101 -80 44 -86 -7 -48 69 49 -59 -3 -66
6518 -66 184 151 71 68 114 70 192 199 96 59 65 74 -25 53 -75 -36 -82 -1 37 -2 146 -69 -83 27 -27 -98 -1 128
6546 128 -53 -66 50 28 65 -52 -124 109 137 203 10 -59 110 109 -120 -130 -199 130 -39 -48 129 20 -88 8 44
6571 44 18 47 -66 -21 -45 -151 74 -81 -131 -77 -26 -97 -108 19 -16 38 -124 -103 -44 16 -42 106 -55 -16 -34 109
6597 109 -69 88 176 -182 -52 193 127 -173 59 6 11 87 -79 187 -105 47 -64 22 129 -107 30 -39 12
6620 12 -129 5 37 -34 0 -22 5 -42 74 -107 -71 -7 -17 57 102 138 -38 77 -121 9 118 -193 41 -85
6644 -85 122 -22 -40 14 80 11 -227 -58 129 9 -105 65 92 119 -208 -15 68 -71 -121 134 44 -5 52 -74
6668 -74 -99 101 49 -55 128 -78 20 56 138 36 169 -80 44 -18 -56 24 -36 51 41 -34 -12 -7 -18 -63 88 79 13
6695 13 49 -13 -34 -15 -57 80 24 27 61 -54 26 5 12 -186 -204 30 147 -38 -123 131 23 -95 38 -13 -128 -106
6721 -106 -46 -106 10 -94 32 75 87 36 123 -200 69 19 -111 -154 140 -108 -137 -69 -1 123 6 87 133 -94
6745 -94 -116 -204 61 213 85 121 92 53 44 43 -56 -116 -212 -87 63 -107 68 94 6 -54 5 -97 -32 -5 132 9
6771 9 42 272 104 73 -21 -95 38 30 -53 112 -6 78 27 -1 107 60 -49 105 -35 -53 82 -33 97 151 -42
6796 -42 52 103 196 83 8 -24 -93 92 -97 -107 109 -91 -20 84 -141 -86 -96 -93 53 -33 -207 126 -105 47 33
6821 33 179 -190 49 92 -176 -119 -44 44 91 -87 22 -45 31 106 -191 -69 66 75 -133 -54 -14 -26 9 25 -147
6846 -147 -82 215 -18 13 -123 127 39 -37 127 -62 -57 35 -6 -118 -121 124 -39 26 40 -15 -46 -92 -71 71 -43
6871 -43 -1 25 16 -27 27 -208 138 127 -53 7 -45 43 -160 100 -56 81 51 -70 34 14 93 36 113 -87 -37 275
6897 275 65 -72 -110 9 45 -47 -25 -92 23 -17 -112 167 120 33 -94 -80 -201 -24 67 55 1 56 -110 -39 1
6922 1 83 145 60 65 -86 79 -102 203 75 -54 111 72 51 18 -63 42 -39 6 -34 10 56 251 38 9 18 -122
6948 -122 -180 -21 196 -64 -210 -123 -104 -36 -24 -222 -26 88 -176 -142 96 -43 -59 55 21 -37 -2 -42 167 121
6972 121 -98 7 20 -86 148 -19 -56 141 -93 -19 -8 -108 33 88 24 -157 -36 49 100 65 44 -9 -194 119
6996 119 27 -94 -21 26 9 34 35 -127 92 -107 97 -102 -49 99 -113 83 187 145 59 1 -120 -56 128 69
7020 69 -84 38 103 56 134 -169 221 -160 -11 -123 -53 72 54 73 4 -22 100 -98 -9 108 51 29 106 25 -85
7045 -85 -206 -45 -21 -5 -44 -74 -10 -69 -26 176 -6 -59 -23 -238 -207 199 -20 54 85 85 11 -143 -11 -140 198
7070 198 83 -13 -165 21 -188 -27 -1 -47 0 -11 105 231 4 122 -41 -14 32 -55 50 84 16 -12 -99 29
7094 29 125 67 259 92 91 -87 -63 -55 -37 178 58 -14 151 7 -55 -129 33 76 -92 12 93 -96 -116 82 -92
7119 -92 108 -14 -68 -2 67 -12 102 7 17 -145 -127 -185 -58 64 -62 -96 108 33 182 81 -24 7 152 120
7143 120 -23 130 167 -33 -15 111 44 -87 -128 39 -92 -25 58 105 61 -5 25 -80 -50 -36 42 -45 23 -84 -6
7168 -6 53 -128 35 212 1 -35 -26 18 -94 98 34 44 -13 -11 -50 228 43 36 52 -24 -23 -203 -45 -79 -70 8 -23 62
7196 62 121 -35 60 24 -80 137 -160 -8 -5 -14 89 78 -32 -33 148 127 13 -46 16 -107 40 -33 62 69 73 -83 120
7223 120 130 60 53 98 44 95 -44 -49 -90 -113 53 -10 -32 17 39 -159 -170 62 30 -142 -42 -64 -92 -34 -171 -18 -46
7250 -46 70 2 -141 89 33 -5 -63 -153 -69 76 -34 38 49 67 30 -179 -25 -41 -74 -35 97 -48 -156 -9 191
7275 191 139 148 59 -6 -84 12 32 125 41 -132 -121 19 228 -169 18 -59 42 -38 103 134 67 -53 134 -47 104
7300 104 84 142 41 -3 83 114 80 -102 -20 -47 -198 -49 -43 76 56 63 -70 35 112 -104 -34 48 -11 -58 32 -88
7326 -88 58 16 156 -18 -210 -5 53 -3 -94 -73 -52 -15 -27 5 120 -79 -112 -1 -39 65 11 -74 196 -67 -109
7351 -109 -120 -186 210 186 -20 -87 -117 96 86 -109 83 35 147 -126 -72 -72 96 -152 -146 40 13 -52 -5 268 32
7376 32 -41 -86 -36 72 -86 38 -35 -11 -141 -121 94 65 -13 102 17 157 67 -53 123 -45 -86 30 -86 -10
7400 -10 3 -56 90 -20 145 -8 -118 -140 -76 31 -123 -37 -74 41 -71 -138 105 180 -65 9 -32 -66 -58 -29 20
7425 20 40 -94 75 142 9 -40 115 -64 192 203 66 61 27 -72 37 59 -24 -58 59 143 1 -76 -193 17 -113
7450 -113 -16 65 -89 -99 -22 56 -11 -67 54 58 -28 -140 148 24 58 -115 -28 -61 130 -56 107 118 46 -89 63
7475 63 84 -119 6 97 104 41 -5 -84 159 22 -44 -67 31 -27 -154 -126 26 50 -67 -80 -13 20 54 -158 -69 180
7501 180 -1 165 -23 20 -20 -69 -62 -20 14 -81 2 -155 23 -48 28 -112 146 192 -4 -51 -119 145 119 -95 153
7526 153 -11 -77 -93 -34 51 93 -120 -241 115 -41 -7 -142 48 82 82 3 45 -65 -198 129 -120 -34 -45 84
7550 84 226 93 74 62 149 120 77 -135 117 98 -28 5 8 139 -88 73 -136 140 79 -55 -85 -95 153 73 -19
7575 -19 -13 -59 -50 -83 97 155 -155 -62 -21 78 66 76 -23 -109 78 -6 42 -49 -71 -109 -70 65 91 19 16 -68 -52 239 -101
7604 -101 9 67 -154 -96 -56 40 56 -4 51 49 10 66 -36 -72 73 33 -110 -135 -39 -37 -90 5 -134 26 -125 104
7630 104 117 94 -72 97 150 33 -38 40 11 -6 -24 -163 -115 17 91 169 21 116 27 -24 56 -29 47 -14 -71 -29 72
7657 72 -40 31 -144 -23 42 -130 -87 -71 72 -113 -79 -53 -32 -35 -50 100 -32 98 -34 127 202 33 -48 53
7681 53 240 169 19 41 -90 -181 220 -106 215 -68 45 -59 -101 81 -137 35 27 56 -128 -125 132 130 -100 -18
7705 -18 16 164 -58 5 -116 8 124 20 60 104 27 -64 51 128 50 -27 130 -17 -119 -158 -156 -61 -89 87 -6
7730 -6 83 133 78 71 23 -29 208 -34 26 17 -36 -51 193 46 -48 -72 -44 25 87 -100 -68 33 -76 -264 5 97 -111
7757 -111 -93 34 -122 89 -57 60 124 -30 3 -81 -35 -82 -10 -54 73 137 141 57 -88 58 42 -92 -14 28 69
7782 69 -13 70 21 -25 255 145 -58 146 -100 -62 38 -85 94 -127 26 13 206 -54 -155 31 -1 39 -3
7805 -3 -238 -79 300 85 35 -88 73 30 -35 36 105 0 94 -3 -87 32 12 -65 -117 -146 -155 94 53 46 53 33 104 73
7833 73 -112 22 96 -35 -264 26 78 177 -22 -49 -64 187 -64 -62 109 -110 250 -46 37 -30 159 121 93 -38
7857 -38 -43 -56 -60 21 102 -37 -162 1 -29 -17 37 67 -38 -9 41 22 30 13 -121 -156 19 14 -48 -29 -18 15 19 -140 30
7886 30 183 6 -31 17 20 43 -71 78 -94 -197 18 37 4 59 -152 -144 -72 30 -191 105 25 -21 101 -38 49
7911 49 -41 -87 -130 -121 -4 -44 -33 -104 -46 -66 74 56 53 95 -30 116 26 -30 -95 -47 163 15 7 -10 189 27 101 123
7939 123 -187 4 6 -80 44 60 34 -117 -110 107 -97 11 -53 -16 20 -120 -21 27 -133 -8 68 -160 -33 162
7963 162 -174 195 12 4 -134 52 14 33 -99 -10 -126 -77 -77 -76 -66 155 100 -95 -146 -29 -26 -84 11 77 56 -32 -84
7990 -84 64 92 -35 -18 106 39 -67 -204 -107 71 85 -27 -5 -20 43 4 33 12 134 62 27 28 -37 -139 -154 151
8016 151 72 206 -87 25 81 -66 -26 188 94 -80 48 6 20 -28 -241 -152 -11 93 104 158 -83 52 -39 47
8040 47 -37 62 194 53 -289 141 106 -65 -18 -3 -138 89 -75 -143 -107 -7 28 -20 -53 -134 41 -40 -23 -96 212
8065 212 -23 -134 31 -42 -42 64 -49 -143 76 -9 -148 -250 -37 48 54 73 -185 108 -111 74 65 -14 -142 -26
8089 -26 -72 65 -65 40 -38 109 -104 -202 -89 71 -98 -59 -173 -32 -3 33 -49 20 -113 21 -113 4 19
8112 19 1 -57 -108 62 -44 -7 44 -8 44 -11 -162 -25 103 -11 -23 52 2 146 66 1 -78 -23 -61 -126 -84 -38 23
8139 23 -6 86 38 81 31 56 17 -349 -132 4 -218 4 -41 -24 -34 134 48 137 -64 -65 46 -43 -187 93 24 -81
8165 -81 -38 9 -107 91 48 102 5 136 2 1 -26 -194 -133 -124 -33 -19 25 -56 135 70 31 -75 71 -30 -82 -99
8191i9
##END NTUPLES=NMR FID
##END=
