##TITLE=1H_DE-80H_X3
 200.13MHz, d2o
 8 sc
 
 19ns.26.2.2025
##JCAMPDX= 6.0         $$ Bruker NMR JCAMP-DX V2.0
##DATA TYPE= NMR FID
##DATA CLASS= NTUPLES
##ORIGIN= UXNMR, Bruker Analytische Messtechnik GmbH
##OWNER= pz
$$ XWIN-NMR		Version 3.5
$$ Wed Jun  3 11:26:13 2026 Russian Standard Time (UT+4h)  Yarkov@DPX200
##.OBSERVE FREQUENCY= 200.1313
##.OBSERVE NUCLEUS= ^1H
##.DELAY= (6, 6)
##.ACQUISITION MODE= SIMULTANEOUS
##.ACQUISITION SCHEME= undefined
##.AVERAGES= 8
##.DIGITISER RES= 18
##SPECTROMETER/DATA SYSTEM= spect
##.PULSE SEQUENCE= zg30
##.SOLVENT NAME= CDCl3
##.SHIFT REFERENCE= (INTERNAL, CDCl3, 0, 14.3821)
##AUDIT TRAIL= $$ (NUMBER, WHEN, WHO, WHERE, WHAT)
$$ ##TITLE= Audit trail, XWIN-NMR		Version 3.5
$$ ##JCAMPDX= 5.01
$$ ##ORIGIN= Bruker BioSpin GmbH
$$ ##OWNER= Yarkov
$$ C:/Bruker/XWIN-NMR/data/yarkov2/nmr/H-C/1/audita.txt
$$ ##AUDIT TRAIL=  $$ (NUMBER, WHEN, WHO, WHERE, WHAT)
(   1,<2026-06-03 11:25:26.62 +0400>,<Yarkov>,<DPX200>,
      <created by zg, POWCHK disabled, PULCHK disabled
       configuration hash MD5:
       00 E9 B6 7A A2 85 ED C7 34 08 36 98 17 FE 4E 26
       data hash MD5: 16K
       BA 69 56 53 E3 C6 F8 49 5A 4B 75 54 EF 8D B4 02>)
$$ ##END=
$$ 
$$ hash MD5
$$ 09 4A F2 97 CA 4C 8E 5D EC CE 31 8B F1 35 FF 5E
##$RELAX= 
##$RELAX= 
##$RELAX= 
##$RELAX= 
##$RELAX= 
##$RELAX= 
$$ Bruker specific parameters
$$ --------------------------
##$DU= <C:/Bruker/XWIN-NMR>
##$EXPNO= 1
##$NAME= <H-C>
##$PROCNO= 1
##$TYPE= <nmr>
##$USER= <yarkov2>
##$AMP= (0..31)
100 100 100 100 100 100 100 100 100 100 100 100 100 100 100 100 100 100 
100 100 100 100 100 100 100 100 100 100 100 100 100 100 
##$AQSEQ= 0
##$AQ_mod= 1
##$AUNM= <au_zg>
##$AUTOPOS= <>
##$BF1= 200.13
##$BF2= 200.13
##$BF3= 200.13
##$BF4= 200.13
##$BF5= 200.13
##$BF6= 200.13
##$BF7= 200.13
##$BF8= 200.13
##$BYTORDA= 1
##$CFDGTYP= 0
##$CFRGTYP= 5
##$CHEMSTR= <none>
##$CNST= (0..31)
1 1 145 1 1 1 1 1 1 1 1 1 1 1 1 1 1 1 1 1 1 1 1 1 1 1 1 1 1 1 1 1 
##$CPDPRG= <>
##$CPDPRG1= <>
##$CPDPRG2= <>
##$CPDPRG3= <>
##$CPDPRG4= <mlev>
##$CPDPRG5= <mlev>
##$CPDPRG6= <mlev>
##$CPDPRG7= <mlev>
##$CPDPRG8= <mlev>
##$CPDPRGB= <>
##$CPDPRGT= <>
##$D= (0..31)
0 0.7 0 0 0 0 0 0 0 0 0 0.03 0 0 0 0 0 0 0 0 0 0 0 0 0 0 0 0 0 0 0 0 
##$DATE= 1780471526
##$DBL= (0..7)
120 120 120 120 120 120 120 120 
##$DBP= (0..7)
150 150 150 150 150 150 150 150 
##$DBP07= 0
##$DBPNAM0= <>
##$DBPNAM1= <>
##$DBPNAM2= <>
##$DBPNAM3= <>
##$DBPNAM4= <>
##$DBPNAM5= <>
##$DBPNAM6= <>
##$DBPNAM7= <>
##$DBPOAL= (0..7)
0.5 0.5 0.5 0.5 0.5 0.5 0.5 0.5 
##$DBPOFFS= (0..7)
0 0 0 0 0 0 0 0 
##$DE= 6
##$DECBNUC= <off>
##$DECIM= 32
##$DECNUC= <off>
##$DECSTAT= 4
##$DIGMOD= 1
##$DIGTYP= 9
##$DL= (0..7)
0 120 120 120 120 120 120 120 
##$DP= (0..7)
150 150 150 150 150 150 150 150 
##$DP07= 0
##$DPNAME0= <>
##$DPNAME1= <>
##$DPNAME2= <>
##$DPNAME3= <>
##$DPNAME4= <>
##$DPNAME5= <>
##$DPNAME6= <>
##$DPNAME7= <>
##$DPOAL= (0..7)
0.5 0.5 0.5 0.5 0.5 0.5 0.5 0.5 
##$DPOFFS= (0..7)
0 0 0 0 0 0 0 0 
##$DQDMODE= 0
##$DR= 18
##$DS= 0
$$ [...]
##$SUBNAM2= <"">
##$SUBNAM3= <"">
##$SUBNAM4= <"">
##$SUBNAM5= <"">
##$SUBNAM6= <"">
##$SUBNAM7= <"">
##$SUBNAM8= <"">
##$SUBNAM9= <"">
##$SW= 18.0517328524113
##$SWIBOX= (0..15)
0 0 2 0 0 0 0 0 0 0 0 0 0 0 0 0 
##$SW_h= 3612.71676300578
##$TD= 16384
##$TD0= 1
##$TE= 0
##$TE2= 300
##$TE3= 300
##$TEG= 300
##$TL= (0..7)
0 120 120 120 120 120 120 120 
##$TP= (0..7)
150 150 150 150 150 150 150 150 
##$TP07= 0
##$TPNAME0= <>
##$TPNAME1= <>
##$TPNAME2= <>
##$TPNAME3= <>
##$TPNAME4= <>
##$TPNAME5= <>
##$TPNAME6= <>
##$TPNAME7= <>
##$TPOAL= (0..7)
0.5 0.5 0.5 0.5 0.5 0.5 0.5 0.5 
##$TPOFFS= (0..7)
0 0 0 0 0 0 0 0 
##$TUNHIN= 0
##$TUNHOUT= 0
##$TUNXOUT= 0
##$USERA1= <user>
##$USERA2= <user>
##$USERA3= <user>
##$USERA4= <user>
##$USERA5= <user>
##$V9= 5
##$VALIST= <valist>
##$VCLIST= <CCCCCCCCCCCCCCC>
##$VD= 0
##$VDLIST= <DDDDDDDDDDDDDDD>
##$VPLIST= <PPPPPPPPPPPPPPP>
##$VTLIST= <TTTTTTTTTTTTTTT>
##$WBST= 1024
##$WBSW= 4
##$XGAIN= (0..3)
0 0 0 0 
##$XL= 0
##$YL= 0
##$YMAX_a= 375082
##$YMIN_a= -269998
##$ZGOPTNS= <>
##$ZL1= 120
##$ZL2= 120
##$ZL3= 120
##$ZL4= 120
##$ABSF1= 10
##$ABSF2= 0
##$ABSG= 5
##$ABSL= 3
##$ALPHA= 0
##$AQORDER= 0
##$ASSFAC= 0
##$ASSFACI= 0
##$ASSFACX= 0
##$ASSWID= 0
##$AUNMP= <proc_1d>
##$AZFE= 0.1
##$AZFW= 0.1
##$BCFW= 1
##$BC_mod= 2
##$BYTORDP= 1
##$COROFFS= 0
##$CY= 83.5205535888672
##$DATMOD= 1
##$DC= 2
##$DFILT= <>
##$DTYPP= 0
##$F1P= 10.8118882576601
##$F2P= -7.23987719738617
##$FCOR= 0.5
##$FTSIZE= 0
##$FT_mod= 4
##$GAMMA= 1
##$GB= 0.15
##$INTBC= 1
##$INTSCL= 1
##$ISEN= 128
##$LB= 0.25
##$LEV0= 0
##$LPBIN= 0
##$MAXI= 10000
##$MC2= 0
##$MEAN= 0
##$ME_mod= 0
##$MI= 1.114404
##$NCOEF= 0
##$NC_proc= 0
##$NLEV= 6
##$NOISF1= 3.799351
##$NOISF2= 2.8
##$NSP= 1
##$NTH_PI= 0
##$NZP= 0
##$OFFSET= 14.38212
##$PC= 1
##$PHC0= -6378.843
##$PHC1= 8.221958
##$PH_mod= 1
##$PKNL= yes
##$PPARMOD= 0
##$PSCAL= 0
##$PSIGN= 0
##$REVERSE= no
##$SF= 200.129724274929
##$SI= 16384
##$SIGF1= 3
##$SIGF2= 2
##$SINO= 400
##$SIOLD= 16384
##$SREGLST= <1H.CDCl3>
##$SSB= 0
##$STSI= 0
##$STSR= 0
##$SW_p= 3205.1282051282
##$SYMM= 0
##$S_DEV= 0
##$TDeff= 0
##$TDoff= 0
##$TI= <>
##$TILT= no
##$TM1= 0
##$TM2= 0
##$TOPLEV= 0
##$USERP1= <user>
##$USERP2= <user>
##$USERP3= <user>
##$USERP4= <user>
##$USERP5= <user>
##$WDW= 1
##$XDIM= 8192
##$YMAX_p= 0
##$YMIN_p= 0
$$ End of Bruker specific parameters
$$ ---------------------------------
##NTUPLES= NMR FID
##VAR_NAME=  TIME,          FID/REAL,        FID/IMAG
##SYMBOL=    X,             R,               I
##VAR_TYPE=  INDEPENDENT,   DEPENDENT,       DEPENDENT
##VAR_FORM=  AFFN,          ASDF,            ASDF
##VAR_DIM=   8192,          8192,            8192
##UNITS=     SECONDS,       ARBITRARY UNITS, ARBITRARY UNITS
##FACTOR=    0.0002768,     1,               1
##FIRST=     0,             0,               0
##LAST=      2.2672688,     0,               0
##MIN=       0,             -269998,         0
##MAX=       2.2672688,     375082,          0
$$ Real data points
##PAGE= N=1
##DATA TABLE= (X++(R..R)), XYDATA
$$ [...]
1991B500l007k557L979J335m174J211K668l102p65L409o77k281K196P35l222R55
$$ 2500 -507 -3064 915 2250 -1924 -713 1955 -1147 -1912 1497 820 -1461 735 1470 -1752 -797
2007g97L616k418k386K829O22l534J268K857k405j110K235q70j464K511P97l180
$$ -797 2819 401 -1985 844 1466 -2068 -800 2057 -348 -1458 777 -93 -1557 954 1751 -1429
2023a429M30K761j900j495L153L03l432J063J703j589J1J864j076k058J935O92
$$ -1429 -999 1762 -138 -1633 1520 1823 -1609 -546 1157 -432 -421 1443 367 -1691 244 936
2039I36k387P12K859k429j715K673M11k138R65J311j549n06J682o26j083J591
$$ 936 -1451 -739 2120 -309 -2024 649 1060 -1078 -113 1198 -351 -857 825 199 -884 707
2055G07M34k627O59K489j646j478J899K27j829O55J343q15n27J121p17q32J731
$$ 707 1141 -1486 -827 1662 16 -1462 437 664 -1165 -510 833 18 -509 612 -105 -937 794
2072G94M60k089O34J502j578q54J557N17j328j69P57m64J3P98p97n44J222r5j424
$$ 794 1254 -835 -201 1301 -277 -1131 426 943 -385 -554 203 -261 -248 550 -247 -791 431 336 -1088
2091a088R46J351r39j126Q71N73n62oM02m04l28M91o55R0J256n47j384N16R54
$$ -1088 -142 1209 270 -856 15 588 26 20 422 18 -310 181 -474 -384 872 325 -1059 -543 411
2110D11p4o52N13K97o96j94O05N4M26j84j130J21Q39j3m04K26o6jr96L71J076
$$ 411 337 -315 198 495 -201 -395 210 264 690 506 -624 -503 336 323 -81 145 79 78 -918 -547 529
2131E29j76j84m77l3M05M5j06M25J15o25k22N3M60N63o62n04L44L06k90n41Q76
$$ 529 353 169 -308 -341 64 109 3 428 543 -82 -304 -251 209 772 110 -394 -50 256 -34 -575 301
2152C01J74r01o2O65j34N3K40o11o1O05R9o46M31O23j164o71J263L60q63L79L66
$$ 301 475 -426 -488 177 43 96 336 -275 -336 269 368 -278 153 776 -388 -1059 204 564 -299 80 446
2173D46j160K48P74l90j38P91k82j076M51J297p87p86J166Rj257P23N95r22J27
$$ 446 -714 -466 308 -82 -220 571 289 -787 -336 961 174 -612 554 563 -694 29 624 -298 -171
2192a71M12m52m96J228M9j372L43J429j261n45J747l60j195N09O14p44K37R03
$$ -171 241 -211 -707 521 570 -802 -459 970 -291 -836 911 551 -644 -135 479 -265 -28 875
2210H75p25j098J247L05j735Q72J671j774p55J489j4j087Q08P49j334k05J612
$$ 875 150 -948 299 604 -1131 -259 1412 -362 -1117 372 358 -729 79 828 -506 -711 901
2227I01p45q88J719j79k317J051J826j588p33J625j32j801R02J303j393j01J743
$$ 901 156 -732 987 808 -1509 -458 1368 -220 -953 672 540 -1261 -359 944 -449 -550 1193
2244A193j371j240K282L94k380J030J494j703j179K394k4j770J067P74k011J74
$$ 1193 -178 -1418 864 1258 -1122 -92 1402 -301 -1480 914 890 -880 187 961 -1050 -876
2260h76K442j566j367K342j42k513J310J859j695j185K199j94k030K005J010k555
$$ -876 1566 0 -1367 975 833 -1680 -370 1489 -206 -1391 808 614 -1416 589 1599 -956
2276i56N23J838j817j016K374J28k603Q40K303k071r25K733o91k233J613J163
$$ -956 -433 1405 -412 -1428 946 1074 -1529 -689 1614 -457 -1382 1351 660 -1573 40 1203
2292A203k493Q82K299k061j463K507J74k495J252K092k453j018K596p66j710K109
$$ 1203 -1290 -408 1891 -170 -1633 874 1048 -1447 -195 1897 -556 -1574 1022 256 -1454 655
2308F55N31k780P75K249j523j268K617j27k831J400K347k404o31K702j453k049
$$ 655 1186 -1594 -819 1430 -93 -1361 1256 1129 -1702 -302 2045 -359 -990 1712 259 -1790
2324a790K120P97k340O37K135j755j550K774J27k868J488J879k635j98K725j017
$$ -1790 330 1127 -1213 -576 1559 -196 -1746 1028 1155 -1713 -225 1654 -981 -1179 1546 529
2340E29k247K263O39k398O48K508k154j507K547J64k721J885J593k675m94K688
$$ 529 -1718 545 1184 -1214 -566 1942 -212 -1719 828 992 -1729 156 1749 -926 -1420 1268
2356A268j090j776K369O53k891O25K530j990j229L209n63k938J639J542k282L0
$$ 1268 178 -1598 771 1424 -1467 -842 1688 -302 -1531 1678 1115 -1823 -184 1358 -924 -894
2372h94K598j469k020K185Q35k938J333K520k534j229K778o10k088J768J532k764
$$ -894 1704 235 -1785 400 1235 -1703 -370 2150 -384 -1613 1165 555 -1533 235 1767 -997
2388i97j1K404j084j930K369N42l060J207K320k344j063K939m81k487J755J395
$$ -997 -1008 1396 312 -1618 751 1293 -1767 -560 1760 -584 -1647 1292 811 -1676 79 1474
2404A474k462KK603j247k095K875K76k966J055K120k241q93K849m51k635J812
$$ 1474 -988 -986 1617 370 -1725 1150 1426 -1540 -485 1635 -606 -1499 1350 899 -1736 76
2420G6J089k174J57K798j687k053K606K11k620J526K014k147j156K281l06k285
$$ 76 1165 -1009 -852 1946 259 -1794 812 1023 -1597 -71 1943 -204 -1360 921 615 -1670
2436a670K053J350k851J94K378j666j410K663K00k547Q66J762j853q18K657n02
$$ -1670 383 1733 -1118 -924 1454 -212 -1622 1041 1241 -1306 -440 1322 -531 -1349 1308 806
2452H06k361J931J286k855K60K608j829j336K335J01k162P54J898j998o06K502
$$ 806 -1555 376 1662 -1193 -933 1675 -154 -1490 845 946 -1216 -462 1436 -562 -1168 1334
2468A334o95k062J823Q75k546O23K446j813j182K139j85k155J212J684k055o52
$$ 1334 639 -1423 400 1275 -1271 -648 1798 -15 -1197 942 757 -1398 -186 1498 -557 -1209
2484a209K213r25j655J846R11k141N31J881j766r01K250K75k330R45J598k170
$$ -1209 1004 79 -1576 270 1181 -960 -429 1452 -314 -1215 1035 1310 -1020 -75 1523 -647
2500f47k55K025p72j527J497M50k011P38K023j592j305J965K26k118J208J438
$$ -647 -902 1123 351 -1176 321 771 -1240 -502 1521 -71 -1376 589 815 -1303 -95 1343
2516A343j673m69J874q34j567J853O08k072K56J862j314j117J826J09j869J077
$$ 1343 -330 -799 1075 241 -1326 527 1135 -937 -681 1181 -133 -1250 576 685 -1184 -107
2532a07J113j530PJ333q40j075J521N51j799L98J763j266j259J824Q6j553Q21
$$ -107 1006 -524 -517 816 -24 -1099 422 973 -826 -428 1335 69 -1190 634 720 -833 -12
2549a2R07j666J72J487o68j321J486N92j870M05J647j245q65J742m84j159R69
$$ -12 895 -771 -599 888 220 -1101 385 977 -893 -488 1159 -86 -951 791 307 -852 117
2566A17P55j166l42J407r10r43J647L23j800O24J320j362o65J643k65j026O84
$$ 117 872 -294 -636 771 -139 -1082 565 888 -912 -288 1032 -330 -995 648 383 -643 41
2583D1N40q15k10J397p80j101J295J98j305N45R79q53o96J189Nr66O25M63j162
$$ 41 581 -234 -444 953 173 -928 367 565 -740 -195 784 -69 -765 424 429 -537 88 551 -611
2602f11K18J154p54p71J228J19j219M46P09n30m52R44N6j191P17N10j033J61J109
$$ -611 -393 761 7 -764 464 583 -636 -190 519 -11 -463 481 537 -654 63 573 -460 -299 810
2621H10r29p21J188Q4q05J40P57o30j84P30k56n33K97L81o75J37O80n27l53N72
$$ 810 -119 -840 348 432 -373 -233 524 -106 -290 440 184 -349 -52 329 -346 -209 471 -56 -409 163
2641A63R8q25K42P26o22k33O46M0p17M64L14o77K89M88m93l66O92J41p72R2O10
$$ 163 261 -564 -322 404 -218 -451 195 235 -482 -18 296 -381 -92 396 -97 -463 229 370 -402 -310 300
2662C00l65l21P40l8m82K35N0l13K79J98l95n8J24K17l89J29M38l51l86N96J1
$$ 300 -65 -386 354 316 -166 69 119 -194 85 283 -112 -170 -46 171 -218 -89 349 -2 -388 208 219
2683B19l67K22l3k21J52L92k44l40J03M71n07J26K84j28q8J50j43j52L35j22l82
$$ 219 -148 74 41 -180 -28 364 120 -220 -117 354 -153 -27 257 129 41 191 48 -104 231 109 -273
2704b73K86j2m5k58J69J01Q2q3N3j14J95L6k05J59K8N4k51M2K54j56k73Q7K55
$$ -273 13 1 -44 -302 -133 -32 50 -33 20 -94 101 137 -68 91 119 173 -78 -36 218 62 -211 -124 131
2727A31j57l5J06q8K35n02L01J02j00n3q1J83j11k5P9j12K20O1k47l7J37Q3j89
$$ 131 -26 -61 45 -43 192 -310 -9 93 -7 -60 -141 42 -69 -94 -15 -127 93 154 -93 -130 7 90 -99
2750i9J72J54m12N1L34l5k39K0K56l20L2K90k60k60M36R6l43P6K42j89k35K53
$$ -99 73 227 -185 -134 200 165 -74 -54 202 -118 -86 204 -56 -316 120 216 -127 -51 191 2 -233 20
2772B0P2l17L00L5l20L7M12m58j68O64k1m88K75J51l20P6K91N6o12M14K02m11
$$ 20 92 -225 75 110 -210 -173 239 -219 -387 277 256 -232 43 194 -126 -50 241 297 -315 99 301 -110
2794a10N1N12n59l97O62Km47K42J74l13j74N67k1m27N27N0o46K71M38n67j74O53
$$ -110 -59 453 -106 -503 159 161 -286 -44 130 -183 -357 210 189 -238 289 339 -307 -36 402 -165 -339 314
2816C14j34o87L73L63m38j7M82k54l72O06j82k72J39N63l81m32M71K15o53J13
$$ 314 180 -507 -134 229 -209 -226 256 2 -370 236 54 -218 -79 484 103 -329 142 357 -296 -183
2836a83M94o27m7Q84o32k37O10J46p92K47O36n54l81O61q7m39L27L09o10j6P23
$$ -183 311 -316 -363 521 -111 -348 262 408 -384 -137 499 -55 -436 225 138 -301 26 335 -275 -291 432
2857D32n31m14P57K34j017L81O95p92k25P49n8o08L17M36p90J36O84m81l81P58
$$ 432 -99 -513 244 478 -539 -158 537 -255 -480 269 211 -397 -80 356 -434 -298 386 -95 -476 282
2877B82K2p30J98P22m96m39Q85k43q88P83J87o60O9O23k11m34O31j4o96K14Q33
$$ 282 304 -426 -228 494 -2 -441 444 201 -687 96 283 -377 -308 315 104 -330 301 287 -409 -195 638
2898F38p87k10P71k96n65N48L17q99K76N89m09n29R35r3p71K00Q45p58j66P38
$$ 638 -149 -359 412 116 -449 99 416 -483 -207 382 -27 -556 379 286 -485 -285 560 -198 -364 374
2918C74k28o33N91L13p73J58O69m32m14N56J6n53K80O86o05m55Q40k56o47N82
$$ 374 146 -487 104 417 -356 -198 471 39 -375 181 197 -356 -76 610 5 -450 390 134 -513 69
2938F9M71j027J92P38l31n08O41O2o87M18M14n18m36Q75m34l51N64K73q91K12
$$ 69 540 -487 -295 443 112 -396 245 307 -380 38 452 -66 -502 373 -61 -412 152 425 -466 -254
2958b54Q13n93n68Q14o2m60K82M47n78k90Q69l10m32M42M72r59J49M90l22m34
$$ -254 559 -34 -602 212 150 -310 -28 419 -159 -449 420 110 -322 120 592 -367 -218 272 -50 -484
2978d84O61J18p53K57N27m14k84O95k90m09M99J78o84L64L78m94l04P89l5o29
$$ -484 177 295 -458 -201 326 -88 -372 323 33 -376 123 301 -383 -19 359 -135 -439 350 315 -314
2998c14Q6O04n00m00Q93k77o79O41K42n89K14N42m36o08P76J76p69L98M45o03
$$ -314 -228 376 -124 -524 369 92 -587 54 296 -293 -79 463 27 -581 195 371 -398 0 445 -158
3018a58j03O94m16n30N75L62p52J97N55m75n13P76K3n05K58L58m58k32O08k73
$$ -158 -261 433 17 -513 62 424 -328 -131 424 -51 -564 212 235 -270 -12 346 -112 -344 264 -9
3038ik66M14K13n86r1O05k15n60O82R9q21N77K23m77K29L80k25n69N03K19n65
$$ -9 -275 139 352 -234 -325 280 65 -495 187 286 -535 42 265 -212 17 397 172 -397 106 325 -240
3059b40m9P36m17n02O93N4o52L04M52m94j15N67k84o44N89M53o03j47N55l18l69
$$ -240 -289 447 30 -472 221 275 -377 -73 379 -115 -230 337 53 -591 -2 451 -152 -299 256 -62 -431
3080d31O38j32j46J02L74n65j03N17j31k36O9L14o28J40N10k08n29O66r1l57J31
$$ -431 207 75 -71 31 405 -160 -263 254 123 -113 -44 270 -358 -218 292 84 -445 221 130 -227 -96
3101i6L92n47L1N39r5n57L31L73n58p4M33m02m0M93q6m71N03O0n47J70L04l70
$$ -96 296 -251 -220 319 224 -333 -2 371 -187 -261 172 -230 -270 223 137 -334 169 229 -318 -148 156 -214
3123b14k93O29J14n49K36M78m22j64J68k5k05J77K28j75j73N70k53l08J95N5r8
$$ -214 -507 122 236 -313 -77 401 -21 -185 -17 -42 -247 -70 158 -17 -190 380 127 -181 14 69 -29
3144b9j94N08l34k34M91k2m50L89L2l30J58K20l3k54K24J42l19q7K46k42j53L49
$$ -29 -223 285 -49 -283 208 186 -264 125 157 -173 -15 205 172 -82 142 284 -35 -122 124 -118 -271 78
3166G8N5m35L55K17n32J65K86j33l07K61L6k48J16K27j04k91L47J07l96K34J87
$$ 78 133 -302 53 270 -262 -97 189 56 -251 10 46 -202 -86 141 37 -254 93 200 -196 38 225
3187B25l49k05L88o4j98P8L24k47k13M56l36J38L19j84m94L67L82n31K1K85j25
$$ 225 -124 -329 59 -5 -203 -125 199 -48 -261 195 -141 -3 316 132 -362 5 387 -144 -123 162 37
3208C7l69K27J22j38m7K78j43k95L01J70j90J07o1q3K7J49j2l70L16K02m42J89
$$ 37 -332 -105 17 -121 -168 110 -33 -328 -27 143 -47 60 -1 -84 -57 92 80 -290 26 228 -214 -25
3230b5Q9n4q0K63j22M0r2J5r7j5J05o4j5R6j6r5kM7J76j15j11J08m9j27J02J09
$$ -25 64 10 -70 193 71 111 19 34 -63 -78 27 -37 -52 44 28 -67 -69 -22 154 39 -72 36 -13 -140 -38 71
3256G1o5J74k51j9m4M4K44j91J11j29r6K06j19oJ52j07l1J4J67r8j14J62Kl6r6
$$ 71 6 180 -71 -90 -134 -90 154 -37 74 -55 -151 55 -64 -70 82 -25 -56 -42 125 27 -87 75 77 41 -55
3281e5J91p3j62L78l45lN1M4pM6k2m0j7nPM3p4NJ00l0L4l9j29J17l7N4k49J23
$$ -55 136 63 -99 279 -66 -69 -18 26 19 65 43 3 -14 -19 -12 31 -43 -38 62 32 66 27 -102 15 -22 32 -217 -94
3309i4K2J33j84l6J43r4Q4l0J10m9p2J42l2j06J36q3k6J16l3j06K9p0P1j05O8
$$ -94 -72 61 -123 -159 -16 -110 -26 -56 54 5 -67 75 43 -63 73 -10 -36 80 47 -59 -30 -100 -29 -134 -66
3334f6J5N0J95j79M1n4J39R2l16N4K68m79K86l0o5k0K00j47j01K3J83l00O8L42
$$ -66 -51 -1 194 15 56 2 141 233 -83 -29 239 -240 46 16 -49 -69 131 -16 -117 -94 89 -211 -143 199
3358A99n8m0n7P7j32Qj11K51j16M2j4k48J55J24q0J00L4j66j44J13J18k2j73J11
$$ 199 141 101 44 121 -11 -3 -114 137 21 63 49 -199 -44 80 0 100 134 -32 -176 -63 55 33 -140 -29
3382b9L2j54K09J06l08K11J78l61p9J61O1j42K45j08q0l3J13l5j24J78J34l01
$$ -29 3 -151 58 164 -144 67 245 -116 -195 -34 27 -115 130 22 -58 -91 22 -13 -137 41 175 -126
3404a26J78J32j66j08J24J54k84JL76k66j84K04N3l01L09Q7j33j05K79k16k41
$$ -126 52 184 18 -90 34 188 -96 -95 281 15 -169 35 88 -213 96 183 50 -55 224 8 -233
3425b33M19k19k11QM41j75n8J02L5k75L84j93j80J95J53k51j06K41n0k85J88L06
$$ -233 186 -33 -244 -236 205 30 -28 74 109 -166 218 25 -155 40 193 -58 -164 77 27 -258 -70 236
3447B36k48r2K28k43m6K78R5k07%Op8k39L66J44l47j3M15j67k07L01k45j23K02
$$ 236 -12 -104 124 -119 -165 113 208 1 1 7 -71 -310 56 200 -147 -160 255 88 -119 182 -63 -186 16
3470A6J40r9j6J48j11l31J94J33k83L25K6j15j04L09r8k69J34J17j82N9K47k70
$$ 16 156 57 41 189 78 -253 -59 74 -209 116 142 27 -77 232 134 -135 -1 116 -66 -7 240 -30
3492c0j59L60J26n35K62J60k11q7K29m1k11Q0K42l88O1L01l06j78N27j31l82L47
$$ -30 -189 171 297 -238 24 184 -27 -114 115 74 -137 -57 185 -203 -142 159 -147 -325 202 71 -311 36
3514C6L86m15j95L43n1l58L03j1j76o6M91k69j10J22j04k11K26K61l84J48M08
$$ 36 422 7 -188 155 104 -254 49 38 -138 -204 287 18 -92 30 -74 -285 -59 202 -182 -34 374
3535C74l82j46K94J63o21J69N47m96k62L85L13m56R5L22m19j33N09q7l58M00L4
$$ 374 -8 -154 140 303 -318 -149 398 -98 -360 25 338 -118 -23 299 -120 -253 256 169 -189 211 245
3556B45m85J20L80l34l83O16Q0m58J06L53l44r7N38j09m98L18L4k86J25M51m53
$$ 245 -240 -120 260 -74 -457 159 239 -219 -113 240 -104 -201 337 228 -270 48 82 -204 -79 372 -81
3577h1k92N89r0l79K11K74l83j13M12j81j17K52J07m14J41L81m37k84O55n5p02
$$ -81 -373 216 126 -253 -42 232 -151 -264 148 -33 -150 102 209 -205 -64 317 -120 -404 251 196 -506
3598e06M46J27l18j08O04j30m59M26J32m61K06L75m20k47N83o4n08L33K79m33
$$ -506 -60 67 -251 -359 245 115 -344 82 214 -247 -41 334 -86 -333 250 186 -322 11 290 -143
3618a43p6M50k15l32M04K07o16J76M21k01k74M19j05m24K85L70m42P2K80k08l36
$$ -143 -219 231 16 -316 88 295 -321 -145 276 75 -199 220 115 -309 -24 346 -96 -24 256 48 -288
3639b88M23R3m09m0O81n83j61N37m8m00J68L01m46m0M56j15l56L91J09p33K48
$$ -288 135 228 -181 -221 460 -123 -284 253 205 -195 -27 274 -172 -212 244 129 -227 164 273 -460 -212
3660b12O03m58l09N29N2n63M69K06o38J04M93k01k76K55R7m56J20N99m73j93L46
$$ -212 391 -67 -376 153 205 -358 111 317 -321 -217 276 75 -201 54 151 -305 -185 414 -59 -252 94
3681I4J52p84N84J20l48j08O82l88l55M87K0k83R4K96k38k92N00l02k52L89J03
$$ 94 246 -538 46 166 -182 -290 392 4 -351 136 156 -127 -33 263 25 -267 233 -69 -321 68 171
3702A71m45P3M21j70j78J27K86o66L36K92l60j83L50J24m41L52K16n64J10M85
$$ 171 -274 -201 220 50 -128 -1 285 -381 -45 247 -113 -296 54 178 -263 89 305 -259 -149 336
3722C36l64k81N01k2k48l2K78k62k10N86k42k79K82K51n20J22M42l05j32K79J5
$$ 336 -28 -309 192 170 -78 -110 168 -94 -304 282 40 -239 43 294 -226 -104 338 33 -99 180 195
3743A95m62K42K76k59k39N03k71j38L02n9k84l1L93k11k80M11O1m32J37K91j97
$$ 195 -267 -25 251 -8 -247 256 -15 -153 149 90 -194 -225 168 -43 -323 88 149 -283 -146 145 -52
3764e2k56O51k99k52L22J15l36m3M32j75m03M71o9k53K8R6MRJ33J3j48J62J3q4
$$ -52 -308 343 44 -208 114 229 -107 -150 282 107 -296 175 106 -147 -119 -23 -19 -10 123 136 -12 150 163 79
3788G9l57N38j97l85K75K2j45J20J53j59m4K41k38q9M22k8k34j55K75r4j25J06
$$ 79 -278 260 63 -322 -47 -25 -170 -50 103 -56 -100 141 -97 -186 236 208 -26 -181 94 0 -125 -19
3810a9J28m4j51K40k42J13R7k34r0K42j6l11K77M3m7k31J86J40l28K15K10j32
$$ -19 109 65 -86 154 -88 25 122 -112 -202 40 24 -287 -10 33 -14 -245 -59 81 -247 -32 178 46
3832D6j84J97o1n2K19M4k77j65L83k82P2P7o6n3J0L30p5k39L57k28j88R1J78j23
$$ 46 -138 59 -2 -54 165 209 -68 -233 150 -132 -60 17 -49 -102 -92 238 163 -76 281 53 -135 -44 134 11
3856A1j47K20J80l81K11j8K8j25J38k46N2L39l72J38j64J49R9m9Q3o5k16K07K
$$ 11 -136 84 264 -117 94 76 104 -21 117 -129 -77 262 -110 28 -136 13 112 63 146 81 -135 72 74
3879G4j36J95r7j33p2K46j83p9J48o7J33J1m3J36k26J58j38%J16j30K01j18K37
$$ 74 -62 133 36 -97 -169 77 -106 -185 -37 -104 29 40 -3 133 -93 65 -73 -73 43 -87 114 -4 233
3902B33j81n6j82J97J4j12kJ58j97K2N9K71j29r8Q7j47J36M8j39K6oJ17j04P3
$$ 233 52 -4 -186 11 25 -87 -89 69 -128 -106 -47 224 95 -3 84 -63 73 121 -18 8 2 119 15 88
3926H8j93J53k20j05J68K46j18OJ04j95PJ28j08J32o1j00m8K36J0j62J29q7o2
$$ 88 -105 48 -172 -277 -109 137 19 25 129 -66 -59 69 -39 93 32 -68 -116 120 130 -32 97 10 -52
3949e2M2P0j63J59L7J05k85R8P7q9r1J3K50k08O9L0k17J41J98q9j57J77O9k30
$$ -52 -10 60 -103 56 93 198 -87 11 88 -1 -92 -79 171 -37 32 62 -155 -14 184 95 -62 115 184 -46
3973d6q4K63j19o8L6J74k23Q9J62n10J73L34m1l17R9P1j72K52R8j46j41K93j00
$$ -46 -130 133 14 -54 -18 156 -67 22 184 -326 -153 181 140 -177 -78 -7 -179 73 171 25 -116 177 77
3996G7l01P3K70j83m6J77j29j48J90J29l05L6M48j85k22K01j07k10K38K09k42
$$ 77 -224 -151 119 -64 -110 67 -62 -210 -20 109 -196 -160 288 103 -119 82 -25 -235 3 212 -30
4017c0j96L62m0k60J46R0j97J22J45k59m1L66j42k01J07K63k87k02N46k84k11
$$ -30 -226 136 96 -164 -18 72 -125 -3 142 -117 -158 208 66 -135 -28 235 -52 -254 292 8 -203
4038b03L63kk90o1N74n18J25J88k39j99M90N0l27k5K90j34k97N01l38k42K50J41
$$ -203 160 158 -132 -193 381 -137 -12 176 -63 -262 228 278 -49 -74 216 82 -215 286 -52 -294 -44 97
4060I7j50k55K60K27l49K60K19m66K0N14l17l11M22j10l90L74J74k90L0J10R3
$$ 97 -53 -308 -48 179 -170 90 309 -157 -137 377 60 -251 171 61 -329 45 219 -71 -41 69 162
4081A62l43J75M44n55K0K84j53k40K42J9m47L53J97k87q9O07k61l34L09J49m11
$$ 162 -181 -6 438 -117 -97 187 34 -206 36 55 -392 -39 158 -129 -218 389 128 -206 103 252 -159
4102a59K1M19k26j68K77P9n31L21K81m11k3L02p5l36L28M6m22J03O13n05k81M82
$$ -159 -138 281 55 -113 164 243 -288 33 314 -97 -120 182 107 -229 99 145 -277 -174 439 -66 -347 135
4124A35N0l40Q1M60m28j81M47jm58K29K31n86J52M28j46n39Q09o8n10K28L00m15
$$ 135 185 -155 -74 386 -42 -223 224 223 -235 -6 225 -361 -209 219 73 -466 343 275 -235 -7 293 -122
4146a22j64O53l69k84M02%l14K05J74k63j99M01J05o14L10M28m68j62N86l73k10
$$ -122 -286 367 -2 -286 116 116 -198 7 181 -82 -281 120 225 -389 -79 349 -119 -281 305 -68 -278
4167b78L44L09p62K75N59m27k98M97m8o44M74K31k82j59L59k6n04L30M41p32J56
$$ -278 66 375 -387 -112 447 20 -278 219 171 -473 1 232 -50 -209 150 124 -380 -50 391 -341 -185
4188a85M80m06l2L54q2k48J07J67l94K4K16J2n23M91K11l27q7P18o07j21M00N2
$$ -185 295 -111 -143 211 129 -119 -12 155 -239 -215 1 13 -510 -19 192 -135 -222 496 -111 -232 168 220
4210B20n42L82M40o50j09M17l4n49O69p9m98J77M96m63k72O60k22l31J97J69k15
$$ 220 -322 60 500 -150 -259 158 124 -425 244 165 -333 -156 340 -123 -395 265 43 -288 -91 78 -137
4231a37p4O39l80k74K73J45o08K87M45m69j38P46k11o18L44K93n05K2M45j59m36
$$ -137 -211 428 48 -226 47 192 -416 -129 316 -153 -291 455 244 -374 -30 263 -242 -220 225 66 -370
4252c70L80K45n13K44K69k19j65M32j72k18K11J01l43Q4K99l79n9L10J8l74J85
$$ -370 10 255 -258 -14 255 36 -129 303 131 -87 124 225 -118 -34 265 -114 -173 137 155 -219 -34
4273c4L00l19k05M45j41m47N54Q6m43J80L46k92m35N10K6n23K44O15n25j64O13
$$ -34 266 -53 -258 187 46 -401 153 239 -204 -24 322 30 -405 105 131 -392 -148 467 -58 -222 391
4294C91k69k96K87K06o14L17K50k98l13M90p1k50J82K45m28m2L77j98k55N73k5
$$ 391 122 -174 113 319 -295 22 272 -26 -339 151 80 -170 12 257 -171 -213 164 -34 -289 284 259
4315B59m06R2K08j61l39N76rm35K34J68k52kL09q4m29M49ol75r8M58k24p7L61
$$ 259 -147 -55 153 -8 -347 229 220 -215 19 187 -65 -67 242 158 -271 178 172 -203 -301 157 -67 -144 217
4338B17j37l92L76J72l91N6N02m63j23M16p8l47L1M60m21q1M53l11k47M28J69
$$ 217 80 -312 64 236 -155 -99 403 -60 -183 233 155 -192 -161 299 -122 -203 250 -61 -308 120 289
4359B89o44J87K17J29j75J24K0l77J98M09l79j93L92j92k29M41r3k34k14N49l18
$$ 289 -355 -168 49 178 3 127 147 -230 -32 377 -2 -195 197 5 -224 217 124 -110 -324 225 -93
4380i3o8J94M1j40J18J26j92l1P5J87l64K30J88k99P8J0q0j15K04M0m17K67m0
$$ -93 -161 33 74 -66 52 178 -14 -45 30 217 -147 83 271 -28 50 60 -20 -135 69 109 -308 -41 -81
4403h1M8l5J33P5k01P4R6j29mJ73l5k51L57j31j11N1L7j89J64l4n2j24K45J6k57
$$ -81 -33 -68 65 140 -61 13 109 -20 -24 149 114 -137 220 89 -22 29 66 -123 41 7 -45 -169 76 92 -165
4428a65N5J32n6MQ4j93q5L30Rj89J2K76l22Q4J18N0l71K50j4r0J07J08j58o5J49
$$ -165 -110 22 -34 -30 54 -139 -224 106 115 -74 -62 214 -108 -24 94 144 -227 23 9 -81 26 134 -24 -89 60
4453F0O5j2k11J58n8m0K2oLk6N8L3o9L6m2K0k9k2J12K7j1M2n0q4N3l5j8M8M0j0
$$ 60 125 113 -98 60 2 -38 -16 -22 -19 -45 13 46 -23 13 -29 -9 -38 -60 52 79 68 110 60 -24 29 -6 -24 24 64 54
4483E4m3Jmj36Lj17K02R9j8N8m1o9J02l14K48K32j81pj54J67j31L3n1O7K8q4P3
$$ 54 11 12 8 -128 -125 -242 -40 59 41 99 58 -11 91 -223 25 257 76 69 -85 82 -49 -16 -67 0 28 -56 17
4510A7j38M9M8QR1k13P9J30j14N8j34K48O1l8r0j20K20k59J2P5O5j27K9J25p7
$$ 17 -121 -72 -24 -16 75 -138 -59 71 -43 15 -119 129 190 152 62 -58 162 -97 -85 -10 55 -72 -43 82 5
4535Ej6K15l01o4J32J8q2J89N1q2J9m0Oj13Q6q3n2o2K97k65O0QJ08k25J66P6j76
$$ 5 -11 204 -97 -161 -29 -11 -93 96 147 65 84 44 50 -63 23 -60 -112 -174 123 -142 -82 -74 34 -191 -25 51 -125
4562a25J45j0l8j69L25P7k71M6R9j54K9K44j88j60J82J75l54m4K88m7k94K81N3
$$ -125 20 10 -28 -197 128 205 -66 -20 79 -75 -46 198 10 -150 32 207 -147 -191 97 50 -244 37 90
4585I0m29L03J99k81k9K69j51N8N1n9p1l9M66m96j38J92J03q4O9K13l90j70N02
$$ 90 -339 -36 163 -118 -147 122 -29 29 80 21 -50 -89 377 -119 -257 -65 38 -46 23 236 -154 -324 178
4608A78j99q6J2K57k69r0N23l29o4O2R2l11K88k8j56k7K97j18k1J44M6m55J41
$$ 178 -21 -107 -95 162 -107 -197 326 -3 -67 -5 87 -224 64 36 -120 -147 150 32 11 155 201 -254 -113
4631a13M32l56q4L69mn29L78J23k18k19M89k45k94M51O0n20L22J48l00R6K17m6
$$ -113 319 -37 -121 248 244 -285 93 216 -2 -221 268 23 -271 180 240 -280 42 190 -110 -14 203 157
4653A57k88M9K58j54l06N32j72l16N55l45j93J54K61k59j94N09m0n20M10R6l44
$$ 157 -131 -82 176 22 -284 248 76 -240 315 -30 -223 -69 192 -67 -261 248 208 -312 98 194 -150
4674a50K17M5m9m36M71Q8m56L87M1j93j67O10k52n24L69M09o80m6O18k65l07M19
$$ -150 67 112 63 -373 98 186 -270 117 158 -35 -202 408 156 -368 1 410 -270 -316 302 37 -270 149
4696A49L7m17K27K92l90n0L42j35k00J70K65l58KM51l07k71L35qm75K63M87m78
$$ 149 186 -231 -4 288 -102 -152 190 55 -145 25 290 -68 -66 385 78 -193 142 134 -341 -78 409 -69
4718f9k83O33k37l77L92J98m66J19M62m71j71M02j10k90L11L19n86l6N65j45n57
$$ -69 -352 281 44 -333 59 257 -209 -90 372 -99 -270 132 22 -268 43 362 -224 -260 305 160 -397
4739c97N01j1k19J13P7o7l56M56J10p00M50O55o39k00N64m02n2K67j15l20K3N56
$$ -397 104 93 -126 -13 64 -3 -359 97 207 -493 -43 612 -27 -227 337 -65 -117 150 35 -285 -262 294
4761B94m50j65M54j5o43N00K38l18j77N44k36m31N87Q0m71K36K88m66P9K56j9
$$ 294 -156 -321 133 118 -525 -25 213 -105 -282 262 26 -405 182 262 -209 27 315 -151 -72 184 165
4782A65m61L05K92l73j79M72j21m01N62j46l00O1M53o06o3O00j38n25M45L10m89
$$ 165 -296 9 301 -72 -251 221 100 -301 261 115 -185 -124 329 -277 -340 260 122 -403 42 352 -137
4803a37j11M60k56l91O33l1l53J91J34k12n1L43q5n56N78J11m02N7L33k76k79
$$ -137 -248 212 -44 -435 198 167 -186 5 139 -73 -124 219 134 -422 156 267 -135 -78 255 -21 -300
4824c00M39N2o32L25K07k24j27O57l41m80M53K37n03P8O11m52k26N32j41m24P3
$$ -300 139 191 -441 -116 91 -133 -260 397 56 -424 29 266 -237 -159 452 0 -226 306 165 -259 -186
4845a86N16m97M9L14Nn71L44L07n77K89L62l15k60M12l2n37O83N9l27r5K64k53
$$ -186 330 -167 -118 196 201 -370 -26 281 -296 -7 355 40 -220 192 160 -377 306 365 38 -57 207 -46
4867d6m14N56J20m63J95L54m02q4L12j19j65J48J85l76O3L46k44m45N53K46o22
$$ -46 -460 96 216 -247 -52 302 -100 -184 128 9 -156 -8 177 -199 -136 210 -34 -479 74 320 -302
4888c02k0L56mj03K19j10j20J4L91l74r7N17k91l40M81Ml95KN00l80m8K78j24
$$ -302 -322 34 30 -73 146 36 -84 -70 321 -53 -150 367 76 -264 217 221 -174 -172 328 -52 -100 178 54
4911E4j89J88K82m71p0L35k74j76K94N3r4J30J07k95m5L18o9k48M47j49k03L1
$$ 54 -135 53 335 -136 -206 129 -145 -321 -27 26 -68 62 169 -126 -171 147 78 -170 277 128 -75 -44
4933d4K49q6m64M33J79m86J65J11J7j26K36j10k36K29K32n63J57L89k27l21K61
$$ -44 205 119 -345 88 267 -219 -54 57 74 -52 184 74 -162 67 299 -264 -107 282 55 -266 -5
4954em0j29J94J83k38j36L97k73j75K49O8j79L6J00L9r5PJ06j10o9J39j78J08
$$ -5 -45 -174 20 203 -35 -171 226 -47 -222 27 95 -84 -48 52 91 -4 3 109 -1 -70 69 -109 -1
4977aK63k90r1j6J10k83L34J58k07k41K78j0l09K57J25k08O0J40r4n3RK45k77
$$ -1 262 -28 -119 -135 -25 -308 26 184 -23 -264 14 4 -305 -48 77 -131 -71 69 -25 -78 -69 176 -101
5000a01q9K47k16N0Q5N9r1N3K5n9k9L05j16k3K0l5o3j81K27j18Q5J10L8m36L18
$$ -101 -190 57 -159 -109 -24 35 -56 -3 22 -37 -66 239 123 100 120 85 22 -159 68 -50 35 145 183 -253 65
5025F5K7k10K71j53J30j85J47O9j76j47K79m0j57O1L3j12j02K05j89J99n3J48
$$ 65 92 -118 153 0 130 -55 92 161 -15 -162 117 77 -80 -19 14 -98 -200 5 -184 15 -38 110
5047A10p1k2N4k32K45j07M6M0O7q2n1J44p7j08mK26j58N1K05k21m6O5j75J05L8
$$ 110 39 17 71 -161 84 -23 23 63 130 48 -3 141 64 -44 -48 178 20 71 276 55 9 74 -101 4 42
5072D2o9P6j51Q5J8L6K8j22L9O2J29k12J15j28j4O8M%J14j87J11P4j39m3Q3q5
$$ 42 -27 49 -102 -17 1 37 65 -57 -18 44 173 -39 76 -52 -66 2 6 6 120 -67 44 118 -21 -64 19 -66
5098f6N6k5J97j86K3j8P4pr2Q3K2j8l1r3p2J03J54r7o1J58l1k9o2P3n7j41K7M5
$$ -66 -10 -35 162 -24 -1 -19 55 48 -44 39 61 43 12 -81 -153 -50 104 7 -54 104 73 44 -18 55 -2 -143 -116 -71
5126g1J14j63K18k17j6J84m9r9p7J59K8k19L62o3q6j38M1M5k25L95j53kJ21j05
$$ -71 43 -120 98 -119 -135 49 0 -99 -176 -17 11 -208 154 91 5 -133 -92 -47 -272 123 -30 -32 89 -16
5150a6J01j36Q2k19K75K6j50N1J10qk55o3M61k99k7M0l6q3J91M9l2o0P2n3k02
$$ -16 85 -51 31 -188 87 113 -37 14 124 116 -139 -202 259 -40 -67 -27 -63 -146 45 94 62 2 74 21 -181
5175a81M0L20l53j2K32j08m6K52q8k13J85K39l10k60M84k9m16L85M2j90m3K65
$$ -181 -141 179 -174 -186 46 -62 -108 144 56 -157 28 267 -43 -303 181 152 -264 121 163 -27 -70 195
5197A95j46o8j3R1k06J18L17k82m0oN3p9J92J5m8j57K43k84J09P5O0l56J62J57
$$ 195 49 -19 -32 59 -147 -29 288 6 -34 -40 13 -66 126 141 93 -64 179 -105 4 79 139 -217 -55 102
5221A02j23j26L10k17j61K59J16k90K0K67k07j54K17K14k90Q1k6L8j77K17J78
$$ 102 -21 -147 163 -54 -215 44 160 -130 -110 157 -50 -204 13 227 -63 18 -8 30 -147 70 248
5242B48n31L01J90k22j43L35j06k70L70j07j83J07K23k96o7L64j78k54J60J60
$$ 248 -283 18 208 -14 -157 178 72 -198 172 65 -118 -11 212 -84 -151 213 35 -219 -59 101
5262A01k42j06N93k36k62L88p1m93L01J57l21J72K15j45l07K01K02m18J41M27
$$ 101 -141 -247 346 110 -152 236 165 -328 -27 130 -191 -19 196 51 -256 -55 147 -271 -130 297
5282B97k63m17O57j57l43K30K06l42j76M37j21k93K37J95l32KN61l69j43M53o4
$$ 297 34 -383 274 117 -226 4 210 -132 -308 129 8 -285 -48 147 -185 -183 378 9 -134 319 255
5303B55n35J95K10l78R2M16k03k56K62K50n73J55L76j50n73M88J06m12J26M62
$$ 255 -280 -85 125 -253 -161 255 52 -204 58 308 -265 -110 266 116 -457 31 137 -275 -149 313
5323C13l55k65N92k65k31K58K44m53J99J92l30j78M02q8k98M20K52m81j13M14
$$ 313 -42 -307 285 20 -211 47 291 -162 37 229 -101 -279 123 35 -263 157 409 -72 -185 229
5343B29k71j69J75J87k88J63L19k94k78L65r2k71K86K17m10k75N36j94k49M60
$$ 229 -42 -211 -36 151 -137 26 345 51 -227 138 46 -225 61 278 -132 -407 129 -65 -314 146
5363A46K5m38J35L18k94O6N8K21m78J94J88m49J89L26k28j47K14L0k37J96K03
$$ 146 171 -267 -132 186 -108 -42 16 237 -241 -47 141 -308 -119 207 -21 -168 46 76 -161 35 238
5384B38k30l77P13k30m03K34L09m87L8L67k20q6J92K05l63q6M80l43k04N46k79
$$ 238 8 -369 344 114 -289 -55 254 -233 -195 172 -48 -134 58 263 -100 -186 294 -49 -253 293 14
5405A4k57L45K39n58P6L39p0k56M01r4k12N3K43l53J9K62j96k95K97K36k87j61
$$ 14 -243 102 341 -217 -141 198 128 -128 273 179 -33 20 263 -90 -71 191 -5 -300 -3 233 -54 -215
5427b15L92o5m45N57l18j47P7K85l22P8K92k10k41K49J67j87pM00j86k97K72R2
$$ -215 177 112 -333 224 -94 -241 -164 121 -201 -123 169 -41 -282 -33 134 -53 -60 340 154 -143 129 221
5449B21m87L06L17o04J4K28K58l77Q4K10l97J49M06l96n6L52R5n30N0L13k99J6
$$ 221 -266 40 357 -247 -233 -5 253 -124 -40 170 -227 -78 328 -68 -124 228 323 -207 -157 156 -143 -127
5471a27L69j29p1n0Q8k39p8L97j62j65N5J35l62L96J47l48N4L11k36l04M89m7
$$ -127 242 113 42 -8 80 -159 -237 160 -2 -167 -112 23 -339 57 204 -144 -90 221 -15 -319 170 123
5493A23l67K02L08k65j47L47k4k80m7K44j85j07K72j51q4N0Q5j34P6L55l97j96
$$ 123 -244 -42 266 1 -146 201 177 -103 -150 94 -91 -198 74 -77 -161 -111 -26 -160 -84 271 -126 -322
5515c22L09J08l60L17R7j43j1J51k07j05M17j54l61Q3K28Jk80K92J56k62k31L92
$$ -322 -13 95 -265 52 149 6 -5 146 -61 -166 251 97 -264 -181 47 48 -232 60 216 -46 -277 115
5537A15j84O7L8j94n6L18j46K5r7K88l32J6L41p1k14JJ90j26j7Jk6p2J50J8k12
$$ 115 -69 -2 36 -158 -214 104 -42 -17 -114 174 -158 -142 199 128 -86 -85 105 -21 -38 -37 -63 -135 15 33 -179
5562a79J66J37j70n0m6K02k69K22N7q2k4J63j38M8J97j56k13K35O3j41j78L04
$$ -179 -13 124 -46 -96 -142 60 -209 13 70 -12 -36 127 -11 37 234 78 -135 100 163 22 -156 148
5584A48Lk28P0O2j31J42L1rk94K91%j42K26k00M6j47N8O9lm5r9N5N9K3p0N3R5
$$ 148 151 -77 -7 55 -76 66 97 88 -206 85 85 -57 169 -31 15 -132 -74 -5 -8 -53 -152 -97 -38 -15 -85 -32 63
5611F3Kk28J57M5J09p0nq3n1O3K30j66j03OM6q3J02p8L8J31k36R8j43J69q9N5
$$ 63 65 -163 -6 39 148 78 73 -10 -61 2 232 66 -37 -31 15 -68 34 -44 -6 125 -111 -13 -156 13 -76 -21
5637b1%m4j9r2J64K10j65P7j98J1J54j74J90j06l6J05j31k1J31M4j68J20M4k25
$$ -21 -21 -65 -84 -176 -12 198 33 110 -88 -77 77 -97 93 -13 -49 56 -75 -96 35 79 -89 31 75 -150
5661a50K26N8j81J73j19J04k34Q6J35Mn5J68j92J5q5J64q3K47l48j5K9j70L52
$$ -150 76 134 -47 126 7 111 -123 -37 98 102 47 215 23 38 -47 117 34 281 -67 -82 -53 -223 129
5684A29l10K63o9oj60O8P8o3N7J08j62J54p9J16k29J6K74k37l0R1Q3r0N3m1m4
$$ 129 -181 82 13 7 -153 -85 -7 -70 -13 95 -67 87 8 124 -105 -89 185 -52 -82 9 92 2 55 14 -30
5709c0j5o8P7k0j15J09k9O9L0j8M1k03Q1n2M8J25k28M9J17kj17o9L73q3j9J14
$$ -30 -45 -113 -36 -56 -171 -62 -91 -22 8 -10 31 -172 -91 -143 -95 30 -198 -149 -32 -34 -151 -220 153 70 51 165
5735A65j81J6k25K77k76J42L54j96k92J80Pj43J54R6j58K3K50k22l7N6J35j84
$$ 165 -16 0 -225 52 -224 -82 272 76 -216 -36 -29 -172 -18 78 -80 -57 193 -29 -66 -10 125 -59
5757e9L2J39j6j52L20k50r0qJ16Q0m70L33O4j85J54k03J26rK52l44K3N2O1j00
$$ -59 -27 112 96 -56 264 14 -76 -84 32 112 -358 -25 39 -146 8 -195 -69 -78 174 -170 -147 -95 -34 -134
5781a34K05J5k25J11K05o6k96J46J29j11Q4J12j18n3MJ58l39O2K57j67P2R5O5
$$ -134 71 86 -139 -28 177 111 -185 -39 90 -21 63 175 57 4 8 166 -173 -111 146 -21 51 146 211
5804B11k87j5J96l9k08L59k02k53L36N9k54J07J91k71l1J10K05k55P8Pk39N7M38
$$ 211 -76 -91 105 66 -142 217 15 -238 98 157 -97 10 201 -70 -101 9 214 -41 37 44 -195 -138 300
5827C00j46j91K80j14k84J47P2k60P3K50M0l38K44K30l89P7J11j38l07L28J07
$$ 300 154 -37 243 129 -155 -8 64 -196 -123 127 167 -171 73 303 -86 -9 102 -36 -343 -15 92
5848I2k52R1J55q8k75K32R8j75N1P2j71O6K63j76j86K05K72m21L9K54j94M9R7
$$ 92 -160 -69 86 -2 -277 -45 53 -122 -71 1 -170 -104 159 -17 -203 2 274 -147 -108 146 -48 1 98
5871I8j03j23K6L11k64J29J24j33j66K47j51l1pL38l90m3K26P3l23J43K50l45
$$ 98 -5 -128 -102 209 -55 74 198 65 -101 146 -5 -36 -43 295 -95 -138 88 161 -162 -19 231 -114
5893a14o4L99l01l3J04N6l06K68J35l40O2J34N8k22M13m2j31LP9k15j57K56R9
$$ -114 -178 221 -80 -113 -9 47 -259 9 144 -196 -134 0 58 -164 249 207 76 79 158 -57 -214 42 141
5916A41l16Q7K60j66j55J90K9k85L30Q6k97N0K71p4k13Q8m5l4L2J05l76L08O0
$$ 141 -175 -88 172 6 -149 41 70 -215 115 201 -96 -46 225 151 -62 26 -19 -53 -21 84 -292 16 76
5939G6r4l36K57L19k38n6Q1k8m7J43K2k37L9L48j75k84J84rj46K02J41l10K55
$$ 76 -18 -354 -97 222 -16 -72 9 -19 -66 77 99 -138 -99 249 74 -210 -26 -35 -181 21 162 -148 107
5962A07J71m23Q9J45J2k90J55K84l29J1Q9K10m68K43K10m05J31K02k48m8K38r3
$$ 107 278 -145 -56 89 101 -189 -34 250 -79 -68 21 231 -237 6 216 -189 -58 144 -104 -152 86 -7
5984gk29L48O9l09K6L75l39q0K08K35m39p7L12j93l2M2L1l0J90N4j62N6J80j99
$$ -7 -236 112 181 -128 -102 273 -66 -146 62 297 -142 -219 93 -100 -132 -90 -59 -89 101 155 -7 49 229 30
6008C0j97K74r1k63K21L70m43j03K42J23k34J33J6j89L7J63J6k99L38J42m57J41
$$ 30 -167 107 16 -247 -26 344 -99 -202 40 163 -71 62 78 -111 -74 89 105 -194 144 286 -171 -30
6030c0K24l91K3J75j49J32J28L00m90k6K62j62m3R4j2k46Q1K36Qn3K41l14j58
$$ -30 194 -197 -174 1 -148 -16 112 412 -78 -104 158 -4 -47 47 35 -211 -130 106 114 61 302 -12 -170
6053a70J03J70j08K8J81k24k02L2K76k60L51J03k52j61O5J66j98P8J82k35k9K94
$$ -170 -67 103 -5 23 204 -20 -222 -190 86 -174 177 280 28 -133 -68 98 -100 -22 160 -75 -104 190
6075A90k3l50K69j3j10J90J6o3k56L50%l30Q1l1l0K8K88j56k31J13R2m8k67L94
$$ 190 167 -183 86 73 -37 153 169 106 -150 200 200 -130 -49 -80 -110 -82 206 50 -181 -68 24 -24 -291 103
6099A03n4l94L36O3j10lJ48k56j10L23jl61L34J54l36J47N7j31K7P3j94L1J55
$$ 103 49 -345 -9 54 -56 -59 89 -167 -277 46 45 -316 18 172 -164 -17 40 -91 -64 9 -185 -154 1
6122AJ00j01N2r6K02k14J24J65l04J16p8N8m1J63j28j32K44j18j38L9K35q5k74
$$ 1 101 0 52 -44 158 -56 68 233 -71 45 -33 25 -16 147 19 -113 131 13 -125 -86 149 64 -210
6145b10K99l6q4J12o4r8m3J20M4M3J4r6r6o3K99j17l41M38n5j93k1J51P7MJ8j68
$$ -210 89 53 -31 81 17 -81 -124 -4 40 83 97 1 -95 -158 141 24 -317 121 66 -127 -148 3 80 84 102 -66
6171f6r7L48j47P9j19j6N3j52K05J19k69O6o9Qo7J05R4j26N0J07r9p5K61l24N3
$$ -66 -163 185 38 117 -2 -18 35 -117 88 207 -62 4 -65 -57 -124 -19 75 -51 -1 106 7 -68 193 -131 -78
6196g8J4L9R1n4J59r9j87J27N0j34J3j0m8K30j50JK4m7M6j02K2K03j94L5J3J78
$$ -78 -64 -25 66 12 171 72 -115 12 62 -72 -59 -69 -117 113 -37 -36 -12 -59 -13 -115 -93 110 -84 -49 -36 142
6222A42k07Q2o9k8K7J51q4O5j78P4Q6N6j3q4R4k8p7j79K53j51R1q8J6J87k68J67
$$ 142 -65 17 -52 -80 -53 98 14 79 -99 -25 61 117 104 20 114 86 9 -170 83 -68 23 -65 -49 138 -130 37
6248C7k8M6r8M3rm3J05m1Pj14K4R7j21J98k5p0L5M0o2L0k7o9q1J28j61J02J55
$$ 37 9 55 -43 0 -9 -52 53 12 19 -95 -71 26 -95 103 78 8 43 83 21 51 24 -45 -126 2 -159 -57 98
6275I8q9o5K3J50k78J47Q4j14R9kpm8L0L4q4P4k08J62j49k3R9J45J2j39j2o2q8
$$ 98 9 -56 -33 117 -161 -14 70 -44 55 53 46 -2 28 62 -22 52 -156 6 -143 -166 -67 78 90 -49 -61 -123 -211
6302b11J14K29j61N8L4Q9k62J06%j0K3J11jk61J20O2o4r6K71j65J55j68l2K3J87
$$ -211 -97 132 -29 29 63 152 -110 -4 -4 -14 9 120 119 -142 -22 40 -24 -120 151 -14 141 -27 -59 -36 151
6327A51J4k51N8J6J42j00O2L7m5JKj00j25N0J32k03J51L2J4j58LJ93k38R3K22
$$ 151 165 -86 -28 -12 130 30 92 129 84 85 87 -13 -138 -88 44 -159 -8 24 38 -120 -117 76 -162 -69 153
6352A53q2j31J32O3l82J97Q1j45J63oo7m1O4R3j37J25J35j90j42J70l7l4Q3n0
$$ 153 71 -60 72 135 -247 -50 31 -114 49 43 -24 -65 -1 92 -45 80 215 25 -117 53 16 -18 65 15
6376A5K6j65L10k56l4K06j84j36K71q1J1p5M7O0j13K28O0k85R6nP9k10J69J36
$$ 15 41 -124 186 -70 -104 102 -82 -218 53 -28 -17 -92 -45 15 -98 130 190 -95 1 -4 75 -135 34 170
6400A70k60K9K19q3r3J22j71j46K21K34l95J80K1K9k95K15J68l17K39J27l19J03
$$ 170 -90 -61 158 75 -18 104 -67 -213 8 242 -153 27 48 77 -218 -3 165 -152 87 214 -105 -2
6422bJ60j37k73K65P4j53R2P8q2o9K16q1j91O9J66j66j39K35j15j84L05PP3j02
$$ -2 158 21 -252 13 87 -66 26 104 22 -47 169 88 -103 -34 132 -34 -173 62 -53 -237 68 75 148 46
6446D6m9Q9k95L19j84n5M0L12l41RK27r0j38M7J33k58K57J08j55k85M11J11k82
$$ 46 -3 86 -209 110 -74 -129 -89 223 -118 -109 118 28 -110 -63 70 -188 69 177 22 -263 148 259 -23
6469b3p0K88m08R7K60r2j94J63k8j67J14J34K1j90K81j09k09J22J92k01j5J61
$$ -23 -93 195 -213 -116 144 52 -142 21 -7 -174 -60 74 95 -95 186 77 -132 -10 182 -19 -34 127
6491A27k4k69J92J02j59k4K05k46j37L99m8l15K90N0k98N7L12k83k00M14k7k72
$$ 127 103 -166 26 128 -31 -55 150 -96 -233 166 118 -197 93 143 -155 -98 214 -69 -269 145 118 -154
6513a54J89K22k80j58M77k63j49J01J02k07N4K50j63k43K75J54k83J81l0r5r9
$$ -154 35 257 -23 -181 296 33 -116 -15 87 -120 -66 184 21 -222 53 207 -76 105 75 -20 -119
6534a19K81p7k92R0K98j22j25L56l72j47M58q9k42L8P1K8j15L14q1j66J04J15
$$ -119 162 85 -207 -117 181 59 -66 290 -82 -229 229 140 -102 -64 7 35 -80 234 153 -13 91 206
6556B06k25l1L07k69j72K05P4l42J63J83j96m2L06j04j99J38J81l06l3L86j80
$$ 206 -19 -50 257 -12 -184 21 95 -247 -84 99 -97 -139 167 63 -136 2 183 -123 -156 230 50
6577E0k23L70j48k13P2J70j47n4L79k92j21J22K73l84M3K35j26q0O2K31m08K20
$$ 50 -173 197 49 -164 -92 78 -69 -123 256 -36 -157 -35 238 -146 -103 132 6 -74 -12 219 -189 31
6599C1R4j40r1J70N6k88J45J46l66J83L01k65j07K51K8m17K23K57k38r9L14j86
$$ 31 125 -15 -106 64 120 -168 -23 123 -243 -60 241 -24 -131 120 148 -269 -46 211 -27 -126 188 2
6621Bj63K26Nk27j03L90j31k62M48%l85J56J57j41J15N0j78m1K34jj83N6J02k24
$$ 2 -161 65 70 -157 -260 130 -1 -263 185 185 -200 -44 113 -28 87 137 -41 -82 152 151 -32 24 126 -98
6645i8j31L81j07j21J65r3p5OJ28j12p7J37L0k11J07J47j14n6K13k6l74L93k2
$$ -98 -229 152 45 -76 89 -4 -79 -73 55 -57 -134 3 33 -178 -71 76 -38 -94 119 93 -281 112 90
6668I0j78k6J46o3oN9P7j19m2J98l64J14L01p9k27J03J18j34j76M02k65K9O6q1
$$ 90 -88 -114 32 -31 -37 22 99 -20 -62 136 -228 -114 187 108 -119 -16 102 -32 -208 194 -71 -42 24 -57
6692e7K7nO9k95Q6L54j59k72K24M1n8n8K10k47nk9J32Kj60K48R4k12J64m4k38
$$ -57 -30 -35 34 -261 -175 179 20 -252 -28 13 -45 -103 107 -140 -145 -174 -42 -40 -200 48 142 -70 94 50 -188
6717a88J16L69l95RJ51q2j39J03Q2l21L35J77k16k4K01j85j06J38N1j35n3K87
$$ -188 -72 297 -98 -89 62 -20 -159 -56 26 -295 40 217 1 -23 178 -7 -113 25 76 -59 -112 175
6739A75j68r9L4lM0J41J6k58N5N2O4K9k0J74l61P8j71Q6N3J56r6j13K35k88J67
$$ 175 7 -92 -58 -61 -21 120 136 -122 -67 -15 49 78 58 232 -129 -51 -222 -136 -83 73 -23 -136 99 -189 -22
6764b2J31Jo6j55R0P8j33P8J24k0o8J64r1k65J20R0qj59N1O3j59J82J50l41J10
$$ -22 109 110 44 -111 -21 57 -76 2 126 106 38 202 111 -154 -34 56 48 -111 -60 3 -156 26 176 -165 -55
6789e5o0L5P5j56J44j3J03l4J8j51L3J74n8n2RJ02j70M5m2j94K60Pk03J89J26
$$ -55 -115 -80 -5 -161 -17 -30 73 39 57 -94 -61 113 55 3 12 114 -56 -11 -53 -247 13 20 -183 6 132
6814A32k70J14k06K34Q6j71K1J60j24J8K50l35K27k69J43O8j10J44q1j03J7k2
$$ 132 -138 -24 -230 4 90 -81 -60 100 -24 -6 244 -91 136 -133 10 78 -32 112 31 -72 -55 -77
6836g7J19k4M2j92O8J9O1j8J00j36j7J04J1q2OR4j1j79N8J22km8j37P6J63o5j66
$$ -77 42 18 60 -132 -64 -45 16 -2 98 -38 -55 49 60 -22 -16 78 67 -112 -54 68 66 18 -119 -43 120 55 -111
6863a11J31n6J6J9j83J82m7j05J75o0J06j08l4J7N8m5K06k27M4N8Om0j43J62n8
$$ -111 20 -36 -20 -1 -184 -2 -49 -154 21 -39 67 -41 -75 -58 0 -45 161 -66 -22 36 42 2 -141 21 -37
6888c7j78L16k28J52k2P6j02N2J07q6l3N1o2j4j59K66k04P0L4qKK6r7Q5j23J52
$$ -37 -215 101 -127 25 3 79 -23 29 136 50 17 68 6 -8 -167 99 -105 -35 -1 -9 -7 19 -78 7 -116 36
6914C6j13M8J56j48j19M7K13o1o5J13j64p0O2j20J27J82K0j57O1OL1j30M3P0k30
$$ 36 -77 -29 127 -21 -140 -93 120 59 -6 107 -57 -127 -65 -185 -58 124 144 -13 48 54 85 -45 -2 68 -162
6939a62J57M1q0j3Q2j57J90j46K06r3q2K29j59j10L9Q1l4p2J72K1l11L33l0k94
$$ -162 -5 36 -44 -57 25 -132 58 -88 118 25 -57 172 13 -97 -58 23 -11 -83 89 110 -201 132 102 -192
6963a92J71K38m11J48O4J1k37K17j04P1j76L20j41kl3J12O9k42L93k79j06J31
$$ -192 -21 217 -194 -46 18 29 -208 9 -95 -24 -200 120 -21 -23 -56 56 125 -117 276 -3 -109 22
6985B2R1k64J03J07L9k24K49o0j36L48k97q6l0J55j17j5L60p1l24L13k27K3N3
$$ 22 113 -151 -48 59 98 -126 123 63 -73 275 -22 -108 -138 17 -100 -115 245 174 -150 163 -64 -41 12
7008A2K30j73k18K52j15j79J87R8k24QK78p4k20K46P7k73J25K99l76P3J71j61
$$ 12 242 69 -149 103 -12 -191 -4 94 -130 -122 156 82 -138 108 185 -88 37 336 -40 33 204 43
7030D3k78K90R5j78RJ57k64P7J42j45o7J62J46j91j96L38k59q3J72J56j36PJ81
$$ 43 -235 55 150 -28 -19 138 -126 -49 93 -52 -119 43 189 -2 -198 140 -119 -202 -30 126 -10 -3 178
7053A78j03j76K0J59k08K1L00l31j34N04k15j02N3J30j14RK42j44k50J80K3m4
$$ 178 75 -101 -81 78 -130 -109 191 -140 -274 230 15 -87 -34 96 -18 -9 233 89 -161 19 42 -2
7075bP7o7M3n5P3o0l48L53L1j17J07O6k19j19L81r8j23J20M3j83q7L52j16j65
$$ -2 75 8 51 -4 69 9 -339 14 45 -72 35 101 -118 -237 144 46 -77 43 86 -97 -184 168 52 -113
7099a13J94M6k24J7J18j37j44J84L3j74K67J67k84j81M17q8l21L84p2k40Q3J01
$$ -113 81 127 -97 -80 38 -99 -243 -59 -26 -200 67 234 -50 -231 186 98 -223 161 89 -151 -68 33
7121C3o1k52N57j74k53J77J92k27j26L31r8j82J63K77n13K14J08j70j38J92N2
$$ 33 -28 -280 277 103 -150 27 219 -8 -134 197 99 -83 80 357 -156 58 166 -4 -142 50 102
7142A02k11J52L3j67J2J18Q2k36J46J25k17N3K08j73k1j2Q5k56K17J59k71J97
$$ 102 -109 43 76 -91 -79 39 121 -115 31 156 -61 -8 200 27 6 -6 79 -177 40 199 -72 125
7164A25K1P2k30l0j7N7q2J13k4j93K19n6OJ57mm41J65L13j23j85K23L2m20O3L33
$$ 125 146 218 -12 -42 -59 -2 -84 29 5 -188 31 -25 -19 138 134 -307 -142 171 48 -137 86 118 -302 -239 94
7189I4qj82P2J10l41K71P9o5K7k9J89l16K48j34k66K06J89l22m6K98Q6k42P2Q3
$$ 94 86 -96 -24 86 -255 16 95 30 57 28 217 -99 149 15 -251 -45 144 -178 -224 74 160 -82 -10 73
7213G3k43J41K81j62k28K73o0r8O6M3j45j33K41k4l17K87J76l92J14J22p4qN8
$$ 73 -170 -29 252 90 -138 135 75 -23 43 86 -59 -192 49 25 -292 -5 171 -221 -107 15 -59 -67 -9
7236il3l07L61R8l35K5L72p4j69N8M3o9P1Q4o6j86K07l1j85J3K80m46J28L04j60
$$ -9 -42 -349 12 110 -225 -200 172 98 -71 -13 30 -39 32 116 50 -136 71 40 -145 -132 148 -298 -170 134 -26
7261b6m7J2J31r9J36k4o6j30L00j07j0q4J56k26q1L21k43R3j3o7J0p0K89k88O1
$$ -26 -73 -61 70 -29 107 83 17 -113 187 80 70 -14 142 -84 -165 156 -87 6 -7 -74 -64 -134 155 -133 -72
7286g2K7J40k78K29J44j35J5ML4j89K04L4j48J97k27j11J43Rk3r9q7L59j61r5
$$ -72 -45 95 -183 46 190 55 70 74 108 -81 123 157 9 206 -21 -132 11 20 -3 -102 -189 170 9 -86
7310h6J75j51j2J29L1k54K09NOj06K4L04l98K28j2kj70R0k7k25J82R2p9j03L21
$$ -86 89 -62 -74 55 86 -168 41 46 52 -54 -30 274 -124 104 92 90 -80 10 -17 -242 -60 32 -47 -150 171
7335A71k62P6J40p4o7J74j7k27j54L27j41r1Q4K08k43J33j9p2P5o8J87k51R6l8
$$ 171 -91 -15 125 51 -16 158 141 -86 -240 87 -54 -145 -61 147 -96 37 18 -54 21 -47 140 -111 -15 -53
7359e3j3q2J88P0km1j86J04KP9k02O8J46p6J02o6k8PqJ62j07j90k00K62j9o5R8
$$ -53 -66 -148 40 110 108 67 -119 -15 -13 66 -136 -68 78 2 104 38 10 17 9 171 64 -126 -326 -64 -83 -148 -50
7386e0R6j65M1Q4Q4m9J67l57L38j32p9rJ03p4nJ13j16r9J84rJ1J5r7M7j27K18
$$ -50 46 -119 -78 6 90 41 208 -149 189 57 -22 -31 72 -2 -7 106 -10 -109 75 66 77 92 -5 42 -85 133
7412A33o4J4q4J25K0k97K48k3m4l1L5J23j30o7n2L7K26l19J22P6J5j11J27q6P9
$$ 133 69 83 -1 124 144 -153 95 72 28 -3 32 155 25 -42 -94 -57 169 -150 -28 48 63 -48 79 -7 72
7437G2q3j13J13M7M9mLn9j40R1J66p3q6M7k04L64m1k19O5J43q2J0j15n1M19l15
$$ 72 -11 -124 -11 36 85 81 84 25 -115 -24 142 69 -17 30 -174 190 149 -70 -5 138 56 66 -49 -100 319 4
7463DJ14j37r0R3O0m2N4j60J17O1j16R8J0K7j37Q1l2J58j79O1k0l0J18k09R0J25
$$ 4 118 -19 -109 -16 44 2 56 -104 13 74 -42 56 66 93 -44 37 5 163 -16 45 25 -5 113 -96 -6 119
7489A19j72J04j38K4P5r9Q9Mp1J83j86N2K4J97j08k38J62M5j45K20j22lJ19j10
$$ 119 -53 51 -87 -63 12 -87 2 6 -65 118 -68 -16 8 205 97 -141 21 66 -79 141 19 16 135 25
7513B5J74k37J10J01k21Q6J52k09j11J9K02j03l1R4j04P5J15m2Rk8j97J03J98
$$ 25 199 -38 72 173 -48 38 190 -19 -130 -111 91 -12 -43 51 -53 22 137 95 104 76 -121 -18 180
7536A80j31j87M8l5J22J03j98J84j56j2L5r6J35p1J50q2L8J6j29LJ64l8j3K9k6
$$ 180 49 -138 -90 -125 -3 100 -98 86 -70 -82 -47 -143 -8 -79 71 -11 27 43 -86 -83 81 43 30 59 33
7561C3m9p3J62p9j64K34P2j81LJ1pN6r2j0j20L82Nl99K22JM3r3j51L13j74j6J52
$$ 33 -16 -89 73 -6 -170 64 136 -45 -42 -31 -38 18 -74 -84 -204 178 183 -216 6 7 50 -43 -194 119 -55 -71 81
7588H1qj62J76P2q2m1J03j29J3r6O5j1mJ49k79K15K6kr7n7P7o1J20j8j31L0L7
$$ 81 73 -89 87 159 77 36 139 10 23 -73 -8 -19 -23 126 -153 62 88 86 -11 -68 9 -52 68 50 -81 -51 -14
7615a4M5J8o5L7k04K53M2k46N9K04o8r8K57j06MK3j69P8j93J81q1mnJ06j44J18
$$ -14 31 49 -16 21 -183 70 112 -134 -75 129 61 -37 220 114 118 141 -28 50 -143 38 -43 -47 -52 54 -90 28
7641B8k9Lj54K72k28J46J18j33L7j46K46k43j09J44j0j89J03K20j79m1K06J04
$$ 28 -1 2 -152 120 -108 38 156 23 60 -86 160 -83 -192 -48 -58 -247 -144 76 -103 -144 62 166
7663A66k41P6J36j50j9N4m1q0J11l6m4l8J20j76N5K62K5k21O3O5j92O7M5m5o6
$$ 166 -75 1 137 -13 -32 22 -19 -99 12 -24 -68 -106 14 -162 -107 155 180 -41 22 87 -105 -38 7 -38 -104
7688a04J38k5q0J09o4Q2j64L40j77p4N6nK7j48J17k14J81o7J60p6k19J83P6q2
$$ -104 34 9 -71 38 -26 56 -108 232 55 -19 37 32 59 -89 28 -186 -5 -72 88 12 -207 -24 52 -30
7712c0J4r1m4K88l1l05J68K80j97J7j16K56l92J85k9O4p9L1J50l19K68Ll48J40
$$ -30 -16 -107 -151 137 106 -199 -31 249 52 69 -47 209 -183 2 -27 37 -42 -11 139 -180 88 91 -257 -117
7736a17K16n0j59K35jj51l5J62j92k7J64K8n3R3Mj06P2Q6k32R1L5m3K0rR3l6j00
$$ -117 99 49 -110 125 124 -27 -62 100 -92 -119 45 73 20 113 117 11 83 169 -63 28 63 20 40 31 124 88 -12
7763a2k3k9r9J58j10n7P4K14k16N9M7j35M6J41j09R9j08O2P9k40L34j48O9KM5
$$ -12 -35 -64 -163 -5 -115 -172 -98 116 -100 -41 6 -129 -83 58 -51 48 -60 2 81 -159 175 27 96 98 143
7788A43k66R6J22p6p9R3J02k28J28P5o1j31J87j13P9l2l6R3r8J59r0n4J2Nj01
$$ 143 -123 -27 95 19 -60 33 135 -93 35 110 49 -82 105 -8 71 39 3 96 -2 157 67 13 25 30 -71
7813g1O8R7j97r4L32j3l16K80Lk62P4K35k60q3J47R6L7k44L01k02K9L5j25m9J91
$$ -71 -3 94 -103 -197 135 122 -194 86 89 -173 -99 136 -124 -207 -60 36 73 -171 130 -72 -43 -8 -133 -182 9
7838IM4j20n4J57j30o6KJ39N4j19K97l73q9J30M8r3J49J64j45j02K17k44p8K57
$$ 9 53 -67 -121 36 -94 -160 -158 -19 35 -84 213 -160 -249 -119 -71 -164 -15 149 4 -98 119 -125 -203 54
7862E4l6p0K28J5r8j39J59K3o9j05P7J28l51L28o3JM1j48lK9mq5J10Q2qj45J29
$$ 54 18 -52 176 191 93 -46 113 136 67 -38 39 167 -184 144 81 82 123 -25 -28 1 -3 -88 22 104 96 -49 80
7889H0j08J76k03r1J45n5J94j04l7J10j29O7J7N1o6j38J43m2O1j47Q9J01j67J70
$$ 80 -28 148 -55 -146 -1 -56 138 34 -3 107 -22 45 62 113 47 -91 52 10 71 -76 13 114 -53 117
7913A17k9q2j88K29J03r1R8L8k85K61j04j32J8M4l2O4M5j00P5j59J07J78j10M4
$$ 117 88 6 -182 47 150 59 157 195 -90 171 67 -65 -47 -3 -35 29 74 -26 49 -110 -3 175 65 109
7937A09j28k1P1m1J04q6Lp2l8J20o8l6J69K7j16ql1M2j10J04n8J17q3%R3L4j7
$$ 109 -19 -40 31 -10 94 8 11 -61 -99 21 -47 -83 86 113 -3 -11 -42 0 -110 -6 -64 53 -30 -30 63 97 80
7964H0j28R6j79K10j93J23l4J37m6n7N4j69Q8K2J1j15J20j03J73n9o0N7J08k2
$$ 80 -48 48 -131 79 -114 9 -25 112 66 9 63 -106 -18 4 15 -100 20 -83 90 31 -29 28 136 114
7988A14j67Q1l6J63k67Q0kj57J68q0K07o7j12mJ4J57k5Nj4Oj45Q4qj16J41R4p4
$$ 114 -53 28 -8 155 -112 -32 -34 -191 -23 -103 104 37 -75 -79 -65 92 67 72 58 64 -81 3 -5 -121 20 114 40
8015D0o9mR1o7J2J18k53J31m9R9j00L9m6J39P8k71M5l9J62l9j26J52Q4q6p8m2
$$ 40 -29 -33 58 -9 3 121 -132 -1 -50 49 -51 -12 -58 81 159 -112 -67 -106 56 17 -109 43 127 41 -37 -79
8041g9J1J43j3l1L5j17R5Lr3O4Q0k48J48R4o5K8M2j52J39k6p8O7j42P9J30q3l
$$ -79 -68 75 62 31 66 -51 44 47 -46 18 98 -150 -2 92 27 55 97 -55 84 58 -20 47 -95 -16 114 31 28
8068B8O7j26K45k56N5q1P7q3J8j43J50R6N1M1j86J08m1j1p3J8J32j76m2J63o6
$$ 28 95 -31 214 -42 13 -68 9 -74 -56 -199 -49 47 98 139 -47 61 20 9 -64 -46 86 -90 -132 31 -35
8093c5Q3N0j2p8o4R1PJ1O2l4l58K52q2R6k1J4J07j20p4J46k00K19o2n4o4k0L38
$$ -35 48 98 86 8 -56 35 42 53 115 81 -277 -25 -107 -11 -32 -18 89 -31 -105 41 -159 60 -2 -56 -120 -140 198
8120A98j86lK6K7r3K24j28r4q8J52r2P1m3n0lK13k28jJ15L1p2o4J03r7O5J1J09
$$ 198 12 9 35 62 -31 193 65 -29 -117 35 -57 14 -29 -79 -82 131 -97 -98 17 48 -24 -88 15 -82 -17 -6 103
8147A03K3kj0j13q0J91k12P5J50j17l0o3J76r6j73K56Nk89K22m8P5Q7k41r1J46
$$ 103 126 124 114 1 -79 112 -100 -25 125 8 -22 -85 91 -5 -178 78 83 -206 16 -32 43 130 -111 -202 -56
8172e6N5L1k46J20K51k32j03J73n7J1J27Or8J50Jj38K2J65p4
$$ -56 -1 30 -216 -96 155 -77 -180 -7 -64 -53 74 80 -18 132 133 -5 17 182 108
8191A08
$$ Imaginary data points
##PAGE= N=2
##DATA TABLE= (X++(I..I)), XYDATA
0@%%%%%%%%%Qj6J6j6K4l2M0m8N6p2Q8j04J28j52J76k09K49k91L35l88M48n12N82
$$ 0 0 0 0 0 0 0 0 0 0 8 -8 8 -8 16 -16 24 -24 32 -40 48 -56 72 -80 96 -113 136 -155 180 -208 240 -272 310
32C10o62P50q47R55j074J203j344J501j673J861k066K288k530K796l089L407l753
$$ 310 -352 398 -449 506 -568 635 -709 792 -881 980 -1086 1202 -1328 1468 -1621 1786 -1967
49a967M135m556N020n532O102o740P457q271R203j0282J1551j3067J4911j7217
$$ -1967 2168 -2388 2632 -2900 3202 -3538 3919 -4352 4851 -5431 6120 -6947 7964 -9253
63i253K0196k4212K9950l8867N4725r1289L26137R5092o32477J48068K08947j82341
$$ -9253 10943 -13269 16681 -22186 32539 -58750 267387 362479 -269998 -121930 87017 -95324
75i5324r1073L41163L4008k52585k9266J47496n8146K246J02899q2152j90296
$$ -95324 -186397 154766 188774 -63811 -93077 54419 -3727 -1481 101418 19266 -171030
86a71030P1793J82052K8360r6466k7873K3614j8002p1567K6325J41411M0901j72870
$$ -171030 -99237 82815 111175 14709 -13164 10450 -7552 -79119 -52794 88617 129518 -43352
98d3352q9903J29745O7282p9566J3385N0186o4969l5904O6629N675k8999M3266
$$ -43352 -133255 -3510 63772 -15794 -2409 47777 -17192 -53096 13533 19208 -9791 33475
110C3475j1083j00058L6827J18804m7090p1894O7742j0794r3138P5165J00975
$$ 33475 22392 -77666 -40839 77965 30875 -41019 26723 15929 -77209 -2044 98931
121I8931r7325o6929R2669k0055j21278Q4489J50841p3794q6296P3479q569j09672
$$ 98931 1606 -65323 27346 7291 -113987 -29498 121343 47549 -38747 34732 26163 -83509
133h3509K2825Q4601j5816j4042N3985K870n3804j0837N648j2455L255j3206o436
$$ -83509 -60684 23917 8101 -5941 48044 50914 -2890 -13727 -8079 -20534 -17279 -30485 -36921
146c6921P6398L2406q7174l369Q1324p3286j15517J04573J24358r6010o0755J13299
$$ -36921 39477 71883 -15291 -18660 62664 -10622 -126139 -21566 102792 6782 -53973 59326
158E9326j4296j33393N9517J12602q1454o0702Q6128j14q4035M9134P7285p3085
$$ 59326 45030 -88363 -28846 83756 2302 -58400 27728 27614 -56421 -7287 69998 -3087
170c087o1992O2523K5272l0201K5242J3038m1933j2804L520j345M8354L3590o4498
$$ -3087 -65079 -2556 22716 -7485 17757 30795 -11138 -23942 -20422 -21767 26587 60177 -4321
183d321m4342N4818J3607m9499L6469N0961p2026m9321O3562K2254k8573K2747
$$ -4321 -48663 6155 19762 -29737 6732 57693 -14333 -63654 -92 22162 -6411 16336
195A6336N298n0135N560M7916j5894j9603L2850k1725n6010M8544N9760l8926
$$ 16336 21634 -28501 -22941 24975 9081 -10522 22328 603 -55407 -6863 52897 13971
207A3971j5282K5391m7786l3725O8741K6326n7675J2552M8241n6804l8412Q6266
$$ 13971 -1311 24080 -23706 -57431 11310 37636 -20039 -7487 40754 -16050 -54462 31804
219C1804K0932q7562J149N8284k5343k0473M7803K291m6568M971J8750k2106J3907
$$ 31804 52736 -34826 -33677 24607 -736 -21209 26594 28885 -17683 -12712 6038 -16068 -2161
232b161L7936l6397l5120M1836J0381l6421J7140K4190l2121r825L5444r69k1775
$$ -2161 35775 -622 -35742 6094 16475 -19946 -2806 21384 -10737 -20562 14882 13913 -7862
245g862J8281j061m2458J7279M9726k2026k6122K9251m649l6679J4073K7359j5569
$$ -7862 10419 9358 -33100 -15821 33905 11879 -14243 15008 10359 -26320 -12247 15112 -457
258d57r717J7508r155j1880L0114K599m0612Q925K7326k5044m437M1860l038l8845
$$ -457 -10174 7334 -1821 -13701 16413 19012 -21600 -12675 14651 -10393 -14830 27030 23992 -14853
272a4853N836J8984k0759l759L2260q114k7261K1055J0266k8422P272K2669k1383
$$ -14853 -9017 9967 -10792 -14551 17709 9595 -17666 3389 13655 -14767 -7495 15174 -6209
285f209j4529K7179R663j9675M403J3131k1488r781K4249o3j0284J6202m632k5226
$$ -6209 -20738 6441 16104 -3571 832 13963 -7525 -17306 6943 6880 -3404 12798 8166 -17060
299a7060Q996J7657j2248n628J8631k672k3879P669J8894j1804l315J4181r854
$$ -17060 -8064 9593 -2655 -8283 10348 7676 -16203 -8534 10360 -1444 -4759 9422 -432
312d32o892J6631j501j5515O259Q796j3590n210K1713N478j9185q75L165j2910
$$ -432 -7324 9307 7806 -7709 -1450 7346 -6244 -11454 10259 15737 -3448 -4323 -1158 -14068
326a4068N797J5891m270k233P834p232j4002N608J5337n320r535J0139L175q830
$$ -14068 -8271 7620 3350 1117 8951 1719 -12283 -6675 8662 3342 -6193 3946 7121 -1709
340a709M968K791j0248j281K631k304L758Q303J018j0318p005N724J795K58P265
$$ -1709 3259 6050 -4198 -5479 -2848 -5152 -1394 6909 7927 -2391 -9396 -3672 -1877 -1619 5646
355E646J52n146j549k948K090O041K14j438k758k908J878m5j677J384L5L15j22
$$ 5646 5798 652 -897 -3845 -1755 4286 4500 3062 304 -2604 -726 -771 -2448 -1064 -1029 -714 -836
372h36L58M539k425p401K222J785j086P340L712l639j306k603n722k102N552N712
$$ -836 -478 4061 1636 -5765 -3543 -1758 -2844 4496 8208 4569 3263 660 -5062 -7164 -1612 4100
388D100l258M48N540p830n682O662k636m422P218J532m407N661P547p009r606
$$ 4100 842 1290 6830 -1000 -6682 -20 -2656 -7078 140 1672 -2735 2926 10473 3464 -6142
403f142O717J640j2591P768J5507r392o125Q242o469q202R169L142j1187J754
$$ -6142 575 2215 -10376 -2608 12899 3507 -2618 5624 -845 -9047 122 3264 -7923 -6169
417f169J3477p082q260J7899K396k2374L009J2177j0524J066J6607m674j2314
$$ -6169 7308 226 -8034 9865 12261 -10113 -7104 5073 -5451 -4385 12222 7548 -4766
430d766Q409L006j7565L076J9233j4103j4144K3549N148j9864Q150J1247j8471
$$ -4766 3643 6649 -10916 -7840 11393 -2710 -16854 6695 11843 -8021 129 11376 -7095
443g095o345J6731j123q794J6927N563k4977K821K1466j8843j3792K6260N55k3794
$$ -7095 -13440 3291 2168 -6626 10301 15864 -9113 -6292 15174 -3669 -17461 8799 9354 -14440
457a4440J1521J7314j5727n921J5698j0773j7244K2278R428k4419J2131K4865
$$ -14440 -2919 14395 -1332 -7253 8445 -2328 -19572 2706 12134 -12285 -154 24711
469B4711k6507j6502K7839M95k4751J1679J6312j9018k857K4355j1436j9238K2442
$$ 24711 -1796 -18298 9541 10036 -14715 -3036 13276 -5742 -8599 15756 4320 -14918 7524
482G524l03l3573J6912L2473k2254j3642K7282l304k9647J2657K0631k0206k943
$$ 7524 7221 -26352 -9440 23033 779 -12863 14419 11115 -18532 -5875 14756 -5450 -8393
495h393K4587j5941j6132L2209N80l8518J0508K6590k3142j0722L4844J419l3238
$$ -8393 16194 253 -15879 16330 16910 -21608 -11100 15490 -7652 -18374 16470 17889 -15349
508a5349Q756J5946k1692N518K9496k2525k0142L2784J783l2945J7487K7051l2517
$$ -15349 -6593 9353 -12339 -6821 22675 150 -19992 12792 14575 -18370 -883 26168 -6349
521f349k0955L5120N692k6158J8465J2400l6474J646L2938j8942j4577L5160j746
$$ -6349 -27304 7816 13508 -12650 5815 18215 -18259 -16613 16325 -2617 -17194 17966 16220
534A6220m1188J4720L6340k4028j8264L0122o323l1209K5289J8099k9930N406
$$ 16220 -24968 -10248 26092 2064 -16200 13922 7599 -23610 1679 19778 -10152 -4746
546d746K4369k9220j6175M0710L991l9967J2990K9246l0654j1484M1815o873l3312
$$ -4746 19623 -9597 -25772 14938 18929 -21038 -8048 21198 -9456 -20940 20875 14002 -19310
559a9310K2896J0956l2266J2694L2570k8936k3244L5307K140l7249K3065L3717
$$ -19310 3586 14542 -17724 -5030 27540 -1396 -24640 10667 12807 -24442 -1377 32340
571C2340l9483j8317L7525q603k5820L2292J3293l8884L135L1041k2231j4773
$$ 32340 -7143 -25460 12065 3462 -22358 9934 23227 -15657 -12522 18519 -3712 -18485
583a8485M2141r11m9158J3620L0809k8636k454L9202j4222l1847J8699O049k4400
$$ -18485 23656 22745 -26413 -12793 18016 -10620 -13074 26128 11906 -19941 -1242 4807 -19593
596a9593K0223K7016l6588j6270M2850o931l6594L6299K4862n1570j1029M2518
$$ -19593 630 27646 -8942 -25212 17638 10707 -25887 10412 35274 -16296 -27325 15193
608A5193j0625k2335L5420O482m7609Q021L8196l0950j9092M9907k025m9866K1074
$$ 15193 4568 -17767 17653 24135 -23474 -15453 22743 -8207 -27299 22608 20583 -29283 -8209
621h209L6727l0337j8244K6984n437j7553K8980J0605l2787N692J7814l5787m560
$$ -8209 28518 -1819 -20063 6921 1484 -16069 12911 23516 -9271 -3579 14235 -21552 -26112
634b6112N2006l214m0981J3981J6051k7506O093L4381j9990k7259K5200J33k7638
$$ -26112 25894 22680 -18301 -4320 11731 -15775 -9682 24699 4709 -22550 2650 2783 -24855
647b4855L5635L4004m8739k4351L6237p214k5369L7076K1402m4993r465L2232
$$ -24855 10780 44784 -3955 -28306 7931 717 -24652 12424 33826 -11167 -20632 11600
659A1600j7259j4158M5518k185n4481J5180L6735l0614r413M6206o651m5724J7334
$$ 11600 -5659 -19817 25701 23516 -30965 -15785 20950 -9664 -19077 27129 20478 -25246 -7912
672g912K9754k7505p605K9275j6329k1309L2042Q024k8647J0436J1535l2714j367
$$ -7912 21842 -5663 -13268 16007 -322 -21631 10411 18435 -10212 224 11759 -20955 -22322
685b2322M1138l540k6620J9054M193l6957J1994L7364k3192j4944L3367j1574
$$ -22322 18816 15276 -11344 7710 11903 -25054 -13060 24304 1112 -13832 19535 7961
697G961l7117L1776L0850m2013j7740L8816p319l2166L3520K6067l7953r322K2065
$$ 7961 -29156 2620 33470 -8543 -26283 12533 5214 -26952 6568 32635 -5318 -14640 7425
710G425k0042q562L8867K564l2907J1806J8942k9997o739L8194o918l1171J8690
$$ 7425 -12617 -21179 17688 20252 -12655 -849 18093 -11904 -18643 19551 12633 -18538 152
723A52J1291k5659J0539K4443k3726j5208K6681k519k4811K1133K0877l2245j0112
$$ 152 11443 -14216 -3677 20766 -2960 -18168 8513 5994 -18817 2316 23193 -9052 -19164
736a9164L1839o904j8685K5047L994l1488O691K0420j9113l309L1503j0705l4094
$$ -19164 12675 5771 -12914 12133 16127 -15361 -8670 11750 -7363 -10672 20831 10126 -23968
749b3968K1712K1703l2978j831L5666j5976k7098K8041J3456k7977L660J9698
$$ -23968 -2256 19447 -13531 -15362 20304 4328 -22770 5271 18727 -9250 -5590 14108
761A4108k1564j1488L3872K187k9820J3408J5165l1258l507L3277m269k0165J2916
$$ 14108 -7456 -18944 14928 17115 -12705 703 15868 -15390 -18897 14380 10111 -10054 2862
774B862K345j9369J1234J9707j9821r859K3761q181k2427K6092J8922k9618q760
$$ 2862 5207 -14162 -2928 16779 -3042 -12901 10860 2679 -19748 6344 25266 -4352 -13112
787a3112J9089q165j0033K1960M862k3692L421J3453j8905q55L0209q682k6770
$$ -13112 5977 -2188 -12221 9739 14601 -9091 -5670 7783 -11122 -11977 18232 9550 -17220
800a7220J5689J2040j8783L513K0132j3533j5475J8086M335j8260J1973J3583
$$ -17220 -1531 10509 -8274 -4761 15371 1838 -13637 4449 8784 -9476 2497 16080
812A6080k6909o514K9084l353j8957J4295O910k3579n29K3554l858j2176J2713
$$ 16080 -10829 -17343 11741 8388 -10569 3726 10636 -12943 -13472 10082 6224 -5952 6761
825F761j776k0404J2483J8326j5044n505J4061r928j3770J7051J1975j5961m424
$$ 6761 4985 -15419 -2936 15390 346 -5159 8902 -1026 -14796 2255 14230 -1731 -6155
838f155J0778r604p047J9263K235j6252O340N995j4863L224J9423o993j6113R331
$$ -6155 4623 -4981 -12028 7235 9470 -6782 -442 5553 -9310 -6086 13337 6344 -9769 -438
852d38P975j3087K211J5090j0484j1437J1875J07r085J1416N879j6814m105J5089
$$ -438 7537 -5550 -3339 11751 1267 -10170 1705 1812 -7273 4143 10022 -6792 -10897 4192
866D192m93r639R300O038j5405j410J2609l644k303Q527o352j1202Q146Q193p627
$$ 4192 3699 -5940 3360 9398 -6007 -7417 5192 1548 -755 7772 1420 -9782 -1636 6557 -1070
881a070j511R137o224j1543Q823Q476o666J236L741r360r21J0417j372n569N470
$$ -1070 -2581 6556 332 -11211 -2388 6088 -578 658 4399 -4961 -5882 4535 3163 -2406 3064
896C064K657j0700j423J2847j277r227M200J071p117M919O307n628k146L805l196
$$ 3064 5721 -4979 -6402 6445 5168 -4059 141 1212 -5905 -986 5321 -307 -2453 1352 -1844
911a844n172Q146Q541q384o576O051p77l333O181K660m240j642j348k119K585
$$ -1844 -7016 1130 9671 1287 -5289 762 -15 -3348 2833 5493 1253 -389 -1737 -3856 -1271
926a271N423j171p150K95N179k043o7M296k270m092k99J203L835L472j720m026
$$ -1271 4152 2981 -4169 -3874 1305 -738 -805 3491 1221 -2871 -3170 -1967 1868 5340 3620 -406
942d06k791J736J776q92K628J296m741j864J429K118J898k461k537J623N98O93
$$ -406 -3197 -1461 315 -577 2051 3347 -1394 -3258 -1829 289 2187 -274 -2811 -1188 -590 103
958A03K076K22q22k984k286K981L460J116k021m079R51K130k993J180M110k649
$$ 103 2179 2401 1579 -1405 -3691 -710 2750 3866 1845 -2234 -1283 847 -2146 -966 3144 495
974D95l884M40K347J703N82j57k261j837L816k85l184M836J682p164n4N702l07
$$ 495 -3389 -2949 -602 1101 1683 1526 -735 -2572 1244 959 -2225 2611 4293 -2871 -2925 2777 2470
991B470l179Q46j51l635O11M617j462m70N029m997o943P395M547o758M63O215
$$ 2470 -709 137 -14 -3649 -3038 1579 117 -353 4676 -321 -7264 131 4678 -2080 -1617 4598
1007D598k536n492M399L275n928L99L670o469jJ0376l712q005N971K721q851L77
$$ 4598 2062 -3430 969 4244 -1684 -1285 2385 -4084 -4085 6291 2579 -5426 545 3266 -5585 -5208
1023e208J0374j474p299M857J955p721M746O678r712j523J0161n017p729R322
$$ -5208 5166 3692 -3607 1250 3205 -4516 230 6908 -2804 -4327 5834 817 -6912 2410
1037B410N580j1505l199J0244l093o694R186J465j0027N606N899j0352P90J2509
$$ 2410 7990 -3515 -6714 3530 437 -6257 2929 4394 -5633 -27 5872 -4480 -3690 8819
1051H819o459j1200R265P624j1079p47J1365p110q132J0567l33j0044Q509O081
$$ 8819 2360 -8840 425 8049 -3030 -3777 7588 478 -7654 2913 2580 -7464 1045 7126
1065G126j2572p06J3546m430j1315R435O731j3162R70J2736p033o371J0760l386
$$ 7126 -5446 -6152 7394 2964 -8351 1084 7815 -5347 -4377 8359 1326 -5045 5715 2329
1079B329j0934R378O794j2607q64J4138o063j2842J1870O938j4628J873J2634
$$ 2329 -8605 773 7567 -5040 -5904 8234 2171 -10671 1199 8137 -6491 -4618 8016
1092H016r446n142J3442k631j1699Q841P501j4258k323J6912n584j3709J2741
$$ 8016 -1430 -6572 6870 4239 -7460 1381 8882 -5376 -7699 9213 3629 -10080 2661
1105B661N489j5832L017J2172r726m794J2979k661j2474R912R487j5310k008J7501
$$ 2661 8150 -7682 -4665 7507 -2219 -7013 5966 3305 -9169 743 10230 -5080 -7088 10413
1119A0413p438j3789J4138N588j5315L462J1221j0626n643J4222k380j4415J0856
$$ 10413 2975 -10814 3324 8912 -6403 -2941 8280 -2346 -7989 6233 3853 -10562 294
1132B94J0088j7255j015J8846q370j4127J4434N523j4991M656J2130j1680p238
$$ 294 10382 -6873 -7888 10958 2588 -11539 2895 8418 -6573 -1917 10213 -1467 -8705
1145h705J5304k221j4819J2370J0033j9700j739J8677p815j1465J4691L379j6678
$$ -8705 6599 4378 -10441 1929 11962 -7738 -9477 9200 1385 -10080 4611 7990 -8688
1158h688M139J3388j1273m216J7525n842j8154J4154J0074j8405J742J8265j1465
$$ -8688 -4549 8839 -2434 -6650 10875 5033 -13121 1033 11107 -7298 -5556 12709 1244
1171A244j3558J4837M378j5468O772J2957j5659n469J9024n605j5883J6156Q202
$$ 1244 -12314 2523 6901 -8567 -1795 11162 -4497 -9966 9058 3453 -12430 3726 11928
1184A1928j9791O87J7934r122j1623J5351K448j7117P173J2846j5898m088J9007
$$ 11928 -7863 -7176 10758 1636 -9987 5364 7812 -9305 -2132 10714 -5184 -9272 9735
1197I735p114j5065J5797P288j8832Q23J6638q668j0046J6589J672j8313P591
$$ 9735 2621 -12444 3353 10641 -8191 -7368 9270 602 -9444 7145 8817 -9496 -1905
1210a905J1518j5560o25J8816q592j5796J3223O870j6264L719J7092j1710j2477
$$ -1905 9613 -5947 -6572 12244 3652 -12144 1079 7949 -8315 -4596 12496 786 -11691
1223a1691J5123Q89j4480J2274J1128j8036l153J5923p077j2000J6130P056j8938
$$ -11691 3432 4321 -10159 2115 13243 -4793 -7946 7977 900 -11100 5030 12086 -6852
1236f852k21J5855j0120q288J7305j364j6900R254R522j4490J05J7231p537j4942
$$ -6852 -7073 8782 -1338 -9626 7679 6315 -10585 -1331 8191 -6299 -6194 11037 3500 -11442
1250a1442J3438P635j7160K864J5864j1556q581J6005j588j5078R375Q739j5326
$$ -11442 1996 9631 -7529 -4665 11199 -357 -8938 7067 5479 -9599 -224 8515 -6811
1263f811n86J7975o692j5164J2551O097j6640N470J5878j1793q340J3501k549
$$ -6811 -7397 10578 3886 -11278 1273 7370 -9270 -3800 12078 285 -8055 5446 2897
1276B897j2824J2306R761j6490l471J5557p352j1817J6611N480j8643K938J2118
$$ 2897 -9927 2379 12140 -4350 -7821 7736 384 -11433 5178 10658 -7985 -5047 7071
1289G071j1339l330J6796l391j5613R511Q850j5023P33J8214r075j4366J3111
$$ 7071 -4268 -7598 9198 5807 -9806 -295 8555 -6468 -5735 12479 3404 -10962 2149
1302B149L968j3781O563J1135j2475n794J3581k626j2411J1445Q079j6503j72
$$ 2149 6117 -7664 -1101 10034 -2441 -8235 5346 2720 -9691 1754 9833 -6670 -6842
1315f842J6172p613j0195J3229J272j3879N762J0911j0430l837J2980n172j3448
$$ -6842 9330 1717 -8478 4751 6023 -7856 -2094 8817 -1613 -5450 7530 2358 -11090
1328a1090J2303Q154j5089O10J3189r097q132J3224K126j1764M557P605j1154
$$ -11090 1213 9367 -5722 -5112 8077 -1020 -9152 4072 6198 -5566 -1009 6596 -4558
1341d558j793J5437m495j2980J0111M919j4412L417J3890p659q888Q764N64j0037
$$ -4558 -6351 9086 4591 -8389 1722 6641 -7771 -4354 9536 1877 -7011 1753 2317 -7720
1355g720P093R730j1080m224J1836m882r570J2029N855j3013k96R443n517n322
$$ -7720 -627 9103 -1977 -6201 5635 753 -8817 3212 9067 -3946 -4242 5201 -316 -5638
1369e638J0103P98j1250L962P363r225m33J1892o150r911R070M713r341K028R038
$$ -5638 4465 5263 -5987 -2025 5338 -3887 -4320 7572 1422 -8489 581 5294 -4047 -2019 7019
1384G019p078o630R675J442q762N561N023j1471J27J1443m335p517Q006J642j0915
$$ 7019 -59 -6689 2986 4428 -4334 1227 6250 -5221 -5094 6349 2014 -5503 2503 4145 -6770
1399f770K016J1134m609o074P367j665q329P217O674q650o33P610n690o822R052
$$ -6770 -4754 6380 1771 -4303 3064 1399 -6930 287 6961 -1689 -2322 5288 -402 -7224 1828
1414A828N389r492q66O881n439l395Q525m55p027M443K573p634K172Q733m092
$$ 1828 7217 -2275 -3141 3740 -1699 -5094 3431 2976 -4051 392 2965 -4669 -2497 6236 2144
1429B144p703O295L365p449J910O857n410l933N849j691l915O239J766q535j99
$$ 2144 -5559 736 4101 -3348 -1438 5419 9 -3924 1925 234 -3681 2558 4324 -4211 -4410
1444d410P872k351n511O413K374q114O54O026k763p86M498l406m812M671K984
$$ -4410 3462 1111 -4400 2013 4387 -3727 -3073 2953 190 -596 3902 496 -4316 355 3339
1459C339n162L05N805l956n821N167L395m413Q22J966l371O6M058j238k707L305
$$ 3339 -1823 -1518 4287 331 -5490 -323 3072 -1341 -519 1447 -1924 -1858 2200 962 -1745 1560
1475A560Q24n430R19O447k420m432L064L75l240K013K390k150j030J562j619j740
$$ 1560 2384 -3046 -2127 4320 1900 -2532 532 907 -2333 -320 2070 -80 -1110 452 -1167 -2907
1491b907M790K076n594r30M225j751j757L969R17l166j331O12KJ187K160j570
$$ -2907 1883 3959 -1635 -2565 1660 -91 -1848 2121 3038 -128 -1459 -847 -845 342 2502 932
1507I32l417J849J193k559J400L380k048l061R72J769M41k0o3r92o34J218o53
$$ 932 -2485 -636 557 -2002 -602 2778 730 -2331 -1359 410 851 831 768 -224 -858 360 -293
1524b93L5K302p58l461K69K294O98o94r06L32k98r53Q59J352P03n13k308l32K368
$$ -293 -258 2044 1286 -2175 -1906 388 1086 392 -514 -182 -480 -1433 -574 778 1481 968 -1340 -1672 696
1543F96O24p16l48k88L01q90n55K048J251k336k006Q93J769J00o04O00l61j120
$$ 696 1320 604 256 -32 269 -621 -1176 872 2123 -213 -2219 -1326 443 543 -61 539 178 -942
1561i42M95l11R22J895j012k751J309K132j097j621Q76J112k256n2K196m43n68
$$ -942 -447 -758 164 2059 1047 -1704 -395 1737 640 -981 -105 1007 -1249 -1301 895 452 -116
1578a16Q52j995j041L494M00k782P25K246j796k264L013K111l176n46J484j773
$$ -116 736 -1259 -2300 1194 1594 -1188 -463 1783 -13 -2277 736 2847 -329 -875 609 -1164
1594a164M62K776k183j528K487l03l302J564M293k216l789K795J401k861K035
$$ -1164 -702 2074 -109 -1637 850 547 -2755 -1191 3102 886 -2903 -108 1293 -1568 467
1609D67K162l153l85K274k074j212L955Q03n172m7M480k239k673M354K00m187
$$ 467 2629 -524 -909 1365 -709 -1921 2034 2837 -2335 -2382 2098 -141 -2814 1540 1740 -2447
1625b447J662K433k661O90L046k890l406M516J982m524P05M851m268l624M757
$$ -2447 -785 1648 -1013 -323 2723 -167 -3573 943 2925 -1599 -894 3957 -311 -3935 822
1640H22R55l396J943J560l960p2M466j706l658M475J196o147J805O110l817l070
$$ 822 1777 -1619 324 1884 -2076 -2148 2318 612 -3046 1429 2625 -3522 -1717 4393 576 -2494
1656b494M379o27m257L079K975m311n93M650l288m030O159J871o766J523N003
$$ -2494 1885 1258 -2999 80 3055 -1256 -1849 2801 -487 -4517 1642 3513 -3253 -1730 3273
1671C273m048k690N821L0m837K412L089n152K15O283l856m973O260J170o862K438
$$ 3273 -775 -3465 2356 2386 -2451 -39 3050 -2102 -1887 4396 540 -4433 1827 2997 -3865 -1427
1687a427N677n000l096N478L0m883L666L372o181K0O461l842m286O813P95p397
$$ -1427 4250 -750 -3846 1632 1662 -3221 445 3817 -2364 -2344 4117 275 -4011 2802 3597 -3800
1703c800K264N559m445k721N805j045n936M426L347o072P55O542n123m671P236
$$ -3800 -1536 4023 -422 -3143 2662 1617 -4319 107 3454 -2618 -1863 4679 -444 -5115 2121
1718B121J479o836K238N556n547k782O657o83n761M682K615p548R61P124m292
$$ 2121 3600 -3236 -998 4558 -989 -3771 2886 2203 -3558 1124 3739 -3809 -2848 4276 -16
1733a6m095O497O40p346K474O218n074k494O697k014o042N641K969p068J273O271
$$ -16 -4111 2386 3026 -4320 -1846 4372 -702 -3196 3501 1487 -4555 1086 4055 -3013 -1740 4531
1749D531m729m558O976J174p461K705N950o319j977P225k109o044N674K694o754
$$ 4531 -198 -4756 2220 3394 -4067 -1362 4588 -1731 -3708 3517 1408 -4636 1038 3732 -3022
1764c022J343O462m789m662O972J163p405L383N363o810k082P438k116n451N752
$$ -3022 -1679 4783 -6 -4668 2304 3467 -3938 -555 4808 -2002 -4084 3354 1238 -4213 1539
1779A539K089p461R74P198m349m113P253J83q004L669N472o111r43P061l365n962
$$ 1539 3628 -3833 -2859 4339 -10 -4123 3130 3313 -4691 -1022 4450 -1661 -2604 4457 1092 -4870
1795d870N622K837o751J281O715n470m578P371L47o706M409M595o896j168O691
$$ -4870 752 3589 -3162 -1881 4834 -636 -5214 2157 2504 -4202 207 4802 -2094 -3262 3429
1810C429k342n136N929K302p599J212O863n247l610P376o84o864M020M111o229
$$ 3429 1087 -4049 1880 4182 -3417 -2205 4658 -589 -4199 3177 2493 -4371 -351 3760 -2469
1825b469o91O885k638n594N996K531p607J675O425m923l193O926q66o649L941
$$ -2469 -3160 3725 1087 -4507 1489 4020 -3587 -1912 4513 -410 -3603 3323 2457 -4192 -251
1840b51L877o126j6O857l432o009O012K358p018K569N909n422l202O250m75n638
$$ -251 3626 -2500 -2516 4341 909 -5100 912 3270 -3748 -1179 4730 -692 -3894 2356 1881 -3757
1856c757M652L713o791j041O703l092m816O681J618p370J709N175m637k082O396
$$ -3757 895 4608 -2183 -3224 3479 387 -4429 2252 3870 -3500 -1791 3384 -1253 -3335 3061
1871C061q13o264M002L595n974rO891l547m904N501J392o171K138M771m363k600
$$ 3061 2248 -4016 -14 3581 -2393 -2402 4489 942 -3962 1539 2931 -3240 -1102 3669 -694 -3294
1887c294N709q56n579M160L668o347n9O582l486m353N514R16n449K110M658m466
$$ -3294 2415 1559 -4020 140 3808 -2539 -2598 3984 498 -3855 1659 2575 -2874 -764 3894 -572
1903e72k557N827j678n115M902L203o591J70N655l568l575N507J286n330J367
$$ -572 -3129 2698 1020 -4095 807 4010 -2581 -2411 3244 -324 -3899 1608 2894 -2436 -1069
1918a069M181m515j137O011j489n402L906K435n584R48N508l205l892M273Q81
$$ -1069 3112 -1403 -2540 3471 1982 -3420 486 2921 -2663 -1715 3793 588 -3304 969 1850
1933A850m850K445M044m422j885N093j601m045M569K224n356j6M697k297l223
$$ 1850 -3000 -555 3489 -933 -2818 2275 674 -3371 1198 3422 -1934 -1950 2747 450 -2773
1948b773M271J029n192K011L331m097n77M732k242l777L792K280m718K14M383
$$ -2773 1498 2527 -2665 -654 2677 -1420 -1997 2735 493 -3284 508 2788 -1930 -1716 2667
1963B667k600l065M333R50m120J704K588l970m39M577j730l301K989J632m623
$$ 2667 67 -2998 1335 2285 -1835 -131 2457 -1513 -1952 2625 895 -2406 583 2215 -2408
1978b408N89M369k079k885L461J16l616K493K606l564l85L348j651l103L730J830
$$ -2408 -1819 2550 471 -2414 1047 1163 -2453 40 2646 -918 -1303 2045 394 -2709 1021 2851
1994B851m157k51L438k124k062L616K1k996J395J794l094L34L689j880k997K817
$$ 2851 -1306 -1557 1881 -243 -2305 1311 1332 -1664 -269 1525 -1569 -1235 2454 574 -2423 394
2010C94J655l375L39L365k072k133K476M6j733J510J154l061k14L102j010k493
$$ 394 2049 -1326 -987 2378 306 -1827 649 695 -1038 472 1626 -1435 -1649 1453 443 -2050
2026b050K846J188l679L11K844j383r03K056n32k022J406J500k435M8K530j581
$$ -2050 796 1984 -1695 -1384 1460 77 -826 1230 698 -1324 82 1582 -853 -805 1725 144
2042A44k537K639J203k441J91J924j452o66J649J98j606J097Q84k188K51K409
$$ 144 -2393 246 1449 -992 -801 1123 -329 -995 654 852 -754 343 1227 -961 -710 1699
2058A699j163j990J879N52j877L77J402q53q63R86k18q42J323P87k039R2J954
$$ 1699 536 -1454 425 977 -900 -523 879 26 -837 149 -69 -911 412 1199 -840 -748 1206
2075A206j218r79J682O41j774k49R71j82k09O29k86j028J120N3j406O55J606j264
$$ 1206 -12 -991 691 1332 -442 -691 280 98 -111 518 232 -796 324 377 -1029 -374 1232 -32
2093c2r99J117N44n52l89P52k03m73M76j40l82J204o30j127N10Q94j91o78K41
$$ -32 -1031 86 630 78 -311 441 238 -235 241 101 -281 923 293 -834 -324 570 379 -299 -58
2112e8L39p33l46R70K12r2k93m86J66R24K4m83J1R6k10n94L10R22k19o21l44J44
$$ -58 281 -452 -798 172 384 292 -1 -487 -321 603 627 144 155 251 41 -553 -243 679 460 -161 -505 -361
2134c61L77N8m47O20jo65M1K23L79M62o52o26N48M25j23l67N31L3j035j02R73
$$ -361 16 74 -373 247 246 -419 -378 -155 224 686 34 -592 -44 381 258 -109 422 455 -580 -682 291
2155B91j8n77L24l91j80Q92j62k62J15N59o26q60J319P34j225j95P26m31l31O30
$$ 291 273 -304 20 -371 -551 341 179 -83 32 591 -35 -895 424 1158 -67 -262 464 33 -298 332
2175C32j26k98K12jq50N20J016p04j017J111M48j270N68P46p34k59O10k72m09
$$ 332 206 -92 120 119 -731 -211 805 101 -916 195 643 -627 -59 687 -47 -306 304 32 -377
2194c77Q15K92j427K7J646j048j134J647K02j602M79J048o02l82J195n77j301
$$ -377 438 730 -697 -670 976 -72 -1206 441 643 -959 -480 568 -34 -416 779 202 -1099
2211a099J288Q25j526J92J747j694j252K037N87j812L39J053j082o45J694k17
$$ -1099 189 1014 -512 -320 1427 -267 -1519 518 1105 -707 -368 685 -397 -1042 652 435
2227D35j330J215O28k295O58K125j053j352J636M3j805O79J645j239q12J702r24
$$ 435 -895 320 948 -1347 -689 1436 383 -969 667 710 -1095 -416 1229 -10 -822 880 -44
2244d4j458J932R87k744P36J803j291j195K084M69k117M69J455j532m14K445j178
$$ -44 -1502 430 1417 -1327 -591 1212 -79 -1274 810 1279 -838 -369 1086 -446 -860 1585 407
2261D07j760J732R08k632P41K188j470j675J861O21k197J117J659k339l58K390
$$ 407 -1353 379 1287 -1345 -604 1584 114 -1561 300 921 -1276 -159 1500 -839 -1197 1193
2277A193q23j814K257P61k929N05K468j389j719K428J61k753J218J810k230M2
$$ 1193 370 -1444 813 1574 -1355 -850 1618 229 -1490 938 1099 -1654 -436 1374 -856 -814
2293h14K342j536j768K173J133k688L99K684k145j540K784L02k706J431J401k590
$$ -814 1528 -8 -1776 397 1530 -1158 -759 1925 -220 -1760 1024 1326 -1380 51 1452 -1138
2309a138l5K588j150k050K367O47k967R49K695j949j471K512k16k455J891J527
$$ -1138 -1173 1415 265 -1785 582 1229 -1738 -789 1906 -43 -1514 998 782 -1673 218 1745
2325A745k474P6K217j271j992K408Q25l061O63K580k225r40K603m33k251J382
$$ 1745 -729 -653 1564 293 -1699 709 1534 -1527 -864 1716 -509 -1449 1154 721 -1530 -148
2341a48J466k242K25K421j422k246K566R04k996R43K284k248j186K628p0k570
$$ -148 1318 -924 -699 1722 300 -1946 620 1524 -1472 -529 1755 -493 -1679 949 879 -1691
2357a691J920J335k831L9K902j403j722K652L29l252J181K285k142p38K543n53
$$ -1691 229 1564 -1267 -1228 1674 271 -1451 1201 1530 -1722 -541 1744 -398 -1136 1407 854
2373H54k422J591J609k781K99K505j677k033K691P46l003J293K018k288r05K480
$$ 854 -1568 23 1632 -1149 -850 1655 -22 -2055 636 1382 -1621 -328 1690 -598 -1503 977
2389I77l53k096J790J481l061K12K905j837j817K706K85k741J220J887k131q20
$$ 977 624 -1472 318 1799 -1262 -1050 1855 18 -1799 907 1192 -1549 -329 1558 -573 -1393
2405a393K507n84k215K190J193k935J36K871j545j766K652J41k833R94J981j723
$$ -1393 1114 530 -1685 505 1698 -1237 -1101 1770 225 -1541 1111 1252 -1581 -587 1394 -329
2421c29q51K701j100k535K592Q77k682P21K459j872j713K489L67k465J273K084
$$ -329 -1180 1521 421 -2114 478 1355 -1327 -606 1853 -19 -1732 757 1124 -1341 -68 2016
2437B016k641p54K816r61k257K423Q89k959N63K441j765j319K305K23k508J142
$$ 2016 -625 -1379 1437 476 -1781 642 1531 -1428 -865 1576 -189 -1508 797 1020 -1488 -346
2453c46J915k308m20K691j094j836J986Q22k748O17K171j586j308K300N9k511
$$ -346 1569 -739 -1159 1532 438 -1398 588 1410 -1338 -721 1450 -136 -1444 856 915 -1596
2469a596J300J537k164J4K414j198j930J822J132k287L79K217j506j499K069m6
$$ -1596 -296 1241 -923 -909 1505 307 -1623 199 1331 -956 -577 1640 134 -1365 704 658
2485F58j828J306J407k309k28K038j257j129J953N92k279J85K113j399q57K045
$$ 658 -1170 136 1543 -766 -994 1044 -213 -1342 611 1203 -1076 -891 1222 -177 -1034 1011
2501A011j25k108J339J139k090P0K166j159j555J570P97j956L52J781j428p99
$$ 1011 886 -1222 117 1256 -834 -764 1402 243 -1312 258 1055 -901 -549 1232 -196 -995
2517i95J706q8j811J269R60j845K7J996q50j722J929L23j980M02J962j567p01
$$ -995 711 623 -1188 81 1041 -804 -777 1219 369 -1353 576 899 -1081 -679 1283 -284 -985
2534i85J689m10j506J394Q22j711K8J720r30j438J762N58j796M70J356j382m73
$$ -985 704 294 -1212 182 1004 -707 -679 1041 111 -1327 435 993 -803 -333 1023 -359 -832
2551h32J655k73j352Q20O46j505J46J842q90j461J445N30j635P30J169j268m47
$$ -832 823 550 -802 18 664 -841 -695 1147 257 -1204 241 771 -864 -134 1035 -233 -680
2568f80J323l35j162J126P43j673L4J546p81j066J409J31j454O09P36p17l42J297
$$ -680 643 308 -854 272 1015 -658 -624 922 141 -925 484 615 -839 -230 506 -211 -553 744
2586G44l60j346J103Q50j614K96J210p67p82R74N2r42M51O12q29o5R72m19r98
$$ 744 384 -962 141 991 -623 -327 883 116 -666 308 360 -582 -131 481 -348 -413 559 140 -858
2605h58J124M51j454L17J244o16p02P80J32q06L25P09q18j93Q23m20o50Q01K09
$$ -858 266 717 -737 -420 824 208 -494 286 418 -388 -63 646 -172 -365 458 38 -612 189 398
2624C98q53J34P59m77o18J081K04j014K41N51n91o3R15m63o48O57J02o18m7P96
$$ 398 -455 -321 438 -39 -657 424 628 -386 -145 406 -185 -248 667 204 -444 213 315 -303 -350 446
2644D46l69m78L54L43o38K30K87m27J92M22k81m30N62J75n98L8N02j82l90M23
$$ 446 77 -401 -47 296 -342 -112 175 -252 -60 362 81 -349 213 388 -210 -172 330 148 -242 181
2664A81km60L49J59l84P5M86m68l19N50J67m91r9P20m76k74M26j10r1K93j43j50
$$ 181 179 -281 68 227 -157 -82 404 -64 -383 167 334 -157 -256 464 -12 -286 140 30 -61 232 89 -61
2686f1n4L84j18n22L43K42n07n1M40n5j40N6P0j78L83k17oj80L39l56K6N9L55
$$ -61 -115 269 151 -371 -28 214 -293 -344 96 41 -99 -43 27 -151 232 15 9 -171 168 -188 -162 -103 252
2709B52l91j18K75r3J80k46Q9k00K52j84J13J14J44q0m16K31J55K1K1k09o8J97
$$ 252 -139 -257 18 -75 105 -141 -52 -252 0 -184 -71 43 187 107 -309 -78 77 98 119 -90 -158 39
2731C9m7q6K45j13j11j52J29om8K37j14N5K20l20j14L73J39m60n8K46j44j29L01
$$ 39 -8 -94 151 38 -73 -225 -96 -102 -150 87 -27 28 248 -72 -186 187 326 -134 -192 54 -90 -219 82
2754H2l6l3KJ3k69P1M70k08l64K38J56n52M77K95l08j33M3L05m53J45K27l07m8
$$ 82 46 13 15 28 -241 -170 300 92 -272 -34 122 -430 47 342 34 -99 -56 249 -204 -59 168 -139 -187
2777a87N72m42j31N05k78k53j65O25k87p1K76J26o19J75L62l11L2N13n05l24N43
$$ -187 385 -57 -188 317 39 -214 -379 246 -41 -112 164 290 -329 -154 208 -103 -71 442 -63 -387 156
2798A56j9l69q6N20j03m88M52m6l93M19J73n68J68O91n99k03M50K57n74m6N88
$$ 156 137 -232 -318 202 99 -389 63 17 -376 43 216 -352 -184 507 -92 -295 155 412 -162 -208 380
2819C80k57n20O53r5n13M88K49n90j44P20m39m50P86J37p96K34O59n63l06P74
$$ 380 123 -397 256 161 -352 136 385 -205 -349 371 -68 -518 268 405 -391 -157 502 -61 -367 407
2839D07k55n37N67K11n85o2O48l29o28P67J31p84L19O10o18r4L98l6l30M06K86
$$ 407 152 -385 182 393 -192 -254 394 65 -563 204 335 -449 -130 480 -138 -232 166 130 -200 206 492
2860D92p03n6P04k54n74N75J52q44L56M88n60j35O46j20p57N44N65p54M8O54o17
$$ 492 -211 -267 437 183 -391 184 336 -508 -152 336 -224 -359 287 167 -590 -46 519 -235 -187 467 -150
2881a50l42N93L48p73L46M18n80k40O54j37n83O13J60p64L7Q00k96p14R18N4q20
$$ -150 -492 101 449 -324 22 440 -140 -380 274 137 -446 167 327 -437 -400 400 104 -610 308 362 -458
2902d58L18O29p67j40P55k88n56Q15K35q87J28P04n70m82Q61O5q12J81M99m43
$$ -458 -140 489 -278 -418 337 49 -507 308 543 -344 -216 488 -82 -564 297 362 -450 -269 230 -213
2922b13k49P94n3q68P71J83p37R7O67l17o37R17%p08K20O39p18q5O46k49o58Q42
$$ -213 -462 332 279 -589 182 365 -372 -275 392 75 -562 355 355 -353 -133 506 -212 -297 349 100 -558 284
2944B84J44p52l4Q64m18l64O39o0p75L21P01q55j63R09n03n28O93L01q74K24Q54
$$ 284 428 -324 -358 506 88 -276 363 303 -472 -151 550 -305 -468 441 -62 -590 103 404 -470 -246 608
2965F08o24m39N88J53o02M66L24n87l85J179o29n92O79J37p88L09N91m37m81O06
$$ 608 -16 -455 133 286 -316 150 474 -113 -498 681 52 -540 139 276 -512 -203 388 -49 -530 76
2985G6R9o53M95N50o32l39O92k46m18M98L28r38J56O67j62o13P47j51o18M55L52
$$ 76 175 -478 17 567 -65 -404 288 42 -376 122 450 -488 -332 335 173 -440 307 156 -462 -7 345
3006C45p38J15P82m18m92K73M56p49L14O59n53m79O31J59p67O90K01o19k49P15
$$ 345 -393 -278 504 86 -406 -133 323 -426 -112 547 -6 -485 146 305 -462 228 429 -190 -439 276
3026B76k37m29L76M07p89K8Q38n08m15P41j96n41M27L84o57j10Q08l98n03N05
$$ 276 39 -390 -14 393 -396 -368 470 -38 -453 288 92 -449 -22 362 -295 -405 403 5 -498 7
3046GK68o12K43O00n47m70P36J4o38L37O26p70k53R15l33n54M90K57n75J47O01
$$ 7 275 -337 -94 506 -41 -511 225 239 -399 -62 564 -206 -459 456 123 -431 59 316 -259 -112 489
3067D89m90j94K90M7o65N27L52o70j63P27k47m13O30K4m98J2M58k30r6M54j17
$$ 489 -1 -195 95 142 -523 4 356 -314 -477 250 3 -410 220 244 -254 -242 216 -14 -110 344 227
3088B27o63K88L18m07k0O58m41l78N50J38n77L21K92n12j70O63m5n98J99M42n84
$$ 227 -436 -148 170 -237 -257 401 -40 -418 132 270 -307 14 306 -206 -376 287 242 -356 -157 285 -299
3109b99J56N63k58m87M77K16o25N5M06k50j90O26k15m25M61J72n26o5O41m10k11
$$ -299 -143 420 162 -325 152 368 -257 -202 204 -46 -236 390 175 -250 211 383 -143 -208 433 23 -188
3130a88J26L38m94Q4L87l62j33M74Jn79K66L51l95j67O82l37j93K25K45n34K26
$$ -188 -62 276 -218 -134 253 -109 -242 232 233 -346 -80 271 -124 -291 391 54 -139 86 331 -203 23
3151B3L63l71k46L16Mm37L32K09l17q7K00P5l23M65Q3n48J65L53l31j3L69k3n00
$$ 23 386 15 -231 85 89 -348 -16 193 -124 -211 -11 64 -259 206 289 -259 -94 259 -72 -85 284 261 -239
3174b39K07K82k89rK39j72k80L43k8q2j04K57j22m0K13K4l70J42M04m65o7K84
$$ -239 -32 250 -39 -48 191 19 -261 82 54 -28 -132 125 3 -37 176 200 -170 -28 376 -89 -156 128
3196A28M1m36L29M3j36P3K04q1m64O04k94j82K15J93l55j7J87j03Q0jp4p3J94
$$ 128 169 -267 62 105 -31 42 246 165 -299 305 11 -171 44 237 -118 -135 52 -51 29 28 -46 -119 75
3219G5p3o7L9J00o5k24K71Q3l94J82J99J5k09J21N7j09m9j5K33l91L53J3k68O6
$$ 75 2 -65 -26 74 9 -215 56 139 -255 -73 126 141 -68 53 110 1 -48 -63 170 -221 132 145 -123 -57
3243e7j25Q0J48J33j17j96K03J40k12OJ00Kj81J43k5j20L1K51j78p2K81m5l34
$$ -57 -182 -102 46 179 62 -134 69 209 -3 3 103 105 -76 67 42 -78 -47 204 26 -46 235 190 -144
3266a44J19O8r9p5J22j53L2J96q3j10O8K8m1K71j16j0J12k38J28r0j00K03j91
$$ -144 -25 43 -56 -131 -9 -162 -130 66 -17 -127 -59 -31 -72 199 83 73 185 -53 75 -15 -115 88 -103
3289a03O5j00J44p5n8K33j87O8jo7J33j44K34k12N0N9L5r5P6R0j58k9J49l3k7
$$ -103 -38 -138 6 -69 -127 106 -81 -13 -14 -81 52 -92 142 -70 -20 39 74 -21 55 145 -13 -42 107 74 47
3314D7R7j29l6j6J27m2P3j38r2J18j30L19j38j84O4J07J1q8K8k62L26q1J76j11
$$ 47 144 15 -21 -37 90 48 121 -17 -109 9 -121 198 60 -124 -60 47 58 -30 -2 -264 62 -19 157 46
3338D6q4l5R5k10N8K92r6j2Rj13K48k06Ok79J51J14%r1K1N1k28K85K8j5k31M42
$$ 46 -38 -73 22 -188 -130 162 66 54 63 -50 198 -8 -2 -281 -130 -16 -16 -107 -86 -35 -263 22 50 35 -196 246
3364B46k55M0jJ89l10p5K87P7l97K07P9k78K29qjj00J57l4k47J71J57k5l21M16
$$ 246 -9 31 30 219 -91 -166 121 198 -199 8 87 -191 38 30 29 -71 86 52 -195 -24 133 108 -213 203
3388B03j54k15J09J58k64J32K93k57o0J45O6j40j8J27l72K25J29k88o1K44L32
$$ 203 49 -166 -57 101 -163 -31 262 5 -55 90 156 16 -2 125 -247 -22 107 -181 -242 2 334
3409C34n69Q9L22k40P1J04J14m43J44K79k27j5J74k02n8K55j26j9k2K10j84K7
$$ 334 -235 -146 176 -64 7 111 225 -218 -74 205 -22 -37 137 -65 -123 132 6 -13 -35 175 -9 18
3431A8M8lk44L47n6k00N2J40N9m65M16n5j25m5K15k60m7K54J08k86J11J99l07
$$ 18 66 63 -181 166 110 -90 -38 102 161 -304 112 57 -68 -113 102 -158 -205 49 157 -129 -18 181 -126
3454a26n4K86j17k23L21O3l54J00K71l02j08J40K33l48J53K56l34j51L57J14l93
$$ -126 -180 106 -11 -234 87 150 -204 -104 167 -135 -243 -103 130 -218 -65 191 -143 -294 63 177 -216
3475b16L74O7k33m9K23j69j97N54l22j64K38J89l58p8M41m10j6K17j37k25L8N94
$$ -216 158 225 -8 -57 166 -3 -200 354 32 -132 106 295 -63 -141 300 -110 -126 91 -46 -271 -233 361
3497C61k61k27K58J64l43L1J58k03j91M75j72k81M29J04m25j29M82l82n1K68K95
$$ 361 100 -127 131 295 -48 -17 141 -62 -253 222 50 -231 198 302 -123 -252 230 -152 -203 65 360
3518C60p01K10K64k35J10K55k13m20K80L57m89J16K95l40r2L04Q2m85K53L63m18
$$ 360 -341 -131 133 -102 8 263 50 -370 -90 267 -222 -106 189 -151 -243 61 143 -342 -89 274 -144
3539a44l8M58l59j13K77J64l62l8M45k17k66L83n1n64N19K28m72m9L93k19k46
$$ -144 -182 276 -83 -196 81 245 -117 -155 290 73 -193 190 139 -425 94 322 -150 -199 194 -25 -271
3560b71K40K07m32L07M3k07J3J86N7m00K13K06l78M9L50n8n64M44L98o46K50K44
$$ -271 -31 176 -256 51 94 -113 -100 86 143 -257 -44 162 -216 -167 183 125 -439 5 403 -243 7 251
3582B51k02m54N60L7k26J03K77n04J28K89j74m26N71Q9n94K20L10l39j37L42j25
$$ 251 49 -405 155 192 -34 69 346 -158 -30 259 85 -341 230 319 -275 -55 255 -84 -221 121 -4
3603dk39L35K85o50J01O17k90n39L80J98l94J83J89l05l13N64J46m16Q9M35p74
$$ -4 -243 92 377 -273 -172 445 155 -384 -4 194 -200 -17 172 -133 -446 118 264 -152 -63 372 -402
3624d02J79N24m01k56M98J35n90K38K73k11j85M42k58j77J21L95l64j73N23k70
$$ -402 -223 301 -100 -356 142 277 -313 -75 198 -13 -198 244 -14 -191 -70 325 -39 -212 311 41
3644D1l36L13J26l92K60J48l08q5N83k57l17L31J77m63M6M22k50m94N79R5o51
$$ 41 -295 18 144 -248 12 160 -148 -233 350 93 -224 107 284 -179 -133 289 39 -455 124 219 -432
3665d32K13M99l57j75M40k87l27M82L07o05M7L97j66k72L41J27l24JL59k55l00
$$ -432 -219 280 -77 -252 188 -99 -426 56 363 -242 -195 202 36 -236 105 232 -92 -91 268 13 -287
3686b87M47j9m67K60J37l15J5L69j21l62O60J44p15J15N42o20J4M35ll08OL80
$$ -287 160 141 -326 -66 71 -244 -229 140 19 -343 317 461 -254 -139 403 -217 -203 232 229 -79 -73 307
3708C07n73P2M63l36j9K56n2l63J67L45l83r7M27j15n89P37p0l58K08K07k22m66
$$ 307 -266 -194 269 -67 -86 170 118 -245 -78 267 -116 -213 214 99 -490 247 177 -181 27 234 12 -454
3730d54P55j65l07J49K36k78j25M14j92k54J82K36m29J19L34k46j24K59j14j93
$$ -454 301 136 -171 -22 214 -64 -189 225 33 -221 -39 197 -232 -113 221 -25 -149 110 -4 -197
3750a97K28L28l48j44K44r5k57K28J30k58l8K76j66k53K90J21k12m7M09l28N7
$$ -197 31 359 11 -133 111 16 -241 -13 117 -141 -179 97 -69 -322 -32 89 -123 -170 239 -89 -32
3771c2K12j55j60J37J31l99J32J86j2k08L88N2m32L02J25m80J39K46l33j76M43
$$ -32 180 25 -135 2 133 -266 -134 52 40 -168 220 272 -160 142 267 -213 -74 172 -161 -337 106
3792A06L3r5K9R5k21r1J91Q1k18M2O6k65Q6K18j8j24K38J33l97m3L74l81R7J49
$$ 106 139 44 73 168 -53 -144 47 128 -90 -48 18 -247 -161 57 39 -85 153 286 -111 -154 220 -161 -64 85
3816H5j28j0kJ57j05j58K99k00mJ1PL4o3K22j35l3j36J88j77J82J0m1o5K24k54
$$ 85 -43 -53 -55 102 -3 -161 138 -62 -66 -55 -48 -14 -77 145 10 -23 -159 29 -148 34 44 3 -62 162 -92
3841i2m3J66M7k45O7M6L3k22L42p0k73L44R9j59j64N7k6P2N3O0j14j3Q9j50J64
$$ -92 -135 31 78 -167 -100 -54 -21 -243 99 29 -244 100 199 40 -124 -67 -93 -21 32 92 -22 -35 54 -96 68
3866F8M9q1j39P0n9J16MK3r2j02K04q3N8rk0M6j20J48o2n4q6K69j1j07q7J85j47
$$ 68 117 36 -103 -33 -92 24 28 51 -41 -143 61 -22 36 27 7 53 -67 81 19 -35 -121 148 137 30 -57 128 -19
3893a9M2J34K9k28J38o5m2k9o8J22R3K7j45j8J20p1J50k86n4J79J94k70r7J13
$$ -19 23 157 186 -42 96 31 -11 -40 -108 14 107 134 -11 -29 91 20 170 -116 -170 9 203 -67 -164 -51
3917e1Q6m6J41j75j54K47K6J1p1m6n7q1J82K37j98j9O5j44k0J57j89o2J46j73
$$ -51 35 -11 130 -45 -199 48 74 85 14 -32 -89 -170 12 249 51 32 97 -47 -67 90 -99 -161 -15 -188
3941a88J42J0J8R4k4J4j92nJ79j61O8K4J36j73r6L53j62l5k8R4l73L34J59q8k69
$$ -188 -46 -36 -18 76 52 66 -126 -131 48 -113 -45 -21 115 -58 -154 199 37 2 -26 68 -305 29 188 100 -169
3966a69K54j40j17K30J01k09j41K22K0j50K63q1k34l6L50m9j90K84j29j79J05
$$ -169 85 -55 -172 58 159 -50 -191 31 51 -99 164 83 -151 -187 163 114 -76 208 79 -100 5
3987EQ8o4k85M60p7j40L0N2k16J84K56l61J8J79L3k92R1L13l85n2K89j26k53M03
$$ 5 93 29 -256 204 127 -13 17 69 -147 37 293 -68 -50 129 162 -130 -39 274 -111 -163 126 0 -253 150
4011A50K33n49Q1M9l2j41M04j3m67L04J38k55pL75k34l07K86J16j45o2K15k87
$$ 150 383 -166 -85 -36 -68 -209 195 182 -285 19 157 -98 -105 270 36 -271 15 131 -14 -76 139 -148
4033a48j19N84j59m44L32K99l65j97N76m33m8J38J70l81K17J08k40j09L80j81
$$ -148 -267 317 158 -286 46 345 -20 -217 359 -74 -122 16 186 -195 22 130 -110 -219 161 -20
4053b0l59M47J08l46k9M13k70j10L40J00m73K36K49m49K3L55j67l75M22M2m33
$$ -20 -379 68 176 -170 -199 214 -56 -166 174 274 -199 37 286 -163 -140 215 48 -327 95 137 -296
4074b96J19M30j24m01M78m3j19j98L53l34j51N58j21l27K50Q2l85K4N60m79j21
$$ -296 -177 253 129 -272 206 163 44 -154 199 -135 -286 272 151 -176 74 156 -229 -205 355 -124 -245
4095b45M40k7m43J08M44m36l3N43k75j20J38J72n36J79K84k86j75L59M0k81K44
$$ -245 195 168 -275 -167 277 -159 -192 351 76 -44 94 266 -270 -91 193 -93 -268 91 131 -150 94
4116I4J70k65k29N11j16m89L63K35n26o1O81l78k46N54j66l71M21ll07m9N21k68
$$ 94 264 -1 -230 281 165 -324 39 274 -252 -313 368 -10 -256 298 132 -239 182 179 -128 -177 344 76
4138G6m24M11J93m98L7O05m48k34M57p9m94N46M5k69k42O58k78n78P63J29p88
$$ 76 -348 63 256 -242 -205 400 -48 -282 175 96 -398 148 193 -76 -318 340 62 -516 247 376 -412
4159d12M04L15l97k54M21L1m55L47J89l91J74M47l83l77M32L04p25K71L72k32
$$ -412 -8 307 -90 -344 77 108 -347 0 189 -202 -28 419 36 -341 91 395 -330 -59 313 81
4179H1l98N05n2l66J49K29l68J5N39n64j80O32J25o66K80L31m20j26O00k22m69
$$ 81 -317 188 136 -230 -81 148 -220 -205 334 -230 -410 222 347 -319 -39 292 -128 -254 346 124 -345
4200c45L31L22n45P9M92m07k45M56J36m87J46K50k79j56N33l66j63L23K39n89
$$ -345 -14 308 -237 -158 334 -73 -318 138 274 -213 -67 183 -96 -252 281 -85 -248 75 314 -275
4220b75p8P40m30l59N59N1l88K34K15m39p0M10n0l43K69K5k07l8O34m52k23M85
$$ -275 -353 387 -43 -402 157 208 -180 54 269 -170 -240 170 120 -223 46 71 -136 -174 460 8 -215 270
4242B70j38l07L8N72n51p7L64k88k19M12J43m19J76L71m19l27N89L9n74L77K11
$$ 270 132 -175 -137 435 -116 -193 171 -117 -336 76 219 -200 -24 347 -72 -399 190 229 -345 32 243
4263B43l93p4N04l04l66N93%m58J83N16m19l07M49l7l49K16J94m05J01L34o1m03
$$ 243 -150 -224 280 -24 -390 203 203 -255 -72 444 25 -282 167 130 -219 -3 191 -214 -113 221 160 -243
4285b43M17p9l41P0M92k26l17L11K33n61M41M5l68k1K87p1l35L87R2l93J39L76
$$ -243 174 95 -246 -176 316 90 -227 84 317 -244 197 242 -126 -147 140 69 -266 121 213 -180 -41 335
4307C35m39k27P68l67k68L37J06j60l34P15l29m50M01N6l16J58J75k95n6L36l1
$$ 335 -104 -331 437 70 -198 139 245 85 -249 466 137 -313 88 144 -172 -14 161 -134 -190 146 115
4328A15k50J17J76k37n4L67m03j61K97K49n28L65L1j87k16N22k0k72J97J75k69
$$ 115 -135 -18 158 -79 -133 234 -169 -330 -33 216 -312 53 84 -103 -319 203 183 -89 108 283 14
4349A4k52N35l45l43M71jj88K76K6l65R1L57j50k33l2K48l09N9L56k76o2K45j
$$ 14 -238 297 -48 -391 80 79 -109 167 193 -172 -81 276 126 -107 -139 109 -200 -141 215 -61 -123 122 121
4372A21l34m0M71l24RL18j59j32O0P5j49J85J26l40m2L60k66r3N1K2J22j14J23
$$ 121 -213 -253 218 -106 -97 221 62 -70 -10 65 -84 101 227 -113 -155 205 -61 -154 -103 -81 41 -73 50
4395E0J6j41J40O6l52R7L28l08p2K31k2j24o0K91k51N2K22l2j13J12J33l80Q9
$$ 50 66 -75 65 131 -221 -124 204 -104 -176 55 33 -91 -151 140 -111 -59 163 131 18 130 263 -117 -28
4418b8K70m91J60K14k05j04K11J57k76p6K29j87J47Q6j01j04nK74j42k1J94k00
$$ -28 242 -249 -89 125 -80 -184 27 184 -92 -168 61 -126 21 107 6 -98 -103 171 29 8 202 2
4440Bj03j46J96k6N9L4N2n9K02k35J02j04R2q1j04J72J06j96J91j52r4J96j01
$$ 2 -101 -247 -51 -77 -18 16 68 9 211 -24 78 -26 66 -15 -119 53 159 -37 154 2 -92 104 3
4463CQ5p2J10p9p7L1K69k63M0o6j41Q8j39K59j10m6J04K7j91J17J37r5L0J44j19
$$ 3 88 16 126 47 -30 1 270 7 47 -19 -160 -72 -211 48 -62 -108 -4 23 -168 -51 86 -9 21 165 46
4488D6n1r5O7K85k01q9j03MK05J30k92K5M8J2k4j9R1p6N7j00P1K9J04l0j06m2
$$ 46 -5 -100 -33 252 51 -38 -141 -137 68 198 -94 -69 -21 -9 -33 -52 39 -37 20 -80 -9 20 124 94 -12 -54
4514e4j13O3J8L4N6K9PJ16j26j33Q5O5j30OJ05P0L0Q2k59m0J4J26o5j45L00k26
$$ -54 -167 -104 -86 -52 4 33 40 156 30 -103 -18 47 -83 -77 28 98 128 210 -49 -89 -75 51 -14 -159 141 -85
4540h5j85L65P6j81o6R0q5Kj00K33N7q7J39j25j17J34O4m98K15K04r7L5J33o1
$$ -85 -270 95 171 -10 -76 14 -71 -69 -169 64 121 34 173 48 -69 65 129 -369 -154 50 -47 -12 121 60
4564F0k39J58m1l3J09m7r8M6J47J52k24J67l6j78O3J27n8j50J9K40k81O0Q1Q0
$$ 60 -179 -21 -62 -95 14 -33 -131 -85 62 214 -10 157 121 -57 6 133 75 -75 -56 184 -97 -37 44 124
4588A24k80K65M1l09%M21k88m9J71J01l53J19K35m59K17J59k08j91M09L9l32J47
$$ 124 -156 109 150 -159 -159 262 -26 -75 96 197 -156 -37 198 -261 -44 115 -93 -284 125 164 -168 -21
4610b1M05l97j19K03N4n50O12r4k24J86J59l40m0J98K5l81L11L29m69o3M09l38
$$ -21 384 -13 -132 71 125 -425 187 93 -131 55 214 -126 -166 32 57 -324 -13 316 -153 -216 193 -145
4632a45j35L59M2l97J70L65k66j69L68N7m89K33K88l49j75O35l81k35L41j7l61
$$ -145 -280 79 121 -276 -106 259 -7 -176 192 249 -240 -7 281 -68 -243 392 11 -224 117 100 -261
4653b61L60J47l55r5M87l5m63K36K81m60j0M37k87j21K09o7k37Q5M79m49qL60
$$ -261 99 246 -109 -204 283 248 -215 21 302 -158 -168 269 -18 -139 70 3 -234 -149 330 -119 -127 233
4675B33j79l43L17J13k77J0L08k00k29L64J46m55N6L10k40j44L81j25l91M22Q2
$$ 233 54 -289 28 141 -136 -126 182 -18 -247 117 263 -192 -136 174 -66 -210 171 46 -345 77 159
4696A59l66N0K33j00l56P09k28n00M06K60m05l39P19j94k00J41K42l61l6M13k94
$$ 159 -207 -157 76 -24 -380 329 101 -399 7 267 -138 -477 242 48 -152 -11 231 -130 -166 247 -47
4717d7k73O19p9o62N39K36m61j80N56j08m20M58J26m65P9N04m63k95O29k36l82
$$ -47 -320 299 220 -442 97 333 -128 -308 248 140 -280 178 304 -161 -82 422 -41 -336 293 57 -325
4738c25L28K77m50j5L83j24m05M15K16m65N2M70m70r3M91j13n91N64P7k24j08
$$ -325 3 280 -170 -185 198 74 -331 84 300 -165 -113 357 -113 -206 285 172 -419 145 222 -2 -110
4759a10K92k02j47K94m1m58M55K58n12k12O10j04m85L36L88m29j39M11k20k74
$$ -110 182 -20 -167 127 86 -372 83 341 -171 -383 227 123 -362 -26 362 -67 -206 205 -15 -289
4779b89L51J19l42K10K23n35K9N14l56j69R3L96k34k41M46j95k55K91J28m35J23
$$ -289 62 181 -161 49 272 -263 -234 280 -76 -245 -152 244 10 -231 215 20 -235 56 184 -251 -128
4800a28N02o03J59N79m30n51N26K02o40J68L36k55m0K49j1n59M43K97l94j36O05
$$ -128 374 -229 -70 509 79 -472 54 256 -384 -216 120 -135 -175 74 63 -496 -53 244 -150 -286 319
4821C19o4m78L29J38m14rN30l80k15M26J7m28J53K47l34k39Q14l48m72M12L06
$$ 319 255 -223 106 244 -170 -179 351 -29 -244 182 199 -229 -76 171 -163 -402 412 64 -408 4 310
4842C10l82n4L44k90l19O75M4p72M14K41l00k53N40m6l36K52L2l33L84N4k67j03
$$ 310 -72 -126 218 -72 -391 284 328 -444 -30 211 -89 -342 198 152 -184 68 100 -233 151 205 -62 -165
4864a65L79j08l23L22J66m72p7P74m22l32L55K13n46J11L87m28j26N84j02m14
$$ -165 214 106 -217 105 271 -201 -278 496 74 -258 97 310 -236 -125 262 -166 -292 292 190 -224
4884b24K01L62l25j61M31K5m59J20K07m26K39N2l1k17K00N9l32L21K11n16Q8L88
$$ -224 -23 339 14 -147 284 309 -150 -30 177 -249 -10 42 11 -206 -6 53 -279 42 253 -263 -175 213
4906B13k07k94L57J96l37m5L03j13j17L00k71l26L28K04l70J17L66k18l80M97
$$ 213 6 -288 69 265 -72 -117 186 73 -44 256 -15 -341 -13 191 -179 -62 304 86 -294 203
4926B03j37m71K52L82l52j29M05j14k38j1M01l61n3M02k38q5J46K24m93K77J25
$$ 203 66 -405 -153 229 -123 -252 153 39 -199 -210 191 -170 -223 179 -59 -144 2 226 -267 10 135
4947A35k40m7L78k57q9J49J09k53O2J57J5k30K61k05k38K62J16p6l41N56j32k73
$$ 135 -105 -152 226 -31 -120 29 138 -115 -53 104 119 -111 150 -55 -293 -31 85 9 -332 224 92 -181
4969a81K30K18k85p7K77j96MK71k15k15L00k36J66k11K50K3r3N9j0j06j35R0p5
$$ -181 49 267 -18 -95 182 -14 -10 261 46 -169 131 -105 61 -150 100 123 30 89 79 -27 -162 -72 -147
4992a47p9K75n7nJ39j9p7j19K88j29j94J49J39k26N1Q9k80J86Q6p1j2J26l5j39
$$ -147 -226 49 -8 -13 126 107 30 -89 199 70 -124 25 164 -62 -11 78 -202 -16 70 -1 -13 113 78 -61
5016f1R4K1%k05K75M7l54K27J28l24J9oQ6p4K71j22r7k5J58k02m9J23J74j59J30
$$ -61 33 54 54 -151 124 171 -183 44 172 -152 -133 -139 -53 -127 144 22 -75 -100 58 -144 -193 -70 104 -55 75
5041G5L9j73J44K20k75J0r4J20j85J09j22K33j63q9K67o0Q2m3q7j53J71r1K6K58
$$ 75 114 -59 85 305 30 40 -54 66 -119 -10 -132 101 -62 -151 116 56 138 95 8 -145 26 -65 -39 219
5065B19l16K1J20p8J36o7j71J40p6O2O6R2j22m3j2k6Q9k07L28p7K3k30J4K34N7
$$ 219 -97 -76 44 -34 102 35 -136 4 -72 -10 56 148 26 -17 -29 -55 34 -173 155 78 101 -129 -115 119 176
5090A76q4j73O1K5n9j9N5QN1r6O2M0j06J74q3m7N9J22l02J03M4p7J48L6m13K52
$$ 176 92 -81 -20 5 -54 -73 -18 -10 41 -55 7 47 -59 115 32 -15 44 166 -136 -33 11 -66 82 118 -295 -43
5116d3K9LJ06k84K82qr0J78k02j12J67n1P6k86K37l0j4j15L05q2J0Q0k6j46O6
$$ -43 -14 -11 95 -189 93 85 -5 173 -29 -141 26 -25 51 -235 2 -28 -42 -157 148 66 76 156 130 -16 50
5141E0L0n6j62K41J7k23J38r7n7M5L07j98j59J57m5m5j49K77Qj07J58r1k66L40
$$ 50 80 24 -138 103 120 -103 35 -62 -119 -74 233 35 -124 33 -12 -57 -206 71 79 -28 130 39 -227 113
5165A13j46o6O0K3J9k11K03J35k18Q0J61j04k10L50r0l40L76J79l74p0J58J08
$$ 113 -33 -99 -39 -16 3 -208 -5 130 -88 -8 153 49 -161 189 99 -241 135 314 -60 -130 28 136
$$ [...]
8191B0
##END NTUPLES=NMR FID
##END=
