##TITLE=1H_DE-80H_X3
 200.13MHz, d2o
 8 sc
 
 19ns.26.2.2025
##JCAMPDX= 6.0         $$ Bruker NMR JCAMP-DX V2.0
##DATA TYPE= NMR FID
##DATA CLASS= NTUPLES
##ORIGIN= UXNMR, Bruker Analytische Messtechnik GmbH
##OWNER= pz
$$ XWIN-NMR		Version 3.5
$$ Fri Jul 17 10:46:53 2026 Russian Standard Time (UT+4h)  Yarkov@DPX200
##.OBSERVE FREQUENCY= 200.1313
##.OBSERVE NUCLEUS= ^1H
##.DELAY= (6, 6)
##.ACQUISITION MODE= SIMULTANEOUS
##.ACQUISITION SCHEME= undefined
##.AVERAGES= 8
##.DIGITISER RES= 18
##SPECTROMETER/DATA SYSTEM= spect
##.PULSE SEQUENCE= zg30
##.SOLVENT NAME= CDCl3
##.SHIFT REFERENCE= (INTERNAL, CDCl3, 0, 14.3821)
##AUDIT TRAIL= $$ (NUMBER, WHEN, WHO, WHERE, WHAT)
$$ ##TITLE= Audit trail, XWIN-NMR		Version 3.5
$$ ##JCAMPDX= 5.01
$$ ##ORIGIN= Bruker BioSpin GmbH
$$ ##OWNER= Yarkov
$$ C:/Bruker/XWIN-NMR/data/yarkov2/nmr/H-C/1/audita.txt
$$ ##AUDIT TRAIL=  $$ (NUMBER, WHEN, WHO, WHERE, WHAT)
(   1,<2026-07-17 10:46:01.90 +0400>,<Yarkov>,<DPX200>,
      <created by zg, POWCHK disabled, PULCHK disabled
       configuration hash MD5:
       00 E9 B6 7A A2 85 ED C7 34 08 36 98 17 FE 4E 26
       data hash MD5: 16K
       DF 18 71 DD 65 50 4C 03 39 02 90 5A 12 52 B9 43>)
$$ ##END=
$$ 
$$ hash MD5
$$ 60 69 42 FF 08 6F 1D 45 45 C2 54 E1 05 83 A1 FA
##$RELAX= 
##$RELAX= 
##$RELAX= 
##$RELAX= 
##$RELAX= 
##$RELAX= 
$$ Bruker specific parameters
$$ --------------------------
##$DU= <C:/Bruker/XWIN-NMR>
##$EXPNO= 1
##$NAME= <H-C>
##$PROCNO= 1
##$TYPE= <nmr>
##$USER= <yarkov2>
##$AMP= (0..31)
100 100 100 100 100 100 100 100 100 100 100 100 100 100 100 100 100 100 
100 100 100 100 100 100 100 100 100 100 100 100 100 100 
##$AQSEQ= 0
##$AQ_mod= 1
##$AUNM= <au_zg>
##$AUTOPOS= <>
##$BF1= 200.13
##$BF2= 200.13
##$BF3= 200.13
##$BF4= 200.13
##$BF5= 200.13
##$BF6= 200.13
##$BF7= 200.13
##$BF8= 200.13
##$BYTORDA= 1
##$CFDGTYP= 0
##$CFRGTYP= 5
##$CHEMSTR= <none>
##$CNST= (0..31)
1 1 145 1 1 1 1 1 1 1 1 1 1 1 1 1 1 1 1 1 1 1 1 1 1 1 1 1 1 1 1 1 
##$CPDPRG= <>
##$CPDPRG1= <>
##$CPDPRG2= <>
##$CPDPRG3= <>
##$CPDPRG4= <mlev>
##$CPDPRG5= <mlev>
##$CPDPRG6= <mlev>
##$CPDPRG7= <mlev>
##$CPDPRG8= <mlev>
##$CPDPRGB= <>
##$CPDPRGT= <>
##$D= (0..31)
0 0.7 0 0 0 0 0 0 0 0 0 0.03 0 0 0 0 0 0 0 0 0 0 0 0 0 0 0 0 0 0 0 0 
##$DATE= 1784270761
##$DBL= (0..7)
120 120 120 120 120 120 120 120 
##$DBP= (0..7)
150 150 150 150 150 150 150 150 
##$DBP07= 0
##$DBPNAM0= <>
##$DBPNAM1= <>
##$DBPNAM2= <>
##$DBPNAM3= <>
##$DBPNAM4= <>
##$DBPNAM5= <>
##$DBPNAM6= <>
##$DBPNAM7= <>
##$DBPOAL= (0..7)
0.5 0.5 0.5 0.5 0.5 0.5 0.5 0.5 
##$DBPOFFS= (0..7)
0 0 0 0 0 0 0 0 
##$DE= 6
##$DECBNUC= <off>
##$DECIM= 32
##$DECNUC= <off>
##$DECSTAT= 4
##$DIGMOD= 1
##$DIGTYP= 9
##$DL= (0..7)
0 120 120 120 120 120 120 120 
##$DP= (0..7)
150 150 150 150 150 150 150 150 
##$DP07= 0
##$DPNAME0= <>
##$DPNAME1= <>
##$DPNAME2= <>
##$DPNAME3= <>
##$DPNAME4= <>
##$DPNAME5= <>
##$DPNAME6= <>
##$DPNAME7= <>
##$DPOAL= (0..7)
0.5 0.5 0.5 0.5 0.5 0.5 0.5 0.5 
##$DPOFFS= (0..7)
0 0 0 0 0 0 0 0 
##$DQDMODE= 0
##$DR= 18
##$DS= 0
$$ [...]
##$SUBNAM2= <"">
##$SUBNAM3= <"">
##$SUBNAM4= <"">
##$SUBNAM5= <"">
##$SUBNAM6= <"">
##$SUBNAM7= <"">
##$SUBNAM8= <"">
##$SUBNAM9= <"">
##$SW= 18.0517328524113
##$SWIBOX= (0..15)
0 0 2 0 0 0 0 0 0 0 0 0 0 0 0 0 
##$SW_h= 3612.71676300578
##$TD= 16384
##$TD0= 1
##$TE= 0
##$TE2= 300
##$TE3= 300
##$TEG= 300
##$TL= (0..7)
0 120 120 120 120 120 120 120 
##$TP= (0..7)
150 150 150 150 150 150 150 150 
##$TP07= 0
##$TPNAME0= <>
##$TPNAME1= <>
##$TPNAME2= <>
##$TPNAME3= <>
##$TPNAME4= <>
##$TPNAME5= <>
##$TPNAME6= <>
##$TPNAME7= <>
##$TPOAL= (0..7)
0.5 0.5 0.5 0.5 0.5 0.5 0.5 0.5 
##$TPOFFS= (0..7)
0 0 0 0 0 0 0 0 
##$TUNHIN= 0
##$TUNHOUT= 0
##$TUNXOUT= 0
##$USERA1= <user>
##$USERA2= <user>
##$USERA3= <user>
##$USERA4= <user>
##$USERA5= <user>
##$V9= 5
##$VALIST= <valist>
##$VCLIST= <CCCCCCCCCCCCCCC>
##$VD= 0
##$VDLIST= <DDDDDDDDDDDDDDD>
##$VPLIST= <PPPPPPPPPPPPPPP>
##$VTLIST= <TTTTTTTTTTTTTTT>
##$WBST= 1024
##$WBSW= 4
##$XGAIN= (0..3)
0 0 0 0 
##$XL= 0
##$YL= 0
##$YMAX_a= 381747
##$YMIN_a= -497738
##$ZGOPTNS= <>
##$ZL1= 120
##$ZL2= 120
##$ZL3= 120
##$ZL4= 120
##$ABSF1= 10
##$ABSF2= 0
##$ABSG= 5
##$ABSL= 3
##$ALPHA= 0
##$AQORDER= 0
##$ASSFAC= 0
##$ASSFACI= 0
##$ASSFACX= 0
##$ASSWID= 0
##$AUNMP= <proc_1d>
##$AZFE= 0.1
##$AZFW= 0.1
##$BCFW= 1
##$BC_mod= 2
##$BYTORDP= 1
##$COROFFS= 0
##$CY= 83.5205535888672
##$DATMOD= 1
##$DC= 2
##$DFILT= <>
##$DTYPP= 0
##$F1P= 10.8118882576601
##$F2P= -7.23987719738617
##$FCOR= 0.5
##$FTSIZE= 0
##$FT_mod= 4
##$GAMMA= 1
##$GB= 0.15
##$INTBC= 1
##$INTSCL= 1
##$ISEN= 128
##$LB= 0.25
##$LEV0= 0
##$LPBIN= 0
##$MAXI= 10000
##$MC2= 0
##$MEAN= 0
##$ME_mod= 0
##$MI= 1.114404
##$NCOEF= 0
##$NC_proc= 0
##$NLEV= 6
##$NOISF1= 3.799351
##$NOISF2= 2.8
##$NSP= 1
##$NTH_PI= 0
##$NZP= 0
##$OFFSET= 14.38212
##$PC= 1
##$PHC0= -7255.922
##$PHC1= 7.421964
##$PH_mod= 1
##$PKNL= yes
##$PPARMOD= 0
##$PSCAL= 0
##$PSIGN= 0
##$REVERSE= no
##$SF= 200.129724274929
##$SI= 16384
##$SIGF1= 3
##$SIGF2= 2
##$SINO= 400
##$SIOLD= 16384
##$SREGLST= <1H.CDCl3>
##$SSB= 0
##$STSI= 0
##$STSR= 0
##$SW_p= 3205.1282051282
##$SYMM= 0
##$S_DEV= 0
##$TDeff= 0
##$TDoff= 0
##$TI= <>
##$TILT= no
##$TM1= 0
##$TM2= 0
##$TOPLEV= 0
##$USERP1= <user>
##$USERP2= <user>
##$USERP3= <user>
##$USERP4= <user>
##$USERP5= <user>
##$WDW= 1
##$XDIM= 8192
##$YMAX_p= 0
##$YMIN_p= 0
$$ End of Bruker specific parameters
$$ ---------------------------------
##NTUPLES= NMR FID
##VAR_NAME=  TIME,          FID/REAL,        FID/IMAG
##SYMBOL=    X,             R,               I
##VAR_TYPE=  INDEPENDENT,   DEPENDENT,       DEPENDENT
##VAR_FORM=  AFFN,          ASDF,            ASDF
##VAR_DIM=   8192,          8192,            8192
##UNITS=     SECONDS,       ARBITRARY UNITS, ARBITRARY UNITS
##FACTOR=    0.0002768,     1,               1
##FIRST=     0,             0,               0
##LAST=      2.2672688,     0,               0
##MIN=       0,             -497738,         0
##MAX=       2.2672688,     381747,          0
$$ Real data points
##PAGE= N=1
##DATA TABLE= (X++(R..R)), XYDATA
0 0 0 0 0 0 0 0 0 0 0 0 -8 8 -8 8 -16 16 -24 24 -32 40 -48 56 -64 78 -91 108 -126 144 -166 191 -221 251
32 251 -285 323 -367 412 -464 520 -582 649 -725 805 -892 989 -1095 1209 -1335 1475 -1624
49 -1624 1788 -1970 2172 -2393 2638 -2913 3222 -3572 3973 -4435 4976 -5622 6403 -7375 8623
64 8623 -10285 12622 -16174 22236 -35225 121202 -354028 -463515 327024 299071 -192269
75 -192269 -154395 151347 -3057 -76782 83833 2352 -163577 96575 198761 -173544 -231703
86 -231703 231461 218271 -263151 -197232 279835 154566 -258787 -99005 222096 27373
96 27373 -164712 51361 127535 -104345 -85658 119447 31579 -107873 44877 85945 -126485
107 -126485 -80030 176036 68426 -193103 -52263 181182 22415 -157671 3849 121862
117 121862 -19994 -64805 44121 11445 -71499 29463 101868 -45730 -117130 50332 114596
128 114596 -56727 -112861 47373 101208 -25841 -74570 -2895 21934 15907 42059 -1824
139 -1824 -83273 -13271 103216 23854 -100324 -17036 96338 5900 -91788 1293 76065 -15703
151 -15703 -65709 20519 49590 -27490 -41389 24315 29219 -16484 -6442 15646 -11545 -10258
163 -10258 30162 7551 -34399 11768 44301 -36898 -61940 56604 79130 -64917 -90065 52564
175 52564 75860 -40261 -52967 25520 23159 -12710 7869 3275 -34150 5733 56261 -2849
187 -2849 -56658 1528 42394 -5797 -20322 19709 643 -36674 12080 45014 -26719 -52385
199 -52385 34133 53717 -36578 -52247 31394 44722 -19403 -26385 9796 9528 6164 10749 -18172
212 -18172 -25582 27406 34827 -33670 -40021 32763 32105 -36749 -24173 34046 9581 -33842 -672
225 -672 30404 -3108 -21863 9209 17767 -6189 -5479 6386 -2 4487 10497 -17473 -25533 23515
239 23515 38074 -27176 -51811 18818 49351 -15487 -43008 9402 30669 -3223 -14620 645
251 645 2444 4582 13669 -1515 -18488 4591 19768 -9327 -17730 13031 11309 -20521 -9808
264 -9808 22771 4599 -27175 -2177 27254 -147 -22254 4495 18893 -3515 -11143 5109
276 5109 5660 -2540 5399 2066 -16275 -3342 21093 1244 -25505 -3699 20977 388 -17599
289 -17599 1899 9494 -7634 -427 16023 -3704 -18966 8272 23795 -6109 -22505 6249
301 6249 22036 -2386 -15952 -2585 4287 3813 4459 -7055 -16580 3163 21171 -4080 -27834
314 -27834 3297 30582 -1346 -26231 2754 22191 -449 -12370 3526 6781 -3592 1185
326 1185 4376 -8568 -5278 10235 1108 -13718 -1066 11324 -3817 -11792 6723 10862 -9288
339 -9288 -6136 15066 6149 -13808 -2596 14956 2747 -12362 -758 8097 -3422 -5772 2891
352 2891 -2961 -6779 6082 6462 -10582 -8281 12116 8611 -11755 -4128 14970 4628 -10053 352
366 352 8270 -1572 -3708 4951 191 -9289 1021 8303 -7520 -11103 8151 8129 -10156 -7563 8886
381 8886 4828 -7946 -150 8404 -1691 -3887 6669 3073 -6341 188 6612 -1786 -6081 3659
395 3659 4150 -8235 -5365 7136 1812 -7802 -23 6684 -2912 -7228 5529 8748 -5971 -6040 8823
410 8823 6300 -6500 -2814 5021 754 -2887 1338 -356 -5430 336 3604 -6406 -5091 8462
424 8462 3895 -10140 -3749 10928 5474 -8660 -2428 11225 4548 -7856 -2889 6986 3948 -4615
438 -4615 -4125 1230 407 -1599 -1627 -4714 -2109 5508 201 -8594 1278 11308 -1190 -11078 4627
453 4627 13867 -4050 -9800 7676 9092 -7091 -7758 4271 6009 -2330 -6287 -2487 2412 2646 -3130
468 -3130 -6419 2077 8843 -403 -9012 -595 11112 5030 -10010 -4991 13065 6935 -13358 -7564
482 -7564 11814 6365 -11556 -6725 8603 3485 -7819 -4604 2438 4894 2175 -6222 -4918 9614
496 9614 9063 -9547 -9650 12646 14179 -11116 -14863 9637 14638 -7278 -15522 2440 13836 -1572
510 -1572 -15874 -2663 12913 3944 -11194 -7619 7699 10818 -2435 -10077 1638 13774 2644
523 2644 -15083 -2661 19838 4951 -21083 -7502 17255 5731 -16247 -7031 12447 6053 -11368
536 -11368 -9701 5496 12483 2057 -11269 -4511 11999 7659 -9796 -7253 11922 12220 -11085
549 -11085 -16463 7693 15889 -6889 -16813 4672 14077 -7871 -15908 7497 15349 -4237 -11393
562 -11393 2131 9235 2530 -4584 -3060 5775 8672 -3815 -14266 1339 18232 157 -21188
575 -21188 -3074 18379 67 -21256 -1891 22371 3771 -22181 -6083 18844 7855 -12148
587 -12148 -4377 12504 6226 -9829 -8657 5584 13075 3592 -14419 -12298 11766 13168 -14186
600 -14186 -15973 16513 18983 -20054 -25569 17362 27995 -10812 -22538 8970 19511 -6506 -16366
613 -16366 5454 17195 1733 -13525 -10484 5258 14606 -598 -18024 -3168 18588 1546
625 1546 -24714 -4243 29254 8865 -28184 -10015 25004 11188 -17786 -6943 17155 8127
637 8127 -13871 -10101 6972 9862 -129 -9419 -6928 4939 6136 -7220 -8761 9367 13588 -10099
651 -10099 -17930 9784 20031 -6531 -14662 10274 15178 -10841 -16186 9103 16519 -4178 -13730
664 -13730 -2028 6393 1280 -6475 -3609 7326 6931 -7710 -12547 3895 16180 2419 -13676
677 -13676 -2007 14043 2101 -15071 -1681 19932 5580 -22204 -10688 17655 10558 -14255
689 -14255 -10992 9232 9911 -7135 -12801 1193 15400 8358 -13191 -14093 11106 18095 -6778 -16182
703 -16182 6321 16822 -4214 -18084 -425 15362 2598 -12310 -5000 6119 1430 -6060 -496
716 -496 6213 1532 -3355 -2271 465 4670 4024 -3639 -2189 7327 2051 -11332 -2588 14841 3413
731 3413 -16563 -5230 12489 1486 -10974 -1172 7187 828 -4409 -1178 1680 2795 3154 -752
745 -752 -3022 2861 3800 -3873 -2763 6273 3455 -9165 -6471 9475 6489 -13077 -8782 13613 9272
760 9272 -14045 -11276 11457 12597 -4911 -8611 830 6187 5983 -1772 -9824 816 14501 75
774 75 -18086 -3347 17047 3392 -16137 -4146 11586 1150 -9506 -315 7874 1269 -5501
787 -5501 -765 5292 2374 -2103 -1385 1477 3721 871 -6105 -3920 7063 6477 -9673 -11999 8402
802 8402 13414 -8694 -14783 6391 13096 -3134 -9543 947 6930 2934 -1038 -3121 -1704 4787
816 4787 4609 -4517 -5361 2907 3441 -2756 -3466 454 -128 -2460 1501 3580 -3145 -5716 3434 8873
832 8873 -561 -9004 168 10624 2631 -8267 -3496 5952 5067 -2736 -7193 -2410 5544 4427 -5497
847 -5497 -8297 2902 8650 -1650 -7608 890 6784 1497 -3360 -458 3225 755 -1008 1401 777
862 777 -2330 -1411 1975 1314 -3249 -3632 1157 2308 -686 -2690 -2140 2102 4787 -315 -5329 86
878 86 7234 2687 -5939 -2422 6032 2511 -4816 -2097 2975 1118 -2772 -2117 424 126 -1033 -441
894 -441 -162 610 871 -1294 -1259 3379 3584 -2294 -3665 3197 5636 -2884 -5762 2647 4952 -2509 -5238
911 -5238 -142 2474 -68 -1706 -1268 -1167 1048 3069 -925 -2802 2179 3916 -1068 -2089 2489 2669
927 2669 -2258 -1341 2703 -469 -4017 579 3150 -1849 -4196 17 2466 -273 -1776 -434 79 1625
943 1625 2920 -1220 -3665 2351 6335 -192 -6122 -775 6106 1666 -5442 -3053 2019 2130 -710
958 -710 -2912 -2449 738 3094 934 -3178 -1794 3559 3046 -1387 -1219 1384 1618 314 -15 -393 -1408
975 -1408 -305 2042 -446 -3807 -1229 2446 1109 -3014 -2565 2150 3037 -944 -2658 528 3691 2276
991 2276 -2212 -2677 1713 4104 473 -4190 -2595 3342 2784 -3608 -4112 1330 2671 -1346 -2806 1009
1007 1009 1634 -1287 -254 2757 1179 -1720 -980 2081 2818 -169 -2598 -1286 2080 2792 -2493 -5193
1023 -5193 932 4725 -1164 -5505 -367 4602 318 -4431 184 4657 892 -2772 -809 2923 2892
1038 2892 -1240 -3059 308 3139 725 -3906 -2790 2930 2193 -3508 -2849 2512 1855 -2942 -1519 4058
1054 4058 2445 -4026 -1929 4787 4004 -1987 -4294 -80 4687 2390 -4112 -4803 1723 5024 -1651
1069 -1651 -6249 223 4516 -671 -3705 502 2862 -167 -1914 1397 3203 -373 -2393 271 3244
1084 3244 1711 -2983 -2796 2078 2487 -2017 -3550 523 2923 -1287 -4754 965 5614 -324 -6639
1099 -6639 -713 8269 3463 -6940 -4331 5878 6327 -2245 -6588 -1070 6124 2835 -5773 -4893 3285
1114 3285 4258 -3303 -4474 2594 3331 -2358 -2368 2492 3274 -1138 -3151 1602 4989 -40 -4829 -885
1130 -885 4524 1626 -4402 -2040 3132 873 -3735 -2416 3001 3397 -2907 -5571 2137 7420 -227
1145 -227 -7189 -408 8330 2973 -7017 -3958 5555 5412 -2603 -6377 -655 5234 906 -5243 -1738
1160 -1738 3906 963 -4376 -1459 4389 2671 -3193 -2409 3030 3950 -1293 -4176 1669 5375 -998
1175 -998 -5397 92 4054 -432 -3980 -289 2988 -276 -4097 -1708 3944 4148 -3194 -5867 2946
1190 2946 7647 -991 -6843 267 7207 1956 -6169 -3713 3919 4247 -2352 -5128 196 3921 -1242
1205 -1242 -4402 831 4066 -268 -3639 -599 3562 2244 -1905 -1559 2376 2645 -2058 -3170 2373
1220 2373 3627 -2606 -3785 1719 2085 -2440 -2819 1697 3161 -1027 -4363 -927 5034 3709 -3640
1235 -3640 -4314 3673 5296 -2417 -4583 1586 4798 4 -4770 -2152 3373 2204 -3340 -3046 2488
1250 2488 2827 -3267 -3594 2950 4399 -1179 -3798 101 4106 1926 -3005 -1900 3292 2793 -3176 -3732
1266 -3732 2281 3313 -2088 -3474 443 1964 -381 -2335 -452 2822 1622 -2651 -2056 2771 3479
1281 3479 -1454 -2588 1644 2689 -948 -2353 314 2007 87 -2688 -1274 1831 459 -2443 -826
1296 -826 2419 1210 -2198 -1340 2057 2383 -272 -1667 -214 2506 1393 -2441 -1268 2520 1181 -2780
1312 -2780 -1989 1729 1165 -2144 -1469 1458 968 -1395 -1460 1086 2611 -48 -2337 254 2816 885
1328 885 -2014 -929 2259 1448 -2244 -2476 1088 2697 -1006 -4219 -261 4137 134 -4358 -732 4150
1344 4150 1847 -3086 -1827 2887 2892 -1000 -2492 195 3049 1084 -3209 -2091 2439 2049 -2462 -3308
1360 -3308 1345 3310 -1441 -3690 943 3500 -24 -3026 33 3457 1022 -1909 -719 1404 1064
1375 1064 -447 -1183 -363 964 94 -1637 -1338 1096 856 -1784 -1013 1838 634 -1710 64 2409
1391 2409 522 -1743 -39 2452 643 -1857 -485 1413 774 -1229 -1630 210 1096 -268 -1721 -906
1407 -906 1182 1286 -1170 -1461 1542 2040 -689 -1633 1263 2326 -846 -2029 1104 2017 -1400 -2063 363
1424 363 1543 -621 -2187 -611 1500 579 -1381 -1622 1255 2685 -415 -2680 298 3559 1190 -2952
1440 -2952 -1528 3039 2225 -2602 -2686 1530 2409 -1256 -3075 -19 2176 318 -1738 -1105 1091 1815
1456 1815 -448 -1704 702 2432 388 -2063 -344 2554 704 -2284 -879 1667 506 -1864 -1324
1471 -1324 907 749 -709 -979 137 744 460 -347 -341 856 1150 -203 -680 397 1011 -110 -838 349
1489 349 434 -1067 -718 747 267 -1055 -867 1061 648 -1252 -546 1239 1219 -415 -916 154 1497 861
1507 861 -837 -1058 559 1142 -1025 -1879 356 1704 -532 -2200 -420 1621 285 -1591 -40 1722
1523 1722 422 -1166 -333 1632 1716 -633 -1637 451 1848 -110 -2115 -705 1979 712 -2760 -2071
1539 -2071 1684 2211 -1050 -2643 343 2755 316 -2150 -394 2505 1588 -1690 -1663 1151 1883 -294
1555 -294 -1756 -436 1217 155 -1793 -751 1274 462 -1327 -773 1041 876 -706 -343 1294 1088
1571 1088 -648 -1119 591 1761 -61 -1740 -321 1284 4 -1526 -758 912 676 -948 -1237 276
1587 276 1213 261 -869 115 1296 30 -726 577 1022 -14 -875 -28 729 -322 -1066 -20 1146
1604 1146 102 -1983 -1444 1656 1547 -1340 -1833 1020 2174 -109 -2037 -75 2629 1379 -1876 -1946
1620 -1946 1517 2441 -1183 -2505 414 1704 -406 -1886 -411 1435 695 -1469 -929 1406 1522 -1071
1636 -1071 -1491 1431 2089 -941 -1735 920 1977 -186 -2008 -616 1747 703 -2020 -1737 1361 1837
1652 1837 -1279 -2119 846 2182 -94 -1713 -169 1968 1145 -1367 -1165 1372 1524 -940 -1287 623
1668 623 822 -1013 -902 417 395 -773 -868 194 1175 80 -1501 -220 2027 1103 -1594 -1052 1725
1685 1725 1517 -1079 -1462 529 1396 -97 -1597 -646 1172 239 -1554 -705 1210 553 -1126 -541 1297
1702 1297 964 -672 -619 728 1161 -231 -1227 328 1595 -224 -1907 49 1673 -60 -2157 -989
1718 -989 1782 1315 -1575 -1829 975 2640 143 -2479 -336 2764 1353 -1667 -1295 1100 1501 -485
1734 -485 -1629 -60 1105 112 -1384 -623 1014 75 -1209 -265 998 346 -809 -181 1108 846 -533
1751 -533 -604 721 857 -317 -1159 224 1144 -449 -1486 -94 1091 96 -1253 -869 1180 1336 -591
1768 -591 -1252 299 1732 422 -1174 -303 1006 601 -516 -541 237 503 -443 -676 166 135 -534 -593 384
1787 384 649 -351 -874 227 1096 295 -618 -379 851 790 -463 -626 527 488 -447 -882 116 766 -305
1806 -305 -1137 -209 732 217 -858 -533 844 918 -280 -775 142 909 296 -635 -189 649 155 -811 -448
1825 -448 503 295 -786 -655 451 426 -421 -746 193 973 299 -735 -301 832 589 -403 -579 322 737
1844 737 11 -709 -240 282 -60 -704 -306 592 128 -642 -275 382 545 -81 -441 372 789 339 -368 -86
1864 -86 743 247 -758 -109 581 -85 -838 -181 357 207 -635 -700 257 647 -112 -928 -83 1308 589 -876
1884 -876 -388 925 861 -528 -779 202 833 -208 -1083 -100 765 164 -994 -502 610 494 -411 -350 118
1903 118 649 348 -451 -123 794 170 -535 -85 547 -120 -724 78 523 -406 -742 -77 482 144 -517 -708
1923 -708 609 989 -171 -783 298 1220 296 -941 -314 786 822 -465 -1245 159 1093 -293 -1410
1940 -1410 -158 899 106 -635 -208 487 356 -57 -44 100 664 202 -280 178 444 -212 -366 185 405
1959 405 -525 -677 82 582 -183 -797 -284 994 620 -825 -641 899 1038 -534 -754 229 1113 223 -827
1978 -827 -540 623 649 -653 -1154 194 1003 -353 -1225 74 941 21 -535 -55 744 400 -331 -97 561
1997 561 465 -196 -506 272 393 -466 -538 58 325 -76 -749 -408 651 188 -550 -251 921 401 -642 -425
2017 -425 904 565 -666 -411 462 522 -128 -689 -153 668 130 -869 -736 701 842 -556 -788 442 880
2036 880 -119 -720 75 997 328 -930 -312 665 361 -375 -551 72 160 -396 -466 4 285 38 -585 -228
2056 -228 560 53 -422 298 907 212 -767 -149 1002 565 -743 -670 432 583 -494 -851 231 912 -56
2075 -56 -1112 -584 597 720 -525 -669 460 868 -27 -660 56 989 148 -769 -207 569 53 -523 -92
2094 -92 496 56 -748 -278 550 258 -233 -388 227 589 -132 -538 232 1115 328 -911 -511 947 662 -633
2114 -633 -661 528 488 -666 -932 358 948 -59 -721 -245 581 408 -336 37 624 567 -529 -543 309 904
2134 904 -219 -872 119 651 -350 -1058 -115 932 198 -1099 -424 626 449 -266 -498 339 633 8
2152 8 -539 103 749 191 -503 -374 471 162 -521 -251 418 138 -606 -538 466 607 -431 -445 516 578 -301
2173 -301 -569 415 963 71 -941 -422 914 535 -693 -971 438 822 -586 -1074 27 1061 213 -828
2191 -828 -267 769 439 -437 -284 564 469 -383 -623 413 548 -106 -425 143 422 -110 -737 -63 766 85
2211 85 -831 -395 705 584 -661 -539 618 804 -211 -922 179 1104 74 -1006 -387 547 516 -579
2229 -579 -723 220 512 -256 -844 -65 927 244 -438 -68 537 308 -325 -198 377 173 -381 -217 226 140
2249 140 -252 -321 84 287 -292 -567 206 497 -72 -599 238 549 209 -564 -163 646 401 -552 -561 363 636
2270 636 -460 -832 135 582 -86 -546 -288 422 370 -528 -477 357 848 -67 -589 159 762 -106 -553 69
2290 69 476 158 -285 -208 144 247 -336 -440 127 361 -212 -559 213 503 30 -349 4 338 279 -421 -236
2311 -236 436 495 -484 -392 235 478 -244 -376 75 323 164 -236 -343 138 490 -132 -374 138 388 34 -100
2332 -100 146 85 -62 -3 3 -74 60 -129 -106 126 42 -253 66 321 112 -106 2 197 71 190 -7 72 250
2355 250 143 -315 -114 277 -16 -402 -42 200 -8 -271 -178 107 165 -1 -79 -162 269 226 -291 -34 281 94
2377 94 -247 -62 142 217 -128 -262 -125 206 89 -414 -345 324 210 -243 -90 291 107 114 -76 -67 215 260 10
2400 10 -421 40 195 -161 -119 6 -39 -38 -55 -127 98 30 -45 -35 202 243 -78 4 203 206 102 55 -61 173 234
2425 234 -214 -113 214 20 -344 -130 92 92 -28 -111 -17 183 85 38 -116 4 339 31 -63 134 77 36 -103
2448 -103 -50 42 -160 -48 -23 103 -76 -155 -54 228 117 -71 52 220 192 -65 -18 154 274 0 -192 -100
2470 -100 62 -9 -328 -301 186 -12 -311 -181 191 97 -234 -130 183 229 -2 -243 -76 253 130 -139 -108 105
2492 105 125 -127 -145 133 106 -78 -270 -53 312 68 -210 -117 341 180 -218 -91 172 194 -66 -152 107 240
2514 240 81 -187 -107 181 -7 -272 -89 195 49 -182 -218 -21 240 75 -55 192 358 -51 -204 -10 342
2535 342 31 -67 -73 210 122 -214 -137 112 252 -150 -173 -2 163 34 -228 -35 237 131 -116 -76 212 98
2557 98 -183 -172 130 166 -147 -277 28 154 -50 -214 -16 215 112 -153 -214 157 297 -211 -122 192 320 -18
2579 -18 -324 106 196 55 -287 -141 191 -20 -321 -136 227 169 -179 -235 121 294 -40 -232 -18 289 98
2600 98 -208 -24 157 191 -272 -161 76 61 -141 -272 73 263 53 -306 -43 246 -8 -125 -123 319 162 -221
2622 -221 -194 220 167 -109 -198 31 267 -39 -251 -96 262 68 -219 -130 189 290 -60 -127 94 256 -142 -193
2644 -193 208 330 -37 -289 20 182 178 -301 -158 186 217 -257 -170 199 267 -1 -322 56 330 106 -284 55
2666 55 211 91 -233 -145 180 105 -197 -252 41 163 -213 -303 -55 231 44 -141 -43 108 216 -17 108 200
2688 200 41 -202 -107 53 286 -147 -232 -14 173 -35 -293 -16 384 149 -307 -171 212 206 -167 -48 219
2709 219 281 -189 -209 209 243 8 -349 -25 178 -55 -255 -68 193 65 -145 -323 74 307 -76 -126 80
2730 80 199 -106 -277 57 326 59 -341 -275 141 173 -302 -255 -37 253 -131 -316 4 199 143 -192 -58 104
2752 104 174 -125 -84 184 228 -170 -236 121 208 26 -210 45 103 92 -200 -76 199 42 -41 -186 87 107 -83
2775 -83 -99 187 3 4 -225 -26 211 -20 -206 -89 16 54 -78 -162 63 95 -119 -44 137 70 -3 -163 122
2798 122 199 -63 -299 -18 396 172 -369 -184 108 339 -125 -196 42 103 68 -41 -38 252 62 -79 -159 104
2820 104 49 -138 71 264 152 -123 -148 3 60 126 -168 -4 117 -20 -130 152 130 44 -140 81 134 118 -23
2843 -23 -145 -86 305 30 -209 -86 144 39 -168 -105 35 81 44 -190 71 10 61 76 -90 62 -24 -83 27
2866 27 41 -129 -135 -32 99 -5 -78 -45 88 111 11 29 22 155 -76 -123 76 234 -40 -56 65 170 151 -214
2890 -214 -279 -34 96 -19 -149 -4 -21 -14 -50 -9 15 -1 -96 0 172 176 -86 -54 164 209 -28 -188 63 142 135 -110
2916 -110 -104 11 125 53 -134 70 49 86 -115 -36 169 68 61 54 128 120 -81 -93 -107 -33 69 -53 25 26 -3 -21 -40
2943 -40 -14 22 35 -14 -41 24 -62 -83 -9 53 32 -69 33 -57 -30 -168 -125 -80 -60 15 -137 -11 5 -53 85 72 -29
2970 -29 -31 44 0 -25 20 69 25 -54 2 13 77 -63 -118 -57 -113 16 14 19 -37 20 15 -92 52 71 63 85 -126 12 60 93
3000 93 11 -78 -37 43 134 -115 -51 -8 34 20 -69 79 148 46 -165 -12 82 119 -53 -28 35 59 -19 -65 -149 60 73
3027 73 -77 40 -13 -30 -50 -103 92 52 13 -13 87 133 -16 78 93 36 -1 47 -56 5 -94 18 -29 -28 34 -34 96
3054 96 59 -24 -23 -36 31 126 -54 16 -61 79 -51 85 -125 128 10 -44 -44 -50 37 3 -35 -136 73 96 -57 58
3080 58 94 -95 -27 -74 73 -22 -38 47 -76 12 30 -242 -14 137 -47 -81 -89 97 124 -76 -110 -31 104 -7 -80
3105 -80 -65 95 12 -2 -81 74 66 39 -133 28 77 58 -145 4 66 242 -57 -89 64 125 -15 -142 77 28 50
3130 50 -42 0 39 -2 -63 -85 75 32 6 -10 13 -54 -121 -75 8 107 -56 21 54 80 54 -165 28 80 33 7 -47 -1
3158 -1 74 -58 -10 93 5 29 -15 -43 96 -24 -81 -119 8 58 94 -105 13 45 -54 -175 62 46 -19 -58 -159 106
3184 106 106 -24 -8 -56 -50 -22 -89 -15 -39 16 -113 -113 64 59 -86 -149 212 12 22 -95 56 42 -146 -144 136 -12 36
3211 36 -100 68 133 66 -58 -4 27 73 -29 -121 129 95 -44 -36 109 100 -73 -41 24 119 -49 -91 50 117 87 -162
3237 -162 -91 86 25 -32 -28 3 -28 -63 -25 5 73 -103 -156 -68 29 61 -37 -44 127 -10 -34 -24 123 160 -64 -126 52
3264 52 205 99 -170 28 73 85 -88 -99 29 70 -73 -106 55 178 -94 7 21 -31 135 -66 -11 67 21 -115
3288 -115 -150 86 -11 -93 -59 127 184 -17 -114 -89 159 4 -93 -65 104 86 51 -70 35 90 44 -97 15 100 -103
3313 -103 -59 117 172 10 -140 -18 32 -13 -105 -69 9 -13 -68 -179 41 98 -52 -155 -95 78 21 8 27 155 18
3338 18 -61 -64 11 226 -25 -73 48 89 11 -135 24 39 -39 -117 21 87 91 -155 -56 73 211 -98 -138 5 111
3363 111 6 -141 34 -21 29 -88 -60 89 2 -25 -35 77 41 -91 6 17 109 -79 -79 4 3 -34 -153 -38 23 132
3389 132 -102 -50 52 73 -82 -37 54 127 -23 -72 -9 45 -6 -124 -23 29 11 -226 -41 61 66 91 -86 -81 165
3414 165 25 -4 49 116 127 16 -82 56 82 22 -43 59 8 -2 -167 73 145 80 -68 8 25 21 13 3 94 17 -17
3441 -17 4 9 4 162 -127 24 131 -4 -93 -29 132 55 64 -51 -27 -11 4 -19 -5 40 -50 135 18 147 59 -142
3467 -142 2 102 90 -55 -39 -11 15 38 -31 -41 55 -16 28 -45 26 29 -65 -25 -20 -30 -47 -89 -27 -7 -37 -92 30 92 70
3496 70 -10 135 163 -90 56 -17 44 123 -72 -49 -49 167 -18 -11 -13 148 168 -104 2 -159 9 39 -71 75 16
3521 16 17 10 56 121 145 -15 41 -24 2 0 60 -18 10 57 -101 -101 36 -155 -80 67 -10 -167 -35 34 -84 20 12 -17
3549 -17 18 70 19 -105 43 127 83 57 -25 24 23 -127 -192 -33 -66 119 -55 8 -19 18 25 -31 6 47 -35 7 30 -95
3577 -95 -125 -59 41 49 58 11 -63 -47 -72 -111 -139 64 8 -44 -198 -52 48 40 -7 1 99 -27 -95 34 16 31 -83 54
3605 54 24 -57 34 -73 -15 6 -14 14 65 40 38 -59 -9 19 66 -14 -72 61 36 -10 -36 -24 126 15 -136 133 52 5
3633 5 80 15 130 53 75 -20 92 34 59 -38 -21 -4 -73 20 9 -8 54 10 29 -112 -61 -84 -16 115 63 10 3 90 -9
3662 -9 15 -121 -23 153 6 -88 96 -15 -56 -149 -48 -29 128 6 -76 -49 -32 115 17 57 33 132 -69 -46 35 13
3688 13 -62 -98 1 66 11 -47 -201 81 10 20 -73 -98 -11 105 -97 8 43 90 37 -8 -94 -2 -29 -69 -6 -81 177
3715 177 -32 63 15 -74 5 -1 14 110 32 -19 15 -29 -86 -35 50 55 -73 35 -62 127 67 -126 125 26 48 -106 -161
3742 -161 44 -34 -125 17 33 36 -54 11 64 98 -29 -6 -57 14 -91 -142 -31 90 19 -95 -132 44 28 50 -185 107
3768 107 25 -131 -72 39 29 78 -116 -39 94 -16 -90 -127 138 -52 -28 -13 25 40 -32 -27 -96 9 -41 19 25 21 21 -111
3796 -111 -79 113 -7 -41 -18 4 105 49 -16 -95 138 22 -105 -68 -79 -26 -49 34 25 70 24 7 49 160 -99 -71
3822 -71 -52 64 -71 -36 -28 -78 -59 -154 23 -66 25 -93 2 128 93 -84 -119 53 18 -58 -100 32 100 79 -159 -67
3848 -67 -6 14 59 -90 52 168 -48 30 -10 -35 61 57 32 36 2 56 -82 102 113 -28 -36 -51 109 -66 25 -51 125
3875 125 -126 -11 -10 46 22 11 -76 107 29 -51 -155 -44 50 11 -91 -16 30 31 -22 -10 0 30 48 -75 34 73 -48
3902 -48 -12 18 109 30 15 114 160 149 -30 53 -22 -96 -32 99 -10 29 -10 -10 -13 42 -116 -32 -44 14 116 -121 35 66
3930 66 159 30 -75 -11 122 69 -87 66 45 0 -130 56 1 -13 -22 113 175 48 61 -41 39 87 58 -92 64
3955 64 106 -71 -65 -21 -10 -25 -8 -49 -96 83 45 -97 19 -22 -55 -28 -26 -13 -101 149 -26 -3 -57 33 2 -29 -15 -156
3983 -156 -111 -77 39 -42 116 87 38 62 18 -60 79 -83 -5 -109 -38 29 54 -175 -16 19 -62 -24 19 -3 -15 -81
4009 -81 -108 -74 -12 -111 -8 79 35 -68 -35 -84 70 124 -7 96 -27 163 -14 42 -44 -151 -29 -69 82 30 -37
4034 -37 -20 57 -54 5 -80 71 16 24 -85 -70 85 20 -56 -29 -47 38 43 -2 33 -7 104 29 -4 25 -26 46 -22 21 -20
4063 -20 -10 25 28 18 16 3 12 -1 -34 -16 -126 104 -18 -22 34 -18 -91 58 21 40 34 -2 -78 15 56 13 -121 -11 63 -13
4093 -13 -34 60 -71 -119 68 -67 9 4 -19 -80 44 93 123 -52 34 -42 66 -32 59 -29 43 44 46 -49 77 -27 -123 -116
4121 -116 -57 54 -133 51 -18 -92 -23 42 -132 8 -30 28 -28 -64 41 -15 -2 102 -128 58 18 -44 -52 -55 67 -34
4147 -34 -16 53 -27 -70 -102 77 -60 22 -75 -165 133 -14 15 -54 -71 117 14 115 -55 -134 -2 -200 -15 82 23
4172 23 13 56 -36 144 146 81 -76 -67 -52 -31 8 -98 47 -5 -86 -31 -150 42 -2 48 -52 18 57 31 -120 -37 37
4199 37 52 -8 -31 13 -78 22 -39 -9 -86 25 -38 -72 12 -21 -134 -28 20 5 22 27 -12 64 2 6 14 -92 -41 -25 -52
4228 -52 86 -15 121 4 -19 89 -34 25 58 82 -132 142 22 6 -58 15 32 -16 -6 -25 -65 41 61 -98 -105
4253 -105 -16 -53 -116 -15 -17 -8 16 -24 2 28 43 5 24 66 -116 -186 -10 37 -9 -3 -27 26 -17 -31 -56 -55 -29 -52 -129 -28
4283 -28 49 58 -93 42 148 94 73 21 -66 23 34 -39 28 72 34 142 -37 57 47 1 -62 -37 -98 -45 -61 -54 -26 -65 -9
4312 -9 -21 -19 -48 79 -11 118 81 1 -32 15 51 132 -113 -52 -48 -26 -94 -84 6 6 30 31 24 24 18 -22 -35 -28 -13 -3 -18 36 -56
4345 -56 -15 41 -31 20 -53 79 -13 65 29 -1 44 87 4 -5 -52 -1 -100 -24 -63 -53 73 -76 -67 16 -21 -22 -82 -9 -64 15
4375 15 1 -29 20 -71 -60 -111 2 -6 64 -50 129 -14 -64 -38 -75 18 -11 -13 35 62 17 -103 117 43 -35 101 39 1
4403 1 -39 -78 -106 -45 105 0 -58 -59 19 12 50 -11 28 -16 57 13 -65 47 130 -97 -21 -12 -10 -83 -51 77 25 42 -8 -18
4433 -18 107 -13 -61 117 56 35 44 17 -62 32 -129 -17 14 -2 26 62 -30 -91 -54 22 74 -65 -77 -9 4 39 28 -29
4461 -29 14 -55 79 41 37 62 -37 23 0 34 128 -72 -9 -24 8 57 -7 -89 10 -94 74 -61 12 44 30 33 -46 89
4489 89 45 24 -41 -91 -30 -11 39 15 77 -32 13 27 114 38 -79 0 11 -6 72 50 27 89 -84 -122 -33 32 -2 37 63
4518 63 -50 97 -114 -112 -117 -12 16 -154 161 76 -19 76 -17 -59 67 -40 -6 102 -28 6 -21 -3 8 -122 -132 78
4544 78 5 -20 -72 57 100 -26 53 14 144 18 -20 1 -83 -3 -32 -58 -16 11 -71 -23 68 53 -51 -46 -21 -15 83 18 -4
4573 -4 -6 45 120 30 -71 8 56 21 65 4 -11 16 -24 45 -2 1 26 84 -7 12 -52 14 -16 -18 39 -10 6 0 -43 9 32 -40
4605 -40 38 -64 -20 8 -86 -33 -14 -36 -38 -43 64 174 2 -110 2 -17 -60 -143 -4 28 144 21 -47 69 16 -79
4631 -79 -38 59 89 -122 -23 -62 72 -46 -33 -17 45 101 79 7 76 -30 40 84 -8 119 136 70 -63 -52 29 38 48 75
4659 75 28 -8 -29 -3 145 46 38 -19 68 -87 -76 -16 78 -5 -34 -14 -16 25 7 -134 -21 -16 49 16 -76 -43 23 -79 -21
4688 -21 33 79 45 11 -6 113 16 -74 41 29 16 6 66 39 35 -172 -10 74 81 105 -69 67 -22 18 -57 -42 -63 62
4716 62 -70 60 -99 -7 -63 7 -55 31 -11 -67 -39 -3 -35 -143 51 -40 6 -95 101 87 81 -9 63 -65 101 7
4742 7 -38 -50 88 -126 -103 -77 48 0 32 -115 -73 -5 -140 -59 -80 -57 -106 41 -22 43 0 -16 105 38 -110 -19 -15
4769 -15 -11 -14 -61 -78 39 64 60 -67 18 -28 -29 -19 -58 1 -40 -15 -9 -88 -55 -63 81 -7 156 -51 -94 -42 30 79 -64 59
4799 59 -31 23 -40 -18 18 -16 42 -24 -13 30 -80 -14 72 -78 -15 62 4 1 97 -18 -14 -77 -68 10 -18 86 138 5 48
4828 48 -21 35 -36 -74 -100 77 42 -77 136 -7 -23 -49 -168 -115 44 -16 -98 14 -30 107 36 -20 38 -75 4 9
4854 9 -51 37 -54 -134 29 -22 -24 0 94 23 3 -65 -2 78 14 -41 -49 3 17 -39 -33 37 -27 -36 -96 -127 -37 85 39 101 -6
4885 -6 13 -105 -40 -25 -2 91 19 16 11 -11 -31 -12 -1 -49 36 -58 26 101 -104 84 44 -24 -133 54 -22 9 -23 9 10 32
4915 32 138 -61 16 46 41 -47 10 -31 60 35 1 7 -6 -107 32 54 81 -47 22 -37 81 56 83 -81 82 32 -90
4942 -90 41 -34 -3 -79 -67 -99 42 -85 -2 -51 62 5 -18 -109 9 -1 -20 4 4 40 180 -11 0 92 -40 -44 28
4969 28 -9 42 -36 -37 -1 -5 -50 -72 -2 11 39 -49 36 83 20 -10 23 14 -1 -57 40 -74 20 -24 40 55 -33 98 -53 -26
4999 -26 3 32 47 -76 34 70 8 64 -90 21 63 13 70 -24 53 -74 -21 33 67 -141 -48 -26 102 -98 93 -80
5025 -80 -118 35 -83 -110 19 -18 39 26 15 73 -1 -99 14 54 12 -19 -100 8 31 -9 -48 75 72 16 -93 8 58
5052 58 -22 20 -7 -58 -3 -41 82 -17 13 -9 30 69 65 -11 -25 41 8 3 -63 57 49 0 26 31 -47 30 21 42 -4 46 32 24
5084 24 69 28 138 73 -26 -40 -28 11 41 -50 -27 1 63 26 87 -52 -170 -80 27 92 -61 37 47 -34 62 -54 -83
5111 -83 12 63 3 -46 77 -7 -105 -19 -18 39 -47 15 118 85 -78 -132 14 -5 191 -90 5 -67 3 51 10 -92 24
5138 24 75 -54 45 -2 -20 -17 45 24 -46 -105 -35 -44 -116 -65 20 67 -43 12 -110 48 -5 -4 44 -11 73 -14 54 60 26 110
5168 110 -69 165 46 -22 -20 -17 61 33 27 -41 85 30 -126 -82 14 18 -38 6 -9 79 -30 -12 -3 -63 20 -136 -86 52
5196 52 67 152 -9 -89 45 47 146 116 26 58 11 -51 41 -70 -64 8 -35 20 27 -45 94 -17 186 -90 -29 50 2 36
5224 36 -53 47 36 148 -37 51 78 89 -48 37 8 75 -30 22 -12 20 -1 -132 -129 56 109 15 -12 43 1 -25 7
5251 7 -7 37 -33 84 59 22 25 -55 82 -122 24 52 -101 -63 -53 32 -67 29 73 27 -14 -25 15 65 -36 27 63 75
5279 75 -19 -118 71 -39 -8 -15 132 48 49 -21 23 -102 -71 -45 65 -36 54 -102 23 45 161 96 3 32 -29 8 -12
5306 -12 -16 41 67 -129 5 75 27 -45 66 -3 -46 -3 -28 -82 29 -39 -16 -71 63 -30 -49 8 28 21 39 -59 31 52 125
5335 125 -8 55 -45 -47 -95 75 60 47 18 -41 36 41 -91 -15 78 -31 -25 -56 0 22 -1 -6 -8 -126 54 80 -64 20
5363 20 16 -28 -39 -100 17 -36 -24 139 76 -46 -88 -21 4 -7 -113 96 0 32 15 -101 -40 33 73 -56 55 16 14
5390 14 72 63 32 78 -34 22 -49 -127 -13 -58 18 -59 53 -60 19 109 -75 -22 7 72 12 -30 -66 -6 27 -144 -62 58
5418 58 60 -9 35 -29 -141 97 -76 -16 -62 -14 -83 92 -4 1 -92 -15 7 8 10 0 -11 49 -84 -24 -19 5 -13 33 -29 121
5448 121 -69 24 24 -35 49 -26 1 6 73 -73 21 -80 10 -3 -79 38 9 -44 21 0 -1 24 55 -61 54 -18 -14 20 -8
5477 -8 -71 -5 33 -112 3 49 -99 2 -31 -49 -75 -27 8 -84 -33 -7 39 159 -29 -31 -53 -25 -3 12 -115 1 -34
5504 -34 73 -40 -32 -54 -40 -84 -47 73 37 -14 -32 19 6 31 5 63 113 36 3 -31 -86 4 1 -22 -12 -47 -61 -128 81
5533 81 48 -112 -88 105 -23 31 6 66 -29 -76 114 -49 -70 36 31 50 -26 50 92 66 53 -62 -19 31 11 2 42 -15
5561 -15 105 -3 96 -39 40 77 26 -42 -89 -12 -16 -74 2 -13 7 34 117 -103 -5 -2 117 -84 24 56 -26 13 -100
5588 -100 -18 45 -26 114 -10 65 70 41 -39 -84 -8 1 32 -2 61 -108 68 75 41 16 69 -46 36 127 -3 3 -3 76 -4
5617 -4 63 26 79 -66 58 19 -12 -115 -7 -6 8 112 34 -110 38 24 56 16 59 23 -11 -73 43 -20 -21 -20 -53 -108
5645 -108 5 167 88 38 -124 -42 100 33 0 13 -16 50 29 -79 -75 68 29 8 37 -9 2 29 -77 -32 53 60 -15
5672 -15 -6 -16 138 16 51 -15 76 43 141 -47 68 18 -79 -113 2 94 -56 -29 9 -16 -15 -28 -71 -12 -36 39 65 4
5700 4 31 -33 63 32 -59 42 43 11 -47 -33 -48 31 -36 -56 -51 -116 1 0 -11 -1 -23 87 70 -38 75 -35 44 26 -88
5729 -88 -35 16 -39 -8 1 99 -168 59 117 91 -89 6 26 88 59 -122 -37 57 -68 62 73 8 -85 43 -7 12 -3
5756 -3 117 -87 66 10 -34 -43 53 20 -6 45 -12 28 6 -34 45 -33 70 -81 -57 -35 28 -14 -67 29 -4 4 -12 -13 -125
5785 -125 -113 -24 60 -119 134 -83 -49 -93 -12 85 -69 46 -12 5 33 39 -96 -22 6 -145 20 38 41 -70 -10 -93
5811 -93 -124 31 34 71 -29 45 18 -8 47 47 -40 -96 59 145 -123 -76 -24 42 -49 109 -24 55 -5 -50 -9 -77 -40 -100
5839 -100 25 72 43 -5 47 -67 56 -119 -5 118 3 9 -9 -35 142 80 2 -76 40 198 -32 -9 -74 15 63
5864 63 -105 -59 52 30 -10 64 -21 -3 -80 -87 117 55 -29 6 29 22 -73 -93 22 21 62 -32 -40 34 -30 -6 -50 -48 -46 -41 106
5895 106 -6 18 1 -14 54 21 -61 15 52 9 -20 7 -85 -69 60 -61 55 31 -63 -43 -187 -98 82 -20 119 49
5921 49 154 -9 45 -27 -29 99 -36 -144 143 16 -5 8 -59 -91 3 -47 -68 2 16 -75 10 20 2 102 -22 22
5947 22 50 -19 28 -82 -30 42 -20 8 47 30 -125 -15 6 65 25 -2 29 10 30 -179 20 90 -103 -9 10 34 18
5974 18 4 -9 65 50 34 -72 57 -30 53 67 48 -68 -112 91 -75 -53 -17 -54 -64 146 -51 6 13 -37 64 12 64
6001 64 -17 -56 -13 -21 41 18 64 -100 -51 -7 -37 60 61 2 30 72 -83 -104 87 49 -9 -31 54 36 -64 -21 -52 -106 -53
6030 -53 -161 129 38 4 -99 -23 47 -17 -5 -78 5 -100 -121 -210 32 27 97 32 -28 136 158 1 51 7 101 -72 -50
6057 -50 41 -4 25 -42 164 42 77 52 14 49 -31 -79 58 -20 -11 -43 80 28 92 -6 -25 -21 12 -52 11 -43 35 126 -20
6086 -20 -39 22 89 -3 28 -26 26 -22 28 -12 36 121 -9 41 0 34 -69 -7 23 -46 -49 12 103 82 58 -33 7 63 36 -47
6116 -47 -45 68 -90 -17 -9 -7 57 -60 -149 0 -34 132 -17 33 -106 -39 -18 -23 -33 78 -67 5 24 -44 -73 -140 106
6143 106 2 21 57 -17 0 -101 -26 -37 44 4 -34 99 -24 57 -126 -5 7 -56 -81 -108 1 21 -45 -10 -81 71
6169 71 14 -64 97 -94 5 -24 -10 -65 -3 31 35 34 -51 41 31 -7 4 84 24 -57 -73 -93 -47 63 -11 -1 37 -159 -34
6198 -34 78 -12 53 53 -107 -33 -3 -13 -38 18 -2 -39 0 32 36 -80 49 -74 4 -5 -11 -150 -69 5 22 -77 87 65 -105
6227 -105 -80 64 46 -61 10 19 21 40 8 10 -8 0 -10 -3 80 -42 20 99 129 -12 -68 -45 -41 -70 -134 -77 4 -60 -97 84
6257 84 -10 69 6 5 3 4 -67 52 6 99 43 -115 -35 -45 14 -74 67 0 10 88 -111 -32 115 75 -45 31 11 -27 -26
6286 -26 59 21 47 76 -52 15 -32 23 4 64 -82 165 -54 1 21 30 70 -29 93 22 50 -99 35 -32 81 -20
6312 -20 -14 -155 35 9 -27 -8 -26 64 76 10 -85 23 -13 -2 -138 4 -3 -81 -79 -2 -79 10 57 -154 65 -80 -11 -104
6340 -104 -43 -59 -19 -54 -32 2 51 -4 -44 -41 56 75 102 -3 2 -50 61 -8 -69 14 -10 50 23 105 67 7 44 8 -42 -3
6370 -3 -14 -36 -6 -89 -97 -19 -147 2 -56 -25 118 -21 41 92 -72 17 -91 -49 -71 47 46 -14 -10 -70 51 82 50 -84
6398 -84 -8 34 16 -23 35 -117 52 90 134 -95 -38 -26 159 -10 -55 62 21 73 99 -54 -133 -5 -91 77 -42
6423 -42 -13 -20 40 -55 28 25 11 25 31 -30 107 -24 -13 24 -13 -41 58 31 27 -32 34 -111 -37 71 -8 -40 -39 46 -61 69
6453 69 -39 -28 -91 -15 83 3 85 -9 -32 -39 15 -89 -134 -15 12 -2 -47 -59 46 46 -32 42 15 -58 50 49 99 40 -53
6482 -53 25 -3 75 48 15 -76 5 -73 16 -40 -54 87 -24 -11 -62 8 48 -19 22 35 40 -48 20 47 -12 -99 42 -51 -13
6511 -13 13 -80 72 -3 -44 -14 -64 -35 -13 -27 110 196 73 116 -13 108 105 -56 71 -22 51 20 -80 -144 -13 -52
6537 -52 -36 37 -99 87 -19 -80 81 40 -48 39 7 176 -15 70 -88 -14 102 25 -88 -13 -47 37 69 4 19 -97
6563 -97 -33 127 -27 67 -46 -20 61 -77 -14 -40 115 105 18 105 25 40 9 42 -12 -15 33 116 156 44 21 12 5 19 -7
6592 -7 -40 -10 9 -81 26 -46 -87 80 60 152 -79 10 129 -49 -76 99 -38 -67 62 -110 -101 -38 -89 26 13 7 5
6619 5 -21 22 90 -31 -106 26 -7 -13 -33 -10 21 30 21 57 3 49 -31 -148 -25 49 -35 9 80 -86 39 27 -3 -14 31
6648 31 -107 84 95 -48 -29 71 -14 -38 9 -23 -1 4 33 -18 -5 -126 24 69 100 -2 -17 -29 14 -62 -70 16 -48 -12
6676 -12 -33 -26 -129 -84 -31 -98 63 134 -34 14 72 21 26 27 13 -62 -12 41 -22 68 -67 21 148 6 99 73 3 2 67
6705 67 81 11 -26 60 97 -63 -31 -12 17 -7 -48 24 -15 -15 -10 33 -60 -47 0 -82 17 2 -77 9 -2 16 49 11 -12 43 82
6736 82 49 0 37 -10 15 12 -38 28 -12 39 22 -65 23 -30 2 -13 56 -73 -5 46 -41 3 22 76 -62 48 -93 -27 8
6765 8 43 -45 -10 -41 101 29 9 102 30 -118 -38 -108 93 -97 43 48 -82 10 -19 -96 -63 -7 27 2 -18 -67 -3 9
6793 9 -19 -52 -4 -38 -113 11 -32 -119 11 -70 22 -55 -32 -55 -23 -5 -66 -83 -54 91 -31 -94 -54 0 32 -13 56 60 5
6822 5 -131 -93 -50 72 -18 -119 12 20 33 -28 35 2 -47 52 -40 55 -57 186 67 -38 -76 -3 80 -11 21 96 82
6849 82 27 -3 15 99 -49 56 -2 -42 -1 -67 -4 -35 -25 58 35 51 -48 -35 -102 24 -14 2 -104 57 31 -108 -11
6876 -11 25 41 -13 -28 79 -40 -12 74 66 -45 39 -33 -70 11 -19 -98 70 30 56 -37 67 67 50 103 56 25 60 49 -41
6905 -41 76 48 65 -65 33 126 -40 -33 -46 -22 117 -12 -17 47 30 8 3 -31 -79 -24 69 -20 -69 34 -23 1 -59 37 -68
6934 -68 -16 89 -29 12 -63 65 -20 42 83 -12 0 21 11 -62 -75 -50 -57 40 -67 -11 -94 21 2 29 55 112 -20 4
6962 4 -30 5 1 39 -13 -42 36 20 104 -17 -99 12 96 -40 7 -75 4 49 -67 -15 -137 -50 -33 -61 87 24 10 85
6990 85 -84 -121 5 120 3 -12 117 -44 -105 13 -32 -27 26 -86 -13 -75 25 30 0 5 -6 66 5 18 1 35 -74
7017 -74 2 30 1 1 -123 -38 -128 38 59 1 157 -94 -40 29 10 -91 -4 -39 35 -122 -45 -11 -64 163 28 -10 -24
7044 -24 60 58 -9 -32 118 48 -59 -17 32 81 32 13 67 -9 77 -70 79 7 21 53 -41 136 -74 130 46 49 5 109
7072 109 -71 -19 20 69 48 71 36 -30 111 54 -54 -17 -5 118 72 57 3 6 157 33 32 79 -45 -64 -40 31 40 36
7100 36 -30 -107 45 26 12 -30 -12 -15 71 60 -33 -44 20 -15 -72 75 46 14 -68 32 96 -41 1 142 2 16 71 76
7128 76 65 124 -68 37 20 22 38 -17 -80 68 -123 -95 -4 -63 21 6 57 -4 -30 5 29 -39 -76 104 34 -13 -37 49
7156 49 -59 53 -111 -136 -29 70 -26 -148 53 -100 35 1 -31 -34 24 4 72 -93 107 59 -87 -66 40 101 -8
7181 -8 -30 -18 0 33 145 134 -91 -98 -69 81 34 79 -74 -89 11 5 -5 72 70 -83 -93 79 18 -46 18 87 -60 -163
7209 -163 -81 -23 10 -3 -5 -11 41 90 -32 -12 -46 -21 72 -18 -46 -13 101 69 -119 -171 34 6 32 -59 -30 54 -23 -59 65
7238 65 37 -17 25 -14 92 55 16 1 64 36 12 -11 40 8 24 6 -90 -37 -2 -54 -6 62 94 -11 -56 -31 -7 -59 47
7267 47 -2 89 -30 -9 87 -50 118 -111 -57 110 -121 -31 -97 49 75 -47 8 -101 -49 -14 -75 -79 38 -58 -6 79
7293 79 38 -89 -98 -108 28 9 -24 -27 51 -48 -172 -64 -17 42 -117 56 -27 -24 -19 13 52 -50 -55 36 3 36 13 68 49
7322 49 -114 -7 -47 -59 -4 -122 -33 -68 -53 -7 -42 12 22 89 84 20 72 -14 -14 65 88 -24 -60 80 8 58 29 13 -7
7351 -7 3 9 -129 -36 -59 58 -36 38 -32 4 56 118 25 7 -26 -3 -45 -27 -91 131 52 -8 42 -86 63 10 -42 6 -8
7380 -8 58 -24 -46 14 -4 -84 20 19 79 45 -13 12 -116 -60 -38 1 2 -61 118 -70 -49 -45 33 -58 92 100 -16 -12 45 -69
7410 -69 69 -114 30 193 15 60 -1 21 94 -64 12 -8 -26 -2 76 16 -62 109 -27 30 62 12 43 46 13 83 3
7437 3 17 74 64 -28 37 30 13 22 -36 -77 -42 -36 -58 38 31 -15 -37 -19 33 80 -39 2 62 -75 -49 14 -47 97 -71 27 71
7468 71 5 -63 1 16 64 36 -62 -33 -35 113 26 96 -8 -6 18 76 -62 -49 158 -11 34 -9 32 62 -3 -54 -31 6 87
7497 87 112 -78 73 -86 -2 13 23 17 -23 -51 58 0 -125 68 -35 6 -24 10 3 -46 -60 19 -111 -36 -68 -23 79
7524 79 -73 50 74 -36 23 49 -33 -18 16 102 145 -26 93 -39 10 55 77 -109 69 -11 34 -10 49 -35 -39 12 -157
7551 -157 74 30 12 -74 18 114 24 61 6 1 54 -50 10 29 -15 -132 -56 -35 2 -120 154 201 -66 -6 75 101 -8
7578 -8 70 -25 21 13 -33 85 -22 81 57 -9 -17 24 -9 -73 -105 14 53 -22 -76 -75 -34 61 -38 -13 25 -31 69 -6 -16 78
7608 78 71 1 -59 -48 -62 -74 69 -14 75 -46 37 4 10 -112 34 22 80 19 19 -10 31 -10 7 49 -125 14 -62 33 27
7637 27 40 -85 73 74 -47 85 16 -75 -87 -8 -86 -7 25 -83 -20 82 59 -13 -28 -180 -35 -48 88 -117 -111 32
7663 32 -16 -71 60 39 3 6 -22 -92 123 31 -5 -110 51 35 132 116 70 -73 86 14 -12 38 7 100 -103 37 94
7690 94 71 115 72 -124 56 -112 -27 39 -17 42 -55 -31 -78 -76 7 54 -41 9 123 85 22 27 76 142 -14 -46 21 -43 24
7719 24 45 -81 -47 -30 103 77 -13 -8 -99 -120 27 22 22 50 10 -82 -7 12 -22 26 3 14 42 31 30 80 -54 58 -58
7748 -58 -72 52 -46 11 17 103 39 -84 -4 -25 16 65 8 4 -46 -17 45 35 57 152 -3 -23 49 79 54 -74 68 -6 11
7777 11 63 -64 41 21 23 -141 -56 27 80 -27 51 82 72 10 -6 -127 42 -24 136 60 -22 30 52 147 27 113 3
7804 3 -36 -30 0 36 -75 -102 -11 -40 -33 46 103 -71 79 42 -34 -2 50 147 5 63 -72 -8 29 69 0 -56 -15 61 20
7833 20 29 80 -81 -11 -8 121 123 156 22 69 28 85 3 -111 25 -51 61 -73 78 150 -14 -43 92 36 -25 44 9
7860 9 -94 -46 -13 -13 71 90 -4 31 -61 31 -8 -1 57 -44 -37 3 44 57 -58 90 85 52 3 -6 -3 -43 -11 -84 -71 -8 32 19
7892 19 -61 -81 -17 -23 18 -14 -26 5 26 -63 -18 -23 55 63 -26 -115 -63 -25 90 71 -2 -55 55 15 -57 -34 -22 -5 72 -17 -66
7923 -66 46 25 -17 -64 0 -64 7 -50 -21 -19 -10 31 73 -81 -4 2 -19 13 79 23 42 46 -22 -33 -19 49 9 7 2 -3 -53 65
7955 65 32 -26 -19 54 -10 55 -46 -80 64 -27 61 -10 20 62 -20 39 -8 37 53 -4 -6 -12 34 88 90 129 -27 -61 144 -2
7985 -2 -37 -54 -161 15 112 46 20 23 23 -52 -59 -38 -27 157 -105 -11 -36 28 -20 -33 -50 48 4 -63 158 71 -108 -71 58
8014 58 77 73 -26 -30 -67 -2 -97 -31 64 -77 -39 56 -8 122 -17 -37 53 3 -12 -10 -79 -95 166 105 -33 34 35 17 38 -41
8044 -41 -115 60 8 -76 2 30 -34 -88 -75 -130 -46 -124 0 -4 -4 16 34 84 46 -41 67 89 88 -139 28 119 -76 38
8072 38 -25 -77 -43 30 -35 78 -99 60 44 -26 55 -101 20 112 -7 -35 -39 -14 -73 -5 -10 -8 113 83 52 8 -114 -7
8100 -7 -31 88 123 -48 -4 23 2 9 110 10 -3 -40 70 15 18 56 -2 47 45 32 -72 -17 45 18 -10 -72 4 192 -31
8129 -31 -31 -49 -30 -14 -34 67 -110 73 37 -5 -22 22 23 11 53 -142 38 -51 -21 61 -87 -97 -50 -47 67 -7 -40 -17
8157 -17 16 -66 16 28 8 -7 112 0 -5 37 70 -31 -45 -5 38 -51 40 -6 84 -41 -134 -5 -5 -71 26 7 46 87 35
8186 35 1 54 -64 82 17
8191A7
$$ Imaginary data points
##PAGE= N=2
##DATA TABLE= (X++(I..I)), XYDATA
0 0 0 0 0 0 0 0 0 0 0 -6 8 -8 8 -16 16 -24 24 -32 40 -48 56 -64 80 -88 108 -128 144 -168 192 -221 252 -286
32 -286 325 -368 414 -468 524 -588 655 -730 810 -902 1000 -1106 1222 -1350 1490 -1642 1810
49 1810 -1992 2194 -2417 2667 -2943 3255 -3608 4011 -4473 5013 -5655 6433 -7393 8617
63 8617 -10236 12482 -15817 21284 -31779 59072 -278396 -497738 381747 366491 -237439 -238976
75 -238976 181584 63380 -105779 44320 50761 -129230 53675 180753 -133762 -222263 207634
86 207634 224008 -249268 -214127 274302 173274 -273787 -132347 243064 63222 -191559
96 -191559 13334 147661 -80474 -103615 118817 64594 -114536 6194 96213 -87352 -82947
107 -82947 155066 72979 -190769 -64585 186884 35296 -172759 -9950 140952 -12700
117 -12700 -94470 32066 38809 -54605 14580 90551 -37135 -109503 50367 118243 -53596
128 -53596 -114207 53139 106889 -40320 -93045 8568 48911 10616 9104 -12482 -67029 -6614
140 -6614 96325 21071 -101893 -20099 100248 13541 -92426 -400 85976 -7462 -70473
151 -70473 18171 56210 -26189 -47111 24910 34355 -21992 -20082 14550 -3667 -13389 22035 10231
164 10231 -31810 1999 40040 -22229 -50192 49837 72585 -61853 -86296 60058 84496
175 84496 -47889 -67271 30403 35743 -21546 -9599 6071 -22667 1775 47283 -4209 -57716
187 -57716 3416 52994 -446 -29310 13948 11497 -27003 6925 41976 -19983 -50246 29475
199 29475 51146 -38860 -56173 32425 47585 -27233 -37247 14453 18370 -995 2461 -10554
211 -10554 -16664 25381 32593 -29607 -37332 34188 37396 -34893 -28888 34853 15570 -35757 -6255
224 -6255 30734 -3216 -27558 5722 19692 -7686 -10700 8033 4081 -95 6597 -9622 -16390
237 -16390 22377 32522 -26428 -46195 22559 50940 -18344 -48318 11057 35651 -7716 -24045
249 -24045 503 7753 2087 6295 -2028 -15540 4246 21735 -4610 -17198 12629 15619 -16174
262 -16174 -10479 21310 6282 -26577 -4974 25953 -1016 -26833 802 19074 -5319 -15813
274 -15813 4320 9003 -2819 1053 3937 -9090 -692 21315 3982 -22684 -1946 23609 1493
287 1493 -20756 -1065 12039 -6240 -6628 10345 -3320 -18598 5924 21672 -6848 -22422 7543
300 7543 24166 -2911 -17920 1587 11783 4496 675 -5873 -11513 3929 17470 -5561 -26667
313 -26667 1875 28282 -3509 -29696 1762 24751 -764 -16212 3191 11207 -1939 -1239 5604
326 5604 -3905 -3989 10395 3684 -12399 -1855 11416 -2913 -13440 3457 9850 -9673 -9809 11586
340 11586 5838 -14518 -3626 15641 3948 -12272 -351 11908 12 -5995 4158 2062 -4721
353 -4721 4512 6114 -9593 -8889 9934 7112 -13553 -7768 12488 3727 -13077 -1834 9962 416
367 416 -4462 4716 3285 -5708 1486 9849 -3786 -9843 7615 8883 -10377 -9424 8052 4749 -9924
382 -9924 -3914 7363 -1505 -6519 4582 4198 -5662 92 8384 893 -4592 4092 5970 -5625 -4717
397 -4717 7517 2936 -8856 -2452 5539 -3066 -8393 2862 6790 -6436 -7872 7491 6761 -6988
411 -6988 -3227 7458 3713 -2088 1843 2502 -2604 622 4797 -3576 -5155 6302 3063 -11015 -5303
426 -5303 9377 3715 -10419 -4167 9969 3658 -9191 -2851 8634 4771 -4420 -2842 4108 3212
440 3212 -901 -791 -1795 -1233 4080 -60 -8542 -947 8576 -2355 -12129 2429 12707 -3938 -11431
455 -11431 6805 10499 -6571 -6883 7341 8142 -2168 -5409 156 4275 2204 -3415 -5658 1191
469 1191 6299 -2963 -10699 -1288 9083 2342 -10391 -4720 12376 7077 -12060 -5837 14287 8416
483 8416 -10604 -5703 10737 5131 -8545 -4482 4414 3327 -1458 -6986 -5217 6546 5991 -10194
497 -10194 -9347 11683 12682 -11099 -13469 12049 16202 -7314 -13947 5566 15090 -1746 -15148 -1095
511 -1095 13645 2317 -13494 -7298 8280 8361 -6038 -11043 1817 12017 1309 -12992 -1397
524 -1397 19031 5328 -19602 -5264 20137 7165 -16513 -6440 13544 5192 -13432 -8943 7568
537 7568 10041 -2674 -13100 -4361 11247 6121 -10227 -6476 11808 10736 -10354 -13019 10987
550 10987 17794 -6240 -15875 5642 14954 -6837 -15969 6756 14665 -7499 -14859 2083 9416
563 9416 -312 -6977 -2669 5403 6254 -3942 -10440 4050 18108 784 -19141 -1091 20114 1578
577 1578 -19967 -1688 20733 1251 -24188 -6325 19685 6497 -15826 -6355 12046 5381 -10616
590 -10616 -5984 9704 12362 118 -12970 -7346 13708 13619 -12566 -14695 14571 15880 -20010 -23680
604 -23680 17942 26299 -15154 -26535 9082 20727 -7249 -16639 7504 18111 -1152 -14595
616 -14595 -5116 10666 14031 -1961 -16253 -1971 17573 1673 -22433 -3728 26208 5110
628 5110 -30626 -10797 26273 10757 -20865 -8503 17902 8107 -14704 -7852 12131 11456 -2790
641 -2790 -9325 -3788 6860 6508 -6131 -7899 7248 9812 -11293 -17192 9189 18978 -8113 -17512
655 -17512 8358 15023 -9942 -14363 11587 18074 -5597 -14702 1358 10130 1949 -6116 -2944 5842
669 5842 3779 -9290 -10823 5092 13909 -1247 -15901 -2908 13690 2511 -13222 -274 18776
682 18776 4657 -20514 -7331 21194 11622 -15745 -11072 10939 9323 -9346 -12479 3451 13134
695 13134 2303 -15398 -12278 12077 16808 -8362 -16642 7375 17263 -4341 -16454 3036 18044
708 18044 2396 -13837 -4331 8614 2778 -6500 -1765 5162 -235 -6143 -2720 1676 3406 2183
722 2183 -3601 -2864 5972 2962 -8220 -938 14315 3977 -15513 -4214 14824 3232 -12284
735 -12284 -1913 8050 -293 -7067 -1987 2296 1374 555 -1706 -3153 2102 4347 -2373 -2269 6131
750 6131 3913 -6903 -4353 9821 6799 -11265 -7922 12817 8052 -15216 -11327 12213 11332 -9152
764 -9152 -11582 2478 7470 3028 -3107 -7410 2222 13299 538 -15703 -907 18317 3872
777 3872 -16670 -4321 13343 1992 -11381 -1597 7441 -434 -7531 -1672 4924 1429 -3526 -1404
791 -1404 2542 3198 767 -3755 -1446 7414 5757 -8106 -9247 8806 12583 -9396 -15334 6780
805 6780 13169 -5732 -12367 1385 7936 705 -3923 -2716 396 4886 4386 -3625 -4251 4542 5283
820 5283 -2322 -3374 1376 1353 -1886 17 1888 -3469 -5648 2764 6781 -2679 -9330 225 10238
835 10238 1822 -9065 -2240 8183 5393 -3459 -5664 705 6911 3634 -5782 -6981 3462 7802
849 7802 -3159 -9322 391 6606 24 -5330 -1237 3461 1022 -1385 1043 1717 -1135 -71 3025
864 3025 1994 -2290 -2395 2154 2730 -1659 -3390 -1611 1394 2685 -2032 -5819 -228 6351 1557 -6298
880 -6298 -2204 6645 3440 -4668 -1347 4792 2226 -2426 -1384 1622 884 -1131 -791 -299 -582 -490 -1711
897 -1711 -1752 1828 2063 -2889 -3333 3257 5315 -2254 -4867 3636 6313 -2011 -4630 1484 4002 -168
913 -168 -2757 -1367 -411 414 1368 -1745 -3753 968 3165 -1797 -2800 2102 3061 -1522 -1096 3357 1231
930 1231 -2846 1244 4065 -1150 -3746 628 2814 -831 -3040 -814 222 277 734 -1867 -3581 2133
946 2133 5327 -1101 -5726 391 6961 2061 -5076 -1772 4196 2820 -1340 -2962 -1455 1404 2137
961 2137 -668 -3952 -2177 2830 2082 -2925 -2262 1635 1969 89 -204 405 281 729 2405 443 -2644
978 -2644 -244 3059 690 -3207 -2484 1786 2094 -2528 -3603 479 2927 800 -2905 -2433 2534 4073
994 4073 61 -3618 -926 4496 3314 -3267 -3372 2311 3082 -1744 -3491 283 1472 -1756 -1461 1601
1010 1601 227 -2479 -1038 2189 2449 -534 -2189 298 3110 2626 -1757 -3626 1969 5114 -1188
1025 -1188 -5613 -178 4490 -371 -5229 -735 4025 -50 -4113 -776 2910 2244 -1594 -2403 1545
1040 1545 3851 672 -2928 -1243 3672 2646 -3510 -2966 2539 1773 -3298 -2262 2724 1211 -4500
1055 -4500 -2404 4446 3172 -3227 -3806 1555 5197 1994 -3792 -3132 3357 5196 -1520 -5696 657
1070 657 5117 -1017 -4742 -99 2580 -936 -2801 466 2365 -1031 -2685 749 3295 1485 -2397
1085 -2397 -1694 3162 3321 -1769 -2825 1288 3116 -1341 -4272 655 4503 -1475 -6800 -678 7042
1100 7042 1858 -7809 -3826 6778 5780 -3514 -5963 1264 7143 2579 -5611 -3733 4560 4661 -3563
1115 -3563 -4877 2273 3337 -3001 -3559 1863 2272 -2114 -3312 1390 4389 -377 -4470 220 5489
1130 5489 1850 -3819 -1457 4014 1659 -3459 -1465 2948 2205 -3475 -5108 2043 6053 -1692 -7746
1145 -7746 -146 7916 1852 -7384 -2920 7010 5513 -3559 -5478 1297 6179 1265 -5230 -1564 4116
1160 4116 794 -4672 -1781 3814 1441 -4367 -2900 2946 3106 -2061 -3845 1826 5448 -793 -4960
1175 -4960 1127 5208 115 -3686 169 3339 -537 -3994 -984 3558 2168 -4191 -5498 2663 6641
1190 6641 -2113 -7160 984 7543 1243 -6203 -2385 5650 4615 -2731 -4500 1243 4426 -704 -4353
1205 -4353 558 3771 -1277 -4449 -535 3254 1182 -2785 -1875 2180 2357 -1738 -2231 2707 4097 -1978
1221 -1978 -3395 2448 3100 -2007 -2388 1864 2433 -1934 -4456 -441 4274 1898 -4525 -4308 3552 4911
1237 4911 -2845 -4587 2546 5092 -207 -4377 -662 4410 2374 -3136 -2700 2522 2467 -3310 -3683 2760
1253 2760 3420 -2634 -4417 316 3722 1282 -3159 -1599 3528 2884 -2808 -2688 3286 3852 -2008 -3353
1269 -3353 1224 2516 -692 -2430 -535 2052 524 -3261 -2273 2735 2764 -2001 -2950 1642 3071 -838
1285 -838 -1893 1258 2607 213 -2094 -593 2291 779 -2485 -889 1923 393 -2825 -1817 1804
1300 1804 1642 -1351 -2108 142 2367 1153 -2064 -915 3034 1715 -2371 -1270 2455 1823 -1990 -1429
1316 -1429 1385 725 -1832 -1734 810 1614 -913 -2796 165 2688 559 -2054 -392 2508 1629 -1726
1332 -1726 -1614 1974 2751 -830 -3575 212 3892 -140 -4770 -887 3897 850 -4171 -2029 2987
1347 2987 2514 -1814 -2548 899 3174 1010 -2764 -1032 3287 2291 -2439 -2757 1761 3162 -1781 -3786
1363 -3786 689 3153 -874 -3669 -300 3092 559 -2593 -614 2092 1149 -462 -664 384 1480
1378 1480 481 -1190 -622 1174 742 -1773 -1400 1557 499 -2219 -607 1672 19 -2187 -227 2264
1394 2264 708 -1821 -212 2062 1167 -801 -850 848 1357 -272 -1482 -514 1105 826 -1662 -1904 967
1411 967 1494 -1352 -1888 950 2165 -909 -1940 1355 2332 -836 -1554 1035 2105 -308 -1878 -20
1427 -20 1717 266 -1815 -1449 956 1893 -1251 -2943 389 3104 420 -3032 -1116 3374 2401 -2443
1443 -2443 -2055 2393 2779 -1225 -2759 469 2520 -46 -2407 -1161 981 1113 -960 -2020 313 2009
1459 2009 -139 -2141 -96 2577 948 -2025 -288 2310 779 -1577 -812 1260 895 -1133 -1254 123
1475 123 462 -166 -810 -630 355 716 -603 -683 610 1308 148 -626 530 978 -346 -237 1080 473
1493 473 -1051 -858 827 468 -1524 -907 965 433 -998 -1264 40 1413 595 -973 -594 984 1328
1510 1328 -317 -1205 904 1856 -518 -2050 -38 1665 19 -1958 -526 1336 -112 -1754 -420
1525 -420 1514 1193 -1048 -1393 956 1992 61 -1447 -15 2298 688 -2469 -1425 2106 1945 -1708
1541 -1708 -2951 298 2457 -284 -2712 -473 2287 974 -2017 -1461 1512 2087 -269 -1508 92
1556 92 1664 650 -1461 -544 1412 432 -1639 -1061 768 517 -1182 -846 953 571 -953 -922 909
1573 909 1748 -3 -1482 280 1877 404 -1154 -310 1412 676 -1192 -1255 108 978 -179 -1307 -355
1590 -355 892 -168 -1018 488 1045 -40 -683 267 1063 92 -555 380 1289 12 -1590 -820 1718 1348
1608 1348 -1885 -1978 915 1753 -834 -2277 -138 2384 911 -2026 -1324 1939 2447 -1010 -2134 937
1624 937 2228 -442 -1820 -11 1394 269 -1788 -1101 1175 978 -1460 -1689 1171 1837 -1108 -1781
1640 -1781 1106 2149 -377 -1638 132 2103 813 -1868 -1167 1619 1560 -1568 -2091 830 2086 -787
1656 -787 -2169 -200 1696 596 -1507 -1090 1473 1631 -805 -1069 953 1270 -545 -701 810 499 -857
1673 -857 -856 258 711 -343 -1592 -513 1750 534 -1890 -1012 1814 1565 -1180 -1257 1188 1819 4
1690 4 -1271 -197 1524 372 -1474 -735 1038 220 -1544 -739 862 539 -1057 -904 607 826 -372
1707 -372 -1049 416 1763 -65 -1588 619 1912 44 -2010 -560 1852 874 -1926 -1930 894 2194
1723 2194 -689 -2723 -318 2581 918 -2005 -1246 1467 1751 -359 -1338 310 1457 321 -1211 -475
1739 -475 1137 166 -1280 -324 868 -46 -1151 -394 770 624 -758 -637 783 911 -331 -697 498
1756 498 1352 -178 -1357 234 1202 51 -1300 -737 1013 880 -1141 -1525 251 1393 94 -1485
1772 -1485 -476 1340 635 -495 -407 559 849 -182 -486 363 322 -337 -497 213 378 -633 -958 257
1790 257 679 -106 -985 -376 831 709 -584 -556 744 870 -278 -553 505 935 -310 -1075 3 830
1808 830 93 -1128 -707 721 542 -708 -858 266 936 137 -674 -55 919 351 -593 -90 663 421 -498
1827 -498 -413 490 268 -615 -852 32 715 -31 -1007 -363 858 443 -541 -578 393 813 -18 -607 169 708
1847 708 238 -409 -304 530 177 -775 -424 303 197 -527 -569 177 440 61 -511 75 592 400 -547 -82
1867 -82 803 123 -593 29 598 144 -578 -513 295 417 -467 -1074 -175 1065 374 -1152 -507 1107 721 -537
1887 -537 -610 448 1025 13 -943 26 991 183 -994 -483 624 237 -690 -499 12 293 63 -645 -302
1906 -302 486 353 -384 88 756 252 -492 133 756 -169 -677 113 537 50 -703 -627 332 621 -550 -1059
1926 -1059 131 920 7 -1039 -259 1042 809 -523 -669 508 1239 -180 -1257 -7 997 164 -925
1943 -925 -361 403 232 -422 -333 83 320 76 -357 130 585 27 -234 533 551 -189 -488 261 673 -233 -905
1964 -905 -238 561 201 -1059 -870 857 759 -791 -890 448 953 -75 -793 -130 844 841 -496 -855 472
1983 472 1123 -317 -1220 191 936 -263 -963 -107 502 264 -545 -266 460 335 -345 -385 447 598 -216
2002 -216 -316 250 438 -172 -558 -210 499 183 -815 -293 577 149 -923 -488 974 555 -713 -439 517
2021 517 661 -94 -514 212 898 234 -877 -468 680 784 -827 -1047 465 734 -369 -987 108 1062
2039 1062 162 -1038 -286 885 546 -345 -355 338 520 -107 -240 251 304 -81 -536 -119 228 -14 -508 -19
2059 -19 425 -129 -780 -240 987 528 -787 -458 721 690 -380 -618 396 964 -206 -1121 -426 709
2077 709 608 -601 -930 271 770 -260 -800 165 982 124 -808 -169 894 299 -536 23 510 20 -749
2096 -749 -227 670 128 -558 -457 118 227 -279 -535 91 839 57 -816 -340 1228 644 -741 -521 873
2115 873 757 -637 -848 545 945 -219 -928 -242 383 243 -443 -424 484 346 -477 -357 459 730 -161
2134 -161 -829 27 871 -225 -869 210 1114 22 -1134 -510 755 439 -499 -526 182 516 -221 -578 240
2153 240 805 171 -492 -394 613 429 -464 -237 425 90 -706 -425 530 464 -701 -650 401 358 -500 -689
2173 -689 383 776 -52 -861 -202 1067 616 -551 -738 563 742 -582 -1125 172 1049 70 -1133 -555
2191 -555 732 401 -596 -413 584 328 -405 -494 444 592 18 -378 103 497 -5 -462 -26 696 -50 -898
2211 -898 -384 642 432 -697 -632 588 642 -489 -679 346 1036 25 -935 -244 966 435 -576 -557
2229 -557 448 547 -511 -663 43 711 116 -736 -375 445 234 -276 -76 438 330 -300 52 327 306 -193
2249 -193 -173 222 360 -200 -566 122 457 -319 -619 -54 338 -62 -665 -273 612 286 -674 -454 466 734
2269 734 -272 -650 177 673 -82 -568 -224 594 263 -555 -599 225 585 -305 -575 193 636 -94 -488 188
2289 188 553 79 -214 -55 353 224 -292 -325 94 340 -402 -519 99 467 -248 -406 -76 362 165 -372
2309 -372 -371 428 400 -394 -404 415 398 -127 -404 94 249 -84 -303 -366 140 178 -146 -450 121 224 -72 -323
2331 -323 48 184 -15 60 70 114 18 -23 -18 154 44 -287 -156 175 -31 -423 -106 158 43 -87 -24 -71 123
2354 123 170 -152 -36 384 173 -216 -72 239 79 -198 -122 160 -65 -164 -308 -129 131 -16 -317 -64 357
2375 357 33 -211 -39 233 163 -58 -219 125 249 39 -183 -199 326 32 -378 -229 44 182 32 -238 -232
2396 -232 243 307 -129 -255 206 282 -42 -97 157 147 -70 -79 -107 -43 -133 -156 -83 -11 77 -87 -168 133 225 -94 -106
2421 -106 -45 143 189 -83 -116 166 180 -316 -67 49 105 -164 -277 -2 13 -61 -22 -149 10 133 38 -133 133
2444 133 289 -24 -28 13 87 -59 88 100 38 -70 -101 -22 87 41 -280 -34 136 -16 -149 -48 100 130 -46
2467 -46 -184 14 143 30 -218 -45 232 168 -296 -189 175 74 -182 -162 94 83 -171 -231 49 223 157 -52
2489 -52 57 290 16 -141 -144 216 205 17 -246 -62 193 55 -349 -141 243 195 -120 -155 123 -1 9 -57 141
2512 141 272 108 -111 58 84 60 -196 -138 252 54 -212 -291 88 144 -166 -260 2 256 -56 -231 141 306
2534 306 111 -102 -40 267 80 -152 -208 188 199 -114 -163 159 202 -23 -262 -185 187 41 -168 -109 221 89
2556 89 -108 -98 227 157 -45 -96 67 107 -62 -249 -120 230 51 -261 -232 136 191 -107 -180 216 239 -97 -248
2579 -248 40 214 149 -100 -54 302 -54 -234 -154 201 143 -126 -263 72 119 43 -191 106 289 11 -307 -2
2601 -2 303 32 -126 -40 143 226 -103 -163 80 247 -95 -239 -17 71 68 -374 -52 247 116 -67 -165 280 302
2624 302 -216 -275 186 279 -86 -357 -50 318 -50 -309 -104 122 289 -144 -291 -46 251 -163 -106 134 363
2645 363 -66 -324 34 372 113 -324 -60 337 84 -306 -214 257 279 -143 -286 19 219 -33 -253 -47 449
2666 449 51 -347 -135 283 335 -128 -244 125 217 -148 -237 19 344 -73 -155 -225 201 47 -83 27 86 60
2688 60 -205 75 212 143 -6 -233 157 324 -52 -251 -50 306 -8 -301 -131 242 149 -252 -220 213 179 -242
2710 -242 -120 354 390 -79 -163 57 277 94 -237 -76 143 184 -255 -187 157 248 -161 -289 -54 286 -83 -125
2732 -125 158 252 26 -308 -29 228 213 -214 -322 183 313 -58 -255 31 131 49 -255 -164 120 60 -91 -43
2754 -43 160 -33 -23 -149 245 269 -3 -276 6 137 16 -201 -97 28 41 -223 -175 14 2 -109 -122 213
2776 213 64 -149 -162 105 279 -101 -298 42 111 42 -75 10 75 -69 -186 -72 183 -54 -31 -112 -11 61 -120
2799 -120 -193 151 392 159 -318 -124 308 174 -159 -337 111 248 -13 -145 -30 133 192 -84 -185 101 187
2820 187 -121 -133 145 88 -104 -140 143 167 34 -136 8 65 -10 -87 -91 142 -112 -200 -28 89 192 -141 -26
2843 -26 104 201 40 -259 13 230 152 -162 -115 124 156 -41 -28 -166 34 21 14 -26 16 -18 -69 49 49 102 -91
2868 -91 86 22 35 -129 -15 109 53 13 -18 176 84 -105 -159 76 76 14 -166 -24 117 68 -24 -126 77 59 -22
2893 -22 -27 -73 84 58 -105 -29 -118 25 -128 -2 97 -16 -133 -90 88 187 -35 -49 82 113 39 -173 -109 58 110
2918 110 -38 -96 66 -1 24 -159 -77 56 96 11 46 40 148 79 43 -64 62 45 67 8 60 28 108 -21 124 -133
2944 -133 -177 77 -67 -7 -62 -3 18 -6 -71 -48 19 56 -70 -86 139 40 -28 -77 -100 11 33 24 -57 -66 40 -83 -20
2971 -20 0 -59 -7 39 44 86 -130 -84 36 -103 -52 20 12 12 106 -137 -80 -47 47 -48 -118 75 94 -42 -115 12 84 101
2999 101 56 -18 -55 201 38 -84 -51 42 10 -44 -69 -81 62 55 41 46 46 220 -20 -95 49 70 -40 -44 -31 1 18 -91
3027 -91 -66 11 16 -57 -110 -18 53 -4 8 -30 -87 57 -64 41 -32 96 -10 57 77 42 -63 127 127 -28 -119 -84 -8
3054 -8 23 3 -107 9 181 -41 -17 -112 -54 150 -18 -96 18 92 -56 24 -105 76 75 56 -9 -6 12 41 -74 14
3080 14 -95 -83 51 0 41 37 -140 4 -19 -29 -23 137 141 -34 -101 -55 105 53 -67 -66 26 -81 -124 -28 -109 10 -19
3107 -19 -137 -77 3 130 45 -83 12 -11 52 33 -71 45 9 -151 43 0 -77 31 -99 -171 17 -32 -57 -23 48
3132 48 -75 -84 -24 -15 13 -87 -101 -57 41 69 -54 -76 0 -36 133 -31 166 72 -21 -52 58 56 -196 60 63 92 -159
3159 -159 -176 -36 -29 -17 -145 -178 18 -38 -178 -29 -40 -23 -79 -42 90 111 38 29 80 136 -43 4 111 114 -12 -125
3185 -125 -45 -6 1 -22 26 11 34 -37 -64 39 -33 -29 -166 39 93 20 -14 8 116 130 -171 -215 10 -29 -77 -87 25
3212 25 144 22 -134 -111 91 129 -128 32 5 118 -65 -66 114 45 -3 -74 28 66 -97 -116 -23 78 -3 -151
3236 -151 -91 59 35 -42 34 93 42 -20 -21 37 74 -77 -85 -45 144 131 -26 -10 37 -65 -123 -148 -61 80 -53 -132 -5
3263 -5 252 17 58 32 84 40 -120 -108 84 24 -86 -71 -50 25 -9 -162 46 1 9 -62 -46 81 -43 -1 -41 7 10
3290 10 -140 -74 103 123 -106 -84 -23 140 -5 -180 -92 -30 72 -209 -71 113 226 12 -110 14 207 -49
3312 -49 -58 18 54 33 -31 -89 153 14 15 -142 -47 111 -45 -144 -19 85 41 -84 53 171 129 -45 -56 9 -19 -258
3338 -258 63 77 71 -131 -159 173 119 -65 -111 86 -3 -145 -133 33 57 57 -69 -90 71 188 -44 -115 53 38 -35
3363 -35 -122 45 135 -29 -2 -22 34 68 5 -13 114 84 -101 -45 106 8 91 58 11 39 54 -65 -25 1 28 -185 60
3390 60 77 126 -97 -78 39 57 15 -73 36 104 37 11 -58 15 70 -164 -185 89 41 43 -58 -64 -31 -11 -71 -51 -32 -54
3418 -54 21 -4 131 51 -93 -112 -55 32 0 -52 13 50 -10 23 24 90 103 -113 -124 81 30 -161 -27 -4 97 -20 -24
3445 -24 20 61 159 -103 17 35 -74 -50 -43 -15 136 -98 -65 -75 94 66 -161 -71 -31 54 -164 -41 -55 -12 -33 103
3471 103 129 90 71 -62 -17 113 -38 -103 -44 143 61 3 -26 14 36 -16 54 -84 19 4 -13 -20 16 28 -4 -7 -31 29
3499 29 -122 -106 34 48 -113 -58 -7 85 -58 -7 76 -41 26 -100 -68 74 -11 37 -54 27 42 121 -8 29 -104 67
3525 67 55 17 -17 51 74 78 16 -26 -92 74 4 -135 -12 -60 -15 24 -85 -10 52 78 78 -116 -89 44 2 -66 -27 68
3553 68 92 20 39 -11 9 149 -1 60 -14 -80 41 54 97 -43 14 6 103 -41 24 -16 -106 126 -7 -151 -23 -105
3579 -105 68 -164 -55 40 44 -17 -81 -83 24 4 -81 -123 -89 127 27 -49 85 25 -46 -9 -45 5 -4 -2 54 38 -38 -1
3607 -1 -16 -73 -15 -49 45 36 -5 -30 105 96 3 57 -28 2 28 17 -97 46 26 7 102 -90 -61 53 11 -28 15 -114 -76
3636 -76 0 -15 -64 24 16 -58 73 53 151 54 65 -10 60 -114 75 68 -114 -13 -97 21 59 81 11 79 19 -2 14 -23
3664 -23 64 -17 -30 150 -9 28 35 -47 47 -28 55 3 100 -113 -1 -48 33 70 -91 -67 25 136 42 23 -58 184 58
3691 58 -75 -60 25 41 -5 -135 92 8 41 -86 71 -6 1 56 -94 -68 -94 -62 -21 45 -132 27 165 -16 91
3716 91 69 16 -62 42 33 -40 -65 -8 -23 -17 -41 33 -31 -23 -96 5 113 -11 -47 17 -52 79 -78 -87 -5 8 -46 9 -48
3745 -48 55 4 -46 65 22 110 56 -25 113 17 -68 78 42 117 -20 -45 -42 86 -6 -87 -18 57 129 -78 -34 -15 -74
3772 -74 -35 -38 7 51 96 -127 -29 -6 -33 -5 69 69 -46 7 -33 43 110 4 24 151 -41 50 -31 -78 44 53 -88 -20
3800 -20 83 56 -25 -48 51 130 50 -56 1 -34 56 -19 -63 -14 -21 -91 -64 -65 -37 148 12 -24 65 46 20 -5 -2 60 -57
3829 -57 -50 65 29 -106 -15 -11 95 -41 -23 -11 51 53 -73 -38 109 76 -70 -131 -46 32 30 -61 27 28 -64 -96 16 -14 -40
3858 -40 4 -68 113 -26 -13 100 -57 50 73 -141 -66 57 -17 -60 39 93 -66 -38 -6 43 -56 -144 -124 -104 58 -88
3884 -88 -12 -10 36 -8 -6 -33 55 -1 -21 -14 8 57 -37 120 -34 61 -46 -43 -69 -8 -25 -128 -55 24 21 -43 61 90 82 -29
3914 -29 -86 28 45 -102 3 -6 10 11 3 38 -10 110 -43 -120 14 100 -84 3 99 173 17 40 10 36 67 -55 26
3941 26 101 32 57 75 -15 -69 35 -34 -62 66 -41 -183 15 52 -26 29 -100 -12 43 -19 -73 -90 -18 -6 39 -66 47
3968 47 -39 -47 31 58 -86 -109 -33 121 -8 -1 -97 132 112 -82 5 37 -35 -48 17 -82 76 -71 0 53 39 2 20 62
3996 62 111 -42 -36 -107 1 57 -96 27 -46 50 77 -100 36 -14 87 -95 -1 -11 -25 -32 -79 28 108 33 -106 40
4022 40 -28 -46 11 53 -48 -20 -67 -21 46 17 21 -137 -1 51 -41 -115 -24 0 -13 -72 -26 22 58 -3 -6 -96 -29 -93 -20 44
4052 44 -56 18 40 -97 55 -44 0 25 29 11 -37 -12 -2 31 -118 -11 -30 -40 5 -18 -21 40 -22 -60 -138 -13 87 -84
4080 -84 18 -59 56 -7 -103 2 18 -2 -26 35 5 -42 -3 -40 137 -73 -65 3 -118 -85 21 -58 -41 68 22 9 -35
4107 -35 -64 114 -10 13 -23 4 -55 -27 -41 34 72 129 29 -38 85 -47 -84 -17 -27 -130 -35 50 69 20 -86 -67 46
4134 46 57 -30 -101 63 61 -127 84 -17 -36 119 -59 78 -50 82 92 -101 68 -40 40 6 -30 119 47 43 115
4159 115 34 -35 -31 19 -38 -4 17 -58 90 -115 -13 18 -75 -33 -99 -43 -24 4 -87 50 101 13 22 -117 -52 40 -30 -77
4187 -77 2 25 12 -55 -44 -43 8 94 87 15 77 -65 -22 -97 101 8 -39 43 -26 -27 -52 -132 27 -72 -80 -2 -7 -77 38 63 -77
4218 -77 -21 -29 -26 63 48 67 -42 99 28 -21 6 -32 -77 120 73 -66 -84 -100 -75 111 -64 -23 -14 93 -20 -33 -16 57
4246 57 7 24 14 8 -77 20 -131 37 -113 18 -15 45 -53 -41 -81 -69 47 40 72 25 76 50 106 85 30 -100 72 -45
4274 -45 -16 -26 -118 -75 -2 -107 -17 140 37 69 53 -17 71 -19 106 3 -45 21 56 92 42 13 92 37 -80 -95 -46
4301 -46 -31 -174 -40 106 19 22 -10 96 93 9 -15 -40 125 54 -75 -27 -84 64 52 -30 8 12 -41 62 -97 57 51
4328 51 7 107 -11 27 85 -83 -33 -49 -18 9 40 24 -108 82 101 -31 -132 35 57 59 -48 -28 47 36 -1 -94
4354 -94 41 -17 -46 -191 19 142 -34 -47 -129 36 13 -152 9 15 18 -6 19 -40 -30 -68 -37 -73 64 85 82 -35 27
4381 27 31 -83 23 52 33 -85 -86 41 33 -1 33 -22 57 -68 90 -66 8 52 83 -100 -6 57 -117 -106 -82 107 -63
4408 -63 43 -122 107 39 -14 -30 -35 21 -92 -61 -48 22 -7 158 -4 55 -42 -5 -86 133 -2 -76 40 118 104 4
4434 4 -52 -10 14 56 95 20 43 36 60 -43 40 64 14 79 110 45 -30 180 103 -9 -62 -72 36 37 9 89 0 -130 10
4463 10 -47 -22 27 64 -10 23 -93 26 -45 -68 45 -59 -28 -4 -121 67 -7 36 36 15 29 -29 133 -76 -19 9 138
4490 138 35 -11 0 112 -18 54 9 -13 -67 54 4 -89 0 22 72 -70 -102 10 -47 62 -55 -66 25 -98 -10
4515 -10 1 61 19 33 -29 35 -82 -102 4 -52 68 -43 13 103 -81 48 -71 -15 69 -3 -49 -7 -33 90 7 -30
4541 -30 -20 -23 -75 -117 46 52 -21 -80 27 -145 68 59 -122 2 -73 -73 -86 -77 -34 118 -3 26 -2 -55 11 -69 30 -65 10
4570 10 36 -27 40 -20 -55 13 -69 50 52 -70 -6 -79 21 86 -72 -25 -12 38 145 -22 96 104 -36 63 -2 -19 -82
4597 -82 -38 83 -25 83 -120 -22 91 -1 9 -59 -37 76 -41 65 -37 24 -42 82 -31 25 -154 -67 75 59
4621 59 11 84 3 76 151 -3 -35 52 22 -43 22 -29 21 7 24 80 -7 -35 69 -30 48 -41 -82 81 95 71 -74 -54
4649 -54 -48 99 -75 -63 20 -125 13 110 47 181 10 -81 -123 -28 -23 31 -25 129 27 -96 -35 114 118 -143 -61 46
4675 46 -27 -20 -159 35 61 -202 5 -91 -31 29 66 -81 68 53 -44 -28 22 55 -39 2 25 41 35 54 -51 56 3
4702 3 -41 76 44 25 -14 -53 -86 8 -52 -4 35 69 -21 -8 33 12 82 1 -83 41 38 -97 116 -12 8 -5 -10 -23 -19 -18
4732 -18 34 66 -15 64 29 41 33 51 -113 33 -19 84 -3 19 -14 35 -26 -51 44 87 49 20 10 12 -56 2 -43 64 154
4761 154 -39 10 -42 16 14 -112 -51 18 2 -36 -18 14 19 31 -46 32 76 -39 28 10 17 56 137 24 0 2 25 -41 -18 -115
4791 -115 0 -90 -36 -27 66 49 -63 -66 29 -61 -63 104 -51 -21 -18 -13 66 -10 -28 -127 115 -22 20 -28 -9 -92 -51 -66 23
4820 23 4 -35 36 -31 -15 5 6 -22 94 -86 -14 -75 71 -36 -30 110 -40 -58 14 -14 29 106 -17 15 -36 10 29 -76
4848 -76 -86 98 -111 -15 -82 -31 -86 -17 -24 -61 29 109 91 -15 93 131 14 -25 4 -5 -34 -66 -21 -33 100 -111 -43 -32
4876 -32 34 113 -11 11 -27 30 40 -11 -50 -16 -71 22 57 -1 -3 -2 -6 40 -136 38 -37 91 -60 105 8 62 94 38 70
4905 70 -57 39 73 47 -36 42 -109 18 -61 13 69 -79 -32 18 -121 -83 -43 20 20 -12 -138 -43 94 -41 39 10 11
4932 11 -37 -50 -60 28 -39 51 8 -45 52 -97 67 -115 -80 44 -80 11 -98 -18 66 9 41 17 -69 -17 15 -20 -56
4959 -56 76 8 52 -56 -56 -13 -98 104 86 0 66 -2 77 27 -28 -54 -7 -46 -34 95 86 -57 2 -106 -97 -40 6 -37 -57
4988 -57 13 -39 67 23 -34 -120 -52 44 22 -17 -54 -80 -8 -55 -10 -37 161 26 98 142 13 46 19 121 -26 15 -51
5015 -51 28 98 51 8 -9 -168 -53 1 -25 -13 72 -5 -58 -25 140 52 -10 -17 8 107 0 -20 53 -39 -32 -18 98 -46
5043 -46 -3 -67 -107 -98 -17 3 155 11 -64 -1 -81 112 -92 -109 -81 -19 28 -33 -94 38 39 83 -41 23 -30 55 -49 44
5071 44 -35 -62 8 -100 -13 95 76 36 -51 -92 39 18 -43 -52 48 -26 -34 35 77 28 -13 9 89 42 29 -41 -50 -55 -17 -9 -67
5102 -67 38 -90 -17 -29 -21 -16 43 -69 40 11 -77 55 92 68 -90 98 105 37 -70 -70 -49 -58 -65 18 109 14 98 6 -74
5131 -74 3 -30 -40 36 78 3 -51 28 -26 -107 11 67 0 -9 39 73 85 -84 97 -23 -8 -92 -56 38 14 -101 38 -2
5159 -2 -107 20 -4 -30 -47 -22 -8 37 31 -95 -3 -65 15 -26 42 -21 74 24 11 2 -22 -56 28 -5 -29 58 68 -64 -31 -104
5189 -104 -20 3 118 51 -52 -37 -5 118 29 31 -53 2 49 30 69 -55 -40 16 103 30 70 -15 -7 138 111 -26 24 81
5217 81 124 53 -53 -45 -8 -51 25 -44 55 -7 9 -1 -41 -39 -52 -67 -23 -3 -2 103 -67 51 -35 -6 64 -54 93 18 2
5246 2 5 -1 12 -64 3 -20 -18 -28 -39 -93 230 40 26 59 19 24 -24 3 43 62 26 -130 96 79 28 -33 -14 -22 -27 -18 -22 40 9
5279 9 43 6 24 -23 79 51 31 29 -98 29 133 -4 -119 50 67 46 -45 18 65 152 83 -116 41 80 -5 39 34
5306 34 24 14 15 118 14 176 -103 10 39 92 28 11 1 -73 55 -57 -1 61 -11 -23 113 78 38 -68 46 58
5332 58 -60 -148 -2 -54 -77 18 -93 66 36 97 -14 54 10 -43 -58 -19 39 25 35 -25 33 181 -7 96 40 -4
5358 -4 -19 -81 -41 -116 129 -47 9 -27 80 42 69 59 -80 -22 53 29 -86 -5 -121 68 141 -3 -107 22 7 31
5384 31 -1 44 114 -5 61 -9 -4 -22 58 -28 3 60 -41 49 -103 35 -73 -94 -54 -30 -5 -39 -14 107 56 -28 -38 -1
5412 -1 144 -14 2 7 -18 -27 -82 -52 36 -7 127 -140 134 93 -25 41 79 94 84 80 -71 93 44 8 -58 -64 65 47
5440 47 -112 -96 31 -6 -13 -76 22 52 -57 -75 -8 -108 -47 -64 -134 79 1 -4 -28 119 -83 -22 -16 63 -28 13 -93 76
5468 76 48 -91 40 12 106 -47 92 -112 -129 -49 -70 -25 -57 17 -48 -53 41 50 89 -66 -17 -33 68 -68 101 70 -112
5495 -112 -35 -81 92 -79 59 -100 115 16 -4 13 72 5 -57 -108 16 71 71 -161 -7 32 14 2 88 -22 6 42
5521 42 -63 0 -17 -64 27 60 77 -140 -46 -6 -39 -1 58 -67 47 38 -67 45 22 16 -3 -38 -46 77 28 -35 -48 88
5549 88 -7 36 -11 94 20 5 -81 -36 -79 -63 -34 88 -99 76 -124 -69 57 18 49 42 -32 -17 14 13 42 -31 -9 -39
5577 -39 65 -135 22 76 -38 -32 -30 -13 31 74 -9 141 5 -11 -40 71 8 54 20 -21 -7 -34 9 -16 111 -71 -86
5604 -86 23 7 -57 -31 -44 -34 -86 35 -74 -28 -36 69 39 -36 -28 -3 -228 17 35 -3 -7 3 67 17 15 61 -17 43 40 -61
5634 -61 50 6 -42 -10 49 15 -37 26 -40 111 -21 -61 -79 -67 -47 17 35 -26 58 110 -27 -38 4 -73 -12 58 -7 -155
5662 -155 13 -2 -108 -36 49 -59 136 22 44 -76 3 -2 45 17 -58 20 -97 151 -54 9 48 -27 32 -25 59 51
5688 51 43 -56 -59 -13 -80 83 31 4 -75 -20 -52 91 9 43 35 -41 -34 20 61 -29 -44 51 52 -69 11 -71 -29 -34 -38 -18 13 184
5720 184 -23 2 64 -45 1 91 81 19 21 19 28 -47 -102 48 10 13 38 -5 -10 40 21 -19 78 -65 -98 -21 -127 73 -131
5749 -131 3 17 132 27 9 22 -23 56 -80 104 70 34 -6 -19 -22 -32 -51 30 -17 -1 93 -64 89 -74 -51 -2
5775 -2 -27 59 -33 67 -2 48 19 -75 -30 -71 40 -61 0 79 36 -24 -59 76 18 26 87 12 56 29 102 59 -54 -15 -75
5804 -75 69 64 -9 -84 -48 82 25 15 74 -30 35 -84 -50 9 13 -50 72 -131 76 34 -35 16 63 -25 1 79 -20 -76
5832 -76 -112 -2 3 4 -57 -60 141 -34 -21 -56 64 32 -35 -51 -5 11 -40 8 -41 13 37 18 -74 -30 -38 118 -60 -68 8 -62
5862 -62 49 29 -41 43 55 -10 -1 111 -56 -147 53 0 -11 -33 7 10 1 -118 -139 -131 29 49 -36 -66 12 34 77 19 32
5891 32 45 -69 -82 112 -30 120 -33 41 -6 -15 -152 -104 67 -45 -37 -81 -18 7 -60 -136 -30 -51 46 -76 -13 -32
5917 -32 -78 -98 113 81 82 -68 -40 -52 -3 30 -76 91 42 10 -99 -55 -5 -75 -42 -82 24 43 -13 13 32 -1 34 -18
5945 -18 32 -69 4 78 -63 65 -39 -71 -43 -43 41 98 -97 41 46 32 30 -103 -63 -12 25 -27 128 70 -42 -47 -71 -6
5973 -6 14 -24 55 -23 22 -60 91 -149 -93 -24 61 121 -9 -126 121 -2 -84 28 -11 48 -94 -60 -103 76 38 -20
5999 -20 73 -40 -56 -8 32 -1 87 -42 -124 8 119 -13 -128 1 -16 24 -98 -69 9 -72 46 -77 61 28 48
6024 48 -13 -44 3 79 -182 7 -67 -13 123 -65 85 -33 -90 -38 -73 -101 87 58 127 -38 84 -76 -23 -14 18 -5
6050 -5 35 32 26 82 -109 53 87 103 -64 -31 -10 42 31 36 32 74 42 16 18 -22 -24 -19 -35 41 -7 -31 24 -46 36 16 -151 -67
6082 -67 -11 -4 -14 29 -50 -4 -98 -12 88 -82 86 54 77 -30 -14 -39 -11 23 25 15 -13 -91 43 29 28 -49 -87 57 94
6111 94 60 48 -26 -56 25 -65 -28 -112 -57 -27 90 62 -112 50 12 41 -62 -7 51 -56 -13 19 27 -33 7 -41 19 24 -15
6140 -15 18 61 8 -15 -21 -119 89 11 13 -40 -201 40 95 -19 6 -1 -42 -48 69 69 -57 -96 -89 -30 -82 -29 -39 66 -126
6169 -126 52 82 -82 35 -10 -69 4 42 -18 93 -94 100 140 -2 -18 19 22 -2 -60 0 107 -22 51 -55 43
6194 43 -21 104 -16 -20 -84 -13 64 22 -49 -27 -61 75 10 66 -160 -122 96 -50 84 -19 9 84 -128 -97 11 -13
6220 -13 -85 -39 162 28 1 -80 -7 49 -22 -108 -108 141 24 -120 7 -36 36 -102 -38 146 12 13 -50 2 -1 -72 42
6247 42 -19 -5 46 -27 17 7 -48 160 -18 -30 10 -103 69 99 15 28 54 26 75 -124 -48 27 18 -78 19 30 -122 64
6275 64 -54 58 22 -22 53 33 -43 -10 66 90 -39 -89 52 -75 -32 65 -66 -191 9 64 -21 -74 57 1 57 -33
6301 -33 -11 -51 14 68 -52 -2 115 -8 -67 -45 -10 32 29 26 84 51 -14 -5 -50 -19 4 12 -103 12 32 -29 55 -108 -35
6330 -35 16 54 -28 72 -96 -41 -101 123 -65 -70 48 86 82 -54 -9 -122 52 39 -51 -53 71 53 20 -33 101 4 50
6357 50 -42 -67 11 79 -60 -41 53 -7 -28 107 20 -48 50 -10 -20 -63 -81 -25 -68 -1 -39 112 -44 44 25 -67 17 -4
6385 -4 8 -22 -80 -144 -37 14 -96 31 -29 89 18 66 -34 3 45 -57 38 67 100 -64 44 -90 -34 7 -19 62
6411 62 24 -80 -73 42 53 -87 41 -93 49 2 43 19 10 31 -72 -144 41 102 16 10 -103 24 40 -48 105 -4
6437 -4 46 105 37 18 21 -19 25 62 42 -27 -87 27 12 36 -17 24 25 -27 77 77 57 34 -82 26 -73 130 33 54 -75
6466 -75 -66 65 26 13 -46 38 -119 90 32 26 -15 -110 -115 15 -72 -13 120 27 68 -41 -23 -71 141 115 -84 88 34
6493 34 -68 46 -53 -22 25 60 69 -99 43 -37 -31 7 46 -62 47 -128 49 23 55 21 40 9 -43 42 -133 -83 -38
6520 -38 -46 7 3 -37 20 -39 76 43 46 53 27 -33 -132 -45 -5 77 -87 10 108 57 -20 -76 -28 28 -64 -7 38 -34 -67 -59 -29 117
6552 117 89 -94 -59 45 7 20 8 25 -46 79 -63 -35 42 12 -22 -57 29 7 -74 -25 -62 -29 47 30 88 131 25
6579 25 -66 -92 93 16 -45 -84 -44 -113 -4 -95 0 -46 78 -30 -39 -12 11 -5 -178 5 -59 -54 -53 5 38 38 -64 -34 18
6608 18 -52 -2 39 -24 72 2 -56 79 61 -35 64 74 -67 -57 33 -16 -6 -32 -22 4 41 19 -156 -24 -114 32 -84
6635 -84 -56 -14 -51 -153 -67 -2 -51 6 -63 -23 52 93 -25 -4 10 0 87 -60 16 45 -78 -21 180 27 18 18 67 -46
6663 -46 -76 70 51 -18 -60 49 45 -57 12 -2 34 21 83 -21 159 -81 -19 28 36 61 85 -58 107 62 -10 69 0
6690 0 96 73 10 35 100 -51 6 -5 -1 -29 80 -30 77 34 105 -45 -3 -12 30 39 -85 88 -5 -80 10 -104 -116 23
6718 23 -73 -14 10 -7 48 -63 -59 -14 191 -83 -44 -15 -148 76 -26 -66 9 -100 -67 62 -56 165 10 15 22 -56
6744 -56 73 -35 -114 -45 -64 35 -71 -35 -3 27 -3 -26 5 -22 -50 -72 19 56 26 2 0 -35 31 -118 -38 56 0 -15 -85
6773 -85 137 94 8 28 -62 41 -16 -11 -41 -92 48 -63 -140 65 65 -16 -85 -161 -11 -84 -18 -42 -10 -13 120 1 22 -16
6801 -16 103 -19 1 61 48 99 -21 -77 30 -72 81 -28 -2 -51 22 -39 79 1 -40 131 66 72 -60 -109 -44 69
6827 69 -83 111 -25 42 -33 23 13 -87 -70 50 -24 2 72 -12 -23 -50 -7 112 -77 -127 14 107 -133 14 -5
6852 -5 -63 -111 49 -17 -59 -24 -27 17 -22 -102 17 -44 -8 -60 141 -68 19 -75 -58 50 -57 68 -92 48 -39 -43 -42 35
6880 35 -71 21 -27 -48 16 114 58 25 -5 43 56 87 25 6 -25 17 48 -38 -60 11 -62 -7 -48 -87 64 14 -98 37
6908 37 12 36 7 -52 -26 116 116 -44 75 -73 -25 -103 -158 -36 -113 97 -82 -61 -18 32 -5 25 -1 79 5 -3 42 62
6936 62 -67 -159 53 40 -28 12 83 -5 -73 -29 -24 -33 48 65 -3 -27 13 183 18 -49 -24 -71 -5 -37 136 -51 -78 75
6964 75 -44 44 -13 27 104 19 -73 -64 116 -10 -49 -15 81 14 123 -19 -19 70 33 -17 20 6 -99 65 124 -14 -36
6991 -36 44 19 21 -29 -20 10 107 -28 -25 34 -10 -32 46 19 5 -39 -43 -6 -34 4 -50 -29 -47 -17 70 -91 -20 141 -22 28
7021 28 -38 44 -27 26 -17 49 -46 -73 47 43 -16 -65 15 30 17 75 -3 39 -21 -70 -83 27 14 -65 -4 19 10 -30 -145 -6
7051 -6 -70 54 -56 -87 15 -62 -16 -86 129 -30 64 -53 -66 -76 73 -3 -71 -73 22 46 93 9 -50 39 6 27 8 -77
7079 -77 -17 -10 54 73 87 7 51 4 -5 -76 -53 37 -60 42 -42 35 -3 -60 -51 43 -43 -6 -37 -40 43 4 -72 27 -9 45 42 71
7111 71 -19 28 40 44 -51 69 110 -111 91 42 63 65 -41 -51 20 -34 -127 -6 -43 2 27 76 62 -28 80 -14 -2 -49
7139 -49 36 10 -76 -37 -70 73 -35 -97 -75 -22 83 -15 -77 52 75 41 81 40 105 18 -128 -25 -20 -128 32 -102
7165 -102 -48 113 2 27 -20 50 -9 -14 -15 -32 -108 -47 -61 144 -126 67 -7 31 -13 -40 -9 -98 -179 18 48 20 4 -81
7193 -81 -49 -43 64 60 39 44 -1 -85 -17 157 19 -82 9 -31 -5 50 -39 -43 23 -16 55 -46 -35 -24 -37 98 57 7 -84
7222 -84 100 18 52 73 66 -3 -11 6 -8 -39 -40 -164 -2 -1 -158 102 -168 -26 -45 -50 24 84 -22 102 -51 -43 14 112
7250 112 8 -8 -24 -50 102 -137 -20 -26 -2 -93 24 -8 -162 -61 77 112 44 44 48 -99 -39 -14 -17 93 -14 71
7276 71 -103 59 8 35 22 -120 97 2 72 20 8 -94 61 -80 -42 -39 42 -65 -34 -85 21 26 -6 52 58 -85 -27
7303 -27 13 6 -12 58 55 -113 14 -32 40 25 2 24 -151 53 -19 -59 -33 124 21 -135 17 1 -71 62 -62 32
7329 32 -2 73 22 -59 119 -30 -46 -61 0 104 9 -32 27 -52 -33 139 -40 -5 -73 -76 -49 6 -8 -67 40 23 -69 -18
7357 -18 43 -101 -38 17 -48 -103 -62 -18 -50 -24 84 104 20 17 -46 83 35 147 166 -30 -53 38 131 53 -37 84 -14 -17
7385 -17 48 -67 20 -29 -30 -150 -54 99 20 -53 49 -7 -24 -57 85 -14 47 1 -78 -22 63 28 25 -91 -107 -79 21 39
7413 39 -23 -66 8 61 -46 -25 42 -93 24 -51 36 -68 -2 -1 74 -37 8 35 -85 -78 35 9 70 -51 -58 89 -53
7440 -53 6 33 87 29 7 18 55 -83 -31 51 67 -43 58 -65 51 -38 81 3 31 99 -53 27 39 -49 -28 47 3
7467 3 6 -167 -35 21 -64 22 32 -47 58 41 -14 37 31 -3 12 -17 101 18 -59 28 14 42 -4 94 44 13 38 5 66 122
7497 122 -139 -24 -73 -32 -15 -46 -101 13 -10 31 21 -1 72 63 22 35 56 -17 24 -111 -63 60 121 -135 -40 63 -105
7524 -105 66 27 -7 -195 -113 -86 -19 -76 -37 -11 -2 -3 28 -6 5 -43 1 -10 -43 121 -40 19 54 59 23 68 42 11 30
7553 30 -79 71 -25 80 2 0 -177 14 -37 -44 -5 -24 54 92 21 55 17 29 26 82 25 -39 18 65 -68 16 39 -54 -25
7582 -25 -11 -7 38 81 -2 18 -56 31 -12 -128 0 -27 23 30 -2 30 4 -73 -121 116 8 -6 9 15 103 -16 -68 -12 15
7611 15 58 17 -3 0 3 7 28 135 -38 49 19 0 8 75 78 3 26 -52 86 89 28 23 92 -55 -2 -5 -20 -39 146 -27 -30 46
7643 46 -40 -66 -41 60 23 4 25 -74 19 30 -91 81 -29 -3 24 -49 -36 99 32 -16 -25 43 22 75 -12 22 -15 20
7671 20 131 -9 32 -48 -8 16 -1 21 -34 16 -66 -20 54 -33 64 41 -86 -75 36 89 94 -18 22 36 48 -29 -110 -39
7699 -39 32 -13 63 29 -52 94 32 -89 -66 -75 -8 -91 42 116 -131 -31 21 4 56 -24 16 20 55 -75 17 20 -78 -36 30
7728 30 29 -41 25 45 -11 53 -13 -82 -142 -60 44 -35 -61 87 -91 -42 -63 141 -73 67 59 39 13 24 -126 22 10
7755 10 -28 -8 -40 133 21 15 -85 -8 50 8 -12 -25 -16 72 -26 -53 -140 15 -83 29 -3 38 -46 -44 -1 -42 -49 -12 -61 -53
7785 -53 43 -11 34 29 -51 39 -1 17 36 -4 -39 -43 -20 125 57 -137 30 14 -9 5 -75 69 32 116 33 -58 -13 -28 -106
7814 -106 -106 21 -100 53 37 -25 43 -2 83 3 -87 -11 -57 -45 -57 -6 -98 -54 29 -63 -92 5 -16 75 9 -9 -28 109
7842 109 47 -12 35 -32 61 -58 -47 -60 -15 23 -163 -37 163 -28 -19 -75 -142 -18 66 15 -31 -99 -91 -10 -46 49 -135
7869 -135 -95 -64 2 -53 -16 -57 57 -116 33 15 -95 68 38 47 51 -18 103 93 20 -29 -18 63 -28 153 -4 107
7895 107 10 -63 42 3 23 3 -18 -57 -58 -24 12 -60 125 2 -44 -77 75 -13 -69 58 -57 -43 -60 -72 -34 60 39
7922 39 18 27 87 -63 -42 -111 59 -110 -55 -52 47 92 -15 -10 119 28 54 -35 121 -76 -39 16 -11 30 88 70 43 -83
7950 -83 46 2 18 32 89 -15 53 58 -18 55 18 41 0 -7 -63 29 30 -121 -89 -125 30 -40 -39 -14 39 -6 56 -41 -108 6
7980 6 -41 -113 -54 -133 -38 69 25 19 -82 -178 32 153 -32 120 -43 25 17 -23 -90 8 103 10 119 72 -36 58 66 132
8008 132 -2 13 84 -47 61 1 -38 25 -19 -23 37 -89 -3 -21 -173 -18 -33 -62 98 -39 42 -60 -90 -28 -93 -35
8034 -35 41 22 -38 35 -16 -18 -9 -32 50 -5 -3 103 -17 -59 46 71 -53 -62 -16 41 -48 56 14 -35 -39 6 71 -28 49 26
8064 26 46 9 55 51 -104 -112 20 -89 15 -2 -11 -11 60 -83 41 91 -158 49 -155 -24 -32 90 -40 -117 -10 30
8090 30 56 27 27 83 -45 -6 -72 82 51 104 63 -50 81 -46 1 -20 -29 -47 24 -7 -1 33 -73 60 -63 54 12
8117 12 -10 27 -71 -14 -45 -44 34 -32 169 12 50 18 26 13 -18 83 121 16 50 31 48 -2 76 -26 -48 -19 -75 -75 -7
8146 -7 29 -94 22 -47 -26 13 60 -15 -17 46 -45 -131 -107 78 -78 55 -28 90 -7 -64 8 50 7 -64 114 22 -98
8173 -98 86 60 -62 2 74 112 25 78 -118 -67 46 -73 -7 93 36 44 -65 -70
8191g0
##END NTUPLES=NMR FID
##END=
