##TITLE=1H_DE-80H_X3
 200.13MHz, d2o
 8 sc
 
 19ns.26.2.2025
##JCAMPDX= 6.0         $$ Bruker NMR JCAMP-DX V2.0
##DATA TYPE= NMR FID
##DATA CLASS= NTUPLES
##ORIGIN= UXNMR, Bruker Analytische Messtechnik GmbH
##OWNER= pz
$$ XWIN-NMR		Version 3.5
$$ Thu Jun  4 10:54:39 2026 Russian Standard Time (UT+4h)  Yarkov@DPX200
##.OBSERVE FREQUENCY= 200.1313
##.OBSERVE NUCLEUS= ^1H
##.DELAY= (6, 6)
##.ACQUISITION MODE= SIMULTANEOUS
##.ACQUISITION SCHEME= undefined
##.AVERAGES= 8
##.DIGITISER RES= 18
##SPECTROMETER/DATA SYSTEM= spect
##.PULSE SEQUENCE= zg30
##.SOLVENT NAME= CDCl3
##.SHIFT REFERENCE= (INTERNAL, CDCl3, 0, 14.3821)
##AUDIT TRAIL= $$ (NUMBER, WHEN, WHO, WHERE, WHAT)
$$ ##TITLE= Audit trail, XWIN-NMR		Version 3.5
$$ ##JCAMPDX= 5.01
$$ ##ORIGIN= Bruker BioSpin GmbH
$$ ##OWNER= Yarkov
$$ C:/Bruker/XWIN-NMR/data/yarkov2/nmr/H-C/1/audita.txt
$$ ##AUDIT TRAIL=  $$ (NUMBER, WHEN, WHO, WHERE, WHAT)
(   1,<2026-06-04 10:53:46.68 +0400>,<Yarkov>,<DPX200>,
      <created by zg, POWCHK disabled, PULCHK disabled
       configuration hash MD5:
       00 E9 B6 7A A2 85 ED C7 34 08 36 98 17 FE 4E 26
       data hash MD5: 16K
       23 CA 1E 6B AB 8B E5 BD 2F 38 F3 14 C8 D6 0C 88>)
$$ ##END=
$$ 
$$ hash MD5
$$ F3 1C D8 22 EE DF EF 87 F4 00 2C D4 9F 07 49 60
##$RELAX= 
##$RELAX= 
##$RELAX= 
##$RELAX= 
##$RELAX= 
##$RELAX= 
$$ Bruker specific parameters
$$ --------------------------
##$DU= <C:/Bruker/XWIN-NMR>
##$EXPNO= 1
##$NAME= <H-C>
##$PROCNO= 1
##$TYPE= <nmr>
##$USER= <yarkov2>
##$AMP= (0..31)
100 100 100 100 100 100 100 100 100 100 100 100 100 100 100 100 100 100 
100 100 100 100 100 100 100 100 100 100 100 100 100 100 
##$AQSEQ= 0
##$AQ_mod= 1
##$AUNM= <au_zg>
##$AUTOPOS= <>
##$BF1= 200.13
##$BF2= 200.13
##$BF3= 200.13
##$BF4= 200.13
##$BF5= 200.13
##$BF6= 200.13
##$BF7= 200.13
##$BF8= 200.13
##$BYTORDA= 1
##$CFDGTYP= 0
##$CFRGTYP= 5
##$CHEMSTR= <none>
##$CNST= (0..31)
1 1 145 1 1 1 1 1 1 1 1 1 1 1 1 1 1 1 1 1 1 1 1 1 1 1 1 1 1 1 1 1 
##$CPDPRG= <>
##$CPDPRG1= <>
##$CPDPRG2= <>
##$CPDPRG3= <>
##$CPDPRG4= <mlev>
##$CPDPRG5= <mlev>
##$CPDPRG6= <mlev>
##$CPDPRG7= <mlev>
##$CPDPRG8= <mlev>
##$CPDPRGB= <>
##$CPDPRGT= <>
##$D= (0..31)
0 0.7 0 0 0 0 0 0 0 0 0 0.03 0 0 0 0 0 0 0 0 0 0 0 0 0 0 0 0 0 0 0 0 
##$DATE= 1780556026
##$DBL= (0..7)
120 120 120 120 120 120 120 120 
##$DBP= (0..7)
150 150 150 150 150 150 150 150 
##$DBP07= 0
##$DBPNAM0= <>
##$DBPNAM1= <>
##$DBPNAM2= <>
##$DBPNAM3= <>
##$DBPNAM4= <>
##$DBPNAM5= <>
##$DBPNAM6= <>
##$DBPNAM7= <>
##$DBPOAL= (0..7)
0.5 0.5 0.5 0.5 0.5 0.5 0.5 0.5 
##$DBPOFFS= (0..7)
0 0 0 0 0 0 0 0 
##$DE= 6
##$DECBNUC= <off>
##$DECIM= 32
##$DECNUC= <off>
##$DECSTAT= 4
##$DIGMOD= 1
##$DIGTYP= 9
##$DL= (0..7)
0 120 120 120 120 120 120 120 
##$DP= (0..7)
150 150 150 150 150 150 150 150 
##$DP07= 0
##$DPNAME0= <>
##$DPNAME1= <>
##$DPNAME2= <>
##$DPNAME3= <>
##$DPNAME4= <>
##$DPNAME5= <>
##$DPNAME6= <>
##$DPNAME7= <>
##$DPOAL= (0..7)
0.5 0.5 0.5 0.5 0.5 0.5 0.5 0.5 
##$DPOFFS= (0..7)
0 0 0 0 0 0 0 0 
##$DQDMODE= 0
##$DR= 18
##$DS= 0
$$ [...]
##$SUBNAM2= <"">
##$SUBNAM3= <"">
##$SUBNAM4= <"">
##$SUBNAM5= <"">
##$SUBNAM6= <"">
##$SUBNAM7= <"">
##$SUBNAM8= <"">
##$SUBNAM9= <"">
##$SW= 18.0517328524113
##$SWIBOX= (0..15)
0 0 2 0 0 0 0 0 0 0 0 0 0 0 0 0 
##$SW_h= 3612.71676300578
##$TD= 16384
##$TD0= 1
##$TE= 0
##$TE2= 300
##$TE3= 300
##$TEG= 300
##$TL= (0..7)
0 120 120 120 120 120 120 120 
##$TP= (0..7)
150 150 150 150 150 150 150 150 
##$TP07= 0
##$TPNAME0= <>
##$TPNAME1= <>
##$TPNAME2= <>
##$TPNAME3= <>
##$TPNAME4= <>
##$TPNAME5= <>
##$TPNAME6= <>
##$TPNAME7= <>
##$TPOAL= (0..7)
0.5 0.5 0.5 0.5 0.5 0.5 0.5 0.5 
##$TPOFFS= (0..7)
0 0 0 0 0 0 0 0 
##$TUNHIN= 0
##$TUNHOUT= 0
##$TUNXOUT= 0
##$USERA1= <user>
##$USERA2= <user>
##$USERA3= <user>
##$USERA4= <user>
##$USERA5= <user>
##$V9= 5
##$VALIST= <valist>
##$VCLIST= <CCCCCCCCCCCCCCC>
##$VD= 0
##$VDLIST= <DDDDDDDDDDDDDDD>
##$VPLIST= <PPPPPPPPPPPPPPP>
##$VTLIST= <TTTTTTTTTTTTTTT>
##$WBST= 1024
##$WBSW= 4
##$XGAIN= (0..3)
0 0 0 0 
##$XL= 0
##$YL= 0
##$YMAX_a= 129732
##$YMIN_a= -99441
##$ZGOPTNS= <>
##$ZL1= 120
##$ZL2= 120
##$ZL3= 120
##$ZL4= 120
##$ABSF1= 10
##$ABSF2= 0
##$ABSG= 5
##$ABSL= 3
##$ALPHA= 0
##$AQORDER= 0
##$ASSFAC= 0
##$ASSFACI= 0
##$ASSFACX= 0
##$ASSWID= 0
##$AUNMP= <proc_1d>
##$AZFE= 0.1
##$AZFW= 0.1
##$BCFW= 1
##$BC_mod= 2
##$BYTORDP= 1
##$COROFFS= 0
##$CY= 83.5205535888672
##$DATMOD= 1
##$DC= 2
##$DFILT= <>
##$DTYPP= 0
##$F1P= 10.8118882576601
##$F2P= -7.23987719738617
##$FCOR= 0.5
##$FTSIZE= 0
##$FT_mod= 4
##$GAMMA= 1
##$GB= 0.15
##$INTBC= 1
##$INTSCL= 1
##$ISEN= 128
##$LB= 0.25
##$LEV0= 0
##$LPBIN= 0
##$MAXI= 10000
##$MC2= 0
##$MEAN= 0
##$ME_mod= 0
##$MI= 1.114404
##$NCOEF= 0
##$NC_proc= 0
##$NLEV= 6
##$NOISF1= 3.799351
##$NOISF2= 2.8
##$NSP= 1
##$NTH_PI= 0
##$NZP= 0
##$OFFSET= 14.38212
##$PC= 1
##$PHC0= -6376.443
##$PHC1= 8.221958
##$PH_mod= 1
##$PKNL= yes
##$PPARMOD= 0
##$PSCAL= 0
##$PSIGN= 0
##$REVERSE= no
##$SF= 200.129724274929
##$SI= 16384
##$SIGF1= 3
##$SIGF2= 2
##$SINO= 400
##$SIOLD= 16384
##$SREGLST= <1H.CDCl3>
##$SSB= 0
##$STSI= 0
##$STSR= 0
##$SW_p= 3205.1282051282
##$SYMM= 0
##$S_DEV= 0
##$TDeff= 0
##$TDoff= 0
##$TI= <>
##$TILT= no
##$TM1= 0
##$TM2= 0
##$TOPLEV= 0
##$USERP1= <user>
##$USERP2= <user>
##$USERP3= <user>
##$USERP4= <user>
##$USERP5= <user>
##$WDW= 1
##$XDIM= 8192
##$YMAX_p= 0
##$YMIN_p= 0
$$ End of Bruker specific parameters
$$ ---------------------------------
##NTUPLES= NMR FID
##VAR_NAME=  TIME,          FID/REAL,        FID/IMAG
##SYMBOL=    X,             R,               I
##VAR_TYPE=  INDEPENDENT,   DEPENDENT,       DEPENDENT
##VAR_FORM=  AFFN,          ASDF,            ASDF
##VAR_DIM=   8192,          8192,            8192
##UNITS=     SECONDS,       ARBITRARY UNITS, ARBITRARY UNITS
##FACTOR=    0.0002768,     1,               1
##FIRST=     0,             0,               0
##LAST=      2.2672688,     0,               0
##MIN=       0,             -99441,          0
##MAX=       2.2672688,     129732,          0
$$ Real data points
##PAGE= N=1
##DATA TABLE= (X++(R..R)), XYDATA
0@%%%%%%%%%%%%%%%%Mj2J6j6J6j6K3l1L2l8M6n1N9p0P8q8J03j18J34j50J66j86
$$ 0 0 0 0 0 0 0 0 0 0 0 0 0 0 0 0 0 4 -8 8 -8 8 -8 15 -16 16 -22 24 -27 32 -38 40 -48 55 -63 71 -79 87 -99
38i9K10k33K58k88L21l56L93m35M82n32N86o45P11p82Q62r51J049j159J282j423
$$ -99 111 -122 136 -152 169 -187 206 -229 253 -279 307 -338 373 -409 453 -498 551 -608 674 -749
58g49J586j774J994k258K584k994L522m240N267o857R674k1559J36248q163k02930
$$ -749 837 -937 1057 -1201 1383 -1611 1911 -2329 2938 -3919 5755 -15804 120444 112281 -90649
73i0649M636J01433M2466o3744j3039K1221k8259J7339N0671N064o3490l9805
$$ -90649 -86013 15420 57886 -5858 -18897 2324 -25935 -8596 42075 47139 -16351 -56156
85e6156N7125N0994j0389o6248K531L9735O3n190l481J969k7041O766N2549j8072
$$ -56156 969 51963 41574 -24674 -22143 17592 17655 12465 8984 10953 -16088 -9322 43227 25155
99B5155n3816J2976O4935j8321n0866K1639L1026k0188l0612L9072J8580m2730
$$ 25155 -28661 -15685 49250 30929 -19937 1702 32728 12540 -18072 21000 39580 -3150
111c150L208L0823j4157m3353J9668N2339j5287n5775K632O5832k53o4225j5274
$$ -3150 58 30881 16724 -26629 -6961 45378 30091 -25684 -23052 42780 42527 -21698 -36972
124c6972N4386L7064n1287l1773M3356J9511l6894j3086L5205O67l2042J659L0563
$$ -36972 17414 54478 3191 -28582 14774 34285 -2609 -15695 19510 20177 -11865 -10206 20357
137B0357n942l0040J5100J1404j9699N80J9748l032k8777O799L7160k805m0298
$$ 20357 14415 -15625 -525 10879 -8820 -8240 11508 8476 -20301 -13502 23658 20853 -19445
150a9445l902L4067K876k1813m059K0862K294l0583L696L0536p967l4341K273
$$ -19445 -23347 10720 13596 -8217 -12276 8586 10880 -19703 -16007 14529 6562 -27779 -25506
163b5506L7234O124l1497j1056K0254J281o657J7107q93k8117o313L6972K4006
$$ -25506 11728 17852 -13645 -24701 -4447 -3166 -9823 7284 6391 -21726 -28039 8933 32939
176C2939l9668l8173K8389M2002j0382l6053q004K2244J5367q548o285m855q368
$$ 32939 -6729 -44902 -16513 25489 15107 -20946 -28950 -6706 8661 113 -6172 -11027 -19395
189a9395J0813J6075j615j4862o543J1769J0454l928n718n080n387J3759J5675
$$ -19395 -8582 7493 5878 -8984 -15527 -3758 6696 2768 -2950 -8030 -13417 342 16017
202A6017j1809k0947j340K2584J0713k1839j2159J6298J2609p124j1044J985R893
$$ 16017 4208 -16739 -18079 4505 15218 -6621 -18780 -2482 10127 3003 -8041 -6056 3837
215C837p10l204O512m414p545R810P807r860j1684R113J7009j0948j9533J0894
$$ 3837 3127 -77 6435 2021 -5524 4286 12093 2233 -9451 -338 16671 5723 -13810 -2916
229b916J5840q692r995M788R194l762r838Q798R401j0135o667Q071R647l971j3464
$$ -2916 12924 4232 -5763 -975 8219 4457 -5381 3417 12818 2683 -3984 4087 13734 9763 -3701
244c701J612J3304k842q382K700N84k810M20M727J100j1303o91J5146R5j2493
$$ -3701 -2089 11215 8373 -9 2691 3275 465 885 5612 6712 -4591 -5282 9864 9959 -2534
259b534m31Q086L957m858n368N753J617n564J444J933q79j456m679K484N058m157
$$ -2534 -2965 5121 9078 4220 -1148 4605 6222 658 2102 4035 3156 1700 -2979 -495 4563 406
275D06l395M94J435M981j311o264J124L532L422j127p175K443O506l758k857J237
$$ 406 -2989 -2495 -1060 3921 2610 -3654 -2530 1002 4424 3297 -3878 -1435 5071 1313 -1544 -307
291c07p83n8j214J320J233o373N39P636l151n322K016M324K025n721j289Q286
$$ -307 -1090 -1148 -2362 -1042 191 -6182 -5643 1993 -1158 -6480 -4464 -140 1885 -3836 -5125 3161
307C161j207p528L091N032p63o574j655R110q0j1227J406P960p43n262k281O322
$$ 3161 1954 -5574 -2483 2549 1786 -4788 -6443 2667 2587 -8640 -7234 726 -17 -5279 -7560 -1238
323a238L155p231N37O648k221k782J645K686J325n701k25P013k665n474J908K615
$$ -1238 1917 -5314 -4777 1871 -350 -3132 -1487 1199 2524 -3177 -3402 3611 946 -4528 -2620 -5
339eO81l814k427N964K1n115K319L370l01j563j579M418K594n359p19L618R79
$$ -5 676 -3138 -5565 399 420 -4695 -2376 994 693 -870 -2449 1969 4563 -796 -1515 2103 3082
356C082J12m107j281N131r33l496P43j64J082k8j350L178j129l873M661K746j725
$$ 3082 3194 -913 -2194 2937 2004 -1492 -749 -913 169 141 -1209 1969 840 -3033 1628 4374 2649
373B649j830j302M564K307o077n85L295k93j276j737J299K446n599j364P137l73
$$ 2649 819 -483 4081 6388 311 -274 3021 2728 1452 -285 1014 3460 -2139 -3503 3634 3261
389C261n156n94L364M144l441l536N059Q77l553R71J643O91k328m249M589L801
$$ 3261 -1895 -2489 875 5019 1578 -1958 3101 3978 425 1396 3039 3730 1402 -2847 1742 5543
405E543n889l434J937L020O64m017J252K813m601R81N751k267m108R09M540L388
$$ 5543 -346 -3780 -1843 1177 1841 -2176 -924 1889 -2712 -1731 4020 1753 -2355 -1446 3094 6482
421F482n473n435L779K999O3k816l583L861J945n602J160L405l185j856K994M444
$$ 6482 1009 -4426 -647 2352 2415 -401 -3984 -123 1822 -3780 -2620 785 -2400 -4256 -1262 3182
437C182k219o395L985O084m097j874J127J7J722j718k154L352Q45m133l538K223
$$ 3182 963 -5432 -1447 4637 540 -1334 -207 -190 1532 -186 -2340 1012 1857 -2276 -5814 -3591
453c591O526l261p394O685M458o023O2L870j858l972K585Q716p71j0084j487N522
$$ -3591 2935 -326 -7720 -1035 3423 -2600 -2538 1332 -526 -4498 -1913 6803 6032 -4052 -5539 -17
469a7M032O67q946n199J0762N656p995n536L218L722j861J457N224p220p483J0642
$$ -17 4015 4682 -4264 -9463 1299 6955 -1040 -6576 -3358 364 -1497 -40 5184 -2036 -9519 1123
485A123Q301n771n468j590K672M344j46l917l487L308O056m660n126L883k953
$$ 1123 9424 3653 -1815 -3405 -733 3611 3465 -452 -3939 -631 5425 765 -4361 -478 -3431
500c431k463R278L983o888m529L214K985l231J355N513m538l624P079k01n718
$$ -3431 -5894 3384 7367 479 -4050 -836 2149 -1082 273 5786 1248 -2376 4703 4502 -1216
515a216o36p54J360M824J262n664o658M369Q281l288l139K247l755P04Q378j620
$$ -1216 -1852 -2606 -1246 3578 4840 -824 -7482 -3113 5168 1880 -1259 988 -2767 -2063 6315 4695
531D695q089J087Q157J347q878k587M777j373Q22N292l497m801o1M20K234J100
$$ 4695 -3394 -2307 5850 7197 -1681 -4268 509 -864 -42 5250 1753 -3048 -3109 -2689 -455 645
547F45j945K77L522L874m534r959N170J0276m806n082M354L030l298n607L15M895
$$ 645 -1300 -1023 2499 6373 1839 -8120 -2950 7326 2520 -2562 1792 4822 1524 -4083 -3768 1127
563A127k85j660l79j406K691P63l861K080K443l363R77L440p09m161p86Q063L027
$$ 1127 842 -818 -1197 -2603 88 851 -3010 -930 1513 -1850 -873 2567 1858 -2303 -3089 4974 8001
580H001j0282n219N327M862J33m965j681N238l10l831P80o8j469J186N358N128
$$ 8001 -2281 -7500 -2173 2689 2822 -2143 -3824 1414 1104 -2727 -1947 -2015 -3484 -2298 3060 8188
596H188p389r319N704Q821j446o284k971N259N295n225m520J850J316R5n43J129
$$ 8188 799 -8520 -2816 6005 4559 -1725 -4696 563 5858 633 -3887 -2037 -721 -626 -1169 -40
612d0M45m816J382P460j980m851J798J121q85j07K683J881l005k149J780j434
$$ -40 405 -4411 -3029 4431 2451 -2400 -602 519 -366 -473 2210 4091 1086 -1063 717 -717
628g17n93R37k432K327M716l620m080J239J645q17m67M809J801o314j46M970k199
$$ -717 -1310 -373 -2805 -478 4238 618 -3462 -2223 -578 -1395 -1862 2947 4748 -1566 -1712 3258 1059
645A059j794J781n51N76J453j683l237k27M351Mm830K332K631n490J194O106k372
$$ 1059 -735 1046 495 1071 2524 841 -2396 -2623 1728 1732 -3098 -766 1865 -3625 -2431 3675 1303
662A303l190K758L092l722m284M887M221m660r93K511j269n99j617k522L763L795
$$ 1303 -1887 871 3963 241 -4043 844 5065 405 -588 1923 654 55 -1562 -4084 -321 3474
678C474k990l470J799L885l955l796P381K643p473J483N981k459m993N93M744
$$ 3474 484 -2986 -1187 2698 -1257 -5053 2328 4971 -2502 -1019 4962 2503 -2490 -1897 2847
693B847m70l834J157N21k204K163j9k439J873Qj544K223J004k384r43L463L556
$$ 2847 2377 -1457 -300 221 -1983 180 161 -2278 -405 -397 -1941 282 1286 -1098 -2041 1422 4978
710D978m718m689N882K411m396l57J796m79n94j116K38J10o13J214o23N0K593
$$ 4978 260 -4429 1453 3864 -532 -889 907 428 -166 -1282 -1044 -934 -1547 -333 -956 -906 1687
727A687k978k029N063Q77l351l20K401J548k725j845L264n52k783J950L66j471
$$ 1687 -1291 -3320 1743 2620 -731 -1051 1350 2898 173 -1672 1592 1040 -1743 207 573 -898
743h98k28q08J891J018l024l39K719J227j039k631K208M184l960k480L753Q52
$$ -898 -1126 -1934 -43 975 -2049 -2388 331 1558 519 -2112 96 4280 320 -2160 1593 2445
759B445k573j191J597K399l448k810L915J011k534r06O87K459J61l247J600K505
$$ 2445 -128 -1319 278 2677 -771 -3581 334 1345 -1189 -2095 -1408 1051 1212 -2035 -435 2070
775B070j830k43N99R85k53k453J272K753l111j652J881Q71n89k341j9L405j214
$$ 2070 240 -3 596 1581 1328 -1125 147 2900 -211 -1863 18 889 300 -2041 -2060 1345 131
792A31k553J705J208K00p36p19K507N92l030P19J736m80r53j616J520K053l375
$$ 131 -2422 -717 491 691 -45 -764 1743 2335 -695 24 1760 1280 327 -1289 231 2284 -1091
809a091j057K370m5m60j275L56K549j600j517K569N20j448J05K34K053p95k820
$$ -1091 -2148 222 177 -283 -1558 -1202 1347 -253 -1770 799 1319 -129 -24 210 2263 1468 -1352
826a352J812J480k227p38K64J451j92l285J341L082k074j847J703J687K43k579
$$ -1352 460 1940 -287 -1025 -761 690 498 -2787 -1446 1636 -438 -2285 -582 1105 1348 -1231
842a231K79L463j196k321J342R27P7j787r24K773l50l328J186J619p51q54q78
$$ -1231 -952 2511 1315 -1006 336 1263 1340 -447 -1371 1402 1052 -2276 -1090 529 -222 -1076 -1954
859a954K194R34k865M39K821p39r98k97J554J532k927j091L115o37j664p1K51
$$ -1954 240 1174 -1691 -1252 1569 830 -168 -465 1089 2621 -306 -1397 1718 1081 -583 -654 -403
876d03J161j587j582K820K82k186R7Q07J933j70l232J950K832j747j429P59R20
$$ -403 758 -829 -2411 409 691 -1495 -1398 -591 1342 1172 -2060 -110 2722 975 -454 305 1225
893A225j51k005Q53J970k541j407J942K47l77j283n85K955O9k208N44J335L53
$$ 1225 1074 -931 -78 1892 -649 -2056 -114 133 -244 -1527 -2112 843 912 -1296 -752 583 936
910I36q33j055K892M55l978R67K844r49k107o07J439Q85k428L99J617j044j49
$$ 936 103 -952 1940 2395 -1583 -616 2228 1279 -828 -1435 4 889 -1539 -1140 477 -567 -716
927g16J31K25J418j250j790L083J726j919j807K68K579r96k610K638O06l100P44
$$ -716 -585 -360 1058 -192 -1982 1101 2827 908 -899 -631 1948 952 -1658 980 1586 -1514 -770
944g70J481j017j139n47K018J434j695n59J65J090J450k039j013L188l90k961
$$ -770 711 -306 -1445 -1992 26 1460 -235 -794 -629 461 1911 -128 -1141 2047 1657 -1304
960a304J301J676p72k330N70K870j998l209K454J263j191O15k8K49L80j734N9
$$ -1304 -3 1673 901 -1429 -859 2011 13 -3196 -742 521 -670 -55 -83 166 546 -1188 -1129
977a129K249R44j135j667J389J954l659j816L848N77k219L17N95k25k301J08L186
$$ -1129 1120 2064 929 -738 651 2605 -1054 -2870 978 1555 -664 -347 248 23 -2278 -2170 1016
994A016n12j468Q12K30R30J46k794R50L425j334j980n4J441j42k051J299K059
$$ 1016 504 -964 -152 78 1008 1154 -1640 -690 2735 1401 -579 -633 808 666 -1385 -86 1973
1011A973k868j738K306m2j52J12N9J581n7j913l18R31J437m16j546K604O43m300
$$ 1973 -895 -2633 -327 -369 -521 -409 -350 1231 1174 -739 -1057 -126 1311 895 -651 1953 2596 -1704
1029a704k09K760n78j062L95R44k80k087Q61J201j031M48N96l51J973j159k838
$$ -1704 -1913 847 269 -793 -398 546 266 -1821 -960 241 -790 -342 254 -97 1876 717 -2121
1046b121K568K393k108j811Q72J509j722j215L488l25l854J121J834j630m67O90
$$ -2121 447 2840 732 -1079 -207 1302 -420 -1635 1853 1528 -2326 -1205 629 -1001 -1468 -778
1062g78J354J045q70o61j256O86J831j431m50L587j271m024J852J902k278j210
$$ -778 576 1621 751 90 -1166 -480 1351 -80 -530 3057 1786 -2238 -386 1516 -762 -1972
1078a972K248J591k704j490K925o40j539K267l01p43J530j076j326J937J942j361
$$ -1972 276 1867 -837 -2327 598 -42 -1581 686 385 -358 1172 96 -1230 707 2649 1288
1094A288k537J496J883l943r36M842o25l239J725Q67k035j219J474J961j62j13
$$ 1288 -1249 247 2130 -1813 -2749 2093 1468 -1771 -46 821 -1214 -2433 -959 1002 840 727
1110G27P67k303O07J646k844M11M053j094l338P15J888j690k765L170K669l635
$$ 727 1494 -809 -202 1444 -1400 -989 3064 1970 -1368 -653 1235 -455 -3220 -50 2619 -1016
1126a016j244L315r96j570J183O56K71O7p08j06P9J534n14k051K095J157m123
$$ -1016 -2260 1055 59 -1511 -328 328 599 666 -42 -148 -69 1465 951 -1100 995 2152 -1971
1143a971n00L868q05k205J122K128j491k998J741K240j692M31J727j034J55j45
$$ -1971 -2471 1397 592 -1613 -491 1637 146 -2852 -1111 1129 -563 -132 1595 561 716 571
1159E71j442O76J413k58j169JJ454j493k529K403J647k530o3J851q4j217j57J631
$$ 571 -871 -195 1218 960 -209 -208 1246 -247 -2776 -373 1274 -1256 -1319 532 448 -769 -926 705
1177G05N66j441K74N53m32O17l18j096J888l17k332K76J347l34j153K26K081n41
$$ 705 1271 -170 104 657 225 842 524 -572 1316 999 -1333 -1057 290 -44 -1197 -971 1110 569
1195E69k491J490J221r70j60M64R50R6j568J44J055k05o68n51P38Q76j777q60
$$ 569 -1922 -432 789 -181 -341 123 1073 1169 -399 -255 800 595 -73 -624 114 990 -787 -1647
1213a647K084j37j568L61Q89N40r43r42K296K30j528K47R76j86l01j024J076J027
$$ -1647 437 300 -1268 -907 -18 522 -421 -1363 933 1163 -365 -118 858 672 371 -653 423 1450
1231A450j803m04Q42j10k08j106Q76J396j255r02J653k6k88m27L18J281n84j273
$$ 1450 -353 -757 85 -25 -233 -1339 -463 933 -322 -1224 429 403 115 -312 6 1287 703 -570
1249e70J060M83o93n91k20J023J99j839L60J256p49n67K56M04P69j295K4J554
$$ -570 490 973 280 -311 -531 492 691 -1148 -788 468 -281 -848 -592 -188 581 -714 -690 864
1267H64j94p30P1L90P18j008j106J908j14j349k01R17R0o52j093J333P85j419
$$ 864 670 -60 11 401 1119 111 -995 913 799 -550 -751 166 256 -396 -1489 -156 629 -790
1285g90P9J060L0j50q41P35J554j699o12J260J07m24j072J93J643j206j396J372
$$ -790 -711 349 379 229 -612 123 1677 -22 -634 626 733 309 -763 -570 1073 -133 -1529 -157
1303a57M94p03l18Q8Q98J4j403J189J021r69k28L59L31M19j613K87J338p32r88
$$ -157 337 -366 -684 -596 302 316 -1087 102 1123 154 -74 285 616 1035 -578 -291 1047 315 -673
1322f73L57K23N14r68o39J598o8j060M51L61L70l22p73J287M03j060m1N56K3k46
$$ -673 -316 -93 421 -547 -1186 412 344 -716 -265 96 466 144 -629 658 1061 1 -40 516 539 293
1342B93j024P07Q18j300l23P45M0o0q27L33J330p19r67J332L67o12o4j42J183
$$ 293 -731 -24 794 -506 -829 -84 -44 -104 -931 -598 732 13 -954 378 745 133 69 -73 1110
1361A110m73j271O34P83q66l05l16Q69L49j676L42J477p25p38N20M61N19j123
$$ 1110 637 -634 0 783 -83 -388 -704 165 514 -1162 -820 657 -68 -806 -286 175 694 -429
1379d29k0J567m07j138M91L32K32o54q06J314j4j083n4P13Q1l05q82J365M08j319
$$ -429 -449 1118 711 -427 64 396 628 -26 -832 482 468 -615 -669 44 125 -180 -1062 303 711 -608
1399f08R8J032Q3m55k34N48M00q57m61J010j21n22k47k48Q99l01j225R70O93l97
$$ -608 -510 522 605 150 -84 464 864 7 -454 556 435 -87 -334 -582 317 16 -1209 -239 454 57
1419E7p25J10J007K3j390R20J085j007pQ2L91j75q79J07Q89l43m95k35M31N40
$$ 57 -668 -558 449 472 -918 2 1087 80 73 155 546 371 -508 -401 488 145 -350 -585 -154 386
1439C86q75m76J532k5j443M38R58J08o86l39J182K40j495L78M09k32o3m29M52
$$ 386 -489 -965 567 542 -901 -463 495 603 -83 -422 760 1000 -495 -117 292 60 -3 -432 20
1458B0M73j025o26J030M84m45m48M59J036j021o59J271K24o13KK26L25k46j271
$$ 20 493 -532 -1158 -128 356 -89 -537 -78 958 -63 -722 549 773 160 162 388 713 467 -804
1477h04P24O04n23k94l13N22L01j164M98J337r43o73N75O93rr21L97J079o61m76
$$ -804 -80 524 1 -293 -606 -84 217 -947 -449 888 -55 -728 -153 540 531 -390 7 1086 425 -51
1497e1K29k72K95n9o52Q26M08j335l62P74M43p02o07J783K43j520J75J052o46
$$ -51 178 -94 201 142 -510 316 724 -611 -973 -199 244 -458 -1065 718 961 -559 -384 668 22
1516B2N5K74J42o5l96k96K72N8M10q73m84J215l21j562J361J426j075o98N66N99
$$ 22 77 351 493 428 32 -264 8 66 476 -397 -881 334 13 -1549 -188 1238 163 -535 31 630
1536F30r18m59J426N90j233M64j66r19M99p5m55Q63M33q51p06O00Q05j368k35
$$ 630 -288 -747 679 1269 36 500 334 -585 -86 -161 -616 247 680 -171 -877 -277 528 -840 -1075
1555a075K366l25j809Q30Q92j105m2O28N84p11o95O32l06k09R59p61m02J017o42
$$ -1075 1291 966 -843 -13 879 -226 -268 360 944 233 -462 170 -136 -345 614 -147 -549 468 -174
1574a74j429J408J019o05p52R04P79j708o25J887rp80O46J9p51p1m26J94M71K88
$$ -174 -1603 -195 824 219 -533 371 1150 -558 -1183 704 695 -85 561 580 -171 -242 -668 -474 -3 285
1594B85j51m34J31N56j504K29J846m95q72P35N41p33o81M34J053j007k21M91l52
$$ 285 134 -300 -169 387 -1117 -888 958 463 -409 326 867 134 -547 -113 940 -67 -288 203 -149
1613a49j61L76l21J78O47p90m58M69M98j42p39J185M40j518k0J144m61k96L06
$$ -149 -310 66 -255 -77 570 -220 -678 -209 289 147 -592 593 1033 -485 -505 639 178 -118 188
1632A88K43O3p94k13K89j68L66j07k36Q59r8j211N47R46n72m01L32Q08n25r27
$$ 188 431 494 -300 -513 -224 -392 -26 -133 -369 490 392 -819 -272 674 102 -299 33 841 316 -611
1652f11R32M75r60p1K02o0O0l19j49P08o2m02k75O52J38n68k23J447n8j263M74
$$ -611 321 796 -164 -235 -33 -93 -33 -352 -501 207 145 -257 -532 120 258 -310 -533 914 856 -407 67
1673F7L92n17p7J53K79J27o94p7J80n1M2l58K33Q97q24k47N36L85o52k8N45L86
$$ 67 459 -58 -135 18 297 424 -270 -347 -167 -218 -176 -534 -301 596 -228 -475 61 446 -206 -234 311 697
1695F97r74j77Q73k07m15L41k20l0j6m35L81K72m7k65q6M78J59j028M18J230n18
$$ 697 -277 -454 419 212 -203 138 -82 -112 -128 -563 -182 90 43 -222 -308 170 329 -699 -281 949 431
1716D31o08N75M2l58n88L82N39l50k96N4jJ56k38m00P32L30o84k8N84J89m31m65
$$ 431 -177 398 440 82 -506 -124 415 65 -231 -177 -178 -22 -260 -660 72 402 -282 -310 274 463 32 -433
1738d33P91N46j141K58M49k93n44J90J38L15n29k86N30q3j56Q9rM17r0o90P69
$$ -433 358 904 -237 21 470 177 -367 -177 -39 276 -253 -539 -9 -92 -248 -159 -168 249 159 -531 238
1759B38L23o58m9L10J53k11o67O09M89n63k1l7L3L9k86j70O31r5m97M41L25j18
$$ 238 561 -97 -146 164 317 106 -561 48 537 -26 -47 -84 -51 -12 -298 -468 163 68 -429 12 337 219
1781B19k33k05P11O4q47L01J53K4j92l99N89M1n30q9L75j70%q7J15M47l48k29
$$ 219 -14 -219 492 556 -291 10 163 187 -5 -404 185 226 -304 -393 -18 -188 -188 -275 -160 287 -61 -290
1803b90M97J42k14k14J83M47l79n69M54J21m99J09L0K36M2n69L50M83n00JJ67
$$ -290 207 349 135 -79 104 551 172 -397 57 178 -321 -212 -182 54 96 -473 -123 360 -140 -139 28
1824B8J97m7k58n5O40k42l56J4M08j33j88j74K87p5n72M93R3m1j20k89L97J60
$$ 28 225 178 -80 -135 505 263 -93 -79 329 196 8 -166 121 46 -526 -33 60 19 -101 -390 7 167
1846A67n11q2M13R8j7k01J29L95m83j55K90J40k86P0j32M26m64l41N16K86m32
$$ 167 -344 -426 -13 85 68 -133 -4 391 -92 -247 43 183 -103 -33 -165 261 -203 -544 -28 258 -174
1867a74k7J59J17P1l96M88K22k25n58M12J04J05o78M11K90m07l34L64J87j16j88
$$ -174 -201 -42 75 146 -250 238 460 235 -323 89 193 298 -380 31 321 -86 -420 -56 131 15 -173
1888a73k48N66j08j84K50J56Pj45l04L20K46p13k6P26k70l03j05L50K41o23K23
$$ -173 -421 145 37 -147 103 259 266 121 -183 137 383 -330 -356 370 100 -203 -308 42 283 -340 -117
1909a17L72k89K8k40L64L02l71m07N51K23l82k57K57J90k06k77K92N5l34k6J16
$$ -117 255 -34 -6 -246 118 420 49 -358 193 416 34 -223 34 224 18 -259 33 88 -246 -272 -156
1930a56Q4M7k10L63N8l3k21p3J41L87l27j79L81L89q39L20J08J22o08J20j10m35
$$ -156 -72 -25 -235 128 186 153 -68 -141 0 387 60 -119 262 651 -188 132 240 362 -246 -126 -236 -671
1952f71N24L01M36m14j24M1j37L66l27r36R67l8K24n35N75j93m91K08N36r1q5
$$ -671 -147 154 590 176 52 93 -44 322 -5 -941 26 -12 212 -323 252 59 -432 -224 312 221 136
1973A36j55J27K59n06k83N00K98qj41o34n2J79M9L83N39n39n10J94Q10p14k40
$$ 136 -19 108 367 -139 -422 78 376 368 227 -407 -459 -280 -231 152 691 152 -358 -164 646 -68 -308
1994c08J90o4m41P6P94j39j22o1k53M75K78n25M7J94J94k3n99Q82n31m56J40P44
$$ -308 -118 -182 -623 -547 247 108 -14 -75 -328 147 425 -100 -53 141 335 312 -287 595 64 -392 -252 492
2016D92o09Q7L89l06k83m63N16k9O97m90L09J46J61l67j034M89Q05q70Q3k1P24
$$ 492 -117 -30 359 53 -230 -693 -177 -206 491 1 310 456 617 250 -784 -295 510 -360 -277 -298 426
2037D26l78o21M96K78r6j15j08K04j05L52j93J57k56J2k01J89L17m06j75N97l45
$$ 426 48 -573 -77 201 105 -10 -118 86 -19 333 140 297 41 53 -148 41 358 -48 -223 374 29
2058B9m48K50J09P5r7J96K06n33k86P02j82j16J36q1J79K18n26K19L1J80J97p43
$$ 29 -419 -169 -60 15 -82 114 320 -213 -499 203 21 -95 41 -40 139 357 -169 50 81 261 458 -285
2080b85J97M57o67K27k8K68j01o3j94J77l16m40J063k63M4J1j61p6l11Q1L55Q74
$$ -285 -88 369 -298 -71 -99 169 68 5 -189 -12 -328 -768 295 32 76 87 -74 -150 -461 -380 -25 849
2102H49l87q64K17k66L21kNM30l09Q9O8K41l15K11n9l6J92j28m90M41k08Mp44
$$ 849 462 -402 -185 -451 -130 -132 -127 303 -6 83 151 392 77 288 229 193 385 257 -233 208 0 4 -740
2125g40O80O04r86J00M81k85j23K38J81n9l65K14P9J27o9n1k6N7j02l45L47L69
$$ -740 -60 544 -442 -342 139 -146 -269 -31 150 91 -274 -60 19 146 77 26 0 57 -45 -390 -43 326
2147C26l04k04J42K81n21n6M66p6k08R9J69k39O9m1R5K61p0j88K2l0J41j32k40
$$ 326 22 -182 -40 241 -280 -336 130 54 -154 -55 114 -125 -56 -97 -2 259 189 1 23 -7 134 2 -238
2170b38M48o9m57J69K21j21j12M8J97p2k02K97j05j09K67j09Q2J80l56j02J97
$$ -238 210 141 -316 -147 74 -47 -159 -111 86 14 -188 109 4 -105 162 53 135 315 -41 -143 54
2191E4Q3j10j31L1L39l59k45M72p0j14J39q9J21j07j4qK03j87Nl6j7O7j62KK31
$$ 54 137 27 -104 -73 266 -93 -338 134 64 -50 89 0 121 14 0 -8 195 8 13 -23 -40 27 -135 -133 98
2216I8j19l20L43K10j64k22R5L42k96j52K26N0o5Nk6J19R7l99K6R6J77r0j00O9
$$ 98 -21 -341 2 212 48 -174 -79 263 -33 -185 41 91 26 31 5 124 221 -178 -152 -56 121 31 -69 0
2240@K3o8j10L26j82o2J4kR2m1j51L99j07k24qK16j06k6k41J16K66l13m0K43J13
$$ 0 23 -45 -155 171 -11 -73 -59 -61 31 -10 -161 238 131 -93 -101 115 9 -17 -258 -142 124 -189 -229 14 127
2265A27n4q2M8qj01l1P0K33j72r7J06J45qj51L2j38L83m71n7L08q9k27J48J66
$$ 127 73 -9 39 31 -70 -101 -31 202 30 -67 39 184 176 25 57 -81 302 -169 -226 82 -7 -234 -86 80
2289H0j22r9j70M77J21k58j6J91q7Q1k68j79K85r5M8O6j1r6l7q8L38k70N5J90
$$ 80 -42 -141 -311 166 287 29 13 204 117 198 -70 -249 36 -59 -11 55 44 -52 -89 -177 161 -109 -54 136
2313A36q9J6j12N1Q7n8l3JL21m14J86k54n9J75k21K34J17k4k46J23J12k3K4o3
$$ 136 47 63 -49 2 89 31 -2 -1 320 -94 92 -162 -221 -46 -267 -33 84 60 -186 -63 49 26 50 -13
2337a3K76l87l9K78R3k15R0j01J81j09j49P2n8o3L0L8j2J33j63r6J92O8om3Nr
$$ -13 263 -124 -163 115 208 -7 83 -18 163 54 -95 -23 -81 -144 -114 -76 -88 45 -118 -214 -22 46 40 -3 2 -7
2363gJ00J48j75M7l02J39qJ50Kk76L14n5k20l6J33J97j00k27N1J23L8r0K60j79
$$ -7 93 241 66 113 -189 -50 -58 92 94 -182 132 77 -143 -179 -46 151 51 -176 -125 -2 36 -54 206 27
2387B7J2j50NJ86qk54K23j44k3J76j63P0J89j22r1J72n9m5J84j41J01k36k0L90
$$ 27 39 -111 -106 80 72 -182 41 -103 -126 50 -113 -43 146 24 -67 105 46 1 185 44 145 -91 -111 279
2411B79j77k7k27R7kJ1j18K44J29j99k36J43O1O4J3R0o5j77q8K13j24K15r9j25
$$ 279 102 75 -152 -55 -57 -46 -164 80 209 10 -226 -83 -22 42 55 145 80 -97 -185 28 -96 119 20 -105
2435a05J52R2j53Kj61K03K3j04J86q7k38J53J55m8m6k49O09k37k34P8K75k28q0
$$ -105 47 139 -14 -12 -173 30 53 -51 135 48 -190 -37 118 70 24 -225 384 147 -87 -9 266 38 -42
2458d2R8Rl6k72J56J44j49Pr5J34K32j44k45M95j27n7k15K66j15r4P7J12p1n1
$$ -42 56 65 29 -243 -87 57 -92 -85 -180 -46 186 42 -203 292 165 108 -107 159 44 -50 27 139 68 17
2482A7k1r1n5L10k14q1J68Qq1k0K22l25N02k57K49l69j8M51m09p6j87K96P4J67
$$ 17 -4 -95 -150 160 -54 -135 33 41 -40 -60 162 -163 339 82 331 -38 -56 395 -14 -90 -277 19 93 260
2506B60p97K8M72M77l90k75L58q3j4q5o9J33k08K27j10J52k31K60j91J18lq3P3
$$ 260 -537 -509 -37 440 50 -225 133 50 36 -49 -118 15 -193 34 -76 76 -155 105 -86 32 29 -54 19
2529A9n8J25k69J28J92j83J01k22K36k2k15K25Q3j28j6K10k28M2j95Q2J43p0K5
$$ 19 -39 86 -183 -55 137 -46 55 -167 69 47 -168 57 140 12 -4 206 -22 20 -175 -93 50 -20 5
2552Ej55K12L50q24M36M9K04k45k13L85j91j90K64J23J54l88M28j76m99n1K73
$$ 5 -150 62 412 -412 24 73 277 32 -181 204 13 -177 87 210 364 -24 404 228 -271 -322 -49
2573d9K9l98R91q20K13m5j61L69K04l12K24n48K73P4O7J76o44j64O6R08o82K74
$$ -49 -20 -418 573 -247 -34 -79 -240 129 333 21 245 -303 -30 44 111 287 -357 -521 -455 453 -229 45
2595D5M67n55k23K16m4l27M24m95P35k98j36k6j06J57O71m32l0K22j28J15r15
$$ 45 512 -43 -266 -50 -94 -421 3 -492 243 -55 -191 -217 -323 -166 505 73 43 265 137 252 -663
2616f63R18p7j72M0rl50k8N12m32L24l81L52m12M3J74k44J16K34o4j14M50k5J03
$$ -663 255 178 6 46 37 -313 -341 171 -261 63 -318 34 -378 -335 -161 -405 -289 -55 -119 -233 217 192 295
2639B95n30ML28j2k41J50j03r6L25N2k04O3Q0j15j63K53m5j89Q3L0R0k64K1K23
$$ 295 -235 -231 97 85 -156 -6 -109 -205 120 172 -32 31 111 -4 -167 86 41 -148 -65 -35 55 -209 -188 35
2663C5Q5p0k4n4j33K05p1O6k3L9j53M3J12J3j42K4J52p3k44J44K3L5J2n3N7N0
$$ 35 120 50 26 -28 -161 44 -27 39 16 55 -98 -55 57 70 -72 -48 104 31 -213 -69 -46 -11 1 -52 5 55
2689E5L1j13Q3j88J74Q6q6Q0k14r8K18rn4J5J00m5l5kK2N7j21J33l7j36J95k56
$$ 55 86 -27 56 -132 42 128 42 122 -92 -190 28 19 -35 -20 80 35 0 -2 20 77 -44 89 52 -84 111 -145
2715a45K07j3k2n2K6n8j81N1J66J39j01k43O1J82K7Nk36J89o6p7K17k5k14J34
$$ -145 62 49 27 -25 1 -57 -238 -187 -21 118 17 -226 -165 17 44 49 -187 2 -64 -141 76 51 -163 -29
2739b9p9J8J56k0k45L04j05j6L2M2N8j33j79O0L24k14J06n2q4J46k15J28J39q8
$$ -29 -108 -90 66 46 -199 105 0 -16 16 58 116 -17 -196 -136 188 -26 80 28 -56 90 -125 3 142 54
2763E4n5K10r3Mq7j02Q3L5%k19l2J34p6O2J09N1r7R4j4j0l6n9K63k45n5O1J91
$$ 54 -1 209 116 120 33 -69 14 49 49 -170 -202 -68 -144 -82 27 78 -19 75 61 51 15 -44 219 -26 -81 -20 171
2790A71l56r4M36j54j0J33j93Q1l7J17q8n3R4l4m6O7rK9J01m48K87m6o0M0J83
$$ 171 -185 -279 157 3 -7 126 -67 14 -23 94 6 -47 47 13 -33 34 25 54 155 -293 -6 -52 -112 -72 111
2815A11j57Q0Q0r7n1r1J77r7N7j47R6J03J4j35q4K49o3k1j35n5L34k08m0O2J22
$$ 111 -46 34 114 17 -34 -125 52 -45 12 -135 -39 64 78 -57 -141 108 45 24 -111 -166 168 -40 -80 -18 104
2840A04j75O3p1NJ53j53J24%j17L9J21m7q1k8j8L49l87J53j49o2J61r6K77j51
$$ 104 -71 -8 -79 -74 79 -74 50 50 -67 -28 93 46 -35 -63 -81 268 -119 34 -115 -177 -16 -112 165 14
2864A4K5k6R7jP5j89o5J79L7j99Q5J25k33O7l5qO9p0M5L5M7nj67J1K0N1j9L5j4
$$ 14 39 13 110 109 184 -5 -70 109 146 -53 32 157 -76 -9 -44 -52 17 -53 -8 27 74 69 -98 -87 -67 -16 -35 0 -14
2893a4r6J96l8l1m2q7J74p3q6m4K22J1k41J48nK2j0k07J61m3K7O5j6r5J16n1J83
$$ -14 -110 86 48 17 -25 -112 62 -11 -97 -141 81 92 -149 -1 -6 16 6 -201 -40 -83 -56 9 -7 -102 14 -37 146
2920A46p0j75m7J81J70k45L5Q9L0m6j13M6L1r3n8J0J03j25oJ78p6k6J21j4k4L4
$$ 146 76 -99 -146 35 205 -40 -5 84 114 68 -45 1 32 -61 -119 -109 -6 -131 -137 41 -35 -61 60 46 22 56
2946E6n7n8J36j88q6J80n0J3J12q0j4N1p3P1k6J04n0j65K37j1j66P6P0j66O3n
$$ 56 -1 -59 77 -111 -197 -17 -67 -54 58 -22 -36 15 -58 13 -13 91 41 -124 113 102 -64 12 82 -84 -21 -26
2972b6j4K22j80J2q9K01r9m3l3P4j30N9J18k09M8n4J13K01j82k01J02J66j9j61
$$ -26 -40 182 2 14 -75 126 27 -16 -49 25 -105 -46 72 -137 -89 -143 -30 171 -11 -212 -110 56 37 -124
2996a24J25K00j80j18R5Q0l2r3j65J54J79k20K24j51L8l3n0J01k10J07N3p2J23
$$ -124 1 201 21 -97 -2 78 46 -47 -212 -58 121 -99 125 -26 12 -21 -71 30 -180 -73 -20 -92 31
3019C1k17Q0K17K4k32R1J41j16l8J01j08R1k9rNp2J55k77O3K20q5k09J13K22k56
$$ 31 -186 -106 111 135 -97 -6 135 19 -19 82 -26 65 36 27 32 -40 115 -162 -99 121 36 -173 -60 162 -94
3044i4M6J84j27R3j25P2P8j00p4J54r7jk8O6k09J70j69N9J42N6k17K54Q7j20l55
$$ -94 -48 136 9 102 -23 49 127 27 -47 107 10 9 -19 47 -162 8 -161 -102 40 96 -121 133 220 100 -255
3069b55K48L5p4n9J80R1o3p3N7k31N8J95m9o4O0m4j46J75n0k0L3P0m6N1j67K55
$$ -255 -7 28 -46 -105 75 166 103 30 87 -144 -86 109 60 -4 56 12 -134 41 -9 -29 4 74 28 79 -88 167
3095A67j33o5Lk9K45n0k27N0K0J7PK3J1j12l7q2L40k6j36m8J05Q8r5L6J42j56
$$ 167 34 -31 -28 -57 188 138 -89 -39 -19 -2 5 28 39 -73 -110 -192 148 122 -14 -62 43 131 36 72 214 58
3121E8l4k7M0o1J0K64j99j08P9j12J44j09M3l4J30j18J16j20P8P8j21J7L0q1L1
$$ 58 24 -3 37 -24 -14 250 51 -57 22 -90 54 -55 -12 -46 84 -34 82 -38 40 118 -3 14 44 -37 -6
3146fl2N1l2j66J92q5K15j72j42J0K15j12Kl9J65j27N2Ro5O0j18J76j27j4N4k43
$$ -6 -38 13 -19 -185 7 -78 137 -35 -177 -167 48 -64 -62 -101 64 -63 -11 -2 -67 -7 -125 51 -76 -90 -36 -279
3172b79J35L13q8o5j03K49j39P0p9Jj41R6K69k15M2j10J5K0L0q4J79k6j0j67k5
$$ -279 -144 169 81 16 -87 162 23 93 14 15 -126 -30 239 24 66 -44 -29 -9 21 -63 116 90 80 -87 -112
3197a12K13j16j59K25j33J97j86P1KJ2j12O5k7Q0l9N7j25J41p9K1QOj08p1J62
$$ -112 101 -15 -174 51 -82 115 -71 0 2 14 -98 -33 -60 20 -19 38 -87 54 -25 -4 4 10 -98 -169 -7
3222gn7o7J53J26j59Q5j58O3M9l5N9J29j34j57qj29l4K75N9k55k8K26k0K31j60
$$ -7 -64 -131 22 148 -11 74 -84 -21 28 -7 52 181 47 -110 -118 -247 -281 -6 53 -202 -230 -4 -24 207 47
3247D7mo9Q3M9j32l5J69P0l41J56O1j21J6J11m0Q3o2j67P5J5L9p3KJ38j00J01
$$ 47 43 -26 57 106 -26 -61 108 178 -163 -7 54 -67 -51 60 20 103 41 -126 -51 -36 3 -70 -68 70 -30 71
3273G1j31J25k05J61K8j28qJ4Qk0J30m4l7l1R4n5K6L8j05o3K54r9K90k63j49J75
$$ 71 -60 65 -140 21 49 -79 -87 -73 -65 -85 45 1 -36 -67 27 -28 -2 36 -69 -132 122 23 313 50 -99 76
3299G6q7p7K5K5o5J51j66L3J33j64N4M1R0J18l36P6L06j69m9%lr9n1K45j99N4
$$ 76 -11 -88 -63 -38 -103 48 -118 -85 48 -116 -62 -21 69 187 -149 -73 233 64 15 15 12 -87 -138 107 -92 -38
3325c8J10j31J43m0k7k6O5o5n5R1j54K6R4j52J60Q9k01K05o4l9O0j53K71k01k
$$ -38 72 -59 84 44 17 -9 56 -9 -64 27 -127 -101 -7 -159 1 90 -111 94 30 -9 51 -102 169 -32 -34
3350c4K4n1j89J22j2M6R2J31k4j02o1J43k7j37J98j01j44K01j66N1O2k6j47M6
$$ -34 -10 -61 -250 -128 -140 -94 -2 129 105 3 -58 85 58 -79 119 18 -126 75 -91 -40 22 -4 -151 -105
3374a05J44m0J64j97J0k3O4k8K14k66R2p1J11o8J33m8k9q5n4j10K00r8k7J90o3
$$ -105 39 -1 163 -34 -24 -47 17 -11 203 -63 29 -42 69 1 134 86 57 -28 -82 -192 8 -90 -117 73 10
3399A0M4R0k47K0J51pp3m0N0j72K74k37K43j35j28J46O1J26j67K12l75K52q5j31
$$ 10 54 144 -103 -83 68 61 -12 -52 -2 -174 100 -137 106 -29 -157 -11 50 176 9 221 -154 98 13 -118
3423a18R8k3k2P2k9K54l48J76Qj55J69l7K7j31P9Kmk0j77K05L9j55K63k26P7N4
$$ -118 -20 -43 -65 7 -22 232 -116 60 68 -87 82 45 72 -59 20 22 18 -2 -179 26 65 -90 173 -53 24 78
3449G8j47J75J5k11L59l34oL58k69R1j94J05M5o3L1j68J74L3j48N9j45L32j93
$$ 78 -69 106 121 -90 269 -65 -71 287 18 109 -85 20 65 2 33 -135 39 72 -76 -17 -162 170 -23
3472b3j7K27k45m3J14O4l1j17j02K20q6N9J02n3j97J98R0m3M3o1J39l0j79j17
$$ -23 -40 187 -58 -101 13 77 46 -71 -173 47 -39 20 122 69 -128 70 160 117 160 99 238 208 29 -88
3496h8j0K18k67l39N19J32L1m86N33n9j80R0j20QK7l1j9J8j04J30qj8J23m7M9
$$ -88 -98 120 -147 -486 33 165 196 -290 243 184 4 94 -26 -18 9 -22 -41 -23 -127 3 -5 -23 100 53 102
3521A02j53K52k85M6J88r9q2l2k3j2R9j1J73k04M5Mmo1J44n7j60NP4j18J54lQ4
$$ 102 -51 201 -84 -38 150 51 -31 -63 -86 -98 1 -10 163 -41 4 8 4 -57 87 30 -130 -125 -51 -169 -15 -18 66
3548F6k5J71j20Jp7o2m5J23r8K31k32K49k68j8P0Q9O7p8RM3j3j12K44k15O1j53
$$ 66 41 212 92 93 16 -46 -91 32 -66 165 -67 182 -86 -104 -34 55 122 44 53 96 83 -29 215 0 61 -92
3574i2K67m1k9j61L1O2l5J23k13k2J37j81J69J01Nr5M4q1K55r9j12P9j47j64K98
$$ -92 175 134 105 -56 -25 37 2 125 -88 -110 27 -154 15 116 121 26 70 -11 244 145 33 112 -35 -199 99
3599I9j64j60j6J09K66j24j78J13p2L72p5n3K99k97j56P4J76l52p3L05k85J14
$$ 99 -65 -225 -241 -132 134 10 -168 -55 -127 245 170 117 416 119 -37 37 213 -139 -212 93 -192 -78
3621g8j72K03l0O8r3K98l9j92L10l16J34j0K6j63K33r4M4k32J76J09j73k0J85
$$ -78 -250 -47 -77 -9 -102 196 157 -35 275 -41 93 83 109 -54 179 85 129 -103 73 182 9 -11 174
3644A74l44Q3J52J0J54j60N4K8j96J79k04k71M18R1j83KR6J03k10K6P5j08kJ64
$$ 174 -170 -87 65 75 229 69 123 151 -45 134 -70 -341 77 168 -15 -13 83 186 -24 2 77 -31 -33 131
3668A31n1k30K53J0q4N4r1n7P6J51Q7j93O0n4j19j85K12J05q2J18j07j74J32O9
$$ 131 80 -150 103 113 29 83 -8 -65 11 162 249 56 116 62 -57 -242 -30 75 -7 111 4 -170 -38 31
3692C1J97k70N2p0N4N9Q4m1j77L02j35l7j82J70m5pl9J35p8o3J59n8j07J23o5
$$ 31 228 -42 10 -60 -6 53 137 96 -81 221 86 49 -133 37 -8 -15 -54 81 3 -60 99 41 -66 57 -8
3717hJ35M1K4j62L0r5J17K6j79J10p3p8J80l6j24Q1j45J54j14J64o6k9np9J23
$$ -8 127 168 192 30 60 -35 82 108 -71 39 -34 -112 68 32 -92 -11 -156 -2 -116 48 -18 -47 -52 -131 -8
3742hK14j68j29O4j17K54k07j59K66P5k68J08Q6j18k0J53k13J55JK7J02j3p7N0
$$ -8 206 38 -91 -27 -144 110 -97 -256 10 85 -183 -75 11 -107 -127 26 -187 -32 -31 -4 98 85 8 58
3766E8j7j94Q4q4R3J31j18K16j75M3j44m8K38j87O4K1L28l21j44K5J33l8O5q6
$$ 58 41 -153 -69 -153 -60 71 -47 169 -6 37 -107 -155 83 -104 -40 -19 309 -12 -156 -131 2 -36 29 -57
3790e7Q8J23mj32r1L1J28k02K16j56j29K12Q0r8q7k8L5J18Rj90J68Q8m5M4k78
$$ -57 31 154 150 18 -73 -42 86 -116 100 -56 -185 27 107 9 -78 -106 -71 47 56 -134 34 122 77 121 -157
3815a57M03l06l8L8J18k4j41P4M9Lo8K9K05l07K20k1K7j60J42m4M5j95J3qN5o
$$ -157 246 -60 -98 -60 58 34 -107 -33 16 19 -49 -20 185 -122 98 77 104 -56 86 42 87 -108 -95 -103 -48 -54
3841e4q6J51r1J16m1j63K09O2j83r8J50j19J24J71n9r5P0K3r9NJ1m3L8N7r5p3
$$ -54 -140 11 -80 36 -5 -168 41 103 -80 -178 -28 -147 -23 148 89 -6 64 87 -12 -7 4 -39 -1 56 -39 -112
3867a12L3L1p9L6K07j33j52K75j08j43J43J42j01Rnk30K48NO%k8M3k12n8J85J06
$$ -112 -79 -48 -127 -91 116 -17 -169 106 -2 -145 -2 140 39 48 43 -187 61 66 72 72 44 87 -125 -183 2 108
3893A08K2p8q9j64J00l0K54j93J37R4k12R5mr7n8R2J07oo9q4J29j41k3J87j32
$$ 108 130 52 -37 -201 -101 -131 123 -70 67 161 -51 44 40 -57 -115 -23 84 78 9 -75 54 -87 -110 77 -55
3918e5J10n8n5K03m6j90K06J8k8n5q1O0j78J01K01j44l17J10L17k72K90j2j29
$$ -55 55 -3 -58 145 99 -91 115 133 105 50 -31 29 -149 -48 153 9 -308 -198 119 -153 137 125 -4
3941dJ21l89K66K62l22K2Kl2jJ77j31l5j0J72l9k01J15Kj75J72Nj7J57j73J71
$$ -4 117 -272 -6 256 -66 -44 -42 -74 -75 102 -29 -64 -74 98 59 -142 -27 -25 -200 -28 -23 -40 117 -56 115
3966A15j17N6k51K51J7q9k03K47K61l01O6k35K16r8ROJ76j73P4O8j39L3p1J77
$$ 115 -2 54 -197 54 71 -18 -221 26 287 -14 52 -183 33 -65 -56 -50 126 -47 27 95 -44 -11 -82 95
3990I5j74J43q1N6O7j91P4J03K2kj10n9J06o3J29k14RR1m4k9K32j5j43M2q9Ml6
$$ 95 -79 64 -17 39 106 -85 -11 92 114 112 2 -57 49 -14 115 -99 -90 1 -43 -72 160 145 2 44 -45 -41 -77
4017g7R2L5qK1j78J18j4L2m6m6R2j2J63j47q1P4J99k62P1l7J36j07M7l0p8O4Q9
$$ -77 15 50 42 63 -115 3 -11 21 -25 -71 21 9 172 25 -56 18 217 -45 26 -11 125 18 65 35 -43 21 110
4044A10J05k36J32M4j42J2J36j07P8j77J43L5k25J44j28J29n9K8l5J23Q6k29L9
$$ 110 215 -21 111 155 13 25 161 54 132 -45 98 133 -92 52 -76 53 -6 22 -13 110 196 -33 6
4067FJ9L0r8j38J3Q8J70k6M4j21J3J35l5j58mK39k54O0J28j46J11j41j45J38q4
$$ 6 25 55 -43 -181 -168 -80 90 64 108 -13 0 135 100 -58 -62 177 -77 -17 111 -35 76 -65 -210 -72 -156
4092a56K96n3j08J14q5n8p4P1Q5j38j9J69j01O0J06Pk62J58r6k9K09j66J9j18
$$ -156 140 87 -21 93 8 -50 -124 -53 32 -106 -125 44 -57 3 109 116 -146 12 -84 -113 96 -70 -51 -169
4116a69L23j61j18J00K02j36JN2q6n9J09j04j13J56K7k25K85rj5q1k12J88n2M3
$$ -169 154 -7 -125 -25 177 41 42 94 8 -51 58 -46 -159 -3 24 -201 84 75 60 -21 -233 -45 -97 -54
4140e4J18j06p1J06j15J90R5k89L12l20k2K10l6K0o6q7R6j7r3L2J09J02j41J18
$$ -54 64 -42 -113 -7 -122 68 163 -126 186 -134 -156 54 18 38 -28 -115 -19 -36 -129 -97 12 114 -27 91
4164I1k28J89K6k5p6J03j47p8M6N5n8kK5L0J0m1J4j12J32r6J42J08l8k5j77K13
$$ 91 -137 52 78 53 -23 80 -67 -145 -99 -44 -102 -104 -79 -49 -39 -80 -66 -178 -46 -142 0 108 70 45 -132 81
4190H1O3J44k72L5o7P1j04J39k53m3O5J44O4j15m8R6k3m2J58q4L3p6K9P5j21J3
$$ 81 144 288 16 51 -16 55 -49 90 -163 -206 -141 3 67 -48 -96 0 -23 -65 93 9 42 -34 -5 70 -51 -38
4216c8J0R7J8j91P8K5l7N1j54K79l09P0Q4J02q2K3l1m4J39m6r7J2K44l04L4L0
$$ -38 -28 69 87 -104 -26 -1 -38 13 -141 138 -171 -101 -17 85 3 26 -5 -49 90 44 -53 -41 203 -101 -67 -37
4242c7j09J95j19kP0jQ2j78J53j66M1J52Q6o2j90K20j95N3KQ1k03R0Q9j09j5Q7
$$ -37 -146 49 -70 -72 -2 -3 79 -99 54 -112 -71 81 167 105 -85 135 -60 -7 -5 76 -127 -37 52 -57 -72 15
4268A5J10j79L6Q1N1k20j9R0n7J58j0J8L6j01K8M1p6L3j1k0k5J40j90q7K07p2
$$ 15 125 -54 -18 63 114 -106 -125 -35 -92 66 56 74 110 9 37 78 2 35 24 4 -21 119 -71 -158 49 -23
4294b3j11J13n8J14J0l6N2q5J02p2n4m5J40N3J38j76J7o2K3nj91J9K04j05k5N3
$$ -23 -134 -21 -79 35 45 9 61 -24 78 6 -48 -93 47 100 238 62 79 17 40 35 -156 -137 67 -38 -63 -10
4320a0J16j82q1J30N2Q8k34J58j39J74m5N4p9j64J71k03J84j1J36j71n3J03j0
$$ -10 106 -76 -157 -27 25 113 -121 37 -102 72 27 81 2 -162 9 -194 -10 -21 115 -56 -109 -6 -16
4343a6N6Q3j43J22k9O8j86l1J30j0L9K0j57l9n1K24j75K19j74j72J49NqJ27L3
$$ -16 40 123 -20 102 73 141 -45 -76 54 44 83 103 -54 -93 -144 80 -95 124 -50 -222 -73 -68 -76 51 84
4368H4r4J27j12j26J59m4K19l11K28j73n3J32j0L5j35Q7j74K34q6J4M1n4oK5K0
$$ 84 -10 117 5 -121 38 -6 213 -98 130 -43 -96 36 26 61 -74 13 -161 73 -13 1 42 -12 -18 7 27
4393B7J85j01p2J3Qm0Kj93Q6J17k0o2K09j25l6J2K9o9M9P1n5J20k09k8O2o4J4
$$ 27 212 111 39 52 60 20 22 -171 -85 32 12 -50 159 34 -2 10 39 -30 19 90 35 155 -54 -82 -20 -84 -70
4420g0nj40K66j64K69j62m0J13R7k04l0m3M6Q8L2j55J12%J79j85J84p3j03l0k
$$ -70 -75 -215 51 -113 156 -6 -46 67 164 -40 -70 -113 -67 21 53 -102 10 10 189 4 188 115 12 -18 -20
4445b0N3j13K06k29J76m0j1J94k33R2K3k30J23J38Nk38P9o6J00n6M2p2P1N7j50
$$ -20 33 -80 126 -103 73 33 22 216 -17 75 98 -132 -9 129 134 -104 -25 -91 9 -47 -5 -77 -6 51 -99
4470i9K02j7j33N0p8J35k06O2K4J22o1J50j43L8j00L7J06k4r6r1J33j50J36j73
$$ -99 103 86 -47 3 -75 60 -146 -84 -60 62 1 151 8 46 -54 -17 89 65 -31 -122 11 -139 -3 -176
4494a76K01m4R1j7j54M2j5o2J57qL1N7j0pn9o6m4Q7k9J32o4j39m9K9k4N1M7j4
$$ -176 25 -19 72 55 -99 -57 -72 -134 23 15 46 103 93 86 27 -39 -83 4 -25 107 43 -96 -145 -116 -140 -89 -42 -56
4522e6R0j49L20l08j26K49L0k66J21J86j14k6K1o6J52r6M4l4J11n4j31K06j47
$$ -56 34 -115 205 -103 -229 20 50 -216 -95 91 -23 -49 -28 -94 58 -38 6 -28 83 29 -102 104 -43
4545d3Q9Pr2on0J14L4l2P2j29P3j35j43K58j3j12MJ01N5j59J12k5o0j25K20j08
$$ -43 46 53 -39 -45 -95 19 53 21 93 -36 37 -98 -241 17 4 -108 -104 -3 52 -107 5 -20 -80 -205 15 -93
4571i3J38J10k20o6J35R3L9L1j65L6k45K34J53j75j81L45k12J58j17o9L7J2J27
$$ -93 45 155 -65 -131 4 97 136 167 2 38 -207 27 180 5 -176 169 -43 115 -2 -71 -34 -22 105
4594A05k19n4L23j62k8R5O0j22kj73K66l12l5J60K22j16N2o2r2K03K5j25p6J60
$$ 105 -114 -168 155 -7 -35 60 120 -2 -4 -177 89 -223 -258 -98 124 8 60 -2 -94 109 134 9 -67 93
4618I3n1j34J06J6Jj0p5J79j35l9R1j34j6J51o1J45j70p8J12j22P0R2j00K57q3
$$ 93 42 -92 14 30 31 21 -54 125 -10 -49 42 -92 -108 43 -18 127 -43 -121 -9 -131 -61 31 -69 188 105
4643A05Rk75L09k75P0J24J08r0p2j63K34j84J90l1Q0l0k05mL5J72k36M6r4J04
$$ 105 114 -161 148 -127 -57 67 175 85 13 -150 84 -100 90 59 139 109 -96 -100 -65 107 -129 -83 -177 -73
4667g3k4J59J5m6j1m6J23n8q3LJ61l0j60J94j14J85n6k6Ql2j53r6K72jj18L4j36
$$ -73 -97 62 77 31 20 -26 97 39 -44 -41 120 90 -70 124 10 195 139 113 121 89 -64 -160 112 111 -7 27 -109
4694a09J6K7j9K5N5m3O1J5J6q4m6R1p1m4p4J97M0m6r0O1M5J5M9r0N7k2p7K2j32
$$ -109 -93 -66 -85 -60 -5 -48 13 28 44 -40 -86 5 -66 -110 -184 13 53 7 -83 -22 23 38 87 -3 54 32 -45 -23 -155
4723a55RJ89k21L10n0j11L3j2j05r7K53K6j13O7r3L6j69Q6J13Q6j26O9j8p3J47
$$ -155 -146 43 -178 132 82 -29 4 -8 -113 -210 43 69 -44 23 -70 -34 -203 -117 -4 82 -44 25 7 -66 81
4748H1k5J37k70J56k7j04pp4l2K3K16o7L5m0N1K0q7M3j36K21L9m3r1p7J83k15
$$ 81 56 193 -77 79 52 -52 -59 -133 -165 -142 74 7 42 2 53 73 -14 29 -107 114 153 110 19 -58 125 -90
4774i0J17M6j2l9j01J18Q3j37RO1j81J71k25J93P6p8m1m0J4J17m4j5N4P9r0o1
$$ -90 27 73 61 22 -79 39 122 -15 -6 55 -126 45 -180 13 89 11 -30 -70 -56 61 17 2 56 135 45 -16
4800a6J02j87J73qk29K11j83Q4L7J5j42Q4J32o6n1j1j7J08j84k2J05r2J90k08
$$ -16 86 -101 72 64 -165 46 -137 -53 -16 -1 -143 -59 73 7 -44 -55 -72 36 -148 -170 -65 -157 33 -175
4824a75N3M0m0J44J6p4J6N5K0r6M0r7L4J53j52J86l3J0rk61J82q7J69j80N6r8
$$ -175 -122 -82 -122 22 38 -36 -20 35 55 -41 -1 -98 -64 89 -63 123 90 100 91 -170 12 -75 94 -86 -30 -128
4850a28K53j93N4J0m4P7l2j3L9n2O1P8q6j1o5J32p1O2n9o9P6p7K82j21k78K34
$$ -128 125 -68 -14 -4 -48 29 -3 -16 23 -29 32 110 24 13 -52 80 9 71 12 -57 19 -58 224 103 -175 59
4876E9k22Q5J27q2j36L54k22K08j14j57J89R1p0j44r1K80k11N0O8r9N5R9n7k9
$$ 59 -163 -78 49 -33 -169 185 -37 171 57 -100 89 180 110 -34 -125 155 -56 -6 62 -37 18 117 60 31
4900C1o8j40R6qM8J60j22O7rN3kk00K38j93J03j19J86o8j03k1J6K30j14nk30J39
$$ 31 -37 -177 -81 -89 -41 119 -3 64 55 108 106 -94 144 -49 54 -65 121 53 -50 -71 -55 175 61 56 -174 -35
4926c5J24m6J49k76J81kr9P2m6q4J21O5l41K79r5J8j12O3j9N1Jo9j8J19o0j38
$$ -35 89 43 192 -84 97 95 -4 68 22 -62 59 124 -217 62 -33 -15 -127 -64 -83 -32 -31 -100 -118 1 -59 -197
4952a97K33n1J65j85m0JJ94j04k06J93o6j3J0MPQ5j19P0O3j75K25j21K4j06J19
$$ -197 36 -15 150 -35 -75 -74 120 16 -190 3 -63 -76 -66 -62 -55 30 -89 -19 44 -131 94 -27 -3 -109 10
4977A0J00j13j4m5%J25j42K03k39J84rq6P7n2L6j33JK62l8j94K12k2o9j6o3j41
$$ 10 110 -3 -17 -62 -62 63 -79 124 -115 69 60 -26 51 -1 35 -98 -97 165 127 -67 145 123 54 38 -25 -166
5003a66K86k00q9K02J07j61l9J14j9L9k55J71l0J07n0l8l9O5J33j93J3P3m8k7
$$ -166 120 -80 -169 33 140 -21 -60 54 35 74 -181 -10 -40 67 17 -21 -60 5 138 -55 -42 31 -17 -44
5027d4R6j02J27j47N4N6J3j03m6j7j6O1K27j62o9J37j05P8o2rJ01kp1n1J33k2
$$ -44 52 -50 77 -70 -16 40 53 -50 -96 -113 -129 -68 159 -3 -72 65 -40 38 -24 -33 68 66 -5 -56 77 55
5053E5m0R0n5K5k84J12J94n6M9k27K71j5j0k42K90l93J74R0l8N2l7L7n9jJ2Mj07
$$ 55 15 105 50 75 -209 -97 97 41 90 -137 134 119 109 -133 157 -236 -62 28 -10 42 5 42 -17 -18 -6 -2 -109
5080a09J00L2j35J42j1p2%J9m5J65l6q9K4Jj17J41j44J95J6j4j17J48j13Q1n8
$$ -109 -9 23 -112 30 19 -53 -53 -34 -79 86 50 -39 -15 -14 -131 10 -134 61 77 63 -54 94 -19 62 4
5105Dk2j07J54j06J13L5m7r7M7O4m2j89K55j89P4K0l0N3p7K16r0l5j68L03k01
$$ 4 -18 -125 29 -77 36 71 24 -73 -26 38 -4 -193 62 -127 -53 -33 -63 -10 -87 129 39 4 -164 139 -62
5130f2J23j41P6N0j29J62j25R4J7R3k77Q2J01j21L0J02k0N0p3j67L46l5m09K00
$$ -62 61 -80 -4 46 -83 79 -46 48 65 158 -119 -37 64 -57 -27 75 55 105 32 -135 211 176 -233 -33
5154c3k3o3K32k19Q7J02m6K1j13J11N0nM7p8j49J03J6j75J79M8J41k13J0p1J9
$$ -33 -56 -119 113 -106 -19 83 37 58 -55 56 106 101 148 70 -79 24 40 -135 44 92 233 20 30 -41 -22
5179b2J49QMj07K2J36k39MO9j07Q5j14O8j0R9j04R0J5N9k53J41N4m5j5O7k33J79
$$ -22 127 135 139 32 54 190 -49 -45 24 -83 2 -112 -44 -54 45 -59 31 46 105 -148 -7 47 2 -13 54 -179 0
5206@%J44q7J8p1M2L0j86J71kQ5m8l6Q0k57K89j34n1j0J88j83J82k49J31k35J67
$$ 0 0 144 57 75 4 46 76 -110 61 59 144 96 60 140 -117 172 38 -13 -23 165 -18 164 -85 46 -189 -22
5232b2L5p7P5m0J46j73p5J13m4J65o8m0P8M5q9p3J09K3K4k16P9O5m8rO4k7j69
$$ -22 13 -64 11 -29 117 -56 -131 -18 -62 103 35 -5 73 118 29 -44 65 88 112 -104 -25 40 -8 -17 47 20 -149
5259a49K44j27n9l7K54n7j40J15k8L6j5j35J0J49p0l2j24K03j86J89p2r1J14q1
$$ -149 95 -32 -91 -128 126 69 -71 44 16 52 37 -98 -88 61 -9 -41 -165 38 -148 41 -31 -122 -8 -89
5283h9Q8r0Q2R8p4j29J65j71K4K4k8J81m4p2p4M7m0K92k15j14J23Q3l0m5j3j29
$$ -89 -1 -91 -9 89 15 -114 51 -120 -96 -72 -100 81 37 -35 -109 -62 -102 190 -25 -139 -16 67 37 -8 -21 -150
5309a50J72j83K09m6J37k02J10j88J3j09K04J86k63N7m2K24k00J24j76M1Q2l3
$$ -150 22 -161 48 2 139 -63 47 -141 -128 -237 -33 153 -110 -53 -95 129 -71 53 -123 -82 0 -33
5331c3K58k42j15J08P0r2j8o9K63k15K15l17K23P3n6l9M6j07K6P7k6Q3n3m9q3
$$ -33 225 -17 -132 -24 46 -46 -64 -133 130 -85 130 -187 36 109 53 14 60 -47 -21 56 30 113 60 11 -72
5356g2KJ74j21J42q4m7R2k95J76n5j0JJ85p2J10j93j7l8j8K59j01N4p3R5n6k4
$$ -72 -70 104 -17 125 41 -6 86 -209 -33 -88 -98 -97 88 16 126 -67 -84 -122 -140 119 18 72 -1 94 38 14
5382A4J60j24lL2J1j51k7O4K29k36j52J65P3j23j3j7J53Q9j94m6M5l2n2J74Mq6
$$ 14 174 50 47 79 90 -61 -88 -24 205 -31 -183 -18 55 -68 -81 -98 55 144 -50 -96 -51 -83 -135 39 43 -43
5408d3M1lj1J3J8p4P1l3J08r6o2J50m2P7j24J19M0k3j16J83k12%J6j19L5J5M7
$$ -43 -2 -5 -16 -3 15 -59 12 -21 87 -9 -71 79 37 114 -10 109 149 126 10 193 -19 -19 -3 -122 -87 -72 -25
5435b5m1J42pj25J00Kn5j6k5R3P7j00n0P3nO5j48J38r4R2l0j42j38K21Q8j22O9
$$ -25 -66 76 69 -56 44 46 -9 -25 -50 43 120 20 -30 43 38 103 -45 93 -1 91 61 -81 -219 2 90 -32 37
5462C7J16k35J19j09R2J64j22K2j01J03j96M05q3k97L2n0l8J62M7l4K13l07LJ15
$$ 37 153 -82 37 -72 20 184 62 84 -17 86 -110 295 212 -85 -53 -103 -141 21 68 34 247 -60 -57 58
5486E8k16J73K2j47M8R5j07N6J09j42k5J43l06J25O7p1J63p8J25kk24K4L2J73
$$ 58 -158 15 37 -110 -62 33 -74 -18 91 -51 -76 67 -239 -114 -47 -118 45 -33 92 90 -134 -110 -78 95
5510I5mm8J43k47K29o0j68j1N1j04J39J37k45K3J81k76J45j63K71n0jo0q1J84
$$ 95 91 43 186 -61 168 108 -60 -71 -20 -124 15 152 -93 -70 111 -165 -20 -183 88 38 37 -23 -104 80
5534H0l1l1j93J63O6j8j14oJ50j52j04J39Q9j09J57j89R4J50q5J09k5j98O6K2
$$ 80 49 18 -175 -12 54 36 -78 -84 66 -86 -190 -51 38 -71 86 -103 -9 141 56 165 140 -58 8 30
5558C0k3P1q2q7J1K04j73j00O7J9J46r4j7J26k4M1j32m7j33K84L4j49Q8r0J04
$$ 30 7 78 -4 -91 -80 124 -49 -149 -82 -63 83 -11 -28 98 74 115 -17 -64 -197 87 121 -28 60 -30 74
5583G4j77R6R7j76R4o5J07m8N5J4k94N8K36n7q6L65j83j13Q0k95J46N4J81j10
$$ 74 -103 -7 90 -86 8 -57 50 2 57 71 -223 -165 71 14 -72 293 110 -3 77 -218 -72 -18 163 53
5607E3k17J47k8j02K39j20j21J69l9j41L52J33n15L10m3j37N88n46M8J45l8O7
$$ 53 -164 -17 -45 -147 92 -28 -149 20 -19 -160 192 325 -190 120 77 -60 528 -18 30 175 137 204
5629B04j75J38k19p9j5K49K0o3k27O11n45L55m65l24O28j69L26l28R0R4j65L9
$$ 204 29 167 -52 -131 -146 103 123 60 -167 444 -101 254 -211 -535 93 -76 250 -78 12 106 -59 -20
5651b0k0j00J79j20J04J28k71J08k7m3J15m7O2J50j7j42j09j24L00m7n5k51L49
$$ -20 -40 -140 39 -81 23 151 -120 -12 -39 -82 33 -14 48 198 181 39 -70 -194 106 59 4 -247 102
5674A02j38j36J83q2Q0J39K1j95Q5q3oJ32j36J20j7o1k0m8k8j7K17j66j1K1L9
$$ 102 -36 -172 11 -71 9 148 169 -26 59 -24 -30 102 -34 86 69 8 -12 -60 -88 -105 112 -54 -65 -44 -5
5699ej2P6j17J36m0J9J30j41n6K01j90o9J51j07l7KL3nR1k12N6J34o8J31n1j42
$$ -5 -17 59 -58 78 38 57 187 46 -10 191 1 -68 83 -24 -61 -59 -26 -31 60 -152 -96 38 -30 101 50 -92
5725i2R0k8o0p5J49P9n2n3P0j08J06Pq3M4n0N0m3K2K1M3o1krQ5j45QJ3r7Q5R6
$$ -92 -2 -30 -90 -165 -16 63 11 -42 28 -80 26 33 -50 -6 -56 -6 -49 -27 -6 37 -24 -26 -35 50 -95 -87 -74 -171 -86 10
5755A0j30J44R0j36O0j22j4J17o1r7R4J73o5l6Oj48K18pj76P7J59k05J1N9o3M7
$$ 10 -120 24 114 -22 38 -84 -98 19 -42 -139 -45 128 63 27 33 -115 103 96 -80 -3 156 -49 -38 21 -42 5
5781EJ26k15K12k14K23q6k0J0q0J29k19m5J63j09J39j21J8Q9k3N0l6M9r7J2J88
$$ 5 131 -84 128 -86 137 51 31 41 -39 90 -129 -174 -11 -120 19 -102 -84 5 -18 32 -4 45 -52 -40 148
5806A48m6j22j53K65q4j16K30k96K25m8m2q2Q1N8l1j74L71j34j04k5lj6k3m9R6
$$ 148 102 -20 -173 92 8 -108 122 -174 51 3 -39 -121 -40 18 -13 -187 184 50 -54 -79 -82 -98 -121 -170 -74
5831g4QJ98k36K28j17Q3q9Q3n0L8j11K4J38n6M1k6r3m7m4L9mj3J71j30R1j32R9
$$ -74 -66 132 -104 124 7 90 1 84 34 72 -39 -15 123 67 108 82 -11 -58 -102 -63 -67 -80 91 -39 52 -80 19
5858A9j71L0J52j4q6O0M7p6j9K42k88J23n6Q7p6J02k9N1o6p4P8j40O0O5k9R5Q2
$$ 19 -152 -122 30 16 -70 -10 37 -39 -58 184 -104 19 -37 50 -26 76 47 98 32 -42 36 -104 -44 21 -8 87 169
5885A69j71Mn6P2K0j37J83n7j84J98r9K9Q5k54L03n2l8j70J30q2N5J55q9rm4R0
$$ 169 -2 2 -54 18 38 -99 84 27 -157 41 -58 -29 56 -198 105 53 15 -155 -25 -107 -52 103 14 5 -39 51
5911E1o8J40q9O4j35J01m0j9j8l2J53o8M3M9k41q9K80j09m6Q6q6L5nj03o0J67
$$ 51 -17 123 34 98 -37 64 24 5 -13 -45 108 40 83 132 -109 -198 82 -27 -73 13 -73 -38 -43 -146 -206 -39
5937c9J53o0K1j53K21j38n5P0pMl8j19J15MLj73R8o2J87l2j20N9J38q7O4J4L1
$$ -39 114 54 75 -78 143 5 -50 20 13 17 -21 -140 -25 -21 -18 -191 -93 -155 32 0 -120 -61 77 -10 54 68 99
5964I9j96K15k18M6M0r4k33K23N8J65m3q3p9J79p9j38J68J2l24J94O0J52j05j06
$$ 99 -97 118 -100 -54 -14 -108 -341 -118 -60 105 62 -21 -100 79 0 -138 30 42 -282 -88 -28 124 19 -87
5988h7J09J61k05l6j01J70j08J94Q9k72J44J67l81L6J28k16K67j88J30J06j14
$$ -87 22 183 -22 -58 -159 11 -97 97 186 -86 58 225 -156 -120 8 -208 59 -129 1 107 -7
6009gL8J44j54O0j9m7n7O3j50J46j7k5J10k03J21J69k47R2k4j37K37j23n0L0m2
$$ -7 31 175 21 81 62 15 -42 21 -129 17 0 -25 85 -118 3 172 -75 17 -7 -144 93 -30 -80 -50 -92
6034i2k5K45k23N1J09%k6P4Nj34K9j14K08j51j5j41L12n0k90L50n0Oq9j14Q0K46
$$ -92 -117 128 -95 -44 65 65 39 113 118 -16 13 -101 107 -44 -59 -200 112 62 -228 122 72 78 -11 -125 -45 201
6060B01j01j77rQ7m3J8r6j03L79qj15M7P1j51p0J61j56J09j25j42L78j5k99K20
$$ 201 100 -77 -86 1 -42 -24 -120 -223 156 148 33 80 151 0 -70 91 -65 44 -81 -223 155 140 -159 61
6084F1k49J52Q3q8J72l29J07P3R3m8o9nN3j54J91j59J79J1J57o0l66K94j2j53
$$ 61 -188 -36 47 -41 131 -198 -91 -18 75 27 -42 -47 6 -148 43 -116 63 74 231 171 -195 99 87 -66
6108f6K8M6Q9p1r0MM6j26J66j33J73o4N3j64P9Kp1j8R1J31q0j07P2j23J7K91j80
$$ -66 -38 8 97 26 -64 -60 -14 -140 26 -107 66 2 55 -109 -30 -28 -99 -117 -26 105 25 -82 -10 -133 -116 175 -5
6135ep8K24r1J9KjL2j00kj10K08k6Q8k72R4J92k68o4K76j05j22Q9j28J40jl1j5
$$ -5 -83 141 50 69 71 70 102 2 0 -110 98 72 160 -112 -18 174 -94 -158 118 13 -109 -20 -148 -8 -9 -40 -55
6162e5j3M9P7j30L8k4Q2o0J3l5R5j79J03J23l6j95K64q0L5K3o1N0j99J7oN3r4
$$ -55 -68 -19 58 -72 -34 -58 24 -36 -23 -58 37 -142 -39 84 48 -147 117 37 72 95 34 84 -115 -98 -104 -51 -145
6189a45J83k64K89j62pK03j57R1om7J1J16n0j46J95j27o2P9M4l7j04O1M7L6M9
$$ -145 38 -226 63 -99 -106 97 -60 31 25 -22 -11 105 55 -91 104 -23 -85 -6 38 1 -103 -42 5 41 90
6214I0j21J02j9j86K49o7l1J02n9q0n0K16k67J04R6j87R2J52l6j45Q4q6J01p8
$$ 90 -31 71 52 -134 115 48 17 119 60 -20 -70 146 -121 -17 79 -108 -16 136 100 -45 39 -47 54 -24
6238b4Q1K1O2o3j04J08j51M5O4k8q3M7R8K4j32O7j3M2k51K75q1kj90p6M03j2j12
$$ -24 57 78 140 77 -27 81 -70 -25 39 11 -72 -25 73 97 -35 32 19 61 -190 85 4 2 -188 -264 139 127 15
6265A5m2j6Q4m7j04K19k35K08j39j26K97o2j13J37k7j17L5Q2m0Mk5L9J0j87P0
$$ 15 -27 -43 41 -6 -110 109 -126 82 -57 -183 114 52 -61 76 49 -68 -33 49 9 13 -12 27 37 -150 -80
6290h0K16k36J06J04q0K4Jj83J53j39K60j36K1M0j14J97l25L2P5Q3j02R9o6M6
$$ -80 136 -100 6 110 30 54 55 -128 25 -114 146 10 31 71 -43 154 -171 -139 -64 19 -83 16 -50 -4
6314dO8j04P4J03j00j34J93j69J22K6p0M4L7q5j36R3r7K29j36L8O1J81j96q9q4
$$ -4 64 -40 34 137 37 -97 96 -73 49 75 5 49 86 1 -135 -42 -139 90 -46 -8 53 234 38 -51 -135
6339a35J37j01R0Q5L4N3j62K17l63J44j01J15j24J03k9K6O9k3J4o2m0P5o7K55
$$ -135 2 -99 -9 76 110 163 1 218 -145 -1 -102 13 -111 -8 -37 -11 58 35 49 -13 -53 22 -45 210
6363B10l18M7P1M8k33R5J70j24P8L0p2j53Q0K8ln3j46K10m2R0j11J15O0Oj14k3
$$ 210 -108 -61 10 58 -175 -80 90 -34 44 74 2 -151 -71 -43 -46 -99 -245 -35 -77 13 -98 17 77 83 -31 -54
6389e4J90l49K22k1m2J37j65n1J72J14j08lm6J22Q2k19N2J0j00K9l8KJ76q2J16
$$ -54 136 -213 9 -12 -54 83 -82 -133 39 153 45 42 -4 118 200 -19 33 43 -57 -28 -66 -64 112 30 146
6414A46M8k10l3K17k09R0q9jJ54q4j09K8J87j34l0q0K50j47J22k41J02j20M9%
$$ 146 194 -16 -49 168 -41 49 -40 -41 113 29 -80 -52 135 1 -29 -109 141 -6 116 -125 -23 -143 -94 -94
6438i4J07J06j85L10m42L04k28M4Q3j52K90j25j6r8J41qN8k25J87Rp6j27K09J34
$$ -94 13 119 -66 244 -198 106 -122 -78 5 -147 143 18 2 -96 45 37 95 -130 57 66 -10 -137 72 206
6462B06k10j09M1q0J48k1m6O9kP5P9q6o6m4JJ17j56L0N5n0k0J11j59R8n1M8J3
$$ 206 -4 -113 -72 -152 -4 -25 -71 -2 -4 71 150 64 -2 -46 -45 72 -84 -54 1 -49 -69 42 -117 -19 -70 -22 -9
6489io7k1K21k98K88j32r6J72K0k1M6k08MJ16m9J94j16j1l0p8PJ00m0J08o0%l0
$$ -9 -76 -97 124 -174 114 -18 -114 58 78 57 103 -105 -101 15 -34 160 44 33 3 -75 -68 32 -8 100 40 40 10
6516A0Np3P1j72J71L4n0K3j26K51k45J79l9j52J5J53p0q1J47o4P8j35o4M6J71
$$ 10 15 -58 13 -159 12 46 -4 19 -107 144 -101 78 39 -113 -98 55 -15 -96 51 -13 65 -70 -134 -88 83
6541H3m9l3K4o9j15K05j96RK07l4j28J81P0k64J23J12k55J03k0Rq1j4J61Q7Kj99
$$ 83 34 1 25 -44 -159 46 -150 -141 66 32 -96 85 155 -109 14 126 -129 -26 -46 -37 -118 -132 29 116 118 -81
6567h1l6O7O5o2r8O6J27q1k8m3r5K50nj33L7O7lj85J32J31p0p7P2J20j74L6J59
$$ -81 -117 -50 15 -47 -145 -79 48 -33 -61 -104 -199 51 46 -87 -50 17 14 -171 -39 92 22 -55 17 137 -37 -1 158
6594A58j68o3L10q7j01rk0p9J48j65mJ31L1q0o0O4N5j25j12K33n5k9M5r9K41k04
$$ 158 -10 -73 237 150 49 40 20 -59 89 -76 -80 51 82 2 -58 6 61 -64 -176 57 2 -27 18 -81 160 -44
6620d4j6J23j22J41l5j80J28o7M5P6j0j67J80j80L5J06j19J87j38J54k10J26J0
$$ -44 -60 63 -59 82 47 -133 -5 -72 -27 49 39 -128 52 -128 -93 13 -106 81 -57 97 -113 13 23
6643B3j05n7J75j78J88k31J75j21J58Np4P3l8k37K89J22j09R6j65j68J12N0JN0
$$ 23 -82 -139 36 -142 46 -185 -10 -131 27 32 -42 31 -7 -244 45 167 58 154 -11 -179 -67 -17 -16 34
6667C4k7n1J16R9k23N7k25J71R3J31j42l2j04K1J16L0k43L29o2M4m3j05K40k10
$$ 34 7 -44 72 171 -52 5 -220 -49 44 175 33 1 -103 -82 34 64 -179 150 88 132 89 -16 224 14
6691A4r5Q9RL1K2j64p8P2L02j31l5l8Oj07J64l9j77K25j48L1R4m6p6q9K55k17
$$ 14 -81 8 17 48 70 -94 -172 -100 202 71 36 -2 4 -103 61 22 -155 70 -78 -47 47 1 -75 -164 91 -126
6717a26j9J18M6j19n1K89K4j78m7k5J73oj0j57Q8oj40P7l9J59k3l3l2Q5j2j7L6
$$ -126 -145 -27 19 -100 -151 138 162 -16 -63 -88 85 79 69 -88 0 -6 -146 -69 -108 51 28 -5 -37 48 36 19 55
6744E5j3j16N6L8n7J77p7m6J4l5j25K07j34k09M15j02O4M9j76K2M2rqM5m5o2O
$$ 55 42 -74 -18 20 -37 140 63 17 31 -4 -129 78 -56 -265 150 48 112 161 -15 7 49 40 32 77 32 -30 -24
6771b4LJ50p3j29J08j14N3qP4j47J39m4j56J53J08k16J36j7J1J00p4o0j35K5K14
$$ -24 -21 129 56 -73 35 -79 -26 -34 40 -107 32 -12 -168 -15 93 -123 13 -4 7 107 33 -27 -162 -137 77
6796G7o5O7k13N3J19n7om1R0N8k1j38L6o3J66m8J0j5j30l9K26j25N2J09j13M8
$$ 77 12 79 -134 -81 38 -19 -25 -66 24 82 61 -77 -41 -104 62 14 24 9 -121 -160 66 -59 -7 102 -11 37
6822C7j2m4Q2J7J02k46q2K18Or0j00K12q4J20j0j18Qq7J33r3l0R6J6J18k18J00
$$ 37 25 -19 63 80 182 -64 -146 72 78 -12 -112 100 16 136 126 8 16 -71 62 -31 -61 35 51 169 -49 51
6848E1k06J24K8j1mk5J43j02P1j64J30j64K17j21J00J26l47J79J04k30m1K13m7
$$ 51 -155 -31 -3 -14 -18 -43 100 -2 69 -95 35 -129 88 -33 67 193 -154 25 129 -101 -142 71 24
6871B4J15j89J22J4k28J86j34L2j51J59J72q2k1j3o9j08K82k44O0J10J31k81K15
$$ 24 139 -50 72 86 -142 44 -90 -58 -209 -50 122 40 19 6 -63 -171 111 -133 -73 37 168 -113 102
6894A02j85M8K8L4L6j60nK90j23j59J17J4M2j38J44q8JK13k00Krr3J22k5m4j62
$$ 102 -83 -35 -7 27 63 -97 -102 188 65 -94 23 37 79 -59 85 -3 -2 211 11 13 4 -89 33 8 -36 -198
6920a98K50k61L19j26k7J03M2M2j22O1r4J54j32L3j14J07K3Q4j55q5j4M9J85p
$$ -198 52 -209 110 -16 -43 60 102 144 22 83 -11 143 11 44 -70 37 60 144 -11 -96 -110 -61 124 117
6944A17j48K09n1l48R7K89j73k7O1O8j95l3K86k97K6K56o1r6K2k8J56q6j60n7
$$ 117 -31 178 127 -221 -124 165 -8 -35 26 94 -101 -134 152 -145 -119 137 76 -20 2 -26 130 44 -116 -173
6968a73J4J85j2N4j90q1L17k8k37Q1r7K12j48K65q5j05R8n9p6L5p8J69n9m2P2
$$ -173 -159 26 14 68 -122 -203 114 86 -151 -70 -167 45 -103 162 77 -28 70 11 -65 -30 -108 61 2 -40 32
6993C2RJl5o7J02J05j49J31j08l7n0Q5j37L1K45j63M5J16j53N7o4j41L6J74m3
$$ 32 41 42 7 -60 42 147 -2 129 21 -16 -66 19 -118 -87 158 -5 40 156 3 60 -4 -145 -109 65 22
7018B2P1r5p2J53r0J96n4k11K70k69OP3J23j72J29J01j91p2J80k11J32Q6j37J9
$$ 22 93 -2 -74 79 -11 185 131 -80 190 -79 -73 0 123 -49 80 181 -10 -82 98 -113 19 105 -32 -13
7042a3O9j15j6J57J4j24K1r6Q3n6p1L96j98K2k43K50j32M2R3k31M9J03j9P6o2
$$ -13 56 -59 -75 82 96 -28 -7 -103 -20 -76 -147 249 51 73 -170 80 -52 -10 83 -148 -99 4 -15 61 -1
7067aj7k2J7O6Qk56K00Q9p1j39K27J34q7r6N6n8j15j17J13J9Q4qJ1Q4j72K66k38
$$ -1 -18 -40 -23 43 51 -205 -5 84 13 -126 101 235 148 52 108 50 -65 -182 -69 -50 34 26 37 121 -51 215 -23
7094b3l3J05j16o8K47nj55oJ1j6Q9n4j62K70j36RLN3N9M2j46K04k02R7j44J21
$$ -23 -56 49 -67 -135 112 107 -48 -54 -43 -59 30 -24 -186 84 -52 -43 -40 13 72 114 -32 172 -30 67 -77 44
7120D4Lk8J25p5r3O0J1j37K05j47j7m0R6N8p8k2J3J28rj68J36k37K9J35J85k8
$$ 44 47 19 144 69 -24 36 47 -90 115 -32 -49 -89 7 65 -13 -35 -22 106 97 -71 65 -172 -143 -8 177 149
7146A49j24N8m0n8K83j18r3j16J16M7j2j25M8j3k1J14P4l02J87J8Nm2o0K2Nmj18
$$ 149 25 83 43 -15 268 150 57 -59 57 104 92 -33 15 2 -19 95 169 -133 54 72 77 35 -25 -3 2 -2 -120
7173a20K22o1k2K0r5L7o2k31L28K9k6Rk30J48n6K67Q4j90J38j17o3l7j56K76j31
$$ -120 102 41 19 39 -56 -19 -81 -312 16 45 19 28 -202 -54 -110 157 241 51 189 72 9 -28 -184 92 -39
7198c9j5j04K0j4J39K5J5J7P3j73J62j83L1J17j17l1M9J53r3l3j85J80o2J10j5
$$ -39 -54 -158 -138 -152 -13 12 27 44 117 -56 106 -77 -46 71 -46 -77 -28 125 32 -1 -186 -6 -68 42 27
7223B7P8pl1q2p8O4P5o8j50K61k91M0K00J43q5j36p5K10o1J06p5j11J0N8n8k2
$$ 27 105 98 67 -15 -93 -29 46 -22 -172 89 -202 -162 38 181 96 -40 -115 95 34 140 65 -46 -36 22 -36 -58
7249e8R5r0M1QM5J6j10K4j64J57l2J59r5j52J54p2l5J85o0q7q0K00j39J78J16
$$ -58 37 -53 -12 -4 41 57 -53 -29 -193 -36 -68 91 -4 -156 -2 -74 -109 76 16 -71 -151 49 -90 88 204
7274B04j41o9J38j32r0j0L18j61k20J81m3lJ62q6r0%j51K22r8mJ32m3j8J21j74
$$ 204 63 -6 132 0 -90 -100 218 57 -163 18 -25 -28 134 48 -42 -42 -193 29 -69 -73 59 16 -2 119 -55
7299e5J69k36J26l4L8o9L9K2O1o0Q6k4l1j76K71o5k01J69R3q0J5j19J00j38K43
$$ -55 114 -122 4 -30 8 -61 -22 0 61 1 87 63 32 -144 127 62 -139 30 123 43 58 -61 39 -99 144
7324A44nj19J6J13j97r2J26p5L8O1j09J41N3j69K40j96j84K04j20L7%R5J54m7
$$ 144 139 20 36 149 -48 -140 -14 -89 -51 10 -99 42 95 -74 166 -30 -214 -10 -130 -93 -93 2 156 109
7348A09r5J31j85J07j53J31p1j2o8J58k2j39J46q9o4J11q8J66p6p5P8j01J37K3
$$ 109 14 145 -40 67 -86 45 -26 -38 -106 52 30 -109 37 -52 -116 -5 -93 73 -3 -78 0 -101 36 59
7372E9l3P1k97K00j02J15o2J37n1j84J53j9J73j27j7J24j57k7k7P5j26LJ10o2
$$ 59 26 97 -200 0 -102 13 -49 88 37 -147 6 -13 160 33 16 140 -17 -44 -71 4 -122 -119 -9 -71
7396g1k56J72J87l13L07J6M6n5n3j6j0j4J07N8p0M5j61k4J14L1j36k8J95p2n9
$$ -71 -327 -155 32 -281 26 42 88 33 -20 -36 -46 -60 47 105 35 80 -81 -105 9 40 -96 -124 71 -1 -60
7421f0l6J07N3l6n8l1k1J66n5M9n6j10K0j17K79j56p2P6n2J73j12K90l52K43l1
$$ -60 -96 11 64 28 -30 -61 -82 84 29 78 22 -88 -68 -185 94 -62 -134 -58 -110 63 -49 241 -111 132 101
7446A01q6Kq1J5Q5n7r2R9p1J23j14J25O8p8j47K76j14j3l5Q5M5j18oj32R7J51
$$ 101 15 17 -64 -49 36 -21 -113 -14 -85 38 -76 49 117 39 -108 168 54 41 6 91 136 18 12 -120 -23 128
7472A28j19O2j24K1J12r5lO3J30j19o4p0kN4O8j03K31j97J2k8K70j44r1L5j01
$$ 128 9 71 -53 -32 80 -15 -18 45 175 56 -8 -78 -80 -26 42 -61 170 -27 -15 -43 227 83 -8 27 -74
7497g4j16L24r6j36J29j22R7r3N5J28n1k9J6j41K54k48o2K10Lj84l9K67m5J8M1
$$ -74 -190 134 38 -98 31 -91 6 -87 -32 96 45 16 32 -109 145 -103 -165 45 48 -136 -175 92 47 65 106
7522A06k85P7J26ko8Q8Oj0o7O3k48P5J8OK15j71J5J0M5o7k4J40L2l7M2n4J04j12
$$ 106 -179 -102 24 22 -46 42 48 38 -29 34 -214 -139 -121 -115 100 -71 -56 -46 -1 -68 -92 48 80 43 85 31 135 23
7550B3k7J73j07j08N9P1j43M4K99k67j25P4Q9Rj05LJ19j27j8j0QQp9K35j34l4
$$ 23 -4 169 62 -46 13 84 -59 -15 284 17 -108 -34 55 64 -41 -38 81 -46 -64 -74 -66 -58 -137 98 -36 -70
7576g0J13j08K49k42J30r2K9J51j30J38j60o1k8J14o0O6o9j4J36j2n5r4K6j24
$$ -70 43 -65 184 -58 72 -20 9 160 30 168 8 -53 -81 33 -27 39 -30 -44 92 80 25 -69 -43 -167
7600a67J83o4j16K81k15Q5p4mn7J10Q7K2j43Ll4J90k1o0p3K21j36L6J41j73K6
$$ -167 16 -48 -164 117 -98 -13 -87 -91 -148 -38 49 71 -72 -69 -103 87 66 6 -67 154 18 54 195 22 48
7625D8j53M6r0L62j54j56N7P6J9Pq1K12j78q6N7n9P7j58L40j63q2N5K08k72J10
$$ 48 -105 -59 -149 213 59 -97 -40 36 55 62 -19 193 15 -71 -14 -73 4 -154 186 23 -59 -4 204 -68 42
7650D2j00P6J11o6k0J23k62oJ78l5p8j04J55k43L04j45K83k51j05J51j05J16N4
$$ 42 -58 18 129 63 43 166 -96 -102 76 41 -37 -141 14 -229 75 -70 213 -38 -143 8 -97 19 73
7673G3J2r1N2n8K06k10j49O0J37Q8l60K89q7Q3M3j29J00j42J11%M1j04j00P1J60
$$ 73 85 -6 46 -12 194 -16 -165 -105 32 120 -240 49 -38 45 88 -41 59 -83 28 28 69 -35 -135 -64 96
7698I6j57O5L4l6K8l0rk2p2K90j16j64O9j00J79J8j28j00K25l7O3j59R3Mrr7J3
$$ 96 -61 4 38 2 30 0 -9 -31 -103 187 71 -93 -24 -124 55 73 -55 -155 70 33 96 -63 30 34 25 -72 -59
7725e9J86k32J29j01J59n0J9q4J26k93L57j53j03J87r8O0J59j90N2OM8k34O5M
$$ -59 127 -105 24 -77 82 32 51 -33 93 -200 157 4 -99 88 -10 50 209 19 71 77 125 -109 -44 -40
7749d0J76j69j16K35k3J10k60J90j23N3N9J3p0rq9j9J50J36l34J39k0p5M8J41
$$ -40 136 -33 -149 86 63 173 -87 103 -20 33 92 105 35 26 -63 -82 68 204 -130 9 -11 -86 -38 103
7773A03j26p0K30k72R4l5K42j8k10J02N3k17J87j84R9l1n9J04or5J23j33%J09
$$ 103 -23 -93 137 -135 -41 -76 166 148 -62 40 93 -124 63 -121 -22 -53 -112 -8 -14 -109 14 -119 -119 -10
7797a0j00O3l4J42L6j64Nk6J36K7p4M7l3N0l4j24j00J77L8J6k21o5J57j00J41
$$ -10 -110 -47 -81 61 97 -67 -62 -88 48 75 1 48 15 65 31 -93 -193 -16 22 38 -183 -248 -91 -191 -50
7822e0j18n3J50L8j22J65O1Q9p0q2j08J90j30M3o3O0Q9j84L0J71q2j08J08l8j41
$$ -50 -168 -221 -71 -33 -155 10 71 160 90 8 -100 90 -40 3 -60 0 89 -95 -65 106 24 -84 24 -14 -155
7847a55M3L34k07m9L20j49r1Oj66Q6pj3J00n4nL5j06QjK45j11j04N8J50j94M1
$$ -155 -112 222 15 -34 286 137 46 52 -114 -28 -35 -48 52 -2 -7 28 -78 -70 -71 174 63 -41 17 167 -27 14
7873A4Nq2Q6Q6j88K67l07n0J01l2J1J47J26k46rJ52n6p4R1o5J42l8R6j93Q2q8
$$ 14 19 -63 23 109 -79 188 -119 -169 -68 -100 -89 58 184 -62 -71 81 25 -49 42 -23 119 81 177 -16 66 -22
7899b2O5%j2j9J00l9j70J33P2j03n3J47r8J0j10P2M0j68M7O7m6P5k9J80q3q3R4
$$ -22 43 43 31 12 112 73 -97 36 108 5 -48 99 1 11 -99 -27 13 -155 -108 -41 -87 -12 -41 139 56 -27 67
7926F7o4K4n5m8mK54j84K03j94N7j71J55O1M1r6k0n4Np1K15l05J80O8j38j4m6
$$ 67 3 27 -28 -76 -80 174 -10 193 -1 56 -115 40 101 142 46 26 -28 -23 -94 121 -184 -4 64 -74 -88 -134
7952a34K40Q9j84K9Pl7K0J31k05lR2j41J20j19O3k3P9m3P2q1Jr9P5M4J9P1q4r0
$$ -134 106 195 11 40 47 10 30 161 -44 -47 45 -96 24 -95 -32 -55 24 -19 53 -28 -27 -126 -51 -7 12 83 -1 -91
7980i1N1j3R6k9m8K6l3J8J48m6j22K7J5l4J0O2R0q0j72K7J80j78P4J16o1J4k08
$$ -91 -40 -53 43 14 -34 -8 -41 -23 125 79 -43 -16 -1 -35 -25 37 127 47 -125 -98 82 -96 -22 94 33 47 -161
8007a61K19p9KP6O1j08j55Q9N0k2l4J46m8j52J11M6k9j44P6J27K0j30L7J07j54
$$ -161 58 -21 -19 57 118 10 -145 -56 -6 -28 -62 84 36 -116 -5 41 12 -132 -56 71 91 -39 -2 105 -49
8032d9J34j82J04N0R0j54K9j22P7l6o0K10m5k8j3J04j17j0k9J5OP3j82J82l5o8
$$ -49 85 -97 7 57 147 -7 22 -100 -23 -59 -119 91 46 18 5 109 -8 -18 -47 -32 -26 47 -135 47 12 -56
8058e6R4k71K53o0O9nj13M7K3o5J39l6lj30J11l5R7k79K58J00j66J18j66Kj3K1
$$ -56 38 -233 20 -40 29 24 -89 -42 -19 -84 55 19 16 -114 -3 -38 59 -220 38 138 -28 90 -76 -74 -87 -66
8084f6J26O0k01K56j43m6J01j29k08K93J04k69N8O7P8oJ16k14j16P4K90l30J53
$$ -66 60 120 -81 175 32 -14 87 -42 -250 43 147 -122 -64 3 81 75 191 -23 -139 -65 225 -105 48
8107D8M3j05m8J03r3j3r5J30R7n4L0Pj34J1L7P0K6JM3L4k07P7j06O8J5J48j12
$$ 48 91 -14 -62 41 -52 -65 -160 -30 67 13 43 50 -84 -73 -36 34 60 61 104 138 -69 8 -98 -30 -15 133 21
8134B1J00j91L0K9p1J27jo8j7J46p7j04J09j11J8J30j33J66P0k40K8O0L9j53P6
$$ 21 121 -70 -40 -11 -82 45 44 -24 -41 105 28 -76 33 -78 -60 70 -63 103 173 -67 -39 21 60 -93 -17
8159a7Q4J47l2k56l7M7J08j66K16j8J33l5j47q5J33jJ3l8n2j53K25P7j13j50J93
$$ -17 67 214 182 -74 -111 -64 44 -122 94 76 209 174 27 -58 75 74 87 49 -3 -156 69 146 33 -117 76
8184G6j42L0l4J33j41j0P4
$$ 76 -66 -36 -70 63 -78 -88 -14
8191a4
$$ Imaginary data points
##PAGE= N=2
##DATA TABLE= (X++(I..I)), XYDATA
0@%%%%%%%%%%%%%Qj6J6j6K4l2L2m0M8n6P2q0Q8j04J26j50J68j92K24k56K88l23
$$ 0 0 0 0 0 0 0 0 0 0 0 0 0 0 8 -8 8 -8 16 -16 16 -24 24 -32 40 -40 48 -56 70 -80 88 -104 120 -136 152 -171
35a71L63m08M58n14N76o42P11p88Q74r68J072j182J303j437J584j746J923k119
$$ -171 192 -216 242 -272 304 -338 373 -415 459 -509 563 -619 684 -753 831 -915 1008 -1111
53a111K337k580K853l164L519l929M412m986N682o549P666r168J1303j4600K0430
$$ -1111 1226 -1354 1499 -1665 1854 -2075 2337 -2649 3033 -3516 4150 -5018 6285 -8315 12115
68A2115l3806J21237L0186k29173J5147J38593M1565j04905o123J7619J0981r098
$$ 12115 -21691 99546 129732 -99441 -84294 54299 95864 -9041 -15164 2455 13436 4338
80D338M2201n626p0933r391N5330N3430l0950p0102J6660M0073J2704l1411J25
$$ 4338 46539 40913 -30020 -39411 15919 69349 38399 -31703 -15043 25030 37734 6323 6448
93F448K993j7132J0969K9703o271n9793J3570O5326k4887m9673J1560M6074k1839
$$ 6448 9441 -7691 3278 32981 26710 -33083 -19513 45813 20926 -28747 -17187 28887 7048
106G048l1854L4680J8068l5154j3432L9532r240l9400K3503M0299j3532n9400
$$ 7048 -24806 9874 27942 -7212 -20644 18888 9648 -29752 -6249 34050 20518 -38882
118c8882Q606O2306o834o1371j2093O3232K4840n3741l4083M3436L1255m3283
$$ -38882 -30276 32030 25196 -36175 -48268 14964 39804 -13937 -48020 -4584 26671 -16612
130a6612j2613L5639N143l0167l742L5072n798l0401J0770J8712j5384q634K0924
$$ -16612 -29225 6414 11557 -18610 -22352 12720 6922 -23479 -12709 6003 -9381 -18015 2909
143B909m444k3718O353L1180j882m2660J368L8077L641k4877n079K3093K584k3799
$$ 2909 -1535 -25253 -18900 12280 10398 -32262 -30894 7183 10824 -14053 -19132 3961 6545 -17254
157a7254O86K9958m946l4816P888L4668K122l5096j1420K8059N662j1809P125
$$ -17254 -16568 13390 8444 -26372 -18484 16184 18306 -16790 -28210 -151 5511 -6298 827
170H27J722k2060r21L5545J4157l7772l1638L5528M2752k0948l8110k90L0290
$$ 827 2549 -19511 -20432 15113 29270 -8502 -40140 -4612 38140 17192 -20918 -21208 9082
183I082J3912j6788j1941l83r89Q556J3861o991j6135j396J2728J0567q528q903
$$ 9082 22994 6206 -5735 -6118 -7107 1449 15310 8319 -7816 -9212 3516 14083 5555 -3348
197c348J103P75J1965J1036j3678j9340N538K2372N774k2284j3080J9790J2006
$$ -3348 -2245 -1470 10495 21531 7853 -11487 -5949 16423 22197 -87 -13167 6623 18629
210A8629j2832j1562K859J0824q32o654M340o20o424P964Q067j0444r047R624
$$ 18629 5797 -5765 -2906 7918 7086 432 4772 4152 -2272 5692 13759 3315 -5732 3892
224C892J4359r388j9607J1359J7569j1068j3311N440Q603m273r765O051R967j0063
$$ 3892 18251 8863 -10744 615 18184 7116 -6195 -755 7848 3575 -6190 -139 9828 -235
238b35q391R959P574n398j0815K318J4982k207j1079K615L590l046m0K903l21
$$ -235 -8626 1333 8907 3509 -7306 -4988 9994 7787 -3292 -677 2913 -133 -173 2730 2409
253B409q080j947J2971J72j5355N8J0164K418n487m616N432L846n354K08M045
$$ 2409 -5671 -7618 5353 5525 -9830 -9772 392 2810 -2677 -7293 -1861 1985 -3369 -3161 884
268H84j390j278j784J469N308m311n364K574J257K140j440o219J530M985Q14j696
$$ 884 -506 -1784 -3568 -2099 3209 -1102 -6466 -3892 -2635 -495 -1935 -8154 -6624 -1639 -825 -2521
284b521n270J751Q300k692m629L400R98k69j12J36J358m103r73P512k562p348
$$ -2521 -7791 -6040 2260 -432 -5061 -1661 -663 -932 -1044 -908 450 -3653 -4626 2886 324 -7024
300g024K708M124J4m656j931P979N89p908L266O319j915m592k11P898J689j0489
$$ -7024 -4316 -192 -178 -4834 -6765 1214 1803 -6105 -2839 3480 1565 -3027 -3238 4660 6349 -4140
316d140N26R861k559o180j201N087L016p368j316P140j516m516K665K596M55l354
$$ -4140 -3614 6247 3688 -2492 -3693 1394 4410 -2958 -4274 2866 1350 -3166 -501 2095 2550 -804
332h04l62P024q88o490K808L776q07k899k279M646J344o801R24M225k297k023
$$ -804 -1166 5858 4970 -1520 1288 5064 4257 1358 -921 3725 5069 -1732 -808 3417 1120 -903
348i03o49K855L012n060j426N489N74j218k097n41N136L25n047J033Q91k49O7
$$ -903 -1552 1303 4315 -745 -2171 3318 3892 2674 577 36 5172 5497 450 1483 2374 2125 2192
365B192k226J167j0m263L471K911l745j945N39L285K891m986j698N483J64k072
$$ 2192 -34 1133 1123 -3140 331 3242 -503 -2448 -1909 1376 4267 -719 -2417 3066 3230 1158
381A158o54N85K109l839k243O570k67o836l82L599K005l101m033M450K443m415
$$ 1158 504 1089 3198 -641 -2884 3686 3419 -3417 -3799 -200 1805 -1296 -5329 -879 1564 -2851
397b851Q78K823l22j088k199L596M555n736m091L936K742p24m053o35L721l501
$$ -2851 -1973 850 528 -560 -2759 837 5392 -344 -4435 -499 2243 1519 -2534 -3169 552 -2949
413b949j213N475k262m973K349M461J836m860m423N514M513j673k445k058L067
$$ -2949 -4162 1313 -949 -5922 -3573 888 2724 -2136 -6559 -1045 3468 1795 -650 -2708 359
428C59L236n394q76M497l116k709K961K757k526n610K802P094l927m010L245J369
$$ 359 3595 -1799 -2675 1822 -1294 -4003 -1042 1715 -811 -6421 -3619 3475 -452 -4462 -1217 152
444A52R76k48k019K779J916m222k112K753M766k611p637M773N987p111k648N251
$$ 152 1128 880 -1139 1640 3556 -666 -2778 -25 4741 2130 -5507 -734 5253 -1858 -4506 745
460G45j294l297L043O366j550r412O5Q623K816j916o337l379J0260N718j0356
$$ 745 -549 -3846 -803 5563 4013 -5399 -5334 3289 6105 4189 -2148 -5527 4733 10451 95
475I5n979M848M594k408j791L247m403o610R696Q409q848o888K402M792L794j113
$$ 95 -5884 -1036 3558 1150 -641 2606 -1797 -8407 1289 9698 850 -6038 -3636 1156 4950 3837
491C837m005j298L350M919m427o552L917J440l200O365K603r163m689M647L981
$$ 3837 -168 -1466 1884 6803 2376 -4176 -259 1181 -2019 4346 6949 -2214 -6903 -2256 1725
506A725k282p53N065k624m820O261J614o693L71L089J510K789q83o196m429M525
$$ 1725 -557 -1310 3755 1131 -3689 2572 4186 -2507 -2136 953 2463 5252 4369 -1827 -6256 -1731
522a731P932l949o732K701n87q39P122j479q344J964Q325N71q527k171P980J086
$$ -1731 6201 2252 -4480 -1779 -2366 -3205 3917 2438 -5906 -3942 4383 4954 -3573 -5744 2236 3322
538C322k015L631l590o059J839K375J056P74k673m49K528J060m189p158N274J1389
$$ 3322 1307 4938 1348 -4711 -2872 -497 559 1333 -1340 -1789 739 1799 -2390 -9548 -4274 7115
554G115m327p562N098L569l941l869J660N729j27l444l62q15J163J032l574L67
$$ 7115 2788 -4774 324 3893 -48 -3917 -2257 3472 3345 -99 -461 -1276 -113 919 -2655 -2288
570b288L123l018m83L775j221l344P61O621K054r550m123Q721N221k205m857k016
$$ -2288 835 -2183 -2666 1109 -112 -3456 -2695 3926 5980 -3570 -7693 1028 6249 4044 -813 -2829
586b829N174M51n296M32J568j248J223L198J419o429p784P300J0106l781o567
$$ -2829 2345 2796 -2500 -2068 -500 -1748 -525 2673 4092 -2337 -10121 -2821 7285 3504 -3063
601c063p24N713M860n449n220L850K571q35r93k43J59l140K87O329k209o721K217
$$ -3063 -3787 1926 6786 1337 -3883 -33 2538 1703 710 467 626 -2514 -2227 4102 1893 -4828 -2611
618b611K818p59N22J692J263k419k569K985K19j241K093j125K41L897l914n437
$$ -2611 207 -552 -30 1662 2925 506 -2063 922 1141 -100 1993 868 1109 5006 1092 -4345
634d345K248K599n95j024K635J385o113q91O050j090k807K545P80l81J463j529
$$ -4345 -2097 502 -93 -1117 1518 2903 -3210 -4101 1949 859 -1948 597 1377 996 2459 930
650I30k392Q37L698K75n334N07L823m378q02N807k118m746K707K780k772l503
$$ 930 -1462 -625 3073 3348 -1986 -1479 2344 -2034 -2836 2971 853 -3893 -1186 1594 -1178 -4681
666d681M978M859m748k590M035p77j337j78q36K848L045m059m020J716L327k660
$$ -4681 297 5156 408 -2182 1853 1076 -261 -439 -1275 1573 4618 559 -3461 -1745 1582 -1078
682a078l873N744L277p402o59P082j975n195K208N118p6m174N90K166j828N55
$$ -1078 -4951 793 4070 -3332 -3991 3091 1116 -4079 -1871 3247 3171 -1003 -413 1753 -75 480
698D80J103k824N51J283k338J154J224k524p86K926K210l663m267N903M277n322
$$ 480 1583 -1241 -690 593 -1745 -591 633 -1891 -2677 249 2459 -1204 -5471 432 4709 -613
714f13j143L352j42r26m88k8Q77q59M69j96j394J636j681k675M315J549m048m45
$$ -613 -1756 1596 1454 528 40 12 889 30 499 303 -1091 545 -1136 -3811 504 2053 -1995 -2440
732b440L037J237k010j980L323J220l064J436J281j788m0k9M70R90l127q70K896
$$ -2440 597 1834 -176 -2156 1167 2387 -677 759 2040 252 212 183 653 1643 -1484 -2354 542
749E42M42j758j907J501L657k563l376M391J995l290p99K325J702k112k918L403
$$ 542 984 -774 -2681 -1180 2477 -86 -3462 929 2924 -366 -1165 1160 2862 750 -2168 1235
765A235J951l627r16J128J309l66l216O46L011j519j387J681N32o3j247O19L153
$$ 1235 3186 -441 -1357 -229 1080 714 -2502 -1856 1155 -364 -1751 -70 462 399 -848 -229 2924
782B924k234k374K933J340j632j793Q0K819p94l832J624J646j173p16n71J794
$$ 2924 690 -1684 1249 2589 957 -836 -756 2063 1269 -2563 -939 707 -466 -1182 -1753 41
798D1J063k856N49K669o81q52k85Q03K323k464j888K826K71j761o01M6J631r33
$$ 41 1104 -1752 -1203 1466 785 -67 -352 451 2774 310 -1578 1248 1519 -242 -843 -797 834 -99
816i9k608K436R88k100O1R81R78J12k499J763K590k401r46J558O37q2k572M84
$$ -99 -2707 -271 717 -1383 -1322 -341 637 749 -1750 13 2603 202 -744 814 1451 1369 -1203 -719
834g19K976k308k482K075J028n83j921j24L309n91l054J884J833n76p88n74K310
$$ -719 2257 -51 -2533 -458 570 -13 -1934 -2058 1251 660 -2394 -510 1323 747 -41 -615 1695
851A695L33l048N86K334j286j227k70Q84J119k801l97L112j014j603N22J249J233
$$ 1695 2028 -1020 -434 1900 614 -613 -883 1 1120 -1681 -2078 1034 20 -1583 -1061 188 1421
868A421j881j222L235J73k144M68P30P64q01j781J747Q32k773l62J652O25n73
$$ 1421 -460 -1682 1553 1726 -418 50 780 1544 743 -1038 709 1541 -1232 -1594 58 683 110
885A10k614J015L520k038j964J699J254Kj261L55K356j971j943K352O95j423q78
$$ 110 -2504 -1489 2031 -7 -1971 -272 982 984 -277 78 2434 463 -1480 872 1567 144 -734
902g34m24K076Q9k881K91J723rj050n40K129J042l343M05L737q58k221k6J628
$$ -734 -1158 918 1007 -1874 -1583 140 131 -919 -1459 670 1712 -1631 -1226 2511 1653 -568 -594 1034
920A034Q22k080l51J773j097j153Q71l22M73n31j775K435J807k488j421J038K660
$$ 1034 1856 -224 -575 1198 101 -1052 -181 -503 -30 -561 -2336 99 1906 -582 -2003 -965 1695
937A695l86k489J943J646k949M5K187j389j153j89J641R04k376j255J187N39R55
$$ 1695 1309 -1180 763 2409 -540 -495 1692 303 -850 -1039 602 1506 -870 -2125 -938 -399 556
954E56j079j564K949N08l063J417K385r66j935N95K650j225l580K255K360k296
$$ 556 -523 -2087 862 1370 -1693 -276 2109 1143 -792 -197 2453 1228 -2352 -97 2263 -33
970c3m37L41o69K20j046p9K540K50j301j231J121K297k391k231M729J168l325
$$ -33 -470 -129 -798 -578 -1624 -1703 837 1087 -214 -1445 -324 1973 -418 -2649 2080 3248 -77
987g7n7R83p31j268m5K655m61k540O60P02j44K49j774M77L497j066k735R88J947
$$ -77 -134 849 118 -1150 -1195 1460 999 -1541 -881 -179 -323 -74 -1848 -1371 2126 1060 -1675 -687 1260
1006A260J33j705O83K207k760j954K746N97j394J03j95M40j71j910r2J696J252
$$ 1260 1393 -312 371 2578 -182 -2136 610 1207 -187 -84 -279 161 -10 -1920 -2012 -316 936
1023I36j06j757J414J410l606j46L932m69j551N44N14o72j616K38J496r41k42
$$ 936 830 -927 487 1897 -1709 -1855 2077 1608 57 601 1115 443 -1173 -935 561 -380 -622
1040f22O22p46Q43j26k483K162K817k127j935J345J941p75j751K486O33m035O54
$$ -622 0 -746 97 -29 -2512 -350 2467 340 -1595 -250 1691 916 -835 1651 2284 -1751 -1097
1057a097K615j774p36J058M87K97j300j372J29O90J906m60j325K840l80m116J933
$$ -1097 1518 -256 -992 66 553 850 -450 -1822 -1693 -1003 903 443 -882 1958 1578 -2538 -605
1074f05L064k229j046K066J225k669k136K716L79k326J527N00j599Q63L68j644
$$ -605 2459 230 -816 1250 2475 -194 -2330 386 765 -1561 -34 466 -1133 -270 98 -1546
1090a546J601J690j292k069J388K447k644j425M771j25m471J155J606j920j022
$$ -1546 55 1745 453 -1616 -228 2219 -425 -1850 2921 2796 -1675 -520 1086 -834 -1856
1105a856J711J690q27j469L99r27k72K333j366m15L807q61l699J009K603j316
$$ -1856 -145 1545 718 -751 -352 -1279 -1551 782 -584 -999 2808 1947 -1752 -743 1860 544
1121E44k120K261K815l613k463L688m17k627J318J015n84j04p52L14N06J009K70
$$ 544 -1576 685 3500 -113 -2576 1112 695 -1932 -614 401 -183 -287 -1039 -725 -219 790 1060
1138A060j956J130K100l401p87M178k29k978P86J803j710k577J392K700j674r79
$$ 1060 -896 234 2334 -1067 -1854 2324 2095 -883 -97 1706 -4 -2581 -1189 1511 -163 -1142
1154a142J885r34q43P27o36O19J749k07j278Q1J265p75k338K055K273k838j254
$$ -1142 743 -191 -1034 -307 -943 -324 1425 1218 -60 21 1286 511 -1827 228 2501 -337 -1591
1171a591K346l46j645N1J003Q68j470l49J415l85L22J29o98J128M27k093M00J616
$$ -1591 755 409 -1236 -1185 -182 686 -784 -1133 282 -103 219 348 -350 778 1205 -888 -488 1128
1189A128l17j112q0J297l05k610R71K205j491p02Q15O25q7j286m7J760q5o66K33
$$ 1128 811 -301 -381 916 611 -1999 -1028 1177 -314 -1016 -201 424 337 -949 -996 764 679 13 246
1208B46K83O11q98j250J895L91k069rJ115k2r81q11J674O41k066J46J456j24k88
$$ 246 529 1140 242 -1008 887 1278 -791 -800 315 293 -688 -1499 175 816 -1250 -1104 352 228 -60
1227f0l61P81J152j512r17J589J39o40m84J78J268j163j594J682J62j055OL93
$$ -60 -421 360 1512 0 -917 672 811 171 -313 -135 1133 -30 -1624 58 220 -835 -829 -436
1245d36P99m4j413O06J421p45l95M29N16L90j694K1J729r38r88O19J69K50j007
$$ -436 363 319 -1094 -488 933 188 -207 222 738 1128 -566 -545 1184 246 -742 -123 46 296 -711
1264g11o51J656Mj193L66N76M99n10r43J528Q80j955R0J022J24n08j406J282R84
$$ -711 -1362 294 298 -895 -529 47 546 36 -907 621 1501 -454 -364 658 782 274 -1132 150 1134
1283A134j828n14J462k62m72m84L29J506j182p68J470N65r00m78M25J244o46j529
$$ 1134 -694 -1208 254 -8 -480 -964 -635 871 -311 -1079 391 956 56 -422 3 1247 601 -928
1301i28J103R40j241n73L14O20j55j273O00J178r89n06P43L97K53r66J17J590
$$ -928 175 1115 -126 -699 -385 235 80 -1193 -593 585 -404 -910 -167 230 483 -483 -366 1224
1319A224n53j079O10K04L25n66r01J328k3j494M12O06k25k60n79Q86P02j203J83
$$ 1224 671 -408 202 406 731 165 -736 592 569 -925 -513 93 -132 -392 -971 -85 617 -586 -403
1338d03Q50M7j07n81K98J185j230m60R81k7o67l47mR28l98j237J018M82q78Q1
$$ -403 447 494 387 -194 104 1289 59 -401 580 553 -114 -461 -465 463 65 -1172 -154 328 -550 -469
1358d69K12Q53Kj361R14R74q04l92R2N19K91j352J6J353o92j034M40M71n3q34
$$ -469 -257 596 598 -763 151 1125 321 -71 21 540 831 -521 -505 848 156 -878 -438 33 -20 -854
1378h54kJ554l72j122O87O33j14l50k86R30K78j297K46P06j40o67o04P46R26j771
$$ -854 -856 698 326 -796 -109 524 410 60 -226 704 982 -315 -69 637 497 -170 -774 -28 898 -873
1398h73j74J472j61p37J8M12N37p20l07J205q7m03j14n8O48m8j362P45Q94r05
$$ -873 -1047 425 264 -473 -455 -43 494 -226 -533 672 585 182 68 10 658 610 -752 -7 887 -18
1418a8q56L22Q22l50r88O45J167q53m74P27K05p1l34j06J263l73j086M76K00K75
$$ -18 -874 -552 270 -80 -1068 -423 744 -109 -583 144 349 278 -56 -162 1101 728 -358 118 318 593
1438E93p08o99J075K00j482J93J251k51n11j27Q69Oj017L31R00k27M1k62q3P43
$$ 593 -115 -814 261 461 -1021 -828 423 172 -339 -466 403 409 -608 -277 623 396 437 175 92 835
1458H35j046m57P99O07q66l49J42P42p72q93J249N58r23K22K88J18q8m41N02P14
$$ 835 -211 -668 131 738 -128 -477 -335 407 -365 -1258 -9 549 -374 -152 136 254 166 -275 227 941
1478I41m70l78j63M12L51j133j87J318p45j109P55O63l15m52L01Q28m96q50P92
$$ 941 471 93 -70 342 693 -440 -627 691 -54 -1163 -408 255 -60 -512 -211 617 121 -729 63
1497F3j16L34K79p84O35O67j509m63R95M26q36m66R59M65j507l64J769m89l40
$$ 63 -53 281 560 -224 411 1078 -431 -894 101 527 -309 -775 184 649 -858 -1222 547 58 -282
1516b82L02J73J39l39k03N69K45j69l98p03R79J70j603R47J419j418j045P63O18
$$ -282 20 193 332 -7 -210 359 604 435 37 -666 313 483 -1120 -173 1246 -172 -1217 -454 164
1535A64n46m03J122P41j309M7O74q12K78M97l26M43J58r17m49K18J008p80q31
$$ 164 -382 -785 337 1078 -231 -184 490 -322 -44 453 127 570 728 -189 -638 -420 588 -192 -1023
1554a023J927j76k049N55J322p10m55R04L23m54n65N94K67l54N77l59q08Q94k70
$$ -1023 904 728 -1321 -766 556 -154 -609 295 618 164 -401 193 460 106 683 324 -484 410 140
1573A40j317R48Q41l01j213O37Q99j399o02J939N98j503O48L88q73j48M6N37O9
$$ 140 -1177 -229 612 311 -902 -265 634 -765 -1367 572 1170 -333 315 703 -170 -318 -272 265 334
1592C34L75m06n42p9N81q85l30J643k39j272L34Q58n96n37Q19Q88q75m50P76n7
$$ 334 709 303 -239 -318 263 -622 -952 691 452 -820 -486 372 -224 -761 58 946 71 -379 397 340
1612C40n00M49j94j49N56o23p11O45N86m70o20N89Q23j534k86J712r2p72O29Q3
$$ 340 -160 289 95 -54 502 -121 -832 -187 399 -71 -691 -102 721 -813 -1099 613 521 -251 378 461
1632D61k2q30M7M74J85j73J01l23L40k1j155N49J062o82o36L97N24k92p82Q42
$$ 461 439 -391 -344 130 315 142 243 -80 260 239 -916 -367 695 13 -623 -226 298 6 -776 66
1652F6Q53r70k05N53j18J2Ml11M29j06p30J26L43J39l58k29R00J10j487M31R75
$$ 66 919 -51 -256 297 179 191 195 -116 313 207 -523 -397 -54 85 -273 -502 398 508 -979 -548 427
1673D27l70k22J97O45k85p41P5N95j66r1k03j09O59n06p16P89L37n95K3M87K52
$$ 427 57 -165 32 677 392 -349 -274 321 155 64 -139 -248 411 -95 -811 -22 315 -280 -257 230 482
1694D82o99n29J232L2p87M52M0n4J50m18j0M59j59n93R8K20K08o67j17J428k76
$$ 482 -217 -746 486 518 -269 183 223 169 319 -99 -109 350 191 -402 -304 -84 124 -543 -660 768 492
1715D92j169P56L14l39j83K94O39m47m61K26L0k07K00n73N06K86n72l97O94j62
$$ 492 -677 79 393 54 -129 165 804 357 -104 122 152 -55 145 -428 78 364 -208 -605 89 -73
1735g3j63j94N31M27p54l64J079m0o90K51K02ok94j16K99J76l61o0j1J63K17p57
$$ -73 -236 -430 101 528 -226 -590 489 449 -241 10 212 206 -88 -204 95 271 -90 -150 -161 2 219 -538
1757e38K08Q61n82l72N22L02k39m98L24O65n49k77N79j93Rl23j04L88j44n27K95
$$ -538 -330 531 -51 -423 99 401 162 -336 -12 653 104 -173 406 213 222 -101 -205 183 39 -488 -193
1778a93J43K1k77l13O52K43o11K37N59k36l28L0M76n5n57O7M62k42k87j56L32
$$ -193 -50 -29 -306 -619 33 276 -335 -98 461 225 -103 -73 403 348 -209 -142 320 78 -209 -365 -33
1799c3K59m94k71M81K66m69Q9R8J69n3l47K80N35n57j50M66o3o4n74M42L37m97
$$ -33 226 -268 -539 -58 208 -261 -172 -74 95 42 -305 -25 510 -47 -197 269 206 142 -432 10 347 -150
1821a50j14K54L2j71j9l00O66p4m96L77K97k59j19j25O04p3n45K81K04l41J98
$$ -150 -264 -10 22 -149 -168 -468 198 124 -372 5 302 43 -76 -201 403 330 -215 66 270 -71 127
1842A27n63Q86j60j165N93M88q5l25J58OL79m43j28N32Q2m82J09R9K67m00k95
$$ 127 -436 450 290 -875 -282 206 121 -204 -46 -40 339 -104 -232 300 382 -100 9 108 375 -25 -320
1863c20L89K12o64RL44P4l7n05L22N29l74q6K22N6n4r3j16N51l86l33L05J34k23
$$ -320 69 281 -383 -374 -30 44 7 -498 -176 353 -21 -107 115 171 117 24 -92 459 73 -260 45 179 -44
1886d4k85P4M93On83J89L18j78j29p2M69k4l26j24O89l75r3q3K10J18m32k08O49
$$ -44 -329 -255 238 244 -339 -150 168 -10 -139 -211 258 234 -92 -216 473 98 5 -78 132 250 -182 -390 259
1909B59q4k78j17J11K12k62k59M76K71l42j16K01K49j84m05M62J47n38J45K04
$$ 259 175 -103 -220 -109 103 -159 -418 58 329 -13 -129 72 321 137 -268 194 341 -197 -52 152
1929A52j88Mk04J65N6N5p57O72J66O8j19l35K74J22O5j67L40j25m32K46q7J4n50
$$ 152 -36 -32 -236 -71 -15 40 -717 -45 121 189 70 -265 9 131 196 29 369 244 -188 58 -29 -15 -565
1952e65P09o46N00m38J41l87L52M08j4l96O80q15M84j51J25k29k17M41K49p14
$$ -565 144 -502 -2 -440 -299 -686 -334 74 60 -336 344 -471 13 -138 -13 -242 -459 -18 231 -483
1972d83j6M50k92O35n14N19o11N94k27o77Q26M39r16J93P40m80q44R29J58j92
$$ -483 -499 -49 -341 294 -220 299 -312 282 55 -622 204 643 -273 -80 660 180 -664 265 423 231
1992B31q24Q18J35p85L60J53k0k31j62O54o19J66j12j86N90P1m24l05Q05K17j001
$$ 231 -593 225 360 -425 -65 88 68 -163 -325 329 -290 -124 -236 -422 168 239 -185 -490 315 532 -469
2013d69m9J179p21k36K98M28m53m81M90Q9n9J39J52j187N09J72k87L03P60p70
$$ -469 -518 661 -60 -296 2 430 -23 -504 -14 75 16 155 307 -880 -371 -199 -486 -183 577 -193
2033a93L29K53j29%j053J263k46k80J25Q4r0k54J59LJ40m10J77k4K89J35j83m43
$$ -193 136 389 260 260 -793 470 224 -56 69 153 63 -191 -32 -29 111 -299 -122 -146 143 278 95 -348
2055c48K90M06o73L76L95k07m51L17L07m11k92K45J76k42P1O7j19K75k10j61M54
$$ -348 -58 348 -325 51 446 239 -212 105 412 1 -291 -46 130 -112 -41 26 -93 182 -28 -189 265
2076B65rl27P7k7P4l15k28Q95m16j59l60R18K45r53K60lOk31M57m88N65j21l51
$$ 265 256 -71 6 -21 53 -262 -490 405 -11 -170 -530 388 633 -320 -60 -63 -57 -288 169 -319 246 125 -226
2099b26N99N3o46K16K80p3n73L33J53R0l14p84J009K89p77K7j4J23N76q65N24
$$ -226 373 426 -220 -4 276 203 -370 -37 116 206 -108 -892 117 406 -371 -344 -358 -235 341 -524 0
2120@r5Q7M06r37J085j44o17j08P40k2m13L3J57l66j4n9M00r9l5K15m03J85M6
$$ 0 -95 -8 398 -539 546 402 -215 -323 417 395 -18 15 172 -194 -208 -267 133 34 -1 214 -189 -4 42
2143D2k29K38M55m37l68K81KKk81M13J75l90LJ04j67M1O8K1L5N6j26K8Q3J68M5
$$ 42 -187 51 506 69 -299 -18 -16 -14 -295 118 293 -97 -94 10 -157 -116 -48 -27 8 64 -62 -34 49 217 262
2168B62m65N57k19l23J06L35l07L3J6j27J56l35J48K56k08J09Q7r2M9J9k07K38
$$ 262 -203 354 135 -188 -82 253 -54 -21 -5 -132 24 -311 -163 93 -115 -6 81 -11 38 57 -150 88
2190H8K16j69k21K0L48l42l88M97J74n25K93N8p3m0j70K46K39j34r6K3J92o1j90
$$ 88 304 135 -86 -66 282 -60 -448 49 223 -302 -9 49 -24 -64 -234 12 251 117 21 44 236 175 -15
2213a5k53M95p8m19K18J92j96r3J76J67k26k53K04M6p8J65K6M1O0l46J10K15j20
$$ -15 -268 227 149 -270 -52 140 -56 -149 27 194 -32 -285 -81 -35 -113 52 78 119 179 -167 -57 158 38
2236C8j34m0J74J85k78j4J90j54k49J17J35o4k0L2O5J10k00J83l7K6k0k44K57
$$ 38 -96 -136 38 223 -55 -69 121 -33 -282 -165 -30 -94 -114 -82 -17 93 -107 76 39 65 45 -199 58
2259E8J40k06o3M0J5J06j72j41K97j52j46J59J71k52J30J05j76J25q7L3J14k97
$$ 58 198 -8 -71 -31 -16 90 -82 -223 74 -78 -224 -65 106 -146 -16 89 -87 38 -49 -16 98 -199
2281a99J99P7J21k24N6j62K12j21M4k12K24R0kj44L3P8k31K89k35J71r0j72N09
$$ -199 0 77 198 -26 30 -132 80 -41 3 -209 15 105 103 -41 -8 70 -161 128 -107 64 -26 -198 311
2304C11L0l13k17l0M69k68n5jJ96k82K32j41lK69l69R2K38j71J26N1j97O2j43
$$ 311 341 28 -189 -219 250 -18 -73 -74 122 -160 72 -69 -72 197 -172 -80 158 -13 113 164 -33 29 -114
2327a14k5L96n01O0J50J23n0j01q3J72J07k67L6J51O8j47r2K30o1k23L9L36k23
$$ -114 -139 257 -244 -184 -34 89 39 -62 -145 27 134 -133 -97 54 122 -25 -117 113 52 -171 -132 204 -19
2350a9m0J36Oq3n5j33K67j24l2M8j20K75n1q9J17j04%K0o0J22K5k51J24R0k82
$$ -19 -59 77 83 0 -55 -188 79 -45 -77 -29 -149 126 75 -14 103 -1 -1 19 -41 81 106 -145 -21 69 -213
2375b13j41L40J2p5Q5n0J92l30L25j04l1q4O8pL8m1k33K02J15q7l1J59N6j00l90
$$ -213 -354 -14 -2 -77 8 -42 150 -180 145 41 10 -74 -6 -13 25 -16 -249 -47 68 -19 -50 109 165 65 -325
2400c25K57K59j17k04K3Q8Q3j43q2L65l20J26J42K2k42q2l0K32Q2k23j06J8J46
$$ -325 -68 191 74 -130 -107 -19 64 -79 -161 204 -116 10 152 174 -68 -150 -180 52 134 -89 -195 -177 -31
2423c1m7J9L5j8q3m5J33Q5j90O5K52m9r8j95L62j39lp4j97K05J38l00O9J04n4
$$ -31 -78 -59 -24 -42 -125 -170 -37 48 -142 -77 175 126 28 -167 195 56 53 -21 -218 -13 125 -175 -106 -2 -56
2448e6L6l1K13j92r1L9J18rQ0J7j44l4P1o5J0rj27K49j45J42k40p9L60Q4l00q
$$ -56 -20 -51 162 -30 -121 -82 36 27 107 124 -20 -54 17 -48 -38 -47 -174 75 -70 72 -168 -247 113 197 -103 -111
2474a11L9k8J35j77O1J48P9j07p4n5L06k57m2k19K74l64J91J25K57p07O78O12
$$ -111 -72 -100 35 -142 -81 67 146 39 -35 -90 216 -41 -83 -302 -28 -392 -201 -76 181 -526 152 764
2496G64q43r3l9R9K87n63P24%k22l17K21O3p98J156o75L98j22m6J4O0j54J22o3
$$ 764 -79 -172 -211 -112 175 -388 336 336 114 -203 18 81 -717 439 -236 162 40 -6 8 68 -86 36 -27
2519b7n0P6o3j29J68P9L6r5M1j15j07K63j83L59k63p3l7K73j29k60K05K04k51
$$ -27 -77 -1 -64 -193 -25 54 90 -5 36 -79 -186 77 -106 253 -10 -83 -120 153 24 -236 -31 173 -78
2542g8p3L03j16R0n6J73l43M9J40q6k6p6J93m35L35P1m46L01M53l94j69L17J78
$$ -78 -151 152 36 126 70 243 -100 -51 89 3 -23 -99 94 -341 -6 65 -381 -80 373 -21 -190 127 305
2565C05k99L51j52J11L9n62M81k45k50L1k72N96%k02l13J07L54j34l49L71j58
$$ 305 6 357 205 316 355 -207 274 29 -221 -190 -462 134 134 -68 -381 -274 80 -54 -403 -32 -190
2586a90j00K37j5L40p27N00J58k00L15p19jL70m54J05L10P20r29L74m59O99j14
$$ -190 -290 -53 -68 272 -455 45 203 3 318 -401 -402 -32 -486 -381 -71 649 -280 94 -365 334 220
2607B20R7n58M80k34j41P6OL04m91L67k04J05Q2j31k62K38OJ9J79J37l41O4J72
$$ 220 317 -241 239 5 -136 -60 -54 250 -241 126 -78 27 109 -22 -284 -46 -40 -21 158 295 -46 18 190
2630A90Q1m58j0M74q8k25J79%K03m16J25r5R8K8k43J68j18K4P1r0K12m2j82J60
$$ 190 271 -187 -197 277 189 -36 143 143 346 -70 55 -40 58 86 -157 11 -107 -83 -12 -102 110 68 -114 46
2654D6j1r6L6J16j14k4j22L29j23k6j0K8k0q9Q5j05J41k8l4o4M4M7q4M1K4J13
$$ 46 35 -61 -25 91 -23 -47 -169 160 37 11 1 29 9 -80 5 -100 41 13 -21 -85 -41 6 -78 -37 -13 100
2680A00m3j48J25J75k74Q9j11J35p5M6P0n7mJ08j52J00O8j68J53K5j42Q8J40j85
$$ 100 57 -91 34 209 -65 24 -87 48 -27 19 89 32 28 136 -16 84 152 -16 137 162 20 108 248 63
2704F3j00J01O8r2j36p6L30j82M0j31J93J2Q7k98K75j57j53O9L5K66j82r9J19
$$ 63 -37 64 132 40 -96 -172 158 -24 16 -115 78 90 177 -121 154 -3 -156 -87 -52 214 32 -67 52
2727E2K9k36K15o2L5q3k13K25N0j48L8K0L0J92nj36O8k4q5P7J4j11J33k01J47
$$ 52 81 -155 60 -2 33 -50 -263 -38 12 -136 -98 -78 -48 144 139 3 71 47 -38 39 53 -58 75 -126 21
2752B1l6j05J7J01LJK1O4k7j16P7L3j6j1Q0j20K40j09k11J56M7q0j11J05J8m2
$$ 21 -15 -120 -103 -2 1 2 23 87 60 -56 21 54 38 27 107 -13 227 118 -93 63 110 30 -81 24 42 0
2778@Nj7k07K93Nk01J22O0L3m5J95k11k7j78K01M8l29J68L0J96j95r6L1M9k0o8
$$ 0 5 -12 -219 74 79 -122 0 60 93 48 243 32 5 -173 28 76 -253 -85 -55 141 -54 -150 -119 -70 -90 -158
2804a58K33J2N2o2NJ4l8n6m2K04k36N4J37j24m5p3J3J70j61R0n2PM9L8M2p9L4
$$ -158 75 87 139 77 82 96 58 2 -40 164 -72 -18 119 -5 -50 -123 -110 60 -101 -11 -63 -56 -7 31 73 -6 28
2831B8j68K91j74%m2J6o4N0j87K80P5j22P3j30kJ11k30K06O7j46Oj27K57p6J92
$$ 28 -140 151 -23 -23 -65 -49 -113 -63 -250 30 105 -17 56 -74 -76 35 -195 11 78 -68 -62 -189 68 -8 184
2856A84l62K12nQ8j21j89J49m1K5O4l8J5N9k46J98kq2k0O4M0kP3Q3k33J02O6r
$$ 184 -178 34 29 117 -4 -193 -44 -85 -60 4 -34 -19 40 -206 -8 -10 -92 -112 -48 -8 -10 63 146 -87 15 81 72
2883G2j7k0p3P1r7J02Nl3J67j79o7J74r7J17r2J84l19K28j07R1j38P5j50Q5K07
$$ 72 55 35 -38 33 -64 38 43 10 177 -2 -69 105 8 125 33 217 -102 126 19 110 -28 47 -103 -18 189
2908A89L5l54J99K9j63N4q1Q9J06L8j86N5o6l0Q2J15L5N8l78L47j33J4k71K90
$$ 189 224 -130 69 98 -65 -11 -92 -3 103 141 -45 10 -56 -86 -4 111 146 204 -174 173 40 54 -217 73
2932G3R2k42J07J6q3p4PO6j61L06q3L2o2lpJ04N2j36p6J98n8j63J75j87J19ln7
$$ 73 165 -77 30 46 -37 -111 -104 -38 -199 107 24 56 -6 -9 -16 88 140 4 -72 126 68 -95 80 -107 12 9 -48
2959d8Q6j49K46j75j5J42Qj18K13j05P5m9p1M8q3j20N0P0J45j64j16K37j47j35
$$ -48 38 -111 135 -40 -55 87 95 -23 190 85 160 111 40 88 5 -115 -65 5 150 -14 -130 107 -40 -175
2983a75L17j64o2L8J1J46j8j66P6M4j74K06j03q0Q3q7J52k3q4J13mp8J28Qj8j9
$$ -175 142 -22 -84 -46 -35 111 93 -73 3 47 -127 79 -24 -104 -21 -108 44 21 -63 50 46 -32 96 104 86 67
3009F7l8Q2j81K99j60N4k55J43J10k90o1J21K02m0q2K34j47j96L00j64P2N4j60
$$ 67 29 111 -70 229 69 123 -132 11 121 -169 -230 -109 93 53 -29 205 58 -138 162 -2 70 124 -36
3032c6J24Q7j68j29J42Q0j37p1O4lO9j48K44j9k70J73KR4j80k1J86k12R6J18j81
$$ -36 88 175 7 -122 20 100 -37 -108 -44 -47 22 -126 118 99 -171 2 4 98 -82 -103 83 -129 -33 85 -96
3057i6M7O0k04Q7L74k49k61O4Q6J74n2j17K27o6k93K50J62j90R3O5m0j51J07r8
$$ -96 -49 11 -193 -106 268 19 -242 -178 -92 82 30 -87 140 74 -219 31 193 3 96 161 121 -30 77 -21
3081b1L8n9L7j48J46J29p2k63K34j25L41l82J96J1p5R6j06J11PK8n0N2k40P9n7
$$ -21 17 -42 -5 -153 -7 122 50 -213 21 -104 237 -145 51 62 -13 83 -23 88 95 123 73 125 -115 -36 -93
3106i3J39k05M3J23k9L8k93J78J39m2k20K10j9l3q5K52K7j12J8Q0k04J66l08K3
$$ -93 46 -159 -116 7 -22 16 -277 -99 40 -2 -222 -12 -31 -64 -149 103 130 18 36 116 -88 78 -230 -207
3130b07J62Q7j9r6O3J05j25j97K90p3j5N4O1j68J58q9N5O7j3j15K3l5N5j0j55
$$ -207 -45 42 23 -73 -10 95 -30 -227 63 -10 -25 29 90 -78 80 -9 46 113 100 -15 8 -27 28 18 -137
3155a37RJ77j18J59q3j84Q4%K16o9j56J49j09P5M7n8J47j34n7j32K95P9l40J32
$$ -137 -128 49 -69 90 7 -177 -93 -93 123 54 -102 47 -62 13 60 2 149 15 -42 -174 121 200 -140 -8
3179hJ80Mr7k6K3q6q5M6N3n4J81j46J28J10l88J18o5Q8l0n5J62Q7p3j96J06q3
$$ -8 172 176 79 53 76 -10 -95 -49 4 -50 131 -15 113 223 -165 -47 -112 -24 -54 -109 53 140 67 -129 -23 -106
3205a06M4M5j07K43j81K11j71k3J04q2j2Q6l7o2j0N2N4k43J57QO1r6MK02j53J47
$$ -106 -62 -17 -124 119 -62 149 -22 -45 59 -23 -35 51 14 -48 -58 -6 48 -195 -38 -30 31 -65 -61 141 -12 135
3231A35N4k19J15q8qL9l1j14M3j9J68m9r9J29p7K0j59K22k03K21q8J6N8NN0j38
$$ 135 189 -30 85 -3 -11 28 -3 -117 -74 -93 75 26 -73 56 -21 -1 -160 62 -141 80 -8 8 66 71 121 -17
3257a7J94k36M1r8J77j28L3L2P8j03J04j66L16k76p3M7J36j11O6J45k67Q4k3K4
$$ -17 177 -59 -18 -116 61 -67 -34 -2 76 -27 77 -89 227 -49 -122 -75 61 -50 16 161 -106 -22 -45 -21
3281b1LN5K5m0P4Qq6J6lj8m5j04K26m0j51J38N4j17o9J41j7l7J67j51l6J18r7
$$ -21 -18 37 62 22 96 104 18 34 31 13 -32 -136 90 50 -101 37 91 -26 -95 46 29 -8 159 8 -28 90 -7
3308gJ02j50J29o2Oj19J8J05j75K61Q1k15j31J21L2K36j74j53J74j26l5L0J59
$$ -7 95 -55 74 12 18 -101 -83 22 -153 108 189 -26 -157 -36 -4 232 58 -95 79 -47 -82 -52 107
3331A07Jj3n5M2l6L2j48j8L03j69J1J6j17l0J69o2P3k69J80O2l34K23p9P4J83
$$ 107 108 95 40 82 46 78 -70 -88 215 46 57 73 -44 -74 95 33 106 -163 17 79 -255 -32 -111 -37 146
3356A46k80PL6J07k3m5J04p8J01j36L0pK3k31M00L2l28K74j63R4k33J47p1J59
$$ 146 -134 -127 -91 16 -7 -52 52 -26 75 -61 -31 -38 -15 -246 154 186 -142 132 -31 63 -170 -23 -94 65
3380F5k42K7K37l1m0j28K09Qj54N3M6r0K24l32J90K8j34k3k26M97Kk80N9N5m9
$$ 65 -177 -150 87 56 16 -112 97 105 -49 4 50 -40 184 -148 42 70 -64 -87 -313 184 186 -94 -35 20 -29
3405b9J85k05R1r7J40j08P8Qj86L8R2L9r7m6l4K3M3q7J06lN2K9j29N0J23n2j88
$$ -29 156 -49 42 -55 85 -23 55 63 -123 -85 7 46 -51 -97 -131 -108 -65 -152 -46 -49 3 32 -97 -47 76 24 -164
3432a64J44O9j16m5K56m4j7j60k0Q8M9l3J27j44J23j67J02M7o3Jp7nk9L51j88
$$ -164 -20 49 -67 -112 144 100 83 -77 -97 -9 40 7 134 -10 113 -54 48 95 32 33 -44 -49 -78 273 85
3457H5o1N8j93J90r8k0J20j30jN3k6o4J83j33KJ63p5l5m6n1L9Jn4J73K3k40K94
$$ 85 24 82 -111 79 -19 -39 81 -49 -50 3 -23 -87 96 -37 -35 128 53 18 -28 -79 -40 -39 -93 80 103 -137 157
3484A57q4j40P6J17j03%k09L36l89m5P28l15R5k40j61L00l3K09j7k05k83J46l13
$$ 157 73 -67 9 126 23 23 -186 150 -239 -284 444 129 224 -16 -177 123 90 299 282 77 -206 -60 -373
3507c73L99j56L18j06j21K39k17J9K8J4K01k29J02j15J70qk50m6L55j19j10N8
$$ -373 26 -130 188 82 -39 200 -17 2 30 44 245 16 118 3 173 165 -85 -131 224 105 -5 53
3529E3O8j12o2J99o3N8k81pJ21K5n4o6L9J32l7l7K04j29m4K00N4l05j10J45qM2
$$ 53 121 9 -53 146 83 141 -140 -147 -26 -1 -55 -121 -82 50 13 -24 180 51 7 207 261 -44 -154 -9 -17 25
3555B5k8R4j90P1P3j60J3m1J20Q1j14J33j07Nj2K09j51qr3J42j19k2K20k31Q2
$$ 25 -3 91 -99 -28 45 -115 -102 -143 -23 58 -56 77 -30 -25 -37 172 21 13 -80 62 -57 -79 141 -90 -8
3580hq2RJ26J03j60M1q6j05n3J28L9j2k6qJ36j64L7%K50O3l45NL5%k9l3K16k18
$$ -8 -90 -81 45 148 -12 29 -57 -162 -215 -87 -48 -60 -86 -94 42 -122 -85 -85 165 228 -117 -112 -77 -77 -106 -139 77 -141
3608a41j49J39L0J45l1L8J37j86J73J9k20J90k93K87Ok26J89J08j70k58J91J16
$$ -141 -290 -151 -121 24 -7 31 168 -18 155 174 -46 144 -149 138 144 -82 107 215 45 -213 -22 94
3630I4k99J71J51k65J25k4J5Pj24K79p3k1j23J59j08o8P2j57K24j09J30j49o2
$$ 94 -205 -34 117 -148 -23 -47 -32 -25 -149 130 57 36 -87 72 -36 -104 -32 -189 35 -74 56 -93 -155
3653a55K01k13K57N5k77RJ87Q5p4K4m8p4n8n3R2M8j16K18k00L26l71N6Q7K8Nk26
$$ -155 46 -167 90 145 -132 -123 64 149 75 99 51 -23 -81 -134 -42 6 -110 108 -92 234 -137 -81 6 34 39 -187
3679a87J72R9q4Rm8J89j01L7m2j58Q0Q7N1O6p3j16J54k14M6p0R2j09K30K7j13
$$ -187 -15 84 0 9 -39 150 49 86 44 -114 -34 53 104 170 97 -19 135 -79 -33 -103 -11 -120 110 137 24
3704B4o8J64l65K30K68j13k09N9J2M4j88J97L2m4j32M6J33r4R3k1p1N9J44l03
$$ 24 -44 120 -245 -15 253 140 -69 -10 2 46 -142 55 87 43 -89 -43 90 -4 89 68 -3 56 200 -103
3728a03Q2J40k76J69M9k08N6J47L8Pl91L19j4R5j21r2O4Q6k7o1J14j8J20j99q8
$$ -103 -21 119 -157 12 61 -147 -91 56 94 101 -290 29 15 110 -11 -103 -39 47 20 -41 73 55 175 -24 -112
3753a12J20J7j90J13J72j36j35K26qO8j29K1n5j02o4J46R1K37k89q0P6o1n9J52
$$ -112 8 25 -165 -52 120 -16 -151 75 67 135 6 27 -28 -130 -194 -48 43 280 -9 -89 -13 -74 -133 19
3777A9j58k3O6m4R1Mk94M14j12M2J37j25q0J03l0J3l9J8R4k13J36J34j73J73j47
$$ 19 -139 -162 -96 -140 -49 -45 -339 75 -37 5 142 17 -63 40 10 23 -16 2 96 -117 19 153 -20 153 6
3802Fj51J27L4kj4j8j11J57o2K2l4O3L9mj51K25j61n7k12L46n3j4k0m1M4J1J34
$$ 6 -145 -18 16 14 0 -18 -129 28 -34 -12 -46 17 56 52 -99 126 -35 -92 -304 42 -11 -25 -45 -86 -42 -31 103
3829A03l65J83m3N5n7K03r2q9R4o7L33j66l73K27J05j82K27j89O4j15M3J49P4
$$ 103 -262 -79 -122 -67 -124 79 -13 -102 -8 -75 258 92 -281 -54 51 -131 96 -93 -29 -144 -101 48 122
3852A22k15N8J8j25M2m6J48K54k77M4r6J10J32j12M2p0k6q3M3mJ43j64J03K6P8
$$ 122 -93 -35 -17 -142 -100 -146 2 256 -21 23 -73 37 169 57 99 29 3 -80 -37 -41 102 -62 41 67 145
3877A45o8o4J86k99J74J0m2M6k37J54N4k6j41L3o4K03q1j4L4R9k18K44j08l1j72
$$ 145 77 13 199 -100 74 84 42 88 -149 5 59 33 -108 -75 -139 64 -17 -31 3 102 -116 128 20 -11 -183
3902a83K12M9m2j76J12M1k8J00k27J29l2J01J09k2l13K03r1o2P5o5o4J45j1JQ2
$$ -183 29 78 36 -140 -28 13 -15 85 -142 -13 -45 56 165 143 -170 33 -58 -120 -45 -110 -174 -29 -40 -39 43
3927D3r4L65k19j48J74J41l33L0L3o4J31j47P8J81q9n3%nN8n5N1m3J02j85M7l47
$$ 43 -51 314 95 -53 121 262 -71 -41 -8 -72 59 -88 -10 171 82 29 29 24 82 27 78 35 137 -48 -1 -348
3953c48L26oq5K14p9k25J69m1o2N8J86m7J07m4k63P2J13J60j27n2Q7P0j17j75
$$ -348 -22 -28 -113 101 22 -203 -34 -75 -137 -79 107 60 167 123 -140 -68 45 205 78 26 113 183 66 -109
3977a09M0J52L9n2j05j15N2Q8J39j12j99K17l1j29P6L4l0J87j22J40o3p8j37J43
$$ -109 -69 83 122 70 -35 -150 -98 -10 129 17 -182 35 4 -125 -49 -15 -45 142 20 160 97 19 -118 25
4001B5Jk5k3P7k3Q4j07j18J00j6M0K22q1q8m7j52J99J22n5k72J16Qj25j03J22
$$ 25 26 1 -22 55 32 116 9 -109 -9 -25 15 237 156 68 21 -131 68 190 135 -137 -21 -13 -138 -241 -119
4026a19J38j40r9K58j45L8J21k4ql6P1K7q4nL5j64J21J14j37J05N3j88J03M3o9
$$ -119 19 -121 -220 38 -107 -69 52 28 20 -16 55 82 -2 -7 28 -136 -15 99 -38 67 120 -68 35 78 9
4051IJ12l13R1J30L6j66Q5J46j52j71J59N2J59r0j38L6n5N8p1l4K07j43k4Q8p6
$$ 9 121 -192 -101 29 65 -101 -16 130 -22 -193 -34 18 177 87 -51 -15 -70 -12 -83 -117 90 -53 -77 11 -65
4076f5p9J11K9M5o0N1j52J61kj1J2N1n2j73j6J27NJ0j33L67k44k54K49K23j15
$$ -65 -144 -33 -4 41 -19 32 -120 41 39 28 40 91 39 -134 -150 -23 -18 -8 -141 226 -18 -272 -23 200 85
4101H5l5j29J7K79n6k81J51q1J08M6j85J20o7L9P5P1k60J28j70L9J62j6Mo3n3
$$ 85 50 -79 -62 217 161 -120 31 -50 58 104 -81 39 -28 11 86 157 -103 25 -145 -106 56 40 44 -19 -72
$$ [...]
8191c34
##END NTUPLES=NMR FID
##END=
