##TITLE=1H_DE-80H_X3
 200.13MHz, d2o
 8 sc
 
 19ns.26.2.2025
##JCAMPDX= 6.0         $$ Bruker NMR JCAMP-DX V2.0
##DATA TYPE= NMR FID
##DATA CLASS= NTUPLES
##ORIGIN= UXNMR, Bruker Analytische Messtechnik GmbH
##OWNER= pz
$$ XWIN-NMR		Version 3.5
$$ Tue Jul 21 13:56:35 2026 Russian Standard Time (UT+4h)  Yarkov@DPX200
##.OBSERVE FREQUENCY= 200.1313
##.OBSERVE NUCLEUS= ^1H
##.DELAY= (6, 6)
##.ACQUISITION MODE= SIMULTANEOUS
##.ACQUISITION SCHEME= undefined
##.AVERAGES= 8
##.DIGITISER RES= 18
##SPECTROMETER/DATA SYSTEM= spect
##.PULSE SEQUENCE= zg30
##.SOLVENT NAME= CDCl3
##.SHIFT REFERENCE= (INTERNAL, CDCl3, 0, 14.3821)
##AUDIT TRAIL= $$ (NUMBER, WHEN, WHO, WHERE, WHAT)
$$ ##TITLE= Audit trail, XWIN-NMR		Version 3.5
$$ ##JCAMPDX= 5.01
$$ ##ORIGIN= Bruker BioSpin GmbH
$$ ##OWNER= Yarkov
$$ C:/Bruker/XWIN-NMR/data/yarkov2/nmr/H-C/1/audita.txt
$$ ##AUDIT TRAIL=  $$ (NUMBER, WHEN, WHO, WHERE, WHAT)
(   1,<2026-07-21 13:55:45.57 +0400>,<Yarkov>,<DPX200>,
      <created by zg, POWCHK disabled, PULCHK disabled
       configuration hash MD5:
       00 E9 B6 7A A2 85 ED C7 34 08 36 98 17 FE 4E 26
       data hash MD5: 16K
       4D 3D C4 A5 9D E5 79 9D 3A 98 EE 6A C0 9D B0 6A>)
$$ ##END=
$$ 
$$ hash MD5
$$ 06 6B 40 84 A7 02 47 40 1C E9 C4 16 36 0C B3 66
##$RELAX= 
##$RELAX= 
##$RELAX= 
##$RELAX= 
##$RELAX= 
##$RELAX= 
$$ Bruker specific parameters
$$ --------------------------
##$DU= <C:/Bruker/XWIN-NMR>
##$EXPNO= 1
##$NAME= <H-C>
##$PROCNO= 1
##$TYPE= <nmr>
##$USER= <yarkov2>
##$AMP= (0..31)
100 100 100 100 100 100 100 100 100 100 100 100 100 100 100 100 100 100 
100 100 100 100 100 100 100 100 100 100 100 100 100 100 
##$AQSEQ= 0
##$AQ_mod= 1
##$AUNM= <au_zg>
##$AUTOPOS= <>
##$BF1= 200.13
##$BF2= 200.13
##$BF3= 200.13
##$BF4= 200.13
##$BF5= 200.13
##$BF6= 200.13
##$BF7= 200.13
##$BF8= 200.13
##$BYTORDA= 1
##$CFDGTYP= 0
##$CFRGTYP= 5
##$CHEMSTR= <none>
##$CNST= (0..31)
1 1 145 1 1 1 1 1 1 1 1 1 1 1 1 1 1 1 1 1 1 1 1 1 1 1 1 1 1 1 1 1 
##$CPDPRG= <>
##$CPDPRG1= <>
##$CPDPRG2= <>
##$CPDPRG3= <>
##$CPDPRG4= <mlev>
##$CPDPRG5= <mlev>
##$CPDPRG6= <mlev>
##$CPDPRG7= <mlev>
##$CPDPRG8= <mlev>
##$CPDPRGB= <>
##$CPDPRGT= <>
##$D= (0..31)
0 0.7 0 0 0 0 0 0 0 0 0 0.03 0 0 0 0 0 0 0 0 0 0 0 0 0 0 0 0 0 0 0 0 
##$DATE= 1784627744
##$DBL= (0..7)
120 120 120 120 120 120 120 120 
##$DBP= (0..7)
150 150 150 150 150 150 150 150 
##$DBP07= 0
##$DBPNAM0= <>
##$DBPNAM1= <>
##$DBPNAM2= <>
##$DBPNAM3= <>
##$DBPNAM4= <>
##$DBPNAM5= <>
##$DBPNAM6= <>
##$DBPNAM7= <>
##$DBPOAL= (0..7)
0.5 0.5 0.5 0.5 0.5 0.5 0.5 0.5 
##$DBPOFFS= (0..7)
0 0 0 0 0 0 0 0 
##$DE= 6
##$DECBNUC= <off>
##$DECIM= 32
##$DECNUC= <off>
##$DECSTAT= 4
##$DIGMOD= 1
##$DIGTYP= 9
##$DL= (0..7)
0 120 120 120 120 120 120 120 
##$DP= (0..7)
150 150 150 150 150 150 150 150 
##$DP07= 0
##$DPNAME0= <>
##$DPNAME1= <>
##$DPNAME2= <>
##$DPNAME3= <>
##$DPNAME4= <>
##$DPNAME5= <>
##$DPNAME6= <>
##$DPNAME7= <>
##$DPOAL= (0..7)
0.5 0.5 0.5 0.5 0.5 0.5 0.5 0.5 
##$DPOFFS= (0..7)
0 0 0 0 0 0 0 0 
##$DQDMODE= 0
##$DR= 18
##$DS= 0
$$ [...]
##$SUBNAM2= <"">
##$SUBNAM3= <"">
##$SUBNAM4= <"">
##$SUBNAM5= <"">
##$SUBNAM6= <"">
##$SUBNAM7= <"">
##$SUBNAM8= <"">
##$SUBNAM9= <"">
##$SW= 18.0517328524113
##$SWIBOX= (0..15)
0 0 2 0 0 0 0 0 0 0 0 0 0 0 0 0 
##$SW_h= 3612.71676300578
##$TD= 16384
##$TD0= 1
##$TE= 0
##$TE2= 300
##$TE3= 300
##$TEG= 300
##$TL= (0..7)
0 120 120 120 120 120 120 120 
##$TP= (0..7)
150 150 150 150 150 150 150 150 
##$TP07= 0
##$TPNAME0= <>
##$TPNAME1= <>
##$TPNAME2= <>
##$TPNAME3= <>
##$TPNAME4= <>
##$TPNAME5= <>
##$TPNAME6= <>
##$TPNAME7= <>
##$TPOAL= (0..7)
0.5 0.5 0.5 0.5 0.5 0.5 0.5 0.5 
##$TPOFFS= (0..7)
0 0 0 0 0 0 0 0 
##$TUNHIN= 0
##$TUNHOUT= 0
##$TUNXOUT= 0
##$USERA1= <user>
##$USERA2= <user>
##$USERA3= <user>
##$USERA4= <user>
##$USERA5= <user>
##$V9= 5
##$VALIST= <valist>
##$VCLIST= <CCCCCCCCCCCCCCC>
##$VD= 0
##$VDLIST= <DDDDDDDDDDDDDDD>
##$VPLIST= <PPPPPPPPPPPPPPP>
##$VTLIST= <TTTTTTTTTTTTTTT>
##$WBST= 1024
##$WBSW= 4
##$XGAIN= (0..3)
0 0 0 0 
##$XL= 0
##$YL= 0
##$YMAX_a= 227947
##$YMIN_a= -255564
##$ZGOPTNS= <>
##$ZL1= 120
##$ZL2= 120
##$ZL3= 120
##$ZL4= 120
##$ABSF1= 10
##$ABSF2= 0
##$ABSG= 5
##$ABSL= 3
##$ALPHA= 0
##$AQORDER= 0
##$ASSFAC= 0
##$ASSFACI= 0
##$ASSFACX= 0
##$ASSWID= 0
##$AUNMP= <proc_1d>
##$AZFE= 0.1
##$AZFW= 0.1
##$BCFW= 1
##$BC_mod= 2
##$BYTORDP= 1
##$COROFFS= 0
##$CY= 83.5205535888672
##$DATMOD= 1
##$DC= 2
##$DFILT= <>
##$DTYPP= 0
##$F1P= 10.8118882576601
##$F2P= -7.23987719738617
##$FCOR= 0.5
##$FTSIZE= 0
##$FT_mod= 4
##$GAMMA= 1
##$GB= 0.15
##$INTBC= 1
##$INTSCL= 1
##$ISEN= 128
##$LB= 0.25
##$LEV0= 0
##$LPBIN= 0
##$MAXI= 10000
##$MC2= 0
##$MEAN= 0
##$ME_mod= 0
##$MI= 1.114404
##$NCOEF= 0
##$NC_proc= 0
##$NLEV= 6
##$NOISF1= 3.799351
##$NOISF2= 2.8
##$NSP= 1
##$NTH_PI= 0
##$NZP= 0
##$OFFSET= 14.38212
##$PC= 1
##$PHC0= -7259.724
##$PHC1= 15.42198
##$PH_mod= 1
##$PKNL= yes
##$PPARMOD= 0
##$PSCAL= 0
##$PSIGN= 0
##$REVERSE= no
##$SF= 200.129724274929
##$SI= 16384
##$SIGF1= 3
##$SIGF2= 2
##$SINO= 400
##$SIOLD= 16384
##$SREGLST= <1H.CDCl3>
##$SSB= 0
##$STSI= 0
##$STSR= 0
##$SW_p= 3205.1282051282
##$SYMM= 0
##$S_DEV= 0
##$TDeff= 0
##$TDoff= 0
##$TI= <>
##$TILT= no
##$TM1= 0
##$TM2= 0
##$TOPLEV= 0
##$USERP1= <user>
##$USERP2= <user>
##$USERP3= <user>
##$USERP4= <user>
##$USERP5= <user>
##$WDW= 1
##$XDIM= 8192
##$YMAX_p= 0
##$YMIN_p= 0
$$ End of Bruker specific parameters
$$ ---------------------------------
##NTUPLES= NMR FID
##VAR_NAME=  TIME,          FID/REAL,        FID/IMAG
##SYMBOL=    X,             R,               I
##VAR_TYPE=  INDEPENDENT,   DEPENDENT,       DEPENDENT
##VAR_FORM=  AFFN,          ASDF,            ASDF
##VAR_DIM=   8192,          8192,            8192
##UNITS=     SECONDS,       ARBITRARY UNITS, ARBITRARY UNITS
##FACTOR=    0.0002768,     1,               1
##FIRST=     0,             0,               0
##LAST=      2.2672688,     0,               0
##MIN=       0,             -255564,         0
##MAX=       2.2672688,     227947,          0
$$ Real data points
##PAGE= N=1
##DATA TABLE= (X++(R..R)), XYDATA
0 0 0 0 0 0 0 0 0 0 0 0 0 0 0 8 -8 8 -8 8 -16 16 -24 24 -32 32 -40 48 -56 64 -72 85 -96 112 -127 144 -160
35 -160 181 -205 229 -256 285 -317 354 -393 436 -482 534 -590 647 -715 788 -867 955 -1054
53 -1054 1162 -1285 1420 -1575 1751 -1957 2196 -2484 2833 -3265 3823 -4574 5637 -7270 10116
68 10116 -16436 60727 -132184 -255564 65670 206008 33617 -133826 -56685 31087 42767
79 42767 43155 24132 -88165 -103377 66759 169749 -10702 -188845 -66321 155285 111015
90 111015 -83498 -113157 14237 72951 35010 -9922 -41579 -49534 21967 90080 18179 -98095
102 -98095 -52817 74253 63645 -41569 -46480 15633 5435 -18937 32968 41838 -54399 -74493
114 -74493 52469 101489 -30061 -107710 7540 97053 9026 -67136 -2567 37972 -24313
125 -24313 -24970 60016 33167 -91813 -63219 97524 91554 -82422 -110572 49709 107503 -15092
137 -15092 -81133 -4528 43976 7706 -2066 13767 -21079 -43153 24438 70049 -9627 -83420
149 -83420 -14852 74446 30178 -55572 -37111 27941 25568 -7836 -4235 -1134 -18958 964 39376
162 39376 10217 -45198 -16733 46237 20692 -41230 -16692 38781 8333 -42603 -4792 45581
174 45581 2483 -50958 -8062 47996 11638 -39674 -10790 28114 3209 -16181 15173 16233
186 16233 -32625 -23913 47274 42004 -48198 -60049 35390 68334 -15967 -65056 -6650 44066
198 44066 17165 -16894 -15402 -10874 -1801 28015 28288 -27329 -50419 14831 64567 8924 -59946
211 -59946 -28052 43399 37344 -20041 -32222 -2951 11993 12861 10457 -12539 -33352 -2056 44220
224 44220 19834 -42799 -33232 33066 40051 -15671 -33155 5020 22154 1318 -6190 2676 -6133
237 -6133 -12111 10540 20366 -10686 -28871 2834 29052 1339 -26777 -4055 20663 3054 -13925
250 -13925 3052 13004 -6861 -11618 13242 14909 -14207 -16022 12724 14998 -10654 -13611 6666
263 6666 7061 -8593 -3241 9663 -2124 -13735 3578 18030 -826 -19572 -675 21902 5459
276 5459 -17768 -5673 13816 5631 -8726 -3037 3993 -3623 -3999 8499 3019 -15293 -6541 16649
290 16649 9755 -16187 -13014 14070 15554 -8278 -12316 5205 9478 -332 -3070 184 -2105 -3227
304 -3227 5665 6934 -9257 -13238 6722 14814 -4707 -17186 -252 15690 3049 -11373 -2379
317 -2379 7345 2414 -868 2290 -201 -5024 1349 9635 14 -12218 -2817 11054 3639 -10523
331 -10523 -6936 6199 5848 -5088 -4917 3197 2694 -1544 1042 3165 -1401 -2805 4393 5960 -4302
346 -4302 -6548 4509 6543 -4523 -7389 1686 5012 -2277 -5019 943 1667 -1858 187 2807 -415
361 -415 -2917 1586 5705 1333 -4857 -1058 5232 2489 -3238 -2659 1172 448 -1945 347 953 -4182
377 -4182 -3892 3939 5061 -3281 -6430 1318 7166 2547 -3335 -2741 870 3949 3975 -656 -5556 -3394
393 -3394 4106 6049 -1438 -8764 -4802 4916 7273 -1230 -8849 -5038 5467 9055 1566 -8211 -7172
408 -7172 5852 12851 2234 -11776 -7561 8011 10980 -1337 -10035 -5681 2968 6731 2913 -5761
422 -5761 -10085 -2001 10688 9465 -6595 -14346 -400 16181 10080 -10151 -13639 3796 14609
435 14609 4395 -9105 -8295 963 5773 4458 -1040 -8019 -7620 3348 11340 3234 -11791 -11363 6996
450 6996 16836 2703 -14950 -9561 10781 15076 -1842 -12405 -4110 6726 6230 -641 -4125 -4799
464 -4799 -3944 2797 9241 1891 -12954 -11099 9790 18756 -1900 -20783 -5407 19111 13065 -10523
478 -10523 -13736 3980 10732 700 -4005 -726 -3353 -5793 4046 11488 -1740 -18508 -7105 19180
492 19180 15567 -14520 -21248 6542 23508 3877 -17687 -8005 11131 9176 -2585 -4692 -1213
505 -1213 -1828 -1646 5715 6362 -7723 -14821 1617 18068 6279 -18066 -14956 13095 20392 -3986
519 -3986 -18897 -2518 15999 7972 -9123 -6076 5236 1923 -5007 1986 7956 -4457 -15604
532 -15604 678 20024 3952 -22643 -11769 19175 17707 -12187 -18612 6709 16750 -1111
544 -1111 -9384 1880 5236 -4669 -3701 10022 6223 -15042 -13571 13672 19021 -9712 -24994 76
558 76 24047 7904 -18559 -12751 10412 14407 -739 -9225 -2571 3850 3275 2917 1830 -4524 -8540
573 -8540 532 12499 5530 -14750 -14691 9701 19480 -2540 -21691 -6500 19022 13504 -11800 -14533
587 -14533 6099 14033 -53 -8857 -145 4775 -2369 -1964 6201 1261 -11642 -5902 12376 9255
601 9255 -12487 -14073 8774 15546 -4012 -14266 421 12919 3173 -8496 -2163 6813 1725
614 1725 -4986 -151 5399 -882 -7085 -393 6536 576 -7541 -3517 5089 4387 -3042 -4605 1160
629 1160 4414 1329 -2398 -774 2611 1503 -1802 -164 2716 -310 -4212 -532 4614 703 -6568
644 -6568 -3860 5077 4680 -4508 -6338 2653 7134 -400 -5822 13 5942 1703 -3440 -243 3053
659 3053 -198 -2013 1254 1341 -3200 -2759 2599 2573 -3571 -4452 1915 4351 -837 -4358 -396 4674 2649
676 2649 -2599 -2238 2016 3402 464 -2327 -1376 1074 1656 -74 -2534 -2584 806 2292 -675 -3073
692 -3073 -1342 1797 2349 -175 -1890 -681 2048 3401 326 -3054 -965 3355 2790 -1710 -3995 -502
708 -502 3356 1230 -3351 -3466 377 2723 670 -2460 -1900 1028 2618 1818 -1314 -2215 1320 3701
724 3701 1327 -2528 -2547 1591 2888 -573 -2953 -1954 815 1875 -415 -2823 -1423 1295 2065 215
740 215 -1972 -630 1756 2147 572 -1315 -683 1759 1770 -749 -1415 -694 398 684 -828 -1376 -779 132
758 132 456 -499 -757 426 379 309 779 428 262 481 492 498 336 -267 -225 -400 -230 218 -524 -1378 -666 -63
780 -63 232 -13 -922 -568 776 1189 402 -594 -6 1595 1224 -159 -311 -238 479 533 -503 -1273 -753 115
800 115 161 -862 -1250 -178 414 563 -91 -839 406 1596 593 -439 56 1041 868 -387 -691 224
818 224 171 -297 -565 -1125 -730 286 153 -761 -1138 -98 1303 701 -811 -648 1032 1808 810 -789 -325
837 -325 778 817 219 -662 -1433 -649 986 468 -1750 -2211 518 1718 -305 -1494 -133 1024 887 566
855 566 336 2 -39 816 1336 51 -1422 -561 949 662 -1309 -1602 83 281 -616 -265 175 -604 -715
874 -715 1144 1715 -501 -1230 1073 2001 27 -664 467 254 -1056 174 1317 -719 -2923 -649 2566
891 2566 762 -3179 -2133 2476 2396 -1448 -1587 1438 1452 -712 152 2343 -40 -2801 394 3665 197
908 197 -4354 -1785 3000 1698 -2798 -2761 803 1527 -129 -592 -172 29 253 1059 1434 -26 -1061 120
926 120 1313 1339 -201 -1913 -1564 1138 2408 -642 -4220 -1786 3719 2257 -3553 -3072 2578 2995 -1764
943 -1764 -1513 2885 1261 -3415 124 5498 1042 -6496 -2511 6791 4059 -6923 -6016 4987 5464
958 5464 -3688 -5674 2069 4298 -2262 -2929 3495 2659 -3909 -2046 5319 4037 -4517 -5027 3910 5806
974 5806 -2094 -5677 -519 3971 1298 -3050 -2454 944 1450 -174 -707 -68 628 -324 -448 2024 2625
991 2625 -1359 -3489 1050 5615 1166 -6729 -3301 6267 4315 -5789 -5953 3808 5144 -3811 -4783
1006 -4783 3857 3762 -4645 -3165 6156 4732 -6642 -5609 7740 7884 -6205 -8696 4413 8586 -2689
1021 -2689 -8105 1073 6055 -1715 -4964 1713 3372 -2938 -3510 3796 4860 -3290 -5160 2854 6049
1036 6049 -107 -4684 -1451 3786 2918 -1773 -3152 -825 1880 1522 -1778 -2428 221 1537 -565 -1169
1052 -1169 1294 1389 -2239 -1508 4354 3436 -4457 -4470 4912 6400 -3674 -7190 2469 6742 -2351 -6543
1068 -6543 1502 4952 -2390 -4817 2864 4897 -3703 -5421 4383 6514 -3192 -6430 2949 6973 -1404
1083 -1404 -5860 1109 4715 -1312 -3605 1034 2006 -2536 -2395 2533 1863 -3094 -2336 2309 2257 -1334
1099 -1334 -1500 964 1175 229 747 224 -1336 -432 2478 931 -2965 -1728 2352 1218 -2717 -1509
1115 -1509 2056 432 -2612 231 3331 -432 -3821 1125 4863 -381 -4450 641 4972 -174 -4460
1130 -4460 168 3775 -1078 -3835 964 3007 -2116 -3613 1783 3266 -2244 -3552 2323 3598 -1677
1145 -1677 -2628 2403 2833 -1944 -1863 2643 1602 -2972 -1406 2793 817 -3337 -1230 2675 431 -3024
1161 -3024 -367 2676 -125 -2344 729 2706 -423 -2111 1397 2675 -1136 -2029 1597 2073 -1749
1176 -1749 -1960 1493 1515 -2331 -1712 2173 778 -2695 -693 2533 507 -2522 16 3366 336 -2737
1192 -2737 700 3047 -658 -2579 846 2637 -1009 -2741 1008 2156 -1892 -2379 1539 1739 -2020
1207 -2020 -2049 2208 2206 -2085 -1856 2734 2065 -2014 -1272 2208 1394 -2142 -897 2327 201 -2705 -195
1224 -195 2145 -435 -2711 -137 2487 -106 -2366 411 2089 -237 -1344 1023 1750 -924 -1282 1760
1240 1760 1491 -2055 -1503 1973 1018 -2122 -1387 1363 772 -2061 -729 1824 64 -1904 360 2060
1256 2060 -123 -1859 680 2585 -253 -2077 689 1982 -674 -1689 568 1209 -1178 -1739 1035
1271 1035 1246 -1580 -1365 1480 1350 -1327 -917 1678 1165 -1359 -342 1959 506 -1360 -77 1519
1287 1519 0 -1672 -355 1478 -248 -1837 -142 1210 -399 -1350 302 1239 -357 -959 980 1208
1303 1208 -659 -699 1079 953 -926 -838 808 484 -1053 -530 668 -252 -1109 -228 845 -78 -1117 309
1321 309 1230 -160 -752 711 1255 -134 -751 628 1128 -600 -949 527 723 -798 -1175 434 396 -1006
1339 -1006 -839 617 547 -775 -379 984 637 -433 -66 940 461 -417 -163 493 148 -524 -216 120
1357 120 -326 -590 -168 192 -385 -386 128 346 -83 -87 426 387 -30 259 666 198 -378 90 547 -79 -611 -284
1379 -284 261 -230 -523 -392 244 138 -370 -156 301 252 -55 -25 474 601 -68 -132 385 527 -162 -460 -317
1400 -317 263 74 -634 -368 208 116 -315 -367 239 539 -222 -332 658 690 -276 -333 428 793 -157 -861 87
1421 87 705 -82 -878 -479 426 187 -707 -604 445 623 -418 -541 592 868 -286 -663 486 1030 -123
1440 -123 -877 52 1143 205 -1316 -467 1080 384 -1368 -802 917 721 -1191 -983 1199 982 -898
1457 -898 -924 1296 1422 -765 -1233 996 1486 -712 -1538 404 1405 -372 -1782 -169 1389 -182 -1516
1474 -1516 -106 1374 210 -1203 -231 1608 615 -989 -344 1121 925 -671 -961 723 1088 -614
1490 -614 -1354 173 1060 -182 -1486 -306 1219 192 -1213 -420 1269 822 -1024 -801 1535 1300 -1101
1507 -1101 -1031 1072 1373 -1045 -1713 799 1457 -1013 -1811 524 1562 -569 -1736 435 1765 -153
1523 -153 -1552 346 1759 95 -1488 89 1689 165 -1496 -147 1281 165 -1327 -626 779
1538 779 352 -1087 -496 693 571 -486 -497 481 722 -73 -444 147 697 247 -545 -269 614 498 -784
1557 -784 -855 355 703 -544 -1185 237 960 -429 -1195 503 1263 -176 -1152 606 1523 -43 -1285
1574 -1285 477 1426 -322 -1388 61 1206 -250 -1529 69 1095 -198 -1275 -9 1050 48
1589 48 -1003 231 1059 -14 -689 293 906 -136 -757 138 474 -192 -617 -78 197 -336 -286 26 23 -345
1609 -345 91 322 76 -8 294 342 -73 -99 517 385 -532 -133 549 98 -667 -347 592 99 -966 -357 795
1630 795 -26 -886 -165 951 117 -796 28 1038 42 -920 127 936 -95 -935 29 825 -262 -1044
1648 -1044 73 574 -465 -927 317 764 -207 -807 470 844 -224 -421 549 650 -229 -286 528 470 -584
1667 -584 -421 484 -49 -707 -209 335 -91 -528 2 416 -188 -514 452 579 -29 -181 549 415 -398 -418
1687 -418 474 349 -752 -396 575 368 -892 -387 491 236 -821 -166 906 121 -684 46 844 85 -595
1706 -595 93 816 1 -535 215 533 -305 -741 110 415 -383 -657 301 428 -405 -377 432 436 -108 -119 511
1727 511 452 -437 -75 601 93 -466 -44 490 -57 -583 -117 524 -207 -620 113 354 -142 -339 375 441 -187
1748 -187 -330 463 629 -356 -281 449 267 -288 -351 390 23 -640 -367 304 -83 -552 -224 492 148 -523 110
1769 110 582 72 -485 190 653 -153 -443 206 519 -309 -409 230 362 -456 -504 216 437 -372 -447 465 424
1790 424 -436 -246 594 337 -289 -111 495 330 -471 -210 376 10 -515 -149 250 -138 -395 -50 313 -181
1810 -181 -294 347 353 -180 -89 362 354 -171 -185 422 298 -381 -145 383 -8 -555 -142 391 -172 -737 -102 503
1832 503 -37 -761 110 679 22 -520 204 651 34 -615 205 573 -313 -600 138 259 -320 -515 218 214 -284
1853 -284 -375 195 278 -199 -219 426 214 -182 -10 364 40 -235 124 275 -120 -262 87 182 -310 -469 153
1874 153 267 -322 -375 311 412 -193 -274 356 605 -291 -317 437 401 -323 -325 290 185 -326 -456 165 139 -481
1896 -481 -400 187 102 -66 -216 259 216 -118 39 294 162 -99 73 58 80 -77 -84 -10 -82 29 65 -227 -210 137
1920 137 200 -140 -258 224 362 -115 -408 451 455 -67 -306 286 512 -191 -656 123 465 -133 -583 -31 354
1941 354 -55 -594 64 537 24 -323 58 535 141 -286 1 438 144 -301 -250 251 169 -305 -416 39 375
1962 375 -280 -397 119 341 -42 -445 -74 526 91 -326 4 499 177 -337 -246 336 196 -403 -371 253 237
1983 237 -322 -526 239 320 -216 -264 146 364 -139 -202 -8 324 93 -300 92 436 31 -317 -436 375 226
2004 226 -375 -467 44 130 -195 -446 95 407 -197 -327 117 532 36 -328 56 593 32 -496 -87 458 45
2025 45 -609 -157 464 115 -464 -124 406 179 -484 -115 578 141 -358 -111 568 201 -209 -29 266 114
2045 114 -202 -202 57 4 -158 -122 37 61 -78 -114 -21 12 152 -3 -96 86 221 119 -254 -13 186 12 -315
2068 -315 -185 357 14 -447 -232 320 43 -429 34 425 216 -497 1 584 263 -350 -192 446 238 -509
2088 -509 -105 444 113 -463 -175 292 31 -376 -103 310 8 -378 -104 281 148 -255 94 299 34 -98
2108 -98 111 162 -58 -29 19 56 -110 -15 52 -107 -228 91 161 -134 -154 236 248 -113 -162 270 293 -191 -276 252
2132 252 198 -206 -374 245 204 -352 -325 227 260 -340 -233 455 215 -404 -188 528 216 -287 -74 267 295 -336
2154 -336 -42 234 28 -243 -96 145 -91 -301 -122 83 -2 -162 85 174 -113 4 137 92 -46 55 318
2175 318 90 -213 6 238 -57 -347 62 221 -103 -433 -34 307 -71 -424 110 341 -68 -270 155 451
2195 451 63 -316 71 290 -127 -82 118 273 -149 -355 58 70 -304 -237 231 98 -313 -100 116 79 -125
2216 -125 70 302 102 -170 37 271 6 -143 69 59 -96 -191 -25 102 -301 -138 146 187 -221 -120 311
2237 311 118 -201 -55 293 252 -175 -75 357 147 -304 10 247 -82 -275 -24 145 1 -254 43 165
2257 165 -1 -117 32 312 -53 -156 159 233 -167 -96 183 58 -183 -168 137 -59 -245 -7 136 -2 -256
2278 -256 17 260 8 -226 159 388 72 -189 94 175 -76 -143 33 218 1 -192 40 126 -105 -211 17
2299 17 110 -127 -167 226 80 -73 -25 179 122 -80 7 247 -87 -176 1 179 -72 -193 -44 29 -138 -240 151
2322 151 86 -108 -150 160 102 -59 -59 132 243 -143 -63 161 84 -256 -115 30 199 -127 -118 136 43 -232 -131
2345 -131 166 42 -118 84 146 17 -119 -79 170 21 -44 2 -13 86 25 -114 -52 -55 52 122 -6 -77 18 193
2369 193 -9 -282 103 174 -52 -66 40 141 15 -144 8 154 -155 -223 -8 194 -144 -349 -121 211 -10
2390 -10 -181 -38 150 37 12 93 203 136 -135 -24 197 8 -117 -112 113 46 -124 -144 -33 169 -44 57 -63
2413 -63 75 72 9 -44 -25 90 -11 -7 133 184 84 -118 122 51 -188 -204 -14 158 -6 -317 19 174 82 -90
2437 -90 -18 260 104 -88 -8 238 100 -97 -121 214 16 -184 -155 158 30 -106 -57 21 136 68 -229 -6 110
2460 110 9 -110 22 212 30 -70 -32 133 -42 -141 -113 93 96 7 -251 93 142 -63 8 12 144 -28 -65 42
2484 42 167 41 22 85 199 27 -215 47 106 65 -72 -201 117 45 -166 -104 94 196 -152 -25 -42 157 -48
2507 -48 -111 11 84 25 -157 48 180 34 -264 -124 169 -11 -83 -127 -37 148 47 -157 -2 59 -179 -25 87
2530 87 191 -47 -220 144 200 -9 -138 26 10 -100 -76 -165 60 -155 -14 7 11 83 -58 65 59 57 -108 -22 -38
2555 -38 36 35 -42 -48 -46 127 -123 -99 -30 69 -106 -58 6 -75 34 -5 79 67 30 -79 87 104 -61 -118 79 31 -131
2582 -131 -148 6 198 -64 -204 117 74 -45 -109 -38 36 -60 -56 64 27 106 -80 51 80 -205 -1 129 92 3
2606 3 -50 -122 16 5 -36 0 -103 -91 -52 144 -92 -3 54 101 -19 -156 151 40 -109 -1 17 -96 -281 -13
2630 -13 87 32 -121 -66 212 -1 -255 9 136 200 -21 -4 162 -43 -132 -4 158 62 -124 -82 40 15 -89
2653 -89 15 -2 2 -66 -61 134 -53 -5 92 133 75 -11 79 -30 -104 -116 75 11 -95 46 145 -102 -103 70 118 -76 -126
2680 -126 9 70 29 -148 54 95 -17 -51 -47 -19 -13 -47 39 -32 -171 -24 80 62 -125 31 112 84 -63 -10 167
2705 167 -10 -84 -7 154 77 -61 -68 51 -10 -23 -103 127 217 -113 45 -67 -68 229 -42 30 -82 139 -15 -26
2729 -26 30 69 75 25 -47 -23 122 -49 -178 -72 86 85 -74 41 109 -27 -88 31 101 23 -60 71 66 -63 33 91
2755 91 132 9 -35 77 39 -21 -106 175 15 -113 -31 138 -1 -52 30 -74 49 -84 22 38 -99 -12 32 31 31
2780 31 11 -28 111 -83 -63 179 -36 -25 29 49 83 161 77 134 92 -24 -67 96 101 -169 -3 95 17 -135 -9 56
2806 56 53 -79 -39 69 -6 -140 56 43 9 -72 113 213 -82 -23 112 24 -11 -8 5 24 -67 -34 -33 -44 9 13 130 123
2834 123 -28 11 57 102 -81 -67 62 28 11 16 110 -3 -97 38 122 -38 -50 7 -4 -138 0 11 -73 -202 34
2859 34 17 79 -22 63 -17 -2 -34 -27 0 -46 -4 58 -77 -135 -51 11 68 -124 -37 -19 103 -74 -47 -4 137 -52 -88
2886 -88 31 -26 -37 112 60 -52 32 -129 108 -31 2 -20 59 63 4 -83 105 62 -46 -51 67 50 72 -35 21 -36
2912 -36 65 120 8 90 -37 -34 -55 -26 -53 72 -126 -100 -59 61 44 31 39 -10 43 37 31 -3 -219 -73 -95 27 -110
2939 -110 -93 7 145 -61 -102 126 10 18 -27 3 131 -36 -161 85 136 -6 -5 -46 -127 -2 -128 -13 -4 -1 -16
2964 -16 -52 68 -75 0 29 27 -89 -12 -17 -19 15 52 68 -39 17 59 64 -64 -63 -2 -57 -80 53 129 73 41 -12 -90 74
2993 74 -69 -34 -41 -90 25 44 135 94 -119 59 43 -62 -95 -10 -42 86 -41 -151 123 -83 -18 117 80 -89 -60
3018 -60 17 50 25 24 -26 -4 15 49 -12 -99 -17 10 -61 -135 27 63 5 -117 38 -50 4 -26 96 63 86 100 11 136
3046 136 -22 -46 -159 -40 75 -10 37 -21 105 -77 -126 15 2 -33 3 161 121 159 -19 -11 299 74 89 11 91
3071 91 -58 17 -50 16 165 25 -11 -5 -72 -39 -154 -11 13 18 64 0 -184 -12 -26 -77 -21 -38 -114 -42 -113 17 -26
3098 -26 -17 63 -67 -71 -60 -63 67 -26 66 -88 -68 53 -124 -30 -69 6 61 46 37 64 -35 28 -30 23 9 5 49 6 -20 23
3128 23 79 28 26 12 49 86 -17 -27 95 106 108 -55 -59 -43 -32 -45 -84 39 -46 -10 -63 0 5 -27 83 78 -55 52 24
3157 24 -24 -39 41 -144 -133 -62 -14 28 -42 -60 37 71 -43 10 43 40 3 -92 38 -14 -16 41 6 12 -85 32 -47 -36 -26 -77
3187 -77 20 11 9 -17 -90 59 -21 -92 -20 -42 -36 -33 62 37 3 122 95 34 -77 -40 129 -82 63 7 49 53 -103 -10 -5 31
3217 31 27 -7 -20 -62 -8 58 -81 -123 11 43 -18 35 -21 -39 5 -44 -19 -17 -16 14 45 60 33 -39 73 59 54 38 -116 75
3247 75 27 14 -91 9 -23 -6 39 35 75 -10 77 -58 -96 -15 -9 -33 19 -59 41 -16 -82 33 87 -159 -28 25 32 47
3275 47 -35 126 27 -18 71 -120 -36 38 34 32 -122 74 60 -19 73 27 60 54 37 -28 -3 117 9 -13 82 -104 45 -127
3303 -127 -60 45 -65 -18 23 -16 -11 -15 8 -24 37 -29 27 -135 -116 61 -95 -83 -5 -16 12 64 -183 -31 151 107 27
3330 27 98 36 -45 -63 106 35 16 -74 -18 13 27 31 -2 11 81 91 43 -73 -45 47 -23 73 28 10 9 152 -110 -85 15
3359 15 -3 -29 -58 -115 20 12 30 -99 -112 -78 35 85 -33 2 -74 6 1 12 48 -12 -24 117 115 68 -63 -19 45 73 96
3388 96 -117 101 50 -59 24 141 99 -25 13 -32 -28 20 43 -21 178 -29 10 29 23 -104 58 -84 100 -69 43
3413 43 35 -53 -69 10 -68 46 -14 -119 36 26 -10 95 57 -103 145 101 141 20 -6 -128 -38 66 82 -94 66
3438 66 50 50 91 5 -34 30 111 -44 -58 93 -9 4 -139 34 -114 -105 22 -66 -12 58 25 -18 -56 -9 72 55 -14 -6
3466 -6 -165 -89 20 -39 18 151 -9 -87 -57 28 -248 -137 -9 -12 248 -28 -374 -278 47 154 63 100 -3 475
3490 475 -104 -198 -6 -141 -287 -28 250 -300 105 -71 126 295 -38 -292 182 375 388 378 82 -99 -511
3511 -511 -510 -241 168 -268 40 240 -47 52 -185 -69 -635 -569 332 -20 -302 166 -64 -123 -31 -530 24 -92
3533 -92 599 340 -538 193 931 -566 -539 341 445 93 -325 381 452 -243 -34 27 -108 -254 -114 868 -46
3554 -46 239 53 428 -210 -59 -131 41 -348 -52 -311 70 281 124 151 -244 -252 -332 76 -78 122 -20 216
3576 216 -38 20 -225 -46 -24 46 -37 -37 31 31 -37 -10 -53 -20 -157 -14 83 -56 74 -39 23 61 6 -44 -34 73
3602 73 86 -19 -67 -84 -44 -165 0 66 0 -3 69 77 46 10 -114 -27 144 165 10 -188 113 122 -265 -370 2 335
3628 335 245 136 -331 -853 -275 -140 393 -583 -468 -464 271 -402 584 526 -484 59 -454 79 -478 -336 260
3649 260 -442 -341 -260 264 -134 -593 323 347 71 -141 242 324 -184 -58 84 -117 94 -32 -224 87 39
3670 39 80 -101 51 57 -32 69 -14 -12 -67 -13 -27 47 -2 -7 -53 -82 96 48 -31 -25 -39 22 19 3 22 -95 -45 -25 12 -88
3700 -88 -40 119 -102 37 42 24 20 -11 97 -5 -90 -22 85 -93 60 46 -23 64 21 -71 45 99 -115 -41 -57 -35
3726 -35 -45 82 -86 -80 -87 112 17 32 65 35 68 -67 -46 25 0 81 -30 8 23 -8 -42 -82 41 -47 26 40 50 90
3754 90 38 78 -9 -75 -49 64 -34 3 83 -20 -102 77 32 -48 -39 24 33 -73 -65 3 -13 62 -37 61 -58 -48 -17 -124 93
3783 93 -6 71 29 5 -59 -8 134 52 147 -133 -76 72 -33 -26 106 -57 -54 2 51 114 -54 -16 -1 -10 -40 32 -14 34
3811 34 -79 42 -62 52 -131 -66 -18 -60 67 -71 -2 -42 46 -23 10 28 -134 3 130 56 23 82 12 -49 -74
3836 -74 39 -38 37 -89 19 -23 -41 -77 97 64 -31 -56 -17 26 13 49 63 18 -93 -15 -2 -30 -18 -47 4 -162 25
3863 25 85 -29 37 30 69 15 53 86 -26 34 40 45 15 61 -61 -62 131 -20 -34 4 -18 -22 15 -17 -60 -99 140 65 -4 -49
3893 -49 -74 -3 79 48 -83 -79 60 98 -9 -10 -25 -15 -78 10 42 43 72 -6 50 -51 -134 69 43 5 3 56 31 -42 19 45
3923 45 -90 12 -54 36 10 -95 76 -6 -27 -15 97 -44 -22 -92 32 106 -54 26 37 3 -31 54 -8 8 17 -30 -21
3950 -21 -86 -16 -18 5 -34 -57 207 -4 -179 -239 -157 -91 152 -718 130 95 -76 37 97 74 -375 178 -33 167 381
3975 381 24 -142 97 196 -284 92 -342 255 -497 294 141 -428 206 -241 465 -4 710 -103 208 -361
3995 -361 -266 23 -127 7 -38 34 78 227 159 -441 115 13 -94 -164 -68 -553 14 221 337 -237 35 -50 -427
4018 -427 -139 -181 269 326 -119 312 137 306 180 102 49 -394 150 125 -175 195 -21 70 495 -78 147 -250
4040 -250 -128 -350 172 26 -460 -58 276 -129 360 177 49 228 8 268 -124 -186 261 -88 334 5
4060 5 22 -179 -12 -18 -52 -7 -109 40 99 15 -209 161 57 -34 -45 53 -54 105 -31 27 64 -115 86 27 -48
4085 -48 -106 -44 40 73 100 -11 -18 8 59 4 -32 91 -16 89 -33 54 -29 -24 -74 44 0 -30 55 83 63 -63 -10 30
4113 30 -11 45 93 -90 -1 -107 -36 126 -30 22 -51 25 15 -25 65 1 51 4 55 50 20 76 27 39 81 -1 -54 16 -56
4142 -56 -13 -37 -137 99 -2 -21 -56 30 -91 70 -67 -70 59 16 -31 3 88 141 40 70 -25 -74 -35 57 60 -35 -7
4169 -7 16 -46 -16 50 28 -116 94 -30 44 -25 -62 -8 106 7 -45 84 -50 36 3 -63 -41 73 -93 25 1 11
4195 11 33 34 27 -77 -2 5 -123 9 -4 29 -69 111 42 28 14 -73 -27 -25 39 -54 107 -42 -10 32 -15 4 -29 73 80
4224 80 67 -5 -3 5 48 46 -79 -128 -55 8 0 -57 -23 21 -66 11 -49 -71 1 127 163 -67 -23 42 150 -142 189 33 -258
4253 -258 254 220 -224 169 365 -231 78 73 -209 219 77 42 -289 371 -206 399 -395 -396 -447 -357 -124 -222 -233
4276 -233 -69 -504 97 -222 -384 307 -173 -38 -725 -462 165 -77 153 -524 -128 -167 475 83 -389 64
4296 64 -325 5 -514 -577 371 -89 84 -671 67 302 -216 -443 -294 430 -273 -717 -536 1093 308 -331
4316 -331 -418 -630 7 -137 168 426 -593 -265 -268 -260 541 -205 -228 -98 156 67 -820 301 -20 -31 -107 82
4338 82 -397 -39 262 -608 -110 16 140 275 -318 -276 -104 -142 45 327 82 -111 -213 -5 -425 109 -531
4359 -531 -172 194 -553 -222 -140 146 78 -5 -70 -12 219 291 502 -85 -213 -670 145 -465 -499 195 315 391 -590
4382 -590 667 -338 478 336 -101 90 -343 -433 -660 85 -418 8 205 -136 -242 -269 -206 -311 -422 -297
4402 -297 112 99 80 6 -553 -262 85 -51 -154 102 -107 24 9 -13 -159 -58 0 -63 -3 -3 -25 81 -73 31
4426 31 91 19 -24 22 20 15 152 80 29 -13 -53 -17 21 -117 73 61 -1 8 -37 -70 -19 -101 3 90 -68 34 17 63 40
4455 40 20 14 134 -50 58 38 -17 -80 57 28 -36 -16 14 28 38 -40 62 12 -57 31 -17 -46 120 -45 -19 62 -73
4482 -73 22 -54 -155 -7 -31 -92 26 -46 30 -141 21 88 152 31 -4 121 -8 -40 -64 20 -61 -70 -49 -107 -19 20 -51
4509 -51 -68 10 -70 -8 28 82 46 -21 86 12 -45 -63 -59 23 -51 17 -46 47 33 31 -59 -31 0 -70 37 23 113 -25 6 -19
4539 -19 -10 -33 -94 -36 5 47 18 56 40 84 -58 -17 6 -46 79 -24 -2 47 38 0 19 64 65 -74 2 108 -8 116
4567 116 -90 -18 5 -34 23 -64 48 -19 -130 -40 89 -14 3 56 59 -31 58 7 -21 -90 57 54 7 76 -26 19 -132
4594 -132 -3 -8 22 25 -24 -1 151 -132 -27 188 -57 61 152 85 44 167 91 30 111 -194 -36 111 -10 49 90
4619 90 -123 162 191 -96 -51 223 271 174 184 -508 -280 61 -64 184 373 -276 -37 -590 150 -257 -314 264
4641 264 -182 -80 -256 152 -29 263 197 -610 87 -128 395 154 -61 254 16 -51 -283 -206 -94 -219 -82
4662 -82 75 93 354 97 576 -190 20 -631 -281 360 -242 -610 -534 -268 -80 -10 -644 -286 -688 -238 574
4683 574 -210 237 -103 -543 695 -936 369 -102 -138 -1017 -60 364 -510 28 -262 392 -353 -336 -322 -497
4703 -497 720 -243 403 -585 257 -415 298 544 -333 183 -311 -19 697 -159 117 215 167 168 -249 -150 -369
4724 -369 -195 -175 -471 -273 7 5 -132 28 -162 -203 -425 190 -78 124 -3 -117 212 -94 -229 46 9 151
4746 151 2 -22 52 -52 36 -71 -1 -46 -54 -42 -99 -13 -29 100 61 -58 35 20 102 -46 173 172 -51 -100 -38 -11 241
4773 241 268 -23 0 -85 -13 -69 221 1 -103 -55 -191 2 -121 -197 -253 26 183 87 -761 44 -555 416 536
4796 536 -308 176 -25 -14 -393 -8 -246 266 -60 225 90 404 520 657 -86 -31 85 -77 51 -364 71
4817 71 142 -111 -189 -102 -6 -2 -103 -29 30 -117 91 -22 -20 125 -130 61 -41 48 -42 -65 97 86 -82 22 21 51
4843 51 5 89 22 -12 -34 28 87 19 -32 -48 45 -39 -35 -14 7 -19 -2 -91 18 100 -112 2 1 -17 -118 15 105 -8
4871 -8 -10 46 59 -82 -26 19 27 -72 117 45 22 -63 -53 -12 -2 -10 -46 -75 -147 42 -184 32 161 -103 33 97 -62 -15
4899 -15 0 135 71 -84 -40 26 26 -90 66 32 -23 -74 92 -37 -34 -9 -47 -9 66 2 -58 65 111 -99 -81 -28 -35 108
4927 108 25 33 -70 -44 -28 -37 21 -20 -62 -70 9 -40 -56 -130 -24 -9 -36 54 -13 97 43 8 -55 -50 -42 -91 7 -32 -39 7 -28
4958 -28 -39 41 -44 17 18 21 -48 25 58 -28 62 108 90 125 13 108 308 285 -268 -257 480 -257 -252 114 2 165 -79
4985 -79 -171 -51 107 -49 -99 15 -84 131 -20 -70 66 14 -99 -78 166 37 95 -25 90 279 -184 -209 103
5008 103 -169 10 -31 75 131 36 -328 -74 102 246 -388 -301 94 148 -203 -68 395 45 -181 26 293 -72
5030 -72 -144 613 -270 -120 545 -100 350 -451 -372 -49 -168 -568 -215 590 -18 24 323 -217 67 -99 463
5051 463 156 260 -197 -193 243 -284 431 -671 547 299 13 605 -67 -582 557 336 -281 274 -1055
5070 -1055 -424 -597 -73 -248 106 -692 654 286 -161 203 288 192 -121 368 -53 1097 504 25 250 405
5090 405 1 -18 185 267 77 34 218 -261 -673 -332 236 -646 -105 -715 -892 -23 -319 494 138 -427 444
5111 444 -198 166 -170 -561 125 -615 16 426 1 -125 144 173 -108 213 312 363 0 -128 -511 128 -336
5132 -336 145 -317 817 -339 -853 -144 -813 314 -305 439 -507 -41 325 -324 314 -650 -471 -1138 -510
5151 -510 -137 -364 -232 -10 449 309 -336 -135 -599 -231 57 -549 1062 -469 -412 -706 -264 -102 -618 -541
5171 -541 -237 -559 430 -163 346 8 -418 -825 -103 -537 -103 -730 -259 695 292 260 278 722 -129 -370 -632
5192 -632 126 -638 55 268 -224 -36 172 -95 -359 -523 -52 -288 -432 -210 -157 -551 220 -7 -158 865
5212 865 99 183 67 547 228 -658 503 708 344 587 -375 -220 -250 153 431 -4 29 -847 153 -416
5232 -416 501 361 280 134 -206 -351 -251 27 -248 -523 253 -35 -210 -40 113 -277 201 -490 -106 -287
5252 -287 274 -142 -414 456 522 460 -224 -360 -44 152 575 496 266 -643 118 317 -410 -322 -125 -473 -53
5273 -53 104 224 -189 -118 220 86 39 -115 26 218 -243 671 225 9 232 -499 -42 370 -43 -324 -48
5294 -48 8 -25 -78 70 55 82 -30 261 29 -90 -41 -144 85 -157 -32 -73 15 25 119 12 133 -117 40 -116
5318 -116 121 73 -55 -22 -121 33 14 -8 -58 -83 -100 28 -62 79 -85 18 78 -80 33 -184 31 45 55 71
5342 71 -2 83 -59 -40 -98 85 -17 43 -63 24 64 23 75 -5 10 35 -99 -53 73 -84 -37 -4 58 -85 -33 19
5368 19 -61 102 25 -31 -113 54 23 -120 -167 42 24 91 -72 8 -26 -13 10 -65 23 -62 26 75 114 -83 -58 -79 11
5395 11 -82 -46 7 3 115 85 -19 -1 26 4 -2 -45 131 -156 1 -36 16 -111 58 14 -48 13 -177 51 -56 79
5421 79 -97 75 -69 -70 56 -35 -34 41 141 135 -30 56 74 -121 -37 6 39 27 32 -4 -115 -1 76 28 -4 -20 -116 -37
5449 -37 -158 -10 86 -101 -71 81 -46 -65 39 -9 -149 -41 3 59 -115 32 93 -82 -30 -87 -27 -48 -70 79
5473 79 51 43 56 -43 32 6 26 -42 62 40 31 14 4 64 -19 -62 -20 93 85 83 -25 61 -155 -43 -17 8 -56 -59 -107 17
5503 17 -5 15 11 -8 30 -12 33 85 5 -46 -55 -23 55 -35 -16 48 34 8 32 -18 38 -19 -47 -60 -32 -9 -48 -11 119 80 -26
5534 -26 87 22 -12 28 106 65 -4 -45 10 -71 26 1 57 5 89 -58 -42 17 82 -24 67 137 -33 118 26 59 64 -41
5562 -41 96 -32 -34 -7 -17 -34 86 -2 -21 -73 37 43 44 10 35 11 -59 -91 31 13 -28 18 72 -6 -130 -87 7 -8 4
5591 4 49 -8 42 6 28 -16 1 138 -46 22 -51 26 59 -22 78 41 -3 39 -21 -8 69 -19 -86 -76 -16 -6 -41 16 36
5620 36 -98 -63 19 96 66 -87 2 33 -61 -37 -46 10 11 -127 59 -81 23 -20 21 -216 -96 57 17 66 115 9
5646 9 -53 22 -88 10 119 33 -2 167 -15 -147 115 -46 -22 29 -71 -55 -82 -44 32 -37 26 -53 -132 -10 -64 -29
5672 -29 -128 31 33 -15 75 10 -72 41 2 40 -20 3 3 -46 -31 13 53 19 -2 -79 32 -13 -55 55 35 -10 -56 -20 -122
5701 -122 -36 -77 11 -17 -19 -1 -27 27 1 30 -40 48 -23 8 69 -13 -91 35 -48 14 36 25 115 -28 52 -34 64 -53 -46
5730 -46 -11 44 48 -35 23 0 -81 -149 103 40 5 80 8 81 -46 -8 -10 -29 -44 -68 7 8 -101 99 29 8 -67 -36 1 -21
5760 -21 -8 -42 -104 20 -65 -80 -27 -94 -41 -19 31 43 -90 -133 -17 -62 18 -64 42 -54 -49 93 -46 12 1 -62 -27 16
5788 16 42 -2 -32 30 47 -55 -47 146 -48 -40 -3 -75 -14 72 -86 -55 -147 124 54 -119 95 -12 -45 172 -96 -77
5814 -77 76 57 -40 -30 -48 -27 7 40 50 22 17 98 106 -56 96 8 23 53 -24 -26 -51 3 16 41 23 -9 -52 21 34 9
5844 9 -85 17 -47 -44 10 42 -123 114 -70 68 42 33 8 -75 10 -30 -76 -62 -65 -8 -68 -44 -95 37 -9 -76 -18 -151 139
5873 139 -18 41 -30 50 -113 -103 -54 -10 5 -100 -70 -7 -60 -141 -19 -75 -10 -87 20 -21 -25 -26 31 -36 -28 -34 -27 -9 72 -11
5903 -11 20 11 -61 -50 117 -32 2 37 -23 -41 46 35 -58 -54 94 2 -15 50 -58 128 -69 -56 64 -27 17 -8 -26 83
5931 83 -16 -45 72 47 -137 -97 74 25 -62 26 -53 76 78 8 2 -44 58 -60 -44 -121 20 -103 -150 -34 21 22 -73
5958 -73 22 -28 17 40 80 -26 15 -47 -29 -114 -11 92 29 102 -9 17 43 -27 0 47 6 -64 68 -103 -2 14 -60
5985 -60 44 115 -15 -18 132 -12 -17 -69 8 43 -206 19 43 4 -83 47 8 5 6 98 108 -50 -10 30 50 -34 -90 9
6013 9 -126 21 9 8 -47 52 -88 36 89 -18 -18 53 10 -27 5 -31 86 35 -25 -54 58 -52 41 117 -75 -92 44
6040 44 104 -34 27 25 17 52 -45 78 -32 -110 21 -31 28 -49 23 32 57 13 -119 10 -14 38 25 -66 89 -29 -100 -16
6068 -16 85 -45 60 59 -67 16 -15 115 -10 -45 12 -34 18 16 37 15 45 121 46 -2 71 -113 -6 -14 40 56 -40 47
6096 47 -145 -44 -90 -48 81 -33 -8 30 21 -2 45 -32 41 -43 -19 -40 50 -59 14 47 24 48 38 -31 -11 33 46 45 -107
6125 -107 54 41 32 -62 13 28 21 -46 29 -1 -67 -30 23 -23 -10 46 -78 -90 39 133 10 68 9 23 58 73 -69 -52
6153 -52 41 -70 104 -60 -12 -68 11 -75 56 -36 -128 82 14 -2 -21 28 -13 23 -8 -193 -30 -145 43 -58 30
6178 30 -195 158 8 -21 96 -144 68 67 -58 75 -33 -116 93 33 -21 -187 32 -61 -61 -67 -47 41 -64 130 -92
6203 -92 -111 -50 -30 18 -30 -24 52 -88 -88 -36 105 -51 -49 0 102 -6 -141 56 71 49 32 83 66 -100 -35 60 18 -40
6231 -40 49 99 44 36 18 34 17 98 -131 -44 -71 -7 54 -77 144 -91 -95 52 -31 33 89 42 15 42 -22 -39 -83 57
6259 57 -41 1 14 -99 -38 -71 -8 73 2 79 8 77 -32 100 53 -34 21 -47 -21 -56 12 1 -59 -45 9 38 38 106 39
6288 39 -166 32 -4 -62 -38 -33 26 -41 -34 7 -34 8 -46 25 -54 -68 72 -40 81 76 66 -14 -2 -38 -28 63 -96 48
6316 48 -20 -4 -3 -33 17 11 105 66 3 -51 26 -54 -71 -104 -11 -137 50 112 4 -3 -55 99 -77 -67 8 93 -20 54 -16
6345 -16 -39 21 -13 2 -66 -63 36 29 -132 59 0 -34 5 78 6 36 -21 43 -29 -18 -31 -27 -78 -67 -77 49 -14 91 -39
6374 -39 28 -58 -60 16 -111 53 6 -129 -51 7 4 -66 68 -51 -56 -96 -29 10 -3 -87 -59 -39 21 -126 -43 -13 -21 -109 -70
6403 -70 -128 28 -61 64 10 199 -1232 -615 -83 820 61 36 -177 -256 -327 -202 88 102 98 -141 120 -219 65
6426 65 -112 64 -47 59 -15 70 99 -44 -192 -12 87 200 -114 168 -107 -73 -24 -158 -74 162 -33 193 -82
6449 -82 -48 51 127 -24 212 -67 -64 -207 -159 617 2 173 -239 55 -529 -45 257 377 -379 -276 253 161 -259
6472 -259 215 -357 -21 -6 -385 -93 -89 -74 377 202 -14 142 54 -221 741 -284 -437 -517 -135 129 217 -88
6494 -88 -420 60 456 315 251 183 13 471 341 40 -431 98 -175 273 -316 -139 -19 -529 311 324 -371
6515 -371 284 89 66 42 405 342 114 -31 122 -114 -229 588 450 180 -35 270 0 59 -249 -864 -691
6536 -691 240 -223 -100 -192 579 11 -30 -249 -327 -482 198 478 -92 201 -333 -117 202 -477 -59 261 -643
6557 -643 -456 -388 40 130 -399 81 -162 -418 -269 -104 90 425 -106 -367 -555 265 239 302 352 -539 340 -4
6579 -4 2 -143 204 126 8 -118 37 31 -9 10 9 -62 -61 20 -204 -45 -28 -39 17 -49 -48 0 -72 40 -72 61 -9 -57
6607 -57 52 -3 -9 -27 128 -45 48 -69 5 -5 -15 31 68 32 -38 7 -25 44 51 -16 66 29 -12 -48 59 57 -25 -16 -72 132
6637 132 -49 -93 -15 -19 37 -56 8 18 -27 59 -61 12 39 -37 69 -19 -50 -32 56 -25 69 -24 121 11 12 -54 0 4 -48
6666 -48 -20 -99 91 -79 -70 -26 -21 -49 42 -29 98 -11 25 -39 -44 66 -133 -64 62 -33 -28 55 -31 28 -54 87 -17 26
6694 26 -20 73 -44 4 -19 41 47 -48 -6 68 -67 -39 44 10 -40 35 -17 -2 61 -2 54 -13 45 -50 25 -52 15 100 -34
6723 -34 -38 89 27 -88 41 63 42 -44 -31 -4 -32 19 43 63 5 -57 45 68 50 2 -72 -9 39 54 30 -16 -75 -61 14
6752 14 92 -25 29 -45 59 75 2 -73 23 54 -31 -22 40 -15 -39 6 -3 -63 88 -7 -86 20 -21 110 6 10 -138 85
6780 85 26 -38 18 38 14 67 -51 -84 3 62 69 0 -1 11 1 -9 28 -84 12 -6 -4 49 81 19 27 62 22 -25 49 49 90 63
6812 63 -100 77 94 16 65 -6 -6 37 -20 39 -1 -49 98 109 50 -32 -4 18 103 -43 -2 -29 -56 -5 81 33 -74 -17
6840 -17 -128 -218 165 -76 215 -126 -223 -56 228 -260 17 -184 69 73 719 500 327 -204 -499 14 -262 -111
6862 -111 82 -34 109 -50 96 128 160 -333 180 -550 -263 -65 -728 -390 469 -39 -309 131 -507 50 37
6883 37 539 40 229 -49 228 9 -309 -160 534 -78 2 180 192 -469 -440 422 152 -309 105 -497 154
6904 154 82 76 -145 32 -540 -580 -60 -159 271 -368 176 351 -133 425 -36 -306 -619 -125 -53 -108 320 67
6926 67 -188 -550 735 1 -57 -241 -280 465 76 -183 260 -119 -265 -68 87 237 -201 -366 6 -170 74
6947 74 -104 12 -8 -59 -28 81 66 -16 -78 27 40 -13 11 3 -4 28 55 -35 -20 -34 106 19 -36 88 15 111 -115 -123
6975 -123 30 -43 -44 77 -43 -54 86 8 58 96 3 17 -42 -16 28 -101 28 -53 0 16 -35 -5 -142 -137 62 18 43
7002 43 -100 84 -54 74 62 -81 4 12 22 -50 8 3 61 -34 16 -61 10 100 -15 114 -27 72 35 31 -91 41 -5
7029 -5 207 8 5 35 95 -18 -52 -69 39 -44 -58 -100 42 25 -38 100 113 -91 44 -87 -8 -60 -13 -30 11 -80 11
7056 11 105 -76 -57 31 144 88 63 1 -47 15 -63 -68 -93 28 26 -80 37 -5 -51 -47 6 -79 -35 50 -49 8 -75 -52 27
7085 27 38 38 -68 -96 12 -94 110 26 -37 -9 -18 -54 104 6 49 98 -54 -25 -1 -17 24 -4 44 -72 -55 -4 -88 122
7113 122 33 -3 -24 14 -33 15 49 -64 -12 123 -42 21 65 37 -23 70 13 43 41 -101 -113 -96 53 66 12 -66 -21 133
7141 133 -99 43 97 68 7 -6 4 114 92 63 85 -57 42 -55 -67 17 7 15 92 42 5 101 42 31 58 -38 19 -30
7169 -30 -2 -83 98 3 19 40 63 -4 -74 -38 100 -10 -31 -23 -21 6 -4 -19 -30 96 38 -13 -18 100 51 -17 -5 -12 23 -39
7199 -39 -40 -15 -27 -29 -16 7 137 -36 -17 -20 136 32 -17 90 0 -64 -46 22 8 -58 -55 -77 -96 21 7 61 -56 -15 -75
7228 -75 -16 84 -40 126 -43 41 17 46 -54 8 -49 -64 -49 -70 11 -128 -27 42 -30 -50 -89 52 -134 51 -3
7253 -3 13 104 -36 12 6 -64 -48 -42 -62 -8 -60 -4 2 26 0 -98 -53 23 87 -48 107 78 29 -11 49 48 44 -9 0 -25 -86 54
7285 54 -28 -21 -43 -37 -3 -94 -28 -36 78 -99 0 -3 -52 15 -47 101 -35 35 -38 -30 -62 -35 -61 75 12 10 -146 -19 40 0
7315 0 -4 -20 1 -41 302 -94 -361 -146 -230 144 25 -307 -427 -174 -102 173 132 -20 40 -95 -87 -42 37 -84 90
7340 90 -100 -42 -24 -76 -57 60 48 -31 54 -59 -49 69 -116 -57 -84 -62 -32 -18 -19 42 -29 -63 22 81 -52 -70 -4 -88
7368 -88 -2 -49 -82 -35 -152 46 -63 -16 78 -15 -70 -48 -44 -71 -64 -22 39 -74 -72 39 37 103 99 78 42 25 49 59 -80 -92
7398 -92 -17 -23 57 53 -50 -35 14 -184 -78 46 15 43 -121 102 12 -60 -37 70 -46 -174 30 -5 5 29 28 18 -42
7425 -42 -61 27 -51 -104 -1 20 0 -107 -15 131 4 -69 -82 -93 -30 -67 29 -31 -32 -42 10 -70 -83 50 -64 -67 25 -49
7453 -49 24 88 -45 -79 -11 -19 -122 -75 0 -97 -74 -58 -91 -57 -45 -84 -54 31 62 -24 -33 -85 -56 11 -120 33 -55 86 -29
7482 -29 -97 -14 28 29 -11 -38 15 -40 -80 18 23 3 -2 -142 -43 -79 -71 36 40 -11 -165 1 -45 -15 -101 -30 11 113 -121 -33
7512 -33 52 23 -39 74 -18 86 -34 -85 -15 44 -22 29 40 65 38 26 57 -37 -78 59 58 -42 -57 -100 -65 -13 -38 23
7540 23 -26 91 544 -269 102 -7 -12 -26 69 -8 -41 -32 69 -18 37 -75 -83 82 -42 171 42 -23 -56 106 46 -55
7566 -55 35 64 -33 -121 53 60 -23 58 -28 144 -80 -61 53 -80 64 -45 24 43 -22 167 -92 55 -3 35 -32 -4
7592 -4 -4 -75 64 68 21 126 -4 24 -19 100 36 8 -9 12 53 24 -28 64 -104 18 -2 9 35 -77 39 -19 -48 106
7620 106 -35 15 24 -96 -28 -36 -95 -6 -60 16 -77 2 -101 -39 56 -12 108 -33 -61 -6 -65 44 -21 71 25 -81 -51
7647 -51 -46 -32 14 -16 70 6 -43 180 50 22 -10 65 19 -15 98 36 88 103 -113 7 -12 22 -84 37 61 -68 -38
7674 -38 -134 39 -83 56 -41 56 -1 29 64 -131 -77 15 160 48 61 -15 -139 73 17 50 -15 41 82 -4 60 -36
7700 -36 -127 5 -19 6 5 0 -29 64 108 -65 -37 81 -26 43 -40 -9 -1 -20 42 -119 57 -41 4 12 -23 70 -51 27 -4
7729 -4 43 -53 115 -77 -14 -1 -127 -148 -8 35 1 61 10 -19 6 107 -74 27 -58 -24 50 72 -20 5 -6 -61 -87
7756 -87 72 69 35 -104 -18 -27 -99 25 -25 -1 -18 44 67 -12 -30 -71 42 24 -34 49 42 38 -8 -58 -41 19 23 -21 138 -30
7786 -30 35 -73 -14 -14 24 32 59 37 -13 -116 -90 -97 48 26 -65 30 23 -14 2 -16 -58 43 9 -51 -41 -131 -163 51 34 -68
7816 -68 2 52 70 -21 -17 -7 -9 4 -46 30 -71 89 -6 -62 41 -6 5 -58 94 -85 19 -88 7 -23 3 12 -13 9
7844 9 -2 93 8 -2 -35 52 -106 38 43 41 47 -13 -1 -15 -41 9 -12 52 81 -116 91 -64 -40 -65 23 -28 -15 55 -78
7873 -78 -8 -62 100 11 -39 -14 -43 25 122 48 -1 22 -141 7 -58 83 -75 24 -9 -26 -55 -152 -54 109 80 45 7
7900 7 138 5 114 44 -30 -77 50 125 4 114 -7 14 -108 54 -36 -51 -37 2 -13 102 95 80 -67 -102 56
7925 56 -11 -20 80 -161 -47 -79 -66 -6 -54 -70 18 -68 20 -9 -44 -62 -35 -22 67 31 22 -4 -8 119 17 -37 9 22 -93
7954 -93 -82 25 -93 -53 2 108 -4 3 -69 -25 -1 23 -18 -89 -45 -68 -22 -67 -93 -56 37 -32 -26 27 51 126 -54 -20 4
7983 4 -14 -50 -27 -61 -60 50 31 7 -18 15 83 -29 -46 39 -45 66 1 64 -22 11 58 -29 -3 13 -100 30 58 -96
8011 -96 -2 -14 2 -70 -12 -12 -106 -29 98 -20 -1 43 30 11 -69 -51 86 -11 20 2 -66 21 49 66 -130 63 -43 -57
8039 -57 -19 -35 -35 55 50 -27 3 3 19 -153 -50 -23 75 53 -13 -116 -29 67 -39 -16 -57 35 24 -39 60 6 4 -64 -36 80
8069 80 -16 23 46 -17 0 44 -39 -92 -20 47 2 45 72 -203 121 -48 -143 -170 -150 30 -99 67 -58 -160 27 6
8095 6 117 -131 83 27 32 19 2 -48 60 -6 57 6 62 41 -3 33 30 -48 37 -70 -52 -28 18 37 41 31 -12 130 -67
8124 -67 -14 -16 -1 -53 -73 73 42 74 57 -7 -17 -77 -161 -53 -23 -71 -111 0 18 -21 67 90 -36 -19 49 23 27 -38 -43 -83
8154 -83 15 -20 53 -61 -5 -34 8 38 -7 68 18 -81 -59 4 85 12 -127 127 20 -20 -64 -9 15 -25 -84 -13 -68 -1
8182 -1 -109 -37 -30 -101 8 -49 49 -19 -91
8191i1
$$ Imaginary data points
##PAGE= N=2
##DATA TABLE= (X++(I..I)), XYDATA
0 0 0 0 0 0 0 0 0 0 0 0 0 0 8 -8 8 -8 8 -16 16 -18 24 -24 32 -40 48 -56 64 -72 80 -96 105 -120 136 -157
34 -157 176 -199 223 -248 278 -310 344 -382 424 -469 518 -573 631 -697 768 -845 932 -1028
52 -1028 1132 -1250 1382 -1531 1702 -1899 2127 -2402 2729 -3138 3654 -4341 5292 -6709 9028
67 9028 -13509 25290 -123526 -250753 116501 227947 -3284 -178876 -46226 80084 61081
78 61081 8768 -9303 -72784 -60321 83306 142483 -44459 -185730 -31214 177924 91215
89 91215 -122658 -120503 46378 95448 14641 -43534 -42096 -21029 36385 74505 -867 -97132
101 -97132 -35423 90201 63167 -57478 -58149 25614 26958 -14945 13936 26856 -48143 -59592
113 -59592 55150 88682 -43472 -107543 18612 105391 3747 -82217 -7387 52951 -7140
124 -7140 -27521 42849 26890 -77698 -47017 97440 77455 -93600 -104696 65671 110459
135 110459 -32841 -97798 2224 63176 8933 -21712 1675 -10973 -26840 26850 59293
146 59293 -17406 -77999 -1617 81750 23821 -66421 -36053 40837 31868 -18037 -17135 386 -8756
159 -8756 1250 29667 3923 -43586 -13479 47199 20663 -42597 -18174 40840 13667 -39042
171 -39042 -5304 44417 3004 -49090 -5563 49338 8955 -45896 -13343 32861 7104 -22224
183 -22224 4884 14841 -23928 -18114 42104 33543 -48219 -50343 44445 66763 -25393 -68145 4145
196 4145 55951 12943 -31989 -19481 987 7028 19975 13621 -30509 -40897 22493 59482 -2773
209 -2773 -63276 -18388 54185 35782 -30850 -35736 8605 23895 9543 -957 -14940 -23673 5279
222 5279 39098 9672 -46259 -28537 38097 37382 -24656 -37676 10077 28997 80 -12927 923
235 923 558 -5871 10231 16976 -10919 -25177 6644 29088 -1417 -29441 -4300 22685 2902
248 2902 -17860 -991 12523 -5035 -11754 10877 14132 -13226 -14585 14857 16746 -10747 -13723
261 -13723 8899 10719 -7491 -5536 8268 -598 -12709 2167 14817 -3530 -19780 -298 20799
274 20799 3201 -19836 -5133 16915 6965 -10070 -3568 7209 880 -3149 6322 3172 -12428
287 -12428 -5202 15627 7070 -17908 -12538 14289 13916 -11919 -14587 6768 11401 -1745 -5342 923
301 923 1548 -194 5151 5782 -7156 -9729 8381 14044 -6544 -17372 1066 15691 731 -14833
315 -14833 -3939 8766 2193 -4002 4 523 -2929 2006 8540 291 -10209 -501 12645 3673
329 3673 -10667 -5566 7842 5909 -6512 -6607 2906 2711 -3222 -1455 1555 -1453 -2750 3120 4960
344 4960 -3518 -5425 5638 7632 -3704 -6164 3562 6572 -1947 -5413 981 2546 -2330 -1779 1367
359 1367 -1508 -3585 391 3948 -115 -5054 -643 6011 2756 -3181 -1678 3047 2570 -792 145 1355
375 1355 -2484 -2849 3605 3528 -4983 -6840 1474 6073 24 -5881 -2900 2346 4052 2383 -1700 -4223
391 -4223 -258 6103 5660 -2263 -7232 -1420 7119 6031 -3937 -9340 -2880 6655 6399 -3175 -9967 -5020
407 -5020 7365 10645 -1717 -12328 -4425 11267 10922 -3758 -10115 -1699 7469 7262 51 -7120
421 -7120 -7443 1575 10210 4829 -10464 -13278 2657 15342 5090 -13818 -12153 7623 15594 1460
435 1460 -11277 -6120 6128 8546 2683 -3505 -6852 -3520 5997 9397 -1273 -13281 -8480 9237
449 9237 13758 -3097 -17084 -6695 13469 13396 -5851 -13726 -446 10957 6602 -2692 -4982 -2187
463 -2187 477 4407 6636 -1399 -12412 -7229 11098 14471 -7105 -21139 -2153 20306 9691
476 9691 -14935 -13547 7807 13853 -39 -6675 -371 667 -1482 4451 8508 -3620 -15778 -3014
490 -3014 18775 10484 -18521 -19752 10037 22553 -1449 -21390 -6293 15012 9690 -5768 -6482
503 -6482 926 2373 1320 4743 4025 -7204 -10879 5061 16457 1382 -19430 -11887 15276 17534
517 17534 -9378 -20679 287 17877 6118 -12010 -6944 7547 5108 -3658 1021 6599 -3165
530 -3165 -11310 3039 17971 743 -22525 -8679 20488 14314 -16786 -19482 8834 17868 -3524
543 -3524 -12863 1499 7815 -2154 -3241 8155 5309 -12186 -9033 15183 16486 -12291 -22850 4426
557 4426 24408 3337 -22643 -11650 13942 13540 -5657 -12293 -1452 7121 4222 621 -327 -3666
571 -3666 -4358 3926 11392 2589 -14132 -10312 12448 17066 -7080 -22122 -2965 20128 9674 -16356
585 -16356 -15005 8473 14717 -2335 -11144 73 7446 156 -2243 5062 1910 -8746 -2987 12397
599 12397 7320 -13339 -12524 10327 14094 -7310 -15852 1393 13386 1464 -10893 -2754 7961
612 7961 2587 -5076 -115 5928 267 -5516 833 7237 441 -7329 -2354 5886 3190 -4889 -5568
627 -5568 1129 4127 -314 -3838 -1299 2616 1618 -1742 -279 2941 628 -2683 729 5070 976
642 976 -5426 -2289 5449 3693 -5447 -6131 2877 6108 -2161 -7292 -378 5633 1019 -4383 -755 3670
658 3670 938 -1731 1479 2269 -1654 -1532 3143 2702 -3207 -4047 2391 3926 -2055 -5311 -459 4034
674 4034 1013 -4023 -2518 2616 3320 -271 -2305 -317 2604 2251 46 -1705 -970 1902 2438 -1047
690 -1047 -3155 -952 1765 1185 -1692 -2963 -682 1683 1947 -907 -3145 -176 3929 2684 -1775 -2741
706 -2741 1294 4333 1300 -3209 -2385 1742 2830 -388 -3479 -2084 1102 1786 -168 -2498 -2385 1385
722 1385 3309 350 -2691 -1433 2740 3580 -377 -2459 -309 2117 2076 -680 -2862 -1110 1497 1123
738 1123 -1256 -2735 -1043 1506 1221 -712 -1715 -491 2173 1916 -628 -866 624 1557 1240 -367
754 -367 -909 37 422 213 -685 -1286 -236 38 -673 -347 -391 -430 11 313 516 506 237 380 609 599 1023
775 1023 320 -667 -121 446 -14 -532 -1269 -918 218 145 -739 -1325 -613 1150 754 -651 -277 590 885
794 885 1162 -38 -428 412 824 603 -537 -1078 -142 319 -221 -749 -1181 -465 834 -254 -1219 5 970
813 970 822 -217 -158 987 1114 251 75 -151 165 783 165 -924 -1161 -282 640 -208 -1782 -1177 491
832 491 1104 -106 -1217 -241 1417 1208 249 -35 -300 674 1554 726 -1358 -1506 694 1622 -849 -2192
850 -2192 -531 683 11 -537 -461 -231 -42 586 1215 288 -913 276 1803 1253 -825 -1087 649 778
868 778 -466 -657 -130 -776 -950 405 662 -1037 -1853 704 1620 -223 -1086 692 908 -122 605 1628
886 1628 8 -1992 276 2843 436 -3262 -1949 2381 1777 -2395 -2581 841 1259 -1181 -565 1506
902 1506 132 -2122 744 3896 265 -3530 -641 4006 2044 -2865 -2531 1486 1764 -909 -1721 -736
918 -736 -99 -245 206 276 -806 -1217 498 1738 1119 -333 -1303 -226 2209 2299 -647 -3228 -599 3829
936 3829 1763 -4300 -3309 2463 2593 -2457 -2708 1894 1325 -2997 -223 4753 687 -5572 -1164 7281
952 7281 3771 -6619 -4904 6060 5844 -4400 -5951 2477 4520 -2519 -4166 2304 2173 -3862 -2335
967 -2335 4722 3179 -4822 -4094 4880 6045 -2524 -5398 1194 5233 1199 -3536 -2138 1710 1618 -822
983 -822 -1546 -562 136 -519 -908 1028 1400 -1619 -2651 1569 4899 608 -5817 -1783 7163 4261 -5831
1000 -5831 -5266 4710 5565 -3943 -5544 3191 3762 -4666 -3817 5123 3442 -6524 -5086 7387 7161 -6620
1016 -6620 -7921 5752 9177 -3053 -8152 1952 7249 -1258 -5538 1486 3663 -2808 -3764 3034
1030 3034 3751 -3967 -5317 2923 5692 -1392 -5250 -315 4716 2759 -2243 -2856 849 2933 1371
1045 1371 -1798 -2332 550 1756 -718 -1764 323 705 -2123 -1718 3304 2340 -4553 -3838 5136 5944
1061 5944 -3909 -6432 3613 7565 -2095 -6496 1956 5683 -2034 -5102 2230 4480 -3729 -5512 3710
1076 3710 5699 -4121 -6662 3057 6941 -1939 -6195 1611 5732 -554 -3688 1471 2985 -1751 -2191
1091 -2191 2502 1787 -3212 -2523 2361 1996 -2395 -2224 875 1267 -232 -137 175 -841 148 2420 1029
1108 1029 -2151 -881 2963 1765 -2452 -1646 2242 828 -2718 -545 2558 -646 -3906 519 4140
1123 4140 -794 -4597 764 4965 -149 -4352 595 4372 -183 -3392 1140 3366 -1618 -3328 1637
1138 1637 3263 -2376 -3813 1950 3242 -2444 -3363 2010 2767 -2086 -2195 2633 2088 -2420 -1065 3214
1154 3214 1301 -2962 -811 3151 812 -3213 -678 2579 -369 -2873 25 2194 -989 -2543 1009
1169 1009 2524 -1150 -2152 1751 2420 -1313 -1733 1879 2034 -1852 -1536 2221 1159 -2780 -1010 2427
1185 2427 260 -2900 -510 2714 -9 -2911 322 3099 -391 -2594 1109 2993 -548 -2354 1195
1200 1195 2722 -1362 -2399 1629 1976 -2111 -2360 1716 1881 -2498 -2254 2278 1809 -2361 -1583 2296
1216 2296 1528 -1896 -787 2555 881 -2259 -62 2625 -212 -2675 -118 2317 -279 -2654 -71
1231 -71 1970 -697 -2016 634 1458 -882 -1208 1517 1564 -1468 -1121 2450 1532 -1783 -1161 1989 1006
1248 1006 -1938 -1016 1529 -132 -2424 -131 1707 -410 -2158 214 2234 -168 -2094 702 2249
1263 2249 -340 -1454 991 1795 -634 -1362 1032 1447 -1646 -1668 1317 1143 -1790 -1479 1171 1051 -1514
1280 -1514 -784 1636 618 -1405 31 1887 412 -1448 71 1927 -12 -1769 140 1362 -319
1295 -319 -1548 -122 932 -653 -1394 365 910 -961 -904 986 1025 -620 -584 1243 880 -710 -269 965
1313 965 266 -919 -99 751 -288 -1220 32 824 -572 -1072 248 854 -385 -745 649 1117 -324
1330 -324 -663 741 1213 -493 -747 682 743 -738 -830 498 337 -1012 -781 599 176 -943 -491 806
1348 806 489 -482 -95 789 451 -131 28 568 140 -266 97 259 -305 -438 38 149 -503 -459 5 82 -416
1369 -416 -51 336 177 -267 154 815 169 -415 118 680 163 -392 -149 185 -48 -465 -412 52 31 -547 -277
1390 -277 258 292 -212 -304 436 634 -17 -188 226 626 380 -261 -268 408 265 -367 -628 54 118 -444 -705 308
1412 308 393 -545 -565 349 853 -133 -545 368 1183 236 -690 -174 694 449 -826 -709 489 327 -704 -643
1432 -643 292 563 -501 -769 366 916 -319 -761 287 1297 338 -872 -143 1368 544 -1177 -632
1449 -632 888 612 -1321 -1052 877 655 -1318 -1047 925 1128 -935 -1341 1071 1639 -480 -1303 825
1466 825 1570 -142 -1532 170 1633 -246 -1659 -243 1254 -34 -1572 -546 1248 298 -1359 -380
1482 -380 1240 797 -722 -679 968 1246 -436 -1033 625 1305 -130 -1200 -199 1122 -4 -1511 -468
1499 -468 1011 413 -1352 -775 1129 982 -1127 -936 1313 1407 -904 -1320 1089 1699 -943 -1685 759
1516 759 1606 -743 -1887 318 1565 -617 -1962 153 1513 -195 -1570 89 1769 281 -1502
1531 -1502 47 1490 304 -1105 -327 1188 454 -1124 -599 690 299 -702 -761 346 487 -456 -800
1548 -800 191 723 24 -500 -61 794 556 -465 -491 666 824 -539 -823 295 943 -499 -1271 93
1566 93 1116 -419 -1266 237 1310 -285 -1284 452 1523 -23 -1256 510 1536 -42 -1439 177
1582 177 1205 -198 -1259 -90 948 -220 -1224 -53 921 -189 -942 205 961 -86 -624 308
1598 308 838 70 -335 337 504 -171 -328 102 65 -367 -238 65 -232 -445 101 115 -321 -247 314 385 -295
1619 -295 -114 783 238 -495 -117 801 238 -770 -215 835 57 -1021 -304 905 -102 -1043 -109 1073
1637 1073 23 -946 144 1014 95 -655 300 1125 36 -780 233 869 -272 -962 183 615 -386
1654 -386 -933 151 701 -420 -690 430 577 -452 -342 598 443 -351 -260 683 375 -646 -85 566 -97
1673 -97 -612 -182 372 -318 -700 128 326 -359 -439 375 438 -310 -242 652 676 -446 -314 814 347 -679 -284
1694 -284 603 150 -720 -418 745 -100 -938 -175 753 107 -667 -14 772 71 -633 313 685 -94 -612 232
1714 232 592 -151 -677 169 397 -401 -677 201 335 -420 -426 369 216 -463 -191 700 215 -470 85 703 168
1735 168 -447 47 640 -15 -628 64 341 -326 -525 -16 286 -289 -554 324 503 -386 -367 482 574 -275 -297
1756 -297 447 346 -372 -305 507 107 -593 -139 406 -50 -684 -92 422 -146 -545 181 634 -61 -308 288
1776 288 689 -15 -415 325 434 -394 -443 278 386 -459 -530 337 216 -593 -331 429 255 -402 -210 486 343
1797 343 -263 -119 688 118 -394 6 516 31 -457 123 333 -264 -516 1 264 -324 -401 182 333 -293
1817 -293 -105 500 209 -294 -8 639 204 -400 52 623 126 -530 -102 566 -161 -681 -153 506 -5 -597
1837 -597 56 565 -28 -571 253 572 -200 -484 309 463 -211 -401 182 454 -346 -527 229 91 -450 -324
1857 -324 286 90 -358 -193 346 203 -340 160 474 81 -206 217 430 -89 -438 213 393 -364 -442 224
1877 224 362 -453 -427 161 259 -381 -499 485 299 -464 -264 472 252 -246 -247 460 344 -411 -443 165 139 -269
1899 -269 -211 100 111 -145 -148 133 -13 -76 82 166 102 11 208 29 -30 106 155 -174 -262 43 117 -246 -242 115 262
1924 262 -191 -508 129 432 -135 -308 207 490 -77 -477 231 671 -116 -394 115 486 -31 -552 -174 396
1944 396 -44 -685 -163 292 -138 -334 -29 366 246 -288 -179 381 362 -156 -279 207 396 -315 -462 173
1964 173 207 -25 -394 -123 255 -81 -411 -65 338 197 -367 -135 522 266 -368 -106 380 393 -268 -247 206
1985 206 328 -282 -498 68 160 -200 -244 10 202 96 -271 30 402 317 -213 -56 275 352 -216 -197 333 325
2007 325 -232 -483 -24 367 -242 -399 76 450 -71 -428 103 637 -13 -471 99 714 155 -406 -24 602
2027 602 172 -595 -143 396 65 -527 -134 431 157 -446 -143 431 225 -433 -91 359 276 -246 -116 276
2047 276 -15 -117 -99 29 124 -163 -200 -72 -116 -97 -99 -147 51 68 -16 -187 -121 346 136 -196 -25 506 146 -299
2071 -299 -40 359 81 -413 -146 299 43 -566 -228 426 95 -582 -14 524 141 -352 -64 457 190 -370
2091 -370 -98 323 151 -375 -187 358 2 -380 -157 141 -60 -334 -52 280 19 -174 29 142 32 -17
2111 -17 111 157 16 -72 211 38 -85 113 134 -148 -216 171 132 -168 -214 316 192 -310 -202 197 419 -290
2133 -290 -150 292 448 -295 -203 263 221 -376 -310 316 234 -497 -397 445 213 -399 -221 267 159 -179 -170 381
2155 381 173 -300 86 316 152 -164 20 213 32 -234 -38 141 -103 -97 49 37 -187 -104 271 87 -185
2176 -185 46 358 23 -195 48 296 65 -250 -7 322 -144 -325 88 328 -176 -403 59 363 -56 -427
2196 -427 200 399 -153 -238 223 346 -48 -191 276 363 -307 -278 173 83 -301 -194 80 -92 -260 -82 191
2217 191 15 -154 84 215 51 -79 139 303 -114 -86 84 211 -164 -240 189 130 -218 -293 179 79 -348
2238 -348 -128 247 88 -231 -21 438 114 -337 -150 323 90 -195 -21 209 154 -350 31 277 -162 -348
2258 -348 25 237 -190 -248 45 246 -102 -138 239 123 -141 -50 247 113 -114 -74 174 -15 -377 -50 199
2279 199 -47 -230 -58 156 47 -192 28 218 -40 -231 95 324 -6 -204 36 211 -94 -220 17 85
2299 85 -278 -62 82 113 -11 -104 161 -21 -95 103 50 20 -23 5 190 -20 -117 63 184 -20 -178 174 27
2322 27 -96 -185 57 104 -225 -169 162 139 -64 -61 212 213 -185 -47 242 53 -185 -64 103 94 -176 -96 65 -23
2346 -23 -123 -140 65 3 -83 -16 127 34 -52 97 49 -73 -52 111 -73 -154 -28 101 -42 -174 0 119 -135
2369 -135 -256 23 162 -71 -155 -11 202 -135 32 155 247 -19 -150 191 98 29 -284 36 47 -6 -102 -23 159
2392 159 -102 -178 67 73 -13 61 129 115 157 -49 55 101 -10 21 -92 60 127 -24 -118 -39 -33 60 -101 -89 51 -18
2418 -18 17 -43 82 197 -3 -147 132 194 -63 -217 82 188 -42 -248 -281 83 -125 -183 31 212 66 -130
2440 -130 28 145 157 -244 62 110 164 -187 -51 142 169 -157 -76 -18 179 21 -198 22 122 -161 -137 96
2462 96 103 -57 -112 -26 157 -28 -78 5 125 28 -139 -183 57 90 -67 -242 45 118 -72 -170 -25 169 -93 -46
2486 -46 62 171 -3 -138 60 180 196 -154 -85 182 -17 -102 -18 129 40 -122 -141 -44 18 23 -47 5 106 2
2510 2 -107 79 228 31 -127 -75 157 122 -93 -22 27 115 -165 -197 100 101 -55 -32 67 74 -97 53 82 268 27
2535 27 -86 27 144 -52 -47 -2 76 -19 -152 28 3 27 -186 -35 4 -72 -112 -9 129 165 -9 48 -10 73 59
2560 59 19 -40 17 67 -25 -222 55 27 37 -118 -6 81 -28 28 85 114 -147 -72 175 177 -87 -147 13 184 -52
2585 -52 -180 -3 167 -44 -86 -56 61 -186 -125 -7 158 -81 -66 18 218 -57 -14 56 1 37 18 22 -30 13 43
2610 43 12 -29 -64 77 54 -261 11 68 89 -136 23 77 6 -84 40 214 24 -20 -40 51 -123 -170 -53 131 -61
2635 -61 -230 -88 41 59 -119 -50 35 107 -214 -8 71 37 10 17 100 -23 -26 -66 118 29 -45 116 25 -60 16 18 117
2662 117 24 -13 59 48 -70 -5 111 97 56 59 22 -33 -111 106 -57 -65 -125 38 35 -105 -84 10 32 -20 -47 98 6 -67
2690 -67 28 165 202 -148 -7 229 87 -111 -28 134 97 -73 -92 225 -26 -54 30 19 146 -150 32 121 15
2713 15 -100 -33 135 59 -56 -64 251 -674 -716 -4 58 -94 -147 20 23 -58 -20 7 35 -42 -18 43 24 -15 151 123 -32
2740 -32 -7 -9 54 -1 -76 -114 126 -99 -67 15 162 -22 99 124 42 -181 -73 99 139 -87 -30 154 85 46 -32 67
2766 67 -1 -81 -29 39 82 -51 79 173 -71 -8 101 72 38 14 164 120 -52 -31 28 171 -45 -34 159 62 -130
2791 -130 -115 25 129 -157 -45 0 109 -17 -77 85 66 -25 48 127 95 -2 -37 27 -19 -89 -52 66 -82 -32 27
2816 27 49 -24 -80 -1 130 -73 -47 58 82 -46 50 108 7 -215 15 233 -21 -53 52 161 -34 -105 -9 88
2840 88 -159 -99 58 53 21 -88 16 42 45 -11 109 -2 0 -18 -26 35 -36 -39 17 50 -141 12 103 29 -41 -83 51 117
2868 117 -16 -6 51 28 20 111 89 46 -16 -11 40 -121 -65 70 107 -156 -78 79 34 -76 -95 36 101 -182 -18 92
2894 92 40 -34 -65 -53 19 -73 -10 209 70 -21 -57 40 -29 -44 25 76 -2 -33 4 -9 140 22 -62 40 44 -54 40 114
2922 114 -100 82 -12 -60 -81 -59 -28 -45 -4 -108 -65 5 105 65 62 -83 67 81 28 6 -43 47 103 -111 -38 -61 28
2949 28 4 -53 43 116 -33 -19 53 55 -33 30 89 -20 68 -98 -106 95 31 -65 -32 6 -199 159 57 85 4 14 48 58
2977 58 20 93 17 70 43 92 -60 -57 106 23 70 -96 14 61 75 -72 -9 -26 -7 -35 -70 -19 125 41 -122 80 -67
3004 -67 63 1 120 -28 -16 -26 26 2 10 -29 60 -6 -109 -9 -34 -49 105 -87 30 29 11 119 21 -21 112 71
3030 71 -153 -53 75 0 -47 -16 -18 -31 -33 -1 105 47 -146 42 18 12 140 -10 104 2 -13 -1 53 -99 -112 -36
3056 -36 149 9 174 -165 12 -37 1 -54 205 67 10 30 -21 131 -90 -93 -96 115 -2 -11 42 23 161 124 -127
3081 -127 380 -21 67 3 6 -76 91 -9 102 110 65 -69 45 104 31 -54 11 196 -73 -29 10 -30 -1 -43 3 84
3107 84 61 39 36 50 -76 52 8 -62 90 -4 -69 -18 81 -44 36 61 75 25 -24 -4 51 31 9 61 9 16 33 119 59
3136 59 -29 60 -95 68 1 50 26 42 13 126 -91 -61 -142 22 18 -10 54 12 41 -68 81 9 32 -60 22 -71 -46
3163 -46 2 7 24 7 24 -80 77 -42 1 57 2 -38 16 -31 -55 78 -53 -54 -16 101 14 -182 -9 52 35 -23 54
3190 54 98 -30 -80 -30 23 16 -12 -76 -26 104 12 -75 40 -60 59 23 29 -51 -1 104 48 -75 95 66 -72 -140 -52
3217 -52 -24 -17 -69 37 -23 -28 -5 -25 45 15 45 -26 13 -26 -13 22 -17 -43 0 -23 82 131 -94 47 54 -36 -91 13 20 -51
3247 -51 26 19 118 30 73 -1 37 -16 -63 -1 -67 7 61 -34 3 -59 -127 -47 41 73 -2 37 44 -122 55 43 -5 -129 -22
3276 -22 -34 15 0 124 61 -13 59 5 26 -112 37 -15 -24 -9 20 -25 26 96 85 -48 19 -73 -78 -110 54 -34 -14 -89 -78
3305 -78 23 4 74 -63 -37 -105 -74 94 -22 96 -98 -105 51 -69 -30 -6 20 18 -22 28 62 56 33 56 41 -21 39 66
3333 66 4 151 119 -75 -47 20 12 -21 -56 83 -27 -107 7 53 39 -43 70 -25 -31 -6 -88 -69 38 18 110 117 74 -70
3361 -70 -62 207 -11 -26 120 16 71 -23 37 -133 -5 -37 14 -29 11 107 41 -17 36 -54 42 -24 -43 21 8 -23 -52 51
3389 51 26 -107 -31 -25 52 73 -52 30 15 -62 40 103 35 68 -57 4 51 -27 -4 -13 2 98 -51 25 -110 15 28 99
3417 99 -22 2 136 -49 -42 -7 91 -104 42 53 -140 -108 -18 -21 -16 48 -35 58 8 -29 -14 32 82 -98 -14 -7 -29 -30 24
3446 24 -17 -3 -43 30 -134 53 8 -21 17 -47 9 -60 57 -28 -14 -1 20 -146 -6 133 -28 -90 3 -47 33 101 -21
3473 -21 118 28 -114 111 -151 -55 77 48 -165 88 -46 -269 -152 52 57 183 302 -12 330 69 219 -182
3495 -182 -30 -113 627 -113 156 -98 74 156 -407 -302 465 309 -669 135 328 68 -272 -121 880 167
3515 167 249 82 50 838 -421 269 87 -545 -306 461 -16 -303 -178 -61 132 823 327 248 -23 157 393
3536 393 112 -2 15 411 -214 244 -168 -340 -176 -476 657 194 327 32 217 -159 278 -208 47 -224
3556 -224 308 332 -209 -223 157 -159 -279 451 298 -389 447 183 -302 723 -343 -174 16 62 66 116 60 25
3578 25 203 -34 -148 64 -43 17 41 9 -131 -70 -63 -62 86 103 -193 -21 -20 -29 -54 80 112 51 8 -41 -72 -28 -14
3605 -14 45 56 66 57 -47 -71 65 -34 50 -11 196 -124 49 -31 64 -32 148 244 170 -31 -49 95 -603 258 47
3630 47 -657 -77 -304 -409 163 -137 -234 104 208 574 -34 194 -523 507 1035 129 -424 -397 277 191 253
3651 253 479 -170 108 -584 773 403 139 393 -98 426 -140 -11 17 -56 55 169 86 -30 -156 -60 -118
3672 -118 -46 -12 45 85 -26 43 52 5 96 -14 -5 58 -78 24 16 -89 -55 143 -59 -18 -17 -13 -45 81 25 -25 -47 -52 8
3701 8 -26 45 -48 -51 -45 -74 4 106 94 38 -34 55 55 23 6 104 4 -39 -62 126 15 -18 -76 -14 120 -98 0 -30 -90
3730 -90 90 -42 28 47 -2 11 -80 -17 -34 51 -76 -25 -119 -21 -25 85 -83 114 14 -12 -16 3 -56 47 -77 19 5
3757 5 33 78 -30 -29 24 67 -64 50 -33 -3 -29 49 -27 5 -74 40 -10 -57 -78 81 -94 55 -57 24 84 163 -106
3784 -106 -25 -61 138 30 108 0 80 74 39 130 54 37 -89 -51 -33 -37 -76 56 -28 -7 -56 -52 39 -47 -91 57 -139 -108
3812 -108 -15 -15 -13 46 -161 -15 -16 11 -96 45 40 41 74 -113 51 183 69 -38 -29 89 56 11 40 29 2 47 -102
3839 -102 11 91 126 -24 42 17 -43 -44 59 -14 -52 130 30 -15 58 -81 47 26 -78 -82 34 89 18 -126 -3
3864 -3 29 43 19 -19 -19 -41 -91 -22 -40 0 -27 71 45 37 95 42 -16 42 82 37 38 -74 -15 -35 -25 -61 -31 -37 -136 -84 31 59
3896 59 -46 61 27 16 -112 53 -44 -56 39 86 -141 -76 -30 44 -8 -43 -82 -9 1 -51 51 58 25 -19 25 74 118 103
3924 103 -24 57 -92 -123 -39 -69 -82 -69 40 20 -57 -23 18 -33 102 -64 -44 62 -137 -47 11 96 -78 65 4
3949 4 30 -4 -44 64 -31 -181 22 180 81 122 -65 -71 -29 225 66 89 89 363 19 244 281 -51 245 477 -155
3974 -155 -348 224 -260 202 -462 -245 -192 -132 457 439 -3 -221 80 262 136 258 231 515 -120 62 -162
3995 -162 16 272 -309 336 151 -153 -18 -149 326 -569 -116 75 405 -50 -364 137 -351 233 -370 545
4015 545 -2 24 -117 689 -770 -228 -185 -2 131 -353 303 21 -8 -29 150 -117 7 96 -45 -486 -40
4036 -40 -141 96 -155 -330 -45 136 40 4 150 94 -36 162 325 -84 241 98 -108 286 -286 -150 48
4057 48 314 253 50 -344 -30 216 -1 233 58 -59 -102 75 -69 26 36 -68 21 29 36 -36 -122 91 -39 123
4081 123 -142 21 6 5 -33 30 -26 -67 -68 63 25 -18 15 15 47 -108 -120 90 14 -33 -75 -40 22 -24 15 -3 90 -20
4109 -20 -2 -28 84 -28 -141 -5 69 52 -96 53 -1 39 20 -23 -115 -15 164 90 43 29 -53 39 -70 37 -64
4134 -64 63 -57 -2 -57 -141 105 97 99 37 8 4 -83 -56 -27 -22 149 -67 28 -33 -1 47 -25 -2 22 -82 -39 118 128 120
4163 120 -32 83 -19 -11 28 66 130 -33 14 52 16 32 0 -38 28 61 6 -32 -51 -1 -29 -43 -156 -5 17 8 17 -41
4191 -41 -33 67 -44 65 48 -42 -61 -54 -19 -40 -63 76 -17 -29 -27 52 80 17 -19 -23 -27 -17 -64 70 18 -129 -70 -37 -39 24
4221 24 -35 -132 -49 -16 75 20 155 -66 128 89 28 15 110 46 -46 80 18 65 44 56 -117 -190 -11 -33 55 60 -154
4248 -154 138 182 168 161 -68 120 -56 467 -82 -434 -156 328 96 98 396 -142 -428 149 102 112 -198 -48 -326
4271 -326 210 -442 3 -135 -182 -41 -314 -233 247 559 315 212 -809 -536 -407 36 8 162 -757 -85 -248
4292 -248 -436 -169 -325 -126 -266 228 -437 -149 -187 173 257 -153 301 -94 1251 -171 553 -618 -562 161
4312 161 594 444 -119 -636 556 120 232 759 8 520 200 192 289 -53 256 -77 -201 -839 -164 352 -298
4333 -298 101 -116 387 -110 192 -96 119 209 -95 -590 131 -83 131 -81 -166 641 301 -446 -326 -409 582
4354 582 24 228 377 111 255 -404 9 -138 -488 -29 -367 -143 313 53 402 76 255 -94 84 152
4374 152 -625 331 -24 -5 171 -399 297 -90 416 -847 -231 110 -589 126 -5 -350 668 405 -376 276
4394 276 41 -67 245 -274 -481 -408 -113 359 200 -111 -4 217 -88 -78 8 54 187 7 -14 1 -53 17 48
4417 48 8 -47 42 29 8 53 -25 14 -8 99 56 9 -15 36 78 -21 66 107 126 -59 -50 67 53 22 -50 51 -23 -52 -102
4446 -102 -74 -112 -11 8 -57 90 13 -76 -50 14 -35 64 131 26 -3 114 61 -22 -94 -53 -16 -3 -17 -26 -13 121 -121
4473 -121 -61 -16 -12 35 47 -82 -44 -4 25 -1 -54 25 -53 -35 28 59 -5 -18 -6 -75 -10 59 -67 -46 23 -85 -74 91
4501 91 -29 -105 7 -41 -23 19 -65 72 -20 -90 -27 -13 10 101 66 -38 -48 -22 -9 55 55 19 19 -11 -63 -60 -68 -41 30 -32
4531 -32 -15 -27 167 58 -90 71 6 110 44 -48 57 8 -90 20 -86 64 38 57 -14 -39 -12 8 11 -2 64 49
4557 49 -182 -41 0 -99 83 59 -2 52 -28 13 103 19 -16 28 154 -103 17 -19 -11 -105 2 -47 21 19 71 94 61 -44
4585 -44 -12 94 37 -46 100 40 -34 -76 7 -46 40 29 61 -17 73 115 -25 -99 -15 -155 -52 -99 19 -164 161 171
4611 171 -129 56 -144 -12 69 67 -103 196 191 -28 -174 -460 -379 105 130 -319 -53 332 -139 78 329 -60
4633 -60 14 -273 286 -27 -243 378 -59 95 267 173 -201 -4 -77 -6 236 8 281 241 -38 -120 20 213
4655 213 305 100 506 122 558 225 -26 36 -156 187 -343 101 308 327 -176 -138 58 -280 -289 223 -31 306
4677 306 185 254 180 -284 1032 274 147 -83 -546 185 -273 213 -586 482 761 273 -619 542 101 565
4697 565 -589 -65 622 -93 -751 -269 197 -139 -179 -540 -365 126 -672 -386 -328 -201 444 500 355 -294 274
4718 274 -84 81 319 -132 -93 186 -64 -24 -262 -94 151 -154 122 11 -203 -151 221 -279 -63 85 -246
4739 -246 -228 209 53 22 -139 -225 116 -170 -47 -38 56 -51 -32 -125 12 44 105 -42 3 -43 -70 22 -157 133 32
4764 32 22 -132 84 102 -160 84 -48 0 113 -47 -69 96 -196 -269 56 -134 -117 -7 -209 103 -74 57
4786 57 -203 87 -122 -170 507 326 -800 -261 -296 -258 237 867 15 -493 330 195 -195 256 123 67 -145
4807 -145 101 570 -40 71 -526 -331 78 138 183 141 0 57 -148 -83 160 66 54 -7 -115 -101 -7 106 -29
4830 -29 -27 -112 -116 43 -6 -118 36 141 24 -31 1 75 -30 39 -90 93 -13 -164 129 -87 -15 -127 119 51
4854 51 -14 0 -36 -24 -65 -67 -33 26 133 42 20 -22 -56 -107 9 43 -60 -46 -21 -78 74 0 3 -73 -22 57 72 49 -6
4883 -6 13 -8 -65 36 72 -42 -22 22 68 -63 -2 -43 -130 -31 -123 -106 -2 -120 -5 -36 130 -109 -42 54 40 -34 50
4910 50 57 34 -65 27 -60 -52 -39 2 44 -33 87 26 -21 -70 -30 -23 125 0 152 135 12 55 -1 -40 -44 -67 3 35 -93
4939 -93 -44 26 -27 -20 11 79 -47 -105 7 22 94 55 67 -8 -61 -41 -79 -69 -39 21 45 32 73 89 -45 -23 34 70 70 84
4969 84 28 6 -156 -182 -146 166 2 -18 -205 204 200 -255 308 -80 33 -64 -286 -84 8 141 32 -77 15 -140
4993 -140 -75 64 -3 57 7 37 60 25 66 5 34 -103 -48 198 265 157 141 -96 48 -9 -104 179 -229 34 -321
5018 -321 -33 116 123 168 -636 289 -32 -361 455 636 184 267 207 174 -172 -155 98 -142 -111 -237 -561 292 51
5041 51 -634 -5 264 497 -267 -64 311 -196 26 -534 226 -148 -30 103 2 12 -303 -50 107 261 25
5062 25 3 -126 -134 75 302 497 7 -863 -210 33 -135 -334 -231 -1109 -8 -158 271 1232 222 147 -657
5083 -657 -99 107 -343 -960 -184 202 541 342 12 -77 687 384 -377 -13 236 257 79 -388 499 -312 -255
5104 -255 439 -212 345 331 -510 -265 -141 585 -245 -464 443 -359 -118 3 78 264 239 -529 -54 39 -253
5125 -253 -475 -230 47 -477 658 -397 -184 -470 -1 -136 -353 -350 -456 845 62 -116 44 603 53 -66
5145 -66 246 190 297 -418 -15 -186 317 332 5 745 -166 -498 -517 748 -585 201 -79 -155 135 64 1174
5166 1174 -204 658 193 -300 286 429 -486 -287 432 -26 195 560 -848 -57 -617 351 -497 -498 500 -249
5186 -249 436 610 1057 -266 575 41 -636 157 -1 -781 -100 34 97 333 228 135 135 626 157 367 -754
5207 -754 -6 -778 -292 -60 760 -210 814 70 -198 -735 -223 -294 147 -311 209 206 136 -336 68 379 146
5228 146 315 -343 326 270 552 924 -259 -292 -188 131 157 -477 269 -656 118 -36 -14 354 190 443 -31
5249 -31 604 259 -250 87 345 680 -84 337 -9 -8 -177 413 -376 -272 -307 -40 236 -575 -160 -511 -453 12
5271 12 243 -240 -467 -245 -435 66 86 273 72 24 -258 271 -30 -131 113 -333 198 131 -54 -215 162
5292 162 89 -32 -145 377 33 -59 124 -60 52 284 61 47 -165 139 23 -40 101 9 5 -109 -50 -61 93
5315 93 -36 249 -126 -16 -27 -127 -26 17 -73 10 50 38 -23 67 23 -146 137 -117 12 -18 -115 -132 -60 78 0
5340 0 -15 -11 -42 95 44 -97 -97 115 93 87 -144 -103 -95 21 -16 47 -8 2 16 -46 45 4 -12 40 -120 -75 4 -99 3
5369 3 24 -42 -24 52 -51 71 -43 191 44 27 92 142 -114 -23 77 45 137 51 -10 8 32 13 34 9 -41 -53 179
5396 179 -5 117 -96 56 3 -82 -83 -51 41 -33 14 -79 40 4 28 28 41 -30 -45 -11 80 -2 -16 -9 29 -180 -106 -25
5424 -25 -13 39 -47 -40 -8 64 -55 81 -26 -5 28 125 -61 6 57 -8 60 -4 -20 54 -8 -93 -61 -63 50 -8 6 -8 113
5453 113 -56 2 18 73 -48 115 -55 -42 -68 -44 72 14 -5 -19 59 100 87 -9 -99 -70 -5 -60 56 -13 101 -150
5479 -150 -18 37 -85 75 14 92 -8 60 25 18 9 4 81 12 50 34 10 43 15 -19 26 50 -49 -17 -50 -95 -55 -24 29
5508 29 155 -35 -49 -25 92 -30 44 4 44 -56 -36 71 -10 -34 26 63 -49 -122 44 -39 48 -61 47 -34 -22
5533 -22 34 -68 35 5 116 -118 49 89 71 30 25 128 10 61 37 7 -121 33 102 -37 7 7 43 -17 -76 20
5559 20 -50 26 2 -28 -1 -58 -69 43 58 72 64 36 -20 27 18 60 79 42 -9 -19 -12 50 85 -12 -88 62 77 39 -70 6
5589 6 11 -27 -42 -121 -4 -67 43 87 130 77 93 87 154 44 -36 98 15 42 -12 -72 -95 -26 -2 -20 -100 6 21 -37 -37 -20
5619 -20 -24 -114 -56 23 53 -35 -40 -40 -11 -56 9 -99 136 6 26 54 39 37 9 -83 -116 -45 16 -58 120 6 -24 -69 5 -33
5649 -33 40 157 8 -77 -159 -135 96 53 -53 -7 -34 -5 2 47 -28 7 -31 33 -50 95 30 31 62 121 15 96 -52 106
5677 106 51 45 70 90 15 -51 -27 -73 -11 -78 -12 -29 -84 -48 91 -68 -82 -5 -85 -80 -24 20 -100 -156 -27 -19 25 0 92
5706 92 -19 5 26 7 91 91 -8 30 -14 -99 -67 -103 8 78 -17 -57 -18 79 19 21 65 -191 -27 -66 29 114 -40 73
5734 73 -85 -18 46 -56 -86 135 -6 -60 8 -2 9 19 15 -18 -56 -77 -91 103 -3 98 -18 -7 7 105 -47 -40 56
5761 56 33 4 7 83 -2 -17 79 -21 -22 27 -1 -5 -6 105 -28 10 -13 44 -23 7 -16 70 8 146 57 -14 -20 33 -164 -16
5791 -16 39 -3 36 -60 -38 -46 -12 -5 16 -21 37 -81 -14 88 30 86 -1 12 13 55 13 36 69 -29 -44 -73 63 60 -38 7 -2
5822 -2 -66 -2 -51 -63 62 -31 6 10 -28 100 -30 -45 -6 16 -119 -9 -83 68 151 27 -25 -23 -43 -95 66 67 9 114
5850 114 14 -3 66 -134 11 149 -63 -25 -79 -57 111 45 -86 -136 50 37 15 -45 -36 -17 -63 -101 -10 86 -38 -62
5876 -62 24 44 -129 -94 -14 79 -19 -34 2 -18 35 -55 50 -88 3 -25 -32 19 86 -6 43 67 39 31 25 9 48 -18 6 52
5906 52 -131 -53 4 -17 14 39 35 16 -76 43 -56 4 -28 -19 -43 57 67 -93 3 26 1 -161 61 -48 17 112 -112
5933 -112 31 -12 65 39 -14 20 -57 87 97 49 -62 -62 39 34 -108 -60 -66 -72 -50 -19 -35 163 -5 -24 -90 30 -111
5960 -111 24 9 6 -67 13 -8 -41 66 -170 1 31 13 -29 -118 53 -32 -191 12 -6 74 -19 -58 -13 -10 11 -132 -72
5987 -72 47 -40 9 -44 -8 -81 -53 72 -13 126 -31 90 44 -108 -19 -78 -50 -79 31 -14 -54 -71 63 28 54 -9
6013 -9 -1 120 11 100 99 -18 -94 -63 105 -9 8 -41 -10 70 49 -29 -76 -28 71 -14 -28 -71 -19 -68 3 -119 -27 65 73
6042 73 41 -153 145 -7 37 -19 -46 44 37 -6 4 19 19 -19 7 19 -31 -20 18 9 -38 -114 76 -10 71 11 -42 11 -31 83
6072 83 -7 46 -96 69 -76 -9 75 -46 -81 -26 19 12 -74 -150 143 81 -142 28 54 20 -10 37 70 8 -67 14 45
6099 45 -1 96 -48 -78 102 77 34 81 40 22 -65 5 52 5 -38 -17 -49 -1 -69 -69 -12 -53 -9 -33 140 -18 -74 45
6127 45 43 -66 41 -95 -81 -90 -102 -83 10 23 72 -89 -44 41 91 40 47 -69 16 67 -5 35 105 7 33 28 -48 57 19
6156 19 -85 -29 33 -33 7 -69 -32 -45 56 48 -20 -3 41 -54 -43 160 94 42 -78 40 -83 -216 136 -93 26 -53
6182 -53 -22 22 10 61 103 4 11 17 -65 24 -50 28 195 21 24 13 -117 -64 -6 63 -27 67 -47 -67 5 -18 -29 -56 25 158
6212 158 -76 14 12 8 -16 -40 23 -86 12 -22 -16 12 -20 -27 109 44 -4 -14 -33 34 -38 104 3 59 -8 -11 -54 -55 -53 -18 38
6243 38 -43 -40 -93 -19 78 9 1 42 -52 -101 -48 9 10 -60 76 7 -46 -47 14 -164 71 1 -30 10 -11 16 -40 -48 -33 -1 -29
6274 -29 -68 -47 51 -93 43 -36 48 -45 -94 -31 21 46 6 64 23 4 23 -49 34 -18 -8 -22 65 -57 37 49 -41 -25 -34
6303 -34 50 -32 -50 -23 -12 -15 -46 -45 -91 67 -106 5 -1 3 -43 147 -52 -37 50 -56 130 -69 -1 -36 110 102 40 23
6331 23 56 42 21 2 19 1 1 -8 8 30 4 17 -54 -41 -52 132 -29 -54 0 31 -32 -77 9 -1 20 -57 -76 -8 -68 133
6361 133 -75 -100 -58 2 69 -21 -37 31 12 -7 72 -81 -9 101 117 -2 -14 1 2 -23 -41 -48 39 -107 -43 -42 41 31 35
6390 35 -60 52 -100 37 -179 28 -48 57 -90 136 -125 96 -133 104 -139 156 -447 143 122 -52 72
6411 72 90 202 -82 128 125 764 137 273 -70 -79 36 159 -36 -71 18 -66 14 -80 -76 105 -3 47 34 20 -16 -20
6437 -20 -119 35 -81 -140 -138 -20 13 59 43 83 52 -42 78 103 -238 -40 -240 763 -122 -108 179 534 337 384
6461 384 243 221 -77 -175 -450 801 -346 374 15 676 371 -84 -248 7 354 -169 71 401 777 132
6481 132 -286 -129 36 -475 -171 71 -182 372 -385 -422 99 -103 320 -144 -532 -420 22 7 42 -371 36
6502 36 -221 -478 -592 190 -102 171 -100 -396 104 -378 -237 355 83 -266 418 134 106 345 -125 -334 -327
6523 -327 564 196 -211 211 -437 26 611 208 371 -192 -145 585 -64 168 -509 184 189 -93 -46 -154 -29
6544 -29 43 -420 -79 -536 223 115 308 491 9 4 271 -920 696 -272 68 -317 -317 -57 799 -28 -130
6565 -130 361 -430 -166 -692 322 -280 -101 -367 -50 115 -626 57 -303 83 -198 -112 -22 -56 -365 135 -78
6586 -78 127 -36 3 -16 85 -16 -2 -17 -35 174 -25 3 91 47 -3 -30 -12 -75 -25 -74 -5 80 -84 -48 14 68 12
6613 12 -17 104 18 -15 -55 34 -5 26 -27 43 -50 -76 -74 21 -33 -65 -14 -93 10 11 53 62 72 -97 -67 -41 -59 14 -78 2
6643 2 102 -79 102 -73 -48 -47 -79 -74 5 -32 -50 37 45 25 -42 15 -3 -43 52 58 -50 -9 33 53 -30 -128 -55 -86 40 7
6673 7 -40 16 -31 26 -22 -78 -24 76 -16 -31 -53 71 65 -23 -52 13 22 101 -13 -20 -80 -40 -58 -47 51 -102 -116 -36 63 -79
6703 -79 -101 62 14 -48 -49 -45 -5 17 -57 36 -100 -71 33 -64 -70 110 -18 -15 182 -38 16 61 56 72 64 85 64 -36 4
6732 4 125 7 -57 -16 -76 -12 63 90 -70 -5 -34 35 -15 -2 29 -79 -62 46 22 87 42 -169 14 51 43 -68 -38
6759 -38 -19 -103 -27 65 -117 -80 -79 24 -63 -24 -10 -25 -8 36 -119 -89 -26 -11 -17 -8 -70 47 -65 74 -84 -40 1 -20
6787 -20 -15 12 -37 -119 82 -23 4 14 24 19 123 74 95 -83 -72 -32 -48 -30 -72 -65 -82 60 -37 -14 80 42 29 -15 47
6816 47 -50 -7 -8 58 41 -88 -24 -71 10 78 14 51 -24 -9 -65 39 25 57 10 -9 114 -10 13 -105 -180 -107 -49 136
6844 136 -85 -144 277 72 140 -189 16 28 -205 -513 -50 -9 340 -375 187 -53 82 -16 -67 -11 63 -163 -64
6867 -64 -450 65 -557 38 465 -279 109 -513 460 280 -130 -196 193 -38 -17 -747 545 -212 -55 169 -349
6888 -349 363 -258 -377 11 -306 7 -286 -253 736 -295 -109 150 338 -69 -182 -10 89 419 -777 -475
6908 -475 -462 643 24 -175 -504 -186 -8 58 623 -223 -213 -365 244 -59 -635 -49 -363 22 170 69 -790
6929 -790 84 582 -295 -163 -381 -141 -173 -186 -2 -9 -51 18 514 -23 46 -116 50 -93 89 3 124 9 -152
6952 -152 -88 -92 -145 50 19 121 -76 54 15 -41 22 52 -69 9 -38 21 8 28 -16 -37 -78 -27 -47 25 16 -61 -104 -107 -119
6981 -119 -71 -39 -54 6 -10 -3 120 -18 115 -95 -27 21 65 38 -54 -25 -42 4 -28 -71 -34 -97 27 4 17 106 6
7008 6 -101 136 50 36 28 107 54 -13 71 104 98 -8 -20 -25 57 -43 62 82 -109 -43 -134 -23 83 21 -30 -7 -30 -83
7036 -83 -49 68 17 -67 -7 25 0 -59 12 -72 -27 122 -96 8 16 -21 -28 -83 -3 -42 117 41 -9 19 -27 2 94 58 27
7065 27 -48 110 -28 44 -124 55 -6 18 4 12 -45 -72 52 -90 -52 108 48 -72 -27 19 -20 9 -36 -56 -46 35 -15
7092 -15 8 -13 -46 6 -10 46 61 -44 2 -97 -22 21 2 -23 130 110 -5 77 28 3 15 -15 43 24 -29 -46 37 14 -18
7121 -18 7 -15 114 59 -6 -29 -39 74 -44 -56 -63 -41 -30 -12 34 -53 12 -64 33 42 29 25 -22 -31 51 24 11 -71 -20 -36 -14
7152 -14 80 44 -16 -48 -8 -69 67 38 10 -126 34 -35 13 57 1 -79 -20 58 56 -121 73 34 18 67 -31 -42 84 -92
7180 -92 28 -21 -39 -110 -11 -10 -118 -82 -44 -22 -23 -6 0 -2 -8 104 41 22 -6 -26 -3 8 -22 -24 -116 157 -43 57 115 7
7210 7 9 -67 -129 -74 43 -40 43 77 11 -65 82 -1 38 -43 9 -39 -70 -21 50 63 112 6 -41 10 77 24 0 -24 -54 127
7240 127 -21 6 -33 -14 16 -66 54 -5 -100 10 32 41 53 3 -57 108 -67 29 -11 51 -61 126 68 114 25 36 54
7267 54 -42 57 -60 -28 -19 28 33 -69 -16 -40 -54 -35 93 -57 44 114 -35 84 -51 1 -44 -169 -4 -2 -87 -83 1
7294 1 -9 69 57 -27 56 -81 59 -5 -191 18 -2 20 -70 -13 77 42 16 -30 -106 21 11 -38 17 -63 -60 -52 -205 -434
7322 -434 -306 388 123 558 -160 23 193 -65 -31 -57 50 -21 19 24 7 8 0 -31 64 -103 84 8 57 -19 47 33
7348 33 -5 11 -61 38 31 31 117 -23 -39 21 23 -50 -12 61 -31 82 -97 70 -71 5 16 -25 32 -124 64 58 -63 138
7376 138 13 39 102 -91 -111 103 50 -70 24 -13 -61 -31 8 69 -156 -107 28 46 26 -78 -44 84 -38 -3 -70
7401 -70 15 -118 -19 -49 -67 13 20 26 49 62 11 -71 93 -16 -56 -100 -49 159 -106 -38 -35 9 -57 71 -98 -49 2 -35
7429 -35 37 45 78 -82 -51 14 95 -38 -5 -5 -4 27 21 -55 -47 2 9 -53 -33 44 70 -81 -43 24 124 -71 -20 -62 -2 134
7459 134 -74 5 23 -70 -12 -33 -113 -82 80 30 -71 -10 56 -30 70 35 -31 -42 -2 8 55 -13 89 -138 -88 33
7485 33 -40 -12 51 79 -111 26 18 -35 -26 95 28 -10 47 -3 75 89 23 37 -56 29 12 111 55 14 -43 31 -133 -38 70
7514 70 32 -51 -48 4 -79 -28 -90 -77 -14 -140 -21 51 102 4 24 78 82 34 50 -8 118 110 24 -68 -37 27 -1 23 173 65
7544 65 -68 -18 -151 -45 -107 -32 93 -12 83 69 -95 119 -37 32 -95 -66 31 10 -29 14 70 -48 21 -35 17
7569 17 -67 -45 47 -57 -4 -48 -65 0 54 13 0 -7 -124 5 56 15 -92 -9 103 -27 -51 38 75 -15 44 41 50 2 54
7598 54 46 30 -21 34 13 -33 48 46 -27 -38 -40 24 10 -23 -19 8 2 26 34 48 99 -44 -41 3 129 -31 -26 -21 -57 45 -30 15 -48
7631 -48 76 47 23 -125 -30 -49 -6 -25 -95 18 -61 32 99 -71 99 54 17 -132 81 -86 25 -31 -88 32 20
7656 20 -52 -24 9 -163 22 -32 55 -5 -20 73 84 -58 -8 40 22 -99 -40 -40 -27 -16 -22 38 -55 5 -125 53 -24 -40
7684 -40 -72 -20 47 78 -66 57 -57 -26 36 -3 111 36 122 157 -13 -16 -46 0 -56 27 53 -17 17 14 37 -37 13 -16 -22
7713 -22 2 -30 1 -29 53 29 -20 -19 21 19 -13 41 -35 56 39 124 79 24 -31 47 -100 -30 3 20 76 20 86 -5 -33 43 -13
7744 -13 -46 -28 -61 -11 -53 31 35 29 64 39 -10 -80 34 17 -84 -2 32 26 -94 -61 25 66 39 5 132 64 -66 51 63
7773 63 49 21 74 10 -46 -56 2 -51 -13 47 -104 -20 -38 -37 30 -169 22 -57 -11 54 -13 -1 -59 -72 -20 -79 32 -31 -53
7802 -53 68 -47 -2 72 86 29 -62 -60 75 83 32 136 64 31 13 -15 -6 -1 -7 51 -43 22 -87 -34 -36 -28 46 -33 -15 72 -87
7833 -87 -14 -17 -56 -117 -9 18 -48 -111 29 -31 20 -65 -105 -62 68 23 34 -46 86 -54 65 -2 -33 23 62 -29 34 22
7861 22 -88 11 -92 5 -5 77 32 54 42 87 100 -80 29 -44 5 51 7 -63 -76 64 -24 -72 -32 1 -45 -66 -19 -106
7889 -106 -109 -42 22 88 150 44 -67 10 -1 -51 -9 -6 -34 127 31 3 -53 -1 -103 -178 8 36 -9 -48 -102 -9 -31 -51
7917 -51 73 -113 -94 -3 -80 49 -7 7 2 -11 -10 -44 103 58 -102 -34 12 28 16 -19 -12 25 -18 -10 -27 17 4 -63 -43 -38
7947 -38 -37 4 62 110 73 -87 14 -23 -56 53 -18 9 -12 -53 -38 -30 -79 -71 67 63 49 -20 -13 0 -58 -25 -151 29 39 63
7977 63 -75 5 -74 -6 19 48 -7 91 50 -19 13 -103 97 -13 -33 52 112 6 12 27 -66 -139 -2 19 -51 -77 95
8004 95 -80 -74 -136 -33 30 84 32 107 -80 -2 166 55 -43 120 50 43 -50 69 8 37 -11 70 -33 19 -9 -50 -62
8031 -62 26 -7 -30 124 -73 -31 109 48 3 -46 -9 17 8 -116 -3 60 -84 11 -6 -31 45 -16 58 -55 -157 -17
8057 -17 37 -69 8 57 14 79 -20 17 36 -38 -27 26 55 28 -20 10 10 -13 -16 28 -158 -30 -13 -126 -80 100 -33 -93
8085 -93 121 84 46 -126 130 -183 -235 87 29 7 -19 -93 -39 -45 -179 1 30 22 34 -6 64 -16 8 -72 11 -20 37 39
8113 39 110 121 -64 -9 -77 93 86 -45 -39 18 -38 -40 -141 -29 34 -35 -137 -80 -10 57 32 26 -38 -82 18 3 74 -30
8141 -30 -83 -24 -11 -78 59 11 -41 -100 98 58 30 -106 11 51 17 60 45 47 -45 79 15 63 -31 27 2 -49 -148 -71
8169 -71 -66 34 33 25 43 -4 10 39 -58 -11 -59 129 29 -6 90 50 -41 12 -101 17 -17 41
8191D1
##END NTUPLES=NMR FID
##END=
