##TITLE=1H_DE-80H_X3
 200.13MHz, d2o
 8 sc
 
 19ns.26.2.2025
##JCAMPDX= 6.0         $$ Bruker NMR JCAMP-DX V2.0
##DATA TYPE= NMR FID
##DATA CLASS= NTUPLES
##ORIGIN= UXNMR, Bruker Analytische Messtechnik GmbH
##OWNER= pz
$$ XWIN-NMR		Version 3.5
$$ Mon Oct 20 10:32:43 2025 Russian Standard Time (UT+4h)  Yarkov@DPX200
##.OBSERVE FREQUENCY= 200.1313
##.OBSERVE NUCLEUS= ^1H
##.DELAY= (6, 6)
##.ACQUISITION MODE= SIMULTANEOUS
##.ACQUISITION SCHEME= undefined
##.AVERAGES= 8
##.DIGITISER RES= 18
##SPECTROMETER/DATA SYSTEM= spect
##.PULSE SEQUENCE= zg30
##.SOLVENT NAME= CDCl3
##.SHIFT REFERENCE= (INTERNAL, CDCl3, 0, 14.3821)
##AUDIT TRAIL= $$ (NUMBER, WHEN, WHO, WHERE, WHAT)
$$ ##TITLE= Audit trail, XWIN-NMR		Version 3.5
$$ ##JCAMPDX= 5.01
$$ ##ORIGIN= Bruker BioSpin GmbH
$$ ##OWNER= Yarkov
$$ C:/Bruker/XWIN-NMR/data/yarkov2/nmr/H-C/1/audita.txt
$$ ##AUDIT TRAIL=  $$ (NUMBER, WHEN, WHO, WHERE, WHAT)
(   1,<2025-10-20 10:31:37.79 +0400>,<Yarkov>,<DPX200>,
      <created by zg, POWCHK disabled, PULCHK disabled
       configuration hash MD5:
       00 E9 B6 7A A2 85 ED C7 34 08 36 98 17 FE 4E 26
       data hash MD5: 16K
       AC 4A A0 98 C9 A9 DC CC 13 EA 1F 34 75 9C 4C 78>)
$$ ##END=
$$ 
$$ hash MD5
$$ 35 E8 F8 DC AE 69 8A 88 27 69 FB AF 3B 49 CA 3C
##$RELAX= 
##$RELAX= 
##$RELAX= 
##$RELAX= 
##$RELAX= 
##$RELAX= 
$$ Bruker specific parameters
$$ --------------------------
##$DU= <C:/Bruker/XWIN-NMR>
##$EXPNO= 1
##$NAME= <H-C>
##$PROCNO= 1
##$TYPE= <nmr>
##$USER= <yarkov2>
##$AMP= (0..31)
100 100 100 100 100 100 100 100 100 100 100 100 100 100 100 100 100 100 
100 100 100 100 100 100 100 100 100 100 100 100 100 100 
##$AQSEQ= 0
##$AQ_mod= 1
##$AUNM= <au_zg>
##$AUTOPOS= <>
##$BF1= 200.13
##$BF2= 200.13
##$BF3= 200.13
##$BF4= 200.13
##$BF5= 200.13
##$BF6= 200.13
##$BF7= 200.13
##$BF8= 200.13
##$BYTORDA= 1
##$CFDGTYP= 0
##$CFRGTYP= 5
##$CHEMSTR= <none>
##$CNST= (0..31)
1 1 145 1 1 1 1 1 1 1 1 1 1 1 1 1 1 1 1 1 1 1 1 1 1 1 1 1 1 1 1 1 
##$CPDPRG= <>
##$CPDPRG1= <>
##$CPDPRG2= <>
##$CPDPRG3= <>
##$CPDPRG4= <mlev>
##$CPDPRG5= <mlev>
##$CPDPRG6= <mlev>
##$CPDPRG7= <mlev>
##$CPDPRG8= <mlev>
##$CPDPRGB= <>
##$CPDPRGT= <>
##$D= (0..31)
0 0.7 0 0 0 0 0 0 0 0 0 0.03 0 0 0 0 0 0 0 0 0 0 0 0 0 0 0 0 0 0 0 0 
##$DATE= 1760941897
##$DBL= (0..7)
120 120 120 120 120 120 120 120 
##$DBP= (0..7)
150 150 150 150 150 150 150 150 
##$DBP07= 0
##$DBPNAM0= <>
##$DBPNAM1= <>
##$DBPNAM2= <>
##$DBPNAM3= <>
##$DBPNAM4= <>
##$DBPNAM5= <>
##$DBPNAM6= <>
##$DBPNAM7= <>
##$DBPOAL= (0..7)
0.5 0.5 0.5 0.5 0.5 0.5 0.5 0.5 
##$DBPOFFS= (0..7)
0 0 0 0 0 0 0 0 
##$DE= 6
##$DECBNUC= <off>
##$DECIM= 32
##$DECNUC= <off>
##$DECSTAT= 4
##$DIGMOD= 1
##$DIGTYP= 9
##$DL= (0..7)
0 120 120 120 120 120 120 120 
##$DP= (0..7)
150 150 150 150 150 150 150 150 
##$DP07= 0
##$DPNAME0= <>
##$DPNAME1= <>
##$DPNAME2= <>
##$DPNAME3= <>
##$DPNAME4= <>
##$DPNAME5= <>
##$DPNAME6= <>
##$DPNAME7= <>
##$DPOAL= (0..7)
0.5 0.5 0.5 0.5 0.5 0.5 0.5 0.5 
##$DPOFFS= (0..7)
0 0 0 0 0 0 0 0 
##$DQDMODE= 0
##$DR= 18
##$DS= 0
$$ [...]
##$SUBNAM2= <"">
##$SUBNAM3= <"">
##$SUBNAM4= <"">
##$SUBNAM5= <"">
##$SUBNAM6= <"">
##$SUBNAM7= <"">
##$SUBNAM8= <"">
##$SUBNAM9= <"">
##$SW= 18.0517328524113
##$SWIBOX= (0..15)
0 0 2 0 0 0 0 0 0 0 0 0 0 0 0 0 
##$SW_h= 3612.71676300578
##$TD= 16384
##$TD0= 1
##$TE= 0
##$TE2= 300
##$TE3= 300
##$TEG= 300
##$TL= (0..7)
0 120 120 120 120 120 120 120 
##$TP= (0..7)
150 150 150 150 150 150 150 150 
##$TP07= 0
##$TPNAME0= <>
##$TPNAME1= <>
##$TPNAME2= <>
##$TPNAME3= <>
##$TPNAME4= <>
##$TPNAME5= <>
##$TPNAME6= <>
##$TPNAME7= <>
##$TPOAL= (0..7)
0.5 0.5 0.5 0.5 0.5 0.5 0.5 0.5 
##$TPOFFS= (0..7)
0 0 0 0 0 0 0 0 
##$TUNHIN= 0
##$TUNHOUT= 0
##$TUNXOUT= 0
##$USERA1= <user>
##$USERA2= <user>
##$USERA3= <user>
##$USERA4= <user>
##$USERA5= <user>
##$V9= 5
##$VALIST= <valist>
##$VCLIST= <CCCCCCCCCCCCCCC>
##$VD= 0
##$VDLIST= <DDDDDDDDDDDDDDD>
##$VPLIST= <PPPPPPPPPPPPPPP>
##$VTLIST= <TTTTTTTTTTTTTTT>
##$WBST= 1024
##$WBSW= 4
##$XGAIN= (0..3)
0 0 0 0 
##$XL= 0
##$YL= 0
##$YMAX_a= 106261
##$YMIN_a= -127106
##$ZGOPTNS= <>
##$ZL1= 120
##$ZL2= 120
##$ZL3= 120
##$ZL4= 120
##$ABSF1= 10
##$ABSF2= 0
##$ABSG= 5
##$ABSL= 3
##$ALPHA= 0
##$AQORDER= 0
##$ASSFAC= 0
##$ASSFACI= 0
##$ASSFACX= 0
##$ASSWID= 0
##$AUNMP= <proc_1d>
##$AZFE= 0.1
##$AZFW= 0.1
##$BCFW= 1
##$BC_mod= 2
##$BYTORDP= 1
##$COROFFS= 0
##$CY= 83.5205535888672
##$DATMOD= 1
##$DC= 2
##$DFILT= <>
##$DTYPP= 0
##$F1P= 10.8118882576601
##$F2P= -7.23987719738617
##$FCOR= 0.5
##$FTSIZE= 0
##$FT_mod= 4
##$GAMMA= 1
##$GB= 0.15
##$INTBC= 1
##$INTSCL= 1
##$ISEN= 128
##$LB= 0.25
##$LEV0= 0
##$LPBIN= 0
##$MAXI= 10000
##$MC2= 0
##$MEAN= 0
##$ME_mod= 0
##$MI= 1.114404
##$NCOEF= 0
##$NC_proc= 0
##$NLEV= 6
##$NOISF1= 3.799351
##$NOISF2= 2.8
##$NSP= 1
##$NTH_PI= 0
##$NZP= 0
##$OFFSET= 14.38212
##$PC= 1
##$PHC0= -4079.816
##$PHC1= 14.22191
##$PH_mod= 1
##$PKNL= yes
##$PPARMOD= 0
##$PSCAL= 0
##$PSIGN= 0
##$REVERSE= no
##$SF= 200.129724274929
##$SI= 16384
##$SIGF1= 3
##$SIGF2= 2
##$SINO= 400
##$SIOLD= 16384
##$SREGLST= <1H.CDCl3>
##$SSB= 0
##$STSI= 0
##$STSR= 0
##$SW_p= 3205.1282051282
##$SYMM= 0
##$S_DEV= 0
##$TDeff= 0
##$TDoff= 0
##$TI= <>
##$TILT= no
##$TM1= 0
##$TM2= 0
##$TOPLEV= 0
##$USERP1= <user>
##$USERP2= <user>
##$USERP3= <user>
##$USERP4= <user>
##$USERP5= <user>
##$WDW= 1
##$XDIM= 8192
##$YMAX_p= 0
##$YMIN_p= 0
$$ End of Bruker specific parameters
$$ ---------------------------------
##NTUPLES= NMR FID
##VAR_NAME=  TIME,          FID/REAL,        FID/IMAG
##SYMBOL=    X,             R,               I
##VAR_TYPE=  INDEPENDENT,   DEPENDENT,       DEPENDENT
##VAR_FORM=  AFFN,          ASDF,            ASDF
##VAR_DIM=   8192,          8192,            8192
##UNITS=     SECONDS,       ARBITRARY UNITS, ARBITRARY UNITS
##FACTOR=    0.0002768,     1,               1
##FIRST=     0,             0,               0
##LAST=      2.2672688,     0,               0
##MIN=       0,             -127106,         0
##MAX=       2.2672688,     106261,          0
$$ Real data points
##PAGE= N=1
##DATA TABLE= (X++(R..R)), XYDATA
$$ [...]
$$ plain form
1403 -483 -295 297 -385 -527 555 214 -816 -487 753 351 -427 125 435 -362 -24 982 163 -974
1421 -974 77 960 -95 -646 441 -111 -589 308 696 -506 -1026 660 676 -395 -217 477 -260 -528
1439 -528 1038 559 -877 -553 1115 394 -703 164 213 -937 -100 1102 -250 -1528 92 887 -149
1456 -149 -620 521 -203 -623 726 1198 -932 -1009 1047 916 -588 -220 564 -693 -255 1053 299 -1740
1474 -1740 -356 1300 137 -783 227 284 -762 465 1519 -521 -1435 602 1368 -302 -573 533
1490 533 -348 -870 1088 794 -1442 -1065 1282 827 -874 -214 360 -776 -254 1453 98 -1618 -285
1507 -285 1437 96 -752 233 135 -869 562 1366 -960 -1481 768 1054 -800 -531 465 -494 -552 1224
1525 1224 879 -1686 -879 1609 802 -769 115 429 -834 146 1454 -310 -1858 -30 1484 -403
$$ packed form
1403d83J88N92o82j42J082l41j030L29J240m02p78N52L10p97L38J006q19j137
1421i74J051Q83j055n51J087n52m78Q97L88j202n20J686J6j071J78O94p37k68
1439e28J566m79j436L24J668p21j097Q67M9j150Q37J202j352j278J620P95j036
1456a49m71J141p24m20J349M72k130p7K056j31j504L68P84j257M38J308p54k039
1474a740J384J656j163r20J010N7j046J227J054k040r14K037P66j670k71J106
1490E33q81n22J958k94k236L77K347m55j701O60N74j136N22J707j355j716J333
1507b85J722j341q48R85r8j004J431Q04k326n21K249K86j854K69R96r59n8J776
1525A224l45k565Q07K488q07j571Q84L14j263R80J308j764j548J828J514j887
$$ plain form
1541 -403 -984 232 -230 -767 827 1123 -1266 -1373 1021 996 -545 -423 424 -367 -289 1319 298 -1459
1559 -1459 -602 1498 377 -756 -100 307 -683 266 1339 -661 -1539 566 1318 -233 -575 401 -255
1576 -255 -485 909 725 -1237 -1069 1079 605 -1082 -214 217 -478 -261 1110 157 -1525 -163 1470
1593 1470 58 -844 231 154 -494 414 1061 -694 -1260 572 888 -665 -607 307 -119 -399 679 584 -983
1612 -983 -670 982 477 -826 -90 373 -226 84 817 -49 -1161 145 1239 -62 -680 46 198 -327
1630 -327 376 721 -542 -831 638 660 -679 -174 443 -59 -240 856 335 -769 -270 913 184 -535
1648 -535 -77 327 -344 -76 460 -259 -880 158 747 -95 -375 288 120 -378 300 492 -486 -520 467 263
1668 263 -527 -62 219 -275 -64 407 197 -674 -67 521 -26 -389 72 124 -306 55 525 -117 -187 342 401
$$ packed form
1541d03n81J216m62n37J594K96k389j07K394k5j541J22Q47p91P8J608j021j757
1559a459Q57K100j121j133O56M07r90R49J073k000q78K105P52j551l42R76o56
1576b55k30J394j84j962J68K148m74j687Q68M31o95K17J371r53j682J362J633
1593A470j412r02J075p7o48R08O47j755n66J832L16j553N8R14m26k80J078r5j567
1612i83L13J652n05j303P36M63n99L10P33q66j112J306J094j301o18P26J52n25
1630c27P03L45j263k89J469K2j339N05O17n02j81J096n21j104M99J183p29p19
1648e35M58M04o71K68N36p19o21J038N89q42k80O63j68m98O78J92r78l4R87k04
1668B63p90M65K81m94K11M71k10q71O07N88n47l63M61N2m30L61M70o42p0N29N9
$$ plain form
1689 401 -247 -38 104 77 -291 214 136 -477 -335 272 23 -277 -66 77 -41 -50 184 128 -242 155 515 -39
1711 -39 -163 41 245 -157 69 323 -115 -208 -3 103 -249 -153 37 68 -216 224 144 -238 22 225 -15 -51
1733 -51 10 162 -120 -39 47 24 -162 -71 9 -325 16 -95 -67 -217 50 -48 -144 38 144 87 163 151 136 -33 -223
1758 -223 9 -20 -209 -96 90 -62 -155 69 186 -32 32 148 -41 1 84 83 -135 -94 109 236 -65 60 -58
1781 -58 -72 -264 -40 -56 -118 -130 20 58 71 92 65 -5 -24 152 72 0 -83 122 -39 -84 107 -36 -103 63 31 -27
1807 -27 72 172 -60 -140 13 88 -89 -16 198 293 -78 62 86 -14 7 96 -244 24 -6 149 -158 -142 -18 212
1831 212 -3 -44 -2 -114 -159 77 -1 -58 -15 241 167 -40 175 -34 10 -32 112 -148 -99 -39 204 -346 -121 138
1855 138 -43 -269 34 219 -56 -41 93 112 -243 -5 91 29 -167 -12 -89 -239 -6 31 -158 -213 -7 171
$$ packed form
1689D01o48K09J42k7l68N05p8o13J42O07k49l00K11J43j18rK34n6l70L97L60n54
1711c9j24K04K04m02K26K54m38r3K05J06l52R6J90L1k84M40q0l82K60K03k40l6
1733e1O1J52k82Q1Q6k3j86R1Q0l34L41j11K8j50K67r8r6J82J06n7P6j2j5j69j90
1758b23K32k9j89J13J86j52r3K24J17k18O4J16j89M2Q3jk18M1K03J27l01J25j18
1781e8j4j92K24j6o2j2J50L8J3K1k7p0j9J76q0p2q3K05j61m5J91j43o7J66l2n8
1807b7R9J00k32q0J53P5j77P3K14R5l71J40K4j00K1Q9l40K68l0J55l07J6J24K30
1831B12k15m1M2j12m5K36p8n7M3K56p4k07K15k09M4m2J44k60M9O0K43n50K25K59
1855A38j81k26L03J85k75J5J34J9l55K38R6o2j96J55p7j50K33L7j89n5K06J78
$$ plain form
1877 171 -192 -62 178 -84 -162 64 98 -242 -109 84 107 -260 4 9 -90 -34 459 -108 -281 -13 236 -211
1899 -211 -164 226 -140 -93 130 307 -242 -137 77 99 -232 231 92 44 -7 142 158 -298 -107 287 39 -101
1921 -101 114 -189 -201 82 361 -209 -318 219 341 -134 -124 204 -75 -219 416 260 -162 -232 252 50 -290
1942 -290 -170 271 -65 -244 231 139 -479 73 354 87 -173 237 -3 -302 124 334 -252 -462 185 240 -253
1963 -253 -114 110 -175 -181 365 259 -413 -143 361 326 -398 -28 234 -48 38 442 -145 -606 148 449 -43
1984 -43 -447 5 -28 -397 296 227 -188 -364 174 428 -206 -96 66 -198 -92 527 123 -607 -182 494 189
2005 189 -439 -31 31 -231 45 324 -214 -427 31 434 -32 -150 153 90 -147 389 252 -465 -305 365 344
2026 344 -258 -50 199 -200 84 414 41 -482 -25 539 286 -353 -117 81 -200 251 362 -145 -408 354
$$ packed form
1877A71l63J30K40k62p8K26L4l40J33J93K3l67K64Nr9N6M93n67j73K68K49m47
1899b11M7L90l66M7K23J77n49J05K14K2l31M63j39m8n1J49J6m56J91L94k48j40
1921a01K15l03j2K83K79n70j09N37J22m75J0L28k79j44O35j56m22p0M84k02l40
1942b90J20M41l36j79M75r2o18N52K81k67k60M10k40k99M26K10n86k10O47N5m93
1963b53J39K24k85oN46j06o72K70N04l5p24L70K62k82Q6M04n87m61P54L01m92
1984d3m04M52l3l69O93o9m15j76N38K54o34J10J62k64J06O19m04p30M25O76l05
2005A89o28M08O2k62K76K79n38k13M58M03m66j18L03o3k37N36j37p17J60O70k1
2026C44o02K08K49l99K84L30l73n23M57N64k53o39K36J98k81M51J11n07k63P62
$$ plain form
2046 354 415 -161 -228 42 -125 -132 303 227 -554 -186 324 114 -194 -100 104 -65 122 183 -18 -456 44 339
2068 339 -17 -299 41 87 -78 54 215 -405 -404 289 164 -298 -135 172 0 -313 273 6 -347 -85 410
2089 410 292 -494 -19 52 -125 89 205 -254 -487 119 313 -241 -332 34 -95 -131 -2 317 -280 -63 342
2110 342 162 -331 -170 -32 -37 60 289 29 -353 -14 410 -127 -278 -100 60 -98 -9 162 -246 -215 165 278
2132 278 92 -201 83 -26 -83 23 -56 -318 -135 138 -63 -203 122 -16 12 -26 182 110 -115 168 114 -75
2154 -75 -43 -134 155 1 117 42 -142 -228 55 174 -92 102 140 -112 -117 3 7 -67 -103 207 -28 -78 55 -1 260
2179 260 24 196 78 -303 21 150 -144 -149 88 121 -52 158 165 -90 52 49 118 -144 -147 36 -34 -85 -94 58 -203
2204 -203 -56 -66 -16 -36 46 80 -154 -35 205 -156 -51 12 13 -55 145 -40 12 -23 -178 18 -133 15 -69 -32
$$ packed form
2046C54O1n76o7K70j67pM35p6p81L68N10k10l08R4K04j69J87O1k01m38N00K95
2068C39l56k82L40M6j65J32J61o20JO93j25m62J63L07j72l13N86k67l53K62M95
2089D10j18p86M75P1j77K14J16m59k33O06J94n54r1L66j29l6J29L19n97K17M05
2110C42j80m93J61J38nR7K29k60l82L39M24n37j51J78J60j58Q9J71m08L1L80J13
2132B78j86k93K84j09n7J06p9k62J83K73k01j40L25j38K8l8K08p2k25K83n4j89
2154g5L2r1K89j54J16p5j84q6K83J19k66J94L8k52nJ20Mp4l6L10k35n0J33n6K61
2179B60k36J72j18l81L24J29k94nK37L3j73K10Pk55J42lO9k62lJ83p0n1rJ52k61
2204b03J47j0N0k0Q2L4k34J19K40l61J05O3Jo8K00j85N2l5j55J96j51J48q4L7
$$ plain form
2228 -32 -27 -43 93 23 -27 -22 -35 -16 -84 89 -19 -52 142 -45 54 -55 -48 -64 -3 -118 -3 6 -11 -10 -103 -118 96 113
2256 113 -62 60 -65 -35 -2 63 25 -74 -108 25 168 -139 141 52 102 -156 118 -39 -139 -20 11 -46 87
2279 87 -20 -128 -60 1 -109 96 -7 38 31 105 -90 96 51 -38 170 -70 -31 -231 -82 -176 -120 -83 -122 -33 -23
2304 -23 29 44 -113 56 22 32 17 -13 138 15 -6 77 64 55 189 -110 -23 99 105 16 7 21 14 51 -89 -5 213 -96
2332 -96 -30 39 0 -124 66 -71 85 -70 91 -76 46 89 154 216 -5 -36 39 200 64 229 150 -44 180
2355 180 -20 135 -7 -19 63 -108 -85 -95 -89 -83 30 -91 -3 -36 -151 22 -44 -120 -87 38 119 25 -35 -97 66 -94
2381 -94 -12 30 9 -138 66 -102 -280 90 24 115 95 -72 -9 21 -145 -49 -167 21 159 0 -46 48 -76 62
2405 62 -74 -59 56 125 40 -66 6 107 -100 10 -69 60 -17 188 -3 -44 37 -34 -75 2 117 8 -52 92
$$ packed form
2228c2Nj6J36p0n0Nj3J9o8J73j08l3J94j87R9j09Pj6O1j15J15Rj7Jr3j5K14J7
2256A13j75J22j25L0L3O5l8r9l4J33J43l07K80q9N0k58K74j57j00J19L1n7J33
2279H7j07j08O8O1j10K05j03M5pP4j95J86m5q9K08k40L9k00J49r4N6L7l9Q9J0
2304b3N2J5j57J69l4J0j5l0J51j23k1Q3j3rJ34k99Q7J22Oq9rJ4pL7j40Q4K18l09
2332i6O6O9l9j24J90j37J56j55J61j67J22M3O5O2k21l1P5J61j36J65p9j94K24
2355A80k00J55j42j2Q2j71K3j0OOJ13j21Q8l3j15J73o6p6L3J25Q1r4o0o2J63j60
2381i4Q2M2k1j47K04j68j78L70o6R1k0j67O3L0j66R6j18J88J38j59m6R4j24J38
2405F2j36J5J15O9q5j06P2J01k07J10p9J29p7K05j91m1Q1p1m1P7J15j09o0J44
$$ plain form
2429 92 -40 -63 63 117 -75 -72 118 39 -8 54 -4 63 4 122 78 -87 112 56 38 -68 91 -63 -154 24 -85
2454 -85 -23 -287 -98 171 -39 -106 -40 -138 118 64 -138 -122 -126 7 271 -120 -102 -81 -34 141 112 -45 -199 59
2478 59 118 -139 -286 121 2 -41 -82 72 -138 15 266 45 13 -27 -122 78 -115 89 -59 -156 -131 54 128
2501 128 -135 -4 121 25 -113 165 -62 -131 -84 99 -23 -104 73 -180 -49 29 114 -93 27 13 231 12
2523 12 -148 40 -38 108 125 13 -59 114 231 -17 -139 70 86 -81 -2 132 -241 -177 187 144 41 -70 73
2546 73 141 46 74 45 -285 -16 -72 42 -142 -5 8 -131 5 126 80 -60 97 62 49 -99 96 55 -58 56
2570 56 186 52 -16 -24 52 41 40 -135 -19 -86 5 21 -125 25 131 40 -56 -152 58 -77 111 117 -199 -295 -28 60
2596 60 -133 4 43 -54 -73 342 -51 31 -179 -21 51 90 155 -70 192 -9 -115 -162 -45 -203 -33 24 -25 156
$$ packed form
2429I2j32k3J26N4j92LJ90p9m7O2n8O7n9J18m4j65J99n6j8j06J59j54r1J78j09
2454h5O2k64J89K69k10o7O6r8K56n4k02J6mJ33K64l91J8K1M7J75k9j57j54K58
2478E9N9k57j47M07j19m3m1J54k10J53K51k21l2m0r5K00j93K04j48r7K5J85P4
2501A28k63J31J25r6j38K78k27o9M7J83j22q1J77k53J31P8Q5k07J20j4K18k19
2523A2j60J88p8J46J7j12p2J73J17k48j22K09J6j67P9J34l73O4L64m3j03j11J43
2546G3O8r5K8k9l30K69n6J14j84J37J3j39J36J21m6j40J57l5j3j48J95m1j13J14
2570E6J30j34o8qP6j1jj75J16o7R1J6j46J50J06r1r6r6K10j35J88Ol16r6K67Q8
2596F0j93J37L9r7j9M15l93Q2k10J58P2L9O5k25K62k01j06m7J17j58J70N7m9J81
$$ plain form
2620 156 -34 49 125 83 -73 -46 142 63 130 40 166 3 -94 72 -11 -15 -39 81 55 -23 -71 -50 -30 -31 -17 -92 -75
2647 -75 -20 -12 -40 2 -29 85 -16 193 62 -129 -41 -126 116 126 23 55 -2 -24 40 24 180 -112 50 94 61 -31
2673 -31 52 20 72 -118 -86 -16 -141 -11 35 -141 88 77 -106 -33 -17 71 -153 44 16 -67 114 76 44 -186 -45
2698 -45 231 11 -58 -100 202 66 -122 -13 -132 -135 40 -150 176 47 59 -102 -21 -135 12 -68 -31 16 148
2721 148 -153 10 124 -9 -32 94 -36 -72 167 73 -138 177 -55 -157 87 -83 -108 34 -36 127 -57 168
2743 168 11 -113 22 -11 78 38 123 38 -22 74 -10 -42 38 -9 -98 -92 350 14 4 35 68 1 11 -89 -77 -10 -75
2770 -75 -32 37 22 -143 -114 -126 72 130 -10 93 70 -76 -138 144 34 -120 101 -84 103 2 -160 27 64
2793 64 32 3 -82 31 -184 -122 -32 -95 36 -42 -56 -47 -27 -59 90 25 -102 44 94 -147 -27 -69 0 -125 163 28
$$ packed form
2620A56j90Q3P6m2j56K7J88p9O7r0J26j63r7J66q3mk4J20k6p8m8K1K0jJ4p5J7
2647g5N5Qk8M2l1J14j01K09j31j91Q8q5K42J0j03L2n7k2O4j6J56k92J62M4l3r2
2673c1Q3l2N2j90L2P0j25J30M6j76K29j1j83P3J6Q8k24J97k8q3J81l8l2k30J41
2698d5K76k20o9m2L02j36j88J09j19lJ75j90L26j29J2j61Q1j14J47q0L7M7J32
2721A48l01J63J14j33k3J26j30l6K39r4k11L15k32j02K44j70k5J42p0J63j84K25
2743A68j57j24J35l3Q9m0Q5q5o0R6q4l2Q0m7q9OM42l36j0L1L3o7J0j00J2O7o5
2770g5M3O9j5j65K9j2J98N8j40J03k3j46o2K82j10j54K21j85J87j01j62J87L7
2793F4l2k9q5J13k15O2R0o3J31p8j4RK0l2J49o5j27J46N0k41J20m2O9j25K88j35
$$ plain form
2819 28 -78 78 123 19 -72 16 79 14 181 13 -4 -161 -79 18 21 -31 -119 -45 -133 -157 -1 53 132 74 61 18 101
2846 101 -105 -22 -21 -23 180 1 -116 -19 23 -1 89 -107 48 134 124 -67 -95 -54 123 102 3 -87 57 -40 84 -65
2872 -65 -22 1 -60 108 -108 -61 -1 58 -47 -64 -15 -3 -159 152 -222 -59 -160 64 -94 -57 -51 105 -193 -17
2896 -17 70 110 76 106 -66 -145 -203 2 -29 37 140 45 -19 -57 183 -121 67 18 18 4 -32 70 -145 -78 -53 107
2922 107 -11 -288 124 56 -49 -62 14 -57 -28 33 -57 91 -58 36 10 -49 77 -8 -33 13 138 14 -6 -3 -113
2947 -113 46 104 -91 -194 31 19 15 47 120 54 124 -13 87 16 -52 -30 96 151 -105 60 40 68 -50 -7 -142
2972 -142 -97 -183 -60 86 165 115 23 8 -27 -70 -16 -105 -7 24 -4 -23 -10 -104 -95 135 139 -122 16 89 246 114 -31
2999 -31 110 42 28 14 -26 -117 35 106 125 1 -70 99 110 114 47 -85 -195 -10 -21 -169 -16 46 25 72 140 24
$$ packed form
2819B8j06J56M5j04r1Q8O3o5J67j68j7j57Q2R7Ln2q8P4q8k4J56N4P9n8j3m3Q3
2846A01k06Q3JkK03j79j17R7M2k4R0j96J55Q6j0j91k8M1J77k1r9r0J44r7J24j49
2872f5M3K3o1J68k16M7O0N9j05j7M9J2j56L11l74J63j01K24j58L7OJ56k98J76
2896a7Q7M0l4L0j72p9n8K05l1O6J03r5o4l8K40l04J88m9%j4l6J02k15O7K5J60
2922A07j18k77M12o8j05j3P6p1K9O1r0J48j49R4k6n9J26q5k5M6J25j24k0Lj10
2947a13J59N8j95j03K25j2mL2P3o6P0j37J00p1o8K2J26N5k56J65k0K8j18M3j35
2972a42M5q6J23J46P9n0r2j5l5m3N4q9R8L1k8j9J3r4RK30Mk61J38P3J57j32j45
2999c1J41o8j4j4m0r1J52P1J9j24p1J69J1Mo7j32j10J85j1j48J53O2k1M7O8j16
$$ plain form
3025 24 133 -33 -12 -142 -78 -10 -114 -59 -17 78 -18 -109 -54 65 -54 -51 -98 98 -26 -67 33 5 -63 -72 215 77
3051 77 44 -15 31 -66 81 -127 3 67 50 -51 0 -4 -21 125 126 77 -110 -99 188 38 -87 135 -34 6 -184
3076 -184 116 165 -122 -82 -94 75 -13 -73 107 -45 -168 -2 55 -7 -79 87 -29 12 82 -48 -94 -97 40 -187
3100 -187 -79 223 -75 -110 -18 34 2 -8 54 -42 -25 -23 -16 47 20 -198 -191 63 51 77 128 -113 -158 28 -112 162 -69
3127 -69 66 -20 -28 124 -8 8 166 26 -135 -82 -88 65 -62 -21 74 -136 -70 32 80 -30 -6 -186 -104 -131 -89
3152 -89 -152 277 85 18 18 -52 195 75 -95 13 -2 -46 121 25 -99 7 38 -9 -10 -49 104 -31 75 -131 -212
3177 -212 36 59 158 -7 198 19 235 -128 9 -13 109 47 17 212 -55 -57 -47 136 -114 -92 24 -85 120
3200 120 -113 -44 49 -82 -116 -17 118 43 72 79 -87 -2 -88 -53 -90 70 110 -74 123 -128 73 24 148 -23 -136
$$ packed form
3025B4J09j66K1j30O4O8j04N5M2R5r6r1N5J19j19Lm7J96j24m1J00k8o8rK87j38
3051G7l3n9M6r7J47k08J30O4j7j01N1mj7J46Jm9j87J1K87j50j25K22j69M0j90
3076a84L00M9k87M0j2J69q8o0J80j52j23J66N7o2p2J66j16M1P0j30m6lJ37k27
3100a87J08L02k98l5R2N2l2j0O2r6J7KPO3k7k18PK54j2K6N1k41m5J86j40K74k31
3127f9J35q6qJ52j32J6J58j40j61N3oJ53j27M1R5k10O6J02M8j10K4j80Q2k7M2
3152h9o3M29j92o7%p0K47j20j70J08j5m4J67r6j24J06L1m7jl9J53j35J06k06q1
3177b12K48K3R9j65K05j79K16l63J37k2J22o2l0J95k67kJ0J83k50K2J16j09K05
3200A20k33O9R3j31l4R9J35p5K9Pj66Q5q6L5l7J60M0j84J97k51K01m9J24j71j13
$$ plain form
3225 -136 -98 -246 -48 -15 222 2 -25 -55 -17 -16 -31 -2 -20 -90 146 49 12 -99 -194 4 -12 -21 -193 -8 138 24
3251 24 -80 -69 -83 -6 44 100 149 -130 50 -221 -13 -10 17 -15 -126 -127 -57 4 10 30 47 136 -103 -81 -210 -2 -17
3278 -17 -54 -11 2 -1 3 -1 45 3 25 7 51 -18 72 234 -21 151 77 27 88 38 16 29 -30 -101 22 -28 -20 -122 -99 103
3308 103 -25 20 11 -78 63 -79 -58 -186 -15 -76 51 33 137 -69 -76 -57 -124 56 93 -41 113 10 22 76 172
3333 172 -63 -25 5 -74 31 -8 -17 -98 62 -19 -1 -149 -55 -73 -110 -24 -38 17 -131 29 9 92 -11 -64 -123 -19
3359 -19 -55 31 23 -78 93 -110 107 -131 108 2 -32 -172 89 167 -28 106 170 29 8 46 -9 59 1 191
3383 191 44 48 44 5 29 51 12 -22 -31 75 -31 -39 -66 -61 -18 10 76 -4 82 63 124 35 95 145 -115 -58 65 -114 -79
3412 -79 -77 -32 148 -120 58 158 130 -7 27 -48 70 91 26 80 -64 0 13 4 56 118 49 74 34 -138 -114 44 58
$$ packed form
3225a36L8j48J98L3K37k20k7l0L8Jj5K9j8p0K36r7l7j11r5J98j6rj72J85J46j14
3251B4j04J1j4P7N0N6M9k79J80k71K08LK7l2j11jP0O1OK0J7Q9k39K2j29K08j5
3278a7l7M3J3lMmM6m2K2j8M4o9R0J62k55J72p4n0O1n0k2J3n9p1J23n0Qj02K3K02
3308A03j28M5rq9J41j42K1j28J71o1J27j8J04k06pJ9o7J80L7j34J54j03J2N4R6
3333A72k35L8L0p9J05l9rq1J60q1J8j48R4j8l7Q6j4N5j48J60k0Q3j03n3n9J04
3359a9l6Q6qj01J71k03K17k38K39j06l4j40K61P8j95J34O4j41k1L8n5O8n8J90
3383A91j47Mml9K4K2l9l4rJ06j06qk7NM3K8O6q0Q6j9O1q9O0N0k60N7J23j79L5
3412g9KM5J80k68J78J00k8j37L4p5J18K1o5N4j44O4J3rN2O2o9K5m0j72K4J58J4
$$ plain form
3439 58 -197 -218 -7 -19 -7 8 122 101 -49 59 -14 43 1 -34 159 30 84 66 26 9 -13 -226 -99 46 219
3464 219 24 182 18 10 -37 -22 -77 105 13 145 -20 -124 -106 -62 15 -77 -89 43 43 20 -43 -33 -82 -5 79 -178
3490 -178 -6 75 -21 92 45 83 -73 34 -43 79 -96 0 -25 -57 54 -38 127 -29 -64 117 -12 -127 -91 0
3514 0 -29 -106 -38 -206 -31 84 43 -83 -46 -89 -66 -218 6 -24 86 -57 -13 -181 -165 -61 -75 -49 -36 114 -59
3539 -59 15 -64 -100 -138 35 -96 160 8 99 153 114 1 90 -202 3 -2 15 119 -5 11 -51 43 -43 3 -22 100
3565 100 201 40 -101 -22 51 -86 51 23 83 -123 -4 66 -135 -173 -43 117 -92 89 95 -157 -87 -153 133
3588 133 147 -123 21 101 0 -72 -60 11 -9 -172 57 -52 -43 135 84 3 -152 153 47 -23 -71 -202 176 -46
3612 -46 -98 35 44 13 -66 -75 -125 38 -45 -163 -7 -73 55 -77 -11 7 54 51 17 35 -77 -57 56 -142 -52 -35 -47
$$ packed form
3439E8k55k1K11j2J2J5J14k1j50J08p3N7m2l5J93j29N4j8m0j7k2k13J27J45J73
3464B19j95J58j64qm7J5n5J82r2J32j65j04J8M4P7r2j2J32%k3o3J0m9P7Q4k57
3490a78J72Q1r6J13m7L8j56J07p7J22j75R6k5l2J11r2J65j56l5J81j29j15L6R1
3514@k9p7O8j68J75J15m1j26L7m3K3j52K24l0J10j43M4j68J6J04j4K6J3J50j73
3539e9P4p9l6l8J73j31K56j52R1N4l9j13Q9k92K05nJ7J04j24J6o2R4q6M6k5J22
3565A00J01j61j41P9P3j37J37k8O0k06J19P0k01l8J30J60k09J81Ok52P0o6K86
3588A33J4k70J44Q0j01p2J2P1k0j63K29j09RJ78n1q1j55L05j06p0m8j31L78k22
3612d6n2J33Rl1p9rn0J63q3j18J56o6J28j32O6J8M7ll4J8j12K0J13j98R0J7j2
$$ plain form
3639 -47 -50 83 -41 -109 -170 -48 -43 -60 -60 20 -16 -30 -15 -73 103 -124 13 -111 -80 124 82 -21 9 3 74 42 -49 -58
3667 -58 41 -83 -65 -98 -105 -160 -26 -76 -83 124 -72 -215 -171 -64 -37 -29 -31 70 -166 94 -10 -89 -123 -28 73 -114
3693 -114 63 46 8 -246 24 -67 -31 44 8 109 149 39 26 20 6 -6 82 -13 -139 155 -102 -76 3 -27 86 120
3719 120 163 114 -80 -52 46 75 -105 -12 -56 76 -143 -17 46 -32 99 40 -51 -46 123 59 -184 -93 89 21 263
3744 263 -102 -94 13 47 119 -61 -92 -48 65 -244 107 30 -58 15 -140 34 -131 132 62 -91 25 2 40 -55
3768 -55 -3 80 -100 -54 -83 -23 50 97 -59 102 121 -66 -58 -206 -59 -120 -25 -68 -81 -48 -186 -104 -188 -42 6 39 223
3795 223 -24 63 70 -43 -99 -47 -32 -114 -42 16 44 24 -23 -26 26 -59 -29 162 -54 58 -171 23 99 81 109 -34 -63
3822 -63 42 105 -16 78 -150 27 77 130 26 2 -70 -60 26 132 145 143 -31 -17 -183 -18 160 133 -91 19 108
$$ packed form
3639d7lJ33j24o8o1J22Nj7%Q0l6j4J5n8J76k27J37j24L1K04m2j03L0oP1l2r1r
3667e8R9j24J8l3pn5J34n0pK07j96j43M4J07K7QkJ01k36K60j04p9l4R5J01j87
3693a14J77j7l8k54K70r1L6P5l6J01M0j10j3oj4j2Q8r5j26K94k57K6P9l0J13L4
3719A20M3m9j94K8R8K9j80R3m4J32k19J26O3p8J31n9r1NJ69o4k43R1J82o8K42
3744B63l65QJ07L4P2j80l1M4J13l09L51p7q8P3j55J74j65K63p0j53J16k3L8r5
3768e5N2Q3j80M6k9O0P3M7j56J61J9j87Qj48J47o1R5m3j3L3j38Q2q4J46M8L3J84
3795B23k47Q7Pj13n6N2J5q2P2N8K8k0m7lN2q5L0J91k16J12k29J94P6j8K8j43k9
3822f3J05O3j21R4k28J77N0N3j04k4p2J0Q6J06J3kj74J4j66J65J78k7k24J10Q9
$$ plain form
3847 108 2 78 55 151 -122 -13 -21 -32 77 -31 -176 31 -74 -78 -6 -77 0 9 76 -73 -44 15 24 -9 -23 71 231
3874 231 -16 36 -72 -36 -88 -79 47 -88 -71 -58 68 22 179 112 126 -12 -101 -111 22 88 12 60 -100 -3 91 -189
3900 -189 -105 34 -36 28 131 -179 -45 -52 -5 -72 -15 -68 28 98 -217 -11 -81 -15 6 117 82 -45 -221 -30 84
3925 84 -135 -136 -221 -44 104 -18 80 -35 -18 -100 142 7 59 68 14 -102 83 -161 -17 114 -99 222 22 109
3949 109 -34 -91 121 17 57 47 1 60 -6 -170 35 98 -36 -129 95 115 -125 -17 18 57 60 -17 -38 -209 -54
3974 -54 -3 -37 -36 18 20 -91 -134 169 -113 -35 97 -28 38 -173 7 55 -43 49 99 -149 -59 17 -36 62 56 -60 123
4001 123 5 -14 -167 109 -19 -25 3 132 30 40 -37 -22 -173 -72 -58 163 32 8 131 180 -37 58 185 -123
4025 -123 -5 -119 -36 -47 -22 -79 30 22 89 29 84 -32 79 128 15 21 114 -133 -38 48 72 96 -30 34 -28 -80 -25
$$ packed form
3847A08j06P6k3R6k73J09qj1J09j08j45K07j05mP2p1P7RO7j49K9N9Rl3j4R4J60
3874B31k47N2j08L6n2RJ26j35J7J3J26m6J57o7J4j38q9j0J33O6p6M8j60R7R4k80
3900a89Q4J39p0O4J03l10J34pM7o7N7n3R6P0l15K06p0O6K1J11l5j27j76J91J14
3925H4k19jq5J77J48j22R8j15J7q2K42j35N2Rn4j16J85k44J44J31k13L21k00Q7
3949A09j43n7K12j04M0j0m6N9o6j64K05O3j34r3K24K0k40J08L5L9Lp7k1j71J55
3974e4N1l4JN4Kj11m3L03k82P8J32j25O6k11J80M8r8R2N0k48R0P6n3R8oj16J83
4001A23j18j9j53K76j28oK8J29j02J0p7J5j51J01J4K21j31k4J23M9k17R5J27l08
4025a23J18j14Q3j1K5n7J09qO7o0N5j16J11M9j13OR3k47R5Q6K4K4j26O4o2n2N5
$$ plain form
4052 -25 -159 -30 -12 5 32 -114 -17 -63 -12 -25 -28 108 62 54 -6 -88 -71 35 77 -5 -176 -40 12 -120 7 51 2
4079 2 -63 21 -153 55 33 -9 40 -88 -14 102 -56 8 78 24 111 -41 47 -1 -113 -38 -63 -1 101 65 -86 -70
4105 -70 115 -34 4 -32 -11 -8 -149 27 48 -105 -96 38 -84 51 -13 -62 86 66 -151 -95 139 2 -17 22 -26
4130 -26 114 -40 41 15 0 -141 55 73 29 104 117 -132 83 -38 42 -30 103 41 -78 18 -67 -7 -80 -54 -66 -23
4156 -23 265 15 109 -46 -94 -7 -98 -44 5 -43 25 110 142 116 76 50 41 -104 -24 88 45 -3 -63 172 -31 -36 38 -75
4184 -75 125 -144 93 53 -127 -52 -136 -92 -173 -131 4 -31 42 92 -99 -1 -131 12 60 -83 40 -22 -8 140 59
4209 59 115 -78 20 66 -130 123 -47 -108 -84 -84 32 -9 54 -138 39 42 -41 -40 -94 -70 167 -44 -88 34 -100 20
4235 20 -36 22 21 -98 64 6 198 -61 8 142 4 -87 52 17 -101 48 67 -7 -50 -32 75 -2 52 92 247
$$ packed form
4052b5j34J29J8J7K7j46R7m6N1j3lJ36m6qo0q2J7J06M2q2j71J36N2j32J27M4m9
4079Bo5Q4j74K08k2m2M9j28P4J16j58O4P0n4Q7j52Q8m8j12P5k5O2J02l6j51J6
4105g0J85j49L8l6K1Lj41J76K1j53RJ34j22J35o4m9J48k0k17N6K34j37j9L9m8
4130b6J40j54Q1k6j5j41J96J8m4P5J3k49K15j21Q0p2J33o2j19R6q5O0p3K6j2M3
4156b3K88k50R4j55m8Q7r1N4M9m8O8Q5L2k6m0k6rj45Q0J12m3m8o0K35k03nP4j13
4184g5K00k69K37m0j80P5q4M4q1M2J35l5P3N0j91R8j30J43M8j43J23o2J4J48q1
4209E9N6j93R8M6j96K53j70o1K4%J16m1O3j92J77Lq3Jn4K4K37k11m4J22j34J20
4235B0n6N8jj19J62n8J92k59O9J34j38r1J39l5j18J49J9p4m3J8J07p7N4M0J55
$$ plain form
4260 247 20 18 -100 163 38 -14 67 64 -223 101 -2 64 -13 -69 -35 114 110 -60 46 -59 -18 -23 86 -121 -215
4285 -215 73 -55 164 36 -94 92 29 85 26 -56 -6 -23 22 -97 -18 94 141 29 -185 -138 -45 68 76 -98
4309 -98 -68 -47 59 62 102 120 77 -70 99 -106 6 -1 -85 -24 69 -27 -114 60 -28 4 134 27 -90 -39 -36 -99 -121
4336 -121 49 -20 125 -51 -2 -75 -52 192 49 -13 -10 19 25 40 43 74 62 13 -12 71 139 74 115 91 18 -39 -100 -68 78
4365 78 -88 -66 61 -21 -148 7 -5 32 25 -50 1 36 75 -7 -153 124 -61 13 61 133 48 177 -26 -30 -6 -155
4391 -155 -45 -140 -1 -172 -48 -112 -141 -30 34 150 -114 131 -7 -2 23 -41 85 -54 43 -29 -129 -188 48 53
4415 53 -51 -9 -147 160 63 30 190 78 21 88 -4 -158 -176 26 -56 106 73 25 119 -5 71 -202 107 -12
4439 -12 65 -14 93 69 32 -134 -139 74 -12 43 -290 -106 -234 -82 -121 -95 -12 74 -67 257 -66 -116 12 -135 -132
$$ packed form
4260B47k27kj18K63j25n2Q1lk87L24j03O6p7n6L4J49mj70J06j05M1nJ09k07r4
4285b15K88j28K19j28j30J86o3N6n9q2N0j7M5j19P9J12M7j12k14M7R3J13Qj74
4309i8L0K1J06LM0J8m3j47J69k05J12pq4O1R3r6q7J74q8L2J30j07j17N1Lo3k2
4336a21J70o9J45j76M9p3K3K44j43o2LK9OJ5LL1j2m9k5Q3O8o5M1k4p3n7o1L2J46
4365G8j66K2J27q2j27J55j2L7pp5N1L5L9q2j46K77j85P4M8P2q5J29k03mK4j49
4391a55J10r5J39j71J24o4k9J11O4J16k64K45j38NK5o4J26j39R7p2j00n9K36N
4415E3j04M2j38L07r7l3J60j12n7O7r2j54j8K02q2J62l3m8R4j24P6k73L09j19
4439a2P7p9J07k4l7j66nK13q6N5l33J84j28J52l9K6Q3Q6j41L24l23n0J28j47L
$$ plain form
4464 -132 -92 143 145 -3 -12 20 171 75 22 81 -27 1 -92 -85 -206 117 97 -75 62 -191 164 -64 3 -132 19
4489 19 33 83 -29 -106 73 -57 -62 -1 -145 33 24 36 58 92 111 -80 139 -23 49 -87 -50 -6 -56 73 -112 158
4515 158 5 66 8 -99 50 56 54 -46 -43 -27 -115 73 37 94 -22 -41 -112 -104 -35 72 89 44 64 -51 87 -47 64
4542 64 -118 -106 -4 -59 90 4 -178 -1 -118 139 5 111 199 91 -47 -13 109 -151 -59 100 -46 -129 41
4565 41 -154 -83 109 -75 -125 -94 -8 -101 104 104 -4 -7 63 190 81 0 48 -154 -111 40 -110 9 69 27 -60 -44
4591 -44 -14 68 110 53 65 -35 233 16 115 36 -70 14 0 -78 -49 71 -62 -45 -44 114 -104 129 102 -101 -44 86
4617 86 -71 85 26 14 -66 -53 90 -73 -57 30 17 -85 47 -25 -57 3 114 42 -1 242 140 78 -196 49 -21
4642 -21 -76 -10 168 105 -103 92 -163 28 -37 92 46 -155 -5 -12 9 -36 27 -5 -168 -71 -16 -268 -56 104 13
$$ packed form
4464a32M0K35Kj48rL2J51r6n3N9j08K8r3Pj21L23k0j72J37k53L55k28O7j35J51
4489A9J4N0j12p7J79j30nO1j44J78rJ2K2L4J9j91K19j62P2j36L7M4n0J29j85K70
4515A58j53O1n8j07J49Okj00LJ6q8J88l6N7j16j9p1QO9J07J7m5K0j15J38j34J11
4542F4j82J2J02n5J49q6j82J77j17K57j34J06Q8j08j38L4J22k60R2J59j46q3J70
4565D1j95P1J92j84n0L1Q6r3K05%j08lP0J27j09q1M8k02M3J51j50J19O0m2q7J6
4591d4L0Q2M2n7J2j00K68k17R9p9j06Q4j4p8K9J20j33J7JJ58k18K33k7k03N7J30
4617H6j57J56n9j2q0J3J43j63J6Q7j3j02J32p2l2O0J11p2m3K43j02o2k74K45p0
4642b1n5O6J78o3k08J95k55J91o5J29m6k01J50pK1m5O3l2j63R7N5k52K12J60r1
$$ plain form
4667 13 192 -172 36 -195 114 21 -192 12 -43 -169 -18 73 118 12 -76 54 -63 -121 88 -7 107 3 -32
4690 -32 -46 56 -15 -219 61 -4 98 -235 48 40 -10 -39 19 46 -132 -176 -19 -82 67 -64 94 46 -39 6 3 135
4716 135 79 21 -53 -64 51 110 43 114 107 -72 181 29 53 116 12 -177 122 83 -19 -136 85 -40 -26 19 18
4741 18 8 -102 -107 -22 -24 -123 -106 -106 117 -129 -45 -101 -18 89 -30 26 4 6 181 125 -47 83 -47 50 3 47 -186
4768 -186 -103 118 -4 91 -16 -25 -107 11 -20 -9 -122 -122 -61 76 27 63 48 -106 -35 7 -95 21 -68 -139 101 -7
4794 -7 -48 151 -67 -43 -39 -3 108 -23 75 -135 -9 23 46 -92 -92 27 32 93 -105 38 -9 -87 -79 -22 -23 43 -35 -78
4822 -78 -125 75 101 140 150 67 -97 47 54 -98 45 43 -56 -71 -193 29 24 -51 -22 -115 -47 5 58 -152 -39 -48 -21 -30
4850 -30 -115 -161 -68 48 49 108 164 85 79 -142 -219 68 11 -78 -81 -86 72 14 27 -104 -176 -102 -66 -114 -27 38 -19 16 -62 66
$$ packed form
4667A3J79l64K08k31L09r3k13K04n5j26J51R1M5j06q8J30j17n8K09r5J14j04l5
4690c2j4J02p1k04K80o5J02l33K83qn0k9N8K7j78m4J57o3J49j31J58m8q5M5lJ32
4716A35n6n8p4j1J15N9o7P1pj79K53j52K4O3j04j89K99l9j02j17K21j25J4M5j
4741A8j0j10nQ5kr9J7%K23k46Q4n6Q3J07j19N6k2KJ75n6j72J30j30R7m7M4k33
4768a86Q3K21j22R5j07rq2J18l1J1j13%O1J37m9L6j5j54P1M2j02J16q9p1K40j08
4794gm1J99k18K4ML6J11j31R8k10J26L2K3j38%J19NO1j98J43m7p8QN7jO6p8m3
4822g8m7K00K6L9J0q3j64J44Pj52J43kr9j5j22K22np5K9r3O8N2N3k10J13rK7r
4850c0q5m6R3J16JN9N6p9ok21p7K87n7q9lnJ58n8J3j31p2P4L6m8Q7O5n7L5p8J28
$$ plain form
4880 66 191 -64 170 -17 185 58 145 -79 -88 -17 83 -156 54 41 -130 -34 -65 -25 62 -99 -91 -102 -36 95 -106
4905 -106 -74 -218 -45 -87 -71 -105 -97 -57 -1 -105 -188 30 20 -109 69 -86 -102 47 90 -119 66 161 -123 60
4929 60 -84 -109 188 -86 -12 -29 -29 134 32 -66 91 194 87 -68 -65 -133 -111 59 -123 -9 29 9 97 -159 -13
4954 -13 94 -54 17 40 -143 -165 -140 48 -14 90 -190 136 -52 -48 -163 106 138 -60 89 -94 -44 -75 -66 59
4978 59 42 16 -81 54 -80 23 -225 -18 50 -67 131 72 -67 -58 91 11 98 -48 35 148 49 -13 71 21 39
5003 39 -37 30 -100 87 1 -21 125 -79 184 -19 -98 -16 249 15 -58 86 34 -69 -30 121 -10 70 -33 12
5027 12 -83 -76 -61 65 158 -27 -116 -87 40 31 -32 -68 22 -56 21 21 -71 -102 84 -60 119 17 -36 -9 -76 -46 2 -6 80
5056 80 91 49 -121 4 6 37 72 117 31 -39 58 -22 19 -20 -63 -82 -61 37 14 90 -187 -73 -58 -32 -104 -90 -200 -106
$$ packed form
4880F6J25k55K34j87K02j27Q7k24rP1J00k39K10j3j71R6l1M0Q7j61Qj1O6J31k01
4905a06L2j44J73m2J6l4QM0N6j04q3K18j0j29J78j55j6J49M3k09J85R5k84J83
4929F0j44k5K97k74P4j7%J63j02r8J57J03j07j55Lo8K2J70j82J14L8k0Q8k56J46
4954a3J07j48P1K3j83k2K5J88o2J04k80L26j88Mj15K69L2j98J49j83N0l1RJ25
4978E9j7k6r7J35j34J03k48K07O8j17J98n9j39RJ49q0Q7j46Q3J13r9o2Q4n0J8
5003C9p6O7j30J87q6k2J46k04K63k03p9Q2K65k34p3J44n2j03L9J51j31Q0j03M5
5027A2r5PJ5J26R3j85q9K9J27ro3l6R0p8P7%r2l1J86j44J79j02n3K7o7L0M8qQ6
5056H0J1m2j70J25KL1L5M5q6p0R7q0M1l9m3j9K1R8k3P6k77J14J5K6p2J4j10R4
$$ plain form
5084 -106 -19 -56 132 -7 -4 72 66 -61 30 17 -63 70 -28 53 -114 3 -108 9 -28 -86 0 -130 72 -71 169
5109 169 200 -136 -157 -77 -4 78 91 64 -147 16 44 63 25 -149 51 -21 46 30 -30 20 -47 71 114 -112 107 85
5135 85 96 -140 93 103 -69 -26 65 4 -55 52 -48 83 -30 61 108 -67 -80 -93 -34 117 -120 -41 84 97 -75
5160 -75 126 -99 119 211 -66 34 101 -72 -20 94 207 -70 1 -29 -120 -171 77 -10 171 47 -20 -47 -24 108
5184 108 -32 -50 -23 125 -6 19 76 84 87 -135 40 34 11 -69 39 56 143 40 -36 -85 -102 -82 -12 62 -4 -143 0
5211 0 117 -60 36 -215 -124 81 -25 -33 -13 13 -93 75 -9 4 13 63 99 29 -57 -111 122 37 -38 -32 105 -16 -90
5238 -90 74 72 0 10 -78 121 73 11 -89 -46 -44 -60 83 97 202 49 -50 73 74 -6 -46 22 -199 20 73 95 164
5265 164 129 -36 66 20 -92 236 -107 3 48 -11 197 131 39 61 124 40 -15 -195 -27 -114 9 19 -66 96
$$ packed form
5084a06Q7l7J88j39LP6oj27R1j3q0J33r8Q1j67J17j11J17l7n8Q6j30K02j43K40
5109A69L1l36k1Q0P3Q2J3k7k11J63K8J9l8j74K00p2O7j6o0N0o7J18M3k26K19k2
5135H5J1k36K33J0j72M3R1o1n9J07j00J31j13R1M7j75j3j3N9J51k37P9J25J3j72
5160g5K01k25K18R2k77J00O7j73N2J14J13k77P1l0r1n1K48q7J81j24o7k7K3J32
5184A08j40j8K7J48j31K5N7QLk22J75ok3q0J08J7Q7j03p6m9j7K0P0P4o6j39J43
5211@J17j77R6k51R1K05j06qK0K6j06J68q4J3RN0L6p0q6n4K33q5p5OJ37j21p4
5238i0J64kp2J0q8J99m8o2j00M3Kj6J43J4J05j53r9J23Jq0m0O8k21K19N3K2O9
5265A64l5j65J02m6j12L28l43J10M5n9K08o6r2K2O3q4n5j80J68q7J23J0q5J62
$$ plain form
5289 96 170 -7 -39 -27 123 7 4 -33 111 153 107 124 123 -145 -10 57 106 62 -110 2 47 63 -2 32 -39 -9 -61
5316 -61 85 -9 -2 116 -63 18 -151 -45 71 58 103 -81 -107 -17 -50 -143 -15 46 -85 70 54 -73 126 52 205
5341 205 -28 -45 -53 -36 -62 -37 44 -119 11 55 -49 -23 76 -9 202 -149 -29 11 92 96 -23 14 12 8 45 22 79 132
5369 132 -47 -37 -26 -42 16 6 -100 27 -152 -88 -85 27 55 -143 -14 39 3 -10 -55 33 116 -68 -30 65 18 218
5395 218 -65 -8 -154 -14 73 -35 167 -3 114 -52 -77 -67 154 4 79 -50 136 27 -142 114 -83 -3
5417 -3 101 -52 116 -90 -134 27 54 -175 87 74 7 -166 -86 19 3 -47 17 153 162 53 171 9 85 -81
5441 -81 -3 102 -40 27 45 -207 33 -52 83 37 38 -67 28 95 -162 13 -2 -36 -55 235 -163 -23 -6 -18 -17 -22
5467 -22 -132 -93 87 -88 -11 -49 -151 41 55 131 -34 39 -6 -161 17 79 -4 -72 36 -74 52 42 144 3
$$ packed form
5289I6P4j77l2J2J50j16ll7J44M2m6J7jk68J35O7M9m4j72J12M5J6o5L4p1L0n2
5316f1J46r4PJ18j79Q1j69J06J16j3M5j84k6R0l3r3J28O1j31J55j6j27J99p4J53
5341B05k33j7qJ7k6K5Q1j63J30M4j04K6R9q5K11l51J20M0Q1Mj19L7kmL7k3N7N3
5369A32j79J0J1j6N8j0j06J27j79O4LJ12K8j98J29N3l6j3m5Q8Q3j84L8R5m7K00
5395B18k83N7j46J40Q7j08K02j70J17j66k5J0K21j50P5j29J86j09j69K56j97Q0
5417cJ04j53J68k06m4J61K7k29K62j3o7j73Q0J05j6n0O4J36Rj09J18j62P6j66
5441h1P8J05j42O7J8k52K40q5J35m6Jj05R5O7k57J75j5l4j9K90l98J40J7j2Jn
5467b2j10L9J80j75P7l8j02J92J4P6j65P3m5j55J78O2q3o8J08j10J26j0J02j41
$$ plain form
5491 3 112 -31 96 -31 -35 -12 -12 -204 -129 100 34 -15 92 -44 -76 -38 78 -77 31 -60 -134 -126 -182 203 -13 -116
5517 -116 -40 -13 52 -117 -39 23 -11 12 74 162 -119 45 88 49 73 176 -67 25 -77 -186 84 196 -11 -1 -39
5542 -39 -115 109 -149 -81 -155 126 115 -45 -215 13 108 27 -48 -26 -199 -99 -34 -73 -65 -19 -34 91 58 87 70 52
5568 52 -56 22 -103 43 50 -40 33 -22 -86 -54 7 -66 44 -8 -1 13 74 -74 28 32 -18 28 4 -44 -90 -107 -29 52 -100
5597 -100 -65 44 -38 -62 56 97 -36 -93 19 90 -66 38 82 -15 70 -133 169 147 -25 12 -61 -134 -128 -106 0
5622 0 -133 -14 95 -5 15 51 -57 -113 -20 -138 -9 -191 -1 -180 -58 -32 -36 4 33 -33 73 -57 -67 -44 95
5647 95 -174 -179 -154 41 -60 -50 -178 28 96 -34 12 -10 68 -3 -94 -125 90 -79 -124 163 -23 -36 -33 -81 -38 -115
5673 -115 -19 -22 -4 49 -65 159 76 -38 72 -20 -94 -63 52 -4 140 -8 -6 -76 2 102 -44 -135 -63 -3 54 1
$$ packed form
5491CJ09j43J27j27mK3%j92P5K29o6m9J07j36l2L8J16j55J08r1p4Qn6L85k16j03
5517a16P6K7O5j69P8O2l4K3O2Q8k81J64M3l9K4J03k43R2j02j09K70J12k07J0l8
5542c9p6K24k58O8p4K81j1j60j70K28R5q1p5K2j73J00O5l9QM6j5J25l3K9j7j8
5568E2j08P8j25J46Pr0P3n5o4L2O1p3J10n2PJ4O1j48J02Mn0M6k4m8m6j7P8Q1j52
5597a00L5J09q2k4J18M1j33n7J12P1j56J04M4r7Q5k03L02k2j72L7p3p3OK2J06
5622@j33J19J09j00K0L6j08n6R3j18J29j82J90j79J22K6mM0K9o6J06j30j0K3J39
5647I5k69nK5J95j01J0j28K06O8j30M6k2P8p1r1l1K15j69m5K87j86j3Lm8M3p7
5673a15R6lJ8N3j14K24q3j14J10r2p4L1J15n6J44j48Kp0P8J00j46r1P2O0N7n3
$$ plain form
5699 1 10 2 71 111 48 4 94 -65 0 -58 -151 41 18 -3 -39 230 121 -81 74 28 -151 -136 122 58 -96 -157 6
5726 6 -208 -80 5 -87 -49 25 24 35 -138 152 89 -46 -65 -129 18 39 24 -19 -27 112 -86 -25 63 42 -4 -17 99
5753 99 60 -20 76 173 32 127 101 16 68 14 48 27 116 -7 70 -19 32 82 -41 -112 -110 -96 201 -1 61 172 -165
5780 -165 19 -214 -108 114 -2 -61 -100 98 8 -28 -71 -86 -55 -70 -31 171 29 54 -131 -70 -90 207 147 -96
5804 -96 7 -181 -20 -4 -21 -181 -12 50 -213 36 75 88 135 -213 125 59 41 11 -31 -2 39 -113 9 -48 -147
5829 -147 45 155 66 -82 -30 -10 -59 -29 26 102 -25 68 0 4 87 30 -57 61 -102 -153 -49 57 249 45 6
5854 6 13 28 -56 -3 -149 -231 47 106 162 8 -1 -49 -252 131 -44 -94 28 106 58 51 5 -120 98 122 80 -217 -24
5881 -24 50 95 -185 86 113 -47 146 -59 -17 21 -110 -121 76 -36 20 126 -87 102 86 112 -15 -32 50 -67
$$ packed form
5699ARqO9M0o3m4R0j59O5n8r3J92k3k1l6K69j09k02J55m6j79J5K58o4j54o1J63
5726Fk14J28Q5r2L8P4jJ1j73K90o3j35j9o4J47K1j5m3qJ39j98O1Q8k1m6j3J16
5753I9l9q0R6R7j41R5k6q5N2n4L4k1Q9j23P7q9N1N0j23p1KJ4K97k02O2J11l37
5780a65J84k33J06K22j16n9l9J98r0l6m3j5L1j5L9K02j42K5j85O1k0K97o0k43
5804i6J03j88J61J6j7j60J69O2k63K49L9J3M7l48L38o6j8l0m2K9M1j52J22n7r9
5829a47J92J10q9j48N2K0m9L0N5P6j27R3o8MQ3n7q7J18j63n1J04J06J92k04l9
5854FPJ5q4N3j46q2K78N9N6j54rm8k03L83j75n0J22P8m8pm6j25K18K4m2k97J93
5881b4P4M5k80K71K7j60J93k05M2L8j31j1J97j12N6J06k13J89j6K6j27j7Q2j17
$$ plain form
5905 -67 -78 -3 116 -50 255 -133 -111 55 50 -50 96 -84 -53 67 47 -91 152 -43 -18 -139 3 12 -45 -92
5929 -92 -128 -80 11 -45 40 27 -146 34 -153 10 133 -38 -71 -45 22 -139 -129 -155 -213 3 41 38 -81 37 71 45
5955 45 -91 -162 -20 11 -31 30 51 14 -232 95 -62 79 -142 -18 30 -25 -65 77 49 -20 -67 182 -75 -6 -169
5980 -169 -179 -66 -34 145 87 64 -94 48 12 5 69 -76 99 58 -193 -110 81 86 -182 109 -67 -35 -32 43 -225
6005 -225 46 -217 -89 32 83 -73 -101 51 -19 -246 32 -39 -152 -45 93 107 -84 -43 27 113 -23 51 -61
6028 -61 27 -56 -8 -58 -133 -29 36 -29 -47 -61 -48 98 -94 56 -141 -125 -44 -104 39 -94 8 43 -34 -92 104 -45
6054 -45 -38 120 -51 7 60 54 99 -104 71 133 -16 65 -122 21 148 -48 196 233 -37 10 -135 64 118 -114
6078 -114 50 -39 -48 -216 89 10 -56 143 -45 -122 52 70 -10 54 -50 2 80 0 53 54 22 -19 -67 -82 -125 -15 -153
$$ packed form
5905f7j1P5J19j66L05l88K2J66nj00J46j80L1J20k0j38K43j95K5j21J42Rn7m7
5929i2l6M8R1n6Q5j3j73J80j87J63J23j71l3K6O7j61J0k6n8K16L8lj19J18L4k6
5955D5j36p1J42L1m2O1K1l7k46L27j57J41k21J24M8n5m0J42k8o9m7K49k57O9j63
5980a69j0J13L2J79n8k3j58J42l6pO4j45J75m1k51Q3J91Nk68K91j76L2LP5k68
6005b25K71k63J28J21N1j56k8J52p0k27K78p1j13J07J38J4j91M1P0Q6j36P4j12
6028f1Q8q3M8n0p5J04O5o5j8j4J3J46j92J50j97J6Q1o0J43j33J02L5p7n8J96j49
6054d5PJ58j71N8N3oM5k03J75O2j49Q1j87J43J27j96K44L7k70M7j45J99N4k32
6078a14J64q9rj68L05p9o6J99j88p7J74J8q0O4j04N2P8q0N3Jl2m1m8j5m3J10j38
$$ plain form
6105 -153 68 24 51 -14 -43 -69 40 -40 -99 -58 -14 -41 -133 -89 -13 -39 39 -52 39 50 -96 0 -53 26 56 13 35 14
6133 14 34 -58 -39 0 -87 -23 31 16 -125 -44 10 37 23 177 -83 32 260 33 117 101 -123 -73 63 66 -159 137
6159 137 105 22 154 180 -22 -32 -15 -62 -35 -133 -55 73 18 9 -18 -116 98 -28 62 24 -152 72 -98 -12 9 105
6185 105 -161 4 106 -86 -126 116 -62 2 190 -74 64 18 43 15 79 109 -38 87 126 -106 -126 152 118
6208 118 83 51 -157 -38 -24 -68 46 62 -96 -9 2 -69 -15 11 8 88 -29 62 -18 108 -188 227 -74 -76 -71 -6 82
6235 82 36 -33 -49 -58 33 -74 -137 -48 -26 216 16 44 248 -63 -13 67 -109 -27 -206 -26 -69 -140 141 -69 35
6260 35 -74 3 -2 -2 -70 -96 42 224 -110 28 165 -10 41 -82 24 36 75 98 -177 -10 71 -196 162 28
6284 28 -30 0 -52 50 113 -70 -69 -49 26 -54 -41 -56 61 -6 14 -20 73 69 -148 17 -17 -199 11 -96 -89 -46 -21 -49
$$ packed form
6105a53K21m4K7o5k9k6J09q0n9M1M4k7r2M4P6k6P8r1R1J1j46R6n3P9L0m3K2k1
6133A4K0r2J9L9q7O4N4j5j41Q1N4K7j4J54k60J15K28k27Q4j6k24N0J36Lk25K96
6159A37l2q3J32K6k02j0J7m7K7r8P8J28n5rk7r8K14j26R0l8j76K24j70Q6K1R6
6185A05k66J65J02j92m0K42j78O4J88k64J38m6K5k8O4L0j47J25L9k32k0K78l4
6208A18l5l2k08J19J4m4J14J6j58Q7J1p1N4K6lQ0j17R1q0J26k96M15l01kNO5Q8
6235H2m6o9j6rR1j07o3Q9K2K42k00K8K04l11N0Q0j76Q2j79J80m3p1K81k10J04
6260C5j09P7n%o8k6J38J82l34J38J37j75N1j23J06J2L9K3k75J67Q1k67L58j34
6284B8n8L0n2J02O3j83JK0P5q0J3j5J17o7K0l4R3mk17J65l4j82K10j07PM3K5k8
$$ plain form
6312 -49 23 21 -19 86 128 206 -71 149 45 -2 29 98 -61 10 -60 -29 -38 12 15 -8 -132 191 13 66 79 -28 -24 84
6340 84 50 7 105 25 -146 -75 -26 -117 -54 -17 29 26 3 42 27 -34 32 67 27 -53 93 50 -42 64 -151 -62 2 -75 -49
6369 -49 69 107 5 -92 -193 104 86 10 22 -16 11 6 19 -179 -62 -123 -2 81 -59 -83 17 3 -60 139 -34
6394 -34 -69 92 246 134 -151 -44 25 107 86 -5 23 -34 202 31 -40 151 42 11 60 26 -130 -24 -36 -5 -76
6419 -76 -95 -6 -86 49 18 5 49 -66 -46 7 -172 2 -24 1 79 -183 -150 105 -13 -147 -22 10 32 9 -4 -15
6445 -15 -66 111 -95 35 31 -18 122 -38 50 -59 -114 -60 -2 63 175 54 -105 67 5 79 -14 -202 92 82 19
6470 19 -86 -118 -4 -48 44 -148 334 227 -49 -117 -57 -9 140 -203 -73 129 136 50 -82 -59 32 -11 -35 38 -22
6495 -22 97 45 8 32 26 20 6 114 -71 37 140 -125 9 84 -21 -20 -236 -69 -41 103 -120 -59 121 52 -61
$$ packed form
6312d9P2km0J05M2P8k77K20j04m7L1O9j59P1p0L1rN0Lk3j24L23j78N3J3j07MJ08
6340H4l4m3R8q0j71P1M9r1O3L7M6lk3L9j5o1O6L5m0q0J46m3r2J06k15Q9O4p7K6
6369d9J18L8j02r7j01K97j8p6J2l8K7nJ3j98J17o1J21Q3j40k4J00j4o3J99j73
6394c4l5J61J54j12k85J07O9Q2k1r1K8n7K36j71p1J91j09l1M9l4j56J06j2L1p1
6419g6j9Q9q0J35l1j3M4j15K0N3j79J74k6K5P8k62L3K55j18j34J25L2K2k3j3j1
6445a5n1J77k06J30mm9J40j60Q8j09n5N4N8O5J12j21j59J72o2P4r3j88K94j0o3
6470A9j05l2J14m4R2j92M82j07k76o8O0M8J49l43J30K02Pq6j32K3R1m3k4P3o0
6495b2J19n2l7K4ooj4J08j85J08J03k65J34P5j05Jk16J67K8J44k23O1J80o9j13
$$ plain form
6520 -61 -89 1 -33 47 -10 21 56 138 31 8 96 62 -47 -21 -122 -78 2 -75 -104 18 -101 -51 65 -73 -186 -6
6546 -6 174 64 -127 77 115 -139 -144 16 38 -43 -90 36 -116 -57 87 113 -93 -20 151 -13 -7 47 114 179 180 -14
6572 -14 120 49 33 79 38 -155 58 -144 71 50 -38 -105 6 19 -15 58 139 -2 71 -116 -70 189 95 54 -51
6597 -51 -40 -36 3 -35 -46 -111 130 -54 14 -49 -46 -43 1 -47 -99 -73 2 -24 8 106 -36 173 -124 -68 18 23 -65 -41 58 -53
6627 -53 -92 38 -94 -129 -234 -235 1 28 -220 -35 -75 82 52 65 -4 55 -208 65 67 -151 -22 79 -80 138
6651 138 137 8 60 50 28 83 162 -61 31 58 91 20 -39 2 106 95 72 -100 -141 56 112 37 66 183 -174 -25
6677 -25 -184 -23 -56 -37 -50 61 102 -83 77 -111 0 -29 59 30 -115 47 -73 112 -62 1 22 61 166 56
6701 56 -171 -31 178 -40 57 69 -175 -134 -87 21 102 36 -14 -28 -77 -89 133 -64 6 -32 -203 56 27 130 -16
$$ packed form
6520f1k8R0l4Q0n7L1L5Q2j07k3Q8l4j09K6j01M4Q0p7k9J22j19N0J16j38j13J80
6546fJ80j10j91K04L8k54nJ60K2q1m7J26j52N9J44K6k06P3J71j64ON4O7O5Jj94
6572a4J34p1j6M6m1j93K13k02K15k1q8o7J11J3l4P3Q1j41P3j87M6K59r4m1j05
6597e1J1ML9l8j1o5K41j84O8o3LLM4m8n2K6P5k6L2R8j42K09k97N6Q6Nq8K4R9j11
6627e3l9J30j32l5j05jK36K7k48J85m0J57l0J3o9N9k63K73Kk18J29J01j59K18
6651A38jj29N2j0k2N5P9k23R2K7L3p1n9M1J04j1k3j72m1J97N6p5K9J17l57J49
6677b5j59J61l3J9j3J11M1j85J60j88J11k9Q8k9j45J62j20J85j74O3K1L9J05j10
6701E6k27J40K09k18R7J2k44M1M7J08Q1o6n0j4m9j2K22j97P0l8j71K59k9J03j46
$$ plain form
6726 -16 0 140 48 25 -66 16 132 -22 48 -9 148 38 128 31 60 -71 -166 -14 -36 -152 -47 -68 62 -69 36
6751 36 -34 -165 -83 -159 90 75 -60 -17 154 32 -19 -65 126 -148 -132 1 -59 11 51 -27 37 80 -81 -29 57 59
6777 59 -5 77 -44 -52 134 41 -185 81 -77 11 3 -48 211 30 61 85 -80 33 90 124 -26 -26 32 -20 38 -38 79
6804 79 59 66 134 -97 72 -178 8 -77 4 -65 68 124 101 4 -4 99 -72 -112 -37 48 -150 9 56 46 -26 -131
6830 -131 -54 -81 4 -41 156 -120 -61 47 154 -126 -24 -114 19 -130 -41 6 7 25 -121 99 -106 28 111 55
6854 55 -144 36 -155 -23 29 -74 192 -80 121 -18 4 62 68 166 116 -72 20 -15 11 -18 5 -96 82 -2 97
6879 97 50 -16 49 -54 -148 50 -125 -124 -122 -131 268 -48 31 -93 23 -5 -50 -13 -29 26 121 -106 4 6 -43 -98 -79 74
6907 74 160 -24 7 -99 14 -57 -1 32 -44 70 -118 -102 -104 -44 -57 -97 -53 35 -48 28 -3 3 -114 -80 133 124 -43 -47
$$ packed form
6726a6J6J40r2k3r1Q2J16j54P0n7J57j10R0r7K9j31r5J52k2j16J05k1J30j31J05
6751C6p0j31Q2p6K49j5j35M3J71j22n1m6J91k74J6J33o0P0M0p8O4M3j61N2Q6K
6777E9o4Q2j21qJ86r3k26K66j58Q8qn1K59j81L1K4j65J13N7L4j50%N8n2N8p6J17
6804G9k0PO8k31J69k50J86q5Q1o9J33N6k3r7qJ03j71m0P5Q5j98J59M7j0p2j05
6830a31P7k7Q5m5J97k76N9J08J07k80J02r0J33j49Q9M7JJ8j46K20k05J34Q3n6
6854E5j99J80j91J32N2j03K66k72K01j39K2N8OR8n0j88R2l5K6k9K3j01J78q4R9
6879I7m7o6O5j03r4J98j75JKrL99l16P9j24J16k8m5L7j6N5R5k27J10Km9n5J9J53
6907G4Q6j84L1j06J13p1N6L3p6J14j88J6kO0j3m0M4Q8q3P6l1Oj17L4K13rj67m
$$ plain form
6935 -47 -60 72 -61 16 12 -35 77 -188 -41 -37 122 -42 51 -85 163 51 -121 88 -75 -29 114 192 57 -6
6959 -6 -108 168 75 43 10 -1 -99 66 -39 -61 54 -112 68 -41 -19 -150 -4 -60 44 -148 -22 -68 25 19 8
6984 8 -79 -32 72 -227 -69 158 219 -20 191 121 215 84 30 -22 43 -23 33 136 90 121 -36 -128 -37 -30 124 21
7010 21 14 -58 -127 -6 -30 87 125 -78 -72 80 -114 291 95 -61 -64 -68 -74 -4 20 -9 95 125 16 36 20 7 -124
7037 -124 29 -30 147 7 -51 -82 78 228 87 -124 -145 -12 -50 95 -33 -117 -9 62 27 22 -26 -101 -105 37 129
7062 129 153 -92 -64 75 -89 50 50 -25 85 -62 21 25 24 -59 136 115 -132 21 131 2 86 125 52 -58 -138
7087 -138 -49 -51 -68 -37 19 -93 -103 -18 -100 102 17 103 -20 56 -95 -50 -89 27 259 -4 126 -107 -84 -155 -42
7112 -42 193 -74 -28 69 -6 -62 95 2 -7 -89 -27 66 67 -125 81 58 39 -172 -84 -75 -27 35 -44 35 -60 -109 -209 -53
$$ packed form
6935d7j3J32j33P7mm7J12k65J47MJ59j64R3j36K48j12j72K09j63M6J43P8j35o3
6959fj02K76r3l2l3j1r8J65j05k2J15j66J80j09K2j31J46n6J04j92J26m6R3oj1
6984Hq7M7J04k99J58K27O1k39K11p0R4j31n4n2O5o6N6J03m6L1j57r2R1PJ54j03
7010B1pp2o9J21k4J17L8k03OJ52j94M05j96j56lmoP0K4k9J04L0j09K0j6j3j31
7037a24J53n9J77j40n8l1J60J50j41k11k1J33l8J45j28q4J08P1l5nm8p5mJ42R2
7062A29K4k45K8J39j64J39%p5J10j47Q3Mjq3J95k1k47J53J10j29Q4L9p3j10q0
7087a38Q9kj7L1N6j12j0Q5q2K02q5Q6j23P6j51M5l9J16K32k63J30k33K3p1J13
7112d2K35k67M6R7p5n6J57r3rq2O2R3Jj92K06k3j9k11Q8RM8O2p9P9r5m9j00J56
$$ plain form
7140 -53 -84 114 31 -8 2 178 -91 2 1 12 32 -24 5 -94 11 12 192 32 9 120 -127 52 -15 -101 -49 47 49
7167 49 -35 -9 70 151 -226 -173 -81 -54 -65 162 -7 -61 4 -76 -64 66 2 -88 78 -191 -14 -40 -27 -42 -84 -17 -32
7194 -32 -28 -44 49 81 -88 90 13 -122 -17 83 -29 145 -152 45 -41 -9 -106 -77 -9 -47 -74 104 54 33 50 -46
7220 -46 39 -57 116 -6 -91 23 55 -79 39 -111 -28 112 -125 105 -83 187 -31 125 -104 124 -160 -78
7242 -78 -82 89 56 -31 10 25 -73 -41 -58 79 -55 72 -24 -113 107 63 -216 -50 -51 14 51 -102 70 8 38 -30 -10
7269 -10 17 29 -24 242 25 -86 44 -5 61 -26 77 -190 -114 46 -86 7 226 68 49 -8 93 101 184 -137 -134
7294 -134 -27 -20 98 -109 6 -109 81 -128 -97 -65 -144 -74 6 -18 132 79 150 135 -115 -111 -105 11 -131 183 6
7319 6 50 -105 11 -119 -21 62 -29 16 -76 -25 83 -45 -60 -30 103 -44 84 -10 -173 -101 -73 143 -71 -23 21
$$ packed form
7140e3l1J98q3l9J0J76k69R3jJ1K0n6K9r9J05JJ80j60k3J11k47J79o7q6N2R6K
7167D9q4K6P9Q1l77N3R2K7j1K27j69n4O5q0J2J30o4r0J66k69J77k6J3j5m2O7j5
7194c2Mj6R3L2j69J78p7j35J05J00j12J74k97J97q6L2r7K9O8l8k7J78n0k1J7r6
7220d6Q5r6J73j22q5J14L2j34J18j50Q3J40k37K30j88K70k18J56k29K28k84Q2
7242g8mJ71l3q7M1J5r8L2j7J37j34J27r6q9K20m4k79J66jO5L7j53J72o2L0o8K0
7269a0K7J2n3K66k17j11J30m9O6q7J03k67P6J60j32R3K19j58j9n7J01QQ3l21L
7294a34J07PJ18k07J15j15J90k09L1L2p9P0Q0k4J50n3P1j5k50MOJ16j42L14j77
7319FM4j55J16j30R8Q3r1M5r2N1J08j28j5L0J33j47J28r4j63P2K8K16k14M8M4
$$ plain form
7344 21 -38 107 -102 -149 68 48 -121 67 -215 -7 40 -74 -37 25 60 152 82 -90 40 -55 -208 -83 170 3
7368 3 -9 -58 -7 -24 67 23 -251 -76 -152 21 -133 -1 44 46 9 -68 -127 112 -56 -10 -228 70 40 -55 40 50 144
7395 144 -57 -81 8 85 -10 -19 -99 -26 141 182 -175 17 6 44 35 -72 -89 32 179 -109 79 81 167 -48 46 76
7421 76 -51 -42 -22 151 141 146 -125 -29 -46 -62 16 -25 100 -41 16 -34 -44 -35 81 74 -80 -83 -185 72 226 54 -132
7448 -132 41 -69 -3 -143 28 80 108 161 -82 42 -59 30 -44 -156 163 -92 41 -82 0 170 -47 45 -106
7471 -106 47 7 -20 17 -50 -60 -87 54 -137 -183 -67 104 116 30 -42 118 47 6 82 -16 26 64 180 114 -8 109
7497 109 54 13 -32 103 -43 -8 -67 214 -160 5 107 55 -96 1 -21 132 -111 11 13 -7 -137 -34 -26 -18 50
7522 50 136 8 -82 -104 -102 -253 -76 -50 -31 119 129 -107 -43 -50 154 28 -121 -23 57 -24 -44 -12 120 0 169 125
$$ packed form
7344B1n9J45k09m7K17k0j69J88k82K08M7j14L7O2L5R2p0j72J30r5j53J25K53j67
7368Cj2m9N1j7R1m4k74J75p6J73j54J32M5Kl7p7n9K39j68M6k18K98l0r5R5J0R4
7395A44k01k4Q9P7r5rq0P3J67M1l57J92j1L8rj07j7J21J47k88J88KQ6k15R4L0
7421G6j27RK0J73j0Nk71R6j7j6P8m1J25j41N7n0j0RJ16pj54lj02K57J54j72j86
7448a32J73j10O6j40J71N2K8N3k43J24j01Q9p4j12L19k55J33j23Q2J70k17R2j51
7471a06J53m0k7L7o7j0k7J41j91m6J16J71J2q6p2J60p1m1P6r8M2L8J16o6j22J17
7497A09n5m1m5J35j46L5n9K81l74J65J02n2j51R7k2J53k43J22Kk0j30J03QQO8
7522E0Q6j28r0k2Kj51J77K6J9J50J0k36O4pK04j26j49R8Q0q1k0L2J32j20J69m4
$$ plain form
7548 125 -31 90 7 -128 -97 22 -17 -94 98 81 28 52 235 -49 -103 47 -26 137 -111 27 48 -24 35 -62
7572 -62 101 114 -3 68 87 -107 93 57 34 68 -43 37 25 -34 -43 21 -23 70 79 -84 55 5 -7 11 -217 12 -50
7599 -50 -140 89 -18 142 -135 62 113 -104 -28 -18 -79 -88 -184 -25 -52 -22 74 -31 32 -76 -43 -75 76 156 181 11
7625 11 145 -1 -206 -10 49 80 -59 -125 -114 170 -4 23 -5 3 -76 66 -72 -61 149 -31 85 120 -194 114
7649 114 -11 -38 14 22 -7 21 -113 -107 -99 50 -12 -53 -55 -72 -79 -16 -19 221 105 -200 78 -89 -79 66 -56 56 214
7676 214 48 12 -82 198 -128 60 40 40 -60 24 -74 -53 -3 -136 98 11 111 -79 96 106 -117 -18 -74 61
7700 61 43 53 -10 -26 60 13 -34 136 29 -31 -68 -31 75 78 -1 81 93 17 -73 212 -44 126 -90 9 22 -74 116
7727 116 -75 -30 -27 68 -111 39 -59 13 35 -96 -150 84 60 -50 -91 50 -6 -16 48 -186 120 -67 -16 -17 81 -74
$$ packed form
7548A25j56J21q3j35L1J19l9p7J92j7n3K4J83k84n4J50p3J63k48J38K1p2N9r7
7572f2J63J3j17P1J9j94K00l6k3L4j11Q0j2n9rO4m4R3Rj63J39n0j2J8k28K29o2
7599e0r0K29j07J60k77J97N1k17P6J0o1rr6J59k7L0R6j05O3j08L3l2J51Q0K5j70
7625A1J34j46k05J96N9L1j39o6J1K84j74K7k8Qp9J42j38J1K10j80J16L5l14L08
7649A14j25k7N2Qk9K8j34OQJ49o2m1kj7pO3lK40j16l05K78j67J0J45j22J12J58
7676B14j66l6r4K80l26J88k0%j00Q4r8K1N0j33K34q7J00j90J75J0k23R9n6J35
7700F1j8J0o3j6Q6m7m7J70j07o0l7L7J06Lp9Q2J2p6r0K85k56J70k16R9J3r6J90
7727A16j91M5LR5j79J50r8P2K2j31n4K34k4j10m1J41n6j0O4k34L06j87N1jR8j55
$$ plain form
7753 -74 -46 0 -65 -84 -14 26 29 19 -157 185 78 -18 41 -151 -3 194 -114 -25 69 58 -2 19 110 7 50 -123
7779 -123 -50 -17 -156 35 -105 -54 52 23 -108 -5 -107 62 -60 3 141 -36 26 -189 75 27 -119 12
7801 12 -106 116 150 -5 63 101 -31 -33 -2 -57 51 15 -165 -82 -14 19 -62 87 -58 60 -26 5 -55 -29 34 10
7827 10 27 333 24 107 -41 29 49 137 52 108 -165 28 -80 14 49 -38 -49 -11 62 -105 84 -147 -191 -124 36
7852 36 -32 119 86 -103 138 25 214 94 47 -128 2 10 36 -75 65 -35 -96 -29 -17 -6 -10 -135 22 -103
7876 -103 7 140 29 -17 -146 124 21 37 -60 32 -20 -32 81 73 10 125 -103 -51 187 -24 176 -79 -94 22
7900 22 29 170 97 -24 -81 -101 1 -118 26 -85 103 98 114 152 84 0 47 34 -92 27 -55 -59 118 -23 62 31
7926 31 -217 39 -47 116 -45 83 35 42 -74 82 82 -114 -73 -90 -79 72 6 13 79 -92 238 45 36 15 26 -48
$$ packed form
7753g4K8M6o5j9P0M0Lj0j76L42j07r6N9j92J48J97l08Q9R4j1o0K1R1j03M3j73
7779a23P3L3j39J91j40N1J06k9j31J03j02J69j22O3J38j77O2k15K64m8j46J31
7801A2j18K22L4j55O8L8j32kL1n5J08l6j80Q3O8L3q1J49j45J18q6L1o0K6O3k4
7827A0J7L06l09Q3j48P0K0Q8q5N6k73J93j08R4L5q7j1L8P3j67J89k31m4O7J60
7852C6o8J51l3j89K41j13J89j20m7j75J30QK6j11J40j00o1O7J2J1mj25J57j25
7876a03J10J33j11m6j29K70j03J6r7R2n2j2J13qo3J15k28N2K38k11K00k55j5J16
7900B2PJ41p3j21n7k0J02j19J44j11J88nJ6L8o8q4M7j3j26J19q2mJ77j41Q5l1
7926C1k48K56q6J63j61J28m8Pj16J56%j96M1j7J1J51o6PO6j71L30j93rk1J1p4
$$ plain form
7952 -48 -137 98 69 -28 30 30 2 284 -116 -78 -80 25 62 -26 153 97 30 2 -118 -40 12 191 57 -50 110 -36
7978 -36 -47 -72 -49 37 100 26 -9 82 -81 -117 110 164 81 -251 32 5 -25 -133 -60 96 1 -106 63 -171 -71
8003 -71 127 65 136 40 157 34 -144 135 81 -121 100 -25 41 73 -114 72 -63 -75 -61 -50 -97 -42 -36 -74 62
8028 62 -102 30 96 79 -28 4 69 -137 64 21 90 39 76 74 -66 31 116 72 -39 11 103 -121 -11 41 -65 -86
8054 -86 9 201 -1 -26 -97 65 95 82 21 -41 -43 114 -73 -70 -86 -18 118 31 -179 -181 10 -139 52 134 -67 -57
8080 -57 146 20 -37 149 -43 5 25 67 19 155 102 -156 128 62 25 46 2 24 72 116 -186 -71 82 -99 -16
8105 -16 -84 -116 -72 13 -31 -191 -223 59 -81 -96 2 113 77 -16 -43 -133 88 -88 48 137 -74 -16 -187 28 159
8130 159 -27 -27 -132 -56 212 -71 20 39 -114 -111 -73 -73 -126 38 244 22 74 -3 37 24 59 -27 -135 -98 -114 -53 -32
$$ packed form
7952d8q9K35k9r7N8%k8K82m00L8kJ05L7q8J79n6o7k8j20P8N2J79j34j07J60j46
7978c6j1k5K3Q6O3p4l5R1j63l6K27N4q3l32K83k7l0j08P3J56r5j07J69k34J00
8003g1J98o2P1r6J17j23j78K79n4k02K21j25O6L2j87J86j35j2J4J1m7N5Ol8J36
8028F2j64J32O6j7j07L2O5k06K01m3O9n1L7kj40R7Q5m4j11N0R2k24J10N2j06k1
8054h6R5J92k02k5p1J62L0j3o1o2kJ57j87Lj6O8J36q7k10kJ91j49J91Q2k01J0
8080e7K03j26n7J86j92M8K0M2m8J36n3k58K84o6l7K1m4K2M8M4l02J15J53j81Q3
8105a6o8l2M4Q5m4j60l2K82j40j5R8J11l6r3k7r0K21j76J36Q9k11N8j71K15J31
8130A59j86%j05P6K68k83R1J9j53LL8%n3J64K06k22N2p7M0j3L5q6j08L7j6O1K1
$$ plain form
8157 -32 -135 67 -91 -47 -31 85 -163 128 -14 -62 -47 148 203 1 -77 115 -17 67 43 59 -62 -67 -16 -81 145
8182 145 -17 -30 -126 -106 102 -189 14 -192 30
$$ packed form
8157c2j03K02j58M4J6J16k48K91j42m8J5J95N5k02p8J92j32Q4k4J6j21nN1o5K26
8182A45j62j3r6K0K08k91K03k06K22
8191C0
$$ Imaginary data points
##PAGE= N=2
##DATA TABLE= (X++(I..I)), XYDATA
$$ plain form
0 0 0 0 0 0 0 0 0 0 0 0 0 0 0 0 8 -8 8 -8 8 -16 16 -17 24 -25 32 -40 45 -48 56 -67 78 -88 100 -112 128 -144
36 -144 161 -182 204 -226 252 -278 310 -343 378 -418 462 -509 562 -619 682 -752 828 -913 1009
55 1009 -1118 1241 -1381 1544 -1737 1968 -2252 2607 -3069 3697 -4607 6046 -8676 15047 -66616
70 -66616 -16531 106261 -15567 -65572 -8826 14147 -9618 44315 39483 -50718 -53981 54668
82 54668 58268 -20313 -28586 6353 -1522 19940 48844 -6294 -62220 2423 61357 10800 -31984
95 -31984 -4749 -5975 -14628 31971 34790 -46244 -48816 39135 39443 -33307 -20185 20520 -15675
108 -15675 -25294 36055 20055 -58413 -28640 50342 14764 -44223 -3457 23966 -22083 -13688
120 -13688 44169 14143 -47608 -9277 47380 17737 -15818 901 1351 -5043 25988 26430 -27053
$$ packed form
0@%%%%%%%%%%%%%%Qj6J6j6J6k4L2l3M1m9N7p2Q5r3J04j23J45j66J88k12K40k72
36a44L05l43L86m30M78n30N88o53P21p96Q80r71J071j181J301j434J580j741J922
55A009k127K359k622K925l281L705m220M859n676O766q304J0653j4722K3723q1663
70f6616N0085J22792j21828n0005N6746K2973k3765N3933m832r0201l263J08649
82E4668L600p8581q273L4939p875K1462K8904n5138n5926O4643N8934n0557m2784
95c1984K7235j226q653M6599K819q1034k572Q7951L08p2750J3122M0705l6195
108a5675r619O1349j6000p8468K9773P8982l5578n8987M0766K7423m6049Q395
120a3688N7857l0026o1751L8331N6657k9643l3555J6719M50o394L1031M42n3483
$$ plain form
133 -27053 -27994 27982 24669 -21370 -11928 10344 -12069 -9986 24292 1805 -40305 -7265 33590
146 33590 -519 -26754 4994 7575 -21333 3195 31889 -13372 -41059 13049 36751 -14683
158 -14683 -27989 13247 12506 -13342 4115 16136 -13077 -12013 24675 16015 -17905 -4010 19919
171 19919 3040 -5792 12055 4776 -14464 2282 16710 -7107 -14116 8191 1794 -19135 -830
184 -830 15786 -11535 -22598 8743 13487 -14721 -10641 12039 508 -11518 7765 9971 -13142
197 -13142 -6409 17470 5626 -14187 276 11743 -4955 -6123 12258 4917 -13119 -921 14403
210 14403 2602 -5907 3508 3800 -2478 5427 8318 -6550 -7642 9233 6683 -9789 -6149 4117
224 4117 -2389 -6288 1613 -1308 -11138 -3486 6850 -2315 -8993 1567 4732 -5084 -1917 8543
$$ packed form
133b7053r41N5976l313m6039R442K2272k2413K083L4278k2487m2110L3040M0855
146C3590l4109k6235L1748K581k8908K4528K8694m5261k7687N4108K3702n1434
158a4683j3306M1236p41k5848J7457J2021k9213J064L6688q660l3920J3895K3929
171A9919j6879q832J7847p279j9240J6746J4428k3817p009K2307o397k0929J8305
184h30J6616k7321j1063L1341M744k8208M080K2680j1531j2026J9283K206k3113
197a3142O733K3879j1844j9813J4463J1467j6698j168J8381p341j8036J2198J5324
210A4403j1801q509R415K92o278P905K891j4868j092J6875k550j6472L640J0266
224D117o506l899P901k921r830P652J0336r165o678J0560L165r816L167J0460
$$ plain form
238 8543 2918 -5573 1371 7653 1367 -1972 3289 2040 -1972 2194 3947 -2244 -3104 3415 2923 -2413
254 -2413 -1353 1978 97 -528 2619 1473 -2587 -1003 1750 -14 -1115 -51 -2035 -4249 -904
269 -904 1542 -2764 -5673 -1705 1296 -1369 -2904 -298 947 434 1372 1709 608 913 3553 3632 1080
286 1080 377 1970 2303 1020 226 452 196 -587 -1062 -217 48 -881 -1280 -586 246 -339 -1039 -254 490
305 490 -38 -763 -511 -475 -350 -256 -557 -1298 -1733 -1223 -325 -773 -1316 -943 71 405 -16 541 1618 1762
325 1762 1105 1538 2222 2002 1557 1297 1622 1255 -49 -262 526 -1 -968 -1460 -1062 -1164 -1625 -985 -503 -1396
345 -1396 -1279 492 265 -1257 -485 1640 820 -1552 -559 1367 -91 -1092 424 40 -1794 -540 1595
362 1595 -242 -1593 423 1423 12 605 2279 773 -461 2412 3249 -210 -696 2130 1195 -890
$$ packed form
238H543n625q491O944O282o286l339N261j249m012M166J753o191q60O519m92n336
254b413J060L331j881o25L147j146m060J584K753j764j101J064j984k214L345
269i04K446m306k909L968L001k665j535K606J245n13R38L37j101L05K640P9k552
286A080p03J593L33j283p94K26k56p83m75Q45K65r29l99O94Q32n85p00P85P44
305D90n28p25K52L6J25R4l01p41m35N10Q98m48n43L73J014L34m21N57J077J44
325A762o57M33O84k20m45k60L25l67j304k13P88n27r67m92L98j02m61O40M82q93
345a396J17J771k27j522P72K125q20k372R93J926j458j001J516l84j834J254K135
362A595j837j351K016J000j411N93J674j506j234K873Q37l459m86K826r35k085
$$ plain form
378 -890 462 442 -3446 -2210 2139 232 -5045 -2483 1427 -1165 -2294 1214 -94 -3909 526 5117
394 5117 -330 -4199 1878 4036 -1199 -545 3045 -1411 -3627 3433 4312 -4298 -4196 3909 2445 -3027
410 -3027 860 2790 -3190 -1420 6667 2415 -5992 -286 6195 61 -3211 2621 454 -5651 681
425 681 5632 -4244 -7845 2842 3518 -5533 -2344 4399 -2913 -5682 5541 6239 -6526 -4317 7312
440 7312 3333 -4141 2576 3858 -5078 -1277 9244 558 -9863 549 8081 -2445 -4765 4427
454 4427 -454 -7445 4273 9803 -5912 -9990 6423 8122 -4566 -2460 3640 -4444 -3590 9502
468 9502 3381 -13476 -5120 10867 2216 -8416 -62 1796 -6549 1823 11308 -3741 -13733 4689
482 4689 14084 -2025 -6837 3897 958 -3525 7952 7727 -11114 -8873 11508 7677 -9098 -3710
$$ packed form
378h90J352k0l888J236M349j907n277K562L910k592j129L508j308l815M435M591
394E117n447l869O077K158n235O54L590m456k216P060Q79q610J02Q105j464n472
410c027L887J930n980J770Q087m252q407N706O481o134l272N832k167o105O332
425F81M951r876l601J0687O76r051L189O743p312k769J1223O98j2765K209J1629
440G312l979p474O717J282q936L801J0521q686j0421J0412P532j0526k320R192
454D427m881o991J1718N530j5715m078J6413J699j2688K106O100q084Q54J3092
468I502o121j6857Q356J5987q651j0632Q354J858q345Q372R485j5049r992J8422
482D689R395j6109m812J0734k939m483J1477k25j8841K241K0381l831j6775N388
$$ plain form
496 -3710 4204 -4582 -2338 10817 1302 -15709 -2121 14957 2133 -9990 504 3324 -4979
509 -4979 3481 10271 -6844 -13694 6741 11823 -6006 -6824 3910 -2866 -6042 10037 8093 -14202
523 -14202 -9776 13640 9309 -7809 -2507 4158 -3768 998 13386 -330 -16392 -142 15323
536 15323 553 -9098 448 -501 -6509 6224 10945 -10517 -15738 8466 13563 -5659 -7461 3531
550 3531 -1647 -2726 10664 5346 -14270 -6849 13498 6301 -8733 -2327 2093 -5185 1867 11785
564 11785 -4043 -16004 3178 15142 -1692 -8475 3410 1581 -4848 6388 10031 -8970 -11024
577 -11024 9306 9603 -6480 -4110 3435 -4565 -3433 10098 2830 -14931 -5114 12698 3025 -8868
591 -8868 -150 2766 -4921 2085 10781 -3098 -12177 3413 11507 -1902 -5881 2477 -1093 -4319
$$ packed form
496c710P914q786K244J3155r515j7011J3588J7078j2824j2123J0494K820q303
509d979Q460O790j7115o850K0435N082j7829q18J0734o776l176J6079j944k2295
523a4202M426K3416m331j7118N302O665p926M766J2388j3716j6062J6250J5465
536A5323j4770r651R546r49o008J2733M721k1462n221K4204N097j9222j802J0992
550C531n178j079J3390n318j9616P421K0347p197j5034O406M420p278P052R918
564A1785j5828j1961J9182J1964j6834o783J1885j829o429J1236L643j9001k054
577a1024K0330K97j6083K370P545q000J132J3531p268j7761R817J7812r673j1893
591h868Q718K916p687P006Q696j3879r079J5590Q094j3409l979Q358l570l226
$$ plain form
605 -4319 6685 6310 -9858 -8232 8724 6771 -6591 -2762 3562 -2826 -886 9188 1091 -11433
619 -11433 -784 11429 1154 -7483 389 2119 -3922 1961 6412 -5660 -9729 4907 7691 -5108
633 -5108 -5283 3432 336 -3335 4549 4362 -6814 -3949 8226 4029 -5402 -1047 3201 -1961 -385
648 -385 5438 -1115 -7854 1034 7128 -1512 -5338 1701 1555 -3379 1937 4876 -3518 -5172 4616 5314
664 5314 -3517 -2640 2883 -547 -2200 3433 1811 -6205 -2713 5389 1387 -4981 -1049 1800 -1607
679 -1607 113 3809 -1108 -4717 2063 5568 -698 -3280 1691 1618 -1258 1609 2240 -3119 -2844 3360
695 3360 2184 -3414 -1669 1675 -893 -1305 2331 532 -3747 -65 4277 721 -3042 372 1963
710 1963 -685 155 2053 -975 -2559 993 2248 -1751 -2120 775 350 -1307 439 1121 -1336 -634
$$ packed form
605d319J1004l75j6168J626J6956j953j3362L829O324o388J940J0074q097j2524
619a1433J0649J2213j0275q637P872J730o041N883M451j2072m069J4636K784j2799
633e108j75Q715l096l671P884j87j1176K865J2175m197r431M355M248n162J576
648c85N823o553o739Q888O094q640l826P039j46m934N316K939q394j654R788O98
664E314q831Q77N523l430j653N633j622q016L492Q102m002o368L932K849l407
679a607J720L696m917l609O780L505o266k582M971p3k876K867O31n359K75O204
695C360j176n598J745L344k568m12L636j799m279L682M342l556l763L414J591
710A963k648Q40J898l028j584L552J255l999l69K895m25j657J746O82k457P02
$$ plain form
726 -634 1990 1172 -1127 37 1265 143 -10 1440 49 -1699 339 1853 -598 -1657 213 345
742 345 -1051 -255 449 -806 -942 894 1016 -793 -372 1021 431 -496 480 637 -412 -443 610 111
760 111 -829 -383 157 -293 -449 153 -359 -434 298 696 -191 -54 510 343 168 297 464 94 178 321 -163
781 -163 -562 -2 49 -350 -563 6 -331 -622 -334 168 5 -113 76 249 202 266 228 114 298 353 72 25
803 25 -174 -14 16 -276 -296 -316 -157 35 -276 -302 123 487 81 -7 286 308 308 84 433 248 -127 -149 266 -119
827 -119 -596 -292 -64 -474 -385 -257 -221 -378 37 453 30 -174 516 769 135 251 468 141 -123 453 350
848 350 -408 -285 344 47 -587 -88 -92 -492 -514 486 -5 -517 122 725 -223 -109 732 263 -489 381 1009
869 1009 -338 -947 144 274 -605 -499 446 -610 -935 649 824 -1116 -551 1035 307 -516 467 703
$$ packed form
726f34K624q18k299J164J228j122j53J450j391j748K038J514k451j059J870J32
742C45j396P96P04j255j36J836J22j809M21J393n90r27R76J57j049l1J053m99
760A11r40M46N40m50j56O02n12p5P32L98q87J37N64j67j75J29J67l70Q4J43m84
781a63l99N60N1l99k13N69l37k91K88N02j63j18J89J73m7O4l8j14J84N5k81m7
803B5j99J60L0k92k0k0J59J92l11k6M25L64m06q8K93K2%k24L49j85l75k2M15l85
827a19m77L04K28m10Q9J28L6j57M15M16m23k04O90K53o34J16K17l27k64N76j03
848C50p58J23O29k97o34M99mm00k2J000m91n12O39O03r48J14Q41m69p52Q70O28
869A009j347o09J091J30q79J06R45j056l25J584J75j940N65J586p28q23R83K36
$$ plain form
887 703 -633 -25 1617 356 -1552 50 1253 -343 -895 486 -271 -1427 305 1266 -995 -1665 1161
904 1161 1147 -1083 -110 1318 -453 -921 1574 1104 -1706 -886 1893 167 -1709 224 652 -1656 -371
921 -371 2108 -297 -2592 558 2167 -673 -1089 1445 217 -1297 1379 2224 -1641 -2073 2144 1565
937 1565 -1768 -667 1043 -1254 -1099 2129 383 -3429 -901 3042 143 -2116 553 865 -1429 658
953 658 3238 -900 -3178 1575 3299 -1238 -1612 1261 -207 -1632 1839 1586 -3201 -2492 3041 1786
969 1786 -2581 -454 1530 -1180 -495 3408 327 -4112 139 4289 -48 -2527 478 527 -1859 1013
985 1013 2829 -2580 -3892 1908 3239 -1942 -1776 1157 -670 -1238 2892 2006 -3921 -1982 4173 1989
1001 1989 -2853 -525 1022 -1574 205 3333 -679 -4761 442 4437 -518 -2866 648 86 -1685
$$ packed form
887G03j336O08J642j261j908J602J203j596n52J381p57j156J732R61k261o70K826
904A161j4k230R73J428j771m68K495m70k810Q20K779j726j876J933M28k308J285
921c71K479k405k295L150J609k840m16K534j228j514K676Q45l865m32M217n79
937A565l333J101J710k297J55L228j746l812K528L943k899k259K669L12k294K087
953F58K580m138k278M753J724m537l74K873j468j425L471k53m787P09N533j255
969A786m367K127J984k710O85L903l081m439M251M150m337k479L005M9k386K872
985A013J816n409j312N800J331n181J66K933j827n68M130q86n927J939O155k184
1001A989m842K328J547k596J779L128m012m082N203L995m955k348L514n62j771
$$ plain form
1016 -1685 2309 3150 -3204 -3807 3492 3836 -2136 -1710 1333 -741 -810 3105 880 -4871 -1363 4480
1032 4480 1092 -3422 -541 884 -1593 844 3480 -1576 -4424 1797 4731 -1020 -2618 1253 377
1047 377 -1476 2125 2405 -3485 -3146 3375 2670 -2777 -1631 1232 -945 -624 3090 445 -4462 -295
1063 -295 4671 589 -2757 308 1180 -1591 932 2871 -1809 -4183 1655 3519 -1747 -2482 1006 -345
1079 -345 -1304 2340 1604 -3663 -2016 4062 2200 -2733 -745 1679 -762 47 2881 -397 -3995 338
1095 338 4012 -364 -2999 255 817 -1297 1021 2130 -2279 -2959 2613 2925 -1941 -1621 1384 252
1111 252 -928 1984 1016 -3026 -1166 3290 1047 -2649 -501 1237 -986 -125 1878 -850 -2814 853
1127 853 3096 -780 -1966 1081 729 -927 1297 1659 -1801 -1848 2304 1834 -2026 -1089 1202 -254 -758
$$ packed form
1016a685L994Q41o354o03P299L44n972M26L043k074o9L915k225n751L508N843
1032D480l388m514K881J425k477K437K636n056k848O221K934n751j598L871q76
1047C77j853L601K80n890L39O521p05n447J146K863k177L21L714k645m907M167
1063b95M966m082l346L065Q72k771K523J939m680k374N838J864n266p35L488j351
1079c45r59L644p36n267J647O078j862m933J988K424k441Q09K834l278l598M333
1095C38L674m376k635L254N62k114K318J109m409o80N572L12m866L20L005j132
1111B52j180K912r68m042J860M456k243l696K148J738k223Q61K003k728j964L667
1127H53K243l876j186L047l52j656K224L62l460m7M152m70l860R37K291j456n04
$$ plain form
1144 -758 1307 216 -2426 -420 2627 297 -1882 41 889 -642 175 1617 -699 -1877 1057 1990
1160 1990 -1011 -1381 620 197 -927 624 656 -1548 -1137 1780 865 -1462 -415 956 -154 -225 1139
1177 1139 199 -1482 245 1833 -332 -1327 329 596 -732 -89 862 -916 -1474 850 1008 -959 -834
1194 -834 669 196 -414 568 575 -658 -286 1191 368 -891 11 536 -282 -375 521 -314 -943 117 580
1213 580 -305 -806 422 161 -264 311 604 -391 -388 598 638 -536 -257 521 -34 -373 217 265 -582 -238 377
1234 377 52 -643 0 249 -192 -173 444 265 -334 159 434 -185 -146 414 313 -117 56 -56 -283 -261 336
1255 336 66 -436 -180 151 -174 -161 153 154 -171 296 422 192 -83 135 195 -202 -58 34 -120 -176 67 70 -72
1278 -72 -181 -148 -122 -121 60 -9 -19 169 303 156 108 297 142 28 72 -11 126 21 -77 -53 -356 -204 60 -163
$$ packed form
1144g58K065j091k642K006L047k330k179J923Q48j531Q17J442k316j178K934R33
1160A990l001l70K001m23j124J551L2k204M11K917r15k327J047J371j110p1J364
1177A139r40j681J727J588k165r95J656K67j328O43R51j778n58K324J58j967J25
1194h34J503m73o10R82Pj233L72J477q23j259R02N25q18r3Q96q35o29J060M63
1213E80q85n01J228k61m25N75K93r95LR86M0j174K79P78n55l39N90M8q47L44O15
1234C77l25o95O43K49m41J9O17j79n99M93K75o19L9N60j01m30J73j12k27K2N97
1255C36k70n02K56L31l25J3L14Jl25M67J26k30k75K18O0l97J44R2j54n6K43Lj42
1278g2j09L3K6JJ81o9j0J88J34j47m8J89j55j14M4q3J37j05r8K4l03J52K64k23
$$ plain form
1302 -163 -217 -80 166 -45 -99 95 109 74 4 227 319 -27 84 8 -138 -44 -45 56 -135 13 -61 -180 -133 157
1326 157 45 -178 21 36 -136 36 263 -28 -147 188 143 -72 -315 73 -67 -222 51 157 -400 -326 -94
1347 -94 190 -206 -77 186 -63 -281 256 239 -105 -94 332 130 -194 127 49 -375 -203 380 -45 -468 106
1368 106 86 -212 -287 60 9 -294 325 548 -45 -214 403 356 -313 -10 170 -65 -437 448 46 -798 -183
1389 -183 495 -139 -588 152 277 -413 11 571 -84 -587 331 740 -232 -346 305 -61 -515 488 483 -632
1409 -632 -639 745 176 -706 -185 325 -452 -271 750 13 -851 -114 1158 90 -425 459 152 -475 354
1428 354 861 -647 -1013 555 785 -629 -541 407 -268 -530 637 461 -1062 -570 986 637 -707 -121
1446 -121 630 -154 92 981 175 -1450 220 1251 -342 -938 142 201 -623 423 869 -763 -1251 1043
$$ packed form
1302a63n4J37K46k11n4J94J4l5p0K23R2l46J11p6j46R4jJ01j91J48p4j19M7K90
1326A57j12k23J99J5j72J72K27k91j19L35m5k15k43L88j40j55K73J06n57P4K32
1347i4K84l96J29K63k49k18N37j7l44J1M26k02l24L21p8m24J72N83m25m23N74
1368A06k0k98p5L47n1l03O19K23n93j69O17m7o69L03J80k35l72Q85m02q44O15
1389a83O78o34m49P40J25o90M24N60o55n03R18M09r72j14O51l66m54J003nj115
1409f32pJ384n69q82N21N10p77J81J021p37q64P37J272j068n15Q84l07o27Q29
1428C54N07j508l66J568K30j414Q8R48o75k62J167j76j523M92J556l49j344N86
1446a21P51p84K46Q89q06j625J670J031j593n96J080N9q24J046M46j632m88K294
$$ plain form
1464 1043 1095 -896 -497 500 -204 -241 1053 353 -1569 -317 1313 445 -1206 -190 516 -580 -95 1064
1482 1064 -413 -1619 461 1400 -472 -792 505 130 -373 789 866 -1151 -997 1309 881 -1162 -545
1499 -545 610 -437 -283 1061 118 -1656 -298 1706 265 -926 74 493 -519 518 1226 -778
1515 -778 -1497 1104 1525 -700 -891 495 -127 -587 834 648 -1541 -943 1465 776 -1075 -346 648 -141
1533 -141 230 1315 -68 -1635 276 1833 -8 -1264 232 393 -431 441 912 -1139 -1287 1195 1178
1550 1178 -859 -912 735 109 -85 1009 428 -1498 -479 1617 472 -1305 -133 498 -445 -48 852
1567 852 -372 -1736 470 1398 -395 -1265 357 252 -453 560 760 -935 -782 1289 967 -1101 -574
1584 -574 516 -97 -125 798 17 -1360 -335 1515 24 -1180 78 322 -280 121 726 -487 -1029 814
$$ packed form
1464A043N2j991L99R97p04l7J294p00j922J252J630q68j651J016P06j096M85J159
1482A064j477j206K080R39j872l20J297l75n03J162P7k017J54K306m28k043O17
1499e45J155j047J54J344r43j774J358K004j441j191J000M19j012J037P08k004
1515g78p19K601M21k225j91J386o22m60J421j86k189N98K408o89j851P29R94p89
1533a41L71J085j383j567J911J557j841j256J496J61q24Q72M71k051j48K482j7
1550A178k037n3J647o26j94J094n81j926J019K096j145j777J172O31r43L97R00
1567H52j224j364K206R28j793q70J622j05p05J013K00j695J53K071l22k068N27
1584e74J090o13k8R23p81j377J025J850j491j204J258K44o02M01O05j213n42J843
$$ plain form
1602 814 1334 -494 -817 378 356 -382 504 276 -1064 -683 874 527 -997 -413 671 -79 -246 601
1620 601 -19 -895 326 1301 30 -835 264 446 -321 169 482 -603 -810 620 693 -675 -549 504
1638 504 58 -268 317 249 -843 -53 1022 261 -709 67 480 -61 -1 474 -226 -835 158 714 -521 -680
1658 -680 245 137 -249 91 498 -510 -339 727 487 -391 -340 473 4 -108 458 71 -377 -25 493 15
1678 15 -598 -67 192 -451 -38 384 19 -518 332 640 -364 -279 172 212 -27 112 311 -275 -266 271 185 -444
1700 -444 -93 171 -199 -157 41 65 -183 57 292 -120 -258 51 214 -19 -67 216 -142 -165 202 20 -233
1721 -233 -212 67 43 -216 33 -47 -327 -159 377 -57 -41 49 166 -75 -5 109 -1 -251 125 113 10 -211
1743 -211 -7 58 -132 39 96 -53 -318 6 14 -8 -48 252 50 42 -37 -121 -115 -48 252 79 78 -17 118 -133 -80 57
$$ packed form
1602H14N20j828l23J195k2p38Q86k28j340L81J557l47j524N84J084p50j67Q47
1620F01o20q76J221R75j271q65J099J82p67M90L13j085k07J430P3j368J26J053
1638E04m46l26N85o8j092P90J075p61r70P76M13n41O0M75p00o09R93N56j235j59
1658f80R25j08l86L40M07j008J71J066k40q78N1Q13m69j12N66l87m48L52N18m78
1678A5o13N31K59o43M13M22l65n37Q50L08j004Q5M51M0k39J39J99n86RN37q6o29
1700d44L51K64l70M2J98K4k48K40K35m12j38L09J63k33m8K83l58k3L67j82k53
1721b33K1K79k4k59K49q0k80J68N36m34J6R0J17k41P0J14j10k50L76j2j03k21
1743b11K04O5j90J71N7j49k65L24Qk2m0L00k02qp9q4OO7L00j73jr5J35k51N3J37
$$ plain form
1769 57 -138 -181 -29 -89 12 -229 25 103 127 126 17 -112 -44 -74 135 149 -76 -37 -40 -29 24 141 -22 -4 26 40
1795 40 -147 102 77 31 93 44 150 48 46 108 -58 33 16 8 -74 219 103 16 -153 54 -18 19 -126 3 14 31
1821 31 98 24 -95 49 291 -185 -16 9 73 61 -164 38 -125 53 -154 69 -41 -123 20 -92 3 55 123
1844 123 -54 -66 210 10 35 282 112 58 -98 218 -70 -165 -64 40 -57 -72 -102 -64 -195 63 -2 -27 85
1867 85 132 27 -74 38 246 -110 13 94 276 -27 -318 109 -207 -267 33 99 -160 -188 95 101 -233 -85 107
1890 107 19 -175 433 -147 -286 144 326 -51 -220 -2 1 -244 -24 -32 -89 -209 160 91 -84 -67 323 29 52
1913 52 130 148 -171 -69 328 -36 -51 32 147 -142 108 155 -115 -306 190 504 -102 -237 239 209 -229 257
1935 257 195 -336 -144 314 309 -139 -30 235 -97 -149 261 -174 -473 140 498 -14 -419 119 167 -43 1 311
$$ packed form
1769E7j95m3J52o0J01k41K54P8K4jj09j29O8l0K09J4k25L9lJ1N3J17j63J8L0J4
1795D0j87K49k5m6O2m9J06j02kO2j66R1j7qq2K93j16q7j69K07p2L7j45J29J1J7
1821C1O7p4j19J44K42m76J69K5O4j2k25K02j63J78k07K23j10q2J43j12R5N2O8
1844A23j77j2K76k00K5K47j70n4j56L16k88r5J01J04r7j5l0L8j31K58o5k5J12
1867H5M7j05j01J12K08l56J23Q1J82l03k91M27l16o0L00O6k59k8K83Ol34J48J92
1890A07q8j94O08n80j39M30J82l77j69K18Lk45K20qn7j20L69o9j75J7L90k94K3
1913E2P8J8l19J02L97l64j5Q3J15k89K50M7k70j91M96L14o06j35M76l0m38M86
1935B57o2n31J92M58nm48J09K65l32n2M10m35k99O13L58n12m05N38M8k10M4L10
$$ plain form
1957 311 -133 -387 167 393 -236 -262 87 81 -207 271 135 -369 -151 322 194 -463 27 390 14 -106 325
1978 325 -35 -530 -25 468 -176 -343 63 37 -161 231 212 -336 -345 415 238 -219 -356 165 37 113 338 114
2000 114 -449 -44 625 67 -312 -94 358 16 -51 354 -130 -454 102 453 -263 -384 84 25 -176 313 339
2021 339 -380 -396 457 137 -293 -181 170 -52 -153 202 -55 -387 -28 555 -8 -550 -217 265 -115 -14
2041 -14 426 -342 -332 296 501 -341 -289 201 37 -70 312 225 -334 -160 568 219 -421 -121 180 -31 -260
2062 -260 261 -118 -519 32 311 -42 -300 -111 246 -112 112 266 -307 -322 312 316 -400 -300 141 78 -198
2083 -198 116 112 -458 -145 364 60 -430 63 246 -99 64 150 -78 -292 219 414 -91 -392 6 240 23
2104 23 108 -14 -484 -269 467 276 -381 -64 226 77 53 91 5 -272 -16 242 117 -371 -38 109 -31 -75
$$ packed form
1957C11m44k54N54K26o29k6L49ok88M78j36n04K18M73j28o57M90L63l76j20M31
1978C25l60m95N05M93o44j67M06k6j98L92j9n48rP60j77m57j37N21j28P6K25k24
2000A14n63M05O69n58l79K18M52l42o7M05m84l24N56L51p16j21M68n9k01M89K6
2021C39p19j6Q53l20m30J12L51k22j01L55k57l32L59N83n63n42L33M82l80J01
2041a4M40p68J0O28K05q42N2M90j64j07L82q7n59J74P28l49o40L00L01k11k29
2062b60N21l79m01N51K79l53k58J89L57l58K24J54n73j5O34Mp16J00M41o3k76
2083a98L14mn70L13N09l04m90M93J83l45J63Q6k28k14N11J95n05l01L98K34k17
2104B3Q5j22m70K15P36j91o57L17K90j49k4L8q6k77K56K58j25m88L33J47j40m4
$$ plain form
2126 -75 182 -256 -251 115 267 -155 -191 69 149 -48 -137 334 -180 80 215 172 -235 -188 105 21 29 210 -4 -263
2150 -263 -24 118 -109 -249 79 48 -39 -50 124 -63 -221 137 105 -237 -84 105 -4 -186 -33 53 -212 -139
2172 -139 167 -53 -269 -97 -139 -27 153 -86 -42 -111 40 88 -86 60 2 93 -28 150 92 -177 -158 -37 6
2195 6 -219 -191 110 191 -43 49 55 -26 71 175 19 -60 -7 -46 9 -142 5 -45 -77 74 98 126 -3 71 25 -27 18
2222 18 126 -7 94 290 34 -42 33 127 -31 101 72 18 -81 53 -28 43 -40 -99 24 -128 -54 38 -14 -44 -74
2247 -74 115 -43 -155 35 -10 4 76 -39 117 98 56 182 -250 -167 66 -90 261 -131 -8 90 149 68 -25 -75
2271 -75 81 -49 121 -15 -74 -14 -121 -13 -49 62 -33 -103 213 120 -156 -72 -58 130 -55 102 -3 126 63
2294 63 24 -81 24 -61 -52 24 63 18 -216 -70 64 149 -168 41 -139 123 -7 -151 71 74 226 -120 -20 263
$$ packed form
2126g5K57m38NL66J52m22l6K60Q0j97q9M71n14K60J35m3m07M7K93q4QJ81k14k59
2150b63K39J42k27j40L28l1q7j1J74j87j58L58l2l42J53J89j09j82J53Q6k65P3
2172a39L06k20k16J72m2J12J80k39M4o9J51M8j74J46n8R1j21J78n8k69J9J21M3
2195Fk25K8L01Q1k34R2Oq1R7J04j56p9N3l9N5j51J47n0l2J51K4K8j29P4m6n2M5
2222A8J08j33J01J96k56p6P5R4j58J32k9n4r9J34q1P1q3n9J23j52P4R2n2l0l0
2247g4J89j58j12J90m5J4P2j15J56j9m2J26m32Q3K33j56L51l92J23R8N9q1r3n0
2271g5J56j30J70j36n9O0j07J08l6J11r5p0L16r3k76Q4J4J88j85J57j05J29o3
2294F3l9j05J05q5RP6L9m5k34J46J34Q5l17K09j80K62j30j44K22LJ52l46J00K83
$$ plain form
2318 263 8 -156 55 45 -9 -233 86 -28 -131 -166 -4 113 -137 -63 28 84 -69 7 -5 68 -256 21 4
2341 4 68 189 19 -37 131 -41 -73 188 -34 77 -102 55 -31 -75 75 77 -24 -83 -77 90 129 93 -64 -67 77
2366 77 -157 211 -49 -90 27 67 41 5 -51 -159 -16 91 87 -145 183 100 -30 139 76 23 -17 -129 -19 52
2390 52 -21 151 88 86 -178 -90 59 0 -150 34 -112 -82 2 -2 76 141 3 119 97 -58 22 -160 -52 7 260
2415 260 -36 -81 -30 -15 -75 4 -67 -198 -51 120 -141 43 67 -6 -30 123 71 -77 -165 83 -45 -84 -84 190 -73
2440 -73 117 170 54 63 -55 9 -137 66 6 -14 -77 -27 180 31 -170 -50 198 -28 -13 1 55 42 65 -9 -56
2465 -56 168 28 110 -57 50 80 -6 135 -3 -42 -63 -96 283 -59 -82 -51 -174 -89 64 -11 -18 0 171 241 -35
2490 -35 -128 -35 107 71 154 -11 -57 22 184 -62 1 15 286 73 -28 38 -11 -49 -64 212 -19 -5 28 147 143 -3
$$ packed form
2318B63k55j64K11j0n4k24L19j14j03l5J62J17k50P4R1N6j53P6j2P3l24K77j7
2341DO4J21j70n6J68j72l2K61k22J11j79J57q6m4J50Kj01n9OJ67L9l6j57lJ44
2366G7k34L68k60m1J17M0k6l6n6j08J43J07mk32L28q3j30J69o3n3m0j12J10P1
2390E2p3J72o3kk64Q8J49n9j50J84j46L0Q4mP8O5j38J16k2j55Q0j82J08N9K53
2415B60k96m5N1J5o0P9p1j31J47J71k61J84K4p3k4J53n2j48q8K48j28l9%K74k63
2440g3J90N3j16Rj18O4j46K03o0k0o3N0K07j49k01J20K48k26J5J4N4j3K3p4m7
2465e6K24j40Q2j67J07L0q6J41j38l9k1l3L79l42k3L1j23Q5J53p5pJ8J71P0k76
2490c5r3R3J42l6Q3j65m6P9J62k46O3J4K71k13j01O6m9l8j5K76k31J4L3J19mj46
$$ plain form
2516 -3 38 -171 -56 91 144 -219 18 65 43 30 -13 -50 -191 62 -49 57 -98 -12 -72 -52 -71 71 -105 -126 -82
2541 -82 87 33 -15 33 -88 22 175 245 24 -97 2 -63 -226 114 70 -142 25 -99 156 46 -11 221 -156
2564 -156 5 -65 -176 -98 3 136 -29 -19 92 -84 2 -62 -5 -40 -71 -194 -16 -86 -50 201 1 -86 50 61
2588 61 -34 95 55 48 -110 -36 188 254 -116 -25 71 59 -171 145 -38 -42 -8 103 44 -56 120 131 -7 24 183
2613 183 -172 28 38 12 26 96 75 -68 -24 43 -41 -15 33 183 -183 -35 49 -96 -76 -120 -43 30 14 49 -109 -55
2639 -55 46 131 -93 63 128 23 9 164 10 -21 -200 117 9 88 37 -157 -38 -124 137 5 -173 52 -164
2662 -164 -18 -19 31 84 -149 18 -48 -7 -156 298 175 67 47 -68 -92 -172 -43 -28 -200 -124 -206 -8 -100 98
2686 98 90 -63 6 -123 -28 -49 149 134 83 -202 181 30 52 7 37 -30 -27 -222 -26 22 24 33 32 7 -47 23 173 16
$$ packed form
2516cM1k09J15J47N3l63K37M7k2j3m3l7j41K53j11J06j55Q6o0K0j9J42j76k1M4
2541h2J69n4m8M8j21J10J53P0k21j21R9o5j63L40m4k12J67j24K55j10n7K32l77
2564a56J61p0j11P8J01J33j65J0J11j76Q6o4N7l5l1j23J78p0L6K51k00q7J36J1
2588F1r5J29m0pj58P4K24O6l70R1R6j2k30L16j83mL4J11n9j00J76J1j38L1J59
2613A83l55K00J0k6J4P0k1j43M4O7q4K6M8J50l66J48Q4j45K0m4P7P3j6L5j58N4
2639e5J01Q5k24J56O5j05j4J55j54l1j79L17j08P9n1j94J19q6K61j32j78K25k16
2662a64J46jN0N3k33J67o6M1j49M54j23j08k0j15k4q0J29J5j72P6q2J98r2J98
2686I8qj53O9j29R5k1J98j5n1k85L83j51K2m5L0o7Lj95J96M8KRjk5n4P0J50j57
$$ plain form
2714 16 -25 114 22 -35 32 -114 -12 73 93 -101 96 -199 -35 -53 -50 -36 59 -119 66 5 117 -20 38 18 -17
2739 -17 15 -84 122 113 87 68 177 79 72 -46 179 -116 153 53 66 -93 -37 68 114 -57 -164 70 -7 38 134
2764 134 -135 -75 228 -136 -11 28 -4 -80 9 -74 -121 -89 134 169 134 130 -84 -173 70 -32 9 32 34 29 35 29 -10 -49
2792 -49 60 -66 -73 -17 -27 49 -145 -42 -57 -88 113 25 102 -126 203 -76 -41 -65 -35 -36 -13 154 -43 -18 -71 -46
2818 -46 93 18 -20 31 -56 -160 -119 7 71 55 -88 10 196 10 121 104 118 144 70 -153 155 75 57 -14 -40 38
2844 38 113 97 -57 -114 2 13 -60 32 15 4 2 50 -95 -3 -140 40 -181 -142 -5 -24 30 146 -184 -46 -104 41
2870 41 54 89 88 71 47 -119 -116 -126 -10 -87 60 -55 -114 55 -39 -34 -116 -22 67 62 17 -27 121 26 -38 6 -32 90 55
2899 55 89 84 24 -69 -13 42 -114 10 7 17 74 -32 -80 -56 -118 13 82 80 57 -84 28 0 -64 -95 3 83 18 184
$$ packed form
2714A6m1J39r2n7O7j46J02Q5K0j94J97k95J64j8LJ4R5j78J85o1J12j37N8k0l5
2739a7L2r9K06rk6j9J09r8pj18K25k95K69j00J3j59N6J05M6j71j07K34p7M5R6
2764A34k69O0L03l64J25L9l2p6Q9q3m7L2K23L5l5mk14q9K43j02M1K3KnOol9l9
2792d9J09j26pN6j0P6j94J03j5l1K01q8P7k28L29k79L5k4L0jK3J67j97K5n3K5
2818d6J39p5l8N1q7j04M1J26O4j6j43R8J86j86J11j7J4K6p4k23L08q0j8p1k6P8
2844C8P5j6j54n7J16J1p3R2j7j1kM8j45R2j37J80k21L9J37j9N4J16l30J38n8J45
2870D1J3L5jj7k4j66Lj0J16p7J47j15n9J69r4Nq2R4Q9nm5m4J48r5o4M4l8J22l5
2899E5L4no0r3N6N5j56J24lJ0N7j06m8K4o2J31O9kk3j41J12k8o4l1R8Q0o5J66
$$ plain form
2927 184 189 -56 -136 -47 -2 136 -179 -119 76 126 46 26 -170 4 136 110 -116 243 166 5 55 -6 187 -151
2951 -151 42 -23 -173 -2 11 4 -37 149 96 -137 176 43 -11 61 86 -177 82 -44 -128 -125 37 -12 76 34 -26
2976 -26 -25 -174 37 -104 -42 15 -8 142 -39 10 -41 -77 -95 190 146 177 -61 11 -10 55 -1 -12 -124 -159 27 -74
3002 -74 11 -119 77 -61 -40 -111 -6 77 -39 107 -90 -62 -39 37 216 -54 -96 73 -150 -92 112 -82 -109 101
3026 101 -35 174 -23 98 -7 -1 -34 113 13 -13 206 88 62 -34 16 -171 -92 9 15 -44 17 68 -144 -63 -19
3051 -19 71 58 183 239 81 -57 97 -7 -20 -84 -117 149 5 96 55 47 27 -28 -32 40 -99 57 85 222 59 -55
3077 -55 64 -116 111 -177 -121 -23 -57 1 277 48 22 65 20 -219 -47 -249 41 185 7 -48 130 -76 61
3100 61 99 168 189 -155 74 -117 29 -125 241 47 -100 64 -41 -46 -19 128 51 -24 -62 -22 50 62 -164 -7
$$ packed form
2927A84Nk45q0Q9M5J38l15O0J95N0q0k0j96J74J32k6k26L59p7j61N0o1J93l38
2951a51J93o5j50J71J3pm1J86n3k33L13j33n4P2K5k63K59j26q4LJ62m9Q8m2o0
2976b6Jj49K11j41O2N7k3J50j81M9n1l6j8K85m4L1k38P2k1O5n6j1j12l5J86j01
3002g4Q5j30J96j38K1p1J05Q3j16J46j97K8K3P6J79k70m2J69k23N8K04j94k7K10
3026A01j36K09j97J21j05Ol3J47j00k6K19j18k6r6N0j87P9J01On9O1N1k12Q1M4
3051a9R0j3J25N6j58j38J54j04j3o4l3K66j44R1m1qk0n5mP2j39J56K8J37j63j14
3077e5J19j80K27k88N6R8l4N8K76k29k6M3m5k39J72k02K90J44j78n5J78k06J37
3100F1L8O9K1l44K29j91J46j54L66j94j47J64j05nK7J47p7p5l8M0P2J2k26J57
$$ plain form
3124 -7 54 -12 85 -37 -104 0 -11 -128 -71 -114 142 162 -19 -23 -32 56 152 -22 5 290 -22 -11 -48 -61 110 12 -96
3151 -96 -54 42 -236 89 262 -147 -56 4 159 -79 166 59 -120 -157 -42 -65 -25 -10 31 -20 115 76 -35 54
3175 54 -99 -113 -159 111 21 -36 -95 38 1 81 -114 10 -89 -79 125 -10 127 76 -3 56 101 -36 107 93 80
3200 80 28 -8 -8 3 -113 73 -26 -41 -83 15 109 -106 -31 -36 -211 -72 -8 114 -16 -6 14 35 -150 -46 -56 4 172
3227 172 75 7 16 56 -150 10 -50 -10 53 65 -63 8 79 0 110 -115 -58 144 -112 42 -10 20 77 176 61 -4
3253 -4 -36 43 -80 113 -89 -123 -3 -57 -10 -69 -116 -88 31 31 -14 34 -90 -52 19 36 118 -16 -82 152 -42 272
3279 272 -13 43 -42 77 141 79 104 -124 -27 -33 -55 -80 124 139 34 123 18 66 85 46 -81 8 -3 30 -118 51
3305 51 117 -6 -24 47 -30 131 -219 -123 -2 8 54 -115 139 -91 -138 -89 -84 143 36 42 -64 -61 22 41 40 -25 -67
$$ packed form
3124gO1o6R7j22o7J04j1j17N7m3K56K0j81mrQ8R6j74K7K85l12J1l7j3J71r8j08
3151i6M2R6k78L25J73m09R1O0J55k38K45j07j79l7J15k3M0J5M1n1J35l9j11Q9
3175E4j53j4m6K70r0n7n9J33l7Q0j95J24r9J0K04j35J37n1p9N9M5j37J43j4j3
3200H0n2l6%J1j16J86r9j5m2R8R4k15P5nj75J39O4J22j30J0K0K1j85J04j0O0J68
3227A72r7o8RM0k06J60o0M0O3J2j28P1P1p9J10k25N7K02k56J54n2L0N7R9j15o5
3253dl2P9j23J93k02l4J20n4M7n9m7K8J19%m5M8j24L8P1J7Q2j34o6K34j94L14
3279B72k85N6q5J19O4o2K5k28R7ok2k5K04J5j05Q9j05M8J9l9j27Q9j1L3j48J69
3305E1O6j23j8P1p7J61l50R6J21J0M6j69K54k30m7M9NK27j07Oj06LQ3J9jo5m2
$$ plain form
3332 -67 53 -80 -162 -61 -88 -100 93 44 126 14 49 -131 -182 211 -91 75 -55 41 36 172 66 73 -53 -12 -49
3357 -49 132 40 31 108 42 78 -46 36 86 -12 -70 -48 67 -33 37 8 165 68 64 56 3 -64 -43 55 -6 -61 -91 -17 -111
3386 -111 -36 162 28 -9 14 248 109 -47 -6 90 129 83 63 81 131 38 -110 1 51 68 -100 -71 -95 93 -40
3411 -40 -47 -5 -115 9 2 -215 63 171 -206 -58 142 72 -50 39 127 -67 -136 -46 -111 158 -49 -161 32 72
3435 72 137 -44 -116 80 13 -65 17 73 165 146 189 -77 94 37 -56 109 139 -135 58 -86 25 -37 4 16 -40 75
3461 75 -134 -27 -47 87 33 5 180 -145 -24 -16 -156 219 43 43 15 -3 -8 -136 22 42 182 -76 -202 129
3485 129 128 -97 17 22 -33 37 -114 -97 51 71 -36 -176 89 -130 -132 -170 9 63 -25 62 86 -131 160 11 -38
3510 -38 -112 -56 0 -78 -42 -9 47 -163 54 146 42 -25 -5 104 17 -58 85 -256 4 -1 98 -74 9 -57 16 37 7
$$ packed form
3332f7J20j33q2J01k7j2J93m9Q2j12L5j80n1L93l02J66j30R6nJ36j06Pj26M1l7
3357d9J81r2rP7o6L6j24Q2N0r8n8K2J15j00P0k9J57r7mqn3o7K1R8o1n5l0P4r4
3386a11P5J98j34l7K3K34j39j56M1R6L9m6k0J8N0r3j48J11N0J7j68K9k4J88j33
3411d0pM2j10J24pk17K78J08l77J48K00p0j22Q9Q8j94o9R0o5K69k07j12J93M0
3435G2O5j81p2J96o7p8Q2N6R2j9M3k66J71n7r3J65L0k74J93j44J11o2M1J2n6J15
3461G5k09J07k0J34n4k8J75l25J21Qj40L75j76%k8j8nj28J58K0J40k58j26L31
3485A29jk25J14Nn5P0j51J7J48K0j07j40K65k19kl8J79N4q8Q7K4k17K91j49m9
3510c8p4N6N6p8L6L3N6k10K17R2j04o7K0J09q7p5J43l41K60nR9j72Q3o6P3K1l0
$$ plain form
3537 7 -46 -165 124 -8 80 30 28 -116 -66 77 78 -101 -141 51 101 -142 -66 54 32 -262 99 59 7 59 -88 -50
3563 -50 123 10 -36 -130 42 -73 31 -140 14 83 7 78 -116 -81 63 50 100 -46 -81 26 92 -149 -158 -14
3587 -14 53 39 -48 -31 5 50 -129 -46 -39 6 -71 -27 -3 65 -44 34 -85 41 69 -150 -58 38 190 -29 -151 24
3613 24 -23 143 -47 -10 58 15 61 34 134 6 -117 -56 72 82 160 -28 50 54 95 107 137 -14 -96 -41 -174 27
3639 27 -71 -42 30 -131 -201 73 14 -119 -81 -25 -124 -82 -27 -111 -33 9 142 -82 -4 45 45 75 47 123 47 27 7 79
3667 79 2 94 112 -118 -20 104 -67 -108 28 -132 -36 11 -41 16 -15 -68 93 64 15 -4 -30 14 -43 -11 48 11 -61
3694 -61 33 -28 -43 40 -81 -19 -40 -157 -277 -137 -113 -36 -116 73 73 -116 23 153 15 -242 -176 -15 -35 -20 -24 25
3720 25 20 26 75 -73 116 13 -92 -44 -75 -67 -62 66 -2 3 86 -135 213 -50 3 15 70 31 15 -15 -84 -130 -57 209
$$ packed form
3537Gn3j19K89j32Q8n0kj44N0J43Jj79m0J92N0k43P6J20k2k94L61m0n2N2j47L8
3563e0J73j13m6r4J72j15J04j71J54O9p6P1j94L5J44j3N0j46l5J07O6k41rJ44
3587a4O7j4q7J7L6M5j79Q3PM5p7M4K4O8j09P8j19J26K8k19R2R6J52k19j22J75
3613B4m7J66j90L7O8m3M6k7J00j28j23O1J28J0P8j88P8MM1J2L0j51q2N5j33K01
3639B7r8K9P2j61p0K74n9j33L8N6r9M2N5q4P8M2J33k24P8M9%L0k8P6p6k0k0P2
3667G9p7R2J8k30R8J24j71m1J36j60R6M7n2N7l1n3J61k9m9j9k6M4n7L2N9l7p2
3694f1R4o1j5Q3j21O2k1j17j20J40K4P7q0J89%j89J39J30j38k57O6J61k0J5mM9
3720B5nOM9j48J89j03j05M8l1QNJ28o8NQ3k21L48k63N3J2N5l9j6l0o9m6P3K66
$$ plain form
3748 209 -89 -82 81 -22 111 84 131 -47 -64 -131 63 153 23 63 -18 -2 -118 17 -134 2 -1 54 -24 -14 43
3773 43 111 83 36 -73 -19 113 -103 -54 1 101 -70 -69 152 -84 5 -13 -7 -100 143 -71 -27 48 248 -27 40 -34
3799 -34 18 122 -218 13 -135 -88 -5 -48 40 99 52 -11 -54 -171 90 154 76 194 -20 -36 -19 124 -38 34 -80
3824 -80 -45 51 135 79 206 76 -125 -76 -193 -50 -10 -36 -87 140 -6 78 143 77 35 -21 131 -89 74 8 22
3849 22 47 158 -95 -6 165 26 152 45 -98 147 46 58 4 97 65 -22 73 10 142 110 100 16 24 216 37
3874 37 64 101 94 -53 -14 47 14 -176 -21 16 -65 67 -30 199 67 101 27 22 99 19 9 -50 60 -118 34 -34 26
3901 26 31 23 149 11 241 7 110 200 -9 139 8 41 69 73 25 46 157 -68 -25 -60 86 -105 -116 73 -87
3926 -87 -28 -89 84 -72 -30 -90 38 -147 -156 16 -20 40 46 22 55 43 73 156 -213 109 -95 -192 28 74 -79 -71 14
$$ packed form
3748B09k98PJ63j03J33k7M7j78j7o7J94R0j30M0q1J6j16J35j51J36lN5p8J0N7
3773D3O8k8m7j09N4J32k16M9N5J00j71JK21k36Q9j8Or3K43k14M4P5K00k75O7p4
3799c4N2J04l40K31j48M7Q3m3Q8N9m7o3m3j17K61O4p8J18k14j6J7J43j62P2j14
3824h0L5R6Q4n6J27j30k01M9j17J43M0k6n1K27j46Q4O5o6m2n6J52k20J63o6J4
3849B2K5J11k53Q9J71j39J26j07j43K45j01J2n4R3l2q7R5o3J32l2j0q4QJ92j79
3874C7K7L7pj47L9O1l3j90J55L7q1J32r7K29j32L4p4nP7q0j0n9J10j78J52o8O0
3901B6NqJ26j38K30k34J03R0k09J48j31L3K8Mm8K1J11k25M3l5J46j91j1J89j60
3926h7N9o1J73j56M2o0J28j85rJ72l6O0Ok4L3j2L0Q3l69L22k04r7K20M6j53QQ5
$$ plain form
3953 14 -69 -26 -30 96 -22 22 103 -47 -159 74 -228 72 1 -12 -124 -55 -162 -37 -89 67 64 92 -174 -8 63
3978 63 87 -151 20 31 -9 185 86 12 213 20 31 160 8 -182 -62 4 71 37 105 -88 46 -65 -139 67
4002 67 -83 -51 71 -6 -82 -90 -24 -36 -42 -43 -85 -140 -28 -155 38 27 -32 -77 86 121 -70 -63 96 45 -22 49 35 -23
4030 -23 75 61 -17 -86 190 -82 -130 86 -24 -21 74 102 -42 163 3 34 53 -57 -42 6 42 -75 92 -33 90
4055 90 -43 -38 3 -95 -111 -226 -221 128 166 -177 64 -20 63 92 5 -42 50 106 99 -10 -49 62 -9 19 -134 -83 -40 78
4083 78 76 -96 42 -14 83 -200 1 -17 -54 -24 40 35 -46 4 -128 56 35 257 106 -40 5 -54 7 41 45 -47 3
4110 3 36 44 154 -50 -60 168 -85 194 11 99 -32 -59 -20 -75 223 65 22 -47 8 -37 -57 85 8 53 -21 -91
4136 -91 14 -3 15 34 8 64 -136 40 159 -10 136 42 57 44 15 -19 -162 -29 28 10 -67 -61 -134 -44 32 101 -221
$$ packed form
3953A4q3M3mJ26j18M4Q1j50j12K33l02L00p1j3j12O9j07J25n2J56lK8k66J66P1
3978F3K4k38J71J1m0J94r9p4K01j93J1J29j52j90J20O6O7l4O8j93J34j11p4K06
4002F7j50L2J22p7p6qO6j2ojm2n5J12j27J93j1n9m5J63L5j91PJ59n1o7P1j4n8
4030b3R8j4p8o9K76k72m8K16j10LR5K8j44K05j60L1J9j10J5M8L6j17J67j25J23
4055I0j33NM1r8j6j15NL49L8l43K41q4Q3K9q7m7R2N6pj09l9J11p1K8j53N1M3J18
4083G8kj72J38n6R7k83K01j8l7L0O4nq1N0j32J84k1K22j51j46M5n9O1L4Mr2N0
4110CL3QJ10k04j0K28k53K79j83Q8j31k7L9n5K98j58m3o9N5m5k0J42p7M5p4p0
4136i1J05j7J8J9k6N6k00J76J19j69J46r4J5j3k9l4j43J33N7j8p7Op3R0P6O9l22
$$ plain form
4163 -221 -37 35 -42 107 253 -132 6 34 92 -15 27 62 -147 -56 -152 -85 135 -28 -34 -35 -128 -23 139 -23 73
4188 73 -21 28 107 -41 -94 -255 -59 -54 106 -89 209 -18 21 -106 -54 57 15 -107 -2 73 97 27 45 29 182
4213 182 -33 92 45 -40 119 -92 55 -173 -25 -42 -69 80 -91 3 6 54 -7 181 -88 -37 35 -60 -118 -64 -189
4238 -189 137 22 -90 -77 -75 -31 -97 -41 -74 -21 -5 -50 -96 -55 -22 -141 -3 32 -87 22 -68 -60 -8 175 87 -43
4264 -43 -50 -38 -81 -113 12 70 -4 -42 -41 158 -16 -81 106 53 53 -34 105 92 83 -56 94 21 -93 -29 15 193 -67
4291 -67 -102 -44 106 -68 4 -23 -113 24 -98 -8 11 -93 -250 215 -40 -95 -48 159 15 -43 22 -23 71 -15 -36
4316 -36 61 -88 -95 -72 66 31 96 -189 -44 159 -4 -9 125 70 -107 68 73 -122 222 86 -68 98 -99 -21
4340 -21 25 178 19 -23 -207 -108 -78 -131 78 -9 66 51 83 -12 24 157 25 -137 -100 32 88 -8 10 -27 -44 67
$$ packed form
4163b21J84P2p7J49J46l85J38K8N8j07M2L5k09R1r6O7K20j63ojr3J05J62j62R6
4188G3r4M9P9j48n3j61J96NJ60j95K98k27L9j27N2J11m2j22J05P5K4p0J8j6J53
4213A82k15J25m7q5J59k11J47k28J48j7k7J49j71R4LM8o1J88k69N1P2r5n8N4j25
4238a89L26j15j12J3KM4o6N6l3N3J6m5m6M1L3j19J38L5j19J09r0QN2J83q8j30
4264d3pJ2m3l2J25N8p4l8JJ99j74o5J87n3%q7J39j3rj39J50p3j14O4M4J78k60
4291f7l5N8J50j74P2k7r0J37j22R0J9j04j57M65k55n5M7K07j44n8O5m5R4q6k1
4316c6R7j49pK3J38l5O5k85J45K03j63nJ34n5j77J75Nj95L44j36j54J66j97P8
4340b1M6J53j59m2j84R9L0n3K09q7P5j5L2r5L6J33j32j62L7J32N6r6J8l7j7J11
$$ plain form
4366 67 135 -64 164 79 2 32 47 14 -49 -10 -46 82 117 -49 -27 -84 -111 74 -23 -94 -83 150 -3 31 -38 -106 17
4393 17 127 55 66 169 83 54 144 -46 29 -59 266 166 13 2 -78 -57 -95 -5 -20 23 -72 -125 185 78 -30 60
4419 60 56 58 -33 7 41 -77 -134 -99 -6 12 -16 38 -61 -156 165 41 -30 157 153 40 -45 73 81 23 -235 -74 -103 153
4447 153 -32 69 49 73 28 -46 71 -162 149 13 -1 84 -122 131 45 -101 -21 63 -155 -167 -60 -17 40 -115
4471 -115 -173 95 -130 -38 10 -23 55 -42 -34 -26 16 -24 42 66 59 73 98 24 37 26 -100 23 -54 133 -45 -109 62 65
4499 65 177 127 -222 -67 -71 -111 2 32 -35 -70 -105 -32 41 -21 -84 131 -5 -114 136 150 -27 -170 -56 -91 13
4524 13 -105 113 143 98 -51 82 21 -63 14 7 -22 -13 -92 -17 52 73 77 -139 -28 -60 -10 18 -28 -76 120 78 108 128
4552 128 -54 -21 -37 10 54 106 -92 -87 -116 -91 -98 -51 65 27 56 44 -109 9 30 -31 12 117 103 -41 -11 -30 63
$$ packed form
4366F7O8j99K28q5p7L0J5l3o3L9l6J28L5j66K2n7k7J85r7p1J1K33j53L4o9o8J23
4393A7J10p2J1J03q6k9R0j90P5q8L25j00j53j1q0K1l8R0j5M3r5n3L10j07j08R0
4419F0mKr1M0L4j18n7L5R3J8k8N4r9r5L21j24p1J87mj13q5J18Qn8k58J61k9K56
4447A53j85J01k0K4m5p4J17k33L11j36j4Q5k06K53q6j46Q0Q4k18j2J07M3N7j55
4471a15n8K68k25R2M8l3P8r7QQM2m0O6K4pJ4K5p4J3j1j26J23p7J87j78o4J71L
4499F5J12n0l49J55mm0J13L0o7l5l5P3P3o2o3K15j36j09K50J4j77j43J14l5J04
4524A3j18K18L0m5j49J33o1q4P7pk9Rp9P5O9K1Mk16J11l2N0K8m6m8J96m2L0K0
4552A28j82L3j6M7M4N2j98Nk9K5pM7J16l8K9j2j53J18K1o1M3J05j4j44L0j9R3
$$ plain form
4579 63 2 86 26 100 80 -144 31 -19 32 -129 -19 63 -12 -6 8 -109 43 111 -5 -20 -141 -95 4 274 29 190
4605 190 124 36 -68 -107 44 -138 -73 -187 -133 -88 102 0 -85 -164 -79 33 -91 -43 -176 134 -63 2 9 -6 -86
4630 -86 -54 43 -81 -57 43 -21 -204 106 -1 -19 -69 171 -72 53 -93 -21 -120 109 -5 3 110 -35 32 -261
4654 -261 -4 52 107 -37 48 -126 -100 32 -10 28 -124 86 86 144 -15 -163 175 -7 -4 -70 -61 -17 -95 -31 -190 84
4680 84 29 -27 -28 5 2 -150 35 -62 40 -67 -114 -157 -97 -144 27 43 125 -36 -74 109 80 -107 203 42 -46 -82
4706 -82 130 158 104 48 75 1 -48 172 -5 81 185 -85 145 -141 -98 9 52 -26 65 34 234 100 15 -51 -8
4731 -8 58 -157 -24 119 -58 -79 -25 74 59 -13 38 202 98 78 55 134 55 54 49 -40 -19 15 -85 -50 -78 -59 130 -86
4759 -86 -80 -33 31 2 -87 151 -10 -26 206 -17 123 -21 -13 43 2 90 59 -58 -74 69 169 66 2 -19 73 -33
$$ packed form
4579F3o1Q4o0P4k0k24J75n0N1j61J10Q2p5OJ4j17J52O8j16j5j21M6R9K70k45J61
4605A90o6q8j04l9J51j82O5j14N4M5J90j02q5p9Q5J12j24M8j33L10j97O5Pj5q0
4630h6L2R7j24K4J00o4j83L10j07j8n0K40k43J25j46P2r9K29j14QJ07j45O7k93
4654b61K57N6N5j44Q5j74K6J32m2L8j52K10%N8j59j48L38j82Lo6RM4p8O4j59K74
4680H4n5n6jL3lj52J85r7J02j07m7m3O0m7J71J6Q2j61l8J83k9j87L10j61q8l6
4706h2K12K8n4n6K7p4m9K20j77Q6J04k70K30k86M3J07M3p8R1l1K00j34q5o6M3
4731hO6k15J33J43j77k1N4R9j5p2N1J64j04k0k3P9p9jnq9K1L4j00L5k8J9J89k16
4759h6OM7O4k9q9K38j61j6K32k23J40j44QN6m1Q8l1j17j6J43J00j03o4k1R2j06
$$ plain form
4785 -33 170 124 -60 121 -130 -121 -56 21 -168 -47 139 154 166 -32 -16 -41 29 -86 25 23 13 4 -119 -83 -95 -23
4811 -23 -112 -20 101 -20 132 -122 93 -99 107 109 52 -51 -115 163 26 -66 -143 64 -99 55 71 -51 108
4834 108 7 55 -36 -54 -10 55 -45 37 -36 -46 -89 160 116 76 -20 -115 -20 62 73 -29 12 -80 99 16 118 49 58
4861 58 -4 -117 117 6 -45 -5 -80 64 67 17 -10 1 -35 155 139 -96 -53 85 -40 212 -123 -103 94 -2 -81
4886 -81 113 -39 -170 -41 -94 29 -45 -81 109 -118 -40 -37 -127 -105 -101 65 42 15 33 75 21 -100 -63 -1 -71 -81 54
4913 54 -146 29 40 -13 106 -5 48 -143 -74 -242 -65 -5 26 4 -36 -39 -37 42 -65 97 19 -28 24 79 -29 12
4939 12 -188 19 103 -5 42 92 -15 52 -114 -26 136 45 -132 -76 93 87 66 40 -51 70 36 61 39 2 100 -27
4965 -27 -97 89 -114 -60 11 44 -70 -73 -90 99 -131 -102 229 8 99 -236 39 48 43 -65 119 -60 -9 146 76
$$ packed form
4785c3K03m6j84J81k51RO5P7j89J21J86J5J2j98J6k5P0j15J11kj0rj23L6j2P2
4811b3q9R2J21j21J52k54K15j92K06Kn7j03o4K78j37r2p7K07j63J54J6j22J59
4834A08j01M8r1j8M4O5j00Q2p3j0m3K49m4m0r6r5R5Q2J1j02M1r2J79q3J02o9R
4861E8o2j13K34j11n1M0p5J44Ln0k7J1l6J90j6k35M3J38j25K52l35K0J97r6p9
4886h1J94j52j31J29n3J23p4l6J90k27P8Lr0K2MJ66k3k7J8M2n4j21L7O2p0j0J35
4913E4k00J75J1n3J19j11N3j91O9j68J77O0L1k2m0lKP9j07J62p8m7N2N5j08M1
4939A2k00K07Q4j08M7N0j07O7j66Q8J62r1j77N6J69ok1k6r1J21l4K5k2l7R8j27
4965b7p0J86k03N4P1L3j14lj7J89k30K9L31k21R1l35K75Rnj08J84j79N1J55p0
$$ plain form
4990 76 8 101 -63 149 20 161 61 -73 201 -101 -92 204 -37 -100 -10 -121 -3 50 37 81 -72 -70 183 -160
5014 -160 163 56 21 -99 -26 -129 -27 -39 -61 -1 -95 106 46 0 163 31 -48 44 71 36 61 -54 136 -48
5038 -48 94 66 -81 94 -16 32 -197 -43 64 -18 69 -4 75 -24 138 -5 57 -49 -71 29 70 184 147 -14
5062 -14 68 -58 -162 -73 128 18 -15 -64 -133 80 72 -190 -141 15 -53 -34 -84 219 131 107 32 23 33 19 49 -216 78
5089 78 -208 4 155 24 -42 15 -1 -25 -93 -68 -52 125 2 21 24 -96 87 27 -123 36 52 -101 147 -89
5113 -89 -181 -95 133 -60 10 38 -32 87 0 170 -200 -67 -194 181 139 37 21 93 29 1 -7 -24 45 -3 132 69
5139 69 -82 46 110 -93 -156 49 135 -43 -62 -39 2 -64 13 -68 -63 3 146 50 -60 -92 -10 -86 173 -63 49 -152
5165 -152 22 -73 159 -23 17 -128 -1 39 -88 119 -118 -139 71 34 -45 -90 67 22 -169 -93 97 -12 29
$$ packed form
4990G6o8R3j64K12j29J41j00j34K74l02RK96k41o3R0j11J18N3j3M4j53KK53l43
5014a60L23j07l5j20P3j03J02j2k2O0r4K01o0m6J63j32p9R2K7l5K5j15J90j84
5038d8J42k8j47J75j10M8k29J54J07q2Q7p3P9r9J62j43O2j06k2J00M1J14l7j61
5062a4Q2j26j04Q9K01j10l3m9o9K13qk62M9J56o8J9n0L03q8k4p5rJ0j4L0k65K94
5089G8k86K12J51j31o6N7j6k4o8K5J6J77j23J9Lj20J83o0j50J59J6j53K48k36
5113h9r2Q6K28j93P0K8p0J19q7J70l70J33j27L75m2j02j6P2o4k8qj7O9m8J35o3
5139F9j51J28O4k03o3K05Q6j78j9K3M1o6P7q1NO6J43r6j10l2Q2p6K59k36J12k01
5165a52J74r5K32j82M0j45J27M0j27K07k37k1K10l7p9m5J57m5j91P6J90j09M1
$$ plain form
5188 29 38 -33 -16 -64 187 -33 167 -90 -8 -30 -3 22 80 -19 -1 14 32 38 -32 95 -37 -82 103 -48 -16 71 -64
5215 -64 -57 123 131 -61 16 104 8 -92 37 -37 122 -32 -34 -10 -33 -147 -4 94 99 -51 -32 57 -53 -75 -43 -80 158
5242 158 -73 166 -69 -33 115 28 66 -100 19 -65 -33 61 99 41 -72 -21 32 -26 -75 3 51 21 -61 130 -40
5267 -40 -142 30 103 162 -148 43 6 215 -70 -198 -7 -26 218 -75 -176 108 -113 10 -47 -1 58 -153 -15
5290 -15 137 34 -78 -70 -33 27 118 -54 102 109 -40 -24 37 236 -12 144 -102 58 119 -88 20 56 82 96 -9
5315 -9 186 -112 33 -27 -15 104 126 -14 162 86 -61 -52 -68 28 -33 -2 -69 -87 -125 6 -156 96 -16 130 52
5340 52 53 42 105 -128 76 24 -60 131 134 -69 41 -19 -122 -152 -90 -38 -84 71 -67 8 -111 -147 78 -37 157
5365 157 70 -45 76 -63 -97 -10 -120 151 133 -38 -21 -128 17 117 67 -10 10 -135 -63 -37 207 -62 -200
$$ packed form
5188B9Rp1J7m8K51k20K00k57Q2k2K7K5N8r9J8J5J8Op0J27j32m5J85j51L2Q7j35
5215f4PJ80Qj92P7Q8r6j00J29p4J59j54kK4k3j14J43R8Nj50J9Q9j10k2L2l7K38
5242A58k31K39k35L6J48q7L8j66J19q4L2R4L8n8j13N1N3n8m9P8M8l0q2J91j70
5267d0j02J72P3N9l10J91l7K09k85j28J91j9K44k93j01K84k21J23n7M6N9k11J38
5290a5J52j03j12QL7O0R1j72J56Pj49J6O1J99k48J56k46J60O1k07J08L6K6J4j05
5315iJ95k98J45o0J2J19K2j40J76p6j47Rj6R6o1L1o7j8l8J31j62K52j12J46p8
5340E2Jj1O3k33K04n2q4J91Lk03J10o0j03l0O2N2m6J55j38P5j19l6K25j15J94
5365A57q7j15J21j39l4Q7j10K71j8j71J7j07J45J00n0p7K0j45P2K6K44k69j38
$$ plain form
5388 -200 102 -9 -67 0 -47 -111 -134 3 -74 37 61 -138 -36 -170 -79 -60 110 41 150 181 133 19 -43 48 17
5413 17 -72 -57 -8 -131 197 -177 -13 -73 -13 -164 187 120 -115 -47 -2 56 -139 -60 195 91 97 -17 72 -113 -14
5438 -14 17 -70 -3 157 54 18 22 -74 42 -50 -142 193 -79 -53 172 144 -63 8 -41 157 43 75 -2 -59 -22 13
5464 13 -38 -51 32 -21 73 -130 177 -103 108 37 53 84 -137 37 -80 99 24 9 33 68 -88 -179 -1 8 -87 -143
5490 -143 -25 19 -96 82 52 -23 6 -14 33 -44 -123 142 39 -20 33 -52 150 44 32 -11 -113 32 25 216 -39
5515 -39 -41 -141 137 100 19 19 -198 -101 61 110 64 54 63 122 -76 67 -126 -116 -119 35 -65 5 -6 -18 67 -102 -46
5542 -46 169 -115 1 154 80 147 162 147 167 1 2 103 69 -50 -104 -71 74 -27 -127 -110 -6 6 38 -57 7
5567 7 58 41 66 -3 -66 119 -43 -18 -38 34 -57 23 46 -259 -143 -115 13 -21 25 96 20 -52 45 204 1 -31 -5
$$ packed form
5388b00L02j11n8O7m7o4k3J37p7J11K4j99J02j34R1J9J70o9J09L1m8j14o2R1l1
5413A7q9J5M9j23L28l74J64o0O0j51L51o7k35O8M5N8j95P9K55j04Oj14Q9j85R9
5438a4L1q7O7J60j03l6Mr6J16r2r2L35k72K6K25k8k07P1m9J98j14L2p7n7L7L5
5464A3n1j3Q3n3R4k03L07k80K11p1J6L1k21J74j17J79p5j5K4L5j56r1J78Rr5n6
5490a43J18M4j15J78l0p5K9k0M7p7p9K65j03n9N3q5K02j06j2m3j02J45pJ91k55
5515c9kj00K78l7q1%k17R7J62M9m6j0RN9j98J43j93J0lJ54j00P0j1j2Q5j69N6
5542d6K15k84J16J53p4O7J5j5K0j66JJ01l4j19n4L3J45j01j00J7J04J2L2r5O4
5567GN1j7K5o9o3J85j62K5k0P2r1Q0K3l05J16K8J28l4M6P1p6p2R7J59k03l2K6
$$ plain form
5594 -5 -85 25 109 71 10 113 -56 -77 101 10 -89 20 17 46 143 35 41 51 133 -21 10 -48 -105 -104 -59 33 -80 -136
5622 -136 113 -104 -171 266 -11 -66 -63 -104 -57 -7 7 35 70 -210 -125 -19 56 47 35 13 -28 87 20 -102 29 -21
5648 -21 41 -48 -83 -15 17 -120 17 77 101 6 -72 169 9 34 -90 154 84 146 113 -14 131 -176 -58 63 106
5673 106 -66 -40 91 67 -1 -57 87 -132 127 -3 -83 158 -15 47 -121 -45 75 41 -37 63 -60 -23 59 -70
5697 -70 -56 31 62 70 -87 -61 77 -148 26 -88 178 79 -88 21 24 79 85 -42 168 -140 -80 102 -91 -119 -128 -40
5723 -40 -52 -40 56 18 111 -63 -95 15 82 0 44 16 -12 -2 -43 0 102 17 122 -93 -8 36 -2 -28 -17 -53 -15 -15
5751 -15 17 0 267 -120 -13 -24 -117 129 -51 13 104 44 82 -70 55 95 113 -175 13 75 -9 -37 3 97 -86
5776 -86 3 -36 74 -138 -42 -13 -28 94 240 -107 9 -203 156 -40 31 -196 21 -40 92 1 -148 -38 -188
$$ packed form
5594eq0J10Q4l8o1J03j69k1J78r1r9J09lK9R7j08OJ0Q2j54L1n8n7JM5R2j13n6
5622a36K49k17o7M37k77n5Lm1M7N0J4K8L5k80Q5J06P5rj2k2m1J15o7j22J31n0
5648b1O2q9l5O8L2j37J37O0K4r5p8K41j60K5j24K44p0O2l3j27J45l07J18J21M3
5673A06j72K6J31k4o8n6J44k19K59j30q0K41j73O2j68P6J20l4p8J00j23L7Q2j29
5697g0J4Q7L1Qj57K6J38k25J74j14K66r9j67J09LN5Oj27K10l08O0J82j93k8rQ8
5723d0j2J2R6l8R3j74l2J10O7q2M4k8k8J0m1M3J02q5J05k15Q5M4l8k6J1l6L8%
5751a5L2j7K67l87J07j1r3K46j80O4R1o0L8j52J25M0J8k88J88O2q4k8M0R4j83
5776h6Q9l9J10k12R6K9j5J22J46l47J16k12L59j96P1k27K17o1J32r1j49J10j50
$$ plain form
5799 -188 -5 -56 -181 -62 12 -31 6 8 -17 -15 52 10 87 -9 -11 -185 -174 29 30 -100 -174 139 93 2 56 -29 113 34
5827 34 33 11 -53 -51 -44 -86 59 13 -84 35 -54 -140 -29 -59 5 -80 38 -62 -78 -44 -61 -76 -21 -11 -56 -96 65 -163
5855 -163 -99 45 -147 -46 -57 3 -24 79 44 -25 35 -44 9 -178 -77 57 -127 111 -68 147 62 -48 151
5878 151 -43 -231 -43 115 107 -67 49 28 11 -27 -161 -95 0 70 12 -88 22 237 47 16 -128 -112 61 95
5902 95 80 127 65 44 187 83 -36 41 71 -35 -98 -23 91 5 139 -72 -66 -95 33 -104 -69 45 203 41 -17
5927 -17 109 219 94 -55 -57 -118 -53 28 29 -58 30 88 99 -142 -51 22 -22 -132 203 121 72 -70 43 -22 -90 110
5953 110 5 60 -201 40 -44 -121 159 -93 209 142 39 268 47 -33 -18 31 147 -2 182 -63 -100 -107 -50 -177
5977 -177 96 47 14 -200 76 7 -144 23 -85 244 0 167 80 53 -68 -132 66 121 52 -103 105 -100 20
$$ packed form
5799a88J83n1j25J19P4m3L7Kk5KO7m2P7r6kj74J1K03Jj30p4L13m6r1N4q5J42p9
5827C4jk2o4KPm2J45m6r7J19q9q6J11l0O4q5J18j00j6L4j7j5N5J0m5m0J61k28
5855a63O4J44j92J01j1O0k7J03l5o9O0p9N3j87J01J34j84K38j79K15q5j10J99
5878A51j94j88J88J58qj74J16k1j7l8j34O6R5P0n8j00J10K15j90l1j44J6J73L4
5902I5j5M7o2k1J43j04j19P7L0j06o3P5J14q6J34k11Ok9J28j37L5J14J58j62n8
5927a7J26J10j25j49ko1O5Q1Jq7Q8N8J1k41R1P3m4j10L35q2m9j42J13o5o8K00
5953A10j05N5k61K41q4p7K80k52L02o7j03K29k21q0J5M9J16j49J84k45l7pN7j27
5977a77K73m9l3k14K76o9j51J67j08L29k44J67q7k7j21o4J98N5o9j55K08k05J20
$$ plain form
6000 20 89 -32 -19 173 88 157 -75 -110 -67 -53 -32 -43 40 -25 155 20 49 59 69 -23 -5 -104 76 -43 -55 1 148
6027 148 38 22 -168 -127 -24 1 -21 -95 -72 -48 -210 -38 -65 -112 42 -117 59 143 -100 55 71 -193 -17 76
6051 76 -61 26 18 -83 136 142 39 57 -72 38 203 78 92 154 61 -22 17 -49 205 -105 31 51 -96 81 -50
6076 -50 -150 -10 51 143 -65 -128 25 -253 69 -145 216 -126 40 -77 61 -17 15 199 10 -81 -99 -10 142
6099 142 -10 -131 149 162 -20 -35 -38 -57 -68 24 -57 -84 85 28 50 -109 68 36 -33 75 -57 31 51 -60 131
6124 131 97 22 46 -181 47 -41 241 -84 -93 -111 -34 -63 11 101 -82 -1 66 8 -20 -36 -105 106 50 -33 -87 -322 7
6151 7 -67 -36 123 -67 2 32 42 88 24 -56 137 -14 -208 40 -22 -6 160 -26 -5 28 -53 19 -105 -37 -95 214
6177 214 94 0 -36 -1 54 -65 -176 56 52 -126 -29 -37 -30 98 -77 46 -121 -60 35 -27 59 -54 -36 -53 66 -165
$$ packed form
6000B0O9j21J3J92q5O9k32l5M3J4K1j1Q3o5J80j35K9J0J0r2J8r9J80j19j2N6J47
6027A48j10j6j90M1J03K5k2p4K3K4j62J72k7m7J54j59J76Q4k43J55J6k64J76R3
6051G6j37Q7qj01K19Oj03J8j29J10J65j25J4O2r3q3L9o6K54l10J36K0j47J77j31
6076e0j00J40O1R2k08o3J53k78L22k14L61l42J66j17J38p8L2J84j89r1j8Q9J52
6099A42j52j21K80J3j82j5lj9j1R2q1k7J69n7K2j59J77l2o9J08j32Q8K0j11J91
6124A31l4p5K4k27K28q8K82l25rj8P7k9P4R0j83Q1O7n8k8j6o9K11n6q3n4k35L29
6151Gp4L1J59j90O9L0J0M6o4q0J93j51j94K48o2J6J66j86K1L3q1P2j24O8n8L09
6177B14j20r4l6L5N5j19j11K32mj78R7qPJ28j75J23j67O1R5o2Q6j13J8j7J19k31
$$ plain form
6203 -165 198 116 143 -160 78 -70 66 117 1 55 108 270 8 86 -87 53 56 22 30 74 -35 60 -148 -19
6227 -19 25 234 69 179 -34 13 -30 -6 65 -160 -45 -57 10 -84 -42 -54 36 -54 -76 67 -62 -122 14 -15 223
6252 223 -36 135 102 -161 27 158 6 -41 78 -77 -31 85 148 -30 -21 -18 85 38 37 -36 -42 -13 73 -37 -40 15
6278 15 -39 63 -128 0 -40 -27 12 243 -41 28 -89 -95 31 23 7 -90 -9 40 81 -8 83 22 46 -63 -36 -138 -11
6305 -11 215 -36 59 -99 -19 195 60 30 -151 -119 -204 124 46 -61 13 95 -21 -135 -41 76 17 -75 -48 -160
$$ packed form
6203a65L63q2K7l03K38j48J36N1j16N4N3J62k62P8j73J40Ll4QM4j09R5k08J29
6227a9M4K09j65J10k13M7m3K4P1k25J15j2O7r4M2j2R0r0k2J43j29o0J36k9K38
6252B23k59J71l3k63J88J31j52m7J19j55M6J16O3j78RLJ03m7jp3oK9Q6j10lN5
6278A5n4J02j91J28m0J3L9K31k84O9j17oJ26qj6r7Q1M9M1q9R1o1K4j09K7j02J27
6305a1K26k51R5j58Q0K14j35l0j81L2q5L28p8j07P4Q2j16j14R4J17n9r2K7j12
$$ [...]
8191A2
##END NTUPLES=NMR FID
##END=
