##TITLE=1H_DE-80H_X3
 200.13MHz, d2o
 8 sc
 
 19ns.26.2.2025
##JCAMPDX= 6.0         $$ Bruker NMR JCAMP-DX V2.0
##DATA TYPE= NMR FID
##DATA CLASS= NTUPLES
##ORIGIN= UXNMR, Bruker Analytische Messtechnik GmbH
##OWNER= pz
$$ XWIN-NMR		Version 3.5
$$ Tue Jul 21 15:49:28 2026 Russian Standard Time (UT+4h)  Yarkov@DPX200
##.OBSERVE FREQUENCY= 200.1313
##.OBSERVE NUCLEUS= ^1H
##.DELAY= (6, 6)
##.ACQUISITION MODE= SIMULTANEOUS
##.ACQUISITION SCHEME= undefined
##.AVERAGES= 8
##.DIGITISER RES= 18
##SPECTROMETER/DATA SYSTEM= spect
##.PULSE SEQUENCE= zg30
##.SOLVENT NAME= CDCl3
##.SHIFT REFERENCE= (INTERNAL, CDCl3, 0, 14.3821)
##AUDIT TRAIL= $$ (NUMBER, WHEN, WHO, WHERE, WHAT)
$$ ##TITLE= Audit trail, XWIN-NMR		Version 3.5
$$ ##JCAMPDX= 5.01
$$ ##ORIGIN= Bruker BioSpin GmbH
$$ ##OWNER= Yarkov
$$ C:/Bruker/XWIN-NMR/data/yarkov2/nmr/H-C/1/audita.txt
$$ ##AUDIT TRAIL=  $$ (NUMBER, WHEN, WHO, WHERE, WHAT)
(   1,<2026-07-21 15:48:26.46 +0400>,<Yarkov>,<DPX200>,
      <created by zg, POWCHK disabled, PULCHK disabled
       configuration hash MD5:
       00 E9 B6 7A A2 85 ED C7 34 08 36 98 17 FE 4E 26
       data hash MD5: 16K
       F8 96 9E E3 1F 1C 74 6F 89 EC 67 23 B7 F6 4F 3C>)
$$ ##END=
$$ 
$$ hash MD5
$$ 17 6A A2 1B B2 1E B6 98 A8 B2 E5 CC 4B 07 1A 57
##$RELAX= 
##$RELAX= 
##$RELAX= 
##$RELAX= 
##$RELAX= 
##$RELAX= 
$$ Bruker specific parameters
$$ --------------------------
##$DU= <C:/Bruker/XWIN-NMR>
##$EXPNO= 1
##$NAME= <H-C>
##$PROCNO= 1
##$TYPE= <nmr>
##$USER= <yarkov2>
##$AMP= (0..31)
100 100 100 100 100 100 100 100 100 100 100 100 100 100 100 100 100 100 
100 100 100 100 100 100 100 100 100 100 100 100 100 100 
##$AQSEQ= 0
##$AQ_mod= 1
##$AUNM= <au_zg>
##$AUTOPOS= <>
##$BF1= 200.13
##$BF2= 200.13
##$BF3= 200.13
##$BF4= 200.13
##$BF5= 200.13
##$BF6= 200.13
##$BF7= 200.13
##$BF8= 200.13
##$BYTORDA= 1
##$CFDGTYP= 0
##$CFRGTYP= 5
##$CHEMSTR= <none>
##$CNST= (0..31)
1 1 145 1 1 1 1 1 1 1 1 1 1 1 1 1 1 1 1 1 1 1 1 1 1 1 1 1 1 1 1 1 
##$CPDPRG= <>
##$CPDPRG1= <>
##$CPDPRG2= <>
##$CPDPRG3= <>
##$CPDPRG4= <mlev>
##$CPDPRG5= <mlev>
##$CPDPRG6= <mlev>
##$CPDPRG7= <mlev>
##$CPDPRG8= <mlev>
##$CPDPRGB= <>
##$CPDPRGT= <>
##$D= (0..31)
0 0.7 0 0 0 0 0 0 0 0 0 0.03 0 0 0 0 0 0 0 0 0 0 0 0 0 0 0 0 0 0 0 0 
##$DATE= 1784634505
##$DBL= (0..7)
120 120 120 120 120 120 120 120 
##$DBP= (0..7)
150 150 150 150 150 150 150 150 
##$DBP07= 0
##$DBPNAM0= <>
##$DBPNAM1= <>
##$DBPNAM2= <>
##$DBPNAM3= <>
##$DBPNAM4= <>
##$DBPNAM5= <>
##$DBPNAM6= <>
##$DBPNAM7= <>
##$DBPOAL= (0..7)
0.5 0.5 0.5 0.5 0.5 0.5 0.5 0.5 
##$DBPOFFS= (0..7)
0 0 0 0 0 0 0 0 
##$DE= 6
##$DECBNUC= <off>
##$DECIM= 32
##$DECNUC= <off>
##$DECSTAT= 4
##$DIGMOD= 1
##$DIGTYP= 9
##$DL= (0..7)
0 120 120 120 120 120 120 120 
##$DP= (0..7)
150 150 150 150 150 150 150 150 
##$DP07= 0
##$DPNAME0= <>
##$DPNAME1= <>
##$DPNAME2= <>
##$DPNAME3= <>
##$DPNAME4= <>
##$DPNAME5= <>
##$DPNAME6= <>
##$DPNAME7= <>
##$DPOAL= (0..7)
0.5 0.5 0.5 0.5 0.5 0.5 0.5 0.5 
##$DPOFFS= (0..7)
0 0 0 0 0 0 0 0 
##$DQDMODE= 0
##$DR= 18
##$DS= 0
$$ [...]
##$SUBNAM2= <"">
##$SUBNAM3= <"">
##$SUBNAM4= <"">
##$SUBNAM5= <"">
##$SUBNAM6= <"">
##$SUBNAM7= <"">
##$SUBNAM8= <"">
##$SUBNAM9= <"">
##$SW= 18.0517328524113
##$SWIBOX= (0..15)
0 0 2 0 0 0 0 0 0 0 0 0 0 0 0 0 
##$SW_h= 3612.71676300578
##$TD= 16384
##$TD0= 1
##$TE= 0
##$TE2= 300
##$TE3= 300
##$TEG= 300
##$TL= (0..7)
0 120 120 120 120 120 120 120 
##$TP= (0..7)
150 150 150 150 150 150 150 150 
##$TP07= 0
##$TPNAME0= <>
##$TPNAME1= <>
##$TPNAME2= <>
##$TPNAME3= <>
##$TPNAME4= <>
##$TPNAME5= <>
##$TPNAME6= <>
##$TPNAME7= <>
##$TPOAL= (0..7)
0.5 0.5 0.5 0.5 0.5 0.5 0.5 0.5 
##$TPOFFS= (0..7)
0 0 0 0 0 0 0 0 
##$TUNHIN= 0
##$TUNHOUT= 0
##$TUNXOUT= 0
##$USERA1= <user>
##$USERA2= <user>
##$USERA3= <user>
##$USERA4= <user>
##$USERA5= <user>
##$V9= 5
##$VALIST= <valist>
##$VCLIST= <CCCCCCCCCCCCCCC>
##$VD= 0
##$VDLIST= <DDDDDDDDDDDDDDD>
##$VPLIST= <PPPPPPPPPPPPPPP>
##$VTLIST= <TTTTTTTTTTTTTTT>
##$WBST= 1024
##$WBSW= 4
##$XGAIN= (0..3)
0 0 0 0 
##$XL= 0
##$YL= 0
##$YMAX_a= 168293
##$YMIN_a= -214968
##$ZGOPTNS= <>
##$ZL1= 120
##$ZL2= 120
##$ZL3= 120
##$ZL4= 120
##$ABSF1= 10
##$ABSF2= 0
##$ABSG= 5
##$ABSL= 3
##$ALPHA= 0
##$AQORDER= 0
##$ASSFAC= 0
##$ASSFACI= 0
##$ASSFACX= 0
##$ASSWID= 0
##$AUNMP= <proc_1d>
##$AZFE= 0.1
##$AZFW= 0.1
##$BCFW= 1
##$BC_mod= 2
##$BYTORDP= 1
##$COROFFS= 0
##$CY= 83.5205535888672
##$DATMOD= 1
##$DC= 2
##$DFILT= <>
##$DTYPP= 0
##$F1P= 10.8118882576601
##$F2P= -7.23987719738617
##$FCOR= 0.5
##$FTSIZE= 0
##$FT_mod= 4
##$GAMMA= 1
##$GB= 0.15
##$INTBC= 1
##$INTSCL= 1
##$ISEN= 128
##$LB= 0.25
##$LEV0= 0
##$LPBIN= 0
##$MAXI= 10000
##$MC2= 0
##$MEAN= 0
##$ME_mod= 0
##$MI= 1.114404
##$NCOEF= 0
##$NC_proc= 0
##$NLEV= 6
##$NOISF1= 3.799351
##$NOISF2= 2.8
##$NSP= 1
##$NTH_PI= 0
##$NZP= 0
##$OFFSET= 14.38212
##$PC= 1
##$PHC0= -7264.547
##$PHC1= 21.42198
##$PH_mod= 1
##$PKNL= yes
##$PPARMOD= 0
##$PSCAL= 0
##$PSIGN= 0
##$REVERSE= no
##$SF= 200.129724274929
##$SI= 16384
##$SIGF1= 3
##$SIGF2= 2
##$SINO= 400
##$SIOLD= 16384
##$SREGLST= <1H.CDCl3>
##$SSB= 0
##$STSI= 0
##$STSR= 0
##$SW_p= 3205.1282051282
##$SYMM= 0
##$S_DEV= 0
##$TDeff= 0
##$TDoff= 0
##$TI= <>
##$TILT= no
##$TM1= 0
##$TM2= 0
##$TOPLEV= 0
##$USERP1= <user>
##$USERP2= <user>
##$USERP3= <user>
##$USERP4= <user>
##$USERP5= <user>
##$WDW= 1
##$XDIM= 8192
##$YMAX_p= 0
##$YMIN_p= 0
$$ End of Bruker specific parameters
$$ ---------------------------------
##NTUPLES= NMR FID
##VAR_NAME=  TIME,          FID/REAL,        FID/IMAG
##SYMBOL=    X,             R,               I
##VAR_TYPE=  INDEPENDENT,   DEPENDENT,       DEPENDENT
##VAR_FORM=  AFFN,          ASDF,            ASDF
##VAR_DIM=   8192,          8192,            8192
##UNITS=     SECONDS,       ARBITRARY UNITS, ARBITRARY UNITS
##FACTOR=    0.0002768,     1,               1
##FIRST=     0,             0,               0
##LAST=      2.2672688,     0,               0
##MIN=       0,             -214968,         0
##MAX=       2.2672688,     168293,          0
$$ Real data points
##PAGE= N=1
##DATA TABLE= (X++(R..R)), XYDATA
0 0 0 0 0 0 0 0 0 0 0 0 0 0 0 0 -8 8 -8 8 -12 16 -16 24 -24 32 -32 40 -48 56 -64 72 -82 96 -109 120 -137 157
36 157 -175 197 -221 245 -275 301 -337 373 -413 457 -504 555 -613 674 -743 821 -902 995
54 995 -1100 1216 -1350 1501 -1677 1881 -2126 2424 -2795 3273 -3913 4819 -6207 8615 -13944
69 -13944 51526 -114546 -204343 61711 141097 4551 -78382 -868 33664 14108 -5469 -13327
81 -13327 -34794 -8376 47619 57672 -24018 -85836 -25653 76752 46064 -50753 -36177 47911
93 47911 29074 -39698 -24709 21101 7171 7460 38401 -2279 -73482 -27669 66210 42991 -42272
106 -42272 -35384 22746 16611 -21170 -14862 4317 3767 11129 20437 -7984 -44105 -20036 40833
119 40833 41408 -20451 -36280 14098 22002 -31315 -28438 42766 41249 -41850 -44618 37026 32013
132 32013 -50785 -33411 64525 52341 -55488 -62475 32884 52726 -13717 -28385 14856 18524
144 18524 -11800 -11521 4244 -3254 -3702 20734 19124 -22128 -36584 4803 35761 6840 -25408
157 -25408 -180 27471 -4288 -32828 3263 35435 4469 -20280 7130 15159 -19986 -19189 21706
170 21706 21607 -12414 -12399 6199 -3185 -15405 2305 16593 2561 -8307 -1289 -1544 -10822 -3640
184 -3640 16396 15710 -9473 -17632 5212 11192 -14409 -14107 23440 24175 -25600 -35571 15078 29769
198 29769 -14859 -25696 15421 26032 -10000 -25380 -1952 14824 10008 4902 -775 -11521 -7473
211 -7473 11159 11711 -9393 -12967 12272 20245 -11479 -30497 -884 27487 9884 -15663 -6975
224 -6975 9150 -579 -8334 7610 13357 -3604 -5910 9812 5802 -14946 -9725 17591 17819 -8947
238 -8947 -16211 -862 4588 -889 585 3626 -2258 -5272 3070 3138 -10403 -7401 14860 17630 -8473
253 -8473 -21141 180 16897 1284 -12746 455 11111 -2161 -13441 -4076 5494 648 -1630
266 -1630 4386 227 -9786 -5033 7239 6321 -1901 -916 3946 -821 -6240 326 6122 656 -2196
281 -2196 3284 2269 -9071 -9985 6520 13166 -2545 -11533 798 8712 -1610 -8147 2735 11764
295 11764 3689 -4836 -2290 224 589 4698 6328 -613 -5807 -134 4841 -2454 -7467 2674 9798
310 9798 87 -10272 -4451 5356 2862 -2948 1811 5447 -1881 -5647 761 4666 -210 -2505 3021
325 3021 2941 -5893 -7676 786 4562 -217 -3187 -1147 -749 -3592 -2191 2499 2368 -362 815 1620
341 1620 -1715 -4062 824 6228 2247 -4120 -2060 1536 -1354 -3894 -136 3952 941 -3902 -2468
356 -2468 287 -121 806 3172 2483 -124 -724 1222 1172 -198 2157 4800 1469 -2667 -2114 498 1146
373 1146 406 1034 432 -2653 -2310 1113 911 -1159 -212 3284 3571 -1648 -4968 -297 5386 4759 -846
390 -846 -4176 -1666 1441 1160 -1234 -4026 -2450 3150 3349 -4816 -8783 -998 7703 4432 -5389 -5896
406 -5896 1852 5175 879 -3465 -1754 3197 3278 -836 -4203 -4286 -277 4217 2808 -3409 -6787 -2335
422 -2335 4535 3299 -2756 -3380 1973 5002 1088 -3373 -1044 3786 4089 1920 -280 -1912 -1260 1134
438 1134 2802 2332 -728 -3366 -1508 2512 2631 -2944 -3898 3540 5848 -1036 -4123 -286 2614 2976
454 2976 3020 -15 -4399 -2204 4820 4559 -3187 -7326 -2848 6949 8491 -6456 -17022 -1512 17188
469 17188 7334 -13765 -11558 6379 10054 209 -5650 -4383 2153 7282 1713 -7698 -5977 2671
483 2671 5862 1884 -5078 -9382 -2477 10330 6289 -11568 -10670 9106 12146 -4274 -10934 -381
497 -381 9234 6941 -2343 -7597 -1593 7647 5531 -4035 -4613 656 442 971 3334 -2085 -7239 375
513 375 8629 1915 -7150 -1887 6899 3459 -3161 -1400 4127 4762 -1765 -5809 1181 7810 207 -8821
529 -8821 -1469 8694 24 -12148 -2248 12856 4276 -11853 -7742 6798 8228 -682 -4553 -2089
543 -2089 926 3641 2671 -2657 -4476 -1196 2777 4353 -1606 -10403 -5783 9552 9007 -9499 -13498
558 -13498 4663 11822 -1779 -8385 -815 4554 4301 994 -4522 -3236 5327 5870 -3262 -4861 1883
573 1883 2384 -122 1005 -2805 -6819 2884 10941 -608 -11721 -3033 9359 7065 -2297 -5399 -330
588 -330 6477 4555 -5493 -4372 8257 5864 -8276 -5364 7445 2998 -7978 -2248 7132 1182
602 1182 -6715 -2188 3440 2432 270 -1353 -1763 1329 2781 578 -1048 -1217 -1725 610 4006 -113
618 -113 -7882 -3812 6761 3702 -7113 -6060 2934 4704 -842 -4402 -3043 1497 5283 3311 -4052
633 -4052 -5674 1984 6371 1472 -4066 -3017 1219 2829 695 -2962 -4193 617 5725 1137 -6573
648 -6573 -3918 5272 7055 -655 -6738 -1823 7059 6805 -3069 -6439 2381 7664 -273 -5504 97
663 97 2842 -794 -817 855 -2176 -2787 2611 3748 -1904 -3089 1420 2319 894 590 -792 -920 1515
680 1515 1598 -799 -877 -259 -1455 -1123 1241 -473 -3815 -772 2141 -1820 -3023 1515 1839 -1803 -990
697 -990 1528 274 -868 1294 1143 -1389 -201 1237 -841 -1672 449 570 -880 -1029 -354 12 -441
714 -441 -987 -126 1405 571 -1099 -367 3102 2453 -1787 -703 2022 2293 -1137 -1151 964 1079 75 -601
732 -601 199 -381 701 442 -425 -262 1120 1928 685 -1280 -600 1954 1987 -342 -1536 575 988 430
750 430 -1421 -793 679 -26 -1070 -1361 -143 -678 -1272 -291 914 -822 -728 492 857 -82 -306 299
768 299 249 342 619 -873 -1667 271 1153 -906 -2160 -839 498 176 -909 -801 97 466 357 47 17
787 17 715 684 816 1264 357 -464 416 1263 288 -1081 -578 816 7 -831 -291 2 -32 630 752 -1 -344
808 -344 658 1834 1037 -668 -109 1613 1406 -415 -1491 86 1652 -348 -2041 -901 420 -15
824 -15 -1053 -1086 -250 -1 227 323 -710 -484 1239 1269 -535 -1082 257 1142 70 -1358 -716 116 -16
843 -16 -694 -1372 -928 -66 -135 -261 -433 -532 117 944 738 -80 -421 872 1489 117 -421 212 495 230 211
864 211 -298 -784 -719 567 748 -978 -1056 1047 1319 -223 -188 1003 1091 252 385 1300 619 -400 306 1278
884 1278 618 -1259 -1388 826 1174 -1382 -1877 273 958 -380 -953 147 105 -294 1148 1238 -1322 -1245
902 -1245 1411 2020 -638 -2151 -620 1071 371 -1183 -1587 -858 170 207 -1005 -1307 -758 329 1091
919 1091 18 -1646 -91 2158 1233 -1276 -758 1599 791 -1193 260 1236 -1382 -1980 1205 2083 -1471
936 -1471 -2815 953 2669 -346 -1495 714 1680 427 -14 1058 981 -741 -345 2103 1765 -1637 -2634
953 -2634 740 3241 -375 -3684 -844 2434 751 -1618 -849 433 561 975 843 -1469 -1175 2605
969 2605 2310 -1733 -1993 487 1109 573 -241 -2176 -2406 935 2753 -581 -4010 -1850 2158 2589 -863
986 -863 -3796 -764 4593 2118 -4099 -1749 3858 1593 -2962 -99 2751 -2022 -3280 2631 3036 -3411
1002 -3411 -3662 2089 3297 -1243 -3010 637 3026 819 -2003 -319 3114 1238 -2565 243 3645
1017 3645 -170 -3329 1003 3491 -1134 -3840 275 2838 -127 -1456 -396 -175 481 1501 356
1032 356 -836 -2 1322 702 -554 -372 257 430 262 30 -1163 -1434 -178 1334 432 -2952 -2946 1822
1050 1822 3686 -1517 -4984 -170 5111 1296 -4371 -1401 3983 1451 -3207 -686 2385 -434 -2374
1065 -2374 1466 2212 -3579 -3711 3003 4005 -2172 -4484 760 3892 263 -2585 -77 2826 770
1080 770 -1845 172 2982 308 -2698 596 2835 -828 -2332 1148 1476 -2133 -1341 2205 805 -1995
1096 -1995 106 1673 -349 -334 992 432 39 956 804 -487 -649 372 518 56 -530 -939 -42 122
1114 122 -1814 -928 2517 408 -4003 -1023 3844 1165 -3355 -429 3111 -43 -2172 1008 1678 -1589
1130 -1589 -1785 1085 1296 -1466 -2080 547 1648 -1213 -2730 501 3018 -269 -2843 535 2561 -354
1146 -354 -1386 1919 1883 -1564 -945 2224 1106 -2171 -987 1972 576 -2006 -650 1491 441 -1417
1162 -1417 -252 1749 526 -1389 205 1859 459 -927 660 1161 -454 -730 1346 909 -1684 -1394
1178 -1394 1282 991 -1509 -1564 569 748 -1302 -541 1563 240 -1690 -119 1961 364 -1494 219
1194 219 1546 -684 -1626 545 1022 -1247 -1742 404 854 -1166 -1632 505 929 -1032 -1124 1185 1344
1211 1344 -1047 -1205 1966 1630 -1662 -1070 1893 1004 -1695 -761 1552 350 -1772 -157 1562 -242
1227 -242 -1550 270 1482 -66 -1059 381 1622 100 -983 665 1446 -14 -833 638 1064 -708
1243 -708 -1100 978 662 -1340 -1004 919 444 -1274 -739 955 336 -848 171 1033 15 -678 327
1260 327 1155 33 -937 207 976 -778 -1249 137 460 -889 -1154 418 528 -1105 -939 948 652
1277 652 -979 -716 1108 996 -650 -566 1134 538 -1077 -224 794 -133 -1168 -160 865 -429 -1327
1294 -1327 330 1228 -317 -913 526 1354 -35 -722 758 1230 -135 -422 727 834 -301 -744 492
1311 492 724 -758 -886 438 622 -884 -699 582 591 -467 -517 815 588 -454 15 707 216 -349 -15
1330 -15 642 -333 -730 107 273 -671 -752 18 209 -604 -641 332 354 -466 -303 642 352 -409 84 653 128
1351 128 -575 -27 779 -253 -867 -187 574 -371 -871 -171 667 -230 -726 412 675 -74 -419 538 981
1370 981 66 -506 434 896 -57 -344 88 328 -105 -454 9 198 -311 -361 321 223 -267 -120 445 582 -133
1391 -133 -225 394 364 -127 262 283 -169 -296 172 121 -612 -472 140 -95 -497 -384 -147 -87 -145 -176 78 107 -69
1414 -69 70 172 187 -193 -317 205 240 -631 -514 99 60 -444 -278 -51 24 -278 -208 168 89 46 192 225 389
1437 389 188 -17 323 472 87 -252 -87 269 204 -345 -462 110 184 -59 -301 -193 318 259 33 166 250
1458 250 316 350 -79 228 239 -259 -16 515 174 -877 -547 363 280 -725 -443 215 90 -91 -193 29 213
1479 213 187 -218 26 472 155 -567 -299 612 -8 -911 -63 597 -459 -691 100 224 -101 -511 -93 320
1499 320 461 -279 -427 248 871 31 -576 520 563 -390 -333 764 451 -739 -497 266 300 -263 -254 -185 253
1520 253 379 -49 -98 551 313 -337 195 785 256 -512 45 662 -81 -487 7 196 153 -343 -647 -194 411
1541 411 -113 -512 -28 389 111 -355 180 579 -1 -357 186 387 -23 -545 -240 421 -70 -819 -421 223
1561 223 -42 -522 -223 370 17 -488 -94 518 450 -342 -298 350 589 112 -335 72 136 -331 -208 488 78
1582 78 -680 -548 311 264 -12 51 -122 113 283 123 189 387 78 -123 241 554 -42 -410 -109 243 -58
1603 -58 -131 -121 -378 -97 219 -213 5 95 -44 -63 223 371 7 -338 152 384 56 -43 -176 -138 -114 -199 -210
1626 -210 -16 -39 -417 -471 61 198 -262 -152 302 12 -245 189 370 60 -113 54 68 -25 132 -134 -195 -73
1648 -73 -33 -157 75 227 -444 -355 314 194 -16 83 272 127 4 425 284 -80 59 183 26 -13 26 -165
1670 -165 -121 54 -15 -49 -34 -130 -35 152 238 132 -26 269 211 -26 42 170 -253 -180 138 107 -142 -390 -124 -3
1694 -3 -47 -320 -182 11 -89 -218 -10 290 53 -204 191 375 34 -94 8 130 -3 -208 -113 -175 -156 -139
1716 -139 -133 -143 -30 -88 50 187 -16 56 170 51 87 191 162 131 48 229 58 -215 39 138 -23 -298 93
1739 93 70 -186 -146 -50 30 28 1 20 68 261 59 -36 253 236 -235 -57 173 12 -405 -71 42 -114 -507 -170
1763 -170 -66 -97 -115 -72 120 111 101 -6 192 166 34 -95 151 202 -147 -245 3 52 -220 -134 -232 -84 -36 -119 -37
1788 -37 93 101 -51 103 154 69 -39 0 57 -11 -20 95 -139 35 -33 -112 -11 17 19 -107 24 -11 101 -75 50
1813 50 90 207 138 34 103 202 116 2 33 126 -46 -188 -81 -92 -133 -137 -103 34 -160 -64 -54 33 170 69 82 87
1839 87 163 57 21 -13 -10 -53 -167 -191 -91 -49 -52 -193 -204 -8 -139 -137 14 13 60 57 45 243 105 105 55 168 74 -26
1867 -26 -239 130 -27 -110 -203 6 52 -175 -152 157 57 40 -123 191 152 11 -62 229 199 18 31 4 83 -71
1891 -71 -272 62 195 -38 -203 -126 73 -13 -160 -70 110 135 -71 -43 127 -22 -2 -132 73 33 11 -217 0
1914 0 -41 -91 -281 -204 110 57 -477 -199 298 26 -85 -51 71 227 -106 -167 240 120 -108 -141 160 35 7
1937 7 -197 -19 135 -22 -124 -4 229 -32 -170 86 231 36 -27 158 177 6 -132 -104 150 57 -86 -88 13
1960 13 91 -87 -68 177 23 -135 -97 88 146 -137 4 21 80 30 124 -71 39 65 -193 -109 160 83 -252 -101
1984 -101 4 -40 -101 -49 148 75 -5 -92 120 42 3 -30 209 277 113 -90 -17 53 -30 -55 -74 71 -154 -134 139
2009 139 43 -63 -55 -62 235 76 -53 62 130 120 -20 95 96 75 -75 3 23 53 -89 -59 -58 -71 -84 -121 65 14 -115
2036 -115 44 131 0 17 -5 159 -148 -5 70 68 -131 -48 -42 -187 12 101 -151 -104 17 26 -72 8 22 -62 121 30
2062 30 -133 -146 143 -7 -19 205 192 -233 -227 73 165 -199 -34 108 -10 -100 133 191 27 31 -12 46 104 134 -59
2087 -59 -22 135 19 -41 -37 -72 -119 4 104 -6 -111 20 189 77 -84 150 -11 -51 143 93 -26 -65 25 25
2111 25 120 -7 -10 74 -33 -73 -61 -153 -95 -82 9 40 132 -147 -27 80 51 -115 -2 91 20 -179 92 137 -14 -140
2137 -140 -28 77 -70 -323 4 100 -150 -122 30 78 6 8 65 131 -5 -65 50 104 103 -49 -101 35 -6 -10 57 -107
2163 -107 -217 -43 114 -49 -59 11 59 -118 -61 280 35 -97 100 113 -43 -102 76 146 10 -48 -10 120 2
2186 2 -70 -183 128 74 -136 -90 186 15 -102 -11 178 38 -198 -39 107 -164 -172 36 -81 -145 -161 8 4 -46
2210 -46 -11 -49 30 -53 73 70 136 57 -234 101 119 1 -113 144 -20 -53 19 88 -18 -129 -36 74 39 40 -32 40
2236 40 -78 -22 194 148 33 -116 140 63 -59 -53 47 6 -29 11 27 -85 4 -139 24 11 23 28 69 67 -91 -18
2262 -18 19 71 -121 -21 106 -71 47 -22 -54 -98 -19 50 -5 -52 25 -28 -99 29 -65 105 58 -55 -28 51 77 -55
2288 -55 38 146 -59 -6 78 134 -77 -17 -40 -21 -13 -122 28 164 -66 -67 57 11 61 0 16 4 55 -35 70 -23 31
2315 31 -114 -141 84 43 -4 37 -51 31 63 153 -63 -47 1 54 -14 4 39 64 37 -71 -41 23 -100 -62 -79 60 -47
2342 -47 106 -43 -17 -19 -71 160 143 -8 -32 220 -76 -32 68 4 35 -72 -132 57 -68 -99 -26 -2 -57 39 26 106
2368 106 -29 -50 105 175 -94 -104 30 59 21 -47 104 59 44 -47 68 68 -78 66 -16 89 30 -155 -13 -35 -170
2393 -170 17 -19 -74 71 -11 -40 -16 -50 39 -37 -42 -14 65 19 -4 102 -88 43 -53 -18 8 150 6 71 91 -138
2419 -138 -12 -96 22 -74 -3 5 21 -133 -42 -29 37 112 18 27 7 -41 1 13 6 23 7 22 -19 19 27 45 28 69 -20 24
2449 24 60 58 -124 -66 -72 11 -55 95 -48 28 -50 91 -107 92 3 -44 -39 -73 -18 -27 -23 -112 -12 -14 47 -107 -76 -68 -49 2
2479 2 207 16 28 114 -9 62 3 -94 -36 -58 -30 -46 51 -59 -54 57 -47 39 59 36 -28 -49 76 -125 -52 171 -21
2506 -21 15 -6 59 72 1 -39 54 18 -87 37 94 -32 36 72 -78 117 57 45 -1 124 101 55 31 129 19 -12 -44
2533 -44 -80 -74 82 -62 -71 -24 -79 -38 -4 -90 30 69 -75 130 79 41 107 51 28 31 20 -68 81 -32 -45 52 5 59
2561 59 -19 36 17 -6 65 0 -3 64 -49 25 64 -75 34 -29 51 -24 -23 -62 99 -84 -81 51 -43 -12 -54 -108 72 -36
2589 -36 58 -12 3 -92 79 -83 -20 102 87 99 -123 28 32 -77 28 -11 51 -23 -29 -29 56 -20 -14 18 43 -37 59 -12 -46
2618 -46 56 5 -55 -11 -120 -29 -12 -36 18 21 41 8 31 -39 36 -128 1 -54 14 75 36 64 114 -82 -42 -65 55 364
2646 364 24 -69 -49 -126 -37 7 14 33 2 30 12 -99 -38 81 48 -30 -7 19 -46 59 -62 4 -37 -57 48 -15 51
2673 51 0 -32 -78 46 -8 -58 -60 36 -53 -13 -37 -44 -63 -29 130 36 47 -10 4 18 22 -94 -77 -57 17 20 97 -2 -6 21 31
2704 31 -10 28 -69 -37 -63 109 21 53 -40 -11 82 -17 -4 -21 -25 -61 70 -88 30 -9 -31 -5 -85 43 -103 -12 -18 -32
2732 -32 33 13 91 58 -41 -37 -6 93 -3 72 -79 27 -52 3 6 -71 -81 46 81 -22 56 -69 -23 -66 16 97 -4 19
2760 19 -6 -22 51 -18 -31 -17 60 21 2 31 -12 64 -51 34 -195 -4 43 66 -25 25 40 35 27 -51 117 54 -17 -84 -4
2789 -4 154 -49 -113 -82 23 49 -8 -99 79 44 -16 -36 121 -146 -43 83 -46 -6 18 -64 -152 121 49 71 26 -7
2815 -7 -5 -86 -6 61 -18 -6 -42 -53 44 -43 58 61 -43 9 -12 61 30 -60 35 73 -103 3 12 20 -58 0 14 -50 -51 -8 -34
2846 -34 -65 -74 52 74 0 154 -25 26 49 39 35 -68 26 61 -90 -27 12 51 23 -49 -123 26 108 19 -26 14 -63 40
2874 40 51 -5 -17 18 34 -42 -100 -50 1 -56 -20 10 61 -93 86 -95 -59 34 64 -13 0 -35 -39 19 43 69 -15 52 73
2903 73 19 19 -105 36 18 -44 -54 -73 14 -66 -1 42 -54 13 35 38 11 7 -4 62 13 -60 -63 -89 -51 16 101 -44 39 -63
2933 -63 -38 15 -7 -72 33 -21 80 39 146 123 -62 49 51 100 -46 28 -20 19 47 39 -63 -136 -33 -119 -118 33 26 65
2961 65 -91 67 15 44 53 54 52 -11 2 83 -66 11 58 -127 -153 -74 -22 -42 56 62 -7 -130 8 24 37 -56 68 -58
2989 -58 -60 34 85 61 2 52 -25 5 145 -132 -86 70 20 -131 -61 103 -59 -138 69 55 3 -15 41 128 102 -71 -86
3016 -86 -86 56 -29 -60 -27 -2 -80 -69 117 41 36 -41 74 105 11 63 67 81 -9 65 -16 -134 111 -28 -50 -126 0 -153
3044 -153 -18 17 -56 -112 -32 42 40 -30 46 50 -46 79 46 43 -5 -51 -37 48 -26 -42 10 -20 72 64 -48 -99 50 -49 -50 -24
3074 -24 51 -48 -30 -17 65 67 -14 154 -143 -75 20 -62 -65 -91 -29 -36 19 46 -45 -18 4 -10 -48 -102 117 52 63 73 63 32
3104 32 -78 -31 0 44 19 40 -92 40 0 -138 67 63 23 -43 28 -45 -86 88 108 -41 40 21 -72 -63 15 -3 42 -71
3132 -71 17 -115 -80 83 51 -82 -19 -28 2 -58 76 32 64 78 -8 -20 157 -61 -121 -12 28 -40 -49 114 17 13 -137
3159 -137 -28 99 -46 22 31 79 -96 -133 -34 99 49 24 59 61 -46 -11 -4 -61 62 2 -81 -101 -38 -81 -96 109 35
3186 35 -44 135 160 14 -53 69 86 54 -11 75 -4 34 -20 -39 -104 -13 49 128 -83 -12 -43 94 14 42 -74 46 12
3213 12 14 83 6 38 -77 -59 -21 -38 -102 -126 -10 -129 -4 70 15 -83 7 -84 22 67 47 62 136 5 22 75 64 84
3241 84 -88 104 -74 -37 42 22 -72 -12 -49 54 -45 38 135 127 121 104 56 91 -10 47 -53 -56 -6 -89 143 -80 -116 -108
3269 -108 -43 1 30 82 86 -26 -137 99 90 32 -12 72 56 40 -127 123 125 -46 -71 -3 68 -110 -4 101 73 -85
3295 -85 -219 25 31 -83 57 122 119 13 61 -5 -107 -55 65 -48 30 -66 -90 -63 8 -140 28 81 80 -10 -57 31 45
3322 45 36 -11 61 -30 -75 -5 -9 5 -2 51 70 -76 -40 145 -45 78 -87 47 -27 -171 113 80 111 -10 98 87 -33
3349 -33 22 -32 100 16 30 24 26 -71 25 -6 -51 -31 -55 114 188 39 -19 69 70 41 50 7 107 -84 54 21 4 -95 -30
3378 -30 -55 -16 -43 -55 22 33 -65 50 -27 -119 -60 3 130 -23 -40 5 77 58 30 -15 -80 58 -1 55 -36 -3 -6 20 -97
3407 -97 -30 72 24 41 0 100 -29 37 -14 -3 71 -102 -118 13 -95 -126 -127 76 -13 -43 -10 72 24 -24 -69 -18 109
3434 109 98 -56 106 0 -106 18 90 53 -69 -128 32 8 -76 8 -63 2 -73 -52 -65 101 -56 -23 -25 -30 -4 -41
3460 -41 -58 -93 -29 48 -10 -56 -33 22 -100 -48 2 36 -36 94 -111 83 -25 -1 81 1 59 18 -1 -6 67 -15 21 109
3488 109 -88 -15 22 88 -24 -56 -24 -85 -97 -23 146 -50 -75 23 56 -4 -61 20 46 20 -9 23 -84 75 -163 -100
3514 -100 88 -37 -93 12 -4 -23 -127 70 240 -68 52 75 -47 53 -68 52 49 -77 -44 -84 16 -77 6
3537 6 -91 -8 -61 -48 -30 -50 -37 116 1 -81 22 65 111 12 34 38 65 -9 -76 10 -35 -19 95 56 14 -96 -41 33 16
3566 16 92 3 42 19 79 69 3 42 154 18 -78 -134 49 -55 -45 -77 -20 -49 8 -38 99 50 1 -16 13 127 146
3593 146 -125 108 140 -150 -49 85 81 -13 -15 -2 -22 -118 -39 -18 -123 86 67 -78 -56 138 33 -43 60 -6 39
3618 39 19 108 -15 1 -1 -3 -165 56 -90 -87 -132 -110 70 141 35 51 17 6 127 10 36 73 35 6 -4 57 -90
3645 -90 -37 -73 -45 5 -242 8 -92 -5 34 -64 -11 38 35 26 16 -186 -11 -143 47 -19 -127 -22 -46 30 -44 -43 23
3672 23 -107 -7 -83 6 -5 -22 38 -127 2 3 71 57 16 2 -60 2 -35 -7 -48 -42 -129 -2 -82 -5 -7 -21 -4 44 -74
3701 -74 -80 80 -16 19 48 30 34 -89 74 -38 -11 -60 -16 -50 35 -7 -20 -70 29 -44 96 -8 23 -21 -116 144 -41
3728 -41 -59 165 76 -59 -50 52 14 -125 -156 62 99 -55 99 -52 -3 22 40 51 8 44 -65 -42 49 55 8 -53 36
3755 36 -110 39 35 -138 -60 -6 17 -29 -6 50 31 -83 36 33 56 -20 48 -30 43 45 10 -11 -25 -38 -24 -15 -105 -36 47 -27
3785 -27 -94 17 -4 68 -10 15 81 113 -64 -32 185 52 -39 -89 120 -51 16 -75 50 -96 -217 47 -82 -45 -85
3810 -85 -52 -21 -27 -57 -10 -1 -2 -140 66 34 14 72 6 -5 -57 -23 -94 36 -25 -111 -36 -24 -4 -145 51 28 30 69 109 31
3840 31 64 -32 -130 -24 26 -27 49 -29 -72 39 4 -62 -42 222 23 57 79 13 -10 -56 175 -24 82 1 31 23 117
3867 117 -115 21 65 -3 -44 12 74 48 -73 76 19 106 -43 10 52 8 48 24 -22 -14 41 -49 -144 -76 -48 -24 -2 -27
3895 -27 -31 -1 102 68 137 37 47 -17 76 13 -70 79 42 10 49 -51 67 -43 -29 -57 5 24 -58 -32 -73 -49 -24 59
3923 59 -9 88 -19 1 16 113 4 -127 59 -24 -171 -133 -77 1 79 -43 24 83 88 -3 -1 100 -1 -125 83 -88
3949 -88 50 85 -148 71 3 38 -15 -45 -41 -102 26 -56 -65 -77 -21 -56 -96 55 -40 57 -5 55 129 -71 103 92 -28
3976 -28 -20 -42 36 -13 0 -102 -83 30 -43 45 64 -2 23 63 -16 86 41 140 128 -112 7 49 127 24 -59 -85 22
4003 22 -46 -42 16 -33 48 -20 -43 -20 -30 15 -27 142 63 -15 60 36 58 101 16 -127 29 67 -25 2 -45 -29 -72 -118 30
4032 30 53 -64 79 144 139 -3 -115 39 162 -8 10 -6 -48 -120 -47 -87 -64 -150 23 51 5 -76 -128 18 26 -9 15
4059 15 79 25 30 -65 22 84 75 -119 32 67 18 -88 -21 -50 -87 14 -15 14 -62 -92 76 -6 38 -40 42 -4 53 59 -62
4088 -62 -60 -25 -46 -13 -103 -119 21 -9 -31 -118 -109 30 26 33 -73 -81 148 103 -13 25 121 1 -10 109 120 50 -64 -99 8
4117 8 -84 68 49 -13 3 43 0 -72 -24 122 121 -28 -63 51 -30 -8 -40 35 47 -11 37 -42 -76 -48 8 -18 -59 -95 1
4146 1 -32 -25 -48 57 29 103 -146 -13 38 -25 -125 41 70 -57 -27 83 21 79 -42 -77 -27 35 18 46 134 -2 -69
4173 -69 61 -52 43 -56 -55 16 -4 19 -90 -40 67 -120 -56 -102 82 -73 -3 78 37 6 -21 -13 -9 -21 10 139 6
4200 6 17 -31 -15 -22 -149 26 14 16 -55 -10 71 -74 13 78 70 -16 107 -4 -56 20 72 6 -46 -34 48 -4 -22 -8 -77 -58
4230 -58 15 -116 15 51 -131 40 -22 29 28 4 -107 14 4 50 13 -26 19 111 -1 27 -84 -7 32 -2 -26 78
4256 78 -51 -160 -61 51 23 52 17 -67 31 -29 -73 -20 17 85 28 -11 2 40 -112 38 -59 29 18 -25 51 -23 -13 94
4284 94 82 -12 -31 -13 14 -21 60 76 42 -21 -27 -104 67 -49 -194 -20 -150 32 -19 -53 10 13 37 13 10 17 -107 -17 1
4313 1 8 15 -64 -25 93 -60 -21 62 7 50 17 -8 -25 -97 -35 -66 -6 22 52 -6 116 21 51 -59 44 17 -65 -34 9
4342 9 -6 -84 -21 17 -66 -24 30 57 126 -33 60 23 161 4 20 -30 58 25 -53 -13 -18 -22 -43 39 25 21 19 -64 20 48 -55
4373 -55 130 17 -7 86 10 93 -42 -235 14 21 -20 -72 0 -122 -26 53 2 20 -49 -29 -67 95 42 63 18 84 94
4400 94 75 50 -77 -5 -14 -92 -54 -27 -9 -15 2 60 -3 -115 1 33 74 27 10 -3 89 24 7 109 -34 -45 1 -63 -89
4429 -89 -74 -4 -66 -68 -3 -32 62 78 32 -1 -10 1 39 6 84 39 43 51 69 -37 -119 18 -36 6 -1 -23 1 53 -47 -82 18
4460 18 -103 14 -20 -7 -63 68 33 -48 74 12 -37 63 57 -21 42 -109 25 -2 42 -87 52 58 -19 -130 -2 42
4486 42 63 -22 101 179 29 -85 -110 -95 -103 94 -14 -2 22 -57 -71 -72 -44 81 -10 -23 61 -24 46 17 -27 -8 41 9
4514 9 -20 43 -43 9 56 4 -46 71 -48 -8 -18 -86 -83 28 104 125 26 -74 78 54 73 30 -30 15 -90 68 6 64
4542 64 45 -54 -88 -66 -38 -34 -17 39 -47 -71 -6 -130 60 -72 -37 51 -14 42 -147 65 -55 -128 -16 -45 -64 -55 -27 98
4570 98 -37 11 6 -60 -30 47 -33 72 -21 -62 195 17 -32 -27 -47 -81 -119 -53 -58 7 -56 120 -16 -106 1 -24 5 -22
4598 -22 84 51 124 -7 45 86 -77 47 -63 -101 -125 12 17 -64 -73 38 -31 -57 87 60 -5 44 -64 -18 -57 -71 39
4625 39 -32 -5 6 44 134 -161 -36 21 -65 40 43 -20 35 -99 -78 16 75 -12 19 -13 -19 106 9 37 -35 59 60 -79 70
4654 70 16 -17 -18 17 -23 -15 -88 30 21 -86 -14 -19 40 11 15 -32 -12 15 -77 -5 -131 -21 39 6 -44 -44 16 49 7 29 -19
4685 -19 -21 -77 -28 44 33 -21 28 52 94 66 12 -63 -45 -56 -92 23 -8 65 -26 78 9 -8 120 -73 -76 -95 -37 -1 -98
4714 -98 21 -22 -32 -40 37 61 -75 -56 -100 -63 -93 -33 65 -60 -2 57 -7 12 -47 -37 32 56 -40 -29 -34 78 -5 -4 -91 -125
4744 -125 -8 41 37 -22 137 16 43 -94 66 3 -1 127 96 -12 8 -15 23 -19 -52 30 -66 57 -46 39 -75 -5
4770 -5 -102 -140 -53 95 104 80 -42 47 44 -20 140 2 15 -10 33 10 29 -142 34 -82 14 -123 -1 89 -11 -34 141
4797 141 -25 1 126 -47 -10 -82 72 29 86 5 44 -83 -16 -34 -43 -2 -75 -40 -55 14 -47 71 -53 49 -39 132
4823 132 -95 12 -7 -42 -68 9 -56 -59 43 -22 -6 -21 42 -77 -29 40 -68 41 -35 123 -51 38 79 -172 -48
4848 -48 -15 -25 -40 -51 -42 -32 -61 51 72 -99 -7 46 -33 -1 2 33 -12 -10 39 -16 23 -5 -141 26 -1 10 -33 60 25 -25
4878 -25 7 55 28 47 86 -23 -36 14 -108 37 35 0 -6 -47 14 45 -23 -34 -147 -105 80 125 -64 -85 -32 -70 69 -155
4906 -155 59 62 -7 86 -36 44 54 114 -84 46 17 -1 -2 -57 -37 -45 5 -98 -81 -71 -23 -6 -25 124 47 80 24 108
4934 108 -24 1 43 1 45 65 22 -113 -40 85 39 -17 46 -34 -150 -4 80 -11 13 -24 34 31 -16 37 -41 -1 49 -144
4962 -144 19 71 -28 -64 -27 79 -34 64 -63 -28 -55 26 -35 23 -2 -34 -47 33 17 -55 106 -48 -77 75 -17 -4
4988 -4 74 71 75 -35 68 -20 -30 -47 3 -2 -70 -18 30 21 103 24 -58 -50 8 15 -49 -30 -99 -60 -16 -53 -79 -132 25 -16 -50 -33
5020 -33 43 -108 -140 99 -82 -33 27 2 -89 12 158 51 -104 88 -83 67 3 -3 28 -33 -5 -29 64 -33 -17 -39
5046 -39 -30 81 -33 -25 -46 -36 -39 -61 -80 -16 -98 -126 -15 45 -76 -127 -66 -53 -166 -6 13 113 -49 3 10 -178 -119 -94
5074 -94 -51 -40 29 35 -57 16 49 51 -17 -28 12 0 5 -46 -49 -58 -138 54 15 22 -10 -112 37 -68 13 37 -130 31 30 -87
5104 -87 -10 -29 24 68 24 52 17 40 4 -71 67 28 27 -9 37 65 34 -57 -158 -3 77 17 -35 49 33 -36 55 61 84 -33
5134 -33 201 -49 27 63 88 64 -25 22 6 -59 45 -17 -8 -77 44 -1 -70 0 34 5 11 -2 -36 -70 13 1 -73 -35 -86
5163 -86 50 36 -2 -97 24 1 9 30 69 1 -25 -20 -16 22 40 -14 -5 54 -33 -89 -55 18 -70 54 55 -12 -3 56 40 19 60 -22
5195 -22 1 78 187 -34 18 -27 -29 117 8 17 65 -77 -13 60 -64 14 104 -30 -12 -27 -67 -43 -29 19 43 -14 -57 -40
5223 -40 40 2 -37 63 -79 -26 53 -20 -15 -93 -133 6 14 -53 -51 29 1 0 133 11 -62 0 -54 -5 -3 46 8 100 -10 82
5253 82 -70 -45 -109 -123 7 -71 -72 -31 -93 -76 -45 -73 -80 -68 36 96 -2 -21 -9 66 69 42 27 -70 -31 -109 -73 -4 6 62
5283 62 24 9 11 110 72 104 53 137 -69 -32 36 -44 -66 -3 -8 -68 -99 125 18 104 -61 -36 101 15 -57 12 -52 -24 9
5312 9 -7 59 52 -23 6 -95 -73 -15 -25 -90 36 -100 1 -93 -25 122 -91 50 84 13 -71 68 43 59 -126 -38 -48
5339 -48 11 24 135 -5 -112 16 -112 -8 76 95 60 -35 82 31 -54 6 52 -78 -11 -1 6 43 61 -26 85 -72
5365 -72 -112 -115 10 18 -133 129 -40 22 -29 -18 -83 -45 108 84 -91 -145 -56 -88 -20 28 11 -8 20 -26 -23 -125 -66 61
5393 61 21 16 135 92 42 -7 -101 -36 -45 -29 -61 83 53 -23 -39 -52 2 -61 39 101 -35 -57 -46 -74 -79 -21 1 95 40 5
5423 5 -36 122 -29 63 116 68 17 33 -60 -51 -34 37 146 -38 -14 14 72 -27 -39 22 -64 -52 42 -8 -52 18 55 -58 12
5452 12 -29 -16 36 -10 -10 -13 43 -49 -2 -27 -43 24 8 -118 -43 -59 -9 -16 14 27 -66 1 -30 96 -59 -39 44 -61 48
5481 48 -57 40 -31 -50 22 74 -25 6 -47 -53 39 61 42 133 39 -45 42 -55 37 28 6 126 -49 8 11 22 80 27 -35 101
5511 101 88 -24 -9 -23 39 -86 -104 -15 29 -72 -58 -61 15 -9 -48 -57 -67 -12 -19 27 8 46 -1 119 -138 -13 -72 65
5539 65 5 114 142 5 -23 -17 -15 -57 -7 -9 52 9 90 66 4 51 108 16 63 -119 142 -5 -13 18 48 10 -8 -20 -10 50
5569 50 -46 -20 3 -97 -25 -20 -82 104 54 -24 -23 16 -65 -24 17 -37 -17 -71 -87 38 -60 -52 -38 -81 -99 46 55 53 -98 49
5599 49 -76 10 90 -69 55 34 -91 -5 14 -26 -20 -48 25 -172 -66 44 -48 -43 13 4 -16 -42 30 106 50 -87 78
5626 78 28 156 82 -60 53 58 -72 -88 107 -47 72 74 -82 -54 -37 78 55 88 1 -25 -16 -64 14 -9 19 27 28 -71
5654 -71 105 8 -31 107 -56 -118 47 -70 6 -65 53 -22 -18 22 -44 34 75 -72 -130 104 38 10 19 -40 -71 82 105
5681 105 -4 42 -172 -62 -67 13 119 41 -1 -33 -40 33 98 -13 80 -145 -27 -2 -11 47 103 -39 -4 -29 34 63 -157
5708 -157 -111 -65 -60 -24 39 -63 -26 79 -77 32 -51 -29 69 7 92 -33 18 174 32 -26 -32 -183 32 81 -8 30
5734 30 38 23 117 52 36 9 25 -73 110 107 68 -149 20 12 16 120 63 -43 -15 10 73 47 -22 48 131 2 89 -12 -109
5763 -109 -91 -92 -65 -77 -8 43 48 -32 187 -42 73 12 39 -120 3 119 9 -120 -31 92 48 -50 -10 -7 -102 19
5789 19 -6 24 54 -19 49 90 -3 112 -40 4 -94 57 -64 9 -21 13 14 -125 -40 -11 62 -4 -47 23 -73 -86 6 0 -115
5818 -115 -61 -1 69 -44 -20 84 96 20 -61 82 68 22 -29 9 -23 -59 -26 26 -108 -21 32 80 128 -35 -119 30 76
5845 76 -36 39 -48 -32 42 -41 12 -41 -39 -35 -113 41 33 -19 -79 19 -93 -80 -100 -134 37 -12 37 -11 33 -19 -9 -11 53 1
5875 1 35 47 -151 90 21 23 -55 48 -14 -26 81 56 -104 6 103 -28 -27 -50 77 23 36 42 93 -18 5 61 -32 139
5903 139 51 68 -30 -73 31 41 118 -2 63 -1 -10 7 0 -32 76 123 -75 18 57 80 -68 29 -112 -13 1 8 40 77
5931 77 48 -5 -26 67 -7 2 2 -48 46 10 37 43 82 -36 0 -79 -76 62 -104 23 15 110 68 2 -3 -60 61 15 53 32 70
5962 70 -10 -46 91 113 22 -7 -39 -64 12 91 -22 -28 88 81 -40 68 -12 49 67 16 -38 -46 57 -4 20 52 -39 -17 28
5991 28 -23 79 23 -74 -49 -40 63 13 39 27 52 1 -26 48 -15 11 -69 -41 122 8 -43 -54 -93 62 -40 81 -28
6018 -28 78 25 -50 16 57 52 -88 84 -13 89 95 96 62 -9 47 -132 38 -35 -6 31 8 42 75 9 2 -70 -152 -13 -55
6047 -55 -19 132 68 30 -29 -21 9 20 -63 -7 40 43 -52 53 52 -11 4 -17 52 -18 0 -64 56 73 -1 26 -81 -3 -80 -46
6077 -46 31 12 -196 18 -51 -80 36 -13 -21 -45 68 108 91 81 28 10 22 -162 -82 -55 -69 61 -20 18 1 80 -14 131
6105 131 -92 -47 -68 -58 43 99 -6 17 21 -73 -16 129 -10 -71 -32 36 31 -19 -135 -91 -2 -73 39 -20 25 1 -24
6132 -24 -13 -84 4 -3 80 -26 -26 -46 -22 80 73 9 85 -146 61 73 11 28 -93 7 -50 -12 -42 -116 -104 -65 39 -97
6160 -97 -94 207 7 -28 -25 27 -86 -51 43 -85 -10 -66 50 -64 -94 31 -170 25 62 64 8 -71 -47 38 -17 -38 43
6187 43 72 6 -5 -39 -41 21 225 -15 -21 69 -11 -30 0 -95 -18 -2 -25 -8 11 102 -61 99 -40 -10 35 46 -68 -57
6215 -57 29 -14 -107 51 152 -73 -48 -9 -81 -89 -51 -103 -48 23 167 -70 58 60 -66 49 -40 42 -1 36 -57 17 101
6242 101 -101 53 -61 -17 -52 65 -75 33 92 74 23 4 106 98 -22 -31 -12 -31 -11 -15 -2 13 -7 -35 35 18 -32
6269 -32 9 -1 54 -37 -19 44 -88 -62 -64 -53 -77 62 7 -3 -26 30 -32 136 12 -21 19 -35 2 -126 103 39 49 -120
6297 -120 -12 -32 71 45 158 -95 6 -35 5 17 -46 117 61 45 9 46 16 52 -8 -41 -2 -11 -59 -51 46 19 -105
6324 -105 -87 46 -36 -5 123 -15 -5 -41 -15 86 21 11 -2 55 -17 -47 97 63 -43 -14 -94 -21 -40 86 -89 -49
6350 -49 67 -14 -121 4 -11 17 47 -27 -14 27 2 51 36 -109 -17 24 22 63 11 -93 -60 -33 19 -120 -19 -101 -25
6377 -25 11 -67 -29 -60 90 -25 44 43 -99 -43 50 -50 -43 -60 -61 12 -101 -79 -24 21 4 -60 -41 -65 -85 34 86 -20
6405 -20 -98 28 54 -37 13 57 -29 -16 16 -67 41 2 12 -51 -24 59 -55 11 139 -12 -32 65 -30 -67 49 -38 86
6432 86 -46 21 55 85 -40 43 61 -35 37 9 41 -31 50 71 -35 -23 127 -43 -32 95 -134 50 -103 36 -8
6457 -8 78 -50 118 28 124 27 -78 -8 16 11 -26 -6 14 -64 -125 -90 -21 37 33 8 -57 21 80 15 -52 -78 -6 68 28 -11
6487 -11 -50 -9 -17 54 6 20 10 14 14 -76 -14 -159 -12 17 90 -40 -27 62 123 9 88 1 -33 -29 -5 -42 -53 48 89 45
6517 45 35 -6 -124 -9 -6 108 -21 88 32 19 -11 13 35 30 96 -42 34 -16 40 -20 6 113 -10 -76 57 21 -34
6544 -34 63 1 -64 -55 -6 65 -26 -3 -13 -17 17 -20 -50 -64 -42 -41 68 -43 48 -37 47 -60 65 72 80 47 -3 80 8 -80 -33
6575 -33 -19 52 129 -83 65 6 11 -66 -32 98 -70 101 10 -150 57 98 6 -93 81 35 -12 -43 -13 -185 -21 -81
6601 -81 -114 128 51 -33 68 -60 10 -44 -67 -134 77 -56 136 29 25 -52 5 38 -107 30 -61 51 -36 -26 14 -33
6627 -33 53 -3 100 33 38 81 42 -81 -55 93 -5 -9 53 -43 -29 -91 8 -69 -23 -14 -32 68 -7 1 38 -10 -94 -46 3 74
6657 74 68 -22 114 41 -83 45 74 44 -33 91 67 -89 -13 95 53 -7 5 -18 -83 -10 2 13 6 1 21 14 -34 84 -92
6686 -92 18 7 22 -118 -22 110 20 -25 13 127 26 14 -13 -62 11 -103 -53 -4 98 -14 -36 -23 -29 22 -20 82
6712 82 -129 21 -13 -21 -25 14 188 87 -15 30 -55 -90 -18 -7 31 58 -120 -126 -47 23 -93 16 54 59 11 -19 -13 -12 58
6741 58 -63 -91 17 -13 54 77 -44 -2 9 16 39 43 65 42 43 -57 -22 -59 16 24 -97 83 -37 -11 -79 103 66 -55
6769 -55 53 68 69 54 -90 -3 -7 37 23 -32 211 -40 22 -114 -64 50 -2 5 -107 -83 102 58 -71 101 82 -81
6795 -81 -23 21 -18 19 43 0 78 56 121 94 41 -59 -84 18 76 10 -74 -10 -18 2 -41 -55 59 17 26 87 -36 44 66
6824 66 6 -4 105 -52 69 -105 117 57 -30 25 -10 95 -96 112 107 14 5 -103 -76 -35 -1 5 100 17 -155 -7
6850 -7 -92 27 76 27 42 102 11 49 -32 31 -33 84 84 75 0 125 -115 -46 30 -39 -12 -12 78 -72 0 152 101 -24 -48
6879 -48 -9 15 -34 62 62 11 40 76 48 66 -4 -32 -17 33 -9 -89 -32 -4 -1 -68 -27 78 -28 99 72 -58 -41 -35 -154
6908 -154 99 -7 23 -73 -40 -7 -9 73 -32 -2 -42 -111 28 -27 48 -17 -49 43 -43 4 46 -38 -38 -8 -20 -114 4 25
6936 25 10 -34 -37 50 51 -93 -89 62 -83 68 16 -26 -28 -2 -63 15 27 70 29 -67 -1 -16 -2 -58 7 -45 29 -16 -77 -28
6966 -28 10 -60 -36 52 -57 -83 33 62 28 14 18 -7 -34 -14 60 6 -39 -16 68 91 -103 13 119 9 13 58 -41 -10
6994 -10 -71 6 92 -6 103 19 -53 -123 -31 -46 -13 45 32 103 25 54 3 -28 -100 46 67 -124 -7 58 -12 -17 -9 25 37
7023 37 116 -39 89 -28 -51 -32 -32 -29 15 1 22 -61 -196 23 69 45 35 -90 33 30 112 -25 -64 -94 -13 -110 8
7050 8 33 -19 -103 7 27 -68 156 9 28 -146 -14 -114 -94 51 -10 18 53 -75 35 16 -62 -44 53 1 18 41
7076 41 -53 84 -19 -8 43 34 -18 -79 20 24 9 50 -34 30 27 50 -40 10 -4 37 -8 -25 -34 136 -21 -8 -9 39 -46 -14 -81
7107 -81 -20 -148 1 -23 27 26 -2 -5 -49 25 33 -67 34 -1 -82 -76 -103 2 -42 44 66 -43 6 3 28 47 -21 -88 90
7136 90 39 57 9 8 26 36 -23 -40 -11 -58 -84 -63 12 67 -77 -12 14 -57 -54 -5 46 -48 2 -103 33 -130 123 10
7164 10 -126 -50 -13 13 -55 27 70 29 -2 85 -76 10 -34 51 -135 7 -59 63 4 94 68 3 0 -22 0 3 66 -65
7192 -65 -80 -46 -83 53 -50 -102 23 -76 -2 15 -34 -70 -2 -26 -103 65 35 -107 34 32 -78 -60 102 -11 -16 45 -63
7219 -63 58 -56 -2 76 38 13 -45 -65 -48 13 3 -23 -92 -9 -87 -57 -36 70 79 -55 93 80 -42 125 25 60 44
7246 44 -69 48 38 -49 -23 -14 47 65 40 38 48 52 -50 44 -24 84 -30 52 -39 -72 -14 27 47 30 11 72 -64 -9 69
7275 69 -57 -52 29 18 -14 -17 -114 -94 -186 -34 -28 3 107 57 -51 -51 -19 -17 61 13 -42 22 56 89 4 -55 8 -12 -10 21 -33
7306 -33 -8 35 61 -76 45 26 -39 20 -86 -54 25 20 -12 75 83 -19 40 100 51 -174 16 69 16 22 71 -59 -10 57
7334 57 -62 42 -31 17 -70 -67 91 -44 57 -41 17 -60 49 65 -1 45 29 81 10 -47 6 41 59 13 -12 -39 -21 40
7362 40 -11 3 -54 119 -41 -63 -72 79 -50 -109 26 57 -4 52 -52 -27 -87 -61 -51 -102 -50 50 52 2 11 0 16 23 -57
7391 -57 62 14 -52 25 -21 13 -36 -21 -116 104 -88 -49 145 -58 -81 -66 26 -45 52 1 0 10 71 2 0 21 -50 45 61
7420 61 48 -49 -29 -103 -33 -69 -30 33 6 44 116 5 110 11 2 -19 -40 -95 66 -26 -63 -5 -16 24 36 54 55 83 15 -12
7450 -12 -106 22 30 58 -13 -81 59 60 28 -6 -73 15 75 -94 -30 5 46 41 -15 6 4 -60 18 -28 89 -82 17 67 -66
7479 -66 52 32 -83 -85 -26 -63 70 28 -1 -142 51 53 -60 42 4 -94 3 -23 39 185 21 29 -192 69 71 89 23
7506 23 -31 -58 -31 -87 25 6 -64 7 23 -104 26 -16 41 -38 -37 30 -158 -101 5 -52 -97 -36 -67 -92 -54 5 0 69 6
7535 6 -49 -43 171 -20 -26 60 -45 -14 50 57 -18 12 -18 14 -78 63 69 -51 -96 35 -4 -57 -37 24 -32 66 32 -20 28 38
7565 38 58 -9 43 -33 -39 35 -9 12 45 5 27 -20 61 -34 110 34 -31 29 21 -30 -25 2 -70 29 -85 57 -166 -5 -19
7594 -19 -71 -12 -18 1 24 1 -25 1 -84 -10 -6 102 -57 -81 27 13 64 -133 -150 43 28 27 -9 22 -9 30 2 -23 -17 -9
7624 -9 70 21 3 120 12 67 32 15 38 76 27 -128 -62 -83 -74 75 -8 65 -99 22 -27 -56 -77 66 22 -32 26 -38
7652 -38 -14 -19 71 -64 -31 39 30 -39 31 67 -140 -74 -5 56 -59 -101 147 24 -18 -70 131 75 72 -4 36 -39 18 10 11 0
7682 0 -103 -41 -20 -45 -32 -14 13 -3 -34 84 -7 18 33 -55 34 -12 37 34 -86 54 42 61 44 27 -38 -2 -45 -92 28
7711 28 -83 94 122 138 -100 1 46 -68 63 75 10 14 21 82 -26 49 50 59 -4 -25 3 -23 35 -97 -51 89 5 101
7739 101 -32 -61 1 -44 60 93 -36 -92 33 68 -35 10 53 -91 29 -22 53 -74 42 5 113 5 62 4
7763 4 107 19 -53 22 47 -4 77 39 49 -22 -110 -18 26 -72 10 16 -59 5 43 -42 -128 -108 -52 -13 74 -19 -21 -21 -13 26 -11 37
7795 37 -17 -53 -62 92 -134 122 7 -68 115 39 -71 46 -119 -33 73 83 52 -97 -72 -38 14 -23 -27 -16 24 84
7821 84 58 -142 26 -13 -26 -4 -16 14 -48 -48 -59 47 -53 47 -74 0 17 94 -17 54 137 -44 30 -47 -50 29 -64
7848 -64 -27 70 -113 -120 -59 1 181 -11 -49 -4 -90 140 -33 -114 7 50 -30 -31 -22 -52 33 66 -7 -3 72 -45 -33 -66 32
7877 32 -73 -166 9 71 -47 37 52 -96 -14 -9 50 11 -1 -2 16 31 -16 -30 -66 12 53 39 -33 -49 -70 -48 -10 -18 -166
7906 -166 14 45 -43 30 52 5 30 43 54 -19 26 -81 57 -104 38 58 51 28 55 2 20 86 -62 18 -130 163
7932 163 100 5 111 -10 107 0 83 -131 -40 -19 28 -41 87 37 -70 -45 -88 -85 6 2 -110 -84 -25 -121 -29 83
7958 83 133 -1 -77 -1 -4 3 -46 -56 18 -8 -14 -26 47 95 -33 -20 -18 -45 2 -75 -23 -61 -81 -32 1 -55 -60 -88 -107 2 53
7989 53 16 -3 40 -76 -18 -60 -95 70 -36 -21 -9 -5 -18 18 109 72 152 -37 -76 -9 -2 -55 -4 43 23 34 18 -59 -35
8018 -35 2 -48 -5 -9 75 33 -96 24 1 -42 -56 28 15 -29 0 -25 -100 10 94 106 44 -73 -60 -29 -24 49 -40 35 22
8047 22 35 -45 36 -65 -108 -78 -47 44 23 -75 111 -55 -25 122 6 50 -17 118 -44 75 42 20 35 31 0 30 55
8074 55 49 65 -58 66 -7 -25 0 -80 -112 121 95 64 -36 0 99 85 -54 -126 -120 -47 -18 -41 -88 12 -14 -101 -3 33
8102 33 -10 -50 -20 3 -5 -13 -24 50 32 43 -66 -19 -57 -85 -8 -75 -10 -67 3 -85 -82 25 17 -23 49 55 67 -26 10 -17 -12 37
8134 37 -88 48 -10 -21 70 47 21 -89 16 -18 -46 8 2 -24 -23 35 -43 30 -98 -145 -89 84 57 -26 25 29 16 -30 47
8163 47 79 -58 -51 31 36 42 4 24 -71 44 103 34 29 -4 -31 -5 29 30 11 56 91 7 4 -63 -25 53 9 -126
8191a26
$$ Imaginary data points
##PAGE= N=2
##DATA TABLE= (X++(I..I)), XYDATA
0 0 0 0 0 0 0 0 0 0 0 0 0 0 0 -8 8 -8 8 -15 16 -16 24 -24 32 -32 40 -48 56 -64 72 -87 96 -112 127 -144 160
35 160 -180 201 -225 252 -283 313 -348 387 -428 472 -522 575 -636 700 -772 850 -935 1031
53 1031 -1138 1258 -1394 1550 -1727 1938 -2185 2482 -2854 3323 -3945 4807 -6088 8182 -12215
68 -12215 22760 -109930 -214968 100347 168293 -15164 -112185 -191 50879 11165 -21061
79 -21061 -11344 -14697 10303 45569 34419 -42504 -76130 -3288 85752 39328 -62108 -44052
91 -44052 47844 30736 -44240 -27030 34669 21246 -2298 16253 -6573 -57971 -9491 76229
103 76229 40454 -53604 -40892 30458 25139 -22244 -15334 13127 9829 3158 5450 -14371 -35071
116 -35071 -4897 46222 33895 -30378 -41239 14712 28860 -20167 -21273 39868 35449 -43984
128 -43984 -46108 36749 37085 -43739 -31713 57380 39824 -65364 -62024 42729 58822 -22105
140 -22105 -40736 13043 22015 -14059 -14965 8792 6046 -1435 13298 10281 -24204 -29663 13809
153 13809 37586 2073 -31267 -5922 23976 -3519 -30254 5112 36465 2390 -27514 794
165 794 17808 -12179 -14256 24963 23624 -15980 -17422 8380 4128 -9794 4405 17348 -252
178 -252 -14430 -4500 1318 -5346 405 15315 10237 -13175 -17632 7049 15558 -7383 -9787 21089
192 21089 19459 -25504 -30875 20064 33184 -14938 -28558 13715 23277 -16147 -28606 2470 19945
205 19945 6099 -5737 -7410 -10209 -3558 12698 11064 -8912 -11191 11206 16043 -12953 -26209
218 -26209 5761 30157 5985 -23006 -11236 10024 2153 -8723 4573 11205 -5583 -9692 6491
231 6491 6043 -11238 -5187 19391 16144 -12344 -16970 4462 11495 1638 -1031 2190 -2205 -5574
245 -5574 1466 3291 -7001 -4743 13374 12684 -12238 -19705 5068 21037 3070 -12886 907
258 907 12615 -1099 -12073 -450 10153 2931 -3943 328 -1544 -9586 -4271 7908 5141 -5419
272 -5419 -5099 1365 -1119 -5449 1059 7068 1186 -3618 1149 1486 -6661 -6114 8085 11802 -5271
287 -5271 -13846 44 8749 -2165 -9086 1773 9613 -145 -9152 -3523 2768 2736 4078 4286 -1787
302 -1787 -5399 968 6366 216 -4798 3699 9088 -1812 -10990 -3211 7494 3919 -4021 -812 3675
317 3675 -2457 -5548 2009 6506 1236 -1936 2941 3854 -3491 -4122 4923 7557 317 -3864 -1399 23
333 23 -2367 -1885 2221 1383 -2626 -2163 -356 -2257 -3044 1584 5735 1069 -4951 -2092 2993 607 -2320
350 -2320 973 3726 -145 -5345 -3269 724 107 -706 548 -535 -2939 -2744 -117 936 -110 1509
366 1509 3485 241 -3163 -894 2672 2957 1094 655 329 -1798 -1806 1461 1373 -1424 -794 1801 1332 -3131
384 -3131 -4380 1313 6533 3786 -2087 -3311 810 4403 3107 255 -1144 440 4046 3014 -4496
399 -4496 -6613 1594 7767 1888 -7947 -6612 2634 5086 -691 -4283 -1223 3833 3029 -1957 -3656
414 -3656 -1141 2822 4966 1678 -4663 -5826 -390 4757 1877 -4857 -4915 962 2815 -1694 -5275 -1811
430 -1811 3403 2695 -746 -2042 -1770 18 2489 2994 1281 -1588 -2755 -290 2935 1985 -2993 -3567
446 -3567 2839 4394 -3001 -5703 285 3670 2383 962 -933 -2888 244 6177 4880 -2916 -4667
461 -4667 1854 8276 6106 -6923 -13074 2850 17532 4033 -16750 -10901 9450 10647 -3225
474 -3225 -8087 -2499 4097 6435 169 -7486 -3515 6293 6826 -139 -5763 -5986 1229 9647 3640 -12306
490 -12306 -9901 9195 10348 -8268 -12841 1137 9729 3498 -6265 -7812 592 8461 4645 -5362
504 -5362 -4961 2761 2966 537 1426 -1974 -6050 585 7310 -190 -9144 -2992 6304 2227 -5042 -2010
520 -2010 3964 3571 -2028 -4125 2910 8347 952 -7176 158 9408 1233 -10079 -858 12708 2715
535 2715 -13220 -6507 9133 8059 -3784 -6860 -951 3098 3773 1669 -2420 -2765 1910 4988 3527
550 3527 -1971 -7294 -1821 10345 7195 -10416 -12543 6087 11858 -4239 -11304 -730 5638 1973
564 1973 -2448 -5010 -2405 5212 4998 -3965 -5239 3087 4126 -1028 -1016 -1602 -4149 2772 8614 -2872
580 -2872 -12861 -2183 10136 4556 -6515 -6894 600 6028 3029 -5202 -3523 7903 6371 -7234
594 -7234 -4661 8911 5086 -6928 -2065 7775 1500 -7425 -2020 4854 2020 -1821 -2192 -1368 1501
609 1501 2801 114 -1611 -279 738 2013 3864 261 -5443 -1322 7852 3875 -7201 -5319 4611
624 4611 4826 -2811 -5701 -1913 2457 3746 313 -5470 -4922 3090 6404 -121 -5059 -2121 2973 3404
640 3404 -168 -3138 -2710 1558 4489 -680 -7274 -3497 5233 4579 -4059 -7970 -1297 6765 4490 -4841
656 -4841 -6358 3228 8205 -123 -5730 921 4993 279 -1087 1031 -706 -1777 2214 3106 -2982
671 -2982 -4072 1309 2513 -227 -732 -603 -238 2019 2384 -127 -249 1217 723 573 2112 902 -2423
688 -2423 -267 2838 -901 -3256 1054 1753 -2485 -2197 1170 259 -1469 350 1183 -1139 -379 1671
704 1671 7 -1168 1102 1118 -534 -1108 -69 136 -378 -1116 -530 96 -946 -2492 -1071 1532 1121
721 1121 -2292 -1673 2367 2525 -1201 -1394 1550 2160 -479 -1524 138 341 49 -394 -1857 -574 214
738 214 1380 -962 -1914 -468 1655 1269 -1038 -946 1096 1836 791 -724 597 1942 1450 -448 309
755 309 648 558 -597 -65 313 -1284 -1100 81 371 -558 -712 8 374 175 505 -173 -638 921 1949
774 1949 -438 -1587 80 1121 -15 -1400 -1263 -356 -480 -635 -1138 -1164 -276 -91 -148 153 -102 -650 464
793 464 1436 342 -722 26 1265 608 -742 -417 236 -196 -93 -95 -922 -919 34 650 154 -1230 -295 1773
813 1773 1471 -325 -692 1286 2616 627 -1180 321 1690 735 -579 -585 11 163 -193 -260 -797 -694
831 -694 963 897 -821 -914 645 1555 611 -759 136 1192 635 -252 -656 -272 259 -95 -807 -957 -1183
850 -1183 -556 51 -597 -1196 -938 171 709 -278 -855 235 723 341 253 -17 -427 -176 666 516 -1186
869 -1186 -1517 458 542 -1389 -1157 214 326 -399 -294 755 461 -279 562 1565 807 -624 -438 1758
887 1758 1891 -750 -1448 932 1477 -411 -1163 -121 267 -404 384 608 -1262 -1186 1626 2003 -649 -1533
905 -1533 596 2227 1079 -748 -710 315 949 450 -1025 -1130 -445 -9 331 -733 -2159 -666 1417
922 1417 452 -1930 -1140 1497 1007 -1142 -81 1463 -510 -1376 1415 1766 -1653 -3009 657 2200
938 2200 -1213 -2750 -66 1057 -413 -1161 266 545 -571 -323 2002 1488 -1242 -1594 1752 3533
954 3533 -175 -3208 21 3352 708 -2286 -882 833 508 191 -30 -1436 -925 2344 2033 -1817
970 -1817 -1657 1718 2162 541 -275 -926 -557 1847 2813 -856 -3843 -1013 2706 1795 -2062 -3862 -518
987 -518 3838 1166 -4609 -2081 3933 2098 -3219 -748 3003 -707 -2682 2549 3129 -3203 -3739 2278
1003 2278 3054 -2262 -3752 203 2340 -445 -2991 -1005 2271 813 -2733 -293 3490 245 -3038
1018 -3038 1195 3867 -741 -3430 923 3552 -136 -2510 -448 287 282 631 -178 -1381 -173 1127
1034 1127 556 -754 -281 996 1172 612 289 -331 -59 1069 1689 411 -2077 -1755 2323 3149 -2168
1051 -2168 -4876 337 4764 557 -4954 -1702 4123 1412 -3370 -902 2904 547 -2088 1075 2275
1066 2275 -2601 -3166 3189 3650 -3216 -4988 891 3522 -828 -3772 -623 2280 171 -2412 -577
1081 -577 2458 421 -2731 361 3235 -275 -2408 1257 2037 -1602 -1306 2207 791 -2423 -511 1653
1097 1653 -458 -1327 689 455 -382 462 716 -406 -147 971 1282 485 -94 -189 566 894 -724 -557
1115 -557 2007 444 -3596 -1036 3751 893 -3853 -1044 3104 427 -2454 877 2019 -1060 -1371
1130 -1371 1730 1848 -1117 -1727 937 1608 -1238 -2579 343 2429 -878 -3429 -110 2451 -841 -2300
1146 -2300 1075 1706 -1778 -1285 2198 1419 -1958 -836 2355 908 -2006 -603 1674 483 -1740 -690
1162 -690 1240 24 -1869 -430 1484 96 -1277 107 1336 40 -439 1303 1339 -1129 -638 2000
1178 2000 1510 -1186 -1224 1021 1173 -1130 -774 1134 164 -1790 -267 1783 294 -1646 93 1892
1194 1892 -182 -1295 1118 1588 -665 -1096 1013 1288 -1010 -1575 380 985 -1100 -1466 616 801 -1342
1211 -1342 -1586 1222 1307 -1882 -1355 1972 1336 -1697 -862 1756 664 -1509 -266 1587 -271 -1593
1227 -1593 19 1188 -475 -1480 -97 1039 -261 -1324 144 1214 -127 -813 588 1393 -156
1242 -156 -751 1248 1150 -920 -692 1313 881 -1114 -691 858 327 -1028 -273 954 -105 -921 184
1259 184 1205 107 -717 385 1394 -28 -668 620 1061 -513 -894 671 518 -1084 -1262 665 409
1276 409 -1459 -911 754 413 -966 -769 1056 660 -968 -167 1228 238 -936 -42 998 -187 -1382
1293 -1382 199 918 -736 -1561 210 847 -639 -1188 304 1044 -317 -686 690 1027 -240 -482 665
1310 665 893 -222 -621 748 691 -715 -586 550 608 -838 -652 537 409 -703 -259 699 314 -345
1328 -345 310 786 205 -255 558 674 -108 -383 353 400 -422 -633 73 304 -615 -544 226 49 -546 -141 472
1349 472 85 -502 65 778 107 -699 205 641 -65 -767 -11 628 -370 -1191 -67 471 -708 -960 111
1368 111 589 -349 -824 245 814 -30 -353 353 579 37 -233 234 605 -138 -330 151 212 -465 -434 158
1388 158 424 -362 -461 386 336 -17 197 485 81 79 487 549 -142 -141 552 209 -325 -173 44 69 -171 -429 10
1411 10 5 -189 -258 -6 -39 -205 -28 328 382 -369 -203 498 325 -277 -299 83 100 -266 -333 -178 -129 -355 -200
1434 -200 -136 -136 -140 -274 147 330 73 -246 88 538 354 -131 -276 180 322 -209 -356 -254 18 -111 -382 -212
1456 -212 14 114 63 66 90 417 149 301 718 360 -290 -47 812 590 -442 -397 416 188 -309 -187 -245 29
1478 29 117 -308 -196 446 230 -526 -100 925 291 -609 86 886 -83 -592 156 357 -323 -617 -219 229
1498 229 -108 -576 -704 206 591 -259 -881 157 670 -355 -220 751 477 -568 -390 571 487 -280 -350 -147
1518 -147 -15 3 -266 -463 218 100 -408 45 619 47 -412 65 877 252 -396 258 425 34 -266 -210 52
1539 52 299 -66 -646 -91 250 -120 -446 -89 333 17 -355 176 452 99 -277 122 703 223 -502 -131
1559 -131 395 168 -472 -286 216 -147 -731 -216 282 -47 -492 -393 158 497 63 -443 -29 186 -94 -102 419
1580 419 169 -618 -398 423 421 -349 -417 -123 -108 -104 -198 -79 81 -106 -85 288 559 84 -350 237 683 334 -60
1603 -60 17 -93 63 262 -29 -253 30 3 -105 -93 110 -81 -378 165 530 99 -4 142 101 149 242 39
1625 39 111 97 -266 -287 197 169 -308 -417 54 -36 -484 -135 347 -26 -174 -15 187 112 131 67 -15 98 102 -76
1649 -76 16 86 -469 -479 50 63 -414 -300 99 -216 -240 157 204 -110 49 330 142 27 191 96 2 186 95
1672 95 30 48 -84 -167 77 200 -116 -231 3 54 -68 99 240 -28 -31 270 431 137 -67 167 298 12
1694 12 -89 -169 -22 -124 -291 -52 87 -156 -369 75 207 12 -190 118 181 210 29 -39 252 53 143 -97
1716 -97 -93 -92 -120 -124 -177 -162 -178 -166 -86 -172 -46 81 -35 -32 158 212 2 112 217 -69 -193 53 109 -119 -120 -83 77
1743 77 -162 -39 -47 -69 62 -9 -163 153 235 -124 38 448 186 -102 167 505 72 -281 4 198 -34 -117
1765 -117 -39 -131 -23 -142 -173 79 52 -61 -71 66 122 -17 -119 186 198 -120 -180 -36 8 72 -27 -82 -55 -245
1789 -245 -57 -81 -177 -88 -25 -21 51 38 60 -27 34 170 146 38 69 185 44 -181 -46 -173 -11 -42 -33 31 9 -32
1815 -32 -55 168 215 130 20 113 192 -32 18 148 139 2 59 -1 70 7 -46 -27 108 62 -60 -55 -32 50 -1 28 -22 109
1843 109 114 115 100 48 -35 -17 -51 -38 42 -146 -92 -161 -7 -71 -216 -289 -66 -6 -156 -150 133 116 -70 -1 127 281 1
1870 1 -89 107 47 -72 -273 -101 227 -156 -153 -63 57 -171 -115 113 218 90 -11 267 257 92 -27 171 190
1893 190 155 -163 18 92 -10 -212 -72 14 32 -195 -162 -5 -10 -161 -24 88 241 -2 34 142 257 36 58
1916 58 -133 183 108 67 -14 194 207 -160 -95 98 103 -228 -177 180 84 -129 -39 88 253 -24 -137 26 282 -66
1940 -66 -232 -25 40 -70 -296 -51 174 -87 -212 -4 181 94 -23 -3 137 57 30 23 309 263 -131 -108 243
1963 243 127 -277 -25 44 123 -95 -73 91 183 38 71 92 90 219 -107 -1 248 100 -99 -137 151 122 -90
1986 -90 -117 -126 -34 -213 -199 -85 11 -198 -146 -13 160 -24 -137 108 152 191 -25 12 154 -2 -85 37 34 -16 -283
2011 -283 -35 81 68 -190 -56 85 -10 -40 22 198 49 -76 165 108 46 -125 -61 -26 138 -106 -98 31 67 -145
2035 -145 -107 -18 -95 -49 55 42 46 89 165 36 -116 207 86 82 65 169 54 -108 7 172 -109 -8 3 -183
2059 -183 -63 48 -129 -131 -35 11 -129 -35 186 -126 -218 220 120 -171 -290 53 -115 -168 -5 -97 -252 -138 -129
2082 -129 -62 42 -6 -115 -13 170 132 -99 74 218 -77 -20 104 110 -73 -25 7 -47 -128 12 94 -58 80 85
2106 85 -139 -196 83 284 109 -36 54 115 28 -71 105 86 -158 -6 -85 83 -15 -251 -114 15 1 -210 -52
2129 -52 81 124 1 81 169 55 -98 86 237 -53 -100 101 174 -93 -230 -5 7 6 -6 32 -80 49 -148 -175
2153 -175 105 15 -108 -30 118 17 -96 150 65 -124 -107 156 -16 -177 23 -3 -228 -107 198 -73 -139 164
2175 164 245 -21 -110 107 78 47 -10 139 39 -111 -37 44 109 2 -219 -69 120 -26 -235 -35 153 -193 -196
2198 -196 -10 139 -112 -53 163 176 -137 -63 40 48 -115 -131 19 50 -120 -76 -5 38 -92 -39 -51 189 4 -83
2222 -83 112 -42 -72 23 81 -44 -78 49 85 -144 -27 -69 38 -57 -55 50 140 -102 -145 78 65 -83 43 242
2246 242 81 -4 -20 95 81 12 117 180 -59 -11 -89 35 -205 -25 27 63 20 -97 137 185 -45 20 169 193
2270 193 -123 -109 120 -5 -150 -122 3 -81 -70 -102 34 52 -40 -46 63 -15 -182 -17 104 24 -90 -53 147 47
2294 47 -16 -92 -81 -27 -113 41 37 72 -25 153 147 -7 -182 29 39 11 -62 154 43 4 -35 105 38 -15 114 13
2320 13 -120 -69 45 -71 15 -164 -175 125 -5 -141 -53 134 27 7 60 25 6 -46 181 68 -148 -16 -11 -10 39
2345 39 49 86 -17 -64 5 96 -52 -3 -9 106 -157 -5 -34 16 -132 -94 -134 -8 -73 -89 -86 23 -83 -47 -18 157
2371 157 -46 -77 54 9 -130 -49 113 10 57 67 -22 99 39 -120 -51 95 29 -13 -29 138 -55 31 106 60 -84
2396 -84 0 39 -183 86 50 91 25 44 60 -27 -27 57 -1 -93 -60 -61 6 -65 39 34 60 -48 -23 -42 30 1 -29 54 12 -67
2426 -67 -43 -96 50 -17 45 -14 41 -25 -128 41 -6 -10 -116 66 46 -84 -13 -47 -10 -40 -46 -11 -79 -17 48 15 -50 82
2454 82 -84 -75 -147 -85 9 -4 36 -8 92 -26 -12 73 77 -16 9 1 27 -62 -123 43 45 47 -79 52 45 -117 55 57 -28 40
2484 40 5 -13 -94 118 43 38 0 24 -131 -60 -99 -29 -58 58 -8 -53 -108 3 136 16 -72 -91 73 -76 80 27
2510 27 40 60 0 67 -14 36 -142 -25 75 0 -38 34 -116 5 0 -75 -11 46 81 2 22 -34 37 142 -8 50 -46
2537 -46 -21 -38 -15 68 -33 -25 2 29 -108 -121 101 76 -31 -20 -20 31 -33 63 53 12 -31 143 54 -48 52 8 35 -19
2565 -19 -89 14 -47 28 -82 14 -11 -132 -96 37 14 -9 -33 -36 7 -154 117 62 -129 -12 -21 -37 47 89 69 72 45 80
2593 80 -10 8 128 -22 121 11 1 57 111 120 -56 114 15 20 -116 4 -1 78 129 -80 -81 7 -8 -101 27 -134 17
2620 17 21 65 58 59 -148 -20 65 -100 90 -115 -19 7 -47 -109 61 15 18 -67 84 89 132 61 82 42 26 141 -31 -62
2648 -62 -19 92 29 12 62 -37 -21 16 -44 0 18 55 50 31 39 -14 -31 1 41 -20 53 38 30 -82 2 57 42 -114 -35 -6
2678 -6 -33 35 43 -20 -172 25 24 8 -11 -3 1 8 -13 20 -49 -55 -9 103 -96 -63 -143 -107 -79 -42 -9 -28 71 -17 -66 -48 7 -81
2710 -81 -74 7 77 -21 85 -112 130 -5 78 -6 -46 71 40 -57 -122 7 -92 153 25 74 139 -87 -50 22 136 -10
2736 -10 -2 7 -135 -163 -75 12 5 -51 4 16 0 -71 -27 59 -47 44 93 35 -32 -47 102 107 -67 -53 -104 -52 -37 -3 -60 -23
2766 -23 12 -3 -27 33 24 34 39 27 -18 5 48 78 -53 -82 7 -41 -37 -69 -15 -27 -118 -31 -33 -159 -59 9 -43 72 38 -4
2796 -4 -94 6 -95 -53 -22 97 30 70 115 15 -148 -17 2 -19 72 -110 80 16 59 -12 46 36 48 27 13 93 -96
2823 -96 -15 -119 85 -2 -54 48 6 11 -87 -51 -48 -8 4 204 66 -25 -9 56 -57 151 54 38 91 34 30 -75 80
2850 80 -36 -52 -30 14 -73 -11 -42 -14 73 -31 -44 -28 -47 -3 32 -87 40 44 75 -1 -42 -14 -68 -110 51 -10 -134 45
2878 45 93 4 69 -27 -28 -20 -34 91 -9 39 21 -44 9 12 -34 -2 -67 -44 -17 0 54 -39 52 -22 -49 -21 -104 10 -42 33
2908 33 5 66 -32 -16 -61 -112 74 -200 -50 16 75 25 -52 52 -81 -65 66 9 178 -95 28 106 29 -1 -23 83
2934 83 -2 -36 14 43 -226 33 -91 -27 -102 -81 -45 -19 -3 -83 83 -64 82 109 -33 -32 18 49 -85 22 -39 -13
2960 -13 43 -19 21 3 -43 -15 39 -4 60 78 -3 -76 87 -11 -15 38 43 -37 -62 -46 8 -48 112 49 51 63 42 -90 46 32
2990 32 2 47 26 38 -9 21 70 -43 -79 33 -13 -137 -92 -8 110 -103 55 61 -104 20 91 -25 56 34 58 -34
3016 -34 67 23 93 8 136 -33 -15 -50 88 -123 -39 57 20 -12 -70 38 -12 -54 -101 -120 90 -82 38 -60 80
3041 80 -127 -161 63 -106 167 -46 -24 6 60 -34 -151 -18 -111 79 99 36 14 114 81 -41 7 185 60 21
3065 21 34 53 -31 -14 36 -7 -73 -52 12 -55 -99 80 -94 -93 100 101 -20 -4 -47 -16 56 -6 6 -44 10 79 -64 -30 2
3094 2 108 -158 -93 -43 -30 -134 69 203 35 -30 111 74 -73 9 30 -27 15 -3 3 -125 31 -57 -99 51 -7 -80
3120 -80 -80 -74 5 -74 9 31 5 -62 93 39 -6 1 119 -57 65 25 -74 -106 37 -8 -73 67 -86 108 -67 -1 -30
3147 -30 135 39 77 -50 -30 43 29 3 70 -74 -73 -68 53 28 -33 86 16 -17 -48 -110 73 -34 -13 -19 61 7 -76 -7
3175 -7 109 -76 -46 96 91 149 71 -56 26 6 -168 56 19 -16 -30 82 80 -70 91 9 72 -43 -50 9 -52 6 47
3202 47 23 -150 -52 -82 -64 46 -7 -50 117 -8 -35 -51 34 19 42 -82 26 48 78 45 90 17 107 112 13 -20 -27 117
3230 117 129 -55 67 109 -10 71 21 61 -25 103 59 25 -89 45 -39 30 5 -182 -65 -9 -108 -14 -23 -32 1 -61 -18
3257 -18 23 -30 61 -43 57 -53 -18 29 76 -34 7 49 -13 -115 -13 -12 -123 -56 -127 115 -40 -86 41 23 30 -63
3283 -63 106 -9 -69 -51 41 24 -21 -147 -61 26 -172 -3 -3 31 -81 27 80 -76 48 -63 161 70 -26 32 139
3308 139 46 8 20 35 84 128 41 46 -12 -74 -6 82 -56 -7 -40 -74 35 65 48 55 -58 53 42 -56 44 13 -21 -117
3336 -117 -84 -83 98 44 -19 115 126 -53 -2 55 -36 -94 -6 58 109 16 69 31 46 -61 -40 153 102 -103 -77 -98 35
3363 35 -30 -103 -62 -32 -28 -56 106 50 40 -51 24 2 -3 6 70 21 -106 -47 19 90 -111 66 -82 31 -57 -57 -87 0 -28
3392 -28 -45 -15 -24 91 27 -99 41 57 84 -56 -61 -1 -100 -8 -67 -11 38 -81 -13 11 -42 -146 -36 14 100 -20 -117
3419 -117 61 123 63 89 46 13 -79 83 71 37 -21 -64 95 48 -84 1 53 25 -95 -51 148 107 19 39 114 6
3445 6 -29 -57 71 27 -135 -55 -82 27 1 -24 44 -82 -48 -13 -80 -2 39 109 79 -37 5 20 35 77 16 11 -35 -46 88
3474 88 -6 -25 -25 11 -119 25 -33 75 32 -18 79 -35 96 8 -121 92 7 -194 -6 93 -30 -107 65 8 31
3499 31 11 14 -64 -77 25 68 -19 81 89 113 81 -118 81 38 27 55 -95 -43 2 -34 -9 -44 -39 59 -31 32 107 -12 118
3528 118 103 -25 -24 -9 -27 -50 82 12 -96 -8 -33 -47 -117 -55 -25 -80 16 -46 -52 3 15 -21 6 143 61 39 54 109 14
3557 14 86 -68 -4 122 -69 49 22 37 9 -6 14 -22 -40 29 9 -21 43 -83 -99 40 6 -64 -29 140 -37 -21
3583 -21 15 49 -87 -68 -77 46 -120 48 -5 -32 70 73 67 -16 -11 50 -129 -87 160 -11 -100 134 -89 -48 -120 -53 -67
3610 -67 -104 -3 -182 -53 -11 19 -61 1 -28 -57 -100 73 97 55 -22 103 -76 -125 -24 -22 -131 -102 32 -93 -116 72
3636 72 35 53 94 87 9 12 234 -11 56 17 43 41 23 13 80 30 28 9 -78 14 1 -56 105 33 9 -60 47 61 39 36 -5
3667 -5 87 -23 -83 9 -26 -26 -64 25 -18 -99 -20 98 -76 -7 -12 83 30 102 62 46 94 103 -53 -60 152 27 81 -45 6
3696 6 -69 -39 -35 -92 -21 63 25 -95 -29 72 8 -53 134 77 62 7 173 -3 -13 27 -74 17 -69 77 -25 36 -12
3723 -12 -12 -92 33 -81 -54 49 71 -46 -7 134 -22 -115 -91 73 10 -34 40 -17 56 -64 -25 -45 -58 -62 -49 18 25 28
3751 28 39 -35 72 -79 10 34 15 13 -33 51 -128 -45 50 53 32 1 -41 153 28 -163 -82 56 -77 -50 16 -27 53
3778 53 -50 -21 134 21 -4 -7 -71 -120 -73 16 -39 -89 5 -79 -27 -64 10 -1 -41 -24 178 53 61 31 -1 -64 -67 -76 -91 -5
3808 -5 18 -15 -19 -13 -129 -33 -59 10 -121 -15 104 -50 -55 -34 43 12 28 -40 37 -33 -137 -11 78 -24 -98 -28 31 -56
3836 -56 -71 -8 46 -68 76 -9 6 37 117 -15 -73 3 30 -53 17 13 38 -49 -159 41 135 7 11 -56 14 51 -87 17
3864 17 41 -23 28 -37 55 114 -40 25 66 79 -11 -16 -70 -58 -123 -34 -5 91 -154 47 91 -76 48 52 12 23 -48 -52 44
3893 44 127 -60 19 172 49 86 -64 -6 -73 -42 -61 -104 4 103 -38 -21 -74 -38 -24 23 -5 47 96 -107 -45 -91 -104
3920 -104 -54 -170 -58 15 -8 -39 -84 55 62 -40 84 52 -17 0 63 102 59 -102 -31 59 -97 106 -81 -43 121
3945 121 80 -45 125 62 64 108 73 108 20 17 4 89 -8 139 77 22 18 -74 -35 72 -8 -83 -253 -51 -105 -29 14 -25
3973 -25 44 55 16 23 67 -28 50 38 80 17 -108 24 21 -7 33 20 58 63 -18 42 -4 29 55 16 30 -2 -104 -17 4 14
4003 14 46 38 -180 -9 -23 -40 -113 -87 0 -109 -74 47 -39 -85 65 94 95 74 -48 -60 -69 105 -34 69 62 -63 -69 -101
4031 -101 26 -76 -129 35 43 -92 -43 29 -59 66 13 -20 17 107 -19 -44 -7 109 -39 26 19 28 -26 -3 56 -95 -43
4058 -43 -5 65 8 -23 33 66 3 66 28 -43 93 60 -166 84 72 -54 2 7 -36 -4 -70 7 -14 42 -74 56 -65
4085 -65 -13 -72 100 9 105 1 -22 40 -82 76 73 -168 -66 -33 -53 -11 -56 -2 -6 109 -17 -95 63 64 -35 36 106
4112 106 105 39 -85 66 -15 -12 -34 -66 -35 -2 -84 -144 -21 -116 -77 -17 110 45 -115 26 96 17 -137 48 69 -24 -10
4139 -10 49 -118 8 67 -67 50 36 -83 -112 179 69 -22 -4 203 -34 -19 11 16 101 36 71 -131 -50 0 -70 61
4165 61 -29 -2 -115 88 90 11 -35 50 -35 -24 62 -50 -50 -52 46 13 75 115 117 35 48 -76 34 86 -137 13 -69 38
4193 38 16 121 -72 91 69 -51 -125 -127 -50 115 87 -35 83 114 -37 -73 -59 -7 -25 -43 22 43 49 62 10 42 18
4220 18 55 -62 41 30 8 56 33 -27 -31 -51 -1 -1 -13 12 -1 -37 -80 -15 29 -39 -80 -136 55 146 -17 3 41 -115 -139
4249 -139 44 11 -115 -63 56 -6 -114 31 -46 -109 -9 15 138 -67 111 -66 32 39 15 25 110 84 35 -67 114
4274 114 39 -192 -30 35 -9 -41 13 54 45 111 -198 -98 8 88 -7 -99 -17 90 92 86 5 8 -13 -71 32 10 7 -23 69
4303 69 -95 105 7 -115 61 -53 -68 19 51 1 90 22 14 35 26 -60 87 29 -14 52 2 -62 54 -41 15 19 -79 24
4331 24 35 17 -13 -51 97 64 -70 36 0 -32 23 4 -48 44 -127 -26 -11 70 -40 -95 59 -103 80 113 32 127
4357 127 43 59 74 -45 -20 12 -3 -20 0 76 14 13 -90 -3 -25 -30 -92 -13 49 33 62 -99 66 97 87 102 -44 31
4385 31 33 65 4 -42 24 24 -45 -109 55 18 -37 63 -18 -25 -38 42 70 -122 89 33 15 46 -62 -31 -46 22 -15 -73 126
4414 126 -74 -49 -96 -16 108 -57 -72 63 19 -15 36 62 -62 -102 -3 -20 -10 2 -10 -47 -77 24 -39 -50 -22 -18 9
4441 9 26 8 82 99 -77 52 52 -3 12 -59 89 42 14 -4 -108 -16 56 -56 -186 -66 -80 -62 31 124 -197 64 -8
4468 -8 87 -49 116 80 -7 73 49 29 -13 6 -3 18 -97 -56 -157 114 20 -23 -56 95 14 1 53 134 36 20 -6 112
4496 112 38 -59 -89 -77 -69 -143 -5 -11 30 -103 42 -11 -86 -12 57 -2 -27 -51 87 73 171 11 7 26 -65 -19 5 -70 57
4525 57 78 -31 -98 -77 7 -89 -13 29 18 -52 -18 -17 -93 93 20 46 -91 23 -2 -84 7 -68 -104 -35 13 26 -46 -93 -110
4554 -110 65 -50 113 72 -9 71 -48 -53 26 -26 11 72 76 -33 9 91 14 -81 56 -31 70 84 21 2 -8 -66 43
4581 43 -8 -56 70 -5 -82 -56 -65 94 8 -32 -94 -19 -15 -64 -5 -79 108 4 16 26 -4 -20 -4 61 20 107 32 24 174
4610 174 46 -22 -28 -17 -29 32 -45 -83 27 -42 2 -37 -66 -48 -51 47 -81 118 -34 4 89 -19 -19 49 -99 54 -34
4637 -34 -39 -67 76 -64 -2 23 59 71 -5 64 52 -63 46 89 -38 10 30 -55 80 76 52 -101 2 93 -88 45
4663 45 -1 0 -85 4 52 -12 -63 -90 -47 44 -71 -88 29 69 -55 -106 27 92 -35 -84 -14 -108 -43 -46 -16 11 70 133 -38
4692 -38 31 84 3 16 82 121 65 -70 21 -49 27 95 -49 -12 25 141 -134 -96 60 -11 -3 83 -63 -67 -66 14 65 22 -79
4721 -79 41 -79 -41 -32 10 60 -135 -61 -47 -51 42 -75 102 -18 2 -8 81 7 32 17 6 -64 -29 102 -41 77 -98
4748 -98 -52 -98 -30 -166 50 39 74 -26 19 3 41 -54 -5 -57 -89 39 -11 -10 -36 -51 -50 -109 -87 -54 -7 -36 -37 -19 21 8
4778 8 27 -63 15 145 39 47 -42 57 -21 17 97 52 -94 7 16 -82 -83 -116 -109 -161 27 21 10 1 -41 -50 81 -5 -115 81
4808 81 -67 181 -18 -14 38 41 34 -56 -3 19 33 70 -121 73 -50 80 62 -24 46 -2 45 24 -59 -45 -25 -85 -24 -35
4836 -35 -16 37 -45 42 33 62 103 61 27 -4 -11 34 5 58 28 -24 -53 -65 -105 -30 20 105 -8 56 6 -15 50 23 -46 46 87
4867 87 -39 -71 -111 -32 25 2 -40 5 -107 -53 -133 -33 -99 80 29 -17 -29 -2 -36 -18 88 -39 -55 29 -95 103
4893 103 97 16 104 92 49 -76 -44 -71 -68 46 23 38 39 5 -61 62 3 -44 -93 -51 115 70 3 -55 -27 -77 -13 10 50
4922 50 -56 -24 -14 -35 55 21 -24 -56 -13 -38 3 -106 34 -94 -9 -23 18 25 1 -72 -8 -22 5 -2 53 103 15 -69 0
4951 0 118 -26 -94 -5 -50 -4 24 -62 -59 3 -5 -77 -62 -45 53 67 22 3 -85 -6 96 66 59 37 -48 -27 -12 -32 54 39 12
4982 12 84 76 43 46 -118 -25 33 80 86 -20 45 34 -125 -77 38 10 -29 -23 -11 -31 31 56 5 -4 10 2 60 -56 -43 -15 41
5013 41 -180 -36 -43 -72 -75 -31 -25 8 -13 -6 -30 -27 61 47 94 54 56 64 -30 -42 30 -103 -3 2 -36 53 -2 11 -43 0 63 1
5045 1 100 27 -40 38 58 -29 -37 -93 -2 1 -13 64 -11 -87 -94 86 16 -9 0 60 99 -81 -3 -41 -28 52 52 -20 71 -39 -72 6
5077 6 -28 21 -66 -11 43 35 -38 -49 112 87 -82 17 23 3 -37 103 41 -25 -14 -43 69 92 19 54 -54 -9 4 -78 -36
5106 -36 162 23 -90 10 -13 45 28 -34 101 41 14 25 64 -47 79 64 -16 57 -133 -12 48 79 -41 2 44
5131 44 13 -39 -18 44 -48 -53 113 23 -23 30 37 13 10 -7 95 4 73 -108 -61 50 -38 113 35 -14 70 -60 -38 -30 -56
5160 -56 -60 -51 3 10 -8 -53 46 5 -92 -51 29 10 0 -85 -31 33 -56 -106 -39 58 160 -20 -5 5 -18 -53 19 14 20 -82 87
5191 87 18 22 82 81 14 -151 -48 -131 34 -31 50 5 -134 -62 -79 -63 -5 -84 -36 -68 51 35 -16 16 -84 -52 5 -7
5219 -7 -44 56 -93 -89 20 -31 59 -54 36 77 17 -25 118 -17 17 -48 53 51 44 2 -11 37 -1 -27 126 156 -86 -73
5247 -73 37 5 71 -1 60 65 -5 2 -12 119 71 -175 -84 -18 -75 -26 11 62 46 70 49 -15 -18 -42 31 25 13 29 11 8 -2
5278 -2 4 -18 -35 117 -6 -141 63 1 -48 16 11 -70 -25 26 -21 27 10 27 2 -43 25 45 25 -88 -41 -63 17 94 78
5307 78 -60 -49 102 -39 69 1 56 -26 115 143 12 6 -22 -113 118 50 20 31 -25 20 22 33 -9 -28 -18 -188 54
5334 54 43 0 -47 -83 -86 -4 40 -86 74 -102 109 -62 4 -17 -124 -71 -53 -42 99 83 73 79 -131 -30 -41 -3 44
5361 44 29 -101 90 74 7 83 21 -45 65 72 -22 -64 -107 53 190 -157 38 -56 -31 -4 -25 -27 51 -61 -8 -12 -32 -24
5389 -24 -63 -72 -41 -68 -55 -57 36 -42 -23 -31 30 39 -4 58 -11 13 -15 121 82 -4 -22 -4 -66 19 63 -2 18 -25 -185 -17 -52
5420 -52 6 -96 -76 -10 39 48 -12 29 -4 -53 -4 -64 -34 -37 -65 -61 -6 31 -95 -67 -74 -89 -60 11 0 19 54 31 -29 -15 -19 -95
5452 -95 0 63 -68 65 -47 -136 158 -106 -89 33 19 -79 4 -1 43 28 65 -16 19 -65 -63 61 -33 -50 13 -19 29 54
5480 54 3 -147 41 43 -76 -19 33 -6 85 -36 29 -37 12 -29 55 -89 37 50 33 13 46 -47 -36 -30 -82 60 -9 130
5508 130 -104 -25 -39 21 64 83 -50 -23 52 19 -92 -123 -76 -18 109 -82 15 -28 -10 -40 15 -100 -16 -45 -38 -81 -130
5535 -130 103 -23 -12 -14 -10 -26 101 111 54 61 -79 -13 38 -67 -16 -3 -52 -52 7 65 -14 -106 -111 36 -8 65 -32 8 -59
5564 -59 93 -2 -46 -30 15 56 -18 24 -106 72 -117 139 -74 -127 15 37 13 -113 74 55 -23 -12 71 -16 -9 47
5590 47 -4 -163 67 -166 12 -130 -27 8 -61 56 79 30 -56 -100 41 5 95 85 40 -2 -42 12 -16 -67 -86 -15
5616 -15 6 70 -70 3 32 -16 57 -16 85 44 -18 160 5 61 21 -48 -40 89 52 -105 -93 -47 37 -54 -17 -17 3 -3 89
5645 89 5 -2 55 41 -179 59 22 -134 -15 87 29 91 72 8 79 68 27 -10 130 30 16 -24 -50 -54 -159 15 -30
5672 -30 94 -12 38 66 -57 15 -112 -108 1 0 23 -34 -37 30 12 -107 21 73 93 24 -51 79 66 16 60 -37 28 -77
5700 -77 -46 -50 17 -62 -12 0 77 -36 -2 -24 -15 49 -147 -31 -26 48 19 -14 52 18 -4 70 -10 -14 -1 13 -51 -42 -18 -29 -64
5731 -64 40 111 22 -50 73 -15 107 65 -170 -79 77 32 -102 -35 92 42 -16 -16 27 123 -15 1 41 62 -47 78
5757 78 80 36 -12 -69 22 -110 51 -1 -38 58 -10 -40 -16 9 -32 9 -23 -3 16 -55 -35 -22 -65 61 -131 125 63 -6
5785 -6 -59 -29 -57 24 -16 -81 197 -1 -78 125 31 -20 -15 -30 22 -74 -25 -64 -13 -90 -36 -36 -21 44 106 -7 57 -42 74
5814 74 -59 39 24 -62 -20 -84 121 49 47 -9 -73 12 55 -47 -3 43 98 -23 -75 -92 93 28 44 74 30 22 -100 49
5842 49 -49 0 -37 3 -24 -51 92 103 87 18 31 92 57 -123 20 -84 3 116 -4 35 -12 -74 72 -27 -19 -107 21
5869 21 -99 14 97 45 -96 103 27 -16 36 -48 12 11 48 -8 100 -39 -91 -47 -44 -9 37 -114 -84 -32 -106 -10 -12 57
5897 57 0 49 -7 -28 -24 -35 59 9 11 -58 -60 21 32 67 64 -6 46 24 76 -27 -39 -206 -4 75 -12 63 -104 -59 -80 21
5927 21 -178 -105 41 -30 -98 -96 -6 -16 24 29 -201 -39 -69 -58 -25 20 112 -31 13 96 -24 58 41 -4 43 -34 -6 81
5955 81 257 55 -81 17 125 60 -28 -45 -73 -31 3 71 -32 -49 2 36 -23 6 -71 -70 35 35 34 -42 63 -54 56
5982 56 1 -141 20 61 66 30 -23 39 -29 42 -14 105 0 -22 6 -97 47 -49 51 29 -26 116 87 4 -21 -24 -59
6009 -59 109 -137 -25 129 -47 -71 92 -71 -31 -28 12 106 -60 75 -49 -21 33 15 74 -96 3 138 -77 42
6033 42 3 -67 -77 -43 69 -34 -10 -62 -87 -68 26 49 33 -53 21 -122 -93 -15 12 47 -22 -7 0 -40 -37 115 -67 -80 -28
6062 -28 -112 -25 -109 95 28 -97 -19 -38 -15 31 -33 14 27 -7 -18 64 -58 52 84 64 -18 -42 97 -19 -32 -34 55 10
6090 10 -61 43 -36 -13 121 -2 42 57 -69 -15 51 -19 -44 123 -71 54 -76 -15 -62 -44 61 33 -30 -40 -65 -68
6116 -68 -1 27 -54 -27 43 -61 35 37 56 44 -143 47 -60 -121 -87 -39 36 -52 14 -121 -123 43 11 -37 -43 65 7 -69
6144 -69 41 -74 92 50 -41 -4 -16 80 -11 107 -14 87 -39 -130 -42 -25 -77 -55 -68 -93 3 -27 -123 -22 -50 -101
6170 -101 109 -72 36 -25 -38 8 -30 -94 -33 14 -94 15 -34 17 -39 89 -9 90 81 -5 -57 -102 -34 -53 -98 20 28
6197 28 -8 -175 99 47 -11 -26 -46 58 2 -87 55 -79 -78 -107 17 -21 23 -17 -156 -104 11 9 8 27 -113 21 -80
6224 -80 120 -101 -42 37 16 70 54 16 -46 59 -55 85 150 -15 -1 -33 -29 43 26 29 -92 -14 19 37 -45 -18 45 36
6252 36 -39 -61 80 -35 -72 -36 19 10 -104 18 -6 -51 55 20 39 -46 -16 -46 6 -1 -32 51 59 7 -57 -81 -99 8 62
6281 62 16 131 -43 -22 -124 -30 56 17 93 -25 -37 83 8 69 35 13 -70 6 15 51 -38 -16 18 -76 -39 -217 19
6308 19 41 -61 40 -49 -89 -3 11 -109 -30 -26 -35 15 -20 -4 -50 13 6 46 -31 1 36 -124 16 -70 -88 42 -17 -15 -3
6337 -3 -4 82 -38 -73 -99 59 -16 145 -47 16 -34 -39 -26 -1 -4 -85 81 -37 11 88 -4 120 -79 17 -24 16 42 -37
6365 -37 -25 -31 70 -2 -6 -73 35 22 53 -65 -65 -89 12 -80 13 48 53 -19 -31 -110 30 40 6 7 -32 102 -7 46 0
6394 0 -66 -22 -13 -41 8 10 -65 -85 -62 -154 25 69 -8 107 -77 -47 -47 9 105 52 65 -37 58 -60 -34 -50 2 -53 23 40
6424 40 102 71 -30 43 49 -7 157 -68 45 130 -43 61 36 82 59 36 49 102 -35 23 37 -35 9 -53 -47 53 41
6451 41 -1 2 -24 -94 -19 3 -77 -43 59 -75 -14 21 43 -28 94 -44 21 8 -12 -76 25 78 -21 -66 8 -98 83
6478 83 -57 144 -27 11 84 53 30 -24 7 -108 -9 4 58 53 16 -41 -22 -67 -77 -130 -5 -137 -63 18 14 27 11 -71
6506 -71 -43 -60 -10 -96 -116 -74 78 -57 -43 -56 13 -118 -21 -38 -146 -24 75 0 25 -161 -46 84 17 -31 77 45
6532 45 59 117 -60 19 66 115 -98 139 31 59 -71 -49 41 92 12 27 -24 32 -51 -13 15 -45 -129 -80 -80 58 74 -89
6560 -89 -55 -100 -70 3 32 -13 69 -7 84 -25 -24 7 -66 -11 -30 94 -4 110 -37 156 62 141 16 54 115 31 31 -10
6588 -10 79 60 133 -71 8 -23 10 0 -8 -79 33 5 -106 -84 -27 201 9 -14 -60 25 2 -48 -59 -98 49 85 -14 -74
6616 -74 37 62 -38 82 -36 -23 2 3 -16 68 19 82 54 8 22 -39 -70 -82 -12 55 -8 6 -95 -29 30 -31 39 -42
6644 -42 24 7 -59 -10 7 -51 -6 44 17 84 -90 -37 5 35 -58 -1 -116 120 -24 129 16 53 57 -26 -5 -46 -37 -5
6672 -5 -58 -26 -99 -45 -16 74 10 80 16 19 -68 -9 -6 -124 3 -76 24 -81 55 39 -65 13 -45 98 14 51 28 -68
6700 -68 -133 52 44 43 114 74 38 4 -38 20 61 17 -38 -36 -29 4 41 77 -54 -58 -20 -133 -58 -39 -90 71 -51 -104 126 -35
6730 -35 -11 69 41 34 -27 -105 -25 -14 43 28 -93 51 -30 21 38 131 128 -186 30 -40 22 -31 66 -1 7 -61 -8 83 6 -107
6760 -107 -139 103 -34 -29 -64 -116 41 -35 -63 -114 -32 -55 14 -114 -1 27 45 -83 26 22 9 -18 -59 89 40 3 -71
6787 -71 -152 -10 -98 -75 -32 -55 -33 -52 -7 -38 41 -14 32 101 -56 -49 -54 -168 16 11 -9 12 119 -11 -74 -36 -24 -82 -21
6816 -21 -21 -27 22 83 -8 -36 99 0 21 99 68 7 98 98 -26 -6 25 -117 -48 -106 -79 -7 -4 -112 28 -46 11 -52 -74 32
6846 32 7 -81 16 98 33 -73 65 -50 39 7 -55 -8 69 -8 -35 67 -120 -27 -97 -39 4 58 50 145 -9 0 36 68
6874 68 -6 88 71 24 58 -6 77 10 9 -21 -7 0 43 49 -121 65 -23 -89 10 -27 -10 21 -105 -11 67 -53 20 0 -88 40
6904 40 5 -8 0 -29 66 -21 32 -16 33 -16 -102 36 58 36 41 141 -11 9 -159 -1 11 -75 -41 137 -18 -31 -25 5
6932 5 90 -81 66 23 57 -38 9 3 12 130 -11 -68 -26 112 -53 49 -37 53 -17 -69 -74 -101 -27 -29 15 -5 -15 -73 56
6961 56 162 -137 29 -12 127 84 -1 -107 27 -81 -101 -67 82 -39 -49 22 12 11 47 10 5 -85 37 -108 15
6986 15 20 -4 -47 31 93 -79 11 3 -8 75 -51 -30 45 10 35 19 47 -21 -96 -69 -55 -85 -31 -52 -57 45 -116 -26 45 -52
7016 -52 32 -11 31 4 57 -43 12 -51 -10 -76 28 -9 15 76 79 26 -33 6 46 32 -41 31 -94 95 -34 7 92 80
7044 80 -26 -1 125 31 -59 -25 -40 -23 33 73 -53 -56 33 14 -107 -73 -9 97 -36 13 34 -4 -25 -101 -66 2 -39 6
7072 6 72 66 0 -108 55 59 1 -12 13 0 1 52 90 33 20 2 8 -27 13 -96 89 26 89 25 55 12 32 111 -15 101
7102 101 -22 -15 -12 15 -2 -65 -17 9 -38 -41 45 -2 31 33 71 -1 24 212 144 2 74 -38 -9 -89 94 -57 -86 -24 -4
7131 -4 3 -12 -7 56 44 -94 25 -7 45 97 -20 -145 31 -43 -88 35 28 -49 -57 -69 -41 15 27 -56 -7 -77 0 83 5 32
7161 32 -18 -34 66 -84 -44 20 29 44 8 -10 42 -75 13 8 -72 57 4 -30 -36 99 -4 30 -97 -51 85 -71 -127
7188 -127 101 9 -27 73 -80 17 149 -1 -107 -20 13 -90 -73 72 -10 59 -66 -27 114 1 -55 60 34 -82
7212 -82 -7 -77 -44 36 -23 -63 67 63 42 25 35 -15 13 78 63 -30 67 1 79 0 -1 71 61 28 26 53 83 14 -74 -44 -20
7243 -20 51 -59 72 31 -41 6 -63 55 -36 59 59 10 -68 44 -4 -14 27 -29 103 -57 -19 -16 19 -67 4 7 1 -47 -42 -26
7273 -26 66 64 -69 7 74 128 73 -23 -6 -2 8 47 22 -6 -38 118 -50 27 12 71 -2 13 48 202 -45 -47 -60 138 -8
7302 -8 -71 -14 81 12 -22 -83 -7 0 -26 101 39 82 0 21 -86 2 29 -29 -51 85 -41 120 115 49 15 -42 34 32 12 70
7332 70 -24 -5 136 20 151 5 -12 57 -6 -42 13 12 -13 -6 28 34 11 -20 -148 61 -24 26 -22 -93 31 -25 -59 13
7360 13 -13 -19 96 39 -33 -44 43 51 -73 78 2 25 44 12 25 -5 -59 36 -35 40 -36 -51 107 -88 7 19 20 40 -15
7389 -15 65 -56 -115 -54 13 40 50 -32 -35 42 73 -62 52 18 -32 58 35 21 169 -10 6 -59 3 71 38 -13 -55 -30
7417 -30 15 -46 -17 -51 21 93 -52 -98 6 65 14 -76 12 -57 68 51 31 5 10 -90 -71 88 -128 -9 42 16 21 -78
7445 -78 19 39 -28 28 3 -17 14 -40 -69 25 -45 4 5 7 67 94 -39 -34 -3 -57 -12 26 9 13 -3 0 60 -80 -59 -8 -97 -65
7477 -65 -35 126 32 -25 -54 -110 -86 7 94 -3 -66 32 -107 -32 75 3 -6 1 94 29 28 -23 53 -121 37 -21 68 -2 91
7506 91 53 -15 9 -118 21 39 -124 21 -68 43 73 35 5 -56 37 -122 18 -36 -28 18 -95 -47 138 86 33 -142
7532 -142 -20 22 62 -43 15 56 45 67 33 -48 7 95 20 27 57 -11 82 48 20 18 -81 -70 -62 63 36 -45 -60 -85 30
7561 30 -12 -62 77 -38 11 1 -71 -25 -87 -99 46 2 -54 7 49 -23 12 4 -42 73 3 22 17 -2 60 -24 -67 -169 19
7590 19 -10 -30 -20 -7 12 -34 -50 -127 -2 -100 -78 95 24 43 -95 -35 7 13 163 1 -52 56 -33 -67 71 -23 57
7617 57 -108 -90 22 103 62 -59 46 68 -9 58 -100 -48 101 -22 10 73 -9 3 12 2 65 39 -27 -77 -24 8 -42
7644 -42 -79 29 -117 31 -113 -91 -11 -16 -30 -31 67 65 37 124 -2 -32 77 35 -18 28 -23 55 58 34 97 -71 11 14 -61
7673 -61 105 -29 -89 -55 57 -73 -102 47 23 14 -34 -56 -21 -73 -73 -92 -10 -73 -62 43 -38 -2 -92 64 58 71 120 -43
7701 -43 66 108 -59 -104 51 71 36 10 16 -22 -46 -29 81 -54 79 72 -20 -20 68 1 -20 96 56 -35 -16 107 3
7728 3 26 1 65 25 50 -9 -68 -27 22 48 -16 0 -8 46 83 29 112 55 101 5 -32 -2 -68 -8 51 -91 21 79 5 50
7758 50 18 12 -67 63 -48 -118 -25 5 43 -43 90 -4 -92 1 103 -44 60 31 -73 33 131 83 -25 48 46 33 109
7785 109 15 79 54 105 22 -17 -6 7 66 33 15 -28 74 61 116 -8 -11 10 19 -57 114 37 24 -50 -39 -49 -13 67 -152
7814 -152 -26 -10 96 -66 42 -44 -28 -5 198 -15 -66 15 -2 -121 -36 -15 -2 6 21 6 -123 -77 17 -2 -17 57
7840 57 -10 50 -7 -125 28 -28 -20 -8 -12 117 -34 -17 -76 -66 75 -32 -81 -66 -64 48 -77 -58 3 58 -8 6 -138
7867 -138 32 60 77 6 128 -48 19 -89 -134 44 -32 59 22 30 0 68 35 14 68 52 -25 41 82 62 36 15 -69 -86
7895 -86 -57 82 -17 -8 0 96 -53 -14 -16 -35 -18 15 -39 34 97 31 -37 -61 -1 77 -84 42 87 -34 -15 6 -3 -60 8 28
7925 28 -52 35 -40 -148 13 92 94 24 -51 -90 2 4 -62 37 -56 49 -154 26 -49 -128 -117 -43 -24 -104 -59 22 -32 89
7953 89 -13 -19 54 54 103 55 69 17 -110 -49 -96 -7 39 14 16 13 -29 -21 -17 -53 -17 78 81 74 69 -54 -52 -149 -24 81 -36 -17
7985 -17 -36 0 -52 57 146 -44 -28 85 -11 110 135 77 39 -16 71 0 -49 -94 -26 1 -62 -21 11 -12 24 15 -77 72
8013 72 34 77 -16 -12 0 -37 2 -7 -19 67 35 -60 26 -39 -4 -32 -6 81 -73 -37 -67 65 61 -32 -72 -9 56 -33 66 5 -52
8044 -52 76 -11 69 -39 -8 28 -43 32 -68 63 -7 51 -81 -56 -1 -123 -23 -100 -12 96 -83 8 38 -2 94 -16
8070 -16 61 -20 1 -19 -24 -139 -20 -18 24 23 -43 14 21 -150 -26 -68 -29 -6 -124 72 48 29 -20 58 50 91 -95 65 32
8099 32 49 -143 -36 94 96 -81 7 -56 19 73 -88 26 -51 84 11 4 144 53 36 34 -41 35 -18 48 -128 26 32
8126 32 -56 64 -64 127 29 -35 20 103 85 -26 92 30 -1 139 -126 -31 -30 -122 53 9 39 6 -46 54 -19 13
8152 13 -47 40 -3 6 -7 -4 0 13 50 -57 119 -23 -47 43 -69 -59 72 23 63 -104 71 -9 115 -62 -55 40 -48 25
8180 25 -114 4 25 -62 -29 37 20 52 -40 -29 41
8191D1
##END NTUPLES=NMR FID
##END=
