##TITLE=1H_DE-80H_X3
 200.13MHz, d2o
 8 sc
 
 19ns.26.2.2025
##JCAMPDX= 6.0         $$ Bruker NMR JCAMP-DX V2.0
##DATA TYPE= NMR FID
##DATA CLASS= NTUPLES
##ORIGIN= UXNMR, Bruker Analytische Messtechnik GmbH
##OWNER= pz
$$ XWIN-NMR		Version 3.5
$$ Wed Jul 22 13:55:36 2026 Russian Standard Time (UT+4h)  Yarkov@DPX200
##.OBSERVE FREQUENCY= 200.1313
##.OBSERVE NUCLEUS= ^1H
##.DELAY= (6, 6)
##.ACQUISITION MODE= SIMULTANEOUS
##.ACQUISITION SCHEME= undefined
##.AVERAGES= 8
##.DIGITISER RES= 18
##SPECTROMETER/DATA SYSTEM= spect
##.PULSE SEQUENCE= zg30
##.SOLVENT NAME= CDCl3
##.SHIFT REFERENCE= (INTERNAL, CDCl3, 0, 14.3821)
##AUDIT TRAIL= $$ (NUMBER, WHEN, WHO, WHERE, WHAT)
$$ ##TITLE= Audit trail, XWIN-NMR		Version 3.5
$$ ##JCAMPDX= 5.01
$$ ##ORIGIN= Bruker BioSpin GmbH
$$ ##OWNER= Yarkov
$$ C:/Bruker/XWIN-NMR/data/yarkov2/nmr/H-C/1/audita.txt
$$ ##AUDIT TRAIL=  $$ (NUMBER, WHEN, WHO, WHERE, WHAT)
(   1,<2026-07-22 13:54:43.93 +0400>,<Yarkov>,<DPX200>,
      <created by zg, POWCHK disabled, PULCHK disabled
       configuration hash MD5:
       00 E9 B6 7A A2 85 ED C7 34 08 36 98 17 FE 4E 26
       data hash MD5: 16K
       D8 BA 61 DD 1D AC 5D 1E A6 FF E4 10 DB 38 75 DF>)
$$ ##END=
$$ 
$$ hash MD5
$$ D3 A7 46 C5 0D 56 C3 8C 6F 0A 84 F3 F0 67 78 7B
##$RELAX= 
##$RELAX= 
##$RELAX= 
##$RELAX= 
##$RELAX= 
##$RELAX= 
$$ Bruker specific parameters
$$ --------------------------
##$DU= <C:/Bruker/XWIN-NMR>
##$EXPNO= 1
##$NAME= <H-C>
##$PROCNO= 1
##$TYPE= <nmr>
##$USER= <yarkov2>
##$AMP= (0..31)
100 100 100 100 100 100 100 100 100 100 100 100 100 100 100 100 100 100 
100 100 100 100 100 100 100 100 100 100 100 100 100 100 
##$AQSEQ= 0
##$AQ_mod= 1
##$AUNM= <au_zg>
##$AUTOPOS= <>
##$BF1= 200.13
##$BF2= 200.13
##$BF3= 200.13
##$BF4= 200.13
##$BF5= 200.13
##$BF6= 200.13
##$BF7= 200.13
##$BF8= 200.13
##$BYTORDA= 1
##$CFDGTYP= 0
##$CFRGTYP= 5
##$CHEMSTR= <none>
##$CNST= (0..31)
1 1 145 1 1 1 1 1 1 1 1 1 1 1 1 1 1 1 1 1 1 1 1 1 1 1 1 1 1 1 1 1 
##$CPDPRG= <>
##$CPDPRG1= <>
##$CPDPRG2= <>
##$CPDPRG3= <>
##$CPDPRG4= <mlev>
##$CPDPRG5= <mlev>
##$CPDPRG6= <mlev>
##$CPDPRG7= <mlev>
##$CPDPRG8= <mlev>
##$CPDPRGB= <>
##$CPDPRGT= <>
##$D= (0..31)
0 0.7 0 0 0 0 0 0 0 0 0 0.03 0 0 0 0 0 0 0 0 0 0 0 0 0 0 0 0 0 0 0 0 
##$DATE= 1784714083
##$DBL= (0..7)
120 120 120 120 120 120 120 120 
##$DBP= (0..7)
150 150 150 150 150 150 150 150 
##$DBP07= 0
##$DBPNAM0= <>
##$DBPNAM1= <>
##$DBPNAM2= <>
##$DBPNAM3= <>
##$DBPNAM4= <>
##$DBPNAM5= <>
##$DBPNAM6= <>
##$DBPNAM7= <>
##$DBPOAL= (0..7)
0.5 0.5 0.5 0.5 0.5 0.5 0.5 0.5 
##$DBPOFFS= (0..7)
0 0 0 0 0 0 0 0 
##$DE= 6
##$DECBNUC= <off>
##$DECIM= 32
##$DECNUC= <off>
##$DECSTAT= 4
##$DIGMOD= 1
##$DIGTYP= 9
##$DL= (0..7)
0 120 120 120 120 120 120 120 
##$DP= (0..7)
150 150 150 150 150 150 150 150 
##$DP07= 0
##$DPNAME0= <>
##$DPNAME1= <>
##$DPNAME2= <>
##$DPNAME3= <>
##$DPNAME4= <>
##$DPNAME5= <>
##$DPNAME6= <>
##$DPNAME7= <>
##$DPOAL= (0..7)
0.5 0.5 0.5 0.5 0.5 0.5 0.5 0.5 
##$DPOFFS= (0..7)
0 0 0 0 0 0 0 0 
##$DQDMODE= 0
##$DR= 18
##$DS= 0
$$ [...]
##$SUBNAM2= <"">
##$SUBNAM3= <"">
##$SUBNAM4= <"">
##$SUBNAM5= <"">
##$SUBNAM6= <"">
##$SUBNAM7= <"">
##$SUBNAM8= <"">
##$SUBNAM9= <"">
##$SW= 18.0517328524113
##$SWIBOX= (0..15)
0 0 2 0 0 0 0 0 0 0 0 0 0 0 0 0 
##$SW_h= 3612.71676300578
##$TD= 16384
##$TD0= 1
##$TE= 0
##$TE2= 300
##$TE3= 300
##$TEG= 300
##$TL= (0..7)
0 120 120 120 120 120 120 120 
##$TP= (0..7)
150 150 150 150 150 150 150 150 
##$TP07= 0
##$TPNAME0= <>
##$TPNAME1= <>
##$TPNAME2= <>
##$TPNAME3= <>
##$TPNAME4= <>
##$TPNAME5= <>
##$TPNAME6= <>
##$TPNAME7= <>
##$TPOAL= (0..7)
0.5 0.5 0.5 0.5 0.5 0.5 0.5 0.5 
##$TPOFFS= (0..7)
0 0 0 0 0 0 0 0 
##$TUNHIN= 0
##$TUNHOUT= 0
##$TUNXOUT= 0
##$USERA1= <user>
##$USERA2= <user>
##$USERA3= <user>
##$USERA4= <user>
##$USERA5= <user>
##$V9= 5
##$VALIST= <valist>
##$VCLIST= <CCCCCCCCCCCCCCC>
##$VD= 0
##$VDLIST= <DDDDDDDDDDDDDDD>
##$VPLIST= <PPPPPPPPPPPPPPP>
##$VTLIST= <TTTTTTTTTTTTTTT>
##$WBST= 1024
##$WBSW= 4
##$XGAIN= (0..3)
0 0 0 0 
##$XL= 0
##$YL= 0
##$YMAX_a= 267150
##$YMIN_a= -337970
##$ZGOPTNS= <>
##$ZL1= 120
##$ZL2= 120
##$ZL3= 120
##$ZL4= 120
##$ABSF1= 10
##$ABSF2= 0
##$ABSG= 5
##$ABSL= 3
##$ALPHA= 0
##$AQORDER= 0
##$ASSFAC= 0
##$ASSFACI= 0
##$ASSFACX= 0
##$ASSWID= 0
##$AUNMP= <proc_1d>
##$AZFE= 0.1
##$AZFW= 0.1
##$BCFW= 1
##$BC_mod= 2
##$BYTORDP= 1
##$COROFFS= 0
##$CY= 83.5205535888672
##$DATMOD= 1
##$DC= 2
##$DFILT= <>
##$DTYPP= 0
##$F1P= 10.8118882576601
##$F2P= -7.23987719738617
##$FCOR= 0.5
##$FTSIZE= 0
##$FT_mod= 4
##$GAMMA= 1
##$GB= 0.15
##$INTBC= 1
##$INTSCL= 1
##$ISEN= 128
##$LB= 0.25
##$LEV0= 0
##$LPBIN= 0
##$MAXI= 10000
##$MC2= 0
##$MEAN= 0
##$ME_mod= 0
##$MI= 1.114404
##$NCOEF= 0
##$NC_proc= 0
##$NLEV= 6
##$NOISF1= 3.799351
##$NOISF2= 2.8
##$NSP= 1
##$NTH_PI= 0
##$NZP= 0
##$OFFSET= 14.38212
##$PC= 1
##$PHC0= -7264.547
##$PHC1= 21.42198
##$PH_mod= 1
##$PKNL= yes
##$PPARMOD= 0
##$PSCAL= 0
##$PSIGN= 0
##$REVERSE= no
##$SF= 200.129724274929
##$SI= 16384
##$SIGF1= 3
##$SIGF2= 2
##$SINO= 400
##$SIOLD= 16384
##$SREGLST= <1H.CDCl3>
##$SSB= 0
##$STSI= 0
##$STSR= 0
##$SW_p= 3205.1282051282
##$SYMM= 0
##$S_DEV= 0
##$TDeff= 0
##$TDoff= 0
##$TI= <>
##$TILT= no
##$TM1= 0
##$TM2= 0
##$TOPLEV= 0
##$USERP1= <user>
##$USERP2= <user>
##$USERP3= <user>
##$USERP4= <user>
##$USERP5= <user>
##$WDW= 1
##$XDIM= 8192
##$YMAX_p= 0
##$YMIN_p= 0
$$ End of Bruker specific parameters
$$ ---------------------------------
##NTUPLES= NMR FID
##VAR_NAME=  TIME,          FID/REAL,        FID/IMAG
##SYMBOL=    X,             R,               I
##VAR_TYPE=  INDEPENDENT,   DEPENDENT,       DEPENDENT
##VAR_FORM=  AFFN,          ASDF,            ASDF
##VAR_DIM=   8192,          8192,            8192
##UNITS=     SECONDS,       ARBITRARY UNITS, ARBITRARY UNITS
##FACTOR=    0.0002768,     1,               1
##FIRST=     0,             0,               0
##LAST=      2.2672688,     0,               0
##MIN=       0,             -337970,         0
##MAX=       2.2672688,     267150,          0
$$ Real data points
##PAGE= N=1
##DATA TABLE= (X++(R..R)), XYDATA
$$ [...]
1178b336M123l78m130P16L935r35l652J358L967j363l754J873L065k140k500K676
1194E25K301l724k128M400J532m639j179M406L76l843J08L707n22l403J188L574
1210B679j197l569J351L775j271m013R17M242j483m039J658L339k301k775K651
1225c6K683l437k112M023J449l721q22L499P48l120n60L017p3k789L35K422j011
1242D95k426R35K640j246l055J589L056j874k582K096K288j999j819K478J460
1257B036k762p35K795K01k873p1K728j58k867K62K712o17k638J045K379j140k198
1274a901J695K364j648k579K253K489k335k178K063K045k074j869K176R56k087
1289f30q23K208K03k348M0K643Ok680L85K773l60k682O08K446o74k394R56J935
$$ plain form
1178 -2336 1787 1409 -2721 -2005 1930 995 -2657 -1299 2668 1305 -2449 -576 2489 349 -2151 525
1194 525 2826 -898 -3026 1374 2906 -1733 -2912 1494 1870 -1973 -1865 1842 1320 -2083 -895 2679
1210 2679 1482 -2087 -736 3039 1768 -2245 -1328 2914 1431 -2608 -950 2389 88 -2687 -36
1225 -36 2647 -790 -2902 1121 2570 -1151 -1973 1526 2274 -846 -1406 1611 1538 -1251 -916 1506 495
1242 495 -1931 -996 1644 398 -2657 -1068 1988 114 -2468 -372 1916 -83 -1902 576 2036
1257 2036 -726 -1461 1334 1535 -1338 -1409 1319 1161 -1706 -1444 1268 651 -1987 -942 1437 297 -1901
1274 -1901 -206 2158 510 -2069 184 2673 338 -1840 223 2268 194 -1675 501 1457 -630
1289 -630 -1453 755 958 -1390 -1350 1293 1299 -1381 -996 1777 1417 -1265 -657 1789 1115 -1279 -323 1612
1307A612j293j803J418J421j619j427J576J406j660j326J855J224j793q47J649
1322C93R19j550n89J473M07j747J48J342n84j355O68J062p93j316J210J149j179
1339c42j004J424Q72j077p98J356O28j381k15J436K8j592J79J255l3j942M40J799
1357A033n56j882Q41J695p68j632J033J802r85j770J474J475j324j540J135J442
1373A473j127j340Q20J007q32q07O98N77p52n52P87O71q96m43J022M17o79m43
1391c99N55N10n94l04M89j75n75O12N8p33j77Q23M7r23K8J135q8p28J74O29r2
1412B72m13K88L24m08m19N07O75o26q98J6J131M2j341L9J342j39j102L48R90l65
1432B63q02O73R07q15n93M67L98J88n71m60L92O41o91n78K26P49k26q37L32O23
$$ plain form
1307 1612 319 -1484 -66 1355 -264 -1691 -115 1291 -369 -1695 160 1384 -409 -1256 393
1322 393 1312 -238 -827 646 1053 -694 -546 796 212 -1143 -475 587 -206 -1522 -312 837 -342
1339 -342 -1346 78 950 -127 -925 431 1059 -322 -537 899 927 -665 -486 769 736 -1206 -766 1033
1357 1033 477 -1405 -564 1131 363 -1269 -236 1566 581 -1189 285 1760 436 -1104 31 1473
1373 1473 346 -994 -174 833 1 -806 -108 469 -283 -835 -48 623 -273 -716 306 723 44 -399
1391 -399 156 666 72 -232 257 82 -493 119 177 -556 -733 90 137 -786 -758 377 289 -439 -265 364 272
1412 272 -141 147 471 63 -356 151 826 200 -698 -682 449 491 -850 -811 531 392 -710 -362 628 263
1432 263 -539 134 1041 226 -367 100 498 686 115 -345 47 688 -3 -581 -355 394 168 -669 -337 286
1452B86k14j7K4m5J55J9O1R9k59k53j36N57L55q44q63R02Q83q31j039O88J122
1473F50n68q26L57Q92l15m06J48M17J09m11k06M09R3o24k29Q02J23j195m29J732
1493E23L03j630l48J486O05j103k40N16M25l98j05J15K35j82q80L53J539n52j898
1512a236M26J876p35j204M43J176p67n09R15K62n84oQ0J35M22m47p27N53P02r32
1532a57q21J150P86j629n31J364M80j087j03N27K90n2m88j36N81M68n21n43P25
1551C03K85j276J24J275l79j380K96J188j34j194N0J140J42n26m43N12O22l55
1569B50o83M85O25n10n89O23M46p40p38Q66N64q06o79N76P79l74n62O08L74n48
1589c3k05M18K76l2m38n1M87R0o03m71Q00K17o91l14P60J50q06K46N50k83k45
$$ plain form
1452 286 72 55 79 34 189 208 269 368 109 -144 -280 277 632 -212 -1075 -173 710 -121 -1160 -472 650
1473 650 82 -744 -387 505 190 -216 -68 349 458 47 -159 250 343 -281 -510 292 415 -780 -1209 523
1493 523 826 -804 -1152 334 939 -164 -404 112 537 139 34 149 384 202 -678 -325 1214 662 -1236
1512 -1236 -810 1066 331 -873 -430 746 -21 -530 385 647 63 57 137 272 694 247 -480 73 775 -157
1532 -157 -978 172 958 -671 -1202 162 642 -445 -548 -21 269 217 -271 -407 174 642 121 -422 303
1551 303 588 -688 -564 711 332 -1048 -752 436 302 -892 -842 298 440 -86 -529 -17 605 250
1569 250 -433 52 677 167 -422 201 647 -93 -831 35 599 -207 -886 -310 469 95 -467 141 515 -33
1589 -33 -238 180 456 424 -14 -65 422 512 -91 -562 238 455 -236 -550 210 360 -446 -200 350 67 -178
1610a78K17K81o0o9j01k18N01J77p20k59Q15k34q65M27Q12q14n16M08O73k77l26
1631c26K17O6K24J58n66J58O22m53l94M76K96r72j53R73N7j001P1P28j02k47M4
1652a24Q7J4o0R7J18L20l02l62K54N67k73n02K17Q6k76LJ70k1j47L6L6m1RO3J17
1677H6J89k2j57j09R5J52k2j37j42J20K06n36m5L26Kk13j07K97J27m52l5N84M9
1700B56m36O4K27J54k88k39M27K09m29l42L85J61m52k13M26K87n53n3M41K5j41
1721h4QK77n0j32j01L22o6j20j23J82P0p7j29o6OP0O6O7l28J06K28j28j24K52
1745A26Q1j13j32K62J03k47L6O0N8k67j48O4K48j53k40P1J11K6k35J83L71l91
1767a26p1K77J84k94M7MJ41j81l8k6J67j39k13m8J55K00k61J0R0O1j1O0m3J96
$$ plain form
1610 -178 39 320 260 191 90 -128 373 550 -170 -429 386 152 -713 -286 526 -288 -804 -396 277 0 -326
1631 -326 -109 -43 181 339 -227 -69 553 100 -294 182 478 -494 -647 326 383 -618 -547 181 79 -168 -124
1652 -124 -37 -23 -83 14 132 452 150 -212 42 609 336 -166 51 137 -139 -136 34 13 -134 -98 -62 -103 -94 -31 86
1677 86 275 253 96 -13 82 234 212 75 -67 53 259 -277 -322 4 6 -207 -314 -17 110 -342 -377 207 256
1700 256 -180 -116 111 265 -23 -262 165 374 -55 -397 -12 149 -303 -516 -90 197 -356 -409 32 57 -84
1721 -84 -76 201 151 19 -82 240 174 54 -69 113 183 106 -23 -89 -83 -13 53 120 -208 -102 126 -2 -126 126
1745 126 207 94 -38 224 327 80 116 176 234 -33 -181 -117 131 -22 -262 -191 -80 -54 -289 -106 265 -126
1767 -126 -197 80 264 -30 17 21 162 -19 -57 -83 84 -55 -268 -316 -161 39 -222 -212 -122 -61 -72 -12 -55 141
1791A41j7pj67j8K25m9l10K24j6k7j09J9N1n4k80K56J30J3r5M1K02R5k30j54L28
1816A92J34l31m6K06J03l53j16L81m5k53k01K80K39l39k08M11J86k63j27K34K16
1837C00l64j37K67K42l12k00J53J81j37l98K30K39m3k29J18J59m3j22P4J28J08
1858B14j60m4R0j2Mk06R6J99j72k45J16J74n6j84j01L60k6k82J02K42J36j72j36
1881f3K23K78m19j54K32K33k45l45J67L17k57l31K93J38j52j59K19L38k45k24
1901a56K26K94k74r7J00J22n3k63N8J12k4k41R8P0J3j83k9K16J00k12M9J24K4
1924G4n1PRJ00r5o1l3M8J58j95k89L07J84k97k26K96K16j83k43L68M6j34p5J45
1948G6J14R2m06K00K58j16n18K29K28n5l26l5M43l09o0J55K17o1j20m4K37j47
$$ plain form
1791 141 124 117 -50 -68 157 108 -202 22 6 -21 -130 -111 -60 -114 -394 -138 -8 5 -90 -49 153 248 18 -136 192
1816 192 326 -5 -51 155 258 -95 -211 170 125 -128 -329 -49 190 -149 -357 54 240 -23 -150 84 300
1837 300 -64 -201 66 308 -4 -204 -51 130 -7 -405 -175 64 21 -208 -90 69 26 -96 -22 106 214
1858 214 54 10 100 88 92 -114 -18 181 9 -236 -120 54 -2 -186 -287 73 47 -235 -133 109 245 73 -63
1881 -63 160 438 19 -135 97 330 85 -260 -93 224 -33 -364 -71 67 -85 -244 -25 313 68 -156
1901 -156 70 364 90 -7 93 215 162 -101 -43 69 45 -196 -98 -28 -15 -198 -227 -11 89 -123 -74 50 74
1924 74 23 30 39 139 44 -17 -50 -2 156 -39 -328 -21 163 -134 -360 -64 152 -31 -274 94 140 6 -69 76
1948 76 190 282 -124 76 334 218 -300 -71 157 102 -224 -259 184 -125 -185 -30 187 126 6 -38 199 52
1970E2L4j22J31K11l11k47K68K54l30j00J66K1k40JR8K70m7j47P4J5R9q9m6J28
1994A43J6j12j51J45K14k74l60L48J81k12k22J64K27k31k36L74K00j63l64L04
2014iL35j54k79O9L15j36m43K04N48l61m57K62M40k84l64J93L18j99j8Q6J18j17
2036F7j5J1K27l9k18k13J87K78l48r0K24K6k27O6J93k78j1J79p0K2J92Qm36K04
2060f1M96l90k75L73M4l31j07L95j6k58JJ18L7m8l34K61J96L0m17K48L75k54m04
2083c21M16K29m07j35K98L09o34r7L73R0k13j26L9K33j36o9O3L13j03j50N2J93
2105B17k06n4K67o5j48q2J80k24l1J56Q4j84j52L06J14j51j90K67J9p3k5K57j17
2128A65l92J97K76m0l71L6K32j50k08J11K69k56j54J40L23k04k69K56L22k09l18
$$ plain form
1970 52 86 -36 95 306 -5 -252 16 270 -60 -160 6 27 -213 -212 -114 156 109 -38 36 51 150 61 15 143
1994 143 159 47 -104 41 255 -19 -379 -31 150 -62 -284 -120 107 -124 -360 14 214 51 -313 -9
2014 -9 326 172 -107 -38 277 141 -302 -98 450 89 -368 -106 334 50 -314 -121 197 -2 -20 66 184 67
2036 67 52 63 290 251 33 -180 7 285 -63 -153 71 97 -130 -64 129 -149 -160 19 -51 -29 163 171 -265 -61
2060 -61 435 45 -230 143 187 -144 -251 144 128 -130 -129 -11 26 -22 -356 -95 101 131 -286 -38 337 83 -321
2083 -321 95 324 -83 -218 80 389 -245 -342 31 121 -92 -218 -179 54 -82 -151 -88 225 122 -28 24 217
2105 217 11 -43 224 159 11 -71 109 -115 -146 10 94 -90 -242 64 178 27 -163 104 123 50 25 282 165
2128 165 -227 -30 246 206 -165 -129 103 -47 -255 -144 125 -131 -285 -145 178 -26 -295 -39 283 74 -244
2149b44J96L50k83j80K32J88l61j25L01M6l76J01L09j98M3l8J65j9k72J52K19
2170B06m4l29J05K62j75j25K15J12k58j99M18Q2n30mM94j75l64J93L39k23k52
2191b52K92L09j26k68N2K34m9m42J73K59l5m40J98K54j53k76K08K81m31J3K91
2212I2K62m69m2L34p3j10r4J74q8r0K9L9K2o4l2K34j44j50P4J52j73j4J84Pj25
2237f5k2J97J68l64Q7K36J0m35J44J52o6k67J02K84j40l24J51L54j33k27J06K38
2259A86o8k28P2L48l15j68K65J92l13j36K22l4j81j1J20J91k87m6L88j11k50J07
2281e7K75o2j70k5K98k30j4Q2P2k24r4J61Q5k10P9N6N1j35r0K94l0k18Q2J47m1
2306H2k92J13K53k05p3R3K32j46m25L13K25j79k20K18J05j32PR3R0j52p1Q8M9
$$ plain form
2149 -244 -48 302 19 -161 71 259 -102 -227 74 120 -256 -155 154 -44 -1 -39 126 107 -165 -13 206
2170 206 162 -167 -62 200 25 -100 115 227 -31 -230 188 270 -260 -264 230 55 -309 -116 223 0 -252
2191 -252 40 349 223 -45 7 241 192 -250 -77 182 147 -293 -95 159 6 -270 -62 219 -212 -199 92
2212 92 354 -115 -157 177 104 -6 -100 74 -14 -104 -75 -36 -14 -78 -110 124 -20 -170 -96 56 -117 -131 53 60 -65
2237 -65 -87 110 278 -86 1 237 247 -188 -44 108 42 -225 -123 161 21 -303 -152 202 69 -158 -52 186
2259 186 118 -110 -38 310 -5 -173 92 284 -29 -165 57 23 -158 -169 -49 142 -145 -191 197 86 -164 -57
2281 -57 218 156 -14 -39 259 29 15 97 169 -55 -149 12 97 -113 -34 22 73 -62 -152 142 112 -106 -24 123 82
2306 82 -210 -97 156 -49 -122 -29 203 57 -368 -55 170 -9 -229 -11 94 -38 -31 62 152 0 -71 17 66
2329F6j35J7lJ56j89M8Q2J8k86J22J09J9k27K34J33k27j46K35J29j92M4J30n6
2352H1q5K1J2oj93J63K8k0j94LK01J17k43L3J35K8j45pK88j99r4J22J57j32j28
2377e7P0J51j54r2n8J61j06J25M1K7k60j9M5M3Q3j6Q9J6j14P2P3r6j29P9J25k24
2403a25J39j2J48k14J7J88k0k79R7K45k64J4J05P2o5j49J42J39j15r5J7J38n8
2426F5k82J50L3R3j79J29J8J1k01J78J60o4k29J98m6Pj23K7K18n9j76lP1k5K7
2451bq9J00m5k4J30j27P2j0n0J48l8m7J49k32J50j74K7qoJ99k58K2jJ94j93j00
2477b13J95M0K3j01J32N7j69qJ49j1j52L0O3m3j1k9QR3j53K2P5L9j8j13J22O8
2503I5r6o0P8J9N0j31J10l8km9j2Jj18J27l0N7%j85J41J16K0k22J82j0j57P7J22
$$ plain form
2329 66 -69 -52 -55 101 -88 -40 42 60 -226 -104 5 24 -203 31 164 -63 -209 26 155 -37 7 137 81
2352 81 -4 17 29 23 -170 -7 21 1 -193 -190 11 128 -115 -82 53 81 -64 -71 217 18 -76 46 203 71 -57
2377 -57 13 164 10 -82 -140 21 -85 40 81 108 -152 -171 -126 -83 0 -16 73 89 -25 47 120 24 -105 -26 99 -125
2403 -125 14 2 150 -64 -47 141 121 -158 -61 184 -80 -66 39 111 46 -103 39 178 63 -32 -15 123 65
2426 65 -217 -67 -34 59 -120 9 27 38 -163 15 175 111 -118 80 34 41 -82 -55 163 104 -72 -75 -4 -29 -2
2451 -2 -91 9 -36 -60 70 -57 15 5 -45 103 65 18 167 -65 85 -89 -62 -70 -76 123 -135 -113 -114 80 -113 -213
2477 -213 -18 22 45 -56 76 133 -36 -44 105 94 -58 -28 35 -8 -19 -48 -40 53 -100 -78 -3 36 18 -95 27 95
2503 95 -1 -61 17 36 86 -45 65 27 25 -24 -36 -35 -153 -26 -56 1 1 -184 -43 73 93 -129 53 43 -114 -37 85
2530H5q2O8M7j79N9p6K79j81L3p9J31j21o5O8J0o0R6J6R0j72J63j18n2J47j91
2555h4O7J82j51q8O9j7Q1k6R9n2j25O5l9k8R0K6k2n9R8rq3Q1p8NO4J4j65l3K90
2584A72k00j03J76L5p7m4L9Q6j1p8l2j3J08n1lK6R4j60j92J82P1r6PM3K6J2j16
2611i9J25M1n7L3K1lr0R7p5J12o1p2J02j8q1r6K02j07j1j1O6n9P4p3J06k2j1o9
2639c6O6R7j20M5R3j08n8J19l7j52M2k2L7L4l4p3J6J41K2kj42J04J0N3j56J27
2665F6J2m1mJ7r0l8o1O5P2n8Q6nJ55j85m5J60p9o2q2L4L6J06j29J7J41j2j96J81
2693F1q8R7k3k19J29J03p6p4P1lJ08q0J76j18o1R7p0M4On8O0j14J15r6J12m8R1
2720A42j61K5k2N8lj30N9J4J92l09P7J79j94J50n7J2J24k16J0Q5L9j34j9O5M2
$$ plain form
2530 85 3 71 118 -61 -2 -78 201 20 53 -26 105 -16 -81 -13 -3 -63 33 49 139 -33 130 12 -40 107 -84
2555 -84 -17 165 14 -74 -5 -22 59 33 132 80 -45 20 -19 -47 43 69 47 -12 86 77 -6 75 -3 2 66 80 -85 -118 172
2584 172 -28 -131 45 80 3 -41 -2 84 73 -5 -37 -50 58 7 4 30 124 -36 -228 -46 25 -71 -64 -21 5 17 -99
2611 -99 26 67 10 43 64 61 -29 68 -7 105 44 -28 74 56 -25 -121 81 -26 -37 -48 18 -41 33 -40 66 44 33 -36
2639 -36 30 127 7 52 145 37 -21 98 61 -91 -49 -71 -34 0 -34 -107 -91 50 72 70 -72 32 42 95 -61 66
2665 66 78 37 33 50 -40 -78 -139 -74 -2 -60 26 21 176 -9 -54 106 27 -35 -117 -83 -47 59 -70 -53 88 76 -120 61
2693 61 -27 70 47 -172 -43 60 -16 -90 -19 -22 86 6 182 64 3 100 30 74 80 22 82 -32 83 -13 99 51 142
2720 142 -19 6 -16 42 39 -91 -32 -18 174 -135 -58 121 -73 77 20 32 156 -60 -50 35 74 -60 -79 -14 28
2745B8O8j00J05L5j04rO7k7q3l0J03o8Q3kk5rNq5j7J13q2L7K7N2j16J25j42K4
2773b7J5j4K1K7Lj39J88m7p2r5J32J1j60K40j53P1P7l7k5K5k6k8K1L2M4o5rj64
2801a54K79j56jj40J86k0m0J28l5k8p1J1n9J26o0l3J20j67J38J6k4nR9j15p2J7
2827f0k5M1Q5rm9l4M2K1J04K9j15LL0j32R7o5R0o5j2j44J78j49J43mk1r1K0nJ09
2856A2m4p3P2K0K6r5N6L2J32j97J83q5l7n1LM6rj10J63j8M0n8J5Qm0Q0j12J39
2884I8j49RN9L9o0m5p0J37k3j4n0M0P9p7q7O1N9q5N5O0p0J31jr3l0o9J71j11N
2913c1J53j29l2n1L7P6q0j2Q4km8M3J46j90O3j93J68k1k2L0j4O3o7N5r3P7l6K0
2941fm0JQ9l3jM0p4R9j20L7p8P7n6K36j55n1P0p6J14m3l4M1m8Rl9K9k0Q3r8R3
$$ plain form
2745 28 96 -4 101 136 32 23 90 63 -20 -50 53 -15 68 66 41 32 37 -48 -65 48 -34 3 30 82 -34 91 -51 -27
2773 -27 -12 -26 -5 22 25 -114 74 27 -45 -140 -8 3 -157 83 -70 1 78 41 16 41 15 -13 8 40 84 19 10 -154
2801 -154 125 -31 -32 -172 14 -6 -46 82 47 19 -52 -41 -100 26 -34 -67 53 -114 24 40 16 11 110 -5 -77 -60
2827 -60 -85 -44 41 32 -17 -51 -9 12 116 145 30 33 63 -69 28 -37 53 -12 -24 -168 10 -139 4 0 -21 -112 -92 -97 12
2856 12 -32 -105 -33 -13 13 -82 -26 6 138 -59 124 39 2 -49 -46 0 -9 -119 44 26 66 8 23 31 -9 71 -41 98
2884 98 -51 -42 17 56 -4 -49 -119 18 -5 -19 -69 -29 50 -27 -114 -53 6 -79 -24 36 -34 97 96 3 -27 -96 75 -36 -31
2913 -31 122 -7 -39 -90 -53 23 -57 -69 15 13 -35 8 154 -36 27 -166 2 -19 -41 -11 -25 38 -29 26 -67 10 -26 -6
2941 -6 -46 -45 44 11 10 50 -24 75 -45 -8 -86 -9 -65 171 16 -35 35 -41 73 30 -4 37 -11 -2 -41 -12 -32 51 -47 46
2971D6m2j02R7R6j05K3m1O1K0j08L9j0R5j27N7L0j0o3j2O8j0J3m7P3k16J96p0
2998d9O0nj10J48l2M6j31P7n6M4Q8q3n0k4J59k07J10j7L7j31N7j5J06j16P8K0
3024Dj8LrJ2J7J00j49N7l2R1j02N6n8r0N5Q7kj65R8J0Q5l1m1k0J09l9o1J5l2J26
3054G6r0J04n9N4j66J23m1j2l0R1l9N8j33R2M9j12Ll7RN9M8j01J84j55oN4L8l9
3082B2q2J67o9J8K2l4l7L4L8o0L1j79J79j8p1lJ40r6k6J9m9J25q5N1M9r9j0P5
3110E2j7j3k9M0j25P6KJ05m5j84K12p3J12j86J23j71J49k0n4M7J12j01l3Q6O1
3135A26j71o3J19J6k9L3j14J39o3J19k6j27M7L4k2Rk5J7O4j55qJ08k3q4R6j67
3161a50J68jj22K45j56l6J05l1l6J19j01M6K9K1Q1j27j09J30j10Q9j09J11J4n6
$$ plain form
2971 46 4 -98 -1 95 -10 13 -28 33 53 -55 -16 -26 69 -58 -1 29 19 -44 -56 12 2 15 -32 41 -175 21 -49
2998 -49 11 6 -104 44 12 58 -73 4 -52 -8 80 -3 -53 -77 82 -125 -15 -32 5 -126 -69 -84 22 -94 -16 4
3024 4 -14 -11 -20 -8 9 109 -40 17 -15 76 -26 30 -28 -118 -63 24 22 -143 -45 -35 50 19 -22 -42 67 28 -33 -18 -50 76
3054 76 -14 90 31 85 -81 42 1 -11 -41 50 11 69 -64 28 77 -35 -32 -69 -60 -1 47 -54 130 -25 -31 23 61 22
3082 22 -60 107 38 56 78 44 7 41 79 19 50 -129 50 32 -39 -42 98 2 -24 -5 -54 71 -14 37 86 -13 -23 52
3110 52 35 22 -7 33 -92 -16 -14 91 46 -138 74 1 113 -73 50 -121 28 8 -46 1 113 12 -21 65 126
3135 126 -45 -108 11 27 -2 31 -83 56 -7 112 86 -41 6 40 18 27 2 19 83 -72 -80 28 5 -79 17 -150
3161 -150 18 17 -105 140 -16 -52 53 22 -14 105 4 50 79 100 181 54 -55 75 -35 54 -55 56 70 14
3185A4j06J69k3j12k8n3J46N5m0o0L7N6p5Ll0P2%q2J60j62L2m0J69nk8j48N9L5
3213A5Q0j27L1k2O2M5n0ok7L5m5j2R6k8j55R3j37J63J9n0O0k6J8n1o8J29q1L5
3241dO2j07o4M1J14lq3K6J6On1O1k7rM6P1j4j35Q2rJ05j31L3K3Mk6j28J57p2j1
3271b7KK0n9m5P8J7J20j08M9j16J32q1mPlj6K3N4j13R0p5J19j0j26J61m5q8J1
3299c3lK4J5LpR6m0r8OQ1l3l3R7q4m3R4Qn9j90J10J34J2j6r6M0K5j0JJ36j65O7
3330C9M4k5l3rN8l1Pq0j0N2M2M4p7njJ21q5l6O2R1k70J27k0M2Rj2j10N0J28j75
3360f3K0P1r7O1K4l2q4J30r5J23O1j89J28n5m7J27r0J51j88J66j66P6j1J9J1K2
3386G3n4%J8P3q9q3J89j79N7o7R8R9k15Q6L9Lj10J04q5P7Jl4M9P1k48M98J58n84
$$ plain form
3185 14 -92 77 54 -58 -86 -139 7 62 22 -38 -1 55 -20 -17 -47 25 25 -57 103 -59 -27 -67 102 97 69 -79 -20 15
3213 15 95 -32 -1 -23 39 84 34 28 1 36 -9 -21 75 47 -108 -15 -152 11 30 -20 40 14 32 -19 -87 42 -39 -4
3241 -4 58 -49 -113 -72 42 39 -44 -18 -2 4 -47 14 -13 -22 24 95 81 -54 28 19 124 -7 26 49 53 27 -101 56 -16 -27
3271 -27 -25 -5 -64 -109 -31 -14 106 -2 47 -69 63 -18 -22 -15 -18 -34 -11 43 -70 20 -55 64 54 -72 89 44 -44 -33
3299 -33 -36 -12 3 6 -1 95 55 -43 -37 44 11 -22 75 -9 -52 42 50 -9 -199 -89 45 57 41 -55 -15 10 0 1 137 -28 39
3330 39 83 58 25 16 74 43 50 -30 -40 12 54 98 21 16 15 136 51 15 77 168 -102 25 5 47 56 44 -66 -16 112 -63
3360 -63 -43 28 -69 -8 16 -16 -100 30 -65 58 119 -70 58 3 -44 83 -7 144 -44 122 -44 32 21 40 51 73
3386 73 19 19 37 110 21 -62 127 -52 5 -62 36 135 -80 6 45 48 -62 42 -43 34 35 1 50 121 -127 371 529 -55
3414e5j2P9j19N08M1n21l1K23N5j9j35k2j17K75o6r8N6L8p3J44r6j3o4M2Q3r2
3440A1q6M2m3R7o7k1R8l1N5m5k6N5n0l3j7J17k2j10J6k0O3M2p3J3j9M2m6R3NJ3
3470E3j29pR9k8J27o8j25M3J11j72J38l7R4r4L3p8Q7Nl1M7j46M1J3lO5n7o6K36
3498A51j77O5M6q8L3j21P5M5o6J10K6Lj62j3R2o4m5M6O0M3L5j42J54j38R4n1J10
3525A21j70q2M7K5J1L3n7l1J74n5p1N7r0P6O3k09J75J13m3j07R7l6l6J8pn7l0
3552g1M7J7%Q9r9J31r3m9J5L0j4J8j07M8M1R3p6j02J55o1pll8P7m6p9J1N4J0n5
3582f4M4J47l5j10L6O9p6q2J06r2P1N6m7k0O7j08Q6m5O8p6m2R5M0K1k87J62m8
3609f4J7J34j15Q7j09pP1q5J02n4n7K16j81Lnj1Q2J8n3l0L6K0q8L7N7j8l6O9P0
$$ plain form
3414 -55 -67 12 -107 401 442 -79 -110 113 168 149 14 -8 -125 150 84 -14 42 80 7 151 55 42 -22 20 103 11
3440 11 -75 -33 -76 21 -46 -67 31 0 55 10 -16 39 -11 -44 -61 56 34 -76 -60 -80 -17 25 -48 -35 -54 -12 -58 35 40 53
3470 53 -76 -83 16 -12 115 47 -78 -35 76 -96 42 5 99 5 38 -40 47 52 21 68 -78 -37 -24 -27 38 -19 -85 151
3498 151 -26 39 85 -3 30 -91 -16 29 -37 73 99 102 -60 -73 19 -45 -90 -44 16 59 94 -48 106 -32 62 11 121
3525 121 -49 -131 -84 -59 -48 -15 -72 -103 71 16 -55 2 -88 -12 51 -158 17 130 87 -20 77 41 5 23 16 -41 -71
3552 -71 -24 -7 -7 82 -17 114 21 -28 -13 17 3 21 -86 -38 3 96 20 -82 73 12 5 2 -36 41 -5 -84 -73 -19 -9 -64
3582 -64 -20 127 92 -18 18 87 11 -71 35 -57 14 70 23 3 70 -38 48 3 71 -5 -47 48 88 109 -178 -16 -64
3609 -64 -47 87 -28 59 -50 -57 14 -71 31 -23 -80 136 -45 -42 -47 -58 24 42 -11 -41 -5 15 -73 -36 21 3 -33 36 106
3638A06j11j79J83J34q1JQj35O9K8n1j8R5j30K28k16q6J49N4m4K7q7L1L8O3n8
3664A8NK4o0l9m0P6J8k8M4j74J34k3R5q5M7Q2K3q2l5L7r9J33K6r4K6J30k01M8
3692FK6L7k7q7K0L6p5M3k7J11j78K9pK2k0J38n7M0j7j02N9m2P3K0k1m6N9N8J3
3721H4j70J09l5L0O1J31j33L3j66M9N6n2p4R7o2M7j36J17L2p4M2J3m5mj6J59o2
3748C1r6K4N6k8jO8m9L8Lm5rL1p4J55pm4q2j0J53j3p5L2n2J19j7l8q0JM3M2j24
3779d8P7p1M5q8P5l8N9J4m3M6m1J16p1Rn1N3N1m9j3J0Qm8n7J05j38N2RQ6l1L2
3809F0m5R9j12ol3j8R8mJ7J7j40K10j55o9L5R1o0j2k5J13qnn7NP9q6M9j5J1r0
3839e6M8k6n4J07L7K5p8k2O1Jj16k6K31j80LJ04K6J4j76J43k1PJ7j5k1q2M5j07
$$ plain form
3638 106 -5 -184 -1 133 52 53 61 -74 -5 23 -28 -46 49 -81 147 -69 -155 -6 48 4 31 -56 -25 13 76 18
3664 18 23 47 -13 -52 -92 -16 2 -26 18 -156 -22 -45 50 -35 12 94 117 35 0 37 -62 71 97 3 29 159 -42 6
3692 6 32 69 42 -45 -25 11 -64 -21 -48 63 -115 -86 -93 -71 -91 47 -10 30 13 -89 -30 -72 1 21 0 -46 13 71 84
3721 84 -86 23 -12 18 79 210 77 110 -56 -7 49 -3 -77 20 -42 5 -131 -14 18 -56 -14 -1 -46 -50 -66 93 31
3748 31 -65 -41 15 -13 -14 54 5 43 46 1 -8 23 -51 104 97 53 -29 -39 114 101 26 58 6 125 108 70 -10 -9 34 76 -48
3779 -48 29 -42 3 -85 -10 -48 11 25 -18 28 -13 103 32 41 -10 43 94 45 32 42 50 2 -55 50 -88 -36 -27 59 28 60
3809 60 15 114 2 -4 -37 -55 43 39 56 73 -67 143 -12 -81 -46 45 -15 -27 -52 61 53 48 -9 -4 75 -11 38 23 34 -56
3839 -56 -8 -34 -88 19 56 81 3 -19 42 43 -73 -99 132 -48 -45 59 85 99 -77 66 45 52 69 54 33 -49 -4 -111
3867a11J65n0n0LJ62j98K8J62m7j00k4J0P1p7J7R0p8n6N0J44l8n9k2M7p0J6K1
3894Fl6R7o0K9l6L9L2k35K88j36nN9ol1Q0k0r0N0l4LP8j08N8K1q2M2J08k1j11
3923b1R6J9j17N7n1J16l2j7m6J5K9l4K7m0m1OQ1m6L8l3j65J47j3mP5l5m3Ol1L6
3953b1l3R7j30J53M5j66r9N2N9lQL2J19Rr8j0p8J9J41r8N0Qj03JJ84k04K1l3J37
3982E9K5J3j65N0N6qnOr2m2P4Q6n8O2j61N6P2j0j14M1K57k52Ol7J71q5k4q2K03
4011A02j15j3N2L7j62Q4L6K3j3Nj02R2r9K3K2N0q8M9m5k0K8M7o5K9O7L9p5N7j0
4040C5o2M8Nr3J28j04K9m2K3l7O6o7J73p5j28J68j25L8j2J28j18J54k0J2j21K00
4066B03j95o8J36p2po0P3J6n7O9RN4p8j03Q6L3K1J4p3l5K7p1J91q0J9j60O1M7
$$ plain form
3867 -111 54 4 -46 -43 119 -79 -51 111 64 -36 -60 -50 21 -56 -39 51 -27 -83 -33 111 73 14 -8 39 -31 -15 6
3894 6 -30 67 7 36 0 39 71 -164 124 -12 -17 42 36 5 85 65 -25 25 -9 -6 72 -36 22 43 -39 3 111 90 -21
3923 -21 75 94 -23 34 -17 99 67 50 4 19 48 14 41 1 -40 -34 47 1 39 6 -159 -12 -25 -29 46 11 -32 -26 -57 -21
3953 -21 -54 43 -87 66 111 -55 -154 -102 -43 -46 -38 -6 113 122 24 14 -64 -45 96 -2 48 56 -47 -46 138 -66 -45 -78 59
3982 59 84 97 -68 -18 38 30 25 31 -61 -103 -29 57 -1 61 -100 -44 28 18 -96 -55 202 -50 -44 -81 90 5 -19 -101 102
4011 102 -13 -26 26 63 -99 -15 21 44 31 36 -66 26 -73 -50 -28 22 -66 -17 -62 -82 -54 -7 -72 -43 24 63 -12 45 35
4040 35 -27 21 26 -67 61 -43 -14 -56 -33 -70 -4 -71 102 27 -101 67 -58 -20 -32 96 -22 132 112 124 3 203
4066 203 8 -60 76 4 -3 -63 10 26 -31 38 47 101 23 -80 6 39 60 74 1 -34 -7 -78 113 33 52 -108 -47 0
4094@P0o8J22j70k3R8k0K0l1LkP5J8j04L5oN2j5r9qk1RQRP2L4j11J09o2r9L6N8
4126a1m3P2J6mM8qr2k8lM0j52K32j10J27ok5j61Q7J79j84j8N8Oj54J80r0l4N8
4154b0K4jMK0l1J39n3m3j19j4K36q9L8p1Mr8N9r8K0N1O0K2Rn4M3Oj08K0N4L1o6
4185b5M1n0J00n9N0R9j78nM7NN0k1l1o6K0L3m6n7R9q9J29j06P1M1n2p3L5O0K2
4214D4r7oJ81m2k9p3L0n3Q9p6P8l4o4P9N1j05mJ05j2ll6l0J76k05N2K0p0O6J1
4243D3n7O6j32M8J16j63P5J8Np4J5J5L0O8j68P6L1j12O5J07j17k5l0J16n8L3J5
4270Fp1J59p5k6J21j39J13j10k2M1N5l7J8k0N3j10J81j55L5O0rj5o6o1j2L4N3
4297AlO5j51J50k7l9M5o4Q5Jj03k3%J42k2n1O2n0J01r3P2j29O7K7o0J3j1j4o5
$$ plain form
4094 0 70 2 124 -46 -69 29 9 29 -2 1 -1 74 92 -12 23 17 69 54 -45 -53 -74 -65 -57 -48 24 58 -53 56 -6 -105 -69 -11
4126 -11 -54 18 34 30 78 70 -22 -50 -53 -13 -165 67 -43 84 78 53 -108 -21 158 -26 -44 14 20 -134 46 -44 -78 -20
4154 -20 4 3 7 27 -4 135 82 39 -80 -94 142 53 91 20 24 -74 -15 -113 -93 -42 18 40 49 -5 38 44 -64 -44 10 41 -25
4185 -25 16 -34 66 7 57 156 -22 -27 20 25 75 54 23 -43 -23 10 -36 -93 6 -83 46 -60 11 52 0 -73 -38 22 44
4214 44 -53 -59 122 80 51 -22 8 -45 44 -32 46 12 -52 27 78 -27 -31 74 62 59 23 -7 169 -36 16 36 -34 32 43
4243 43 -14 52 -80 -32 84 -79 -4 14 19 -55 -40 -25 5 73 -95 -19 12 -100 -35 72 -45 -70 -100 16 -42 -9 6
4270 6 -65 94 19 -7 114 -25 88 -22 -44 -3 52 15 33 13 66 -44 137 -18 17 77 68 53 -13 -74 -86 -52 1
4297 1 -2 63 -88 62 35 -4 41 -23 62 63 -40 -63 -63 79 57 6 68 18 119 26 98 -31 36 63 3 16 5 -9 -74
4326g4l8J58K5p4qk6nN0l0P3J9p4L1q3pqJ58j90K13K4j50N0o7P2k0m0O3p5l1K07
4356A43n2q6n4K9Q2l8j61J06J24l3m2J9J6q8N0P9n5k2nO6o4j22J83l6j1l2J5k6
4384a5K5j17P4Q3r6rK0L8l3Q6j5q5O3Q9q2j9o5J79j37J21j08J4m5M0n8P8P5p2
4412B9r6J33j06j1l1k0N5Qn1Q9N6k1K9p6J1L2m4K6r1O3P3m1j5j26J18J9j0l3O1
4441C0o1J31%q9L8p9J44j02J2m3K5j6o1k8j6P%JJ22j8k0P8l9o7N7j34N7Q0J15
4470A24j96K19j37N8%l2j09J49j20P9q8j1J1J51j03J6P4j35J35l5m9O9k3o1QP3
4496F7o8J25k16J45n5K3j52J75L2j10M1%o7J01Pk04K20jK2j03M1k1j1P3j34N7
4522a3O3j38M1J98k03m6K48j17R6p0j08K8JO1l7K1k04J48m9N2K6j10Q2K2rK9K6
$$ plain form
4326 -74 -112 46 71 -3 -11 -37 -42 8 -22 51 70 -4 27 -56 -63 -71 87 -103 110 134 -16 34 -33 39 19 -21 42 -33 -64 143
4356 143 91 5 -49 -20 62 24 -137 -31 93 60 18 37 53 -35 15 94 39 17 12 78 14 -108 75 39 28 -4 11 -15
4384 -15 10 -107 -33 50 -46 -55 -35 3 -30 56 41 -44 19 108 26 7 -58 121 -16 105 -3 11 -34 6 -52 26 101 29
4412 29 -67 66 -40 -51 -82 -102 -47 -39 -90 -1 55 34 63 -13 -2 30 -14 12 -79 -16 57 16 1 -125 -7 12 2 -31 30
4441 30 -31 100 100 11 49 -30 114 12 24 -19 6 -10 -71 -99 -115 -108 -108 -107 15 -3 -23 55 16 -51 6 -128 -71 9 124
4470 124 -72 147 10 68 68 36 -73 76 -44 35 -53 -64 -53 98 -5 11 85 -50 85 50 1 70 47 -14 -6 67
4496 67 -1 124 -92 53 -2 21 -131 44 76 -34 7 7 -60 41 48 -156 64 63 85 -18 23 2 -9 64 -70 -13
4522 -13 50 -88 -47 151 -52 -98 150 33 129 59 -49 -21 -20 41 4 25 -179 -31 -80 -28 -2 -112 -30 -8 -17 12 38
4549C8j07M6j2L7J8n8P8m1J1P1o3k9R0j62N0M4m2q0J26l3KJ13j50k4O1l2J29q5
4577dO7l7R7j31l3l3M0PJ05q5J4K2J1J02j73n7J24Nn6O1j03J00n7M4k2j24J48
4604C2j62K22j62M8rO2l8J28j56J21K6j41k4o1J94K5j19K9K7K4j30O5l1R6n6j0
4630@j6KM3j35J54j22O0K0p8O6j9J8l3l2J38J8q5k2rL0rk4Q6q7J02m9O5j8j3j86
4660a35J09N7MN0o1M6k4r1R6n3k2q5J11J07j19M7j04N7k5M0j20Q3P4K7q5j11K35
4687A08j37jJ6n4QM1J07o5q5l1Q9m0j2Q6m4j0O6k6j7q9J18O3j50Q3M6q5j3K4N4
4716E0pJ6m3Pn2%L6n1L7Q6j50Q5n2J3M1P0l8j15P8l3J1PQ1n2L1j16N8p3Q7J8L4
4747F4j25m4J8M4J08l5n0M0o6n9N3J28j83K3O3l8M7O2j22K3J00J9j31pK3N2j03
$$ plain form
4549 38 -69 -23 -35 2 20 -38 40 -1 10 81 18 -11 79 -83 -33 11 -31 -111 15 -18 -16 97 -53 -77 -16 -48 81 -4
4577 -4 63 26 123 -8 -41 -74 -34 -27 78 -7 7 29 40 142 -31 -88 36 41 -15 46 -57 43 -14 30 8 -116 32
4604 32 -130 92 -70 -22 -31 31 -7 121 -35 86 112 -29 -53 -114 80 105 -14 15 42 66 -64 1 -30 66 10 0
4630 0 -16 -14 29 -106 48 -74 -14 6 -72 -6 -25 -7 -40 -72 66 84 -1 -23 -32 -2 -11 -35 51 -36 66 17 82 64 51 -135
4660 -135 -26 31 35 85 24 70 46 -45 51 -2 -24 -109 2 109 -10 37 -67 -10 -35 5 -115 -32 42 69 -16 -127 108
4687 108 -29 -30 -14 -68 -60 -19 88 23 -62 -93 -4 -44 -56 30 -14 -24 42 16 -1 -90 28 91 -59 24 70 -15 -28 -4 50
4716 50 43 59 16 23 -29 -29 7 -44 -7 79 -71 14 -38 -25 16 86 48 -67 11 -22 -11 -4 77 25 56 -60 -2 -75 12 30 64
4747 64 -61 -105 -87 -43 65 30 -20 20 -46 -105 -52 76 -107 -84 -21 -59 -12 50 -72 -49 51 70 -61 -68 -45 7 -96
4774i6J18q6P6M8j42K14j51q4N9J03L3J5o1o2M9j18J07o4J20n8r5k6J73q8N0r7
4800f3N9J4p2O5m3M0N7k5N7j73K33j10L1q1L4n4J02m3o6Q0o2J23j00p0J64J9r0
4827B6j6j30J69l9j1J5m6L3q5L5N2n8J28o1qJ29j49m5qJ27o4Q5j29J10m4q5K13
4854A44j90J00n0n5M5m4N4J0P2m0j33N5J5M6O0j66J10p8O3k7J02m9N2j35J67p4
4880E4q9k4K8j6J32j88O8J47Pj47l5J41j21J46p7k4n3k5N3M1Om8J59j22o7M4j
4907a1jo1J51m4L2j14K01j14rLM7Oj70P6P3j8m7n2R3j60J05K2o1O3J11k6n1o8
4935b4k5P9P8j47N4J6K5n7rq6N1K1P2j2l1pM6ro4J00p1J04%l5k51J31M8n7J93
4964A33p4j28J57j1j7o3R0k3n7l6j14J60k8J49j45L9L4mp3M7M9r3J18j43O1J3
$$ plain form
4774 -96 22 -64 12 60 -82 132 -19 -103 -44 59 92 107 46 -16 33 -85 22 -42 78 20 -75 -101 72 -16 34 -63
4800 -63 -4 10 -62 3 -40 0 57 32 89 -84 149 39 70 -11 23 -31 71 28 -38 42 -20 103 3 -67 97 116 26
4827 26 10 -120 49 10 -1 14 -32 1 -84 -49 3 -55 73 12 4 133 -16 -61 -69 58 -6 79 -50 60 16 -69 144
4854 144 -46 54 4 -51 -6 -50 4 14 86 46 -87 -32 -17 29 89 -77 33 -45 18 -9 93 44 96 -39 128 54
4880 54 -35 -59 -31 -47 85 -103 -35 112 119 -28 -63 78 -43 103 26 2 -51 -76 -23 18 24 -24 135 13 -54 -10 -11
4907 -11 -12 -73 78 34 66 -48 153 39 30 33 80 86 -84 -8 65 47 0 -52 41 -119 -14 8 -53 10 121 95 44 -24
4935 -24 -49 30 108 -39 15 31 56 -1 -10 -96 -45 -24 48 36 5 -2 44 35 -29 71 0 104 104 69 -182 -51 -3 -60 133
4964 133 59 -69 88 77 60 -3 87 64 7 -29 -143 17 -11 138 -7 32 66 62 -11 36 85 -8 110 -33 28 41
4990D1n0P2q8k0L1M1L6j28N1R4q5O2j39J07N0r0J3N5j35l1J59l5K1j22J0J39n6
5017CJ08q9l8j26J57jp0qP5R4j07J8k3N5J1m2J6N0j00n3K12n5j05R8J1j49J15
5044E7j09J20p6M1rj9m3m6Q4k9M4j4J3o9L5M5l4Km3mRL8m3P4J3k8m4nM1K2oJ2
5076B9m4J03o0j12J38rK8j04jN4r4R9k1o0N5P7K3q1J7l3oQ4o8Pk3k7RN5J4j28
5106g9qP4j52J40L8OkN2k2j06j6J26kk5q5P0J09j47m8N9L1j9OO0r8j5Nk1J42p8
5136eK6R1j42J75j23p5N1L7m0j0k9n5n4K28j30K3j7R9j07K6qQ1%r2j2j5J39N5
5164A17r9l4Q5j02Q2r1j25J73o9LR6o1KL3O3q6J14m8j05m0J09n6J32o1Q2n5l2
5191B7r5R2N1q8J06j1o1qN0M1k5k0l9m2J2R8q6KO1Ro9M0k8L8O5r2q5O4N2j6JM5
$$ plain form
4990 41 -9 63 -25 -45 -14 27 63 -65 -14 80 -5 57 -82 25 75 -15 -2 53 -82 -113 46 11 32 -90 -80 59 3
5017 3 111 22 -16 -142 15 14 -56 -64 11 105 -2 16 -7 48 59 17 33 83 -17 -70 142 87 -18 80 91 -58 57
5044 57 -52 68 -8 33 24 5 -38 -84 0 -29 15 1 14 -55 -20 25 -9 -7 -50 -54 -45 -7 -50 24 37 9 -35 -40 1 23 17 29
5076 29 -15 88 28 -84 54 45 73 -31 -32 22 -72 27 6 -54 1 78 101 20 37 4 -2 82 14 21 -2 -29 -20 35 49 -79
5106 -79 -87 -13 -165 -25 13 19 17 69 47 -59 -75 51 49 24 -61 9 118 -29 -77 -18 13 -6 0 60 -38 -53 -48 -69 73 -5
5136 -5 21 112 -30 145 22 -53 -2 35 -5 -15 -44 -99 -153 75 -55 -32 -49 50 -57 -31 -39 42 42 -50 -62 -77 62 117
5164 117 18 -16 69 -33 49 -42 -167 6 -63 -60 36 -25 -23 10 73 -13 101 53 -52 -92 17 -39 93 32 114 59 27
5191 27 -68 24 75 -13 93 82 21 13 63 104 79 59 20 -22 -10 88 2 4 65 74 5 45 17 55 120 28 -57 7 59 43 44 89
5223H9j51J19l7q3M5m4J52j29j9J21o1k9%m7O7P6p8PM1J5j15J12L3o5J29j18J1
5250D1K8j22J67j34OJ01rk36J30L0J7m2M7q9mQ9Qq4Qj5L4k6N2LM3p0JJ1LJ54q0
5281F2J7p9m0nQ8j08Q3Ok0Q1n8j6K5P2o9k3L0L9q5O6q4q6J97p3n2K1p7J38Pr7
5311d0K0m8P0j00J29r4R2J46j47p5K5m7Q2Q7j59K9J38q4J3m2Nl6J36m8j30J30
5337E2K2k6k2k2m5N0Q9m5N8j30k5L9o8J33n2q8O2J6n6L6m4J9rP1n5J31j3q5Q2
5366G5j54L9N6k7M0J6J8m8l4j36J53Q4o0n0o8J66j56O9k8K0J9L1o3J15j17J25
5392H5p5q3J22l6N5K0j11k4PM0QJ4q1J22j09k7J10nr5J2p3J51J04p7QJ4n5k7N7
5421E1k7Q0m5L9q6J12r3j04J28r7J49n6m6K0Nq1N2K3lm9L9L7r5Q6j03l3J44K6
$$ plain form
5223 89 -62 57 20 -63 -18 -62 90 -39 -58 63 2 -27 -27 -74 -7 69 -9 -2 39 54 -61 51 84 19 148 30 41
5250 41 69 -53 114 -20 -14 87 78 -158 -28 2 19 -23 24 -65 -69 20 28 -56 -48 -63 -29 -55 -3 0 43 -27 -26 -15 -12 142 62
5281 62 79 0 -40 -45 43 -65 18 24 4 85 27 11 36 108 39 16 46 85 0 66 -18 -104 93 20 -32 -11 -88 50 57 -40
5311 -40 -20 -68 2 -98 31 -63 29 175 28 -47 -22 -69 13 100 -59 -30 108 24 37 -5 0 -36 100 52 -78 52
5337 52 74 48 26 4 -41 9 98 53 111 -19 -44 -5 -73 60 8 -80 -18 -2 -58 -22 -66 -47 -56 15 -40 91 78 -7 75
5366 75 -79 -40 16 -11 29 45 63 15 -19 -155 -2 82 22 -28 -96 70 -86 -17 -45 -25 -6 25 -38 77 -40 85
5392 85 10 -73 49 13 68 88 -23 -47 -40 0 8 22 -59 63 -46 -73 37 32 -63 -51 -124 27 131 54 62 76 21 -6 51
5421 51 24 104 59 98 12 124 31 -73 55 -42 107 51 5 25 30 -51 1 24 21 -28 11 48 -47 39 -64 -97 47 73
5449G3n5m2J10q6%j0J4N3l4PN7j57O7J33j72K9OL7m7l1N9L7L0p8l9P7PQp0MR7
5480H4j64O7j0o4P0K5Kj51J15k2Q4Q1l7p3pQ3m3p2J07J3o1m3J38j36P7j34nJ80
5508A04j31J27j47R0k8p7K6K2L5J4p5J03r6m2J08N7n8q9M7Rm2k4J14n9K4JL0l2
5536A1j07J05N6p3J42j25mr2J26L5rj34J01J5N3m0n5qrM1L9l9p3J87q5n3m6Nj4
5565e0J84j59l3J13p9K0l3P5qJ9j86Q9J47j12l2%O8n2J14j54J0J01n7Nj8J02q6
5592a2K0m6J75j90K4N1r4M6j06J21M4j0kN4j32M7Q5p5P7j01n4L0m3J03K9o2K8
5619Gl2Kp7J90q0p8O9l0JQ2QOj3q0P1N4l0j3l9mK5n2m8M0p8L8L9j0J25r0J12p3
5651D2r8N9%qj19J42p0j3L4N7m1L5N3j56L7J05J8n7N8j38J2J46Nj04J8j23J47
$$ plain form
5449 73 18 -24 86 0 0 -10 4 57 23 30 87 -70 -3 130 -42 -13 -7 30 -17 -48 11 48 78 0 -39 38 45 53 -17 -13 84
5480 84 -80 -13 -23 -87 -17 8 10 -141 -26 -48 36 117 80 7 0 83 40 -32 75 88 27 -16 122 -14 63 -71 -76 104
5508 104 -27 100 -47 43 15 -62 -36 -14 21 35 -40 63 -33 -75 33 90 32 -57 -10 -1 -43 -67 47 -12 12 13 43 11
5536 11 -96 9 65 -8 134 9 5 -87 39 74 65 -69 32 47 100 60 5 -3 -12 29 68 29 -44 143 58 5 -41 -36 -50
5565 -50 134 -25 -58 55 -24 -4 -37 38 30 49 -137 -48 99 -13 -45 -45 23 -29 85 -69 -59 42 -15 -10 -28 74 -12
5592 -12 8 -38 137 -53 -29 22 -72 -26 -132 -11 33 23 21 75 -57 -10 75 0 77 -24 -78 -48 -91 12 41 -21 7
5619 7 -25 -23 -100 90 10 -68 1 -29 -28 54 62 68 55 -25 46 100 70 57 18 14 39 -13 -61 -21 -99 -61 -22 -32 93 3 115 42
5651 42 -56 3 3 -5 -124 18 -52 -65 -31 26 -15 20 73 -83 -46 59 77 20 78 -60 -48 98 103 -1 17 -106 41
5678D1J6j34M7J5J7J03j50LM6l1JL7O3k43J61M0Oj4m2m9J03Pr5J41j09j7O9r1
5706e9J20o5N1l8K7j19J45p0n0J41n9j25J66K6Oj72J91k40K26j28n9J76r7K8o5
5731d3l8m7R2P9m6Lq5L2O1j6J27r1o4o5K32j77j8M7J37j08mL5Oj5j29J11pL6M2
5760H7q7M0l2mk0J4r6J46M8r1n1J23r7p4J3J11M7n7m8Q7k1N3j08N7k9lk5nQ4l9
5790B3P6j96M9K7j17J21K5l3J7j34J64J5P5j61J24j13N4q7K3P3q2M2j3J4n3J39
5816G2j17J6J10j18O2pk6L3j2L6l4qQ6j0q5J67j20q9M6PJ49l9K6j20n1O9K4q3
5844a6m9P2m0m6O3m9n6J53P9j07J58p9j48KJ39m1r7J10j44J85r1j18m5Q8Q0Q3
5870H6k08J45j08J18O6P2k18j8N2J21j51l6M8Q9j47R2%m3K6o4R1P4k06K06j15
$$ plain form
5678 41 57 -77 -30 -15 2 105 -45 -42 4 -27 -26 11 74 -169 -8 32 38 24 -18 -67 36 43 -52 89 -20 -37 32 -59
5706 -59 61 -4 47 9 36 -83 62 -8 -58 83 24 -101 65 91 97 -75 116 -124 102 -26 -85 91 -6 22 -43
5731 -43 -81 -128 -36 43 -3 0 -85 -53 8 -8 119 28 -36 -101 131 -46 -64 -17 120 12 8 43 49 34 -95 16 9 45 87
5760 87 0 40 8 4 -16 -2 -98 48 96 5 -46 77 -20 -94 -81 30 77 20 -28 59 38 91 -17 40 11 8 -17 -22 62 23
5790 23 99 -97 -48 -21 -138 -17 8 -25 -8 -142 22 37 112 -49 75 -38 16 -71 -48 25 -57 -15 -28 -14 -67 72
5816 72 -45 -29 81 -37 25 18 -8 25 13 49 15 7 93 83 -2 165 45 -44 2 9 158 119 145 25 -26 43 67 -16
5844 -16 -65 7 -33 -79 -16 -65 -121 32 111 4 162 83 -65 -63 76 35 -62 48 -96 89 -2 -120 -165 -77 3 86
5870 86 -122 23 -85 33 99 171 -47 -65 -13 108 -43 -79 -31 58 -89 3 3 -40 -14 -78 13 87 -119 87 -28
5895b8O5j23J12O1j08R6P0j59k1N3LO7k14J50j01J45j32J69m5m7K0k9l6J54j88
5920f6N7L1k7kk3J32j50J30k1j67J46MJ5l9J0N2j17l2m9J62J27k27P0j02J26J9
5946E9o4J7rJ27r5m2J4K4j25J38Q6j00J9q7K0j0O8n1L3L8p5J20j00K8o1L5p4L0
5974c7L5m2M3L7j12J61j11M1m9N1q1J77j53J98k0j33Kk4J14k07R4J79j27j20K6
5999e8O3j5J6K5j30O5Q1N8j60J54j01o9J82j8rp3j0Kl3M9o1K6M6n3r7Q0J9n0J23
6028E2m4J18j49j02P9N1rJ7m3j4j3J47j14N4m8M2K6m0p0qO7J8J14k12P1Pl9M8
6056FJ10j45K8m8O0pJ6Jj5p6Q1P3j1j36L7l2O1k1Q5j16P6O3o9m5o9M8n1J54O9
6085A27p6l2mPn0O2lj3J1j03j8K03j82m1R0l1P7j00J3Q7l4n3J8J9k1N1q8n0P6
$$ plain form
5895 -28 37 -86 26 87 -21 75 145 -14 -35 18 21 88 -126 24 -77 68 -64 105 60 13 33 4 -32 122 -66
5920 -66 -9 22 -5 -7 -30 102 -48 82 61 -106 40 44 59 20 30 82 -35 -67 -116 46 173 -54 16 -86 40 59
5946 59 -5 12 3 130 35 -7 7 31 -94 44 130 30 49 -38 -18 -28 40 -11 22 60 -15 105 5 33 -28 7 -67 -37
5974 -37 -2 -44 -1 36 -76 85 -26 15 -34 17 -64 113 -40 158 138 5 7 -17 97 -110 -16 163 36 -84 -58
5999 -58 5 -10 6 31 -99 -34 47 105 -55 99 -2 -71 111 93 84 11 1 3 -30 19 -42 -16 30 -23 -120 -40 -21 -71 52
6028 52 8 126 -23 -125 -46 5 -4 13 -30 -44 -57 90 -24 30 -18 24 50 10 -60 -68 -1 17 131 -81 -10 -3 -42 6
6056 6 116 -29 -1 -49 11 4 20 21 6 -70 11 84 73 -63 -26 -58 3 -18 67 -49 27 90 21 -24 -93 -45 -96 58 127
6085 127 51 19 15 22 -28 34 31 18 29 -74 -92 111 -71 -112 -22 -53 24 -76 -63 24 -10 -63 -45 -26 -47 4 -84 -134 -58
6114e8O6M5j1l6j25R8K9k7R8k18J12L8K9j32J37r3R2k6m0J44p5J4j60K1M4o5M3
6141e6P1O8j4k21J53Q7j13N1M6l7%m6pN0m5j27K02m5M9j03K3o4K27j03K9j60J15
6168C0r1N1Q1j62J04j06J41M3j07L4N4j82K37j04J26q2p0j5r8J98J2j62J41m7
6192B6kR4n3j83J96o3r8R6l8j4pRJ2L4j29J83n4m0L0K0n0O5m6rJ05p3m3j4K1l3
6222e8N1J20j21M9o7M7m6J0K6R6j12m9qJ43Qm7rj22P6nJ20p4Rj1o6O2K5l0j06
6251h9P8P1l6L1O2o7q9Q2M2P1j40L2lk4m9k2J07p9J9l0l8k0K1Q0j9k3j6K2L2j42
6281a36J68rRo1M3l6N0J06j38rO7k5j0J4j1j9Nn1lQ8m0NjM0j04N2k0Q7n1m8N2
6312A4m7M5m5l0l3J20M3J8l5r9J3J26n7n3J24j98J17r4J19K5j68P7J05q0L5J3
$$ plain form
6114 -58 8 53 42 6 -119 -21 8 -19 79 -139 -27 11 40 -92 45 -48 44 18 -22 122 47 61 -99 -78 -34 -99 -56
6141 -56 15 83 69 -152 1 88 -25 26 72 35 35 -11 -18 32 -13 -140 62 17 66 -37 -14 -78 149 46 75 -85 30
6168 30 -61 -10 71 -91 13 -93 48 91 -16 18 72 -110 127 23 149 67 -3 -18 -116 82 94 -68 73 26
6192 26 24 118 65 -118 78 15 -83 13 -25 -39 -46 -37 -25 9 -120 63 9 -31 -1 19 -31 34 -12 -21 84 11 -32 -46 -25 -58
6222 -58 -7 113 -8 41 -26 21 -25 -15 11 107 -5 -54 -62 81 89 42 33 -89 -13 -18 102 28 37 26 -40 22 47 17 -89
6251 -89 -11 60 24 55 117 50 -39 43 85 156 16 48 45 21 -28 -50 57 -22 -3 -33 -71 -91 -70 10 -9 -32 -48 -26 6 -136
6281 -136 32 23 32 -29 14 -22 28 134 -4 -13 54 29 19 33 22 3 8 -43 -46 42 2 7 6 46 -58 -6 -26 61 10 -38 14
6312 14 -33 12 -33 -63 -96 24 67 85 50 -49 -36 90 33 -20 104 -94 23 -71 48 73 -95 -18 87 7 42 55
6338E5l7k1j18J25q9lL7k2R2j10N9L7m4R2K5j32J73r1k7J1m4o9J37p8M6j34J46
6365A6j02PJ59q2O0p7J3o9J20k7N0k5l3Q0j55j4N4j9M5J6M4r9L6J0k3J16j02m3
6393d4K7ol2%O0M7kk9q2J71n4j43J73p0J6K7k5l9J30j07m0O6j70J18l4j4J66j2
6421I8o3J2o2j2K0jM6m6J4L4k5p7R4n0Q7j33Q2o6J7m9R9n2p4J69p2n6O2PMO1j44
6452g6J44p4pL6j4K3jm8L7j73J40j66J95q1K35k20J2kj8J24k6MLO4o6m1m1N8m4
6481b3nL0o9Q2m5RL2j42K05j07J08q4q3J66j93J06k2n0N4J62k25N9Oq4Q0J30m3
6508E4j80J08m7L0l4P1p7J18J4n0J39k52N3L1Q2K4p8L2j05nL3o9R1j2j7j1L5K0
6536bJ1n2J20O7j98j7R2K7o6R5J8j33n6N9M8L8l3nJ34j02j42J49o5J42j44j05
$$ plain form
6338 55 18 -3 -121 4 -85 -88 -51 -73 19 -91 -32 5 -39 53 78 -54 119 28 1 12 -32 -101 36 -42 4 -130 16
6365 16 -86 -79 80 -2 58 -19 -6 -75 45 18 68 43 10 90 -65 -79 -25 -44 1 17 61 -38 -2 8 -15 101 -1 -44
6393 -44 -17 -23 -55 -55 5 52 50 21 -61 110 56 -87 86 16 32 59 34 -5 125 18 -22 44 -126 -8 -42 -56 110 98
6421 98 35 47 -15 -27 -7 -8 38 -8 6 40 15 -62 32 -18 69 -64 18 -48 -31 -80 19 -33 -107 62 -10 -66 -4 3 7 68 -76
6452 -76 68 -6 -13 23 9 32 31 -17 20 -153 -13 -179 16 -65 170 -50 -38 -40 -58 66 40 44 47 111 45 4 -37 21 -23
6481 -23 -28 2 -67 15 -30 -21 11 -131 74 -33 75 -9 -92 74 -119 -13 -35 -85 -31 131 -94 -35 -29 -113 -33 97 54
6508 54 -126 -18 -65 -35 -69 2 -75 43 57 7 146 -106 -53 -22 60 84 6 38 -67 -72 -39 -108 -17 -29 -46 -57 -22 -2
6536 -2 9 -43 77 144 -54 -71 21 48 -18 77 95 -38 -94 -35 13 51 18 13 147 45 -97 52 -13 129 -15 -120
6562a20J94j89P7M4K2n8J11j12J35p8J9j15J12l6p2RM7Q9j15N5j15J24j35P1n6
6587i2J24K4p1J13j65Q1J5m6N5j04L4P5n6l0Q6MJ09k19N3Mk8L4L9j09L7J34j11
6614a0Q9Rj07l8nJ82j25l5j2J36k07L7J80j09K9m1Q5o6R1n4R5n0j12L5n6J65l3
6641G3j16n1J21o3J03q8R0j07K1P4K5j76L6J88j87l4P3Qo1j7O9KLj20N3K55k03
6668b9N1M8q0M3m7o1R1k4P8j86J61nk5j00M8N6p7J49j18K5N2l5N8j9J10j1r3o5
6696eJ18r8j1l4M6k4M4o6l6qL4J12q2j7n1J71j63J01J5m8k6j6%k0K5%m4P5K0n6
6726d4J36j0j7k6J2L4j82P8l2N6J35j85k4J36j64L6J40l8Jj7j05L1J38r4L7qq0
6753e6KM6Q0m3%O0r9Q2r7M6N1j50k1J32k9pn7j8J14p3l4Q6Qj81K29k16K07p3r5
$$ plain form
6562 -120 74 -115 -38 6 28 -30 81 -31 104 26 45 -70 42 6 -66 -57 -10 79 -36 19 -96 28 -107 -36 -92
6587 -92 32 56 -15 98 -67 14 29 -17 38 -66 -32 43 -13 -43 43 47 156 -63 -10 -6 -34 0 39 -70 -33 101 -10
6614 -10 79 88 -19 -57 -62 120 -5 -40 -52 84 -123 -86 94 -15 14 -27 58 -8 83 29 124 74 -38 -3 -59 106 73
6641 73 -43 -94 27 -36 67 -21 69 -38 -17 57 82 -94 -58 130 -57 -91 -18 -10 -71 -88 -19 -17 -14 -134 -81 174 -29
6668 -29 22 70 -10 33 -14 -75 16 -8 70 -116 45 40 15 -85 -37 19 -58 91 -27 -2 50 15 73 54 164 153 60 -5
6696 -5 113 15 4 -30 16 -8 36 -30 -66 -74 -40 72 -10 -27 -78 93 -70 31 46 -2 -28 -44 -44 -64 -39 -39 -83 -8 12 -44
6726 -44 92 82 65 39 51 85 -97 -19 -51 5 140 -45 -69 67 -97 -61 79 41 42 25 -80 -49 89 -5 32 24 -56
6753 -56 -54 -8 72 29 29 89 -10 72 -25 21 72 -78 -99 33 4 -3 -60 -78 36 -37 -71 15 23 -158 71 -145 62 -11 -106
6782a06J28m4K3l3P0j6%q9J62n2l3m6N2j41J89lj1j08O5%j4K5n1K5J9J0k3Kp6
6811g6N1L2N1K2Or5Q0%p2mr9Q2N5N3q1L5j01Q2j27P8lL8k3j9J21r0P2p7K1O5M3
6842A20o5J8k1j88J15l3k5O2N1N0j24J69p1j30J98j03L8jM3j10M4P7j27K7Oj05
6868h5P3N4k2M6j50P7n1J17o1p8J33Jj22Kj0J11j05O3Rq3jK11j39N5k6l7Q6kj34
6897f8JR3p9O8k9L5J7P7j12m4KM6j9M9k2j00L0j5O8Jr0J9j9P3j1Q1l1k2q7j1J14
6928A5qj03P7J57j42m0K5N6o4P0q0ON7M1j06J7rN2L1m5J8m3N6M0j19L8m9O0q7
6957g9K1R0K7l3J0L6j77J50n4J3o8J33m8nj08J31k2j05P9j1Q1J8j26P4j3k8J11
6984I7j42P1j21J62r2l3J90j34L6m8o4L9Q1l6nP0k6j26P8n4M0j1J03j5r9P3j3
$$ plain form
6782 -106 22 -22 1 -32 38 22 22 -67 95 43 10 -36 16 -125 64 61 50 -58 7 7 -7 18 -33 -8 11 21 -2 0 -76
6811 -76 -25 7 58 80 86 -9 71 71 -1 -5 -104 -22 33 86 5 40 -61 21 -106 -28 -31 7 -16 -35 86 -4 68 -9 12 77 120
6842 120 55 73 52 -136 -21 -54 -79 -17 34 84 -40 129 58 -72 126 23 61 60 103 -7 37 114 -13 14 20 -85
6868 -85 -12 42 20 66 -84 -7 -58 59 -2 -80 53 54 -68 -66 -76 35 -70 -7 2 -81 -82 129 -10 45 19 -18 68 66 -68
6897 -68 -67 26 -53 15 -14 21 38 115 3 -41 -39 7 -12 37 15 -85 -55 -70 -2 -1 -91 -72 -91 -18 -29 52 21 -1 -88 -99 15
6928 15 7 -96 -19 138 -4 -44 -19 37 -27 43 -37 -31 26 67 -39 -22 -31 21 52 7 25 -18 38 78 -41 -3 -52 8 -79
6957 -79 -58 32 59 26 36 72 -105 45 -9 4 -64 69 21 16 -92 39 17 -88 -9 -20 61 79 -47 27 14 -14 97
6984 97 -45 26 -95 67 -25 -58 132 -2 34 -14 -78 -39 42 6 1 71 45 -81 -3 -57 -17 -28 75 60 -39 34 21
7011B1j11K12j95Q0R9jr7LP8n2p2J6J32j03o6M0N2j85J33J31r7j47J85j07J73
7036A22k07N4J20j82O4mM2k2L1p0o7J95o4o0k8K9J70j50k9N3p9O4k7J26q3K8p1
7063d5L9N8l7l2J04K4p1L9r3P0p9M4L7m2N1on0jmk9M5j8m6Q3q4Nk3J16J3j28L6
7094b4Q5No2j2k1J20n4r7N6P4K4r3Q8j50NJ08J4n4l2J2p9P5L4m0J00p4l8M8p5
7123e7j7R4j62M5J22Mj08L2Q1m0j24k4J10M4o5K1N0rK6R4j52Q3j21J13j5l2L5
7150B8k0O4j01rl2N5N9k1j3PN5n8N5O1j92Q5J3n7j1j9M2l3R8j13N9n9k4J81M9
7179A49k28N2l0J37j60lPR1o8J04K4r5O4o6J0M8N6l6M3M8j43pL2J08m8j04k9J31
7207H7o4M0n9O9Pm3j10K26k22k4m8J77j23L7J28j53j4J19k0j92K09mN5j10N8M0
$$ plain form
7011 21 -90 122 -73 7 106 105 8 11 89 37 -35 -19 113 10 -56 -16 36 -149 -16 115 18 -129 56 -51 122
7036 122 -85 -31 89 -93 -29 -33 9 -13 18 -52 -119 76 12 -48 -76 -47 123 -27 -56 -3 -82 -18 -45 81 -2 26 -45
7063 -45 -6 52 15 -17 87 111 40 79 -14 56 -23 21 58 16 67 61 11 10 6 -23 22 4 -42 41 -43 -38 -61 55 68 -60 -24
7094 -24 61 66 4 -8 -29 91 37 -60 -4 70 94 1 89 -61 -56 52 66 12 -20 -8 -87 -12 22 -18 82 8 -30 18 -57
7123 -57 -74 20 -142 -97 25 29 -79 -47 34 -6 -130 -154 -44 0 -65 -44 6 -3 23 117 -35 48 -73 40 25 -7 28
7150 28 8 72 -29 -38 -70 -15 44 23 10 17 72 14 69 130 -62 23 36 -21 -32 -51 -9 -42 56 -57 2 -57 -81 100 149
7179 149 -79 -27 -57 80 -80 -83 -76 15 -53 51 75 -20 44 -22 -12 36 92 56 99 147 4 -3 29 137 89 -15 -44 87
7207 87 23 63 4 73 80 37 -73 153 -69 -93 -141 36 -87 -50 78 -75 -89 30 10 -182 27 23 78 -32 26 66
7233F6j19M2l7O0l6J5j5R2r2R6j04Nm2J35oq2P8j11L4NN8j01J21j36P7R4k0j17
7261d0j7N5m6J2m9J27O7k55J35R7n7K3M2j58O2KO1l4n0O3r0rL7n3M1K2P2j03N3
7290A0k0O0j30%J23m4M4p9Q0p7j3j6Q6qk0m3K9p2K4J58j03N7j19L2J02q1J31l4
7318G7o5m4J31k02J54lj27R2k1k7L3k5J02n9q1L1n7J09P5j28k7J19j35J03rj24
7344a08P9%r0J79n2Lo0oN9j8k8J51o4l7N3K6p1K8k0j05Q2M2p5J13J6j00N1j22
7372g4Q3K2j0N1j18j01K18o4O3p3q2k1L3K22j66Jm0Q0M0J5m9p7J17r8L4m8n7Q7
7400a2M9q5P6r0J31k3k7k7M9kn3m1J06o3O3j2k00J87l7p6J04p0j3R3r6M1L1M7
7428E0jl6j64J26m5nJ6M8l0P1j6o9R1k9ON4r3N6p7O0N7j5N7j18Pl5N1L4j7q3L0
$$ plain form
7233 66 -53 -11 -48 12 -24 -9 -24 68 -24 72 -32 -27 -69 66 60 -22 56 -55 -21 -16 42 -59 62 -74 3 97 77 -40
7261 -40 -57 -2 -48 -36 -85 42 109 -146 -11 86 29 52 94 -64 -2 0 61 27 -23 40 -50 -59 -22 -75 -34 -12 60 -43 10
7290 10 -10 50 -80 -80 43 -1 43 -36 44 -33 -46 -62 24 16 -4 -47 -18 -90 -66 92 -11 46 -73 -41 61 -20 111 77
7318 77 12 -32 99 -103 51 48 -79 13 -8 -35 -2 -27 75 16 -65 -34 -91 18 93 -35 -62 57 -78 25 16 -108
7344 -108 -29 -29 -119 60 8 11 -49 -55 4 -14 -42 109 45 8 61 87 16 44 24 -81 1 43 -32 81 97 -3 48 -74
7372 -74 9 31 21 72 -46 -147 71 7 70 -3 -85 -106 -73 149 -17 -16 -56 24 64 79 30 -47 70 -28 6 -42 -99 -12
7400 -12 37 -48 28 -62 69 46 19 -8 41 39 -14 -55 51 -12 51 39 -161 26 -11 -87 17 -53 -66 27 -69 -28 3 50
7428 50 49 13 -151 -25 -70 -75 -59 -11 -41 30 14 -55 36 7 13 67 -26 30 -47 13 70 55 112 -6 1 -34 17 51 34 -49 -19
7459a9J5m1l6J79j28N4l3R1j48J41r0j58J33P5Lk4q7L4R7kn9J9pKO8j20O3K%n7
7489c3k4Q6L7k8P5j62J53j45o2J52p8j00J07l6L7NM8m5J05l6m4L2ql7J7j00O2
7516b2J52m5m8O0j28m1J7RP9o8j56K11q6M0j4nJ63j4j34L0L2m0k4j8K3p0Q3l7
7544e1pMJ8Q4k4J3nj55R5Q1o8l8R6j87J67O0j31J24j39J37p5Q2j20N1m1MJ2Km9
7573f0O9N8o2j34J71J4qo9O3L2j04LN1p2K4O1NORo8l7M7L5L9l9q8J28m3ON1r8
7604a0n0L3R1r2O5K7K7K1j32J10j11k9%L1P4K0m9r8N4k1J05p3J18j12m0M4L4l0
7632GM2j39M8J30j59M9J1J38j45k4J0J1O8m1j1k9j3J24o6K8n4J5j06M9M9j8J23
7659I7J3r4j15K44k37M3J38K9j68K76j25j54m5K39l08j95L93K48j11j2p0p37L16
$$ plain form
7459 -19 -4 -45 -81 98 -30 24 -9 82 -66 75 -15 -173 -40 35 38 14 -73 -39 58 56 -3 16 9 11 79 -41 22 24 24 -33
7489 -33 -57 29 66 38 113 -49 104 -41 -103 49 -29 -129 -22 -58 -21 -16 32 -13 92 56 12 44 36 -1 16 -84 -22
7516 -22 130 85 37 97 -31 -72 -55 -46 33 -35 -191 20 -66 -26 -40 -45 118 104 -30 0 32 -8 -32 -50 -27 -97 -14 -51
7544 -51 -58 -54 -36 48 24 37 32 -123 -28 53 -15 -53 43 -144 23 83 -48 76 -63 74 -1 81 -39 12 -29 -25 -13 -11 -60
7573 -60 9 67 5 -129 42 56 48 -21 42 74 -30 -27 24 -48 -24 37 42 48 57 -11 -48 -1 34 73 34 -54 74 31 37 88 -10
7604 -10 -60 -27 64 -28 37 64 91 112 -20 90 -21 -50 -50 -19 55 75 26 -72 -18 -39 66 -7 111 -1 -41 3 37 7
7632 7 49 -90 -42 88 -71 -22 -11 127 -18 -42 -32 -21 47 6 -5 -34 -47 77 11 39 -15 0 -106 -57 -8 -26 97
7659 97 110 16 -99 145 -92 -49 89 118 -50 226 101 -53 -98 141 -167 -362 31 279 168 156 86 -651 -335
7682c35J86nj08K27K15n8n54N42r3o10o7L83j92%K94J48o3J94R1k63M75M4m39
7705A2L9l96R36k54m65L62n25N07k32J39k28K37j59j5%L4L9P7k07J08m3N1j1o3
7729e7m8J08j59K24j47J08l0J27j81O6K7l7n8J10j39J82j59J21n0n0QO8Q4o3k56
7754b01K18k42N29L86r83N94m35K30o3k3J0N2N7k78L25m71M90K46l53L25j31j40
7776A42j02M63r45Q87o50K46K78n50n20P90p6Q7L21p6k42n30N12l57N50q76K66
7797c82J253o76j28J99J23M47j174J076r8q96N48n42K66l94O61l30l11O60o38
7816c36Q96o03M46m65O3n1k83O85k83L3P51q05q2jj26k37R1j43O22j10M47j412
7838i03J618j81q02K74m34J46n02N37P55o22Q1J466j478p5O69j016P7N77o06M65
$$ plain form
7682 -335 -149 -154 -262 -35 180 122 -432 110 17 -593 -660 -277 -469 -469 -175 -27 -90 104 195 -68 407 451 12
7705 12 51 -345 591 337 -128 234 -291 216 -16 123 -105 132 -27 -42 -42 -8 31 108 -99 9 -34 17 6 -57
7729 -57 -105 3 -156 68 -79 29 -1 126 -55 11 38 1 -57 53 -86 96 -63 58 8 -42 -34 34 118 55 -201
7754 -201 17 -225 304 690 -293 301 -134 96 33 10 20 72 129 -149 176 -295 195 441 88 413 282 142
7776 142 40 503 -442 445 -205 41 319 -231 -751 39 -37 50 371 295 53 -477 35 -322 228 -648 -382
7797 -382 871 195 67 266 389 836 -338 738 640 -256 292 -250 16 -378 283 -47 -358 302 -336
7816 -336 560 -43 403 -62 1 -50 -333 352 69 102 853 48 -34 -35 -161 -398 -307 -450 172 62 509 -903
7838 -903 715 534 -268 6 -428 -282 -784 -247 508 -114 -33 1433 -45 -120 549 -467 -390 187 -419 46
7858D6l42Q34n87L23M6n62O8J62N81p00O30l25k85L72m00n31M98o1K06p66N06
7879b87k43Q1N18o2j113J025r6N12m26M02j204R54l51J75J492k259J157j62K22
7898C35r27J73O82J25j318J051K87j09mk21l84K67K49O8n66J91N4k74L04K11K
7919A96k1k48P1j01J02j18r9K69k60K40nk19Q4K55k32J54j64J88j40J25j01P1
7941D7n8p9J10j5k8O2k3L6N9j15K8J06o4q5Q8r8O1L9o4M6o2l2Q5p4m4mJ18j7o7
7970d4O6m0P2j33O5K3L3l9L3N0j32Q8j12K8J03m7OqJ23j18J06j40N6j6q0J18Q
7997F9j68J00P0j37NJ64j07p6P7l4jL5Qn2O7n9N1J1m1k1L0j03J29L3j73M4O6O2
8025D9l2j3J1J7N9p7O6j2k6j20O2K7oL4l9kl0l3M0J7m7L3LJ3j7K1J9mj59J16M4
$$ plain form
7858 46 -296 538 -49 274 320 -242 -174 -12 569 -131 499 174 -111 261 -139 -670 -172 -233 -27 -793 -287
7879 -287 -530 -449 69 7 -1106 -81 -177 335 -91 311 -893 61 -290 -115 1377 -882 275 113 335
7898 335 -592 -419 263 388 -930 121 408 299 295 74 -310 -43 206 274 -292 -101 -47 -321 -17 194 196
7919 196 175 -73 -2 -103 -1 -119 -218 51 -209 31 26 -193 -109 146 -86 68 -96 92 -48 77 -24 47
7941 47 -11 -90 20 5 -23 39 16 52 111 -4 24 130 66 -19 69 -29 32 71 7 53 -9 -41 44 -30 -74 -78 40 23 -44
7970 -44 22 -18 54 -79 -14 9 42 3 36 86 -46 42 -70 -42 61 14 20 12 135 17 123 -17 39 23 -57 61 69
7997 69 -99 1 71 -66 -61 103 -4 -80 -3 -37 -38 -3 5 -47 20 -39 12 23 -18 -39 -9 -112 17 50 -123 -79 -13 49
8025 49 17 4 15 32 91 14 80 68 42 -78 -16 11 5 39 0 -2 -32 -65 -25 -8 -55 -22 -19 -6 -23 -2 17 13 -146 -30 14
8056A4n8k0K4j6Q9n9J19j23K3r1J2Q9m8o2L5N4j05J38K0L6j54J27j00M9L8l8m1
8083d8O0j5j7m5J08j01l8J94o8R5j55j6LJ3m6Q1Q6j33J03j16N6o4J09k18J75P
8109A0J4L7O2j62L2J10j23J6l9N4O8O9p8o2l8K7MJ58j46J8J9j57J47k4n5k8Ql7
8137i6P2p2J13n0j3M9k5P2n6r2Q3P5j69J01p3K2mJ2N4OJ25j6j07n0L4j0q4J76
8165G7p1l3J38o1j24J22k6k5O2jj76J68n6L2j26K2N3j6Q8r3J54j71R0m1p7N5
$$ plain form
8056 14 -44 -64 -40 -56 33 -26 93 -30 -7 -98 -86 3 -45 -107 -72 -18 -123 15 35 71 -83 44 -56 -7 31 -7 -48
8083 -48 12 -3 -20 -65 43 -58 -96 98 30 125 -30 -46 -43 -30 -76 5 91 -42 61 -55 1 -63 46 -172 3 10
8109 10 24 61 123 -39 -7 103 -20 -4 -43 11 79 148 70 8 -30 -3 1 159 13 31 50 -107 40 16 -39 -67 -59 -96
8137 -96 -24 -96 17 -33 -46 3 -22 50 -6 -98 -15 60 -109 -8 -81 -59 -63 -51 3 9 134 118 11 -39 -5 -15 -99 77
8165 77 6 -27 111 50 -74 48 22 -3 59 58 -118 50 -6 26 -100 -78 -25 -41 47 -46 108 -63 27 -14 -91 -36
8191c6
$$ Imaginary data points
##PAGE= N=2
##DATA TABLE= (X++(I..I)), XYDATA
0@%%%%%%%%%%%qJ6j6J6j6K4l2M0m8N6p2Q8j04J20j36J56j80K08k40K72l11L56
33A89m04M55n11N74o42P17q01Q94r92J099j219J348j488J643j813J999k202K424
51A270k670K944l249L589l972M409m910N491o174O993p997R258j0898J3128j6351
66i139K1438l0687N2757k00299j72040M83635J21485k86852j60263J90183R0622
77A00840r5128p4429M4418K5958L1593M1100k7626j35841m2340J49160J35331
88A53036j08732j56093N9182J38466n1252j13360L9960R1082j8594k3927J8977
99B8745n5658p2225R3296J27803o9957j38603L9003J09289l2517q8470K5447O9631
111C5784n9k6375r233l3401k7182N8419Q0684l4601r8152J2218Q6300k3855r0060
$$ plain form
0 0 0 0 0 0 0 0 0 0 0 0 0 -8 8 -8 8 -8 16 -16 24 -24 32 -40 48 -56 64 -72 84 -96 112 -128 144 -167 189
33 189 -215 240 -271 303 -339 378 -423 471 -521 578 -641 707 -781 862 -951 1048 -1154 1270
51 1270 -1400 1544 -1705 1884 -2088 2321 -2589 2902 -3272 3721 -4276 4982 -5916 7212 -9139
66 -9139 12299 -18388 34369 -165930 -337970 145665 267150 -19702 -179965 10218 100840
77 100840 5712 -68717 -24299 1659 33252 74352 46726 -89115 -131455 17705 153036
88 153036 44304 -111789 -52607 85859 34607 -78753 -38793 52289 33695 9768 28745
99 28745 -26913 -99138 -5842 121961 52004 -86599 -47596 61693 29176 -59294 -33847 35784
111 35784 35725 9350 117 -33284 -60466 -2047 78637 44036 -54116 -41898 44402 20547 -69513
124f9513M5080J18473m1525j34052L0270J19886m8971j14778Q1902J42086q5840
135D3018j72316N2117J65267k2459j29049J9582J01987j8389q3141L188M7824
146G629L103J002K4671k6481o5313J2192P9188Q475p0258r285P0756M307q5380
159d5394j4803Q7329K8866o4719j6835M8196j1285n3753K6693O1476k1324m6546
171b2099K0669K1859l7053j6329M5440K2686l2598j6170J5970p466j9724K1170
183c645L3960j4167l3852J1319K5020k7579l0465M7193N2992m8204o8839L9271
195a6996O7253m2458o7938M9569P8227l9542q1878J1398O0478O237k6726p62O086
208B948q000L885Q767j8317j3224L6161L5669l7188o1390J6483O5246J454n1836
$$ plain form
124 -69513 -24433 94040 52515 -81537 -51267 68619 19648 -95130 -13228 128858 43018
135 43018 -129298 -77181 88086 65627 -63422 -43840 58147 39758 -43383 -40195 7629
146 7629 10732 11734 36405 9924 -55389 -43197 35991 44466 -25792 -35077 35679 39986 -45394
159 -45394 -60197 27132 55998 -8721 -25556 22640 11355 -42398 -15705 45771 24447 -22099
171 -22099 -1430 20429 -16624 -32953 12487 35173 2575 -13595 2375 -5091 -24815 -3645
183 -3645 30315 16148 -17704 -6385 18635 -8944 -39409 7784 60776 12572 -56267 -16996
195 -16996 50257 7799 -60139 -10570 67657 28115 -53763 -42365 18113 24350 -2376 -3138 2948
208 2948 -5052 -1167 7600 -10717 -23941 12220 47889 10701 -50689 -34206 31040 32494 -19342
221a9342k714M1544k928m1267J628L4478j019j6946J6484R349l6164j9131M1438
234E410L2992k9831l0657K0263J9658k0178j5647J5821J3466l859m57k332k1550
247a6901r530L3459K6848k7814l2717K1363L1377k2027l4448K2300M1211j1920
259B1201l6922O89K0094l982r082J4526R347j9074j1835J4256M961j3049K868
272f002J9186n20j9902m470J1647M36l701J2583O462j9500j4590J6493J5769j6330
286b439j4041K1696J7570k4988k5845J6364K6708n662j6748M474Q599q092n601
299h005P717L347k177N718L501j3990j3678J3088J9585p379j6393O112J1378r831
313a007j3986R828J7147m543j2048M254M304r961l057J5454Q775j2902r820Q225
$$ plain form
221 -19342 -22056 19488 16560 -24707 -23079 11399 10380 -6566 9918 19267 -16897 -36028 5410
234 5410 38402 8571 -22086 -1823 17835 -2343 -17990 -2169 11297 7438 6981 4649 -16901
247 -16901 -26431 7028 33876 6062 -26655 -5292 26085 4058 -30390 -8090 33121 21201
259 21201 -15721 -15032 5062 1080 -8002 6524 15871 -3203 -15038 -782 4179 -8870 -6002
272 -6002 13184 12664 -7238 -11708 -61 375 -3326 9257 15719 -3781 -18371 -1878 13891 -2439
286 -2439 -16480 5216 22786 -2202 -28047 -11683 15025 9363 -7385 -2911 5688 -2404 -8005
299 -8005 -288 3059 882 6600 10101 -3889 -17567 -4479 15106 7727 -8666 -2554 8824 -1007
313 -1007 -14993 -5165 11982 7439 -4609 -355 3949 -6012 -9069 6385 15160 2258 -7562 663
327F63M593r526j841J1850M443r167o638K047N22q28O810N665o914p914L578N328
343B671m035l488R490P577r784j1247M430Q032k242l709M766L045q013o021M464
358d064M287p61J571K750l742o476J523O954M79k861K772K208n331m964K148N014
374A507P94o69J023l379o650J642Q379J946o234k553O352L072p610n813O681J0171
390H659R65q758p291J147P474N463l501r262M09J0677J182j3291o758J2457J4044
405A3616n853j5565k560J0637P506l721o498M37M862K009k575n742k640O314R003
420I230j648j2479p142Q293J1012k440r294j357P260L129n976m613L913N544J093
435D525j991l328l234k23L998N643o14p648m823M957P424l303r197K730J0531
$$ plain form
327 663 5256 -4270 -6111 5739 10182 1015 -5623 -3576 -3054 -3882 2928 8593 1679 -6235 -2657 2671
343 2671 -1364 -4852 4638 12215 2431 -8816 -4386 3646 1404 -2305 2461 5506 -2507 -8528 -4064
358 -4064 223 -538 1033 3783 41 -6435 -4912 2042 2521 -340 2432 4640 -691 -5655 -3507 1507
374 1507 2301 1632 2655 -724 -7374 -5732 2647 4593 -1641 -4194 2158 5230 -2380 -8193 -1512 8659
390 8659 9624 866 -6425 -5278 2196 7659 4158 -5104 -4695 5982 7164 -6127 -12885 -428 13616
405 13616 7763 -7802 -10362 275 7781 4060 -2438 -2001 2861 4870 2295 -3447 -6087 227 9230
420 9230 7582 -4897 -12039 -3746 7266 4826 -4468 -5825 1435 4564 -1412 -6025 -2112 3432 4525
435 4525 2534 -794 -4028 -4251 -253 5390 4776 -2872 -7695 -2738 4686 1383 -7814 -5084 5447
450E447L39q712l626K849M398N654K136q706j0463N731J5648J485j6468j2031
464a6319J3191K3150n955l2253o713L2934J9275k4475k4875J1933K2144j72j3600
477a735p323M798J2381M338j1452j2106K686J4355R842q835k1068l752K5141J5791
491B3061k4292k4143J8896K8130r374k6914k386K0319J2736q551j5577k259J2055
504A701P340n983n857M21j093L060Q368n337j5644L389J9980R43k0092m866J6909
519C239O713j2516o656J0472Q781q825j2221Q723J4973q770j8124R364K2642q851
533H944k8912L608L1854L575k7585j0079J9040J1856r601q829L625L771J043L012
547E322j642r041l043J2220J2239r772k2435J674K7438P910k8000j6930K3980
$$ plain form
450 5447 5786 -2926 -6552 -3703 695 6349 8485 -221 -10684 -4953 10695 12180 -4288 -16319
464 -16319 -3128 20022 14067 -18186 -24899 8035 27310 2835 -22040 -10107 12037 11865 -1735
477 -1735 -9058 -4260 8121 12459 1007 -11099 -8413 5942 15784 6949 -14119 -17871 7270 23061
491 23061 -1231 -25374 -6478 21652 12278 -14636 -17022 3297 16033 7482 -8095 -10354 1701
504 1701 9041 3058 -2799 -2378 -3471 -411 7957 2620 -13024 -9635 10345 11288 -8804 -13670 3239
519 3239 9952 -2564 -9220 1252 10033 1208 -11013 -2290 12683 3913 -14211 -4847 17795 8944
533 8944 -19968 -16360 15494 19069 -8516 -18595 445 12301 2700 -6129 -2504 1267 2310 5322
547 5322 3680 -5361 -8404 3816 16055 6283 -16152 -14478 12960 20870 -7130 -24060 -80
560h0K2322j6213k2548N713J7372M978p711j0521j352J0912P734p488r957J708
574e131P151N007k75j2152j1426J4237K1548j0480k6264L043K4504L612j8602
587e228p853J3068J2111o922j5677K275J7853r76j7828K650J7649o333j8644P556
601f299J8341o587j5762M392J0347k368m058J556l41j039L078L607j845o785k789
616f552Q900R373q115j5403N501J7954l155j8225l75J4973M364q392p213n32O340
631e57Q886o05j2146n166J0948R365n671j0624j224R335P532n258j2719k957J3019
646B158J0918r331j6210K187J6704N562j3773j1284R091J4932k695j4955k699
659i395J2533N462q539m694M390R65j921K566M8o093l73Q611J801r158l036O776
$$ plain form
560 -80 22242 6029 -16519 -10806 6566 11544 3833 -6688 -8040 2872 10606 3118 -6839 -5131
574 -5131 2020 7027 6752 -5400 -16826 -2589 18959 8479 -17785 -14742 9762 13374 -5228
587 -5228 -13081 -13 12098 5176 -10501 -8226 9627 8651 -9177 -6527 11122 4789 -13855 -6299
601 -6299 12042 5455 -10307 -5915 4432 2064 -1994 -438 -779 -1818 1260 4867 3022 -3763 -6552
616 -6552 2348 11721 3606 -11797 -6296 11658 8503 -9722 -10097 4876 9240 848 -6365 -6897 -557
631 -557 8329 7724 -4422 -9588 1360 10725 5054 -5570 -6794 2541 10073 4815 -7904 -10861 2158
646 2158 13076 3745 -12465 -10278 6426 11988 -1785 -13069 -3978 10954 8259 -6696 -9395
659 -9395 3138 8600 61 -4633 -243 722 -1199 1367 1415 -4678 -5051 3560 5361 -3797 -6833 -57
675e7L268k452j075k98n95J168J692Q5j668j045P19J985j44l759q49N302J185
692C462o481p43N787k10m182J520L165k074j582L245J97l613J547L115j746j859
708d52J105J06j269N22J474j082k715O48L121K68l377k169M015M652l714n675
724d542L314N605j810m882J032L877r07l158J4J220K05N53o88k346k4K872J196
741A531k658j872K966K303k246j966J288K254P1j961l21J400m43j240L82J099
757E87o32j583O34J776j058j974J398K027k31j090l83M36R04J207l71k633J6L390
775B420J7l698p57K905J221k011j831R11R03l1L4J14k12j88L78J273k9k162K32
794e11K816J78l152j226K310J395j772j378N58K33M00N23j312j140J237K269k89
$$ plain form
675 -57 3211 759 -316 -614 -1209 -41 1651 1736 68 -977 -258 1727 1583 -2176 -3025 2277 3462
692 3462 -3019 -3762 2025 1815 -2367 -847 2318 244 -1338 1907 2104 -1509 38 3153 1407 -452
708 -452 653 759 -510 12 1486 404 -2311 -1663 1458 1726 -1651 -3820 195 4847 1133 -4542
724 -4542 -1228 4377 2567 -2315 -1283 2594 1687 -1471 -1457 -237 -32 521 -167 -2513 -2537 335 1531
741 1531 -1127 -2999 -33 2270 24 -1942 -654 1600 1671 -290 -611 789 346 -894 -512 587
757 587 -45 -1628 -994 782 -276 -2250 -852 1175 944 -146 -529 -93 811 2018 1647 -986 -970 2420
775 2420 2437 -1261 -2018 887 2108 97 -1734 -823 80 49 83 197 -15 -203 175 1448 1419 -743 -511
794 -511 2305 2483 -669 -1895 415 1810 38 -1340 -782 -549 -149 374 -938 -2078 -841 1428 1139
811A139k986n65L679J592k674k510J640L107r47l567n4L006N07j916j471M56J127
828d37P27q9j565n71K626J650k815j780K413K637j199k604L08J845n2q85k88m58
846e37J03P50R5j001j256J052K283j12k443m43K291J404j309j531J144R87m65
863A012o6l88j342P2J905O44k931j668K798J929k461j330J700Q27r28K1J052n80
881B66j717J673K398j434l457M80L605J012m251k032L169K121k169j617O69M98
897g86R0J799J25l802n54N502J705m890k639L437L194j698k566l78J149J466L47
914A501k416j835J439K635N22k638k064K351L318j549l093J305K989j531j905
929i71K535R37m514k33N746Jo632r64O525J161n747j304M505J001l075K83K369
$$ plain form
811 1139 -1847 -2412 1267 2859 185 -2325 -685 2422 1475 -2092 -2146 860 1367 -549 -2020 -1564 -437
828 -437 290 201 -1364 -1935 691 2341 -474 -2254 159 2796 1597 -1007 -699 1146 1094 209 -79 -537
846 -537 -434 316 411 -590 -1846 -794 1489 1377 -1066 -1509 782 2186 877 -654 490 1477 1012
863 1012 946 558 -784 -712 1193 1837 -1094 -2762 36 1965 -496 -1826 -126 701 -227 -206 846 266
881 266 -1451 222 2620 1186 -2271 -1791 1814 2826 -1425 -3457 -288 1833 -336 -1953 -1284 -786
897 -786 -696 1103 1228 -2574 -3128 2374 4079 -811 -3450 -13 3181 1483 -1083 -1461 -312 1154 1501
914 1501 -915 -2750 -1311 1324 1846 -792 -2856 -505 2813 1264 -1829 -524 2465 934 -971
929 -971 1564 2501 -2013 -2246 3500 3501 -3131 -4095 2430 3591 -2156 -3460 1045 2046 -1029 -746 1623
946A623j188k783K507M490k669o589J730P561L7p738k646O701L555m819l767K188
962a807K233K75K12j261k886J185N431L06o216j482N254K510k227k913j508J521
978a373M301R86o227m285O027O588m439p268J345P399K023o331l941N303M550
993D658m288k833M739O35o574J263R090l256j0783L780J0891m211r791L491Q557
1008E368k933p077K652N801j672m750J217M977o32o126P35P673j082r208N17R316
1024D776k66q245M5N294p01k141J950q35k919K695L895k655l947J380L277N72
1040B175q13k004k492K129M763q72o188j868N631M928m434p500K455Q992l33r145
1056d576j039R000J910p991r08O415p79m943L598M574o338o189Q006P529q175
$$ plain form
946 1623 435 -2348 159 4649 1980 -4609 -2879 4682 4719 -3019 -5665 1036 4591 -228 -3995 -1807
962 -1807 426 701 913 -348 -3234 -2049 3382 3688 -2528 -4010 1244 3754 1527 -1386 -2894 -1373
978 -1373 2928 3914 -2313 -6598 -571 6017 1578 -5690 -4345 3054 5077 -1254 -5195 108 4658
993 4658 370 -2463 2276 2911 -3663 -2400 6690 3434 -7349 -3569 7322 3111 -6680 -3189 5368
1008 5368 2435 -4642 -1990 3811 2139 -2611 -1394 3583 2951 -3175 -2440 5233 4151 -5057 -4540 4776
1024 4776 4510 -3735 -3690 1604 903 -1238 712 -123 -3042 -347 3548 893 -3054 -1674 1603 2175
1040 2175 1362 -642 -3134 -1005 3758 2886 -3302 -5170 461 5389 955 -6545 -4090 4902 4569 -4576
1056 -4576 -5615 3385 5295 -2696 -3604 2811 2032 -2911 687 5261 -1077 -7266 740 8269 94
1071I4q392P004P896n487o929M203O482l394n340L128M830k736m313K504M261
1086C811k874m062L928L304n179l158N661K729o098j876N454N58m718J177L588
1101B245k216j948K942J021k902l34K438l38j552J201P86k375j569K413K956j781
1117I87n051O43O395J40o749N1O564o90n663K211N390l871m500N054L561n933
1133a461k479N940J848o134k009N637K268n114k324M318K362l483k177L972K061
1148C225m473j145M912L60m982L44N313j458n421J735N144k479m849K798M041
1163C065k674l463K624K979k538j893K814J072k930j53L222j86l772K49M066l74
1179B108m455M87L894q86l735J104L688j314l936J748L610j945k886K678K471
$$ plain form
1071 94 -8298 -1294 6602 1115 -5814 -1611 4871 1477 -3863 -735 4095 1359 -2954 -450 3811
1086 3811 937 -3125 803 4107 -1072 -4230 1431 4160 -1938 -3814 1640 2198 -2520 -1343 2245
1101 2245 29 -1919 1023 2044 -858 -1192 1246 908 -644 557 1343 -1032 -2601 -188 2768 987
1117 987 -4064 -3421 2974 3114 -3635 -3584 2980 2290 -3373 -1162 4228 357 -4143 911 4472 -1461
1133 -1461 -3940 2000 3848 -2286 -4295 1342 3610 -1504 -3828 490 2852 -631 -2808 1164 3225
1148 3225 -1248 -2393 2519 2879 -2103 -1759 3554 2096 -3325 -1590 3554 1075 -3774 -976 3065
1163 3065 391 -3072 -448 2531 -7 -1900 914 1986 -944 -1097 2125 1939 -1833 -1584 2482 2108
1179 2108 -2347 -1860 2034 1148 -2587 -1483 2205 891 -3045 -1297 2313 368 -2518 160 2631
1194B631l328j969M130J810m675j427M557N76m249l49L840l66l695J048L337j187
1210F84l423J507L688j123l842J211M215j141m283J721L722k154l119K429K722
1225B814l298k378L636J772l937j061L717P89l358l92L019K80k733M19K614p73
1241A130k331Q31K604j230l037J263K975j741k944J967K555k131k170K338J748
1256A827k685r74K936M39k702P4K642k21k537L1K770n53k845Q15K351j105k412
1273b149J394K323j816k253K025K595k186k218K185K105j869j800K152J453k195
1288b54j121K443K44k446k26K418J0k815L24K898n82k633P21K599o70k131Q99
1305c22K095r32j933J331J509j582j251J348J265j525j447J549J266j738j264
$$ plain form
1194 2631 -697 -2666 1464 3274 -1401 -2828 1729 2305 -1944 -2293 1547 1181 -2514 -1466 1871 684
1210 684 -2739 -1232 2456 1333 -2509 -1298 2917 1776 -2507 -786 2936 782 -2337 92 2814
1225 2814 -484 -2862 774 2546 -1391 -2452 1265 2054 -1304 -1696 1323 1603 -1130 -711 1903 1130
1241 1130 -1201 -370 2234 1004 -2033 -770 2205 464 -2480 -513 2042 -89 -2259 79 1827
1256 1827 -858 -1832 1104 1543 -1159 -1085 1557 1336 -1201 -1170 1600 1047 -1798 -983 1368 263 -2149
1273 -2149 -755 1568 -248 -2501 -476 2119 -67 -2285 -100 2005 136 -1664 488 1941 -254
1288 -254 -1375 1068 1312 -1134 -1360 1058 1068 -1747 -1423 1475 893 -1740 -1019 1580 910 -1221 -322
1305 -322 1773 841 -1092 239 1748 166 -1085 263 1528 3 -1444 105 1371 -367 -1631
1320a631J712J064j521o90J536N65j586L0J538k63j258L35J273q85j253Q14J351
1337A131j365r91J131P10j039p16J182O17j225k66J310K68j400K9J676k23j532
1354g03J51J745o48j804N96J770r18j732Q16J727q93j656J148J690j068j407J068
1371a18J604j078j367J065J274r49j080Q91M56o33o77N96O69r28n79R75L65p18
1389b32o19R46N28l06o37N86J22k20J15K25m96k68O98J29j063j53J075j71j013
1408g54M3R30k16n31K11O82m34m69O30M53k93p67K81J071k29j210j70J426k05
1427D49j368L71Q75m57q17O73Q47p42o44O99O49k30l17l85N89N91m62q17M47O71
1447F22k59q47J60N59k68l02O6J28OJ71J66j20j9n0J98L23J40n94o17P71Q49p69
$$ plain form
1320 -1631 81 1145 -376 -1066 470 1035 -551 -521 1017 754 -504 -169 1104 219 -1034 -220 1131
1337 1131 -234 -1225 -94 616 -423 -1139 43 660 -565 -831 479 747 -653 -624 1052 829 -703
1354 -703 -552 1193 545 -1259 -663 1107 189 -1543 -727 1000 107 -1549 -401 1289 221 -1186 -118
1371 -118 1486 408 -959 106 1380 431 -649 242 698 65 -612 -16 653 -275 -854 121 486 -232
1389 -232 -851 95 623 317 -320 266 388 168 283 508 12 -256 442 571 -492 -645 430 259 -754
1408 -754 -711 219 3 -528 -317 365 -69 -538 92 545 252 -515 -234 837 608 -602 -772 654 449
1427 449 -919 -548 327 -130 -947 -274 573 -169 -813 -114 535 305 -12 -397 192 783 321 -496 -49 622
1447 622 363 -484 -324 235 -33 -335 -269 -141 -135 36 202 82 63 13 211 534 674 80 -537 234 1083 314
1469C14j155O34J000n36j147M64R16k83q55L69M33r9j71m1M43J55n05q5N84K98
1489G33j102l89J347M31j961k04J418M51j401l15Q79K78k60k34L10J79p9m92K86
1508a25J126l39j648M93J700o64j544N21J089p16p69Q04L82o25j18L61J36L48
1526D12l07n12O05Q05p57r06J084P72j342r09J528N30j381k60O84K35l49l61J5
1545d14N99J88l39m53P11L83j019J9J274k44j376K81J178k60j284J37J085j67
1563B99p72l48O90O17o26o33P79N28l97m81M00N87o32m95P30P46j039q10P02O59
1583E04n78n17M63L24m78l11N98L23l64l06J97N01P5m76k52O23M16q47j86O38
1603C47J08r50J12P45l20m59L58K75k95J76k62L2L35M30o95k96P98O4p71L07O69
$$ plain form
1469 314 -841 -207 793 257 -890 -426 490 207 -648 -279 154 55 -116 -157 286 441 -64 -149 435 733
1489 733 -369 -758 589 1020 -941 -1145 273 724 -677 -992 -113 165 -95 -329 -19 160 81 -411 -125
1508 -125 1001 662 -986 -493 1207 543 -1001 -480 609 -107 -876 -72 310 -315 -433 -72 64 412
1526 412 105 -407 198 1003 246 -660 424 1196 -146 -1055 473 1003 -378 -638 46 281 -68 -429 -414
1545 -414 185 373 34 -419 292 675 -344 -325 949 705 -671 -390 788 528 -756 -619 466 299
1563 299 -473 -821 -131 486 -140 -773 6 534 137 -344 56 643 11 -484 246 992 -47 -857 -155 504
1583 504 -74 -591 -128 196 -282 -593 5 328 -36 -342 -145 356 431 -45 -297 326 742 -105 -291 347
1603 347 455 -495 -383 362 42 -417 -59 216 -79 97 -165 -133 202 632 -63 -359 439 503 -268 39 708
1624G08n53q81N72Q06o32n07J99J81M7R9k99P0N85k96m57M93M96q26j72Q33J60
1645F26j035MP38j34n18J6J84P1j41k7N1J51j38k80M92L56k13n14L48L32k96j72
1667i9L64n9l28J32J18j31r8J6p1j5J57j05r8K16J71J9j64J33J04K24k55m08M06
1690B29J1k62o8L14p5n09J19N06k37k84n2M30j3k49m6K67L33m39r1J33M14n01
1712g0k18M34J38m36j32K91M1l64M8K42j32m9K3J21J35j95Q0N6J47J1j93J58m
1735A32j59k9P2Ok47K28m0j81J08J82k91O5J91M8j41o3L97m2Jj49k2J82m6k64
1759f2J19J4J32m03R1K47j74j49K33k3q5j19K25Q4K4j01J26L6k8j72N0J2J17l07
1783a13P4L3n9j02K8N9o7pl8J87M5K5j0R8j52J63o0j03m7J15K1j98P6J41q0l58
$$ plain form
1624 708 155 -726 -154 652 20 -487 -288 -107 -60 39 -260 -190 395 99 -358 135 631 -195 -367 466 626
1645 626 -409 -405 333 199 -319 -303 -119 -48 -189 -216 -165 -14 -152 -432 60 416 203 -311 37 369 73 -99
1667 -99 265 206 -122 10 128 -3 -101 -85 -156 -171 -14 -119 -217 -1 170 189 25 158 262 486 231 -177 229
1690 229 240 -22 -90 224 149 -360 -241 265 28 -256 -308 122 109 -140 -186 81 414 -25 -116 17 431 -70
1712 -70 -288 146 284 -152 -284 7 48 -316 -268 -26 -158 -207 -184 -63 72 -123 -43 13 160 171 -22 136 132
1735 132 -27 -56 16 22 -225 3 -37 -218 -110 72 -219 -154 37 85 -56 -119 278 236 237 88 66 248 202 -62
1759 -62 57 71 203 -200 -109 138 -36 -185 48 25 -60 -179 46 130 154 53 179 215 187 15 65 77 194 -113
1783 -113 -39 -6 -65 -167 -139 -80 -147 -154 -192 -5 40 65 55 153 1 164 104 1 -46 69 90 -108 -32 109 29 -329
1809c29J36K12M4k78RK78J58l54J63J62m8k01j48L13J71l06j28K78N4j85k73L15
1831D3O0j72k32L43J52j15l13L09J40o9j76J85J99k55j64J40K10j45l65K74J5
1852F4j67l8o6Q4K02k16oJ01J33j45J03JJ59m2l10L5J72m6j43R0J03n8l24Q3K95
1877F4J08m00n9J70L76l61q7K78J56k66l4P7M50m21l16L92J15k10l07J62J57j03
1899e9k58K23K40r4q3P9J90j13m3m6J98j33q5J36r0J58k17j73K36K8j44n6P1k
1923c7o7L6j5J49J34k43m7J73J46N1m75K59J73k29l42K43L33l25k59K13J88k28
1945a69p0J58K67j83j41K30K30q8n17J99M01m9n58J71K23n3k53R3J85j98l6j31
1967b89L30P2k79J23J18%j1k12K01K39k01r3R0J22j72k41J96J14p0o9n4Q9J05
$$ plain form
1809 -329 -193 19 63 -215 -206 72 230 -124 39 201 153 -48 -196 117 288 -18 -146 132 186 1 -272 43
1831 43 103 -69 -301 42 194 79 -234 75 215 146 -30 155 354 99 -65 75 285 140 -225 49 64
1852 64 -103 -141 -207 -123 79 -137 -143 -42 91 -54 49 50 209 167 -143 -108 64 18 -125 -35 68 10 -314 -231 64
1877 64 172 -228 -287 -117 259 -102 -189 89 245 -21 -55 22 472 51 -265 127 242 32 -275 -113 44 -59
1899 -59 -317 -94 146 52 -31 48 238 125 82 36 234 101 16 152 62 220 3 -170 66 94 -50 -106 -35 -37
1923 -37 -104 -68 -83 66 200 -43 -90 83 229 280 -195 64 237 8 -334 -91 242 -83 -342 -129 59 -169
1945 -169 -239 -81 186 3 -138 92 322 234 -283 -84 317 268 -290 -119 104 51 -202 -109 76 -122 -158 -289
1967 -289 41 113 -166 -43 75 75 64 -148 53 292 91 -2 88 210 38 -203 -7 107 37 -32 -86 3 108
1990A08j99j87L87J44l11J3Q8K88k28l26K79K98m31j25J76K38k72j95K76J18k38
2011i9j81J40K89j12k53R4M72k24l73K35K50j18m57K04M48j53n11J24L92k84j74
2032b91K92K1k02O9M5J81mj05k57L29K36k59j92K08O5j73J80P9k67j05J16l7o2
2055a33K08j74k50L35K45j37l47L49P2l35Q2L19j4k74j08K21J43j54j64l0K04
2076E8o2k54R0L75k57l85L12M72l06k90M65K2l61M4L31O3l40k16J75K00l09l8
2098b11K26j1l1j92J55M2j9j77L32J3k31J84j5p1J69o1m5j08k7J13J68l28j01
2121b26K18J34j56q2K16o0l22K00M91k92k14J66K09j79k30J06K27k15j79K6M30
2142B68l09k10K07K51k04l17K64J19q0k35L29K02m31j6M68k9m12J01J13m9j83
$$ plain form
1990 108 -91 -278 109 253 -58 -45 43 331 103 -223 56 354 -77 -202 -26 212 -60 -255 21 139 -99
2011 -99 -280 -140 149 37 -216 -122 350 126 -247 -12 238 120 -337 -133 315 162 -349 -225 167 -117 -291
2032 -291 1 22 -180 -111 -66 115 111 6 -251 78 314 55 -137 71 136 -37 143 222 -45 -150 -34 -71 -133
2055 -133 75 -99 -349 -14 231 94 -253 96 168 -167 -85 234 220 -54 -162 59 202 48 -116 -146 58
2076 58 -4 -258 -168 207 -50 -435 -123 349 43 -247 218 240 -121 -77 254 317 -23 -239 -64 136 -173 -211
2098 -211 15 4 -27 -219 -64 -22 -41 -218 114 127 -104 80 65 -6 163 102 57 -51 -78 35 203 -125 -226
2121 -226 -8 126 -30 -112 104 44 -278 -78 413 121 -93 73 282 103 -127 -21 206 -9 -188 -162 268
2142 268 -41 -251 -44 207 3 -314 -50 69 -11 -246 83 285 -146 -162 306 277 -135 -34 79 30 -153
2163a53J93L4k23k5J4R4jq4M7J34L7j36J7K11j01k03K95J94n43K8M50j17m39O9
2187b08L73j90j52J14K07j90j14K39J28j43k30K08K48n8m49J56K98j21m15L43
2207D4J26k35k00K86J45l67P8K14L6k25J16J11l5o8m7J77j7j14n9K49j97k00J15
2230f7J47k09n8J97L9j96n4K77P5l57K37L00j56j79K7L16k55l23K84J30p2m11
2252c08J58K52j05l61K44L72l39j47L06J57k26q2J10K87l71j38K84l5r4p6J31
2273A9J24k21k8J78k7j55k6J45R3k13N1J23R4k07J39P3j44p2K46Qk60p4K75j03
2297C8k02L6J37m1k35K19J68nj19o9L29j39k17R1K94k00j84J20K37k73j68J78
2319eR7k38r5J93J73j90j40R6J54q7r6K12J90j99k45J84J93l03K7J09P6k25M4
$$ plain form
2163 -153 40 74 -149 -174 -160 -66 -67 -151 -104 30 67 -69 -52 159 58 -145 150 344 -199 -171 279 162 -277 -208
2187 -208 165 -25 -177 -63 144 -46 -160 79 207 64 -166 42 290 232 -217 -61 237 116 -299 44
2207 44 170 -65 -265 21 166 -201 -123 91 127 -98 18 129 94 26 -21 156 139 25 -34 215 18 -182 -67
2230 -67 80 -129 -187 10 49 -147 -201 76 151 -206 31 331 175 -4 23 339 84 -239 45 175 103 -308
2252 -308 -150 102 -3 -364 -120 252 -87 -234 72 229 3 -79 31 318 -53 -191 93 58 -36 -112 19
2273 19 143 -78 -106 72 45 -110 -136 9 102 -111 -60 63 157 -50 89 162 18 -54 192 200 -60 -134 141 38
2297 38 -164 -128 9 -32 -267 -48 120 115 -4 -73 256 117 -100 -9 285 85 -99 21 258 -15 -183 -5
2319 -5 92 -146 -241 -48 125 -65 -205 -109 45 -42 -138 74 264 65 -180 4 197 -106 -79 30 106 -119 -75
2342g5O3Nj35J69J17l55K8L06j01j79P9J81O8k20O6J71j9l55J42J96l2k63R0O
2366d7O4k33K21J51j48j42R2L26k50k17Q9L28j19k00R1J86j41j69J21kO1m7J0
2389B5kn7kM0k0q9R8R1r5n1J63m3l6m0M5N8j01l9N1m3m7M5J66r6j67J98Oq7j21
2418a50J00N4L7j09OK35n2j56J14M2Kl37J38K25m7k45R3O6J9k48J19J72m3j66
2442a31J08J69j03r7R4l2O0j5j14M7M9K7r2n3J2m6K2J14O3q8J28j22L2%m5q2J31
2469C6j0jj17Q3j4j04m6J49k0L3N0O6o0Q9j69J47Rk00J51l9J14j83r7J95J52l17
2495a03M5P9q5N5r7J53l1rk9L1Q2k5k3nl1J32k35J52k6P8r7n4K54r5j21q4Q3k9
2523c5n5L7P8m4P5k6J04j44J7R7J2j11n9J9j7J88l02N9O6R8j28J8j6O7r4QR6J42
$$ plain form
2342 -75 -12 -7 -142 27 144 -211 -183 123 22 -157 -78 103 171 -49 17 188 169 -186 -44 152 120 -143 -53 -47
2366 -47 17 -216 5 156 8 -134 -42 284 34 -183 -94 234 115 -85 6 192 51 -118 3 1 62 15 25
2389 25 23 -34 -36 4 -16 -105 -7 84 -11 -62 101 58 22 -18 27 85 -16 -55 -4 -47 -94 -49 117 21 -146 52 58 -29 -150
2418 -150 -50 4 41 -68 -62 173 121 -35 79 121 123 -214 -76 149 102 -143 -50 16 35 -213 -94 78 35 -131
2442 -131 -23 146 43 -54 40 8 68 53 -61 -14 35 62 -30 -83 -71 -117 -95 19 82 -6 122 0 32 32 -13 -95 36
2469 36 26 25 -92 -9 -23 -127 -173 -24 -44 -11 39 105 45 134 -35 112 121 -79 72 33 147 -36 -133 62 214 -103
2495 -103 -58 21 -64 -9 -106 47 16 7 -22 9 91 66 43 38 7 139 -96 56 30 108 11 -43 211 116 -5 -89 -6 -35
2523 -35 -90 -53 25 -19 56 30 134 -10 7 104 116 5 -54 -35 -52 136 -166 -107 -41 57 -71 -53 -69 -2 -96 -88 8 150
2551A50j45Qk6R4j20M4l0Q5j07K5n0P2l5n9J37N2p5j50J71p2p4P0N2o0Q2Jk5J3
2579B8n5J1M9L0k2k11L19q6k3j62Q1Q0j04R3l8POQo2N6K6J05j26K2L8q6O3J3k4
2608C6K1J2n5m2o5N9kN2m6j5R9j0K0o0o5J54r4j43K45j16n7k6J04qO3m3r6l8J8
2637i8j1O0J20J1j40k7O8m5N1J6M8m4l5m0l6jJ22p1n9J53j12O0N1k0k2p4K02n0
2665G7r0J6q1K59j61m3J3L0k9OJp5Kl0K8J45j28J1k6J00K0j46P0J29r5nl1%J00
2694F7l8j45J86r3j2n6M2N3j82J18l8P2n8k2J86m7Lq4P5J8k6l4p9J44m1m8L1P7
2722F9j20n4J3J08j6j00J56nn7nM9P5L0l4j24k0L0j8M1K5L7L2j55P5P6m7J3j32
2750e8O3K6o6r8J28J78k56LJ82p7j51j1Q8J46Nj41M1J01j36n1J31K2p2L7K0M3
$$ plain form
2551 150 5 13 -13 81 -39 5 -25 60 -47 -22 -72 0 -35 -94 43 95 20 -130 41 -31 -105 -35 17 -43 39 40 15 28
2579 28 -27 -16 33 63 41 -170 149 63 40 -122 -41 39 -65 28 -10 -3 3 11 -51 5 31 136 10 32 70 -16 47 60 36
2608 36 57 69 14 -28 -93 -34 -36 16 -30 -45 54 44 64 4 -61 93 -1 -144 101 -15 -72 -98 6 -2 61 18 -78 -116 -98
2637 -98 -109 -49 71 82 -58 -85 -17 -62 -11 5 53 9 -26 -66 -102 -103 19 -52 -111 42 -70 -10 41 21 -1 -75 127 77
2665 77 -13 3 -78 181 20 -23 -10 20 -9 -3 -2 -77 -75 -105 -77 68 -60 -49 -75 25 45 -101 -31 98 3 -2 -33 -33 67
2694 67 29 -116 70 -23 -35 -91 -49 4 -178 -60 -98 -26 -84 -106 80 33 36 -48 27 45 19 -15 -94 50 9 -39 -8 69
2722 69 -51 -105 -92 16 0 -100 56 51 -6 -11 38 113 143 109 -15 -35 -5 -23 18 43 80 112 -43 32 108 61 74 -58
2750 -58 5 31 -35 -133 -5 173 -83 -80 102 25 -126 -137 -49 97 102 -39 2 103 -33 -84 47 69 -3 34 54 97
2776I7j46k0N9J3p8J50m4qq3N8o9Q6K3q9RK0O3j8L9J8j08J02j26J16m2j2l6O3
2804C7K3lj35J8M0J01j27nM1L4n8oJ7Rj1Q0L2L1n5j26QQ2j2QL2n8l6J5n1Q4j16
2835a07J24rm1Q6o7Q6j37L6k1L6j9Q6j22Jk7J32Ok3p1j2K9l0O5QJ1J4q2J10q4
2864b2PoJ03o8L0k4n0J55j68l7K7L9Ol8qM7J1n1O9%Rq3J42k1q5L1RO6r5k0J07
2895H2q0rj7M1j0K9q4Q8j6p4k7kO0K2J6Q4j19N8k3l4P8k3q7k0j3J34K5j86R1J59
2925A43j26j20J24O1J0j07q7J00nn3Q0p4J11j92P0P9j3j0j7J13l3P9j83O5k3m2
2951e0N1M1n7LJJ72j99O7Q4p0O9j54RJ62n2o2p5P1K3K8r0m6K1J01N3j09RN3j21
2980f7R8M5m7q3j8Q4m5J8J8K1J6O4l9j20J24l2n1R8K2m6l2lo1Ok5O9j37P8J1l1
$$ plain form
2776 97 -49 -69 -10 3 -75 75 31 23 -60 -2 -71 15 38 -51 -42 -22 41 23 62 80 -28 74 -52 64 22 10 -26 37
2804 37 60 57 -78 -60 -20 81 -46 -51 -10 24 -34 -40 -23 -14 -25 55 87 118 63 -63 -55 27 15 23 55 -3 -39 -24 -75 9 -107
2835 -107 17 8 -33 53 -14 72 -65 -29 -50 -14 -33 53 -69 -68 -95 37 43 20 -51 -63 -34 -64 1 9 20 34 -48 62 -22
2864 -22 -15 -21 82 14 44 20 -30 125 -43 -80 -53 -14 -8 -46 -54 -7 4 -47 22 22 31 -52 90 69 -16 15 24 90 -5 -25 82
2895 82 2 -7 -24 17 7 36 -48 40 24 -50 -77 -79 -19 3 19 103 -16 42 19 -15 63 40 -47 -67 -80 54 79 -107 -16 143
2925 143 17 -103 21 82 92 -15 -102 -2 -7 -60 20 -54 57 -135 -65 14 1 -9 -26 87 54 133 -50 15 -8 -50
2951 -50 1 42 -15 -12 -11 161 -38 29 113 43 112 -42 -33 129 77 15 -60 11 34 62 -28 -74 -53 48 101 -8 1 54 -67
2980 -67 31 76 29 -54 -72 12 -33 -15 3 24 40 104 65 -55 69 37 -14 84 106 60 28 25 -36 -30 -55 14 -123 -45 -34 -65
3010f5J27j17J08p3J57j20J8j14J87m7p0q5J59J1n3j58K96j18n0L7j7P1qk1m7
3035HN7j13K3M6l9L4M3O5m2j04J50j38N6l1n1l4J17j34Q6j1l2k3J7J00j03RJ00
3062E6q5Q1j27N1q9O6R8J1n5rq1OJ70r5n3n7J06n7Q2j00J01k2M2j9J1r2R3N7j22
3091c2N9O7j9j05J38j93Q2Rp9P9nOn4M0J0o6R1K4K3o6L9Q4j87J27r3l8J05qo0
3120b2R3m7J3k6QK3L5j62K01j27M3j01rR7j7J4m4K5rP7q7o3J01J2n6K2q6K27j64
3149b9mmJ6N2q3oJ07M2k48J66N5o6L3L2j21M4P4n4J72k18M8N0j53K9l9J73%j63
3177i5O7kM6NJ8j20L9P7m9L1j18J16n9j17J52JjR7m7L7p3N7Q3k27o6J91qo3KM2
3207A6p7J07k8pl3P1p0k2N5LL5m3P4l0K6j35J03J4m0n6M6J0N0n2j7L7L9r0J7M3
$$ plain form
3010 -65 62 -55 53 -20 137 17 35 -79 108 61 -9 -94 65 76 23 -135 161 43 -7 30 13 84 76 55 8
3035 8 65 -48 -25 21 -18 16 59 124 82 -22 128 -10 46 15 -36 -70 47 -87 -1 -12 -44 -67 -50 50 -53 -44 56
3062 56 -29 52 -75 -24 -113 -47 51 62 7 -2 -83 -77 93 -2 -55 -112 -6 -63 19 -81 20 -2 40 21 32 -60 33 90 -32
3091 -32 27 94 75 -30 108 -85 -3 6 -73 6 1 7 -47 -7 3 -63 28 52 75 9 48 132 -55 72 -21 -59 46 38 -22
3120 -22 71 24 37 11 19 42 77 -85 116 -11 32 -69 -78 19 2 16 -28 -3 -12 65 -22 -85 16 28 -28 -6 -92 135 -29
3149 -29 -33 -37 -21 31 -52 -58 49 91 -157 9 64 -2 31 63 -58 -14 60 6 178 -40 8 58 -95 -66 -105 68 68 -95
3177 -95 -28 -30 16 21 39 -81 -42 35 -14 17 -101 15 -44 -161 -9 -8 -9 88 41 78 5 62 145 -82 -148 43 35 -28 -26 16
3207 16 -61 46 18 11 -22 49 -21 -43 12 15 50 7 81 51 77 -58 45 59 19 -37 9 19 69 17 0 37 76 -14 3 46
3237D6j0n8n4J35j5p8n0N4J56j43J6N2k4n7qk0N5J2o7J10l0O5m7jk8n5K9O1k8
3266A8l1M1L2J3j45J34q6j1P3jJ1r1R2j8o8J11r0k4J00K1m6L0Rj58J1P7Qj67K12
3295E7pj1l9m0N3l3K8qo4J21m2J01j67o3R3K6P8q9l5J00nn1K2q7J50j79L9M8K7
3324B3o0M9o7l5J55k1J0j95P5J29o6N0k13K12M5j29R3n9j02P0K6p9M8K1J8J4M4
3351E6k08J33j2l3J6O9J3k8K7Np4R5m3J1q7J5j05J49M5n3Q0l8q8R1Q5j20R2j40
3379d7R3p7J06l6q4J11lj25P0O1m5l7Qk8N8Rq0J10k3q8J23J7j61N2J35p6q5P4
3407C2r5L4N4j86L54K5l19m9K0J24K16n37L32m1p9K50N3Q1l07j1K5j5j83K07L9
3432B4n7MJ04j50n1J72p4o4K7J4l4J11r2K10q3j22j03J49L8j22J1P2O2n5n2J10
$$ plain form
3237 46 36 -22 -76 59 44 -34 -84 -30 126 -17 -1 51 27 -30 -38 -58 -3 9 -58 52 22 87 40 39 11 -44 -15 46 18
3266 18 -13 28 60 73 -72 62 -24 -35 38 37 48 -43 49 31 -37 74 -16 -40 60 81 35 65 74 -84 -73 4 12 -155 57
3295 57 50 39 0 -40 13 -20 8 0 -64 57 15 116 -51 -114 -21 5 83 -6 -41 59 54 3 25 -62 88 -91 -52 -4 23
3324 23 -37 12 -55 -90 65 44 54 -141 -66 63 -3 47 -166 46 91 -38 55 -4 -106 -36 -10 -89 -41 -20 -2 12 56
3351 56 -152 -19 -31 -64 -48 21 34 6 33 38 -36 59 16 27 -60 -45 -150 -1 44 -9 71 33 -55 36 121 1 93 -47
3379 -47 46 -31 75 39 -45 66 63 -62 8 69 24 -13 -5 -33 25 34 -46 64 41 -47 76 93 -68 -16 119 43 -42 32
3407 32 -63 -29 25 -161 193 218 -101 -150 -130 -6 210 -327 5 -36 -115 135 188 269 -38 -49 -24 -39 -222 -15 24
3432 24 -33 -29 75 -75 -126 46 -28 -92 -65 -51 -85 26 -66 144 61 -61 -164 -15 23 -99 -88 -16 46 -9 -61 49
3458D9k1J16k31P3k2J27j08r0J72r5J8l9L8M1n1lqN2K3q5LJ58j9r2p7k4N7lJ20
3487G9j17J16Mj13J03Lo5j9K4l3j31O8Q0l7J16j39p3N5JK28j29K5q5o6J41P7q9
3514B4r4N6pP5o4K2%N0m6l1n8L0M3l4J18J05k28O2K0p3Q2l9Ml3q4J75j36nJ0M5
3544a1o4J18j29J11L2jp5l7R1o5oj5M4pL3m0OO0L3j03m9K18m2l5k48J21k4Q3j9
3573b0k5P2Jj14J44N4o7j15P2n3J77m9j78N3k6l0O9o6o0J56n5l5N3JO3M3l6p0
3601d1Mk6J5J08j5P2j16M1q8mN6N2j21M0R1j03L9K8q4l2P9J07o6q9L9l5N8J5l5
3630a1j26J94p0o8j7K8O5P3k3n2L7o7J50p3j04P5j12J88j35lO2n0R8r6P3n1J45
3657A30j95J2Q3P4j23M0J33j12n4R0q9P3o8l6PK8m7J12p7l4R0m0l2j4m6R7L6j1
$$ plain form
3458 49 28 144 -87 -14 -36 91 -17 -107 65 -30 -12 -51 -13 28 -23 -26 -34 18 41 -44 -41 117 98 6 -71 -95 -38 -41 79
3487 79 -38 78 82 -31 72 75 10 -9 15 -18 -149 -81 -1 -38 78 -61 -134 -79 -78 150 21 46 -39 -105 36 113 24
3514 24 -70 -14 -21 54 -10 12 12 62 16 -15 -73 -43 0 -34 84 189 -39 23 43 -30 52 13 17 -16 -100 75 -61 -66 -56 -11
3544 -11 -75 43 -86 25 57 56 -19 -56 35 -30 -36 -51 -7 -14 19 -21 -15 45 78 -25 -74 144 102 67 -181 -60 -84 -1 -20
3573 -20 -45 27 28 -86 58 112 45 -70 2 -51 126 77 -101 -48 -74 -104 -35 -101 -161 -5 -60 -95 -42 -41 22 65 29 -41
3601 -41 -37 -63 -48 60 45 117 1 42 -46 -50 6 58 -63 -23 68 -35 4 32 -52 -84 -5 102 36 -53 -14 -49 9 24 -11
3630 -11 -137 57 -13 -81 -98 -70 -5 68 45 -7 30 -37 113 40 -64 11 -101 87 -48 -51 11 -39 59 -37 36 -15 130
3657 130 -65 -53 30 104 -19 21 154 42 -12 78 -11 62 -6 -42 -35 -7 -54 58 -19 -53 37 -3 -35 -49 -95 2 38 27
3685B7J7%K4j94J05L5O0j09j5K1K4J2l9P6o4O4m8j12J10p0k7J14J49j00k1l5k0
3712a6J38r5j22k5J07P9K6j70jR2l3P0j76MJ12r5K6J8P6n2O8K0j08M9PN0j11R3
3740C1p6kl3R9p5M9j1N5L4q0k5m4Q4J24o0p9R2k8j00J05m4O5j70L6PJ0M4Lj21
3769a10L9M6Q1p5j0N1m7p8J52Rj23J9M8J0j22K41m9m1q8m0M6K6n0m5J24m7LQ6
3797E6j24O3N7p8P4PL1m9j47P2N2LoJ6jP6k41R6mk9k7J29Rk3rp4J17N2j03j47
3827a52P8N4N3Noj6J6K0o4J31j7j6Rq9j20J71l1j07O3J12q0nP8j11k9o7J53L7
3855G0L0j84nJ55j59J64l9p9Q3o9N9L6q9Ql6N8N2j15J41o7p6K1LL2r0J51j4j92
3883a51J12N1q7J31J5m6LP9j19Q3J4q4m1n7K0p8J38j41N8J25q1J19j47L7L1O6
$$ plain form
3685 27 44 44 68 -126 -21 14 74 -35 -50 -29 -5 7 -32 44 -20 44 -4 -116 -6 -76 -103 11 160 60 39 4 -16
3712 -16 122 27 -95 -120 -13 66 92 -78 -79 13 -20 50 -126 -122 -10 -105 -79 -61 15 -37 31 51 -57 -8 -1 49 -62 31
3740 31 -45 -47 -80 19 -56 -7 -18 37 71 -9 -34 -78 6 130 70 -9 83 55 -45 60 16 81 -89 -53 -46 -36 8 11 -110
3769 -110 -71 -25 56 -19 -29 22 -25 -103 49 58 -65 -46 2 12 -110 131 82 41 -47 -87 -41 -15 -65 -110 14 -33 -30 56
3797 56 -68 -5 52 -26 48 55 86 37 -110 -38 14 17 11 27 26 102 -139 -43 -47 -76 -103 26 35 12 3 -71 46 98 -5 -152
3827 -152 -74 -20 33 38 32 16 32 52 -12 119 102 86 95 6 -114 57 26 -81 -18 94 14 9 87 -24 -53 -120 33 70
3855 70 100 -84 -89 66 -93 71 32 -47 36 -33 26 62 -27 -19 -55 3 55 -60 81 14 -62 -41 -38 -6 -96 55 41 -151
3883 -151 -39 12 -75 56 71 25 28 107 -12 71 85 1 -40 -97 -77 -155 -17 -158 -100 25 -56 63 -84 -47 -16 50
3909E0l0o2k8J29M3j06J71o9j37l7O1K6j4P2r8m4R7o5J07j37N6JN1j42J30j08
3935h3O3N1MK5l8J2r4N5M9M9j69K5MP6%q7K8m0l4J40M8j0r3l8r1J24jP6m4Q4j25
3966c4R7J8j29P6q2K14j56J42k17J09J3k2K4M3k3j23P1q5J08kn4j49J36N6r9k3
3992i1N4LM6m6R2q3P8J3J2k6P8j00k3M7j20P3OL6q3mL1j16J75k5j0P0q6j53J77
4021B5j9K6q8J02m5O5j27Q3Q8r9k5P1j25N0JPN5n7K5j8k2L7kL1J3m1o0J8J17M1
4051A27j61J61r5L1o1o6R6j06P4l2N9J6r4M0P6r5R8j1Lj46J07k9J6k3R6j58K8
4078d9k9K49j55K8K5l4R7j17L6l4J26j81J10M2j90J15j76J70J2K4p7J00j34q2
4102a24J32r1J64j60R0k3J8J31r8j8M0k0r4J00q7J11n4o7J84j46O1k3m5J10l5
$$ plain form
3909 50 20 -42 -70 59 102 -4 167 98 -39 -76 -15 11 -3 69 -29 -73 24 -41 66 -71 -15 -14 37 -105 25 -83
3935 -83 -20 31 35 60 22 34 -60 -5 44 93 -76 -51 -47 29 29 -58 -30 -70 -104 36 84 74 -19 -57 -148 -24 -25 51 7 91 -34
3966 -34 63 81 -48 28 -54 160 4 146 -71 38 51 29 53 96 73 -50 21 -64 44 42 -12 -161 -25 31 -68 -91
3992 -91 -37 -34 12 -34 58 -25 53 66 78 52 130 30 7 54 -66 7 13 49 -34 -38 -7 -123 52 27 17 87 1 -152 25
4021 25 6 32 -56 46 1 66 -61 22 110 11 -14 57 -68 -18 -17 -10 45 -12 13 -5 -27 10 8 39 52 11 -49 -31 86 127
4051 127 -34 127 32 63 2 -64 32 -74 0 -32 27 43 -51 -11 65 -30 68 57 60 -86 21 -8 8 -15 81 -77 -49
4078 -49 -78 171 16 44 69 35 132 15 51 17 143 -38 72 114 -76 39 -137 33 45 69 -8 92 -42 -124
4102 -124 8 -83 81 -79 11 -12 6 137 39 21 61 41 -53 47 -40 71 17 -50 134 -12 49 26 -19 91 56
4127E6m4j32J02N5L7p4J15k07M7j9J30q6K7J6q5J25j13J21j9k5k7m6L8J3J81r5
4153I1p7j6l1rN1O8J6j00m7Q8j1l5j09M8N1L7n2Q1lj10J79j60O7M1l4L4n4o4Q4
4182B4J1j19J28k9n0l6J01k8q3O8q7J22J5p6mj4R3N5q9jPQ3%r1p4J0P5k8Q3n2
4212A4j2j32J26L0JmN1j45j4l4J30p0M0K7n6K5l4Rl0J00r5o5J58j5N8k1o7oQ9
4241E8p3L4K7Mn6M5M5j65J7K6J20r4K1rj63J81J6j16L7M2K7Q6j02L4l3j06J19
4268B2K4M6n9J03r6M4q2j17J54m7m2qJQ1n8PK5k4K22j96m6L3J11j9j51J23lQ1
4296A29j82J46j28q7J63n9Q7m9o3LJ29q5j0N4k3k0j12J20N2j19J30j00Q0r1O0
4321B5j79J65J7J04q4k7N9j12O8j25K0J44j8p4J24r5N3n5Mm6J3o3J68p6j8o7P1
$$ plain form
4127 56 12 -120 -18 37 74 0 115 -92 -45 -64 66 -20 7 23 -62 63 -50 71 52 27 0 -46 -8 5 186 91
4153 91 14 -2 -33 -42 9 77 93 -7 -54 34 23 -12 -121 -73 -22 15 -37 44 41 -69 110 -50 17 58 24 58 4 -60 24
4182 24 35 -84 44 15 -35 -71 30 2 -81 -13 -100 22 37 -39 -43 -57 36 91 2 1 8 91 91 0 -74 -64 11 -17 66 14
4212 14 2 -130 -4 26 27 23 74 -71 -85 -119 11 -59 -19 8 -48 -23 -57 -48 -78 22 -73 -138 20 5 63 42 -25 -31 58
4241 58 -15 19 46 50 -6 39 84 -81 -64 -38 82 -12 9 0 -163 18 34 -82 -45 -3 24 110 8 42 9 -97 22
4268 22 46 92 33 136 40 84 2 -115 39 -8 -50 -58 -57 24 -34 -27 -2 -26 196 0 -46 -13 98 79 -72 51 48 129
4296 129 -53 93 -35 -122 41 -18 69 20 -43 -40 89 4 -6 48 25 5 -107 13 65 -54 76 -24 56 -35 25
4321 25 -154 11 28 132 48 21 80 -32 36 -89 -69 75 57 -17 107 12 65 10 14 -32 -19 -82 86 10 -8 -75 -4
4348dL7j34R0K1JqPn1JJ02m9J20j75N2O4K6k30R7J0P4r7M7l4n9K6J32o8jM4O5
4378A06j06Q1n2l4R4p4ll0K5J2q9R9j00K2P3k9M9k3J4n9j6J07l1Jj05PR6J5j26
4407g6J02o1n7k3P2K0L6j2m8Q3P4j73RL3K0M3q2n2J47j76J12j7P6K9M9n0q0N2
4435E0n6J06j88QRJ19j40O4J56k26J56j19K4N1M2r6J17%Jm8q6J09p5N7K0K6j63
4462h2P7J5m2Q2%LJ3o3K9P6j17O8l7Nj4M1j48M7M3QJ3r5kJ75m1L3j64O2O3l8o8
4493e8J9R4j3L4j00J13j00J7m4PrP8Rnj20J9K8p7J68q7O4P2j41J20j79K19j30
4520bK9p8M2N9j35O0N9P6j65Q8K9j5J5j32O5o4j2J30j57J78p0J03n0j77J85l6
4546B5j0l7jQ7l8j86J94l8l8l6M7K05r4j08j0R3l0r1K52k43M6o1L2J56j27R9L0
$$ plain form
4348 -4 33 -101 -11 10 11 3 10 -41 -40 62 13 133 -42 10 74 100 -130 -33 -23 51 -46 1 -33 -92 -66 66 -2 -3 41 106
4378 106 0 81 29 -5 89 15 12 -18 7 19 -70 29 -71 -49 24 -5 44 21 35 -24 -40 67 36 37 -68 -61 35 50 -76
4407 -76 26 -35 -92 -115 -43 -23 13 1 -47 36 110 -63 -54 -21 -1 42 -40 -92 55 -121 -9 -26 50 79 128 78 -2 50
4435 50 -6 100 -88 -80 -71 48 -92 -28 128 -98 58 -61 -37 14 56 -40 77 77 78 30 -56 53 -22 35 55 81 -82
4462 -82 -5 10 -32 50 50 53 66 3 32 108 -9 59 22 27 13 54 -94 -47 -4 4 17 -78 -80 95 54 87 -77 -15 48 10 -58
4493 -58 -39 55 42 76 -24 89 -11 6 -38 -31 -40 38 47 42 -78 -59 -31 -108 60 -27 37 109 -32 88 -91 128 -2
4520 -2 27 -51 -9 50 -85 -25 34 110 -55 33 62 47 62 -70 -5 -69 -81 49 -108 70 0 103 53 -124 61 25
4546 25 15 -22 -23 64 26 -160 34 -4 -42 -78 -31 174 80 -28 -38 55 25 -66 186 -57 -11 -72 -40 116 -11 88 118
4573A18j43q7K34j25rO1J8j2j45M7m4J35j02Q9J0L4p2n1P3j0r0j1J69r1P6j31
4599e9J41m6o6M8n8j2O3j16J44k4O1q3K3r0j7J20o2Q6j26Q3Q2J4q6m0O7J6j42
4626g9L5O3k0M3k0K1j9Mm6J77r1q3k0j2J00j16P1j6K3j5n7O2L5o1j8L7L7j02J01
4655C4q6M5o6J02j18J35J8j38J8M6L5OL9m7jk3k7jN3l5J42j22n2N3%Q9p2o2L1
4684dn6L2J00j31L4M5j3Nk1P1j51J21j09M1J18o1M8o9M0l2k0J31j95P4mp7R3N2
4712F2j31l2P6P0L7k3j2J3Lj42Q9m2J5R9oJ8l4j88J38n9J57j24o0K25j28l3m0
4739e2J14n6N8k6q0k3J57L0k13J54J3o4Jl0mQ0n2M1J04q5J7q8Nj0j9o0J20j04
4767g2J03q0l2N5J6J2m6R2k7O7j07L4n6J52l6l8Oj41J83j54l6J04k6O0m1rj8Q
$$ plain form
4573 118 -25 -112 122 -3 -12 49 67 55 -90 -43 -87 48 -54 35 45 79 7 -44 29 19 -71 -82 87 -4 72 -59
4599 -59 82 36 -30 18 -40 -52 11 -105 39 15 76 -7 16 -74 -91 29 -33 53 -73 10 92 106 20 -20 47 63 -79
4626 -79 -44 19 -1 42 22 43 24 28 -18 159 68 -15 -35 -47 53 -63 8 -8 15 0 -57 5 40 -21 -39 -2 35 -67 34
4655 34 -52 -7 -73 29 -89 46 64 -74 -56 -10 25 31 70 23 22 -1 -28 -29 24 -11 131 9 -43 10 10 99 27 -35 -4
4684 -4 -60 -28 72 -59 -25 20 7 12 -9 62 -89 32 -77 -36 82 21 69 0 40 8 -12 119 -76 -2 -6 -83 10 62
4712 62 -69 -101 -25 45 82 59 47 60 63 -79 10 -32 -17 82 76 94 60 -128 10 -49 108 -16 -76 149 21 -12 -52
4739 -52 62 6 64 38 -42 -65 92 122 -91 63 76 12 13 -17 -21 59 7 48 152 67 84 -4 1 -9 -28 -88 32 -72
4767 -72 31 -49 -81 -26 -10 2 -44 48 21 88 -19 15 -41 111 75 37 43 -98 85 -69 -105 -1 -27 33 -8 -17 -35 -27
4795b7l6K7M9j3N1n4J3m4o8R2P6nk9O3l9j5q0M9p6QL1j9L9Q2r2MJ9j0K9r1M8k9
4827d7P5q5J7l7P5N4L3k6Ol1m8j2p2Q5L6k4P5p2K1j21J95j32J29l9j13M7K2l9
4855b8O2O5j20M3Qm0P7r0j13K27j42qR6j16J65j10Pm6J51j75J97k89J10N9j6J05
4881G9m7j29J52j15L7Q0n5N8l6m4kJ60k19Q0Pk4l6M7O3q3P0j12lP8l7M6%K5j41
4910a01J16n7Q9k2n2j8j9J21r8Rp0J53M4n9k1K5J2j6j09Q8l3P6p7K0N6j89J70
4937C8JMK0r7MMo0J79p8K2j8j10Q4MqK7m2r2J17L9K8j47K33j14p3rK8P6l2M3j66
4968i5J34p0KP2kk8J20k34J15K3q3O6l6j4L9r2J32L0j0j03k9P5j05J38q7k9M7
4995b4o1J37j68Q6n1J12Pj12Q5Po4OJ04o7pQ7k9j98P7R9K4L4m6qqK3m1j80J66
$$ plain form
4795 -27 -63 -36 13 0 51 -3 10 -34 -102 -10 66 61 32 95 56 41 -39 10 -66 -58 -27 -46 -7 75 -17 -13 6 -4 25 -66 -18 -47
4827 -47 28 -57 -40 -77 -2 52 85 59 65 34 -14 -26 -98 -13 23 -1 74 2 23 -98 97 -35 94 55 -58 -11 11 -28
4855 -28 34 99 -21 22 30 -10 67 -23 -136 91 -51 -59 37 -79 86 -24 -17 -63 88 -87 110 -179 -69 -10 -26 79
4881 79 32 -97 55 -60 -23 57 2 60 24 -20 -22 138 -81 -1 6 -18 -54 -7 56 -27 43 -69 -72 6 -31 15 15 40 -101
4910 -101 15 -42 47 25 -27 -45 -64 57 -41 -32 -102 51 95 36 15 40 52 36 -73 15 -18 58 -19 1 57 -132 38
4937 38 39 43 63 -34 -30 -26 -86 93 15 37 19 -91 -7 -3 -11 16 -26 -118 -1 38 66 -81 152 38 -35 -44 -16 60 28 71 -95
4968 -95 39 -31 -29 43 41 13 133 -101 14 37 -46 20 -16 -30 9 -83 49 79 69 -34 -63 12 -93 45 -42 -71 -24
4995 -24 -85 52 -116 -30 -81 31 38 -74 11 18 -46 -40 64 -3 -10 77 48 -150 -73 26 50 84 38 30 22 45 4 -176 -10
5024a0q9J52p3J5%P2j5k9Q1k29O6l0O2O3r3J29p9M3m6kK6o0l8M3k2O9n8R6j06
5053f2K1P9k3J21k2j2j60J1O2j03J16K5r7R6J5o4k8n0J48k7l0j06N7k4k4n0J23
5080hK8q8L3O4Jmq9n4N1jM1L5q7k2L5O2Q4l7Mln2r7P3K4K5M4r0p1L4k6O0J07L3
5113A09l3j29j4K4j2J34k0j8L6o2r2O0R5k9l3j0o9K3K4k1L3Mn6K01k40k0M6K4
5141d5P1p2l7J35J4P4p5j13P4k3q2J3J55r0p0L7J26o4K2q9K6nq1J47k3j4l6M2
5169A7K9Pm2k9M3p6L1n0l3O3l0O4o5J25qj5m0M8j14j19J69N2M2nj29L7R6q1jk0
5199c4J13n7j34K38j43m3NN2J3J58j40n1R0%j02L3L7K1j7j18mP5q6J19J0Lm3k7
5227c2mQ5K4q3J02n5j2N8Om0J24j27l6o1Q1m6M2l4oM6O8m4q0J01j2q4J19k16J19
$$ plain form
5024 -10 -99 53 -20 -5 -5 67 52 23 104 -125 -59 -89 -27 36 -57 72 -7 36 -10 -12 14 -46 -84 -41 -63 6 -52 44 -62
5053 -62 -41 38 15 136 114 102 -58 -47 15 -88 28 53 -44 52 67 3 -25 -75 73 46 16 -90 -33 -57 -81 -131 -8
5080 -8 20 -68 -35 29 30 26 -63 -117 -66 -67 -26 9 -78 -100 -65 -3 81 44 48 45 -7 -104 -31 -7 18 62 -28 -99 -65 -91 -31 76 109
5113 109 76 -53 -67 -43 -55 79 59 41 77 15 -77 -17 78 49 16 6 -63 -40 -16 -37 -4 0 -56 145 -95 -115 -69 -45
5141 -45 26 -46 -83 52 66 140 65 -48 26 3 -79 -66 89 -1 -71 -34 92 28 50 -39 -13 -18 -99 48 25 11 -25 17
5169 17 46 53 11 -18 25 -51 -20 -70 -103 -40 -70 -6 -71 54 46 31 -9 39 -75 -194 -25 27 69 64 -65 -28 68 -13 -14 -34
5199 -34 79 22 -112 126 -17 -60 -55 -3 10 168 28 -23 67 67 -35 -2 35 56 39 -79 -83 -8 -94 25 35 38 -5 -32
5227 -32 -36 49 73 -10 92 37 25 83 89 49 173 46 10 -51 30 -16 26 -8 -14 32 100 56 -24 77 65 -19 100 -116 3
5256Co2J33N5j08p9Q1l0n0K9NQr5K2J07q9J25j28j6kN3N8J2m9Q6o5J9N6r7P6j14
5286e6R7o6J02j11l7PQ4n2M3Nj3j68J16L1n0m7J97m6j3K8q5M9O6q4l8K0N3o7O1
5315B6n3P3j46J99j61M4M6n2lj2Q7j07k4J15l5n1J21Qq3K7Pn3k5R7L1p6j47J96
5343D9Qj6q0n8M6R2mp8J48j05k8P2L7j90M4N9o6P0K8m0Nm7k2Q2K0pL4j25Q5P8
5373I1q8oJ6l8q0P9J0J7k4Jq0N7N7r8J1J2J03J4j22J98j55J00j16J4lQ9j74N8
5401e7m4J47K3j26R2K1L5l8J2r7M1oM2oj0l4L1K2Q3j08rr9Q0r4O7M9J2N0n7k4
5431bK7J2J5m1J37j38M9N2l2j34J02j1p8J03j23L6J13q0M5j9o9J01qk3j7J4l5
5458dR0o9L5J0jj15Q4L0p9J1P0j4k6m0n2J20p2P7k6r2M4m5P8j20K65j10Oj33K20
$$ plain form
5256 3 -59 74 129 21 -58 23 -7 -57 -28 -23 -15 -110 -88 19 -70 55 -73 -89 -91 -38 20 32 -17 69 4 23 79 -18 58 -56
5286 -56 41 -25 77 -34 -71 -64 20 -32 11 16 3 -165 -49 -18 -68 -115 82 36 23 51 -34 15 81 -3 -41 -21 32 -35 26
5315 26 -27 46 -100 99 -62 -18 28 -24 -27 -39 48 -59 -83 32 -3 -54 67 75 -8 19 26 -27 -52 45 76 0 -147 49
5343 49 57 41 -39 -97 -51 41 37 -41 107 2 -26 46 83 -107 -63 -4 -70 0 28 -12 -7 -54 -76 6 26 19 53 -72 13 91
5373 91 3 -3 13 -25 -105 -26 -16 1 -23 -22 -102 -45 12 -86 -75 -63 40 54 -68 130 -25 75 -41 -27 -30 59 -115 -57
5401 -57 -101 46 69 -57 35 56 91 53 65 -32 9 3 45 39 29 -5 26 48 131 23 14 -85 -5 -99 -32 17 29 79 22 -2
5431 -2 25 37 52 11 148 10 59 111 79 -55 47 36 -42 61 -62 -26 87 7 52 33 -36 65 57 34 17 31 -4
5458 -4 86 17 52 62 61 -54 30 60 -19 -8 62 48 22 -18 -70 50 -22 55 29 -63 -19 -64 14 -106 159 49 55 -78 142
5487A42j08j38J8J19j51P7P0o7j1o1J09%l1K2o3k6O0m1J39jm6M4j67P2R0j06P8
5514B3On5M3o7N3j01J02OL4n5m8L9O1j2K1j28M6k0R2m7J0Q3kj6j11p2J36j3J9
5543B7l2M3Km5j2RL7j28P1j0j1n6M5J4J8O1p2J34q7K6k7N1q6L9k7R7q1r4Q1O7
5573E4k5o5M7j7P9r4p8J59j43R9k4k6M5L5Oj39J74q4n8mJ40j26M1QJP1p3m0O6
5602B9J0j22J44j56Q4Jm4l0J54L0j49L8Q9l1J0n3L5o3k4L1L1p7M3m2P0O3j37J5
5630e1R5p9J24k5p2J8NQn4J54j15M0o8Rq8Q2L2o7J27j62J40m2M6o8L8O2r1N0k4
5659B4Lm0l2M9J16j09j8k0N6j34L2M8M8J14j23j35Q9m8J07q6K0l6J90jj52Q5L3
5686H0k8m8M1k2N2m0mp1qR9j30J37Rj27J44p1NML1l9o2N7J3L7j4j37K7Q8n0r2
$$ plain form
5487 142 34 -104 -86 33 -118 -41 29 -38 -49 -110 -1 -1 -32 -10 -73 -99 -39 -80 59 58 12 56 -111 -39 51 -55 23
5514 23 29 -26 17 -50 3 -98 4 10 44 -11 -59 -20 41 29 50 -78 -32 -52 40 -7 3 86 84 68 -43 -115 21 8 27
5543 27 -5 38 40 -5 -17 -8 29 -99 -28 -38 -49 -105 -60 -46 -28 33 -39 95 8 34 7 58 -28 11 -16 81 0 -94 -13 54
5573 54 29 -36 11 -6 73 -21 -99 60 -83 16 -8 -34 11 46 52 -87 87 3 -55 -59 81 -45 -4 4 5 76 3 -37 29
5602 29 39 -83 61 -95 -11 -10 -54 -84 70 100 -49 -11 78 47 57 4 39 -24 -48 -17 14 -63 -20 -62 8 71 -66 -51
5630 -51 44 -35 89 64 -8 10 15 23 -31 123 8 48 -20 -11 -99 -17 15 -52 75 -87 53 11 57 -11 27 89 -2 48 24
5659 24 27 -13 -45 4 120 11 -7 -27 29 -105 -73 -25 23 137 14 -121 -32 -80 27 -59 -39 -75 115 114 -38 47 80
5686 80 52 4 45 23 75 35 31 -40 -48 51 -79 58 67 -60 84 13 18 22 53 14 -48 9 22 59 45 -92 -65 23 -27 -119
5716a19J29j18N6M0M7l4N0rNn5O7L0r4L9n3rm9P0j9kq9J15k9L5l3KL9q2J39n3
5746A6K4q1J32j14J33k8j80Q0j9L7o7M8k9R5j15K6M2P2m1m2n4N0K6l2J9J1n8m2
5774i1p3O4J54r8O0j57J39lnj03N6%R6J2j08Q0J07j57K8L3l1M6K2jj25l2J30m2
5802AoN6o1K0K4j14L7J07j32R4kK5p8j7M4P4k8q2J15j48P7Q8r5R4j42P0L7j06
5830d8J21n8m9J05l8j50J15O2o8R8p2l3l6J3M0r3L7n9O7Ml4N5L6o3L4O6o8j47
5858a63J47N5m0j11J33o9l0N5M5O4j84O5rJ09j13j3M8o4J91M3j84N8j32K26n2
5883G5r4o0J13J4OO5k12J39Mm8l7m8J58j47O2J1j3o7M8Mj6M3P9j72pJ38j3j10
5911h5M3Q4Lrp3J57q9RM7j27n9K06j07O0P4p6j9J4o0m8Q7j75K03j7K7q4j10K36
$$ plain form
5716 -119 10 -108 -52 -12 35 1 51 42 47 -8 59 89 -5 34 -19 -28 -77 -7 -26 -28 -117 -2 -31 4 -29 -27 12 -70 69 16
5746 16 40 -41 91 -23 110 82 -98 -18 -37 0 -67 -19 -48 47 -68 -42 0 72 31 -11 -65 -15 11 -21 -2 9 -49 -91
5774 -91 -164 -100 54 -44 16 -141 -2 -5 -10 -113 -57 -57 39 51 -57 23 130 -27 1 34 3 49 71 70 -55 -87 43 1
5802 1 -5 51 -10 10 34 -80 -43 64 -68 26 24 49 -29 -46 -2 72 44 -38 77 -71 6 94 -1 93 -49 21 58 -48
5830 -48 73 15 -34 71 33 -117 -2 60 -8 90 18 -15 -51 -38 2 -91 -54 -113 -46 -42 -76 -21 15 -48 -14 52 -16 -163
5858 -163 -16 39 -1 -112 21 -48 -78 -23 22 86 -98 -33 -42 67 -46 -59 -11 -75 116 159 -25 33 -99 127 75
5883 75 -19 -79 34 48 54 119 -93 46 50 2 -35 -83 75 -72 -10 1 -12 -79 -31 -27 -43 0 79 -93 -100 38 25 -85
5911 -85 -42 42 45 36 -37 120 31 40 87 -40 -99 107 0 60 134 58 39 53 -7 -55 32 -143 60 43 70 -14 -124 112
5939A12o8j03l0k5M3k6J01j43N0J21m2J31j59J75r8N9k7j09L3k2l5K1N2oR3j4
5965H4k26J50r3M2n7J14N6r3M4Q0m9m5l5k7K3l9m0nJ41n9q9L5L6NR8q9RJ13j15
5994c1N2l7J9Pj7q8J11r6N5k7Q8Q0k22M5J0M0o0J9j04K4J25N2j57J16R5k5j13
6021c9P3n4kJ3K6j04R2qo8L1R6op8pl2J00N0m7J3o5KQk5K2l5J13m4k5o2m6N5M2
6053a1QP5n3j44J28K0r1N4O4n8M7j9k3J69k44J02J3jj37P2J41j65M3M8r3M2JQ3
6081G1kpk2l0RJ00j42Q9j09j7J51j65m1N6J17k3q0k1J25%q5l5Q8n8O1j02J74j43
6109d1J08q2j0j04J27K8l9m5N9J1R5mj53J07j63O3L2J09Lj24l3p8J39KM0j5j20
6136h8J97j75k3RL5l2P9p3P6k3n7K9L4mR8j27PJ16j03RK3Pq7n8J52P6l9p5N4k0
$$ plain form
5939 112 44 -59 -89 -114 -71 -97 4 -139 -89 32 -10 121 -38 137 39 98 71 -38 -5 -27 -62 -41 11 5 98 84
5965 84 -142 8 -85 -43 -100 14 70 -23 21 101 52 7 -28 -55 -32 -71 -111 -116 25 -34 -123 -88 -52 -47 51 -38 -29 84 -31
5994 -31 21 -16 3 10 -7 -95 16 -80 -25 -52 36 116 -106 -61 -51 -11 -71 -52 -156 -132 -7 45 -112 4 99 74 -39
6021 -39 34 -20 -22 -9 17 -87 5 -3 -71 -40 56 50 -28 -35 -67 33 83 36 49 -16 -14 -6 -31 -9 -44 69 25 0 -62 -108 -53 -11
6053 -11 -3 72 19 -125 3 23 -68 -14 50 -8 39 20 -3 166 -78 24 37 36 -101 -29 112 -53 -10 38 -55 -13 -12 71
6081 71 69 62 40 10 19 119 -23 66 -43 -60 91 -74 -115 -59 58 35 -45 -66 59 59 -26 -61 27 -31 30 -72 102 -41
6109 -41 67 -15 -25 -129 -2 26 -13 -58 1 12 107 103 -50 57 -106 -43 -11 98 101 -23 -56 -134 5 7 47 32 -88
6136 -88 109 -66 -89 -80 -45 -77 2 -71 5 -18 -75 -46 -12 -16 82 -45 -38 78 -25 -16 7 14 -73 -131 21 97 58 -17 37 17
6166A7j13L0Q5j23K11r2J60j78j18J63L0j64K1J6K2R4j00j4mJ5m9O3J8O8r5J5
6192b2m4N5J6j8N8j11k0qJ56J6o3k4J15p6L4o6J4q1J39n6L1L1J5j14j9N6q7L8
6220c5M8n2j3J00j26M8n5J18k0j2L1l5M6j7kJ06m3j7L2j51J04n7J03j50K0R0j13
6247e2J04o5k0J04j02L3k1L5P4j39m7J16q0n9J04n3O8l3N6N9j78J40q1K7K6j36
6273a20L7P5j28%K44o0K2n8J7o2q1J32j07J14N2pj09oL3j4K6p2J24o9jJ0Q1lp9
6302iO9p5N3l6Q8q6m2M4n8M8ON2p4O8J6j43nJ09m3L5K0N6r1m6K4J0P0j63Q9M5
6332C1p9K3pl4LL0K1o6O0k1J05m2N1q8J8L4J5m8j00Q0RJ5m8J00j25qo5J49L7n4
6362dN2j96J0J72K4P7j30o0o1J60n4pP7J3r6J46j50j07j6J86j04J43m6L9j71J09
$$ plain form
6166 17 -96 -66 19 -104 107 15 175 -3 -121 42 72 -92 -71 -55 -33 61 -39 -53 -57 -42 -91 -28 -10 58 -37 -22
6192 -22 -66 -11 5 -13 45 -66 -86 -94 62 78 15 -9 106 30 64 -2 12 -69 70 14 45 76 91 -23 -42 14 -73 -35
6220 -35 13 -39 -52 48 -78 -30 -85 33 13 1 32 -3 43 26 24 130 87 70 102 -49 55 -2 101 -49 -29 61 -52
6247 -52 52 -13 -33 71 -31 2 -19 16 90 -49 -96 20 -60 -119 -15 -68 0 -33 23 82 -96 44 -37 -10 16 -120
6273 -120 -83 -8 -136 -136 108 48 70 12 29 -33 -114 18 -89 25 77 70 -39 -45 -12 -26 0 -72 52 -17 -18 -8 73 70 -9
6302 -9 60 -15 38 2 90 4 -38 6 -52 -4 2 54 -20 48 64 -79 -84 25 -18 17 37 93 2 -44 -20 -10 60 -103 -14 31
6332 31 -48 -25 -32 -66 -63 -33 -12 -78 -18 -39 66 24 75 -13 5 39 54 6 -94 -14 -5 10 -38 62 -63 -71 -136 13 50 -4
6362 -4 48 -148 -138 34 58 135 5 -55 -116 44 -10 -17 60 73 -23 123 -27 -134 -150 36 -68 75 29 68 -103 6
6388FNK2o7nJ39o9j3N2prP4j80q2N7j4K7Q1o4R5r4J41p3r2M2N5lK6j17lR0m7k8
6420e5R3K2j70O4J46q6n1J9o0R7p3j1P6j5pO9o5O3m2l9L0l5K0Q8j50N3J5K7k1
6449BJ3k4Kl1J60k50J19J10k05J72N2j41M4r5k4M0J73k3j43J74j80M1Mm0k6N5
6475b1J2JP2j1n8r6N3j15J00J05r0M6J07j19J21k17J30N2j18K3k3J9p9O4J04o1
6501Al0k2M1p0K5K9o7J54M4j27m3J9K8M2n2L9kj14J22m4J56p6l0M8o2q3L3L5n2
$$ plain form
6388 6 11 33 -34 -39 100 31 18 70 63 54 128 -52 -134 -77 -91 -64 17 -47 48 -46 95 22 -70 -28 27 24 50 -67 -70 20 -27 -55
6420 -55 38 60 -110 -46 100 14 -37 -18 -78 19 -54 -65 11 -4 -11 58 -7 56 14 -25 5 -30 -10 78 -72 -19 -4 23 2
6449 2 15 -9 -7 -38 122 -128 -9 101 -104 68 120 -21 23 -72 -96 -56 117 94 -49 125 -55 -14 -10 -50 -76 -21
6475 -21 -9 -8 64 53 -5 -101 -48 -163 -63 42 -48 -2 105 -14 107 -110 20 72 -46 -23 -46 -27 -106 -42 62 1
6501 1 -29 -51 -10 -80 -55 -26 -93 61 105 -22 -65 -46 -18 24 -28 11 9 -105 17 -27 129 53 23 71 9 -74 -41 -6 -58
$$ [...]
8191a
##END NTUPLES=NMR FID
##END=
