##TITLE=1H_DE-80H_X3
 200.13MHz, d2o
 8 sc
 
 19ns.26.2.2025
##JCAMPDX= 6.0         $$ Bruker NMR JCAMP-DX V2.0
##DATA TYPE= NMR FID
##DATA CLASS= NTUPLES
##ORIGIN= UXNMR, Bruker Analytische Messtechnik GmbH
##OWNER= pz
$$ XWIN-NMR		Version 3.5
$$ Tue Jul 21 16:03:31 2026 Russian Standard Time (UT+4h)  Yarkov@DPX200
##.OBSERVE FREQUENCY= 200.1313
##.OBSERVE NUCLEUS= ^1H
##.DELAY= (6, 6)
##.ACQUISITION MODE= SIMULTANEOUS
##.ACQUISITION SCHEME= undefined
##.AVERAGES= 8
##.DIGITISER RES= 18
##SPECTROMETER/DATA SYSTEM= spect
##.PULSE SEQUENCE= zg30
##.SOLVENT NAME= CDCl3
##.SHIFT REFERENCE= (INTERNAL, CDCl3, 0, 14.3821)
##AUDIT TRAIL= $$ (NUMBER, WHEN, WHO, WHERE, WHAT)
$$ ##TITLE= Audit trail, XWIN-NMR		Version 3.5
$$ ##JCAMPDX= 5.01
$$ ##ORIGIN= Bruker BioSpin GmbH
$$ ##OWNER= Yarkov
$$ C:/Bruker/XWIN-NMR/data/yarkov2/nmr/H-C/1/audita.txt
$$ ##AUDIT TRAIL=  $$ (NUMBER, WHEN, WHO, WHERE, WHAT)
(   1,<2026-07-21 16:02:53.89 +0400>,<Yarkov>,<DPX200>,
      <created by zg, POWCHK disabled, PULCHK disabled
       configuration hash MD5:
       00 E9 B6 7A A2 85 ED C7 34 08 36 98 17 FE 4E 26
       data hash MD5: 16K
       89 75 BD CE 6A 44 B0 CA 0F 08 13 F3 C6 DE 7C DC>)
$$ ##END=
$$ 
$$ hash MD5
$$ 9B F6 7C 1C 00 A0 D3 D0 1F 39 78 3C 4E D5 19 F5
##$RELAX= 
##$RELAX= 
##$RELAX= 
##$RELAX= 
##$RELAX= 
##$RELAX= 
$$ Bruker specific parameters
$$ --------------------------
##$DU= <C:/Bruker/XWIN-NMR>
##$EXPNO= 1
##$NAME= <H-C>
##$PROCNO= 1
##$TYPE= <nmr>
##$USER= <yarkov2>
##$AMP= (0..31)
100 100 100 100 100 100 100 100 100 100 100 100 100 100 100 100 100 100 
100 100 100 100 100 100 100 100 100 100 100 100 100 100 
##$AQSEQ= 0
##$AQ_mod= 1
##$AUNM= <au_zg>
##$AUTOPOS= <>
##$BF1= 200.13
##$BF2= 200.13
##$BF3= 200.13
##$BF4= 200.13
##$BF5= 200.13
##$BF6= 200.13
##$BF7= 200.13
##$BF8= 200.13
##$BYTORDA= 1
##$CFDGTYP= 0
##$CFRGTYP= 5
##$CHEMSTR= <none>
##$CNST= (0..31)
1 1 145 1 1 1 1 1 1 1 1 1 1 1 1 1 1 1 1 1 1 1 1 1 1 1 1 1 1 1 1 1 
##$CPDPRG= <>
##$CPDPRG1= <>
##$CPDPRG2= <>
##$CPDPRG3= <>
##$CPDPRG4= <mlev>
##$CPDPRG5= <mlev>
##$CPDPRG6= <mlev>
##$CPDPRG7= <mlev>
##$CPDPRG8= <mlev>
##$CPDPRGB= <>
##$CPDPRGT= <>
##$D= (0..31)
0 0.7 0 0 0 0 0 0 0 0 0 0.03 0 0 0 0 0 0 0 0 0 0 0 0 0 0 0 0 0 0 0 0 
##$DATE= 1784635373
##$DBL= (0..7)
120 120 120 120 120 120 120 120 
##$DBP= (0..7)
150 150 150 150 150 150 150 150 
##$DBP07= 0
##$DBPNAM0= <>
##$DBPNAM1= <>
##$DBPNAM2= <>
##$DBPNAM3= <>
##$DBPNAM4= <>
##$DBPNAM5= <>
##$DBPNAM6= <>
##$DBPNAM7= <>
##$DBPOAL= (0..7)
0.5 0.5 0.5 0.5 0.5 0.5 0.5 0.5 
##$DBPOFFS= (0..7)
0 0 0 0 0 0 0 0 
##$DE= 6
##$DECBNUC= <off>
##$DECIM= 32
##$DECNUC= <off>
##$DECSTAT= 4
##$DIGMOD= 1
##$DIGTYP= 9
##$DL= (0..7)
0 120 120 120 120 120 120 120 
##$DP= (0..7)
150 150 150 150 150 150 150 150 
##$DP07= 0
##$DPNAME0= <>
##$DPNAME1= <>
##$DPNAME2= <>
##$DPNAME3= <>
##$DPNAME4= <>
##$DPNAME5= <>
##$DPNAME6= <>
##$DPNAME7= <>
##$DPOAL= (0..7)
0.5 0.5 0.5 0.5 0.5 0.5 0.5 0.5 
##$DPOFFS= (0..7)
0 0 0 0 0 0 0 0 
##$DQDMODE= 0
##$DR= 18
##$DS= 0
$$ [...]
##$SUBNAM2= <"">
##$SUBNAM3= <"">
##$SUBNAM4= <"">
##$SUBNAM5= <"">
##$SUBNAM6= <"">
##$SUBNAM7= <"">
##$SUBNAM8= <"">
##$SUBNAM9= <"">
##$SW= 18.0517328524113
##$SWIBOX= (0..15)
0 0 2 0 0 0 0 0 0 0 0 0 0 0 0 0 
##$SW_h= 3612.71676300578
##$TD= 16384
##$TD0= 1
##$TE= 0
##$TE2= 300
##$TE3= 300
##$TEG= 300
##$TL= (0..7)
0 120 120 120 120 120 120 120 
##$TP= (0..7)
150 150 150 150 150 150 150 150 
##$TP07= 0
##$TPNAME0= <>
##$TPNAME1= <>
##$TPNAME2= <>
##$TPNAME3= <>
##$TPNAME4= <>
##$TPNAME5= <>
##$TPNAME6= <>
##$TPNAME7= <>
##$TPOAL= (0..7)
0.5 0.5 0.5 0.5 0.5 0.5 0.5 0.5 
##$TPOFFS= (0..7)
0 0 0 0 0 0 0 0 
##$TUNHIN= 0
##$TUNHOUT= 0
##$TUNXOUT= 0
##$USERA1= <user>
##$USERA2= <user>
##$USERA3= <user>
##$USERA4= <user>
##$USERA5= <user>
##$V9= 5
##$VALIST= <valist>
##$VCLIST= <CCCCCCCCCCCCCCC>
##$VD= 0
##$VDLIST= <DDDDDDDDDDDDDDD>
##$VPLIST= <PPPPPPPPPPPPPPP>
##$VTLIST= <TTTTTTTTTTTTTTT>
##$WBST= 1024
##$WBSW= 4
##$XGAIN= (0..3)
0 0 0 0 
##$XL= 0
##$YL= 0
##$YMAX_a= 67796
##$YMIN_a= -99192
##$ZGOPTNS= <>
##$ZL1= 120
##$ZL2= 120
##$ZL3= 120
##$ZL4= 120
##$ABSF1= 10
##$ABSF2= 0
##$ABSG= 5
##$ABSL= 3
##$ALPHA= 0
##$AQORDER= 0
##$ASSFAC= 0
##$ASSFACI= 0
##$ASSFACX= 0
##$ASSWID= 0
##$AUNMP= <proc_1d>
##$AZFE= 0.1
##$AZFW= 0.1
##$BCFW= 1
##$BC_mod= 2
##$BYTORDP= 1
##$COROFFS= 0
##$CY= 83.5205535888672
##$DATMOD= 1
##$DC= 2
##$DFILT= <>
##$DTYPP= 0
##$F1P= 10.8118882576601
##$F2P= -7.23987719738617
##$FCOR= 0.5
##$FTSIZE= 0
##$FT_mod= 4
##$GAMMA= 1
##$GB= 0.15
##$INTBC= 1
##$INTSCL= 1
##$ISEN= 128
##$LB= 0.25
##$LEV0= 0
##$LPBIN= 0
##$MAXI= 10000
##$MC2= 0
##$MEAN= 0
##$ME_mod= 0
##$MI= 1.114404
##$NCOEF= 0
##$NC_proc= 0
##$NLEV= 6
##$NOISF1= 3.799351
##$NOISF2= 2.8
##$NSP= 1
##$NTH_PI= 0
##$NZP= 0
##$OFFSET= 14.38212
##$PC= 1
##$PHC0= -7264.547
##$PHC1= 21.42198
##$PH_mod= 1
##$PKNL= yes
##$PPARMOD= 0
##$PSCAL= 0
##$PSIGN= 0
##$REVERSE= no
##$SF= 200.129724274929
##$SI= 16384
##$SIGF1= 3
##$SIGF2= 2
##$SINO= 400
##$SIOLD= 16384
##$SREGLST= <1H.CDCl3>
##$SSB= 0
##$STSI= 0
##$STSR= 0
##$SW_p= 3205.1282051282
##$SYMM= 0
##$S_DEV= 0
##$TDeff= 0
##$TDoff= 0
##$TI= <>
##$TILT= no
##$TM1= 0
##$TM2= 0
##$TOPLEV= 0
##$USERP1= <user>
##$USERP2= <user>
##$USERP3= <user>
##$USERP4= <user>
##$USERP5= <user>
##$WDW= 1
##$XDIM= 8192
##$YMAX_p= 0
##$YMIN_p= 0
$$ End of Bruker specific parameters
$$ ---------------------------------
##NTUPLES= NMR FID
##VAR_NAME=  TIME,          FID/REAL,        FID/IMAG
##SYMBOL=    X,             R,               I
##VAR_TYPE=  INDEPENDENT,   DEPENDENT,       DEPENDENT
##VAR_FORM=  AFFN,          ASDF,            ASDF
##VAR_DIM=   8192,          8192,            8192
##UNITS=     SECONDS,       ARBITRARY UNITS, ARBITRARY UNITS
##FACTOR=    0.0002768,     1,               1
##FIRST=     0,             0,               0
##LAST=      2.2672688,     0,               0
##MIN=       0,             -99192,          0
##MAX=       2.2672688,     67796,           0
$$ Real data points
##PAGE= N=1
##DATA TABLE= (X++(R..R)), XYDATA
$$ plain form
0 0 0 0 0 0 0 0 0 0 0 0 0 0 0 0 0 0 0 8 -8 8 -8 8 -8 16 -16 16 -24 24 -32 32 -40 42 -48 56 -64 72 -80 89 -100
39 -100 112 -124 139 -154 171 -188 209 -230 254 -279 308 -339 373 -411 454 -501 553 -616 685 -765
59 -765 858 -971 1108 -1277 1497 -1793 2214 -2857 3996 -6569 25837 -39893 -84716 20199
73 20199 52436 -7702 -46355 -2894 22962 11459 -1658 -11828 -37407 -20628 35677 47532
85 47532 -13097 -42928 4959 43078 3620 -34501 -8943 29803 24171 -307 -15188 -21507 -14537
98 -14537 12555 20848 -11160 -27731 6308 26988 -4599 -30697 -5698 25038 17534 -1086 -3003
111 -3003 -4533 -5545 7618 11859 -7768 -14982 9212 19992 -10211 -30911 -3918 21530 4808
124 4808 -15060 -2711 11518 961 -8741 2834 9678 -1111 -1245 10691 4832 -12362 -9599
$$ packed form
0@%%%%%%%%%%%%%%%%%Qj6J6j6J6j6K4l2L2m0M8n6O4p2Q2r0J04j20J36j52J69j89
39a00K12k36K63k93L25l59L97m39M84n33N87o47P12p84Q65r55J054j169J301j450
59g65J623j829K079k385K774l290M007n071O853j0565L2406o5730m4823J04915
73B0199L2237o0138l8653M3461K5856j1503j3117j0170k5579J6779N6305J1855
85D7532o0629k9831M7887L8119l9458l8121K5558L8746n632k4478j4881o319O970
98a4537K7092Q293l2008j6571L4039K0680l1587k6098K4999L0736p504j8620j917
111c003j530j012J3163M241j9627p214K4194J0780l0203k0700K6993K5448j6722
124D808j9868J2349J4229j0557r702J1575O844j0789j34J1936n859j7194K763
$$ plain form
137 -9599 7645 8188 -5764 -7016 1137 -1024 -3875 2008 1124 -6621 -857 13376 8018 -12752 -11455
152 -11455 11987 16579 -3485 -12532 -450 8783 1984 -7171 -5593 -787 1746 4026 907 -7420
166 -7420 -7666 3488 11629 4437 -7803 -5488 6321 9133 433 -7542 -5272 5533 9101 -796
180 -796 -11655 -9004 4735 9789 -780 -9463 -4684 5410 7798 223 -7401 -2984 8355 10717
194 10717 -972 -11438 -3724 9253 6237 -5818 -7757 332 4769 -610 -5872 -3269 1431 3562
208 3562 2788 -915 -2658 154 3572 3807 253 -1519 1459 2210 -708 -2301 -2215 -1190 633 917 -1472
225 -1472 -4486 -2706 2901 2655 -2506 -1307 4143 3992 -845 -2188 1825 3707 876 -490 10 -1255
241 -1255 -1418 -710 -1493 -2127 -1149 949 241 -3123 -1887 2492 2185 -259 603 3382 2454 -1329 -795 3016
$$ packed form
137i599J7244N43j3952j252Q153k161k851N883q84p745N764J4233n358k0770J297
152a1455K3442M592k0064r047J2082R233o799r155J578M806K533K280l119q327
166g420k46J1154Q141p192j2240K315J1809K812q700p975K270J0805L568r897
180g96j0859K651J3739N054j0569q683M779J0094K388p575p624M417J1339K362
194A0717j1689j0466P714J2977l016j2055j939Q089M437n379n262K603M700K131
208C562p74l703j743K812L418K35l554j772K978P51k918j593Q6J025J823K84k389
225a472l014J780N607k46n161J199N450j51m837j343M013J882k831j366N00j265
241a255j63P08p83o34R78K098p08l364J236M379l07k444Q62K779r28l783N34L811
$$ plain form
259 3016 1565 -1816 -888 935 -1099 -3126 -2105 38 -873 -1424 627 -131 -1915 385 2902 1499
275 1499 -376 1266 3716 1391 -2234 -87 2425 33 -2065 -939 96 -1775 -3401 -963 830
290 830 -1414 -1565 1291 1284 -697 -336 2231 2908 402 307 2282 710 -1246 2 570 -670 -1799 -646
308 -646 -165 -2570 -2943 304 1117 -1036 -908 1235 1874 261 -266 1856 2474 646 746 760 -150 -539
326 -539 -256 -177 -1218 -1967 -345 -75 -2369 -1944 609 892 -361 -365 1230 1825 135 397 2030 1383 351
345 351 629 422 -331 -1109 -729 83 -1144 -1823 -510 -429 -1260 -1141 -51 1133 555 10 932 1100 566
364 566 935 1118 891 419 26 80 -344 -1574 -575 -103 -1086 -1328 -923 -459 -249 -599 -315 703 755 1180
384 1180 696 -133 826 1688 1012 25 -512 297 775 -602 -1724 -1116 -302 214 -507 -1607 -986 111 583
$$ packed form
259C016j451l381R28J823k034k027J021K143r11n51K051p58j784K300K517j403
275A499j875J642K450k325l625K147K512k392k098J126J035j871j626K438J793
290H30k244j51K856pj981L61K567O77k506r5J975j572j956J248N68j240j129J153
308f46M81k405l73L247Q13k153J28K143O39j613n27K122O18j828J00J4r10l89
326e39K83P9j041p49J622K70k294M25K553K83j253mJ595N95j690K62J633o47j032
345C51K78k07p53p78L80Q12j227o79J313Q1q31J19J090J184n78n45R22J68n34
364E66L69J83k27m72l93N4m24j230R99M72r83k42M05M64K10l50K84J018N2M25
384A180m84q29R59Q62o76r87n37Q09M78j377j122O08Q14N16p21j100O21J097M72
$$ plain form
403 583 720 -366 -312 1338 1837 851 -216 -157 1352 1504 -206 -942 -1162 -658 252 -337 -1487 -1588 -623
422 -623 469 150 -1165 -718 846 1413 1302 -195 -410 1056 1606 724 -168 -701 -175 388 -166 -625 -1483
441 -1483 -1238 475 350 -1138 -1389 -551 699 1110 -1 21 628 957 1448 693 -277 156 414 896 967
460 967 -1351 -2020 100 947 -485 -1978 -1347 819 991 -262 -1143 413 1242 1175 300 92 508 1038
478 1038 1036 420 -307 -149 0 444 -654 -1726 -735 970 189 -1399 -1200 496 2030 66 -950 -312
496 -312 1297 1938 1675 -1428 -561 1722 1805 -281 -2611 -1432 1233 554 -675 -2654 -1326 1656 1189
513 1189 -882 -2523 640 2648 2322 977 -1362 -472 2049 2433 -278 -2329 -349 2555 1019 -1308
529 -1308 -3200 -1607 1697 594 -2031 -1548 873 909 1112 151 -709 381 1982 2445 290 -1965 -737
$$ packed form
403E83J37j086N4J650M99r86j067N9J509J52j710p36k20N04R10n89j150j01R65
422f23J092l19j315M47J564N67j11j497k15J466N50q82q92n33N26N63n54m59q58
441a483K45J713j25j488k51Q38J250M11j111K2O07L29M91p55r70M33K58M82P1
460I67k318o69K120Q47j432j493O31K166J72j253q81J556Q29o7q75k08M16N30
478A038ko16p27J58J49M44j098j072R91J705p81j588J99J696J534j964j016O38
496c12J609O41k63l103Q67K283Q3k086k330J179K665o79j229j979J328K982m67
513A189k071j641L163K008l26j345k339Q90K521L84k711k051J980K904j536k327
529a308j892J593L304j103k625M83K421L6K03r61q60J090J601M63k155k255J228
$$ plain form
546 -737 3096 1523 -1532 -2975 -538 1725 755 -2956 -1665 240 848 -460 -1309 -612 1033 424 698
563 698 536 494 483 378 1526 1006 -668 -1467 809 1057 -787 -1109 -846 74 -653 -1932 545 416 -137
582 -137 -286 620 885 217 -306 702 878 -441 150 804 357 -504 -838 1131 592 -1292 -842 859 -207
601 -207 -188 -700 -196 1242 -150 -216 226 208 466 656 427 146 364 -175 382 124 -44 -359 -731 -538 -377
622 -377 -280 -843 -639 -510 871 421 -411 347 17 864 352 -15 -214 663 559 166 -1290 -989 650 34
642 34 -605 -654 -417 -390 -494 -381 206 -66 -237 562 803 59 -101 418 1107 850 -517 -402 499 314 -368
663 -368 -675 -687 -140 -200 -525 -413 -597 -90 312 8 -164 325 461 643 621 216 310 411 107 -3 -472 -14
685 -14 77 -785 -670 -84 -351 -659 -537 27 405 -258 -335 639 866 328 120 509 920 317 -273 204 286 -313
$$ packed form
546g37L833j573l055j443K437K263r70l711J291J905O08j308q49O97J645o09K74
563F98j62m2j1j05J148n20j674p99K276K48j844l22K63R20p27j279K477j29n53
582a37j49R06K65o68n23J008J76j319N91O54m47q61l34J969n39j884M50J701j066
601b07J9n12N04J438j392o6M42j8K58J90k29k81K18n39N57k58j68l15l72J93J61
622c77R7n63K04J29J381m50q32P58l30Q47n12l67j99Q77j04l93j456L01J639o16
642C4o39m9K37K7j04J13N87k72j71P99K41p44j60N19O89k57j367J15R01j85o82
663c68l07j2N47o0l25J12j84N07M02l04j72M89J36J82k2m05R4J01l04j10m69M58
685a4R1q62J15N86k67l08J22N64L78o63p7R74K27n38k08L89M11o03n90M77Q2n99
$$ plain form
707 -313 -436 -510 -469 -311 -523 -397 -289 -548 73 276 -194 282 649 518 429 219 548 505 -42 24 379 -213
729 -213 -472 -381 -224 -284 -581 -646 -2 -270 -342 110 69 92 497 516 286 -42 284 996 172 -525 150 395 -251
752 -251 -675 -716 70 -346 -776 -434 119 -26 -92 128 451 394 177 572 741 271 321 396 249 16 -216 -248
774 -248 -123 -494 -413 -136 -542 -553 -96 -71 -140 -201 155 480 296 199 617 390 190 264 169 86 42 -253 -130 -472
798 -472 -682 -176 -386 -627 -421 -169 34 -62 -182 417 582 72 321 674 519 292 -54 361 337 -287 -320
819 -320 -25 -431 -464 -298 -478 -232 -383 -372 82 -78 16 329 216 446 379 252 519 409 166 231 27 -154
841 -154 -145 -330 -443 -334 -507 -305 -169 -359 -61 54 -35 369 306 249 449 430 401 309 -53 262 299 -442 -241
864 -241 -152 -181 -328 -512 -452 -141 -428 -115 85 -24 157 264 311 515 329 284 598 408 200 -15 -31 -30 -139
$$ packed form
707c13j23p4M1J58k12J26J08k59O21K03m70M76L67j31q9k10L29m3n47O6L55n92
729b13k59R1J57o0k97o5O44k68p2M52m1K3M05J9k30l28L26P12q24o97O75K45o46
752b51m24m1P86m16m30L42N53j45o6K20L23n7k17L95J69m70N0P5j47k33k32l2
774b48J25l71Q1K77m06j1M57K5o9o1L56L25j84r7M18k27k00P4r5q3m4k95J23l42
798d72k10N06k10k41K06K52K03r6j20N99J65n10K49L53j55k27l46M15k4o24l3
819c20K95m06l3J66j80K46j51J1M54j60R4L13j13K30o7j27K67j10k43O5k04j81
841a54Rj85j13J09j73K02J36j90K98J15q9M04o3n7K00j9k9r2l62L15L7p41K01
864b41Q9k9j47j84O0L11k87L13K00j09J81J07M7K04j86m5L14j90k08k15j6Jj09
$$ plain form
887 -139 -505 -384 -354 -470 -195 -231 -357 -116 -158 160 434 212 350 419 410 540 180 36 299 68 -237 -312 -408
910 -408 -340 -341 -584 -270 -268 -441 -134 68 87 182 164 345 738 282 121 429 142 240 67 -216 -156 -320 -430 -257
934 -257 -359 -438 -225 -159 102 -115 -241 301 428 168 237 351 335 412 159 52 178 -82 -197 -290 -483 -252
956 -252 -356 -480 -71 -182 -254 -59 62 237 174 227 542 460 180 387 467 150 15 -247 -21 18 -443 -420 -294
979 -294 -353 -260 -387 -350 175 29 49 258 238 254 420 361 427 174 -27 194 205 -110 -166 -181 -249 -57 -471 -499 -72
1004 -72 -259 -42 -2 -110 214 104 243 381 170 144 430 147 9 42 -82 -39 -102 -219 -153 -352 -342 -247 -208
1027 -208 -87 119 -22 58 158 108 325 238 234 416 250 284 184 -119 -9 91 -313 -296 -266 -383 -242 -231 -163
1050 -163 -1 -21 109 240 43 228 504 363 362 263 72 144 87 -46 -141 -212 -114 -37 -384 -287 -258 -384 -48 -29
$$ packed form
887a39l66J21L0j16K75l6j26K41m2L18K74k22J38O9rJ30l60j44K63k31l05p5r6
910d08O8jk43L14Kj73L07K02J9R5j8J81L93m56j61L08k87R8j73k83O0j64j10J73
934b57j02p9K13O6K61k17j26N42J27k60O9J14j6P7k53j07J26k60j15r3j93K31
956b52j04j24M09j11p2J95J21J75o3N3L15q2k80K07Q0l17j35k62K26L9m61K3J26
979b94n9R3j27L7N25j46K0K09k0J6J66n9O6k53k01K21J1l15n6j5o8J92m14k8M27
1004g2j87K17M0j08L24j10J39J38k11k6K86k83j38L3j24M3o3j17O6j99J0R5L9
1027b08J21K06j41Q0J00n0K17q7mJ82j66L4j00l03J10J00m04J7L0j17J41J1O8
1050a63J62k0J30J31j97J85K76j41jr9j91P2n7j33r5p1R8P7l47R7K9j26L36J9
$$ plain form
1074 -29 -182 124 219 302 178 259 189 413 200 174 140 -113 34 -69 -404 -254 -183 -310 -349 -267 -130 3 17 183
1098 183 190 38 256 386 287 332 220 224 272 -110 -62 15 -327 -174 -265 -418 -230 -296 -423 -99 -139 15 260 102
1122 102 387 264 174 461 366 61 239 49 -88 -59 -311 -279 -93 -284 -254 -353 -224 -86 -96 -98 292 249 88
1145 88 263 272 313 290 206 235 157 -162 -36 -102 -311 -165 -309 -305 -115 -285 -292 -136 -117 65 221 174 396 151 122
1170 122 345 256 60 157 -72 65 -106 -285 -157 -146 -275 -330 -106 -212 -53 -117 -15 365 219 152 71 411
1192 411 293 193 10 216 22 -128 -167 -103 -233 -142 -303 -262 -130 -235 -91 -97 134 -25 -78 182 504 72
1214 72 189 352 72 63 15 -106 82 -229 -258 -73 -240 -388 -300 -239 28 -72 -100 95 127 104 198 245 188 261 106
1239 106 85 215 -145 -25 -66 -285 -67 -169 -386 -226 -278 -186 -141 -84 56 112 49 153 282 44 123 230 179
$$ packed form
1074b9j53L06R5Q3j24Q1p0K24k13k6l4k53J47j03l35J50P1j27l9Q2J37J33J4J66
1098A83Pj52K18J30r9M5j12MM8l82M8P7l42J53r1j53J88o6j27L24m0J54K45j58
1122A02K85j23r0K87r5l05J78j90j37K9k52L2J86j91L0r9J29J38j0kL90m3j61
1145H8J75RM1k3q4K9p8l19J26o6k09J46j44MJ90j70pJ56J9J82J56m7K22k45k9
1170A22K23q9j96R7k29J37j71j79J28J1j29n5K24j06J59o4J02L80j46o7q1L40
1192D11j18j00j83K06j94j50l9O4j30R1j61M1J32j05J44oK31j59n3K60L22m32
1214G2J17J63k80rm8j21J88l11k9J85j67j48Q8O1K67j00k8J95L2k3R4M7n7P3j55
1239A06k1J30l60J20m1k19K18j02k17J60n2R2M5N7J40N6o3J04J29k38P9J07n1
$$ plain form
1262 179 273 -54 -4 61 -232 -214 -168 -304 -173 -324 -89 -21 -127 -38 164 208 193 92 194 301 181 60 244
1285 244 174 -76 -24 -43 -179 -236 -268 -249 -114 -445 -205 72 -112 128 126 92 286 145 134 360 130 99 226 -24
1309 -24 126 103 -43 -103 -218 -294 -93 -273 -191 30 11 2 146 121 265 215 25 326 171 54 192 131 -31 -112
1333 -112 -140 -68 -293 -442 -142 -158 -203 -265 -143 -44 9 -11 191 236 247 223 152 186 137 27 -21 138 -154 -297 -222
1358 -222 -215 -261 -298 -280 -147 40 -45 -12 22 184 206 221 279 238 164 131 34 -11 9 -26 -241 -48 -253 -204 -216 -214 -248 -52
1386 -52 -166 32 126 -4 272 172 214 255 38 257 263 -8 16 -30 -37 -187 -178 -200 -156 -177 -238 -78 -57 -169 9 10
1412 10 131 97 131 279 221 73 205 178 35 43 -172 -127 -53 -183 -140 -184 -203 -7 -76 -74 38 113 63 244 103 327
1438 327 226 -6 133 58 -120 -27 -52 -77 -60 -229 -221 -114 -245 -133 96 -39 -60 30 60 141 113 26 232 135 258
$$ packed form
1262A79R4l27N0O5k93J8M6j36J31j51K35O8j06Q9K02M4j5j01J02J07j20j21J84
1285B44p0k50N2j9j36n7l2J9J35l31K40K77j84K40kl4J94j41j1K26k30l1J27k50
1309b4J50k3j46o0j15p6K01j80Q2K21j9rJ44k5J44n0j90L01j55j17J38o1j62q1
1333a12k8P2k25j49L00j6m5o2J22R9N3k0K02M5J1k4p1L4m9j10m8J59k92j43P5
1358b22Pm6l7J8J33J87q5L3L4J62K2J5N8m1p4l3r7m5K0l5k15J93k05M9j2Kl4J96
1386e2j14J98R4j30K76j00M2M1k17K19Ok71K4m6pj50Rk2M4k1o1J60K1j12J78J
1412A0J21l4L4J48n8j48J32k7j43Qk15M5P4j30M3m4j9J96o9KJ12P5n0J81j41K24
1438C27j01k32J39p5j78R3k5k5J7j69QJ07j31J12K29j35k1R0L0Q1k8q7K06r7J23
$$ plain form
1463 258 78 55 125 -200 -232 -18 -131 -286 -177 -117 -114 -72 20 -42 66 32 70 143 183 228 -51 165 265 28 -124
1488 -124 47 -15 -23 -96 -164 -63 -133 -181 -13 -118 -80 -48 30 100 233 88 128 149 150 220 83 -56 81 -151 -175 -142
1514 -142 -150 -124 -182 -239 -2 -62 -181 -24 154 107 100 257 217 192 99 88 122 148 -44 5 64 -109 -244 -212 -140 -108 -70
1541 -70 -78 -117 -8 79 65 235 300 132 115 138 113 151 15 120 77 -240 -115 -158 -270 -103 -128 -56 -19 -211 -74
1566 -74 99 4 103 225 105 333 155 11 213 83 86 -59 -20 -99 -29 -157 -89 -102 -202 -13 -31 -122 -12 -3 131
1591 131 185 64 4 192 202 134 -10 -152 52 -67 -167 -106 -160 -144 -213 -185 -83 -70 -45 86 142 -16 134 241
1615 241 7 11 171 77 133 135 -95 83 24 9 -123 -216 -131 -95 -74 -45 -83 32 58 -28 20 164 109 138 56 157 176
1642 176 -34 -11 9 20 -63 36 -23 -106 -105 -98 -40 -75 -5 88 -27 39 101 115 115 169 170 74 124 -24 -5 -55 -136 -146 -188 -239
$$ packed form
1463B58j80k3P0l25l2K14j13j55J09O0LM2R2o2J08l4L8P3M0M5k79K16J00k37j52
1488a24J71o2qp3o8J01p0m8J68j05L8L2P8P0J33j45M0K1JP0j37j39J37k32k4L3
1514a42qK6n8n7K37o0j19J57J78m7pJ57m0k5r3j1L4K6j92M9N9j73j35L2P2L2L8
1541g0ql9J09Q7j4J70O5j68j7K3k5L8j36J05m3l17J25m3j12J67k5P2L7j92J37
1566g4J73r5R9J22j20K28j78j44K02j30Lj45L9p9P0j28O8j3j00J89j8r1J10RJ34
1591A31N4j21o0J88J0o8j44j42K04j19j00O1n4J6o9K8J02J3K5J31N6j58J50J07
1615B41k34MJ60r4N6Kk30J78n9j5j32r3Q5L6K1K9l8J15K6q6M8J44n5K9q2J01J9
1642A76k10K3K0J1q3R9n9q3JPN8l5P0R3j15O6O2J4%N4Jr6N0j48J9n0q1j0m2n1
$$ plain form
1672 -239 -47 -138 -47 -131 -50 -13 81 43 164 69 118 164 99 81 118 90 7 80 -48 -76 43 -62 -21 -165 -151 -4
1698 -4 -81 -27 -39 -48 35 47 41 168 118 72 -2 -14 132 -94 -17 -14 44 -165 -145 -87 -153 -100 -138 -13 -84 43 69 188 122
1727 122 79 166 62 145 38 13 125 44 -19 -64 -40 -94 -94 -228 -10 -168 10 43 -28 112 76 19 155 179 59
1752 59 84 115 -50 24 -42 23 -110 -202 -197 -100 -115 -171 -35 -194 48 104 40 86 49 17 184 146 77 141 98 88 -11 -31
1780 -31 32 -27 -43 -53 -89 -108 -143 -131 -117 -75 33 117 84 -26 62 51 82 87 48 136 76 19 -22 -55 -7 -184 -99 -73 83
1809 83 -94 -120 35 7 -21 60 170 65 38 -2 123 -15 74 9 32 15 -56 -71 -110 0 -6 -173 -103 -184 -46 30
1835 30 2 71 -79 108 65 117 2 99 -25 91 -30 -1 -89 -24 -85 -147 -112 14 -48 20 -67 -17 -90 90 126 105
1861 105 123 79 30 98 12 21 112 -47 -19 42 -110 -65 -71 -55 -30 -118 -46 -31 7 -51 11 70 -117 113 99 45 42 56 110
$$ packed form
1672b39J92r1R1q4Q1L7R4l8J21r5M9M6o5j8L7k8q3P3j28k8J19j05M1j44J4J47
1698dp7N4j2rQ3J2oJ27n0m6p4j2J46k26P7LN8k09K0N8o6N3l8J25p1J27K6J19o6
1727A22m3Q7j04Q3j07k5J12q1o3m5K4n4%j34K18j58J78L3p1J40l6n7J36K4j20
1752E9K5L1j65P4o6O5j33r2NR7j5n6J36j59K42N6o4M6l7l2J67l8o9O4m3j0r9k0
1780c1O3n9j6j0l6j9l5J2J4M2J08Q4l3j10Q8j1L1Nl9Q8o0n7m1l3M8j77Q5K6J56
1809H3j77k6J55k8k8Q1J10j05k7m0J25j38Q9o5K3j7p1j5l9J10oj67P0q1J38P6
1835C0k8O9j50J87m3N2j15R7j24J16j21K9q8O5o1o2L5J26o2O8q7N0p3J80L6k1
1861A05J8m4m9O8q6RR1j59K8O1j52M5oJ6K5q8P2J5L8n8O2N9j87K30j4n4lJ4N4
$$ plain form
1890 110 -15 53 -38 43 56 -36 -85 27 -4 -71 -73 35 15 1 107 39 55 144 109 133 105 -11 43 -18 -32 -16 -72 -20
1918 -20 -95 -110 -83 35 28 -19 8 43 228 13 98 24 140 -17 14 -13 68 58 -51 -54 32 -15 -75 -87 -34 -110 -97 -120
1946 -120 19 30 -32 -17 33 85 63 57 -6 14 -1 -20 -87 -114 -104 -60 -146 -23 -74 -63 -12 -124 -37 90 111 55 113 132
1974 132 52 87 81 46 67 57 -8 -57 -111 -122 -92 -91 -28 -26 -45 -57 -99 -102 62 -25 70 105 36 18 65 -13 -15 47 18 -43 -29 -20
2006 -20 -20 -216 -99 -30 -83 -101 -48 -53 -27 -15 80 15 49 126 37 11 -59 -18 150 39 -44 -91 -105 -63 -151 86 82 -29 62
2035 62 9 80 72 21 -166 71 22 -7 126 8 -7 37 -145 -95 0 -66 -119 -120 -153 21 -37 -24 4 21 -124 151 -7
2062 -7 -16 -27 11 -8 -37 32 -10 -22 -31 -14 -93 -25 -67 -107 -172 -33 -23 87 74 33 -58 -66 -3 89 -12 -13 -18 -14 104 -8 -24
2093 -24 -30 -18 -20 63 31 87 20 -20 84 -76 39 119 42 93 -7 119 63 36 1 -25 21 -62 -20 -95 -67 29 -5 -123
$$ packed form
1890A10j25O8r1Q1J3r2m9J12l1o7kJ08k0j4J06o8J6Q9l5K4k8j16N4o1j4J6n6N2
1918b0p5j5K7J18pm7K7L5J85k15Q5p4J16j57L1k7Q1j0j09lQ6m7o0j2N3p6J3k3
1946a20J39J1o2J5N0N2k2oo3K0j5j9o7k7J0M4q6J23n1J1N1j12Q7J27K1n6N8J9
1974A32q0L5ol5K1j0o5m9n4j1L0JO3Kj9j2m2lJ64q7R5L5o9j8M7p8kO2k9o1J4R
2006b0%j96J17O9n3j8N3nK6J2R5o5L4P7q9k6p0M1J68j11q3m7j4M2q8K37mj11R1
2035F2n3P1qn1j87K37m9k9J33j18j5M4j82N0R5o6n3jl3J74n8J3K8J7j45K75j58
2062grj1L8j9k9O9m2j2rJ7p9O8m2m0o5J39J0J10j3m1r1qO3R2j01jnMJ18j12j6
2093b4oJ2kQ3l2N6o7m0J04j60J15Q0p7N1j00J26n6k7l5k6M6q3M2p5K8R6l4j18
$$ plain form
2121 -123 -11 -4 34 5 -84 90 67 -24 64 -9 -44 -19 15 93 56 -97 -111 -121 -102 84 20 42 -19 114 53 109 -8
2148 -8 177 107 -15 90 149 48 -69 51 6 77 -2 32 -94 40 -11 -61 -34 -89 -146 16 -38 -78 -76 -46 9 -56 117
2175 117 8 55 70 11 63 -6 9 17 -13 -72 41 0 -163 3 -84 -106 62 55 0 89 -26 123 38 28 -7 73 16
2202 16 67 -16 78 33 -95 -23 -163 14 -15 -98 6 124 -100 -155 -52 125 100 7 12 -21 6 94 124 -1 -17 -55
2228 -55 -53 -118 -11 -62 49 34 45 58 93 83 105 -67 16 97 -16 12 91 24 61 -42 -23 97 -44 -113 52 -118
2254 -118 -72 35 -17 157 -102 1 188 3 41 -8 48 -26 -19 16 12 5 19 -59 69 -122 -99 -190 -64 -78 24 -10
2280 -10 34 3 36 -14 -18 93 -1 38 104 -94 -54 -137 -15 -35 -26 10 -89 -85 -54 37 -98 -122 65 31 24 -14 97 -41 -20
2309 -20 49 108 -68 47 -50 -17 -61 45 70 -72 63 -45 -124 -47 -17 -124 -4 89 31 -30 17 65 -94 58 49 -3
$$ packed form
2121a23J12PL8k9q9J74k3r1Q8p3l5K5L4P8l7j53j4j0J9J86o4K2o1J33o1N6j17
2148hJ85p0j22J05N9j01j17J20m5P1p9L4j26J34n1n0K7n5n7J62n4m0KL0N5o5J73
2175A17j09M7J5n9N2o9J5Ql0n9J13m1j63J66q7k2J68pn5Q9j15J49q5j0l5Q0n7
2202A6N1q3R4m5j28P2j40J77k9q3J04J18k24n5J03J77k5r3Nl3K7Q8L0j25j6l8
2228e5Ko5J07n1J11j5J1J3L5j0K2j72Q3Q1j13K8P9o7L7j03J9J20j41o9J65j70
2254a18M6J07n2J74k59J03J87j85L8m9N6p4PL5mpJ4p8J28j91K3r1J26j4J02l4
2280a0M4l1L3n0mJ11r4L9O6j98M0q3J22k0RL6r9ML1R1j35k4J87l4pl8J11j38K1
2309b0O9N9j76J15r7L3m4J06K5j42J35j08p9P7L0j07J20R3n8o1M7M8j59J52rn2
$$ plain form
2335 -3 83 -70 72 -18 38 -81 35 -17 -61 6 -37 -37 27 16 -73 57 57 67 69 118 12 51 61 2 -7 19 26 -28 -10 32
2365 32 -147 -24 -59 -156 -11 -12 -82 5 144 4 30 -45 45 -30 9 39 31 -33 -95 -15 -108 51 54 -12 -16 55 114 84 1
2394 1 1 73 -33 54 -10 107 -36 -67 -32 -60 17 -4 -27 16 -39 -34 -2 108 39 -91 -52 -83 11 76 -40 95 -58 7
2422 7 3 -101 73 -8 32 8 -20 63 8 -12 52 41 27 -21 -66 -27 -22 -40 53 4 -113 -97 89 32 61 -39 -7 -9 -106 -15
2452 -15 -113 2 -112 7 47 -105 72 41 -111 46 19 -55 115 105 79 -11 -11 75 1 -76 9 23 53 -53 -13 76
2478 76 -35 -91 -14 -108 58 40 83 -21 31 78 55 -10 17 27 -113 45 63 -22 1 -9 -29 -32 58 -91 -31 58 -21 -49
2506 -49 -24 21 67 24 116 -4 -4 -23 0 -80 -56 65 -60 2 -15 -35 3 21 18 128 170 -15 53 10 54 -7 55 64 153
2535 153 -8 -28 106 -58 -40 3 -114 1 41 61 -28 -63 21 -4 46 25 46 57 -58 0 82 -132 68 17 -116
$$ packed form
2335cQ6j53J42r0N6j19J16n2m4O7m3%O4j1q9J30%J0KM9j06L9J0n9rK6Pn4J8M2
2365C2j79J23l5r7J45jp0Q7J39j40K6p5R0p5L9L0qo4o2Q0r3J59Lo6mP1N9l0q3
2394A%P2j06Q7o4J17j43l1L5k8P7k1k3M3n5NL2J10o9j30L9l1R4O5j16J35j53O5
2422Gmj04J74q1M0k4k8Q3n5k0O4j1j4m8m5L9Nj8R3m9j17J6J86n7K9j00L2kr7R1
2452a5r8J15j14J19M0j52J77l1j52J57k7p4J70j0k6r0%Q6p4p7Q5J4L0j06M0Q9
2478G6j11n6P7r4J66j8M3j04N2M7k3o5K7J0j40J58J8q5K3j0k0lR0j49O0Q9p9k8
2506d9K5M5M6m3R2j20%j9K3q0K4J21j25O2j7k0L8J8lJ10M2j85O8m3M4o1O2RQ9
2535A53j61k0J34j64J8M3j17J15M0K0q9l5Q4k5N0k1K1J1j15N8Q2k14K00n1j33
$$ plain form
2560 -116 35 -24 -50 -103 42 68 -47 -50 -99 -21 -2 77 -46 131 26 -31 17 128 73 93 -83 -76 71 35 105 -2
2586 -2 37 -77 64 43 -30 -80 32 -27 -72 2 13 -2 -8 58 -26 93 -36 22 39 4 -137 -59 6 9 -42 -9 59 -111
2614 -111 -11 -56 -34 107 41 15 -24 64 107 39 103 2 14 -47 -54 42 -15 -92 -53 -75 72 31 89 20 22 -63 59 4
2642 4 -17 -17 15 38 57 72 1 -165 93 13 -5 -168 -107 29 20 48 39 -17 107 -20 -37 65 1 106 -22 95 -4
2669 -4 8 -48 -58 -39 31 -4 -3 -31 -168 -4 -18 24 -20 -58 -74 -38 -100 -80 31 -43 57 35 -26 -79 90 -83 53 4
2697 4 45 23 -105 -14 4 40 -96 -113 -2 -58 -20 77 34 -67 -29 -55 20 -62 -20 6 -43 -25 33 -132 -44 -55 48 47
2725 47 -35 45 39 24 -73 -19 81 -4 109 146 2 91 42 -51 93 -15 -46 2 -70 -18 -78 136 9 58 -48 14 13
2752 13 -25 -93 -30 -10 -57 -3 67 38 -7 13 -14 77 157 8 -15 0 12 52 -1 -46 -21 -75 156 -53 0 -29 23 -20 79
$$ packed form
2560a16J51n9k6n3J45K6j15lm9P8J9P9j23J77j05n7M8J11n5K0j76PJ47l6P0j07
2586bL9j14J41k1p3n0J12n9m5P4J1j5oO6q4J19j29N8J7l5j41P8O5Ln1L3O8j70
2614a11J00m5K2J41o6k6l9Q8M3o8O4j01J2o1pR6n7p7L9k2J47m1N8o9Kq5J22n5
2642Dk1%L2K3J9J5p1j66K58q0j8j63O1J36rK8rn6J24j27j7J02o4J05j28J17r9
2669dJ2n6j0J9P0l5Jk8j37J64j4M2m4l8j6L6o2K0J11p4J00k2o1n3J69j73J36m9
2697DM1k2j28R1J8L6j36j7J11n6L8R7m3j01L8k6P5q2M2K6m9J8N8j65Q8j1J03j
2725D7q2Q0oj5r7N4J00q5J13L7j44Q9m9r3J44j08l1M8p2N2o0K14j27M9j06O2j
2752A3l8o8O3K0m7N4P0k9m5K0k7R1Q0j49k3J5J2M0n3m5K5n4K31k09N3k9N2m3R9
$$ plain form
2781 79 -118 -61 -32 1 -33 -28 -113 23 -67 -135 53 34 -7 88 -20 -101 17 -61 -40 -4 16 93 70 38 -6 48 -7 24
2809 24 -19 48 -50 -9 102 29 14 -113 -48 -77 55 -46 64 -10 -30 125 -76 -71 -46 -60 -20 41 -135 59 -67 -2
2835 -2 83 28 4 57 -56 -146 9 88 51 -95 -13 116 1 14 -22 -46 45 -25 9 -83 67 11 -18 108 -62 75
2861 75 -126 -15 -15 -12 126 51 54 -87 36 80 -46 -67 33 -36 10 -115 37 30 18 -61 1 93 104 20 -60 -48 -138 -36
2889 -36 -65 28 44 112 -24 50 -5 -77 14 91 -12 -80 -42 -146 67 -81 -13 -145 63 -35 115 -31 -133 -35 -47
2914 -47 -68 -81 -33 -9 16 -28 36 -66 -29 -60 9 -1 72 86 2 -22 12 -37 21 -10 52 73 17 -48 66 4 -61 16 -138
2943 -138 -1 -3 -21 26 85 -7 33 -60 181 73 -66 -16 113 108 -17 16 -99 -64 -42 -81 45 -12 -9 -45 66 5 -71
2970 -71 -18 -55 -60 -68 -7 24 -83 -6 55 84 35 91 -49 -12 -14 -174 41 8 -32 89 -85 77 -32 10 97 -28 -26 38
$$ packed form
2781G9j97N7K9L3l4Nq5J36r0o8J88j9m1R5j08q1J18p8K1L6K0P7k3l2m4N4n5L1
2809B4m3O7r8M1J11p3j5j27O5k9J32j01J10p4k0J55k01NK5j4M0O1j76J94j26O5
2835bQ5n5k4N3j13r0J55P9l7j46Q2J29j15J3l6k4R1p0L4r2J50n6k9J26j70J37
2861G5k01J11%LJ38p5Lj41J23M4j26k1J00o9M6j25J52pj2p9O2R2J1q4q0J2r0J02
2889c6k9R3J6O8j36P4n5p2R1P7j03o8L8j04K13j48O8j32K08r8J50j46j02R8j2
2914d7k1j3M8K4K5m4O4j02L7l1O9j0P3J4q4k4L4m9N8l1O2K1n6o5J14o2o5P7j54
2943a38J37kj8M7N9r2M0r3K41j08j39N0J29nj25L3j15L5K2l9J26n7Ll6J11o1p6
2970g1N3l7nqO1L1j07P7O1K9m9N6j40L7kj60K15l3m0J21j74J62j09M2Q7j25KO4
$$ plain form
2998 38 -36 92 129 21 55 -86 26 -80 33 44 96 -18 20 31 36 -41 41 -166 -25 38 -81 -55 -135 -79 149
3023 149 -62 122 -21 87 -25 5 -8 -19 -9 58 54 -147 117 88 16 91 -17 123 65 -78 95 -20 35 44 9
3048 9 67 -15 48 111 -58 -110 -124 -157 -16 5 105 -24 -17 -39 26 80 12 -31 31 4 -53 -52 4 56 25 73 -29 75 45
3077 45 75 -37 -34 1 -53 -140 -117 -57 -41 -31 19 49 -27 -74 -125 -18 86 27 -3 97 -180 -62 -89 108 -85 45
3103 45 -55 66 -51 30 -47 -68 -12 -16 100 23 -53 24 -59 74 26 -67 149 27 63 -124 -70 -53 -10 0 -153 -59
3129 -59 -49 -34 31 38 61 -50 -39 25 23 -25 -56 53 -116 -35 13 28 -104 -14 26 72 -8 7 -58 -82 23 -29 -8 73 -16
3158 -16 -37 7 -12 84 42 -12 -11 -15 -103 30 43 -13 66 -109 97 41 -9 24 107 -87 12 56 -13 11 38 -39 -42 -51 -68 52
3188 52 -39 -30 90 0 -28 6 -21 43 56 8 117 84 18 34 1 -64 -16 -20 18 39 -133 -78 -11 -8 -132 -70 -33 -69 38
$$ packed form
2998C8p4J28L7j08L4j41J12j06J13J1N2j14L8J1Np7Q2k07J41O3j19K6q0N6K28
3023A49k11J84j43J08j12L0j3j1J0O7mk01K64k9p2P5j08J40n8j43J73j15N5Rl5
3048IN8q2O3O3j69n2j4l3J41K1J00j29Pk2O5N4o8m3O2k7n7JN6N2l1M8j02J04l0
3077D5L0j12LL5n4q7K3O0J6J0N0L0p6m7n1J07J04n9l0J00k77J18k7J97j93J30
3103D5j00J21j17Q1p7k1N6mJ16p7p6P7q3J33m8r3K16j22L6j87N4J7M3J0j53R4
3129e9J0J5O5PK3j11J1O4km8l1J09j69Q1M8J5j32R0M0M6q0J5o5k4J05n2K1Q1q9
3158a6k1M4j9R6m2n4Jmq8J33J3n6P9j75K06n6n0L3Q3j94R9M4o9K4K7p7lrj7J20
3188E2r1RJ20r0k8L4k7O4J3m8J09l3o6J6l3o5M8mL8K1j72N5O7Lj24O2L7l6J07
$$ plain form
3217 38 36 -53 75 50 21 67 7 33 96 20 -47 -61 -1 9 -22 -35 -25 164 -74 18 10 13 -10 39 -6 -75 7 163 58
3246 58 -82 -41 -70 53 82 -8 1 74 15 -22 -13 -17 -22 -95 -33 -57 29 -2 21 -33 66 -51 -39 -33 66 6 14 99 13 -12 -7 18
3278 18 -62 -116 12 45 52 20 77 -76 42 151 -7 121 -3 99 18 101 29 -38 10 -33 -16 -56 24 -163 -27 -58
3304 -58 -43 29 -71 -143 -48 -73 -39 -46 52 -16 26 2 -38 49 140 -21 13 -50 43 -23 -44 22 57 -21 17 79 75 3 117 14
3334 14 -52 40 -54 -23 25 25 -19 -40 -55 -60 22 -56 -35 23 87 -48 -59 1 -31 21 47 4 -66 -22 11 -12 30 48 63 79 139
3365 139 -9 22 49 -102 -27 2 -78 9 -63 -78 3 15 84 35 -1 14 19 34 -17 -5 37 -8 78 11 -43 69 25 149
3393 149 75 25 57 -106 -5 36 -18 74 120 -16 45 95 -25 96 -22 30 -56 -26 -55 34 -25 90 -24 -18 84 -28
3419 -28 -11 -26 -36 -61 -89 92 99 56 58 -91 71 -39 -49 -7 -44 -44 -4 39 -50 -30 -72 -36 -35 -20 -117 -96 78 -15 -15 -76
$$ packed form
3217C8kq9J28k5k9M6o0K6O3p6o7j4O0J0l1j3J0J89k38R2qLk3M9m5o9Q2J56j05
3246E8j40M1k9J23K9r0RP3n9l7Rmnp3O2k4Q6l1K3n4R9j17J2OR9o0QQ5q6k5NK5
3278A8q0n4J28L3Pl2N7j53J18J09j58J28j24J02q1Q3p2o7M8m3J7m0Q0j87J36l1
3304e8J5P2j00p2R5k5L4pR8o8M2k4m0Q7R1j61L4o3R3o6k1O6L5p8L8O2mp2J14j03
3334A4o6R2r4L1M8%m4k1j5nQ2p8K1N8O4j35j1O0l2N2K6m3p0M4L3k3M2J8J5J6O0
3365A39j48L1K7j51P5K9q0Q7p2j5Q1J2O9m9l6J5NJ5n1J2M2m5Q6o7n4J12m4J24
3393A49p4n0L2j63J01M1n4R2M6j36O1N0j20J21j18N2q6L0k9Q9n9J15j14OJ02j12
3419b8J7j5j0k5k8J81Pm3Kj49J62j10j0M2l7%M0M3q9K0m2L6JJ5r7K1J74r3%o1
$$ plain form
3449 -76 72 92 7 11 52 -57 88 -118 -5 2 -65 -49 96 49 -73 -64 -66 -22 54 61 48 -10 -21 52 5 -26 -12 -39 -54
3478 -54 6 -38 34 90 -54 80 -90 17 54 -10 54 42 -38 -22 -9 47 135 102 9 -16 -125 -142 -51 -52 -34 69 -13 48
3506 48 15 16 118 29 16 -88 -33 27 -30 22 14 6 77 -54 -3 -55 -53 -24 121 -53 16 -54 30 -26 -1 56 -83 10 71
3535 71 75 -35 41 -125 50 -73 -26 -24 -37 -81 -4 -16 -86 -10 -48 11 -108 36 51 -6 51 0 -89 41 -91 -65 26
3562 26 78 -44 35 17 -39 -74 -60 -21 -104 -10 26 52 -38 -88 -94 -124 59 -47 -18 64 17 -41 -65 -16 25 38 6 -19 55
3591 55 8 53 0 -153 8 1 -174 80 80 -26 6 139 -1 1 119 12 -135 20 116 33 117 -112 60 -43 -50
3616 -50 39 57 -117 -55 -9 28 -53 45 -14 19 18 10 -31 -12 71 17 -54 -57 -32 -99 -62 -32 92 48 -34 26 -1 -34 105 120
3646 120 34 -19 -66 54 -21 113 -20 -53 -35 12 -48 -5 -48 46 -33 -3 143 -58 51 -93 -55 82 27 -48 32 64
$$ packed form
3449g6J48K0q5MM1j09J45k06J13Po7J6J45m7j22RkM4P6Pj3n8j1P3m7l1J4k7j5
3478e4O0m4P2N6j44J34j70J07L7o4O4j2q0J6J3N6Q8l3r3k5j09j7R1jJ8J03q2O1
3506D8l3JJ02q9j3j04N5O0n7N2qqP1j31N1n2KK9J45j74O9p0Q4n6K5N7j39R3O1
3535G1Mj10P6j66J75j23M7Kj3m4P7j2p0P6l8N9j19J44J5n7N7n1q9J30j32K6R1
3562B6N2j22P9j8n6l5J4L9q3R4L6K6r0n0ol0J83j06K9Q2m7n8k4M9M1J3l2k5P4
3591E5m7M5n3j53J61pj75K54%j06L2J33j40KJ18j07j47J55R6q3Q4k29J72j03p
3616e0Q9J8j74O2M6L7q1R8n9L3jqm1J9Q3n4p1lK5o7L7L0J24m4q2O0k7l3J39J5
3646A20q6n3m7J20p5J34j33l3J8M7o0M3m3R4p9L0J46k01J09j44L8J37n5p5Q0L2
$$ plain form
3672 64 35 -68 20 -94 101 19 -64 -42 -77 50 -21 -32 63 4 -79 30 13 -31 75 44 -119 23 -111 -107 60 75
3698 75 70 -65 -55 8 -100 -67 83 -12 2 50 19 -131 -38 -46 58 33 24 -118 48 75 -88 62 35 63 39 37 2 -43
3726 -43 52 -80 61 23 -48 8 -77 -6 32 32 88 -63 -29 31 -23 28 -77 -1 -85 -9 -2 46 5 62 -93 12 -53 -27
3754 -27 -2 -58 45 -64 -54 86 94 74 57 78 58 36 -41 15 -37 26 5 5 75 -90 34 21 66 36 -35 -42 -15 -22 -38 -46
3784 -46 83 84 106 14 48 21 28 24 -87 -27 -113 33 80 -38 -33 -31 -37 12 4 35 40 81 -3 9 -43 -21 -51 21 -22 -15 41 21 -37
3817 -37 24 48 -45 123 68 -27 24 58 -75 63 39 -63 37 -12 -55 -10 -34 80 39 27 -92 -35 -46 -24 1 43 57
3844 57 -62 36 -99 -28 -30 -38 91 42 -36 25 35 -14 98 110 -53 29 -36 -100 -29 -14 73 17 223 -13 -87 -52 105
3871 105 108 -103 -41 -72 54 68 22 4 114 -34 28 -24 18 -76 44 122 -14 -30 -43 54 64 45 -62 103 37 -16
$$ packed form
3672F4k9j03Q8j14J95q2q3K2l5J27p1j1R5n9q3J09j7m4J06l1j63J42j34MJ67J5
3698G5nj35J0O3j08L3J50r5J4M8l1j50R3qJ04k5rj42J66K7j63J50k7K8k4kl5m5
3726d3R5j32J41l8p1N6q5P1L8%N6j51L4O0n4N1j05P6q4P6PM8m1N7j55J05o5K6
3754b7K5n6J03j09J0J40Qk0j7K1k0k2p7N6n2O3k1%P0j65J24j3M5l0p1pK7pj6q
3784d6J29JK2r2L4k7Pmj11O0q6J46M7j18NKoM9qL1NM1q4J2n2K2l0P2m3PN6k0n8
3817c7O1K4r3J68n5r5N1L4j33J38k4j02J00m9m3M5k4J14m1j2j19N7j1K2K5M2J4
3844E7j19R8j35P1kqJ29m9p8O1J0m9J12J2j63Q2o5o4P1J5Q7n6K06k36p4L5J57
3871A05Lk11O2l1J26J4m6j8J10j48O2n2M2r4J20P8j36j6j3R7J0j9j07J65o6n3
$$ plain form
3897 -16 -7 -24 13 -29 -21 -16 9 -136 123 18 44 38 72 -15 115 -26 -79 -38 -1 -87 -1 -31 118 54 -17 50 -97 -37 -10
3926 -10 -8 -111 -83 -49 -7 7 -149 -84 19 12 -51 -49 35 -71 10 3 0 52 -48 48 -86 105 -42 23 60 -55 -66 -120
3954 -120 -44 -22 20 8 136 48 22 -7 -22 1 -53 -110 -71 24 -28 -63 34 21 32 22 -64 -62 -76 101 -75 -117 48 -28
3982 -28 -44 51 39 -17 20 -50 52 34 114 29 84 25 -123 -88 -2 -66 6 -7 -28 -21 1 -48 -72 59 -92 87 -39 98
4010 98 -32 -27 22 -123 23 26 -23 -55 56 -74 -79 46 36 -28 -24 -43 81 83 -45 -74 -91 71 76 -36 82 96 33 96
4038 96 34 -15 -76 18 4 -8 68 13 -89 5 -115 -21 83 -112 7 -8 -71 -69 -6 -12 112 76 -46 -51 -58 -50 -51 0 21 84
4068 84 63 71 -58 -68 3 -23 -81 17 72 45 70 -74 18 -12 24 -134 -73 -29 -3 94 69 45 47 -54 -5 3 -61 69 -7
4097 -7 -78 -27 -6 -26 -101 32 23 -48 -44 31 18 -93 41 -111 -63 27 -41 -8 64 -56 -3 -29 99 67 56 24 21 72 49
$$ packed form
3897a6Rj7L7m2QNK5j45K59j05K6oL4q7J30j41n3M1L7q6Q6l0J49o4p1O7j47O0K7
3926a0Kj03K8L4M2J4j56O5J03po3KQ4j06Q1plN2j00R6j34J91j47O5L7j15j1n4
3954a20P6K2M2j2J28q8k6k9j5K3n4n7L9R5n2l5R7j3J1j0q6Kj4J77j76m2J65p6
3982b8j6R5j2n6L7p0J02j8Q0q5N5n9j48L5Q6o4P2j3k1PK2m9k4J31j51J79j26J37
4010I8j30NM9j45J46Lm9l2J11j30nJ25j0o4Mj9J24Kj28k9j7J62Nj12J18J4o3O3
4038I6o2m9o1R4j4j2P6n5j02R4j20R4J04j95J19j5o3KO3oJ24l6j22npQjN1K1O3
4068H4k1Qj29j0P1k6n8R8N5k7K5j44R2l0L6j58O1M4K6R7k5k4Kj01M9Qo4J30p6
4097gp1N1K1k0p5J33rp1MP5j3j11J34j52M8R0o8L3P2j20N3k6J28l2j1l2lN1k3
$$ plain form
4126 49 23 -43 -22 13 -64 61 57 -1 44 10 -186 0 82 -66 -1 -11 -112 -45 82 27 13 -76 32 19 106 67 12
4153 12 42 -64 96 6 -83 -10 -16 94 -104 32 57 28 22 -48 -38 -10 -57 6 -28 43 -21 3 -66 43 27 -14 37 -45
4181 -45 -51 -31 42 31 49 100 19 -22 -63 167 -30 -106 68 55 41 -14 -64 23 -107 -38 70 97 8 8 -110 33 40 -58
4209 -58 96 25 0 -13 41 -27 -23 -104 31 13 64 93 -26 -93 90 -95 0 -7 107 -82 -45 -30 14 -72 -13 18 -111
4236 -111 -46 0 113 24 69 -58 47 7 -31 40 -39 27 -57 64 -53 -73 94 72 2 -64 67 -66 -30 29 -44 -65
4262 -65 56 -79 -75 -37 21 -17 67 -13 -22 24 -63 46 -5 -9 60 -48 43 -29 -9 54 53 -18 -104 70 22 -45 -65 71 -53
4291 -53 -59 61 -36 68 -2 117 16 -77 103 -55 55 45 -122 6 -28 -79 36 8 -37 10 17 48 110 -30 5 -35
4317 -35 10 -19 -13 -105 85 -8 -59 -119 -76 -83 40 -19 -7 26 -78 -22 109 -203 -56 0 59 56 -79 28 26 30 131 24
$$ packed form
4126D9k6o6K1L5p7J25mn8M5l4j96J86Q2j48O5j0j01O7J27n5j4q9J08j3Q7l9n5
4153A2L0j06J60r0q9P3oJ10j98J36K5k9op0J0K8m7O3l4P1o4K4o9J09j6m1N1q2
4181d5oK0P3j1J8N1q1m1m1K30j97p6J74j3j4n5n0Q7j30O9J08K7q9%j18J43Pr8
4209e8J54p1k5j3N4o8Mq1J35j8N1K9j19o7J83j85R5pJ14j89L7J5M4q6N9L1j29
4236a11O5M6J13q9M5j27J05m0l8P1p9O6q4J21j17k0J67k2p0o6J31j33L6N9p3k1
4262f5J21j35ML8N8l8Q4q0rM6q7J09n1mO9j08R1p2K0O3jp1q6J74m8o7k0J36j24
4291e3oJ20r7J04p0J19j01r3J80j58J10j0j67J28l4n1J15k8m5M7PL1O2j40L5m0
4317c5M5k9Or2J90r3n1o0M3pJ23n9J2L3j04N6J31l12J47N6N9lj35J07kMJ01j07
$$ plain form
4345 24 -32 -39 0 -20 -42 -29 25 -51 -88 -174 54 -80 -87 -50 -90 128 74 126 64 -42 -50 37 33 105 -19 -2 -86 -48 -52 44
4375 44 -63 -41 136 -54 -195 -59 73 -106 88 -24 1 55 -48 46 -3 -86 -34 59 13 46 -16 45 -48 -143 27
4400 27 11 46 66 -33 20 15 -50 -38 46 -66 159 163 87 -10 -27 23 51 52 -101 -22 122 -10 108 -115 37 -24 27 -33
4428 -33 97 -16 7 -39 36 -14 -64 -183 -10 -5 -63 34 60 -15 39 -57 -31 -55 -49 32 52 43 -13 -66 -33 16 67 38 -86
4457 -86 119 -124 66 -58 10 -13 30 -100 31 57 -20 -41 65 122 -37 62 -80 68 -38 14 -51 51 -114 68
4481 68 73 20 -38 -62 82 -47 97 -8 107 6 -14 14 94 33 -9 -17 -79 62 -10 -82 -256 -56 16 24 8 15 -93
4508 -93 -215 0 3 67 -16 69 -90 -15 -50 -127 -65 4 -51 -44 0 67 -55 60 -2 -39 -123 -31 89 -1 86 -28 37 34
4536 34 37 -20 8 -41 -54 -20 -19 76 18 -16 -70 50 90 -141 59 -24 -7 31 -85 -119 -67 -19 -97 12 39 -118 23 -5
$$ packed form
4345B4n6pL9k0k2J3N4p6l7q6K28j34pL7m0K18n4N2o2j06qQ7mP2j24J7q4L8mR6
4375D4j07K2J77j90j41J36J32j79J94j12K5N4j03R4m9q3N2R3m6L3o2O1r3r5J70
4400B7j6L5K0r9N3no5J2Q4j12K25Mp6r7j7N0K8Jj53P9J44j32J18k23J52o1N1o0
4428c3J30j13K3m6P5n0n0j19J73Nn8R7K6p5N4r6K6k4OQ1K0rn6n3L3M9N1k9j24
4457h6K05k43J90j24O8k3M3j30J31K6p7k1J06N7j59R9j42J48j06N2o5J02j65J82
4481F8Nn3n8k4J44j29J44j05J15j01k0K8Q0o1m2qo2J41p2p2j74K00P2Qj6Pj08
4508i3j22K15LO4q3Q5j59P5l5p7O2O9n5PM4O7j22J15o2l7q4R2J20r0Q7j14O5l
4536C4Ln7K8m9j3L4JR5n8l4n4J20M0k31K00q3J7L8j16l4N2M8p8J09K7j57J41k8
$$ plain form
4564 -5 -116 50 97 65 4 -51 -85 -129 92 -71 -51 -113 59 -150 32 -102 -28 -134 35 -74 71 117 27 78 62
4589 62 17 -41 -134 -78 -81 115 14 19 -30 16 -8 -4 17 -28 -42 -49 77 -26 102 -37 -25 -66 62 31 -46 52 -24 -40 33
4618 33 -5 29 -24 12 -47 -128 10 58 -35 -18 63 -54 29 -92 86 99 49 38 6 82 -72 -44 -84 -29 -35 -20 14 -63
4646 -63 8 -39 -82 -58 82 -67 -53 37 36 35 -64 22 69 -13 76 -16 -50 -75 76 28 -63 -78 -73 -21 -56 38 52 6 15 -30 87
4677 87 88 -75 35 -69 35 -19 -28 -94 31 -61 17 -80 -45 -95 -14 -60 -140 4 49 -5 52 10 9 32 19 28 37 -41 -82 -37
4707 -37 36 44 -30 182 46 -42 -8 -28 -19 19 60 56 52 -87 164 35 100 5 23 -60 22 -67 -16 -20 -62 -92 -120 31 -99
4736 -99 -11 8 41 54 -4 -32 -120 -32 42 -6 -81 43 100 -21 -16 59 -89 -5 18 -46 -82 -19 -4 19 2 19 89 26 41
4765 41 33 -9 31 17 17 80 -66 68 -34 46 50 -8 21 -66 96 8 -52 45 -39 18 -37 0 57 65 19 87 11 56 10 -20
$$ packed form
4564ej11J66M7l2o1n5l4m4K21j63K0o2J72k09J82j34P4j06J69j09J45M6r0N1j6
4589F2m5n8r3N6lJ96j01Nm9M6k4MK1m5j4pJ26j03J28j39J2m1J28l1p7R8p6j6P3
4618C3l8L4n3L6n9q1J38M8r3J7Q1j17Q3j21J78J3n0j1l2P6j54K8m0N5oJ5L4p7
4646f3P1m7m3K4J40j49J4R0jjr9Q6M7q2Q9r2l4k5J51m8r1j5NN2l5R4J4m6Rm5J17
4677H7Jj63J10j04J04n4ro6J25r2P8r7L5n0Q1m6q0J44M5n4N7m2jK3j3RRp8m1M5
4707c7P3Qp4K12j36q8L4k0RL8M1mmj39K51j29O5r5J8q3Q2q9N1mm2l0k8J51j30
4736i9Q8J9L3J3n8k8q8Q8P4m8p5J24N7j21NP5j48Q4K3o4l6O3J5K3j7J7P0o3J5
4765D1qm2M0j4%O3j46J34j02Q0Mn8K9q7J62q8o0R7q4N7n5L7N7Qm6O8p6M5m6l0
$$ plain form
4795 -20 26 17 22 38 3 39 26 63 -124 -78 -90 -45 -52 -4 -103 16 -79 -66 -17 -63 28 134 140 45 -13 3 -77 52 30 -6
4825 -6 27 -8 31 -23 68 -20 -15 197 41 -4 124 7 -50 -8 -51 -18 -54 -7 -28 -9 -105 16 3 97 117 -8 35 34 28
4854 28 12 94 -46 24 10 22 10 45 -105 8 142 60 30 -42 -22 26 39 98 -36 -118 -47 82 -57 -24 34 78 90
4881 90 54 39 32 -21 -39 -6 16 -112 -12 -41 17 -15 -38 -47 -160 -24 46 26 -8 4 7 -62 -6 46 2 -31 -22 20 -121 -57
4911 -57 79 -40 35 -17 52 -53 18 2 -100 -41 -128 79 -15 10 159 43 -1 -84 -30 -54 -81 -20 44 -33 -50 2 -63
4938 -63 29 -75 -31 -18 -54 43 43 -50 81 12 -40 -19 21 60 -79 -39 -21 18 -8 -30 49 -31 -27 46 -66 105 130 -62
4966 -62 107 -39 -47 -93 -34 9 -54 -48 33 -23 -25 -81 -135 -48 3 -90 -50 -102 -4 45 -77 -114 37 -77 -18 -50 -44 49 -39 23
4996 23 26 57 100 61 42 151 23 -146 22 36 -2 111 -90 -1 -129 11 28 76 43 -46 -62 -27 17 -69 -3 -17 63
$$ packed form
4795b0M6rNJ6l5L6j3L7j87M6j2M5pM8r9J19r5J3M9m6R1J06Or5n8J6q0J29k2l6
4825fL3l5L9n4R1q8NK12j56m5J28j17n7M2m3L3l6M7k1J9r6J21j3R4K0j25M3jo
4854B8j6Q2j40P0j4J2j2L5j50J13J34q2l0p2K0M8J3N9j34q2P1J29j39L3N8M4J2
4881I0l6j5pn3j8L3K2j28J00k9N8l2k3rj13J36P0k0l4J2Lo9N6N2m4l3RM2j41O4
4911e7J36j19P5n2O9j05P1j6j02N9q7K07r4K5J49j16m4q3N4k4k7O1O4p7j7N2o5
4938f3R2j04M4J3l6R7%r3J31o9n2K1M0L9j39M0J8L9k6k2P9q0MP3j12J71K5j92
4966f2J69j46qm6N9M3o3OQ1n6kn6n4Q7N1r3M0n2R8M9j22l7J51j14N9l2OR3q8O2
4996B3LL1M3l9j9J09j28j69J68J4l8J13k01Q9j28J40J7M8l3q9j6L5M4q6O6j4Q0
$$ plain form
5023 63 106 -182 1 24 -69 29 44 -18 39 35 -61 17 94 61 88 93 -34 77 8 -128 -29 78 -33 27 56 -39 -133 11
5051 11 -14 3 42 18 -78 -50 -35 56 -73 18 16 -38 58 45 -31 -120 -59 -59 -49 -92 -42 43 -49 84 -56 -51 26 -27 75 117
5081 117 -70 13 -4 37 -54 -81 23 35 -68 -29 4 -80 -87 -56 51 -88 15 2 100 -1 -17 24 -5 50 17 38 -112
5108 -112 65 -22 -35 5 124 47 92 -38 -16 -94 -31 48 58 -19 62 -122 19 18 -110 27 -17 23 6 0 -90 -31 -72
5135 -72 20 12 -121 21 -90 25 -76 -12 29 -138 70 -113 25 70 24 8 127 23 -54 53 52 140 -15 13 23
5160 23 -26 -45 -93 54 -46 -99 50 -106 -18 94 -40 112 -13 -89 75 -6 43 -34 120 86 15 10 -92 93 126
5185 126 32 -85 -56 -51 -26 -11 -92 34 -52 -22 10 -109 -43 93 -66 29 72 45 -46 -22 48 -29 75 -64 55 6
5211 6 -62 24 45 -12 -45 85 102 44 82 2 -37 70 -40 -41 58 3 169 -11 74 -93 -17 7 86 79 -63 -29 23 34
$$ packed form
5023F3M3k88J83K3r3R8J5o2N7mr6P8P7l3K7Nj27J11o9j36R9J07j11O0K9r5r4J44
5051A1k5J7L9k4r6K8J5R1j29R1kn4R6j3p6q9O1%J0m3N0Q5r2J33j40NP7n3J02M2
5081A17j87Q3j7M1r1k7J04J2j03L9L3q4pL1J07j39J03j3R8j01j6M1k9N5l3K1j50
5108a12J77q7j3M0J19p7M5j30K2p8O3P9J0p7Q1j84J41jj28J37m4M0j7or0N9m1
5135g2R2qj33J42j11J15j01O4M1j67K08j83J38M5m6j6J19j04p7J07jQ8j55K8J0
5160B3m9j9m8J47j00n3J49j56Q8J12j34J52j25p6J64q1M9p7J54l4p1nj02J85L3
5185A26r4j17K9NK5J5q1J26q6L0L2j19O6J36j59R5M3k7r1K4P0p7J04j39J19m9
5211Fo8Q6K1n7l3J30J7n8L8q0l9J07j10jR9n5J66j80Q5j67P6K4P9pj42L4N2J1
$$ plain form
5239 34 -27 -48 50 36 -121 -46 28 -67 -64 -153 125 45 -35 -58 9 51 -18 21 8 37 52 -3 14 -106 -27 -6 -4 -24 -18 -66
5269 -66 63 34 56 45 6 -32 73 0 -1 -58 45 59 -42 4 -15 21 7 124 90 141 40 -42 -55 -42 10 104 -2
5296 -2 -59 -21 -30 47 -6 -24 -101 -46 -60 43 0 53 9 -34 -14 70 -146 20 7 141 11 24 58 12 -25 -3 122 54
5324 54 101 -8 -46 -90 50 100 85 31 -1 67 -28 128 94 9 25 -7 -41 -7 -73 -12 17 -50 81 -53 7 -73 56
5351 56 -103 18 -26 1 9 92 -9 64 -31 -66 14 -17 43 71 -11 -113 68 -30 -2 23 -6 17 49 21 -39 23 42 6
5379 6 9 -50 61 -33 98 37 1 18 -70 -37 38 66 -169 38 29 -58 82 -35 1 127 -42 -20 10 29 -39 61 -10
5406 -10 -34 58 10 133 72 51 79 48 34 44 30 28 48 -39 57 140 42 64 2 -2 26 -105 -83 21 14 -21 -41 -2 -25 -40
5436 -40 -76 53 -55 -91 6 192 -148 27 53 68 32 -52 21 -2 -65 41 -9 -15 -94 -179 86 -29 -56 22 -124 50
$$ packed form
5239C4o1k1R8j4j57P5P4r5Lq9K78q0q0k3O7M2o9L9j3K9J5n5J7j20P9K1Kk0Om8
5269f6J29k9K2j1l9l8J05p3jn7J03J4j01M6j9L6j4J17l4N1j01q2j3J3N2R4j06
5296bn7L8rP7n3j8p7N5j4J03m3N3m4m3K0Q4k16J66j3J34j30J3L4m6l7K2J25o8
5324E4M7j09l8m4J40N0j5n4l2O8r5J56l4q5J6l2l4L4o6O1K9o7J31j34O0q0J29
5351E6j59J21m4K7QQ3j01P3r5l5Q0l1O0K8q2j02J81r8K8K5k9K3L2k8o0O2J9l6
5379FLn9J11r4J31o1l6J7q8L3P5K8k35K07rq7J40j17L6J26j69K2L0J9o8J00p1
5406a0k4R2m8J23o1k1K8l1j4J0j4kK0q7R6Q3r8K2o2mK8j31K2J04pl5k0L9k3j5
5436d0l6J29j08l6R7J86l40J75K6J5l6q4P3k3o3J06n0op9q5K65j15k7P8j46J74
$$ plain form
5462 50 14 -55 -12 25 65 6 41 33 14 -23 -16 -59 -69 -134 -16 -92 91 -12 -96 -2 -153 19 -13 96 43 -43 -39 170
5490 170 104 -43 -51 -81 -5 62 111 19 37 9 24 -5 -52 123 -123 -26 54 80 -52 -62 50 -78 2 -69 -1 1 -44 64
5518 64 -51 60 22 65 6 -41 -107 5 -34 -18 50 43 -41 92 -7 61 -13 25 16 41 71 -139 40 57 69 -8 -14 99
5546 99 -16 63 -25 38 -4 109 40 -49 48 -89 -31 52 35 6 55 -123 -15 -50 -32 -9 -19 -122 -174 52 80 -6 -39
5573 -39 -145 -5 26 35 44 75 84 54 -59 67 11 -5 -5 -97 -25 93 50 22 -22 20 122 -46 -3 -51 -38 30 41 -32 28
5602 28 -132 97 -72 -22 49 65 -12 -68 -68 -83 -40 -60 -65 -68 -99 1 -140 -33 33 -32 61 -11 24 49 15 -24 -106 72
5630 72 -57 73 38 19 55 62 32 -94 75 6 30 -29 -57 -32 -45 -13 -11 -16 -49 64 -67 33 -45 33 29 17 -34 46 62
5659 62 -33 70 12 -15 102 81 15 114 -77 -1 -4 -42 -27 21 26 138 29 36 36 -6 -20 -15 -103 136 -90 -54 -12 21 36
$$ packed form
5462E0l6o9M3L7M0n9L5qj9l7Pm3j0o5J18p6J83j03q4R4j51J72l2J09n3q6MK09
5490A70o6j47ql0P6O7M9r2J8k8J5k9m7J75k46R7Q0K6j32j0J12j28Q0p1O8Km5J08
5518F4j15J11l8M3n9m7o6J12l9J6O8pq4J33r9O8p4L8rK5L0k10J79J7J2p7oJ13
5546I9j15P9q8O3m2J13o9q9R7j37N8Q3j7k9M9j78J08l5J8K3j0j03n2K26K8q6l3
5573c9j06J40L1RRL1Rl0j13J26n6j6%r2P2J18m3k8m4M2J02j68M3m8J3O8J1p3O0
5602B8j60K29j69N0P1J6p7n6%j5M3k0nll1J00j41J07O6o5R3p2L5K5l4l9q2J78
5630G2j29J30l5j9L6Pl0j26J69o9K4n9k8K5j3L2Knl3J13j31J00p8P8mj2n1Q0J6
5659F2r5J03n8k7J17k1o6R9j91P6ll8J5M8NJ12j09P%m2j4Nq8K39k26L6M2L3J5
$$ plain form
5688 36 -24 9 93 76 58 115 40 32 -22 34 55 -101 -121 60 17 -36 25 44 -25 -65 -37 77 23 109 -35 62 1 -48 14
5717 14 -22 13 28 11 5 -46 -42 29 -44 109 -19 16 -49 89 -20 -80 22 16 30 -22 83 27 -43 -23 29 127 83 11 -38
5746 -38 -29 -55 -5 103 74 -18 24 79 34 39 -75 17 175 63 25 33 -79 101 -8 103 -15 76 -51 78 -6 50
5772 50 -51 -55 -13 -35 55 -99 -6 -119 3 -27 -4 -17 -26 -72 -3 96 45 -56 -7 -74 17 7 60 -60 27 45 29 38 42
5801 42 46 4 -81 3 -5 -58 -117 5 62 28 -31 -129 73 -52 105 -88 -20 95 2 -34 43 -8 98 23 24 121 -35 98
5829 98 -51 38 -47 147 64 -72 56 -14 -16 153 -1 23 15 -26 77 16 88 -59 -14 -21 -1 -19 -114 10 -43 63 21
5856 21 -17 -58 39 -106 -24 -106 -90 52 -1 -45 -70 -62 -98 3 69 -47 -63 107 -66 79 -32 72 -62 -20 -96 27
5882 27 60 29 9 -16 33 -39 59 1 70 -70 1 -39 -34 -89 -157 -94 83 -19 -46 1 122 -76 -95 0 46 43 63 -2 25
$$ packed form
5688C6o0L3Q4j7j8N7p5qn4N6K1j56k0J81m3n3O1J9o9m0K8J14n4Q6j44R7o1m9O2
5717A4l6L5J5j7on1MP1p3J53j28L5o5J38j09o0J02oJ4n2J05n6p0K0N2R8m4p2m9
5746c8Rk6N0J08k9r2M2N5m5Nj14R2J58j12l8Qj12J80j09J11j18R1j27J29q4N6
5772E0j01mM2k2R0j54R3j13J22l0K3j3rm6O9R9n1j01M9o7R1j0N3j20Q7J8j6RM
5801D2Mm2q5Q4qn3n9J22N7l4n9r8K02j25J57j93O8J15r3l6P7n1J06p5JR7j56J33
5829I8j49Q9q5J94q3j36J28p0kJ69j54K4qm1J03o1P2j47M5pK0j8r5J24n3J06m2
5856B1l8m1R7j45Q2q2J6J42n3m4k5Ql6J01O6j16j6J70j73J45j11J04j34M2p6J23
5882B7L3l1k0k5M9p2R8n8O9j40P1m0Nn5o8O3J77j02k7M7J21j98j9R5M6lK0o5K7
$$ plain form
5911 25 89 -23 53 -1 8 36 -63 25 -22 132 -13 -13 -42 26 -51 -36 -2 16 -52 18 -9 -89 14 53 9 -35 78 -48
5939 -48 -126 -78 -144 -81 -59 -82 14 52 41 -49 13 31 26 204 -61 15 -15 62 39 10 79 -139 29 4 67 -97 -55 74
5967 74 -100 99 37 -14 -54 -29 82 -14 69 -46 -98 10 78 -11 -110 -104 -79 65 -10 27 -3 83 -6 -93 -27 -19 -43 -68
5995 -68 -54 93 198 -23 84 -24 4 -10 56 -50 13 -103 2 -35 91 78 35 -105 23 -32 79 21 4 -113
6019 -113 93 53 -56 50 -34 -18 -11 -28 -7 27 -67 -21 -14 34 -43 -8 24 -42 -35 -72 31 -89 -45 180 17 73 -18 -51
6047 -51 49 9 142 -26 -95 -12 -83 -13 14 -13 8 -20 48 -75 45 77 21 -146 69 92 3 83 25 -98 -39 27
6073 27 -26 -44 -47 19 58 -1 -25 23 -95 -6 -34 46 -50 20 -3 -6 -55 -51 85 65 49 108 40 137 -27 -167 -36 -48 -82
6102 -82 3 53 -74 -85 108 -67 -49 168 24 -57 -50 -11 33 45 133 47 -26 77 -76 32 -12 -61 11 21 71 -14 -112
$$ packed form
5911B5O4j12P6n4RK8r9Q8m7J54j45%k9O8p7J5L4J8o8P0k7q0J03L9m4m4J13j26
5939d8p8M8o6O3K2k3R6L8j1r0O2J8nJ78k65P6l0P7k3k9O9k18J68k5O3j64M2J29
5967G4j74J99o2n1m0K5J11r6Q3j15n2J08O8q9r9OK5J44p5L7l0Q6q9q7O6Qk4k5
5995f8J4J47J05k21J07j08K8j4O6j06O3j16J05l7J26j3m3j40J28n5J11n8j7j17
6019a13K06m0j09J06q4J6Pj7K1L4r4M6PM8p7L5L2o6Pl7J03j20M4K25j63N6r1l3
6047e1J00m0J33j68o9Q3p1P0K7k7K1k8O8j23J20L2n6j67K15K3q9Q0n8j23N9O6
6073B7n3j8lO6L9n9k4M8j18Q9k8Q0r6P0k3lm9MJ36k0j6N9o8R7j64j40J31j2l4
6102h2Q5N0j27j1J93j75J8K17j44q1PL9M4J2Q8q6p3J03j53J08m4m9P2J0N0q5r8
$$ plain form
6129 -112 43 -54 -71 -55 99 -94 -61 19 -144 61 -4 -36 44 71 -42 106 -50 -10 78 -15 -21 -34 -23 35 57 18
6155 18 -35 55 28 138 -10 51 24 -38 -5 56 24 -21 -12 18 -25 -11 125 20 -13 -68 -9 8 27 -38 59 29 77 8 23
6184 23 -90 -58 142 -48 1 59 24 15 -16 -20 25 20 -5 -17 -15 99 -28 -43 -26 -15 -33 -11 41 -83 -29 -21 -40 -83 -7 -23
6214 -23 47 25 63 -46 45 15 37 58 163 11 -39 20 79 -21 -76 3 66 -61 -59 117 -37 124 -38 34 -1 -94
6240 -94 12 -62 3 -76 36 -53 15 130 -6 34 23 76 67 100 -41 -7 43 -104 5 73 61 46 75 -5 -36 11 115
6267 115 15 12 15 23 -53 1 170 0 -115 -75 43 6 -84 -19 78 -16 -5 53 68 79 14 145 17 81 -219 2 -68
6294 -68 -15 -98 -7 -106 -24 -34 -59 5 -48 -40 16 -34 -20 137 -73 -68 -73 -20 87 -8 44 64 6 12 -49 16 -41 37 12 71 13
6325 13 8 -100 -99 38 -38 67 84 120 1 3 95 -146 165 -47 -8 13 -28 50 56 89 11 32 -21 -74 -11 155 74 1
$$ packed form
6129a12J55r7j7J6J54j93L3Q0j63K05o5l2Q0K7j13J48j56M0Q8r3oj3J1N8K2l9
6155A8n3R0k7J10j48O1k7o2L3O1l2m5RL0m3J4J36j05l3n5N9J7J9o5R7l0M8o9J5
6184B3j13L2K00j90M9N8l5rl1mM5nk5j2KJ14j27j5J7J1j8K2N2j24N4Qj9m3P6j6
6214b3P0k2L8j09R1l0K2K1J05j52n0N9N9j00n5P9O3j27KJ76j54J61j62P2l5r3
6240i4J06p4O5p9J12q9O8J15j36M0j1N3rL3j41L4N0j47J09O8j2j5K9q0l1M7J04
6267A15j00lLQp6N4J69j70j15M0J18l7r0O5R7r4J1N8J5J1o5J31j28O4l00K21p0
6294f8N3q3R1r9Q2j0k5O4n3QN6n0J4J57k10NnN3J07r5N2K0n8Oo1O5n7P8k5N9n8
6325A3nj08JJ37p6J05J7L6j19KR2k41L11k12L9K1m1P8OL3p8K1n3n3O3J66q1p3
$$ plain form
6353 1 22 49 11 -3 108 85 77 -36 44 -33 -16 -45 -8 -112 5 -26 -10 21 57 32 -98 32 -39 -10 -19 -153 -85 11
6381 11 -21 -29 30 -108 -67 9 104 -57 4 -41 62 0 -57 -53 -69 -27 -64 -143 89 56 -83 132 70 -124 77 54 87
6408 87 49 24 -42 -16 17 -66 -152 21 -15 -81 156 7 -18 -36 7 47 60 90 112 74 209 29 -10 -9 -18 -69 -130 -82 82
6437 82 18 44 -14 28 -120 27 -23 61 7 -77 29 24 -60 -25 36 -26 -68 -152 -89 -55 -93 8 64 29 -56 55 -15 -47
6465 -47 113 110 73 20 -13 49 -45 -99 5 17 79 -7 -76 30 37 -56 32 -49 6 -19 95 -122 -133 -136 -110 -88 -20 -13 -25 -63
6495 -63 66 9 31 55 -10 56 -17 4 -70 -100 -28 29 165 -59 22 56 -38 123 93 58 52 -52 -73 101 31 -2 -120
6522 -120 50 -6 53 11 56 -110 -24 -3 -94 23 64 22 -105 51 33 -23 10 0 -2 47 57 4 39 24 8 -82 13 -43
6550 -43 -66 85 -37 -46 11 23 38 -30 42 -62 -6 94 -11 29 15 99 23 -8 -108 4 -74 -25 3 30 -23 -78 11
$$ packed form
6353AK1K7l8j4J11k3qj13Q0p7J7k9L7j04J17l1J6L1L6k5j30J30p1K9rj34O8R6
6381A1l2qN9j38M1P6R5j61O1m5J03o2n7Mj6M2l7p9K32l3j39K15o2j94K01k3L3
6408H7l8k5o6K6L3q3q6J73l6o6K37j49k5j8M3M0J3L0K2l8J35j80l9Jrn1o1M8J64
6437H2o4K6n8M2j48J47n0Q4n4q4J06nq4L5O1o2m2q4O3L4l8J01N6l5q5J11p0l2
6465d7J60ll7n3l3O2r4n4J04J2O2q6o9J06Pr3Q8q1N5k5J14k17j1lK6K2O8Pj2l8
6495f3J29n7K2K4o5O6p3K1p4l0P2N7J36k24Q1L4r4J61l0l5oj04k1J74p0l3j18
6522a20J70n6N9m2M5j66Q6K1r1J17M1m2j27J56j8n6L3j0kM9J0n3L5j5j6r0R5n6
6550d3k3J51j22rN7J2J5o8P2j04N6J00j05M0j4Q4p6l1j00J12p8M9K8K7n3n5Q9
$$ plain form
6577 11 -81 -42 60 -74 -6 -82 -47 84 -34 44 110 133 -44 -50 12 -17 74 -6 34 -159 -17 -98 -82 13 19 16 -48 -15
6605 -15 -104 84 -17 8 11 -69 35 28 -46 -74 -39 57 -22 66 22 -56 -3 -52 70 -38 17 103 25 -35 65 76 58 83
6633 83 42 -7 71 31 10 16 27 -96 -85 38 -56 -44 -102 83 -11 37 31 37 12 -40 42 -15 91 -63 -77 -22 76 68 -18 -4
6663 -4 -103 143 -8 -82 -23 -52 24 -44 -24 5 51 18 -142 28 16 1 44 8 61 -12 -12 -19 -16 -29 2 -134 64 -47 57
6692 57 114 75 89 -146 74 6 -98 46 -20 24 -24 4 111 53 46 35 4 -55 36 -95 -44 32 -9 41 -12 105 -12
6719 -12 -50 48 -57 -75 -42 -3 -80 36 69 -51 -84 -9 81 30 31 95 -5 -1 63 95 -53 -31 3 -2 121 81 29 -31 -25
6748 -25 -24 64 17 64 -81 -55 73 82 -25 -102 11 94 72 -29 -25 -11 -77 8 -21 -113 16 -29 10 41 -37 -121 -10 -18 -3
6777 -3 113 36 -119 -5 132 -12 0 -14 41 -97 -70 -33 -113 -72 28 -18 17 -4 -44 24 12 12 17 15 -89 65 -78
$$ packed form
6577A1r2L9J02j34O8p6L5J31j18P8O6K3j77oO2k9R1q0M0j93J42q1J6R5Olo4L3
6605a5q9J88j01K5Lq0J04pp4k8L5R6p9Q8m4p8N3m9J22j08N5Q6p8o0J00J1j8K5
6633H3m1m9P8m0k1OJ1j23J1J23r4J2n8J85r4M8oOk5n2Q2n7J06j54j4N5R8qq6J4
6663dr9K46j51p4N9k9P6o8K0K9M6l3j60J70j2j5M3l6N3p3%pLj3L1j36J98j11J04
6692E7N7l9J4k35K20o8j04J44o6M4m8K8J07n8pj1l1n9R1j31N1P6m1N0n3J17j17
6719a2l8R8j05j8L3L9p7J16L3j20l3P5R0n1JO4j00MO4L2j48K2L4nJ23m0n2o0O
6748b5JQ8m7M7j45K6J28Rj07p7J13Q3k2j01MJ4o6Q5k9r2J29m5L9L1p8q4J11qJ5
6777cJ16p7j55J14J37j44J2j4N5j38K7L7q0M1J00m6L5k1m0O8j2%Nkj04J54j43
$$ plain form
6804 -78 -80 -74 50 51 -21 52 107 -59 -33 23 -128 -111 47 7 -65 -34 3 63 -64 -1 12 -6 -7 -36 -24 9 31 53 46 -175
6834 -175 -56 -74 -13 -64 66 -5 17 121 129 51 7 -78 -13 40 20 8 17 23 -27 -87 87 -129 30 34 -13 -10 30 -36 45
6863 45 209 69 -9 85 87 54 36 29 -5 0 5 11 -15 106 24 -65 40 -74 28 -20 12 41 117 193 101 -38 66 -19 32
6892 32 -10 121 -40 112 187 62 -73 -16 -21 38 -52 -85 42 18 -49 -125 18 -62 41 -24 -155 0 19 31 38 85
6918 85 -68 8 10 -25 9 -22 120 -113 70 7 -58 42 104 68 60 33 13 -25 -47 -27 55 -95 -48 72 124 2 -129
6945 -129 19 74 -64 27 -54 -71 -10 -53 -23 9 44 2 -93 -25 6 -63 85 15 94 -3 2 32 -34 15 -22 12 -124 42
6973 42 19 14 -90 35 -64 38 -62 -54 22 -55 -58 -54 57 0 30 -58 56 29 -24 5 37 -96 -64 64 50 8 77 81 -63
7002 -63 -21 28 19 54 27 87 38 76 84 108 98 24 76 91 -22 -27 90 108 47 -18 77 95 -10 -119 26 14 -15 34 -83
$$ packed form
6804g8kOJ24Jp2P3N5j66K6N6j51J7J58m0p2L1L7O0j27O3J3j8jk9J2L3K2K2pk21
6834a75J19j8O1n1J30p1K2J04Qp8m4q5O5N3k0j2ROn0o0J74k16J59Mm7LM0o6Q1
6863D5J64j40p8R4Kl3j8pl4NNOk6J21q2q9J05j14J02m8L2K9P6P6r2j39J04q5N1
6892C2m2J31j61J52P5j25j35N7nN9r0l3J27k4o7p6J43q0J03o5j31J55J9J2PM7
6918H5j53P6Kl5L4l1J42k33J83o3o5J00O2l6qk7k0l8k2K0Q2j50M7J20N2j22j31
6945a29J48N5j38R1q1j7O1m3L0L2L5m2r5O8L1o9J48p0P9r7NL0o6M9l7L4j36J66
6973D2k3nj04J25r9J02j00QP6p7lMJ11n7L0q8J14k7n3K9L2j33L2J28j4m2O9Mj44
7002f3M2M9rL5k7O0m9L8QK4j0p4N2J5j13nJ17J8o1o5R5J8j05j09J45j2k9M9j17
$$ plain form
7031 -83 -64 -105 109 9 56 -4 88 103 -24 -23 -112 -81 65 -75 -28 57 -11 38 2 79 -76 8 -12 23 121 12 32
7058 32 142 -16 84 108 -73 63 -7 -78 67 55 59 -26 34 -12 -77 -13 37 28 -70 39 -4 -14 -11 51 18 126 35 24
7086 24 -28 -72 -19 73 -98 40 14 84 9 -65 -85 -70 141 -171 -29 62 72 65 24 -10 -19 66 44 -50 128 -85 -44 -1
7114 -1 -50 -158 -113 30 -2 -41 -16 -76 13 -84 12 -101 -52 17 -72 156 54 -68 -54 74 37 1 -43 -38 13 33 -140
7141 -140 -1 -49 15 20 27 8 15 43 7 -43 50 46 -39 45 132 -69 -67 1 -40 -2 82 51 -63 -29 -56 -54 68 4 -3 -113 -44
7172 -44 -7 8 47 27 -48 -88 -51 56 -9 -86 59 118 105 -28 -15 19 -13 -20 51 -6 63 15 -62 -29 29 -113 96 -31
7200 -31 -71 19 34 -74 73 -102 -16 -26 -83 8 50 -86 -54 -13 236 103 -3 43 36 -3 94 -93 50 13 0 -66
7226 -66 -16 43 -60 -2 36 44 -51 54 14 63 58 16 39 19 -130 -2 -51 80 -41 -29 -49 26 21 4 105 45 4 9 40
$$ packed form
7031h3J9m1K14j00M7o0R2J5j27Jq9L1J46j40M7Q5o8M9l6P7j55Q4k0L5R8j09K0
7058C2J10j58J00K4j81J36p0p1J45j2Mq5O0m6o5O4N0rr8J09m3j0LO2l3J08r1j1
7086B4n2m4N3R2j71J38k6P0p5p4k0J5K11l12J42R1J0pm1l4rQ5k2r4J78k13M1M3
7114am9j08M5J43l2l9K5o0Q9r7R6j13M9O9q9K28j02j22J4J28l7l6m4NN1K0j73
7141a40J39m8O4NPj9PK8l6n0R3mq5Q4Q7k01KO8m1L8Q4l1j14L4k7KJ22o4pj10O9
7172d4L7J5L9k0p5m0L7J07o5p7J45N9j3j33J3L4l2pP1n7O9m8p7L3N8j42K09j27
7200c1m0R0J5j08J47j75Q6j0n7R1M2j36L2M1K49j33j06M6pl9R7j87J43l7j3o6
7226f6N0N9j03N8L8Qr5J05m0M9nm2K3k0j49J28m9J31j21J2k0P5nj7J01o0m1NL1
$$ plain form
7255 40 -72 94 14 18 41 35 71 -15 -35 60 -58 15 -57 36 -78 -108 51 -131 -31 22 -53 -44 -15 -3 73 -25 56 12
7283 12 13 44 -39 23 -43 -35 101 39 211 -10 8 -29 -46 5 70 55 -41 -10 79 -46 25 -23 -47 13 83 -186 20 -12
7311 -12 -108 33 -64 -20 -7 25 41 128 -35 -46 9 -18 31 -44 -56 37 110 57 -74 -53 42 27 7 -58 -94 -35 21 54 51
7340 51 78 -42 2 -19 110 -28 46 -8 -37 -31 93 73 -25 31 -93 42 34 -105 -36 -42 11 89 -68 -11 -16 -67 71 78
7368 78 -12 -17 -14 15 -21 -23 -100 -8 -74 49 85 -55 35 57 -21 3 47 55 37 2 61 2 -3 -64 101 79 -18 75 -43 52 -115
7399 -115 64 67 -87 64 6 -51 79 -29 -115 47 -72 -19 -28 63 -95 -62 -36 85 -40 -25 -71 -22 -1 -45 4 30
7425 30 44 19 27 23 56 -9 -12 14 16 56 34 20 -27 -14 44 9 45 74 83 -11 -14 -22 66 -35 -47 92 -100 34 58 12 11 -103
7457 -103 -3 -10 25 64 26 -17 50 -43 55 17 7 60 16 115 38 -15 -81 8 30 5 138 39 -8 -98 0 82 -27 -76 -29
$$ packed form
7255D0j12J66q0MK3oL6q6k0R5j18P3p2R3j14l0J59j82J00N3p5RK9J2P6r8Q1m4
7283A2JL1q3O2o6QJ36o2J72k21J8l7j7N1O5j5r6L1Q9j25P1m8k4O0P0k69K06l2
7311a2r6J41r7M4J3L2J6Q7j63j1N5k7M9p5j2R3P3n3j31K1R5j5k0o5l6N9N6L3l
7340E1K7j20M4k1J29j38P4n4k9OJ24k0r8N6j24J35qj39O9oN3P8j57N7nn1J38P
7368G8r0nLK9l6kp7R2o6J23L6j40R0K2p8K4M4Qj8l5N9n9no1J65k2r7R3j18R5j67
7399a15J79Lj54J51n8n7J30j08q6J62j19N3rR1j58L3K6J21j25J5m6M9K1m4M9K6
7425C0J4k5QmL3o5lK6KM0k2j4m7J3N8l5L6K9Rr4lqQ8j01j2J39j92J34K4m6jj14
7457a03J00pL5L9l8m3O7r3R8l8j0N3m4R9p7n3o6Q9K2k5J33r9m7r0R8Q2j09m9M7
$$ plain form
7486 -29 18 52 9 -28 44 34 -72 47 -1 16 -22 42 64 -119 15 35 -31 -11 -5 -12 32 -28 56 -2 99 -23 -2 1 -39
7515 -39 12 -3 103 30 -44 -46 29 30 44 68 4 -36 100 -68 5 -100 10 -27 22 -66 27 71 -142 -69 34 -53 21 -2
7543 -2 -139 75 25 -60 0 0 41 25 -49 -87 -38 194 -95 -37 46 -4 68 -110 -76 80 35 48 57 -88 108 41 60 -44
7571 -44 46 -7 76 7 -111 -91 14 -38 -67 84 24 -46 -63 28 -92 23 25 26 12 -82 -35 1 46 6 37 59 15 -43 42
7600 42 87 21 -141 108 91 -109 -14 5 27 -48 63 -79 -13 -15 13 87 18 9 84 -16 -17 -17 49 62 47 33 -27 -25 60 76
7630 76 57 20 -19 35 -2 22 -59 61 16 -91 44 -24 -28 -23 -25 5 -10 116 27 -39 -18 -24 -33 -33 12 9 72 -67 -5 95 -34
7661 -34 -29 -87 -51 -50 -17 -59 -27 -44 -61 -170 -56 9 -26 96 38 47 -7 -87 -37 -77 14 -8 -18 28 151 54 -23 33 49 98
7691 98 16 -58 -4 51 134 -40 -21 43 0 59 36 -117 -83 2 36 19 73 -48 69 108 -33 22 7 -58 -92 17 53
$$ packed form
7486b9M7L4m3l7P2j0j06J19m8J7l8O4K2j83J34K0o6K0OpM4o0Q4n8J01j22K1Lm0
7515c9N1j5J06p3p4kP5JJ4K4o4m0J36j68P3j05J10l7M9q8R3M4k13P3J03q7P4k3
7543bj37K14n0q5O0%M1j6p4l8M9K32k89N8Q3n0P2j78L4J56m5J3Rj45J96o7J9j04
7571d4R0n3Q3o9j18K0J05n2k9J51o0p0j7R1j20J15KJj4r4M7L6M5m0L1K2m4n8Q5
7600D2M5o6j62K49j7k00R5J9K2p5J11j42O6kK8P4o9rP5j00j%O6J3j5j4o0KQ5J6
7630G6j9l7l9N4l7K4q1J20m5j07J35o8mNkL0j5J26q9o6K1or%M5lO3j39O2J00j29
7661c4Nn8L6JL3m2L2j7j7j09J14O5l5J22n8Rn4q0N0m0R1k2j0M6J23r7p7N6J6M9
7691I8q2p4N4N5Q3j74J9O4m3N9k3j53L4Q5L4j7N4j21J17L9j41N5j5o5l4J09L6
$$ plain form
7718 53 -1 -18 -16 54 -69 -79 98 32 70 27 29 -26 -35 30 11 -6 72 36 76 -28 -8 127 128 -96 -79 -65 7 -29 -10 -43
7748 -43 44 135 -71 47 -68 52 -18 152 5 -81 41 63 17 -49 -34 24 44 93 -129 -28 44 -16 16 85 -18
7773 -18 108 -33 18 126 12 -49 -95 -37 -64 72 -116 27 35 -103 -38 31 42 22 64 -21 23 37 -25 51 10 -39 131
7800 131 -2 4 7 -47 -2 -65 1 11 -55 -45 42 127 24 -43 -34 -37 91 -25 43 2 14 32 -112 1 -25 4 123 49
7828 49 17 -118 -5 18 -57 -44 49 -60 -28 -60 110 7 -79 129 -68 -49 39 -74 45 17 14 8 -98 -8 106 -142
7854 -142 -20 -26 101 -30 -51 15 86 -22 -43 44 -70 27 91 -46 -56 -45 -162 65 37 -29 -90 -7 49 27 57 23
7880 23 -71 23 11 55 21 18 -62 -2 27 -38 21 87 -113 68 12 55 61 136 79 4 -89 28 55 -49 -78 10 -37 27 -27
7909 -27 43 105 -13 -32 -26 -66 64 -161 33 -66 49 6 -188 -8 58 202 -28 25 -3 6 -57 40 -26 -1 -95 1 103
$$ packed form
7718E3n4j7KP0j23j0J77o6L8m3Kn5rO5j9j7P8l6M0j04K0J35Jk24J7J4P2l6J9l3
7748d3Q7R1k06J18j15J20p0J70j47q6J22K2m6o6J5N8K0M9k22J01P2o0L2O9j03
7773a8J26j41N1J08j14o1m6N8k7J36j88J43Qj38O5O9J1k0M2q5M4J4o2P6m1m9J70
7800A31j33OLn4M5o3O6J0o6J0Q7Q5j03o7RlJ28j16O8m1J2J8j44J13k6K9J19p4
7828D9l2j35J13K3p5J3R3j09L2l2J70j03q6K08j97J9Q8j13J19k8loj06R0J14k48
7854a42J22oJ27j31k1O6P1j08k1Q7j14R7O4j37j0J1j17K27k8o6o1Q3N6k2L0l4
7880B3r4R4j2M4l4lq0O0K9o5N9O6k00J81n6M3OP5n7p5r3J17K7j04k9Q8m7O4n4
7909b7P0O2j18j9Om0J30k25J94r9J15m3j94J80O6J44k30N3k8Ro3R7o6K5r4R6J02
$$ plain form
7936 103 31 25 56 -20 -53 51 -66 -26 -5 39 149 -15 38 11 100 75 24 90 -84 69 21 -60 -47 -79 42 76 33
7963 33 -40 -45 4 76 -90 97 13 148 -9 -70 13 -36 -30 146 113 -13 -28 -70 -10 109 25 -47 -31 33 66 92 16 -58
7991 -58 101 35 -14 -11 142 5 34 33 -77 -21 -45 33 -156 8 103 -57 35 -3 34 79 58 18 20 -88 35 16 -98
8018 -98 48 80 -83 -11 83 6 18 -50 60 -101 -28 31 -15 -134 61 67 -113 108 46 11 38 -39 62 -35 -20 28
8044 28 106 17 -74 73 -150 122 1 35 35 -23 43 63 33 -101 63 71 127 74 -2 -44 23 78 24 19 -44 52 30 -54 90
8073 90 -37 69 -57 30 -22 76 -39 -4 94 -5 32 -114 -46 69 -31 17 -14 -8 -47 -79 -40 -45 118 86 70 -71 52
8100 52 31 -37 -28 49 -19 21 61 66 151 53 3 -10 101 85 68 39 34 42 -6 -14 -14 54 -87 107 28 -72 49 -70 32 -37
8130 -37 23 85 -68 -14 53 -26 -67 11 11 26 -31 36 -71 -37 30 -24 -123 -33 69 2 93 -2 8 -197 -25 -14 9 8 47
$$ packed form
7936A03p2oL1p6l3J04j17M0K1M4J10j64N3k7Q9k5n1O6j74J53m8q1J3l2J21L4m3
7963C3p3nM9P2j66J87q4J35j57o1Q3m9OJ76l3j26j5m2O0J19q4p2J6O4L3K6p6p4
7991e8J59o6m9LJ53j37K9jj10N6k4P8j89J64R5j60R2l8L7M5k1m0Kj08J23j9j14
8018i8J46L2j63P2R4p7J2o8J10j61P3N9m6j19J95Oj80K21o2l5K7p7J01r7J5M8
8044B8P8q9r1J47k23K72j21L4%n8O6K0l0j34J64QN6n3p6m2O7N5n4no3R6k2q4J44
8073I0j27J06j26Q7n2R8j15L5R8r9L7j46O8J15j00M8l1Ol9l2L9nJ63l2j6j41J23
8100E2k1o8RP7o8M0M0NQ5r8n0j3J11j6j7k9nQm8q%O8j41J94p9j00J21j19J02o9
8130c7O0O2j53N4O7p9m1P8%J5n7O7j07L4O7n4r9R0J02o7R1r5J0k05J72J1K3jL9
$$ plain form
8159 47 -40 -26 -29 -91 -18 -79 13 15 -57 32 90 78 -78 37 -4 -55 -20 3 11 -45 -1 58 8 105 -4 -22 47 47 -5 3 -123
8190 -123 -17
$$ packed form
8159D7q7J4lo2P3o1R2Kp2Q9N8j2j56J15m1n1L5K3Qn6M4N9n0R7j09j8O9%n2Qj26
8190a23J06
8191a7
$$ Imaginary data points
##PAGE= N=2
##DATA TABLE= (X++(I..I)), XYDATA
$$ plain form
0 0 0 0 0 0 0 0 0 0 0 0 0 0 0 0 0 0 8 -8 8 -8 8 -8 16 -16 16 -24 24 -32 32 -40 48 -48 56 -64 72 -81 95 -104
38 -104 116 -129 144 -160 177 -196 217 -241 265 -291 321 -355 391 -430 475 -523 579 -643 714 -796
58 -796 892 -1004 1143 -1310 1527 -1812 2206 -2790 3751 -5591 10418 -51699 -99192 34715
72 34715 67796 -6704 -52023 434 29434 7854 -10767 -5187 -11375 4400 41148 34829 -28675
85 -28675 -47502 9628 47330 1203 -40764 -12312 25740 10546 -18691 -21860 -9986 2098
97 2098 18384 16852 -13044 -23610 14082 35146 1308 -25390 -5 26749 10376 -14238 -10586
110 -10586 -1717 -2422 2543 2783 -14724 -17986 7713 19251 -7309 -24244 3063 26419 5180
123 5180 -15468 1440 19413 7091 -8201 -506 6057 -4644 -6660 5749 2568 -13767 -11425
$$ packed form
0@%%%%%%%%%%%%%%%%Qj6J6j6J6j6K4l2L2m0M8n6O4p2Q8r6J04j20J36j53J76j99
38a04K20k45K73l04L37l73M13m58N06n56O12o76P46q21R05r98J102j222J357j510
58g96J688j896K147k453K837l339M018m996O541r342J6009o2117m7493J33907
72C4715L3081p4500m5319N2457K9000k1580j8621N580o188J5775L6748o319o3504
85b8675j8827N7130L7702m6127m1967K8452L8052j5194k9237l169J1874J2084
97B098J6286j532k9896j0566L7692K1064l3838k6698K5385K6754j6373k4614L652
110a0586Q869p05M965K40j7507l262K5699J1538k6560j6935K7307K3356k1239
123E180k0648J6908J7973j2322j5292P695O563j0701k016J2409l181j6335K342
$$ plain form
136 -11425 4632 4240 -9167 -7293 6486 6698 149 2394 2584 -3491 2478 14869 9024 -10425
150 -10425 -9836 10105 10613 -11228 -16711 892 10409 -351 -11721 -8430 -36 3282 4666 3084
164 3084 -2528 -1910 6932 10515 1551 -7750 -1791 10545 8988 -4162 -11835 -6814 3919 6073 -3917
179 -3917 -11470 -5766 5954 7383 -4489 -9792 481 11198 9936 -429 -7275 -1314 9068 8928
193 8928 -2537 -9935 -1580 8782 1984 -11058 -9615 1870 6200 -700 -6628 -3289 2132 3301
207 3301 2150 478 348 3195 4565 2396 -1643 -2319 1726 3302 -387 -3087 -2910 -2545 -1217 -477
223 -477 -1589 -2756 -914 3024 1874 -3700 -1704 4989 5251 -24 -1332 2150 3098 -520 -1731 444
239 444 207 -574 -717 -2148 -3170 -1879 480 581 -1804 -1234 2311 1338 -1715 -1 3325 3088 -123
$$ packed form
136a1425J6057l92j3407J874J3779K12o549K245J90o075N969J2391n845j9449
150a0425N89J9941N08k1841n483J7603R517j0760j1370L291Q394L318J384j582
164C084n612O18Q842L583q964r301N959J2336j557j3150p673N021J0733K154r990
179c917p553N704J1720J429j1872n303J0273J0717j262j0365o846N961J0382j40
193H928j1465p398Q355J0362o798j3042J443J1485M330o900n928L339N421J169
207C301j151j672j30K847J370k169m039o76M045J576l689k700J77L65J328P40
223d77j112j167J842L938j150n574J996O693K62n275j308L482R48l618j211K175
239D44k37p81j43j431j022J291K359J01k385N70L545r73l053J714L326k37l211
$$ plain form
256 -123 -407 2559 956 -2766 -837 1709 176 -2160 -1715 -101 -1302 -2107 263 749 -1121 294
272 294 2213 69 -1709 625 3517 1911 -1724 -6 2535 -84 -2409 -367 1341 -90 -2150
287 -2150 -783 600 -1693 -2113 1086 1604 -767 -952 1126 1534 -714 -652 2119 1517 -747 188 967
304 967 -484 -1196 186 1111 -841 -1990 375 696 -1843 -1556 952 1519 -276 -1213 570 1242 -253
321 -253 -100 1059 500 235 300 160 -526 -1031 575 1214 -1114 -1433 588 346 -1188 -1086 658 1203 -574
340 -574 -891 830 589 -530 440 1080 484 -89 220 682 -306 -903 593 730 -616 -835 -303 80 -389
359 -389 -1024 1 714 -366 -369 278 -45 217 393 546 659 -153 205 965 -98 -437 324 461 270 -676
379 -676 -996 -208 -223 -247 -141 -834 -69 935 55 -802 -224 808 1628 379 -669 162 763 802 125 -1013
$$ packed form
256a23k84K966j603l722J929K546j533k336M45J614j201q05K370M86j870J415
272B94J919k144j778K334K892j606l635J718K541k619k325K042J708j431k060
287b150J367J383k293m20L199N18k371j85K078M08k248O2K771o02k264R35P79
304I67j451p12J382R25j952j149K365L21k539K87K508N67j795r37J783O72j495
321b53J53J159n59k65O5j40o86n05J606O39k328l19K021k42j534J02J744N45j777
340e74l17J721k41j119R70O40n96n73L09M62r88n97J496J37j346k19N32L83m69
359c89o35J025P13j080lO47l23K62J76J53J13q12L58P60j063l39P61J37j91r46
379f76l20P88j5k4J06o93P65J004q80q57N78J032Q20j249j048Q31O01L9o77j138
$$ plain form
399 -1013 -392 554 218 -624 -1368 -1180 403 849 -548 -1195 -643 920 1173 -72 -483 465 907 1283 597
418 597 -813 -525 484 987 255 -1644 -1410 161 466 -357 -1209 -1194 485 982 -98 -476 -144 752 1387
437 1387 823 89 -263 -92 1115 925 -956 -1098 -256 500 30 -1193 -1501 -401 196 254 -278 -722 147
456 147 685 1013 791 -242 -755 1720 1519 -314 -1381 -344 1693 653 -1534 -1757 -511 479 190
473 190 -1279 -858 219 442 402 386 -564 682 946 955 678 -144 134 1126 259 -1882 -915 -354 505 -670
493 -670 -1965 -939 199 476 -542 -1290 -739 1810 1873 -477 -1094 -433 2962 1101 -1049 -1774 606
510 606 1884 -512 -2008 -2602 58 1067 309 -1328 -2862 -202 1438 1310 -891 -1940 1186 2921
526 2921 971 -1764 -1114 1559 2513 731 -2121 -2169 553 1217 -679 -1868 -2815 -913 688 935 -416
$$ packed form
399a013O21R46l36q42p44J88J583M46j397o47N52J563K53j245m11R48M42L76o86
418E97j410K88J009N03p32j899K34J571L05q23q52J5J679M97j080l78L32Q96O35
437A387n64p34l52J71J207j90j881j42Q42P56m70j223l08J100N97N8n32m44Q69
456A47N38L28k22j033n13K475k01j833j067J037K037j040k187k23J246R90k89
473A90j469M21J077K23m0j6r50J246K64Rk77q22K78R92q67k141R67N61Q59j175
493f70j295J026J138K77j018p48N51K549O3k350o17O61L395j861k150p25K380
510F06J278k396j496n94K660J009p58j637j534K660J640j28k201j049L126J735
526B921j950k735O50K673R54j782k852m8K722O64j896j189r47J902J601K47j351
$$ plain form
543 -416 -1816 101 2637 2398 -2000 -1904 1130 2716 1097 -931 -1428 909 1318 -565 -2934 -186 811
560 811 -236 -848 -180 180 -1102 -842 598 725 -1155 -595 2400 2056 -1069 -1040 208 1382 -756 -1238
578 -1238 -683 744 -1416 -1161 -31 -134 -1272 -1330 407 680 29 -127 1364 420 -378 52 1249 480
596 480 -971 -407 1115 141 -711 -607 -268 -135 -886 -960 27 -339 -237 160 -358 -90 326 105 567 625
616 625 440 680 -21 548 91 -157 -269 -1069 60 398 -801 -1775 -553 -61 348 -301 -252 -19 753 463
636 463 483 194 -25 1239 824 -493 -16 118 8 -562 -635 -469 -730 -709 -229 45 -540 -651 284 543 500
657 500 -366 -24 1323 943 194 41 103 615 231 -178 -354 -348 -404 -127 -687 -955 -463 -144 -123 79 -231 235
679 235 632 234 603 370 615 801 149 -33 500 -26 -412 -399 -309 -123 -770 -1062 -106 61 -617 -395 60
$$ packed form
543d16j400J917K536k39m398R6L034J586j619k028m97K337M09j883k369K748R97
560H11j047o12O68L60j282K60J440J27j880N60K995l44l125K9J248J174k138m82
578a238N55J427k160K55J130j03j138n8J737K73o51j56J491r44p98M30J197p69
596D80j451N64J522r74q52J04L39J33p51p4R87l66J02L97n18K68M16k21M62N8
616F25j85K40p01N69m57k48j12q00J129L38j199r74J222M92M09o49M9K33P72k90
636D63K0k89k19J264m15j317M77J34j10n70p3J66k61K1M80K74n85j11R35K59m3
657E00q66L42J347l80p49j53O2N12l84m09j76On6K77n60k68M92L19K1K02l10M66
679B35L97l98L69k33K45J86o52j82N33n26l86J3R0J86o47k92R56J67o78K22M55
$$ plain form
700 60 544 483 -108 428 961 428 311 521 343 236 -102 -203 -171 -543 -440 -183 -727 -602 -87 -279 -317 -130
722 -130 297 496 125 342 845 495 217 544 515 219 -194 -365 67 -304 -746 -286 -389 -577 -285 -155 -197
743 -197 -291 -44 744 476 -321 468 1007 444 -240 167 693 309 -629 -269 105 -414 -543 -373 -362 -374 -465 -190
765 -190 227 -158 60 492 422 364 418 417 480 217 -50 381 -124 -481 -40 -209 -587 -561 -452 -88 -332 -553 81
788 81 30 126 215 275 363 441 294 497 433 -67 292 221 -409 -274 -102 -330 -338 -665 -276 14 -626 -396 250 108
812 108 17 104 435 740 276 95 595 301 109 244 -77 -122 -206 -364 -271 -368 -475 -244 -376 -376 -52 -25 227
835 227 269 75 273 438 372 440 338 163 161 143 -1 17 -490 -400 -190 -449 -240 -229 -439 -12 -44 -25 193 191 463
860 463 547 191 273 552 396 133 -17 -186 122 -151 -411 -266 -428 -409 -261 -359 -53 -168 -223 236 324 129
$$ packed form
700F0M84o1n91N36N33n33j17K10j78j07l38j01L2l72J03K57n44J25N15j92l8J87
722a30M27J99l71K17N03l50k78L27k9k96m13j71M32l71m42M60j03j88K92J30m2
743a97r4K47P88k68p97P89N39n63o84M07N26l84r38L60L74n19j29J70J1j2r1K75
765a90M17l85K18M32p0n8N4jO3k63k67M31n05l57M41j69l78K6J09L64k44k21O34
788H1n1R6Q9O0Q8P8j47K03o4n00L59p1o30J35J72k28ql27L89K90o40K30O46j42
812A08r1Q7L31L05m64j81N00k94j92J35l21m5q4j58R3r7j07K31j32%L24K7K52
835B27M2j94J98J65o6O8j02j75kj8j44J8n07R0K10k59K09J1k10M27l2J9K18kK72
860D63Q4l56Q2K79j56k63j50j69L08k73k60J45j62J9J48r8L06j15n5M59Q8j95
$$ plain form
882 129 263 365 479 411 87 205 440 -126 -41 -202 -487 -291 -362 -420 -207 -317 -309 -92 -40 48 70 24 481 507
906 507 153 276 248 279 124 -10 -112 -22 -362 -353 -315 -457 -421 -414 -225 107 -149 -280 318 256 209 342 239 522
930 522 455 87 256 133 -139 -69 -264 -245 -327 -615 -331 -116 -358 -282 -100 69 212 180 223 539 258 309 350
953 350 306 249 110 -89 29 -21 -434 -302 -244 -331 -319 -373 -134 90 -270 22 392 197 352 356 306 489 265 60
977 60 249 61 -24 -240 -586 -93 -82 -520 -334 -181 -297 -76 13 28 -21 67 489 566 193 206 315 246 217 85
1001 85 -205 102 -63 -321 -353 -382 -296 -257 -361 3 -93 -148 248 132 76 337 336 376 417 145 183 -26 -61 20 -129
1026 -129 -389 -106 -350 -641 -171 -373 -228 -13 -77 115 129 163 165 107 422 583 238 -35 122 76 5 -39 -271
1049 -271 -161 -238 -295 -184 -451 -260 9 -135 -139 42 19 244 320 77 253 342 355 341 2 -114 77 -173 -129
$$ packed form
882A29J34J02J14o8l24J18K35n66Q5j61k85J96p1n8K13j10QK17N2Q8K2m6M57K6
906E07l54J23k8L1j55j34j02R0l40RL8j42L6PJ89L32k56j31N98o2m7J33j03K83
930E22o7l68J69j23k72P0j95J9q2k88K84K15k42P6J82J69J43l2M3L16k81N1M1
953C50m4n7j39j99J18n0m13J32N8q7J2n4K39K24l60K92L70j95J55Mn0J83k24k05
977F0J89j88q5k16l46M93J1m38J86J53j16K21Q9J5m9Q8M22P7l73J3J09o9k9j32
1001H5k90L07j65k58l2k9Q6L9j04L64r6n5L96j16n6K61jM0M1k72L8k09l5Q1j49
1026a29k60K83k44k91M70k02J45K15o4J92J4L4Kn8L15J61l45k73J57m6p1m4k32
1049b71J10p7n7J11k67J91K69j44mJ81k3K25P6k43J76Q9J3j4l39j16J91k50M4
$$ plain form
1072 -129 -80 -473 -392 -319 -265 -161 -166 6 242 99 169 238 182 355 460 155 204 242 -12 12 -183 -153 -147 -305 -365
1097 -365 -171 -382 -281 44 -190 52 152 155 325 149 127 377 153 298 255 -42 -30 -97 -383 -185 -70 -313
1119 -313 -247 -330 -172 -113 -179 43 139 49 200 420 329 231 346 201 334 72 -45 -128 -221 -166 -273 -332 -170 -208
1143 -208 -542 -121 -18 -24 82 138 260 277 110 336 405 93 133 122 26 98 -223 -236 -145 -352 -273 -295 -329 -22 -154
1168 -154 -375 207 138 -76 343 370 212 344 107 207 242 24 -80 123 -170 -55 -312 -368 -114 -192 -200 -132 43
1191 43 49 94 116 322 306 49 294 254 46 300 -42 -13 72 -290 -233 -10 -287 -231 -300 -226 -30 -210 -18 252
1215 252 172 28 79 291 266 144 104 404 138 10 169 -127 -50 -161 -345 -149 -105 -288 -129 -148 -152 87 -5
1238 -5 34 309 193 203 157 108 217 242 19 -5 -76 -183 -46 -323 -141 -160 -267 -171 -30 -188 0 170 216 100
$$ packed form
1072a29M9l93Q1P3N4J04nJ72K36j43P0O9n6J73J05l05M9L8k54K4j95L0Oj58o0
1097c65J94k11J01L25k34K42J00LJ70j76k2K50k24J45m3k97J2o7k86J98J15k43
1119c13O6q3J58N9o6K22R6r0J51K20r1r8J15j45J33k62j17q3r3N5j07n9J62l8
1143b08l34M21J03oJ06N6J22J7j67K26O9l12M0j1r6P2l21j3R1k07P9k2l4L07j32
1168a54k21N82o9k14M19K7j58J32k37J00L5k18j04K03k93J15k57n6K54p8qO8J75
1191D3OM5K2K06j6k57K45m0k08K54l42K9Q5l62N7K23k77N6o9P4J96j80J92K70
1215B52q0j44N1K12k5j22m0L00k66j28J59k96P7j11j84J96M4j83J59j9mK39r2
1238eL9K75j16J0m6m9J09K5k23k4p1j07J37k77J82j9j07R6J41j58J88J70M6j16
$$ plain form
1262 100 105 179 294 174 74 419 132 5 49 -132 -19 -152 -406 -94 -199 -357 -178 -23 -51 113 -180 79
1284 79 320 103 153 357 171 262 78 95 100 -145 -150 -120 -217 -197 -19 -245 -147 -102 -163 26 52 117 236 114 189 293
1310 293 147 193 94 -42 172 -137 -114 17 -165 -245 -102 -239 -109 -119 -259 -91 -10 -74 78 255 225 176 155
1333 155 219 247 -49 143 141 -171 -69 -127 -234 -188 -227 -207 -73 -86 -49 112 -65 160 57 121 238 202 107 165 86
1358 86 -74 21 -196 -174 -37 -260 -266 -149 -333 -87 -187 -168 104 -18 -9 273 137 241 101 132 329 61 47
1381 47 33 -57 -100 -39 -261 -241 -167 -167 -207 29 -151 64 -20 123 262 38 38 273 89 127 214 77 101 2 -163 -7
1407 -7 -70 -277 -111 -201 -209 -52 -96 -72 34 -51 33 176 136 193 83 288 234 34 138 70 -158 -95 -147 -183 -116 -196
1433 -196 -158 19 -36 -98 88 -8 104 76 22 205 264 168 114 191 52 80 -127 -139 -35 -45 -136 -150 -208 -169 -224 -71
$$ packed form
1262A00NP4J15j20j00L45k87j27M4j81J13j33k54L12j05j58J79J55k8J64k93K59
1284G9K41k17N0K04j86R1j84J7Nk45nL0r7K0J78k26R8M5o1J89K6O5J19j22P5J04
1310B93j46M6r9j36K14l09K3J31j82q0J43j37J30j0j40J68Q1o4J52J77l0m9k1
1333A55O4K8k96J92kl12J02n8j07M6l9K0J34j3L7J61j77K25j03O4J17l6r5N8p9
1358H6j60R5k17K2J37k23oJ17j84K46j00J9K72j22RK82j36J04j40L1J97k68j4
1381D7j4r0m3O1k22K0P4%m0K36j80K15q4J43J39k24%K35j84L8Q7j37K4r9j65J56
1407go3k07J66r0qJ57m4K4J06q5Q4J43m0N7j10K05n4k00J04o8k28O3n2l6O7q0
1433a96L8J77n5o2J86r6J12k8n4J83N9r6n4P7j39K8k07j2J04j0r1j4n8L9n5J53
$$ plain form
1459 -71 31 165 16 86 90 73 100 153 187 217 67 -92 101 -49 4 -231 -75 -115 -214 -236 -100 -131 -28 73 95
1484 95 194 189 35 115 205 37 118 46 200 37 -137 -20 -83 -206 -266 -153 -179 43 -187 -176 -52 -1 198 120 97
1509 97 168 152 61 371 106 35 120 27 -51 -14 -188 -77 -67 -320 -104 -121 -153 -105 49 134 149 128 35 160 196 94
1535 94 172 -1 98 6 -199 4 -159 -131 -77 -265 -137 28 -91 -121 24 -17 139 158 92 160 140 110 143 208 82
1560 82 60 -57 -58 -214 -45 -89 -105 -196 -22 -126 -132 116 -41 89 98 101 83 284 218 116 69 -61 117 102 -77 -95
1586 -95 -142 -124 -172 -199 -164 -52 -75 35 -16 -65 -18 21 77 113 12 119 224 10 53 -31 -84 -17 -111 -151 -217 -310 -60
1613 -60 -4 -185 -94 57 -15 7 -17 96 28 81 214 93 22 107 70 -103 -77 28 -41 -90 -128 -210 79 -65 -54 7
1639 7 -76 45 146 44 170 126 14 104 175 156 61 -130 121 -14 -182 -37 -147 -106 -89 -128 -78 61 60 26 80
$$ packed form
1459g1J02J34j49P0Mj7K7N3L4L0j50j59J93j50N3k35J56m0r9k2J36l1J03J01K2
1484I5R9nj54Q0R0j68Q1p2J54j63j74J17o3j23o0J13k6K22k30J1J24N1J99p8k3
1509I7P1j6r1L10k65p1Q5r3p8L7j74J11J0k53K16j7l2M8J54Q5J5k1r3J25L6j02
1535I4P8j73R9r2k05K03j63K8N4j88J28J65j19l0J45m1J56J9o6O8k0l0L3O5j26
1560H2k2j17jj56J69m4j6r1J74j04oK48j57J30RLj8K01o6j02m7j30J78j5j79j8
1586i5m7J8m8k7L5J12k3J10n1m9M7L9N6L6j01J07J05k14M3q4n3O7r4m0o6r3K50
1613f0N6j81R1J51p2K2k4J13o8N3J33j21p1Q5l7j73K6J05o9m9l8q2K89j44J1O1
1639Gq3J21J01j02J26m4j12R0P1j9r5j91K51j35j68J45j10M1J7l9N0J39jl4N4
$$ plain form
1664 80 177 124 152 -41 59 85 -91 75 1 -186 -69 -30 -100 -55 -24 -134 -70 -23 -9 97 33 131 103 41 47 71 26
1691 26 24 64 -26 27 24 -31 -136 -195 -39 -123 -179 -73 -65 -77 -64 -20 109 43 15 190 109 145 102 155 51 22 -77 -29 -123
1720 -123 -116 -169 -51 -149 -64 -142 -83 -77 -200 128 125 23 133 199 15 119 -11 170 260 -134 -79 -1 -57 -193 24
1745 24 -54 -104 -65 -145 -90 -51 28 49 67 114 58 93 53 138 62 66 95 -109 -163 -85 -47 -75 -172 -65 -29 -16 -52 84 -84
1774 -84 135 64 85 63 62 59 107 66 48 -1 -51 -106 -37 10 -97 -97 -68 66 -142 16 39 -86 100 38 85 147 92 81
1802 81 138 57 25 91 -15 -38 -94 -84 7 -11 -156 113 -86 36 30 -7 31 -5 -30 -40 84 41 16 124 70 82 -65
1829 -65 -140 26 -102 -182 -178 -95 -42 37 -51 78 -61 -162 76 78 44 92 132 -52 110 90 121 92 -14 26 17 -196 51
1856 51 -42 -116 -102 -139 -105 105 -12 32 -54 -31 56 54 -75 155 77 52 101 52 -167 4 -132 -161 -92 -55 -92 -23 -73
$$ packed form
1664H0R7n3K8j93J00K6j76J66p4j87J17L9p0M5L1j10O4M7J4J06o4R8k8o2OK4m5
1691B6kM0r0N3ln5j05n9J56q4n6J06Qj2J3M4J29o6k8J75q1L6m3N3j04k9r9M8r4
1720a23Pn3J18r8Q5p8N9Oj23L28lj02J10O6j84J04j30J81R0l94N5P8n6j36K17
1745B4p8n0L9q0N5L9P9K1J8M7n6L5m0Q5p6MK9k04n4P8L8k8r7J07L6J3l6J36j68
1774h4K19p1K1k2jlM8m1j8m9n0n5O9M7j07%K9J34k08J58K3j25J86o2M7O2n5j1
1802H1N7q1l2O6j06k3n6J0R1j8j45K69j99J22ol7L8l6k5j0J24m3k5J08n4J2j47
1829f5p5J66j28q0MQ3N3P9q8J29j39j01K38Kl4M8M0j84J62k0L1k9j06M0rk13K47
1856E1r3p4J4l7L4K10j17M4q6K3Q7kj29K30p8k5M9m9k19J71j36k9O9L7l7O9n0
$$ plain form
1883 -73 -98 -16 84 100 117 70 200 136 6 0 66 129 -3 -23 32 -147 -124 57 -152 28 27 -53 -35 -9 40 -125 95
1910 95 -50 170 146 44 3 -68 -23 160 -26 -43 32 -98 -108 -35 -211 -123 83 -94 1 9 63 89 101 68 184 78
1936 78 24 54 53 -42 -29 99 -12 -68 -69 -99 -130 -63 -42 24 -89 -26 26 14 -56 138 30 53 104 76 82 42 45 23 -68 -113
1966 -113 -70 -3 -112 -32 -124 -134 -37 17 -31 6 90 37 217 74 28 -3 15 30 121 -64 -72 8 -179 -114 -197 -146 -39
1993 -39 -66 -105 -37 -155 79 -32 -51 50 25 67 124 33 -42 49 29 4 35 55 -119 -12 -49 -14 63 -56 -44 42 1
2020 1 -27 16 61 214 -20 156 -49 -37 110 64 56 -12 -35 -159 -68 -60 27 -106 -117 -6 15 44 127 18 -68 36 -15
2047 -15 30 0 -25 100 68 -75 -32 -22 -78 -47 -76 -97 -26 -113 -109 164 -133 -42 -82 -67 178 8 -3 86 -102 97 -48
2074 -48 -79 -65 34 -73 -43 -112 -157 -104 -14 -33 131 -66 -31 32 -100 67 -6 14 5 153 -49 47 126 -21 -94 -98 9
$$ packed form
1883g3k5Q2J00J6J7m7J30o4j30oO6O3j32k0N5j79K3J81k09J80jq0J8K6M9j65K20
1910I5j45K20k4j02m1p1M5J83j86j7P5j30j0P3j76Q8K06j77R5QN4K6J2l3J16j06
1936G8n4L0jr5J3J28j11n6jl0l1O7K1O6j13O3N2j2p0J94j08K3N1k8Om0Lk2r1m5
1966a13M3O7j09Q0r2j0R7N4m8L7Q4n3J80j43m6l1J8J5R1j85qQ0j87O5q3N1J07
1993c9k7l9O8j18K34j11j9J01k5M2N7r1p5R1k0k5L1K0j74J07l7L5P7j19J2Q6m1
2020Ak8M3M5J53k34J76k05J2J47m6qo8k3j24R1QQ7j33j1J11K1K9Q3j09q6J04n1
2047a5M5l0k5J25l2j43M3J0n6L1k9k1P1q7MK73k97R1m0J5K45j70j1Q9j88J99j45
2074d8l1J4R9j07L0o9m5N3R0j9J64j97L5O3j32J67p3K0rJ48k02R6P9j47p3mJ07
$$ plain form
2101 9 47 -107 -32 -106 -24 -34 -70 -12 60 53 159 -4 -25 97 118 116 103 85 -52 -136 -134 28 -208 -57 0 -47 -23 25
2129 25 9 38 -68 -11 47 -5 131 -110 29 34 41 123 -50 -1 -40 -94 4 73 23 29 -6 71 46 -31 208 87 -48 123
2157 123 151 75 55 74 43 -70 8 -21 32 27 -110 28 -65 -78 56 -60 -16 -67 2 121 -15 89 51 120 35 -43
2183 -43 107 106 -20 3 19 -24 46 18 -134 -74 101 11 -101 -29 -10 -29 17 -66 42 158 1 92 -86 -85 -106 -28 -2
2210 -2 -64 57 -78 -73 11 9 -17 -115 44 157 75 7 -13 90 24 91 67 140 17 -53 -12 66 31 3 -42 100 75 -8
2238 -8 -67 2 104 -68 -93 -44 -15 30 93 104 23 74 -35 -66 -45 -16 25 -65 -51 -45 -32 -38 -35 -60 -87 -2 -2 4 34 17 43 -3
2270 -3 33 9 -6 -31 31 59 -85 71 -30 -12 56 -179 72 -27 -110 3 -82 -44 29 49 -9 39 -75 -4 24 153 53
2297 53 -63 -5 -47 -13 -74 23 -2 -52 -27 25 25 -34 -16 130 -10 49 44 103 126 145 53 -22 -47 5 -8 17 -1 37 -40 -58
$$ packed form
2101IL8j54P5p4Q2j0l6N8P2pJ06j63k1J22K1kj3j8j37q4KJ62k36J51N7m7K4M8
2129B5j6K9j06N7N8n2J36k41J39NPQ2j73M9l9n4R8O9n0Ol5P7k5p7K39j21j35J71
2157A23K8p6k0J9l1j13P8k9N3nj37J38r3j3J34j16M4n1O9J19j36J04l8O9q5p8
2183d3J50jj26K3J6m3P0k8j52O0J75r0j12P2J9j9M6q3J08J16j57R1j78Jk1P8K6
2210bo2J21j35NQ4kk6r8J59J13q2o8k0J03o6O7k4P3j23p0M1P8l5k8m5J42k5q3
2238hn9O9J02j72k5M9K9M5O3J1q1N1j09l1K1K9M1r0J4OJ3oLk5k7Q5%OL0j7K6m6
2270cL6k4j5k5O2K8j44J56j01J8O8k35K51r9q3J13q5L8P3K0n8M8j14P1K8J29j00
2297E3j16N8m2L4o1R7k5n0K5N2%n9J8J46j40N9nN9K3J9r2p5k5N2j3K5j8L8p7j8
$$ plain form
2327 -58 -130 75 -83 49 29 100 -62 -22 -42 -16 -88 78 5 30 1 -19 74 -33 -54 -134 32 -31 -3 -29 45 21 -40
2354 -40 1 40 37 -33 0 20 59 48 175 -110 -8 86 -8 -61 -89 24 -125 -139 -10 -51 -42 -35 -20 -35 87 -52 100
2381 100 -9 -35 83 -41 -22 -110 -72 19 67 14 -17 -41 -32 15 -41 27 -85 -106 -5 -26 11 -33 55 33 10 -31 9 63
2409 63 -45 -87 39 8 -15 -37 -88 8 -49 -43 109 -51 -6 -14 79 -8 33 21 -9 32 -14 38 43 -37 118 24 -6 43 -123
2438 -123 -18 -33 13 38 62 35 118 -28 41 -29 35 43 25 27 24 46 11 -63 -32 6 36 -85 36 1 70 42 14 -30 -54
2467 -54 15 22 -11 69 -61 72 114 -40 -22 -25 -10 40 -2 46 -22 -13 45 13 9 21 -5 -49 22 41 28 -32 -83 -10 1 25 -118
2498 -118 -94 -35 -48 -10 -58 -68 -24 -102 -97 18 12 -31 -85 127 -85 87 -60 -112 -31 57 15 80 98 21 -74 -31 -51 114
2526 114 -46 -32 158 -87 -3 -165 -18 66 -42 -5 54 -6 0 -33 62 114 -6 14 -46 -4 -80 22 -13 27 -67 31
$$ packed form
2327e8p2K05j58J32k0P1j62M0k0K6p2J66p3K5k9k0R3j07k1q0J66o3K8k6P4k4o1
2354d0M1L9lp0L3K0L9j1J27k85J02R4r4n3k8J13j49j4J29m1RPJ5j5J22j39J52
2381A00j09k6J18j24J9q8L8R1M8n3l1k4RM7n6O8j12k1J01k1L7m4Q8k2k3m1M0N4
2409F3j08m2J26l1k3k2n1R6n7OJ52j60M5qR3q7M1j2l0M1m6N2Nq0J55r4l0M9j66
2438a23J05j5M6K5K4k7Q3j46O9p0O4Qj8KlK2l5p4L1L8L0j21J21l5O9k8k8m4k4
2467e4O9Pl3Q0j30J33M2j54J8lJ5N0m2M8o8RN8l2mJ2k6m4P1J9j3o0n1P3J1K4j43
2498a18K4N9j3L8m8j0M4p8NJ15om3n4K12k12J72j47n2Q1Q8m2O5J8p7r5M3k0J65
2526A14j60J4J90k45Q4j62J47Q4j08L7N9o0Ol3R5N2j20K0o0M2p6J02l5M0r4R8
$$ plain form
2552 31 6 -40 63 -57 12 -100 24 14 42 76 4 -5 51 40 -18 3 -50 -88 72 -35 -104 -101 -93 6 -10 -2 2 -30 -71 -94
2582 -94 -43 13 23 -23 74 26 -12 50 -31 -39 -144 -102 49 -77 68 43 -83 59 69 -16 -30 2 40 21 12 32 160 77
2610 77 -58 97 -64 -27 -67 -48 -79 -2 39 -59 -18 -56 32 -51 44 41 -74 -17 20 14 -26 -104 -8 52 -22 -54 -34 76 8
2639 8 25 -42 23 -94 -1 -96 -30 -110 72 34 4 -42 33 140 99 -43 -33 42 -55 10 -95 -70 -59 21 -39 123 -12
2666 -12 37 -27 -8 45 52 -16 5 83 -64 0 -40 -54 81 -20 -14 12 -10 -58 -59 79 -113 -32 29 -72 70 35 -10 18
2694 18 13 19 -68 8 -44 99 8 -26 -37 77 -3 -29 49 -1 -124 119 48 16 76 -51 47 -51 16 -75 22 44 -8 -44 3
2723 3 2 35 -12 45 -23 38 -49 -79 36 -131 92 -27 108 50 -19 -116 39 -10 76 5 58 10 75 30 -54 -66 -60 -3 -42
2752 -42 -33 92 -89 -67 -80 -4 -23 3 99 42 -7 87 13 51 85 -73 38 -64 -54 73 -79 -77 1 33 14 -30 28 8
$$ packed form
2552C1k5m6J03j20O9j12J24j0K8L4p2rN6j1n8K1n3l8J60j07o9LQR9j6QMl2m1k3
2582i4N1N6J0m6R7m8l8O2q1qj05M2J51j26J45k5j26J42J0q5j4L2L8j9rK0J28q3
2610G7j35J55j61L7m0J9l1P7M1r8M1l8Q8q3R5lj15N7L7om0p8R6O0p4l2K0J10o8
2639HJ7o7O5j17R3r5O6q0J82l8l0m6P5J07m1j42J0P5r7O5j05K5J1Q0o0J62j35
2666a2M9o4J9N3Po8K1P8j47O4m0j4J35j01OK6k2m8jJ38j92Q1O1j01J42l5m5K8
2694A8nOq7P6n2J43r1l4j1J14q0k6P8n0j23K43p1l2O0j27R8r8O7r1R7K2n2l6M7
2723CjL3m7N7o8O1q7l0J15j67K23j19J35n8o9r7J55m9Q6p1N3m8O5m5q4j2ON7l9
2752d2RJ25j81K2j3P6j9K6R6n7m9R4p4L8L4j58J11j02J0J27j52KP8L2j9m4N8k0
$$ plain form
2780 8 42 -37 24 72 -36 70 -1 84 33 -61 -36 -26 -46 -55 12 -93 -85 20 19 28 21 56 37 -24 113 -57 9 19 91 30
2810 30 -54 65 44 -61 -52 25 51 -33 17 -50 13 -57 73 -7 26 -41 -92 69 -138 14 19 93 -26 83 40 11 -16
2837 -16 -39 -22 -62 -7 40 20 -27 35 -12 115 -34 -40 -27 4 13 6 2 5 -18 65 18 4 -42 68 31 -66 -42 90 -126 -111
2867 -111 -97 -3 -29 14 87 58 -81 25 -79 -17 30 -31 -56 25 92 -67 -37 49 75 -7 -90 -102 80 50 -89 0 131
2894 131 27 36 -20 -1 31 25 55 -13 59 -71 102 12 14 -39 50 30 -73 108 -57 3 -85 95 47 22 -82 -14 88
2921 88 -91 63 30 18 10 -34 48 -51 15 -4 -17 34 -28 100 -94 -79 75 -6 -140 -83 -46 -56 6 -21 36 87 27 -68
2949 -68 96 -30 -19 -48 -22 9 112 85 105 -125 51 9 25 9 59 -13 7 2 -85 -66 -25 -97 -82 27 53 14 -170
2976 -170 -5 109 -63 45 -21 -83 -51 12 -15 -16 -4 58 18 -18 -63 -50 -39 113 12 -34 -10 -87 21 13 -48 9 -13
$$ packed form
2780HL4p9O1M8j08J06p1Q5n1r4K5J0k0rO7j05QJ05jRpL5j9o1J37j70O6J0P2o1
2810C0q4J19k1j05RP7K6q4N0o7O3p0J30q0L3o7n1J61k07J52NP4j19J09m3k9k7
2837a6k3J7m0N5M7k0m7O2m7J27j49oJ3L1RpmLk3Q3m7j4m6J10l7r7K4J32k16J5
2867a11J4R4k6M3P3k9j39J06j04O2M7o1k5Q1O7j59L0Q6K6q2q3j2J82l0j39Q9J31
2894A31j04Rn6J9L2oL0o8P2j30J73r0Kn3Q9k0j03J81j65O0q8J80m8k5j04O8J02
2921H8j79J54l3j2qm4Q2r9O6j9j3N1o2J28j94J5J54q1j34N7L7j0O2k7N7N1o0r5
2949f8J64j26J1k9K6L1J03k7K0k30J76m2J6j6N0p2K0nq7J9M1p2J5J09K6l9j84
2976a70J65J14j72J08o6o2L2O3k7jJ2O2m0l6m5J3J1J52j01m6K4p7J08qo1N7k2
$$ plain form
3003 -13 44 17 -30 9 -4 164 -36 79 -90 16 -50 -85 -13 -11 -20 -140 -8 -59 -15 -19 15 68 29 60 129 9 29 -41
3031 -41 -105 -137 -10 -161 42 83 -39 64 -106 -34 -6 -97 -73 59 -63 8 24 82 -74 89 -50 -57 -106 46 -97
3056 -97 -39 -65 64 39 16 -13 52 47 -88 2 49 66 -113 12 -5 -6 -2 86 -19 89 -87 -57 -24 -53 -16 -94 -38 -62
3084 -62 -34 -49 16 13 29 -54 -109 -52 -74 -58 18 -63 53 -11 54 21 -31 65 -27 -37 18 23 -115 31 -54 -18 49 -1 28 62
3114 62 58 -7 44 129 -53 6 -53 80 13 -183 -33 25 -94 33 -29 -89 -28 38 46 -13 -152 -39 48 39 8 71 -31
3141 -31 14 -57 -45 -26 -41 -101 -2 76 -47 -74 -57 18 54 47 5 40 -50 23 54 -48 81 -19 165 32 0 -89 -44 -36
3169 -36 -106 3 -43 -20 13 -38 -21 -34 -156 -18 1 3 -47 -56 188 -8 63 7 66 -64 72 5 25 53 88 104 19 7
3197 7 -96 40 -7 -14 79 117 -62 -26 -32 -94 -90 1 20 13 -117 -76 -31 -5 68 31 -38 -99 106 53 84 71 -11 9 -42 76
$$ packed form
3003a3N7k7m7L9j3J68k00J15j69J06o6l5P2Krj20J32n1M4mL4N3l9L1O9j20K0p0
3031d1o4l2J27j51K03M1j22J03j70P2K8r1K4J32j22P1J6N8j56J63j39pm9J52j43
3056i7N8k6J29k5k3k9O5nj35R0M7J7j79J25j7jMQ8j05J08j76L0L3k9L7p8N6k4
3084f2K8j5O5lJ6q3n5N7k2J6P6q1J16o4O5l3n2R6r2j0N5Nj38J46q5L6O7n0K9L4
3114F2mo5N1Q5j82N9n9J33o7j96J50N8j19J27o2o0O1O6Qn9j39J13Q7rl1O3j02
3141c1M5p1J2J9j5o0R9P8j23k7J7P5L6pm2L5r0P3L1j02J29j00J84j33l2q9M5Q
3169c6p0J09m6K3L3n1J7j3j22J38J9Kn0rK44j96P1n6N9j30J36o7K0K8L5J6q5j2
3197Gj03J36m7pR3L8j79L6oo2MR1J9pj30M1M5K6P3l7o9o1K05n3L1j3q2K0n1J18
$$ plain form
3227 76 -159 -24 -56 -34 10 16 37 63 45 -56 -5 39 140 -98 95 -78 -45 -128 32 19 53 9 -23 -85 -92 -14 -25
3254 -25 2 -7 100 -26 47 1 15 10 -34 21 35 -43 9 32 32 -46 5 12 105 -21 -28 3 -19 76 -34 -29 43 60 -37 91 -139
3285 -139 58 -98 102 -5 143 -8 72 -15 24 8 -73 -92 125 -53 -23 -53 22 -27 -42 -58 -57 -105 27 -27 35 -21
3311 -21 4 -8 -17 -8 -12 94 28 8 16 65 85 -42 4 17 -94 -45 -60 54 39 -104 -61 135 66 -60 2 -77 107 -28
3339 -28 -27 3 0 -12 25 -47 12 11 -37 72 47 -41 -5 28 33 -21 64 -64 -60 -103 -45 69 4 -12 -24 38 45 -27 46 -88 -99
3370 -99 -70 -68 -140 -91 -21 -42 -71 -94 60 -76 -62 -96 20 65 -28 -21 -35 81 86 -89 41 -74 55 -18 -19 28 -34 -25 -99
3399 -99 11 10 -62 121 -23 82 81 15 94 -58 -90 8 3 14 -59 47 18 -26 -27 -81 85 -49 -21 18 -51 -11 -38 -12
3427 -12 -22 38 142 6 -6 51 7 -75 -103 -24 -5 46 174 -18 -9 40 118 -90 -19 79 26 -133 58 38 -10 122 63
$$ packed form
3227G6k35J35l2K2M4OK1K6j8j01N1M4J01k38J93j73L3q3J60j3L4m4l2o2pP8j1
3254b5K7rJ07j26P3m6J4nm4N5J4p8N2K3%p8N1PR3j26pL1k2R5j10NP2J7r7J28k30
3285a39J97j56K00j07J48j51Q0q7L9j6q1j9K17j78L0l0P5m9j5j6Jm8J32n4O2n6
3311b1K5j2rRmJ06o6k0QM9K0j27M6J3j11M9j5J14j5j43M3J96o9j26O2p9J84j35
3339b8JL0lj2L7p2N9jm8J09k5q8L6L3Nn4Q5j28Mm3N8J14o5j6j2O2Pp2P3j34j1
3370i9K9Kp2M9P0k1k9k3J54j36J4l4J16M5r3Pj4J16Nj75J30j15J29p3jM7o2Rp4
3399i9J10jp2J83j44J05jo6P9j52l2R8nJ1p3J06k9m4jn4J66j34K8L9o9M0k7K6
3427a2j0O0J04j36j2N7m4q2k8P9J9N1J28j92RM9P8k08P1R8n3j59J91k0m8J32n9
$$ plain form
3454 63 17 -42 93 -38 -107 5 38 -12 52 35 -7 7 91 -12 90 -59 12 25 12 138 35 -89 33 -55 2
3479 2 -42 -30 60 54 -66 73 9 -37 -11 -79 16 63 -44 -29 56 10 -54 19 -16 53 -73 -12 -111 -54 20 77 -9 50 -26
3508 -26 -70 90 -118 42 -109 -111 -22 -23 -22 92 70 8 90 -7 -80 50 67 -8 71 81 47 60 63 -19 4 -14 -112 50 27
3537 27 -51 61 -66 -20 1 9 -29 -43 -3 -12 -61 -31 -134 -85 -37 -8 -142 -61 -2 18 79 4 -34 70 73 28 -41 87 34
3566 34 25 77 27 97 -6 -5 -36 98 -17 76 145 -67 68 19 118 -17 -108 66 23 45 70 -117 56 26 -6 -1 12
3593 12 62 11 116 -32 -57 8 -52 -71 -3 40 5 51 93 31 1 61 21 -68 16 28 59 -34 3 43 103 52 -160 93
3621 93 48 35 -25 -40 12 -66 -83 26 -48 26 102 105 -9 -74 115 -155 32 -25 -63 19 12 -16 -10 -52 -25 65 -86 -34 -85
3650 -85 54 66 36 44 17 -87 48 54 -10 -16 -102 -2 54 24 27 -77 -23 12 -106 -60 15 22 3 -38 -96 -26 33 24 57 11
$$ packed form
3454F3m6n9J35j31o9J12L3n0O4j7m2J4Q4j03J02j49P1J3j3J26j03j24J22q8N7
3479Bm4J2R0oj20J39o4m6K6o8R5M7j07J5Q5m6o4P3l5O9j26O1r9N7P4N7q6N9p6
3508b6m4J60k08J60j51kQ9jJJ14k2o2Q2r7p3J30J7p5P9J0l4J3Lq2K3j8r8J62k3
3537B7p8J12j27M6K1Ql8j4M0rm9L0j03M9M8K9j34Q1N9K0O1p5l8J04Lm5o9J28n3
3566C4rN2n0P0j03Jl1J34j15R3O9k12J35m9R9j35r1J74m3K2K5j87J73l0l2NJ3
3593A2N0n1J05j48k5O5o0j9O8M3l5M6M2o2l0O0m0q9Q4J2L1r3L7M0O0n1k12K53
3621I3m5j3o0j5N2p8j7J09p4P4P6Lj14o5J89k70J87n7l8Q2pk8Om2K7R0j51N2n1
3650h5J39J2l0Qk7j04J35Oo4oq6J00N6l0Lj04N4L5j18M6P5Pj9m1n8P0N9rL3m6
$$ plain form
3680 11 12 -60 -18 -97 -38 109 7 41 12 2 -10 68 -24 26 38 16 -79 84 -8 9 -28 38 81 -67 63 27 -87 60
3708 60 -23 28 -36 -81 5 -41 -24 4 60 56 -60 -136 28 -41 132 47 41 -88 3 -71 16 -66 -13 -118 -78 -24 -120 36
3736 36 22 113 -116 -24 17 29 97 115 -24 102 68 48 -55 -68 0 24 126 -78 -2 -55 58 6 -12 30 29 29 21 -6
3764 -6 40 43 91 -65 -43 38 -37 -135 30 34 9 73 1 43 -55 31 -41 144 -36 -42 -6 53 52 22 -24 11 -161 47 -117
3793 -117 11 -38 -71 92 42 -36 -47 19 -5 -108 -79 50 -21 -95 -163 30 20 59 -63 48 -4 -39 4 13 28 -58 38
3820 38 3 93 -68 -10 -14 46 15 -31 45 40 38 70 7 -13 32 61 5 7 -55 92 10 70 30 -136 -68 68 94 -96 -92 -4
3850 -4 -78 -4 77 -31 43 -46 20 -50 -103 21 -39 -97 57 -7 8 12 -2 33 -2 -74 -32 5 -16 119 -135 -51 -1 -40 -15
3879 -15 -22 -64 35 68 -169 -46 47 -24 56 -43 -68 -66 -46 78 12 -66 50 -2 -57 -69 71 73 62 -60 -85 7 13 -20 -69
$$ packed form
3680A1Jp2M2p9N9J47j02L4k9j0j2P8r2N0J2k2r5J63r2J7l7O6M3j48J30l6j14J47
3708F0q3N1o4m5Q6m6J7K8N6mj16p6J64o9J73q5oj29R1p4Q7q2N3j05M0N4r6J56
3736C6j4R1k29R2M1J2O8J8j39J26l4k0j03j3O8K4J02k04P6n3J13n2j8M2j%qk7
3764fM6LM8j56K2Q1p5r8J65Mk5O4p2M2r8Q6p2J85j80oL6N9jl0m6L5j72K08j64
3793a17J28m9l3J63n0p8j1O6k4j03K9J29p1p4o8J93j0L9j22J11n2l5M3RJ5q6R6
3820C8l5R0j61N8mO0l1m6P6nkL2o3k0M5K9n6Ko2J47q2O0m0j66O8J36K6j90MQ8
3850dp4P4Q1j08P4q9O6p0n3J24o0n8J54o4J5Mj4L5l5p2M2L7k1J35k54Q4N0l9K5
3879a5pm2R9L3k37J23R3p1Q0r9k5KK0J24o6p8J16n2n5j2J40Kj1j22k5R2Ol3m9
$$ plain form
3908 -69 -20 35 -20 -90 -67 -44 93 -25 84 56 21 83 -14 42 -13 -10 -21 75 123 -28 -44 151 95 46 16 -15 -24 -2 24
3937 24 -17 -22 -139 11 56 30 -20 15 53 41 -35 13 17 45 7 79 -59 15 -20 -89 52 -9 -78 27 -2 22 -29 -101 -64
3966 -64 11 -57 5 -12 19 165 1 -54 -44 114 58 -22 36 39 -17 76 57 67 41 30 64 -58 14 31 1 -63 53 -39
3994 -39 122 -18 17 7 -2 17 29 86 22 -82 45 -70 -50 -31 35 83 25 -20 14 13 32 80 99 71 68 26 104 -12 -82
4023 -82 0 21 103 59 71 -8 50 39 41 -104 82 54 -113 -37 23 -98 -94 81 -64 -20 -60 47 -63 -50 -157 -23
4049 -23 35 -13 -44 -52 40 -105 -77 20 28 80 -55 6 78 -42 22 -72 -86 -51 11 49 14 -64 -54 76 27 47 18 54 -53
4078 -53 -27 -64 47 -38 -8 72 -27 62 -14 -55 -46 -103 -95 -8 -16 45 153 -26 -50 -30 19 2 15 -27 -3 -20 -39 31 15 -30
4108 -30 29 -3 -24 84 42 -44 -26 40 15 -104 65 -51 -44 53 32 13 -25 19 108 -21 -97 -51 -2 39 -79 29 -55
$$ packed form
3908f9M9N5n5p0K3K3J37j18J09k8l5O2r7N6n5Lj1R6M8j51j6J95n6m9l0l1rK2K6
3937B4m1nj17J50M5k6n0L5L8j2p6M8MK8l8P2j38P4l5o9J41o1o9J05k9K4n1p2L7
3966f4P5o8O2j7L1J46j64n5J0J58n6q0N8Ln6R3j9J0k6j1L4j22P2J7l0o4J16r2
3994c9J61j40L5j0rJ9J2N7o4j04J27j15K0J9O6M8n8m5L4jJ9M8J9k8lm2P8j16p0
4023h2Q2K1Q2m4J2p9N8j1Kj45J86k8j67P6O0j21MJ75j45M4m0J07j10J3j07J34
4049b3N8m8l1qR2j45K8R7QN2j35O1P2j20O4r4j4L5O2L8l5p8J0J30m9K0k9L6j07
4078e3K6l7J11q5L0Q0r9Q9p6m1Rn7QQ7qO1J08j79k4K0M9j7J3m2K4j7j9P0j6m5
4108c0N9l2k1J08m2q6J8O6k5j19J69j16PR7k1j9l8M4Q9j29p6M6M9M1j18J08q4
$$ plain form
4135 -55 66 62 25 -61 -29 53 20 -101 15 -66 74 -61 -44 -29 -51 -95 -32 46 7 -52 -1 64 -10 -39 44 52 -39 -18 41
4164 41 -63 130 25 -39 69 12 -28 54 -65 -35 51 -17 74 -61 -32 -18 11 -82 -2 -61 37 -75 -17 14 33 89 -89
4191 -89 -15 -51 7 9 28 -47 34 129 -76 -21 4 -106 -13 -17 69 67 -135 6 196 81 10 15 120 15 -20 6 50 36
4219 36 -58 57 -19 -4 53 -98 -1 -108 -72 99 49 -21 -149 -75 -62 28 -42 -71 -3 21 124 52 -75 30 90 44
4245 44 -69 35 -48 -16 -7 81 150 -34 -8 -98 0 -55 -4 66 9 146 18 -22 -12 -15 25 -88 -34 -75 -42 -84 65 -2
4273 -2 -135 -155 -31 -62 -10 61 102 61 -56 -37 47 -14 -12 51 -9 96 4 -45 -1 56 -73 2 25 9 15 -18 -54 0 -79
4302 -79 -60 -24 50 -46 -11 -22 87 -59 -64 24 -45 48 27 30 -25 75 24 65 -147 7 61 6 -100 -5 -33 21 7 -7
4330 -7 -22 18 35 22 -25 -4 -76 -21 23 -26 59 72 -38 -47 19 40 -9 10 -36 42 -21 17 -21 -48 -184 -97 56 -123 22
$$ packed form
4135e5J21ml7q6L2Q2l3j21J16q1J40j35J7J5k2m4O3P8l9n9N1O5p4k9Q3Qr1K1N9
4164D1j04J93j05o4J08n7m0Q2j19L0Q6o8R1j35K9J4K9r3Q0n9R8j12N8L1J9N6j78
4191h9P4l6N8KJ9p5Q1R5k05N5K5j10R3mQ6kk02J41J90j15p1NJ05j05l5K6M4j4
4219C6r4J15p6J5N7j51R7j07L6J71n0p0j28P4J3R0p0k9O8K4J03p2j27J05O0m6
4245D4j13J04q3L2RQ8O9j84K6r0R8n5N1P0n7J37j28m0J0lM0j13N4m1L3m2J49o7
4273bj33k0J24l1N2P1M1m1j17J9Q4o1KO3o0J05r2m9M4N7j29P5K3j6Ol3l6N4p9
4302g9J9L6P4r6L5j1J09j46nQ8o9R3k1Ln5J00n1M1k12J54N4n5j06R5k8N4j4j4
4330gj5M0J7j3m7K1p2N5M4m9Q5J3j10rO6K1m9J9m6P8o3L8l8k7j36Q7J53j79J45
$$ plain form
4359 22 146 -70 -74 -7 64 -35 -77 -6 -50 29 23 50 5 -14 -4 13 72 73 27 -61 87 -64 -113 -13 -86 -9 -26 -13 143
4388 143 -39 -39 -16 -56 67 5 10 6 25 -2 68 10 47 -32 59 18 58 -137 15 31 58 71 97 90 -133 -14 6 116
4416 116 18 -98 18 -133 -30 85 0 -111 24 -40 28 43 -85 72 -58 -102 -157 -47 -111 13 70 -70 29
4439 29 -77 59 61 8 214 -87 58 -7 42 -111 -66 90 -26 -54 -46 45 -35 -79 10 54 -159 34 22 -78 50
4464 50 -90 -34 -28 -43 27 -64 -24 -127 -43 33 -30 -145 31 31 -15 18 151 69 -37 19 -52 -68 -57 124 -12 34 -42
4491 -42 -16 -136 15 55 -77 -79 -66 -38 -30 -18 7 -59 52 -54 50 17 -43 8 -83 117 -35 -98 -80 19 -14 61 55 76
4519 76 2 17 105 6 22 -19 7 -24 -3 -19 8 79 32 42 -7 -2 167 102 2 56 14 131 10 45 -10 -29 -59 -22 -22
4548 -22 46 -39 80 -7 26 36 -7 38 -10 53 -46 13 -9 -35 14 -19 -85 42 -72 103 -80 -39 -14 -64 -67 -5 -27 79
$$ packed form
4359B2J24k16mO7P1r9m2P1m4P9oK7m5j9J0J7N9Jm6q8J48j51m9J00p3P7j7J3J56
4388A43j82%K3m0J23o2NmJ9k7P0n8L7p9R1m1M0j95J52J6K7J3K6pk23J19K0J10
4416A16r8j16J16j51J03J15q5j11J35o4O8J5j28J57j30m4n5J10o4J24N7j40R9
4439B9j06J36Kn3K06l01J45o5M9j53M5J56j16k8QR1q0m4Q9M4k13J93j2j00J28
4464E0j40N6Oj5P0r1M0j03Q4P6o3j15J76%m6L3J33q2j06N6p1j6J1J81j36M6p6
4491d2K6j20J51M0j32kJ3K8QJ2K5o6J11j06J04l3o0N1r1K00j52o3J8R9l3P5oK1
4519G6p4J5Q8r9J6m1K6l1K1j6K7P1m7J0m9NJ69o5j00N4m2J17j21L5n5j9l0L7%
4548b2O8q5J19q7L3J0m3M5m8O3r9N9k2k6M9l3o6J27j14J75j83M1K5n0lO2k2J06
$$ plain form
4576 79 -14 -11 -53 -147 34 69 -75 -15 -48 -64 -74 62 -85 45 -26 -45 -85 -73 110 -97 68 -21 22 -59 51 48 -47
4603 -47 74 -59 48 -46 -46 -39 62 44 104 -51 96 -13 -33 6 -13 -135 -18 62 88 30 -54 -8 1 -34 -38 25 -52 -48
4631 -48 -133 13 -1 72 -10 -72 -36 -16 -33 16 0 -86 -91 61 -62 68 -94 65 -22 -59 -16 -72 54 111 -48 -74 42
4658 42 -10 -17 -88 35 59 54 29 66 22 29 56 -112 -137 -31 13 -20 102 13 -46 -18 -57 37 15 111 19 -36 67 87 101
4687 101 -12 -30 -69 -70 123 -15 -19 -100 -53 -3 -84 67 44 11 -51 12 63 -19 21 54 -43 59 -17 62 6 -72 -81 -35 26
4716 26 -58 47 -29 -77 -164 -38 -8 36 -104 -46 -20 73 12 -19 29 -113 58 -2 78 -135 -63 21 79 -31 34 46 -26
4743 -26 53 10 31 5 157 -3 -105 -8 42 107 62 38 90 51 19 -52 5 56 -8 57 -22 5 -74 56 -85 -72 -52 63
4771 63 -123 117 -55 -37 21 -17 -46 -53 -41 -5 -58 -40 100 -38 5 -13 -87 -17 91 -25 38 -38 47 -59 34 -43 32
$$ packed form
4576G9r3Lm2r4J81L5j44O0l3j6j0J36j47J30p1j9m0J2J83k07J65q9M3q1J10lr5
4603d7J21j33J07r4%PJ01j8O0j55J47j09k0L9j9j22J17Q0K6n8q4M6Rl5mO3p7M
4631d8q5J46j4P3q2o2L6K0j7M9j6q6nJ52j23J30j62J59q7l7M3n6J26N7j59k6J16
4658D2n2pp1J23K4nk5L7m4PK7j68k5J06M4l3J22q9n9K8l9R4k2R6r2n5J03K0J4
4687A01j13j8l9jJ93j38mq1M7N0q1J51k3l3o2O3N1q2M0L3r7J02p6P9n6p8rM6O1
4716B6q4J05p6m8q7J26L0M4j40N8K6R3o1l1M8j42J71o0Q0k13P2Q4N8j10O5J2p2
4743b6P9m3K1k6J52j60j02R7N0O5m5k4N2l9l2p1N7N1o4O5p9K7p9J30j41J3K0J15
4771F3j86K40j72J8N8l8k9pJ2L6n3J8J40j38M3j8p4P0J08j16O3p6Q5j06R3p7P5
$$ plain form
4798 32 8 87 75 8 -10 -42 -29 51 -35 88 41 -67 6 -16 -50 -37 33 -138 -17 -63 77 117 -23 7 -71 150 28
4825 28 6 74 17 -26 11 27 -76 4 56 101 30 -105 -84 -73 19 49 120 21 -70 -59 -63 -59 106 10 -33 6 -119 -30 -25 91
4855 91 9 -87 -145 -11 40 -35 12 18 -63 156 -5 21 29 57 49 62 -58 -16 1 -85 -103 4 -5 -31 81 -39 29 -78
4883 -78 -92 22 44 110 -26 36 7 -46 65 -33 43 -91 -74 40 -30 -64 -68 -76 -11 -128 -36 -35 79 -35 -152 -112 49
4910 49 66 28 70 55 17 75 -59 12 6 -20 15 54 -112 -34 19 -72 -78 32 49 -41 -39 -63 17 33 13 -114 -53 -140 -14
4939 -14 -38 -109 40 -27 -118 -90 8 -1 51 95 47 -181 -2 46 -48 66 73 -22 31 29 45 19 75 -49 -36 35 45 -9 6
4968 6 86 5 125 80 60 31 -69 -17 -46 -62 -26 -13 -130 -76 -112 -42 35 -41 -114 49 19 -77 -39 -4 39 -17 -20 -65 -3
4997 -3 -16 88 1 -1 48 -50 -41 32 -80 0 -12 -48 49 -76 -45 -71 -72 7 5 -29 68 78 50 -22 80 9 63 -41 26 29 -36
$$ packed form
4798C2k4P9j2o7j8l2J3Q0q6J23m7j08P3k2l4J3P0j71J21m6J40M0j40L0p8K21j22
4825B8k2O8n7m3L7J6j03Q0N2M5p1j35K1J1R2L0P1r9r1J1mMJ65r6m3L9j25Q9NJ16
4855I1q2r6n8J34N1p5M7Oq1K19j61K6QK8qJ3j20M2J7q6j8J07rk6J12j20O8j07
4883g8j4J14K2O6j36O2k9n3J11r8P6j34J7J14p0l4mqO5j17R2JJ14j14j17M0J61
4910D9J7l8M2j5l8N8j34P1ok6L5L9j66P8N3r1oJ10J7r0Kk4Q0J6k0j27O1q7J26
4939a4k4p1J49o7r1K8R8rN2M4m8k28J79M8r4J14Pr5N3kJ6k6N6j24J3P1J0n4J5
4968FQ0q1J20m5k0k9j00N2k9j6L6J3j17N4l6P0P7p6p3J63l0r6L8L5M3n6lm5O2
4997cj3J04q7kM9r8RP3j12Q0j2l6R7j25L1k6jP9kl4R7J0k8p2J02p1N4j04O7Lo5
$$ plain form
5028 -36 -21 -35 -100 10 107 -70 148 -16 -36 37 74 51 17 46 -50 13 -73 16 -14 -91 56 116 149 -99 49 -128
5054 -128 -85 164 -11 11 -43 7 82 47 -15 93 31 -27 39 -1 -12 -53 45 53 -47 -116 -55 23 87 -19 55 -10 1 160
5082 160 61 -33 -57 -2 13 -15 30 23 -16 -23 -7 142 64 48 -48 38 -51 1 -20 74 -62 -122 -22 71 11 -47 67 -28 66
5111 66 -17 21 51 -88 -4 -139 33 46 -164 -74 6 -21 -118 -131 -28 23 69 -37 53 -46 50 21 -18 31 61 -41 -30
5138 -30 -37 47 26 -85 71 68 36 -52 -57 -27 29 -5 -43 10 44 23 24 -111 -13 9 30 -85 97 -33 -24 -19 44 -28 71 50
5168 50 61 -43 -19 92 9 -14 -94 -54 -5 -27 58 58 59 -40 -41 -56 -44 -22 -31 33 87 -3 0 15 73 91 -75 52 -38 -22 98
5199 98 85 -18 34 77 16 -1 -31 -99 24 -87 80 -3 -74 27 -49 75 166 -41 -82 -88 75 113 15 -22 2 -45 -18
5226 -18 4 -21 3 -64 -165 -120 33 -46 -67 -49 106 -56 76 89 -56 -20 4 108 -41 -85 -27 29 70 1 34 -9
$$ packed form
5028c6J5j4o5J10R7j77K18j64k0P3L7k3l4K9r6O3q6Q9l0p7J47O0L3k48J48j77
5054a28M3K49j75K2n4N0P5l5o2J08o2n8O6m0j1m1R8Qj00o9O1P8O4j06P4o5J1J59
5082A60r9r4k4N5J5k8M5pl9pJ6J49p8j6r6Q6q9N2k1R4j36o0J00R3o0n8J14r5R4
5111F6q3L8L0j39Q4j35J72J3k10R0Q0k7r7j3J03N1M6j06R0r9R6k9l9M9L0j02J1
5138c0pQ4k1j11J56ll2q8nL0N6l4l8N3L4k1Jj35R8K2K1j15J82j30RNO3p2R9k1
5168E0J1j04K4J11q3k3q0M0M9k2Q5%Jr9jj5J2K2rO4N4r0LJ5N8J8j66J27r0J6J20
5199I8j3j03N2M3o1j7l0o8J23j11J67q3p1J01p6J24R1k07m1oJ63L8r8l7K4m7K7
5226a8K2k5K4o7j01M5J53p9k1J8J55j62J32J3j45L6K4J04j49m4N8N6M1o9L3m3
$$ plain form
5252 -9 -5 -87 53 -15 -41 14 56 -15 0 -32 -36 38 5 -1 58 33 -15 2 -22 53 -4 -14 30 -91 -55 -65 -20 -166 -27 -57
5282 -57 -21 -70 -63 -6 15 120 3 7 46 -29 84 -7 47 -69 -27 94 103 4 -2 64 -75 -93 -54 15 -96 58 -71 28
5310 28 -15 -94 -2 -9 15 -13 59 91 -43 -85 11 -40 -22 -13 26 42 -110 -20 -26 -72 30 -22 -62 96 30 -64 4 -52 79
5339 79 4 76 -38 5 33 -48 16 10 12 48 -61 19 31 -138 -38 -114 -36 -67 76 -105 -172 36 -11 7 -59 49 26
5366 26 -19 -4 -53 -109 -26 38 17 -47 21 22 -54 83 -81 -2 123 83 35 0 29 -45 18 -30 28 42 -31 -45 143 24
5394 24 -60 109 -24 -28 83 -31 81 -47 147 -23 -29 5 20 -1 -4 -52 24 -56 -60 71 -105 -77 -102 2 51 -26 -43
5421 -43 25 29 -78 19 65 20 118 -51 -54 -18 -41 85 -34 20 -69 18 42 -124 -8 38 -118 -78 -48 72 49 43 -32 72
5449 72 -45 -44 -53 2 -31 40 116 64 -29 -27 100 35 25 59 -80 19 56 65 -4 36 47 -95 24 -19 -43 -20 -120 29 -100
$$ packed form
5252iMq2J40o8k6N5M2p1J5l2mP4l3oN9k5m8J7k4P5n7j0M4j21L6j0M5j46J39l0
5282e7L6m9PN7K1J05j17ML9p5J13r1N4j16M2J21Rr9oO6j39j8L9O9j11J54j29R9
5310B8m3p9R2pK4k8P2L2j34m2R6n1J8RL9J6j52R0om6J02n2m0J58o6r4O8n6J31
5339G9p5P2j14M3K8q1O4oKL6j09Q0J2j69J00p6P8l1J43j81o7K08m7J8o6J08k3
5366B6m5J5m9n6Q3O4k1o4O8Jp6J37j64P9J25m0m8l5K9p4O3m8N8J4p3j4J88j19
5394B4q4J69j33mJ11j14J12j28J94j70oL4J5k1lm8P6q0mJ31j76K8k5J04M9p7j7
5421d3O8Mj07R7M6m5R8j69lL6k3J26j19N4q9Q7K4j66J16M6j56M0L0J20k3op5J04
5449G2j17JrN5l3P1P6n2r3KJ27o5j0L4j39R9L7Ro9M0J1j42J19m3k4K3j00J49j29
$$ plain form
5478 -100 10 -74 -28 -113 -37 -109 58 -54 -95 20 2 -16 13 -55 -6 65 8 -143 11 40 -60 61 38 28 -14 -19
5504 -19 -35 -77 48 144 -36 103 34 4 -86 35 -8 46 -90 36 -40 -11 70 -98 3 -75 -27 -40 -49 -57 19 44 -74
5531 -74 1 29 11 -26 37 -5 36 -28 71 45 -54 -13 6 60 24 -17 -115 -51 65 115 118 -16 -11 -50 14 -43 -19 -42 102 -33
5561 -33 -94 28 -8 34 -11 -117 -96 184 -88 -50 12 -39 15 21 149 -87 47 -80 -49 53 -72 48 50 69 -71
5586 -71 98 30 95 102 -97 64 -23 16 -38 -20 38 -33 -17 29 11 -30 -54 23 30 9 99 -5 76 134 -17 -58 -36 49 -48
5615 -48 22 -19 -20 -44 187 48 -57 58 8 31 25 -9 -13 -80 -50 114 -30 71 -17 -48 -82 56 7 -42 -49 -16 74 -13
5643 -13 -6 -67 55 20 -7 -35 7 7 -11 32 12 47 -58 4 20 47 85 20 7 26 50 -4 67 41 40 26 79 -44 -77 104
5673 104 -13 -88 5 146 -51 -33 -19 -45 47 -66 -138 52 47 43 80 -112 -40 20 13 -18 29 -9 -78 26 -136 80 -79
$$ packed form
5478a00J10q4M6q5P6p2J67j12m1J15j8j8K9o8M9P1n7j51J54K9j00J21k3j0m2n
5504a9j6m2J25R6j80J39o9l0r0J21m3N4j36J26p6K9Q1j68J01p8M8j3rqP6K5j18
5531g4P5K8j8l7O3m2M1o4R9k6r9M1J9N4l6m1r8O4J16N0Lj34Nl9O4n7K4k3J44j35
5561c3o1J22l6M2m5j06K1K80k72L8O2n1N4OJ28k36J34j27L1J02j25J20KJ9j40
5586g1J69o8O5Pj99J61q7L9n4J8N8p1J6M6j8m1k4P7Pk1R0j04Q1N8j51m1K2Q5r7
5615d8P0m1jk4K31j39j05J15n0K3ol4mo7L0J64j44J01q8l1l4J38m9m9pL3R0q7
5643a3Po1J22l5k7k8M2%j8M3k0L5j05O2J6K7L8o5j3J9K4n4P1k6jj4N3j23l3J81
5673A04j17p5R3J41j97J8J4k6R2j13p2J90nmL7j92P2O0pl1M7l8o9J04j62K16j59
$$ plain form
5700 -79 -46 -49 -10 -139 -69 -75 82 -26 79 79 106 48 -12 13 83 157 -178 123 27 -18 5 -2 -101 56 -59 -29 64 -4
5728 -4 -68 -31 -19 28 44 -78 -13 44 -83 40 11 -63 7 21 -46 -3 6 38 -45 -81 -42 91 -115 4 -91 -32 -29 135
5756 135 55 99 59 -103 73 -34 15 58 -115 -39 25 -16 -119 -74 47 -121 -57 46 -55 37 8 -93 78 -26
5780 -26 -5 -126 -23 -41 119 -72 95 -106 39 19 -8 52 -44 105 -134 25 35 14 -68 -94 -67 -46 12 -5 -34
5805 -34 -7 12 92 -67 -4 -13 42 111 -47 -78 36 -34 32 51 -17 -54 56 44 -63 98 -98 -63 4 -116 10 14 -20
5832 -20 -84 49 -100 80 -31 -39 62 -104 55 3 76 -36 9 86 -34 10 -31 108 -110 5 37 -33 -12 15 92
$$ packed form
5700g9L3lL9j29P0oJ57j08J05%K7n8o0K5P0P4l35L01r6m5K3pr9J57j15L0R3o8
5728do4L7J2M7J6j22O5N7j27J23k9p4P0J4o7M3RL2q3l6L9J33k06J19r5N9LJ64
5756A35q0M4m0j62J76j07M9M3j73P6O4m1j03M5J21j68O4J03j01R2k9j01J71j04
5780b6K1j21J03j8J60j91J67k01J45k0k7O0r6J49k39J59J0k1q2k6K7K1N8j7k9
5805c4K7J9Q0j59O3rN5O9j58l1J14p0O6J9o8l7J10j2j07J61j96L5O7j20J26Ml4
5832b0o4J33j49J80j11qJ01j66J59n2P3j12M5P7j20M4m1J39k18J15L2p0K1K7P7
$$ [...]
8191A3
##END NTUPLES=NMR FID
##END=
