##TITLE=1H_DE-80H_X3
 200.13MHz, d2o
 8 sc
 
 19ns.26.2.2025
##JCAMPDX= 6.0         $$ Bruker NMR JCAMP-DX V2.0
##DATA TYPE= NMR FID
##DATA CLASS= NTUPLES
##ORIGIN= UXNMR, Bruker Analytische Messtechnik GmbH
##OWNER= pz
$$ XWIN-NMR		Version 3.5
$$ Tue Jul 21 13:50:19 2026 Russian Standard Time (UT+4h)  Yarkov@DPX200
##.OBSERVE FREQUENCY= 200.1313
##.OBSERVE NUCLEUS= ^1H
##.DELAY= (6, 6)
##.ACQUISITION MODE= SIMULTANEOUS
##.ACQUISITION SCHEME= undefined
##.AVERAGES= 8
##.DIGITISER RES= 18
##SPECTROMETER/DATA SYSTEM= spect
##.PULSE SEQUENCE= zg30
##.SOLVENT NAME= CDCl3
##.SHIFT REFERENCE= (INTERNAL, CDCl3, 0, 14.3821)
##AUDIT TRAIL= $$ (NUMBER, WHEN, WHO, WHERE, WHAT)
$$ ##TITLE= Audit trail, XWIN-NMR		Version 3.5
$$ ##JCAMPDX= 5.01
$$ ##ORIGIN= Bruker BioSpin GmbH
$$ ##OWNER= Yarkov
$$ C:/Bruker/XWIN-NMR/data/yarkov2/nmr/H-C/1/audita.txt
$$ ##AUDIT TRAIL=  $$ (NUMBER, WHEN, WHO, WHERE, WHAT)
(   1,<2026-07-21 13:49:21.37 +0400>,<Yarkov>,<DPX200>,
      <created by zg, POWCHK disabled, PULCHK disabled
       configuration hash MD5:
       00 E9 B6 7A A2 85 ED C7 34 08 36 98 17 FE 4E 26
       data hash MD5: 16K
       39 42 F6 CD B2 9F FD 95 5C 4C E4 ED 8E B7 8D CE>)
$$ ##END=
$$ 
$$ hash MD5
$$ 88 C0 86 CB DD C1 97 57 11 F2 B9 69 3D 86 27 E8
##$RELAX= 
##$RELAX= 
##$RELAX= 
##$RELAX= 
##$RELAX= 
##$RELAX= 
$$ Bruker specific parameters
$$ --------------------------
##$DU= <C:/Bruker/XWIN-NMR>
##$EXPNO= 1
##$NAME= <H-C>
##$PROCNO= 1
##$TYPE= <nmr>
##$USER= <yarkov2>
##$AMP= (0..31)
100 100 100 100 100 100 100 100 100 100 100 100 100 100 100 100 100 100 
100 100 100 100 100 100 100 100 100 100 100 100 100 100 
##$AQSEQ= 0
##$AQ_mod= 1
##$AUNM= <au_zg>
##$AUTOPOS= <>
##$BF1= 200.13
##$BF2= 200.13
##$BF3= 200.13
##$BF4= 200.13
##$BF5= 200.13
##$BF6= 200.13
##$BF7= 200.13
##$BF8= 200.13
##$BYTORDA= 1
##$CFDGTYP= 0
##$CFRGTYP= 5
##$CHEMSTR= <none>
##$CNST= (0..31)
1 1 145 1 1 1 1 1 1 1 1 1 1 1 1 1 1 1 1 1 1 1 1 1 1 1 1 1 1 1 1 1 
##$CPDPRG= <>
##$CPDPRG1= <>
##$CPDPRG2= <>
##$CPDPRG3= <>
##$CPDPRG4= <mlev>
##$CPDPRG5= <mlev>
##$CPDPRG6= <mlev>
##$CPDPRG7= <mlev>
##$CPDPRG8= <mlev>
##$CPDPRGB= <>
##$CPDPRGT= <>
##$D= (0..31)
0 0.7 0 0 0 0 0 0 0 0 0 0.03 0 0 0 0 0 0 0 0 0 0 0 0 0 0 0 0 0 0 0 0 
##$DATE= 1784627360
##$DBL= (0..7)
120 120 120 120 120 120 120 120 
##$DBP= (0..7)
150 150 150 150 150 150 150 150 
##$DBP07= 0
##$DBPNAM0= <>
##$DBPNAM1= <>
##$DBPNAM2= <>
##$DBPNAM3= <>
##$DBPNAM4= <>
##$DBPNAM5= <>
##$DBPNAM6= <>
##$DBPNAM7= <>
##$DBPOAL= (0..7)
0.5 0.5 0.5 0.5 0.5 0.5 0.5 0.5 
##$DBPOFFS= (0..7)
0 0 0 0 0 0 0 0 
##$DE= 6
##$DECBNUC= <off>
##$DECIM= 32
##$DECNUC= <off>
##$DECSTAT= 4
##$DIGMOD= 1
##$DIGTYP= 9
##$DL= (0..7)
0 120 120 120 120 120 120 120 
##$DP= (0..7)
150 150 150 150 150 150 150 150 
##$DP07= 0
##$DPNAME0= <>
##$DPNAME1= <>
##$DPNAME2= <>
##$DPNAME3= <>
##$DPNAME4= <>
##$DPNAME5= <>
##$DPNAME6= <>
##$DPNAME7= <>
##$DPOAL= (0..7)
0.5 0.5 0.5 0.5 0.5 0.5 0.5 0.5 
##$DPOFFS= (0..7)
0 0 0 0 0 0 0 0 
##$DQDMODE= 0
##$DR= 18
##$DS= 0
$$ [...]
##$SUBNAM2= <"">
##$SUBNAM3= <"">
##$SUBNAM4= <"">
##$SUBNAM5= <"">
##$SUBNAM6= <"">
##$SUBNAM7= <"">
##$SUBNAM8= <"">
##$SUBNAM9= <"">
##$SW= 18.0517328524113
##$SWIBOX= (0..15)
0 0 2 0 0 0 0 0 0 0 0 0 0 0 0 0 
##$SW_h= 3612.71676300578
##$TD= 16384
##$TD0= 1
##$TE= 0
##$TE2= 300
##$TE3= 300
##$TEG= 300
##$TL= (0..7)
0 120 120 120 120 120 120 120 
##$TP= (0..7)
150 150 150 150 150 150 150 150 
##$TP07= 0
##$TPNAME0= <>
##$TPNAME1= <>
##$TPNAME2= <>
##$TPNAME3= <>
##$TPNAME4= <>
##$TPNAME5= <>
##$TPNAME6= <>
##$TPNAME7= <>
##$TPOAL= (0..7)
0.5 0.5 0.5 0.5 0.5 0.5 0.5 0.5 
##$TPOFFS= (0..7)
0 0 0 0 0 0 0 0 
##$TUNHIN= 0
##$TUNHOUT= 0
##$TUNXOUT= 0
##$USERA1= <user>
##$USERA2= <user>
##$USERA3= <user>
##$USERA4= <user>
##$USERA5= <user>
##$V9= 5
##$VALIST= <valist>
##$VCLIST= <CCCCCCCCCCCCCCC>
##$VD= 0
##$VDLIST= <DDDDDDDDDDDDDDD>
##$VPLIST= <PPPPPPPPPPPPPPP>
##$VTLIST= <TTTTTTTTTTTTTTT>
##$WBST= 1024
##$WBSW= 4
##$XGAIN= (0..3)
0 0 0 0 
##$XL= 0
##$YL= 0
##$YMAX_a= 51710
##$YMIN_a= -80539
##$ZGOPTNS= <>
##$ZL1= 120
##$ZL2= 120
##$ZL3= 120
##$ZL4= 120
##$ABSF1= 10
##$ABSF2= 0
##$ABSG= 5
##$ABSL= 3
##$ALPHA= 0
##$AQORDER= 0
##$ASSFAC= 0
##$ASSFACI= 0
##$ASSFACX= 0
##$ASSWID= 0
##$AUNMP= <proc_1d>
##$AZFE= 0.1
##$AZFW= 0.1
##$BCFW= 1
##$BC_mod= 2
##$BYTORDP= 1
##$COROFFS= 0
##$CY= 83.5205535888672
##$DATMOD= 1
##$DC= 2
##$DFILT= <>
##$DTYPP= 0
##$F1P= 10.8118882576601
##$F2P= -7.23987719738617
##$FCOR= 0.5
##$FTSIZE= 0
##$FT_mod= 4
##$GAMMA= 1
##$GB= 0.15
##$INTBC= 1
##$INTSCL= 1
##$ISEN= 128
##$LB= 0.25
##$LEV0= 0
##$LPBIN= 0
##$MAXI= 10000
##$MC2= 0
##$MEAN= 0
##$ME_mod= 0
##$MI= 1.114404
##$NCOEF= 0
##$NC_proc= 0
##$NLEV= 6
##$NOISF1= 3.799351
##$NOISF2= 2.8
##$NSP= 1
##$NTH_PI= 0
##$NZP= 0
##$OFFSET= 14.38212
##$PC= 1
##$PHC0= -7261.524
##$PHC1= 15.42198
##$PH_mod= 1
##$PKNL= yes
##$PPARMOD= 0
##$PSCAL= 0
##$PSIGN= 0
##$REVERSE= no
##$SF= 200.129724274929
##$SI= 16384
##$SIGF1= 3
##$SIGF2= 2
##$SINO= 400
##$SIOLD= 16384
##$SREGLST= <1H.CDCl3>
##$SSB= 0
##$STSI= 0
##$STSR= 0
##$SW_p= 3205.1282051282
##$SYMM= 0
##$S_DEV= 0
##$TDeff= 0
##$TDoff= 0
##$TI= <>
##$TILT= no
##$TM1= 0
##$TM2= 0
##$TOPLEV= 0
##$USERP1= <user>
##$USERP2= <user>
##$USERP3= <user>
##$USERP4= <user>
##$USERP5= <user>
##$WDW= 1
##$XDIM= 8192
##$YMAX_p= 0
##$YMIN_p= 0
$$ End of Bruker specific parameters
$$ ---------------------------------
##NTUPLES= NMR FID
##VAR_NAME=  TIME,          FID/REAL,        FID/IMAG
##SYMBOL=    X,             R,               I
##VAR_TYPE=  INDEPENDENT,   DEPENDENT,       DEPENDENT
##VAR_FORM=  AFFN,          ASDF,            ASDF
##VAR_DIM=   8192,          8192,            8192
##UNITS=     SECONDS,       ARBITRARY UNITS, ARBITRARY UNITS
##FACTOR=    0.0002768,     1,               1
##FIRST=     0,             0,               0
##LAST=      2.2672688,     0,               0
##MIN=       0,             -80539,          0
##MAX=       2.2672688,     51710,           0
$$ Real data points
##PAGE= N=1
##DATA TABLE= (X++(R..R)), XYDATA
$$ [...]
951D27m80o35N30r6j38L64n22K26M23j31M39l64m87J129k06m72O09n69q2O64l38
$$ 427 -53 -688 -158 -254 -392 -28 -550 -324 99 -32 407 43 -444 685 479 7 616 47 -35 629 291
972B91k68k03l09Q31j77r31M90p9m2O44q12P1J117n92J1K20l17L85j13kM09p13
$$ 291 23 -180 -489 342 165 -766 -276 -355 -397 247 -565 -494 623 31 42 262 -55 330 217 215 624 -89
994h9j42R45n94m20K28m42M60j9r11P17J18n01O31j65K66M07p29M10O64m71J78
$$ -89 -231 714 120 -300 -72 -514 -54 -73 -984 -267 -149 -650 -19 -184 82 489 -240 170 834 363 541
1015E41k09m13P02l28n73L60n22J6M63o06K25R6m18O00J55n31O56r5K07O00p93
$$ 541 332 -81 621 293 -280 80 -442 -426 37 -569 -344 -248 -666 -66 89 -442 214 119 326 926 133
1036A33%R22m74m85q2k68O93n94o35N39l68K0N38n16O7N75l50O29K94p47N62L03
$$ 133 133 1055 581 96 14 -254 439 -155 -790 -251 -619 -599 -61 -577 -510 65 -285 344 638 -109 453 756
1058G56k03M9o02J84L83q00j68K49o73L15J77n49M84J2k07P18k27P7N69m56M39
$$ 756 553 602 0 184 567 -233 -401 -152 -825 -510 -333 -882 -398 -386 -593 125 -102 -25 544 88 527
1079E27L33n42K91j15o15M78k64n51J89k03%J96n08M80K24m98Q10K18o49O41O2
$$ 527 860 318 609 494 -121 357 93 -458 -269 -472 -472 -276 -784 -304 -80 -578 232 450 -199 442 504
1100E04O5L85p82L3L57l48o4j69m95M77l73l86O78k85l10Q48k84n0N60j30L43
$$ 504 569 954 172 205 562 214 150 -19 -514 -37 -410 -796 -118 -403 -713 135 -149 -199 361 231 574
1121E74j37l03M18o2m59M76o06o7L23p13J14J73l74L27J13m27M83J12l3L61l81
$$ 574 437 134 552 490 31 507 -99 -166 157 -556 -442 -269 -643 -316 -203 -630 -147 -35 -68 293 -88
1142h8m8P33m10R8K06n45K25J6l85M79m78k33M76l07k15M33k20K26Q5m67O07J
$$ -88 -136 597 187 285 491 -54 171 187 -198 281 -197 -430 46 -261 -476 -43 -263 -37 48 -419 188 189
1164A89l89N01K6k04K67l26R7K83m11Q5k5m22L15j20j50L49n23J41O25n02K4M36
$$ 189 -200 301 327 123 390 64 161 444 33 118 93 -329 -14 -134 -284 65 -458 -317 308 -194 -170 266
1186B66m49L37L5j31L03j79m15O56m11j02O39p03N2K76n42J97Q1m80M17p1OJ75
$$ 266 -183 154 189 58 361 182 -233 423 12 -90 549 -154 -102 174 -368 -171 -90 -570 -153 -224 -218 -43
1208d3k43L4N54m22J93M71m86K98J19l10J28j85j31K21m77qL37n61J45K33k83
$$ -43 -286 -252 302 -120 73 544 58 356 475 165 293 108 -23 198 -279 -287 50 -511 -366 -133 -416
1229d16K78R1j85O02j47m1M18l95K36J14n43K34Ln46M90l27k10J40j85m0J65j49
$$ -416 -138 -47 -232 370 223 182 600 205 441 555 12 246 249 -297 193 -134 -344 -204 -389 -429 -264 -413
1251d13J24L93l15M21P0k53M49Rk33L74m83l1L26o02P0J7n87M31o5k22L97k37
$$ -413 -289 104 -211 210 280 27 476 485 252 626 143 112 438 -164 -94 -77 -664 -233 -298 -520 -123 -360
1273c60jN57j14q7N35m59K82K48m84L37p2m06L87l70k79J07l63K33Pl24K95K54
$$ -360 -361 196 82 -5 530 71 353 601 117 454 382 -24 363 -7 -286 -179 -542 -309 -302 -626 -331 -77
1295g7l10N19P2k37N38k69J17L29l56M0L9m34J12r2l65L21k01k35K91k01pM16
$$ -77 -387 132 204 -33 505 236 353 682 326 366 405 -29 83 -9 -374 -53 -254 -489 -198 -399 -406 10
1317A0l18L01K28l07L54Q4k12L27j69m11L77O8j75p7m71K41M5l86K57n6j70N63
$$ 10 -308 -7 221 -86 268 352 140 467 298 -113 264 332 157 80 -391 -150 -105 -491 -234 -290 -460 103
1339A03k11j2M72l54J09L23l33J50M8k48J65l6k77K61k28k38L32l11rK15j64L18
$$ 103 -108 -120 352 -2 107 430 97 247 295 47 212 176 -101 160 -68 -306 26 -285 -294 -79 -243 75
1361G5j37k94N90j38o4J97j90R6K66m31J31K98m26J62K6k67J78j11k77M05k23
$$ 75 -62 -356 234 96 32 229 39 135 401 -30 101 399 -27 135 161 -106 72 -39 -316 89 -134
1382a34j03K83j60m3J69j18K22q1N6K02k87j61M16j82q6J75l55J49J73l88J66
$$ -134 -237 46 -114 -157 12 -106 116 35 91 293 6 -155 261 79 -7 168 -187 -38 135 -253 -87
1403h7j3k53L11r8j12L33k59J12K50l00J16K61j76J75j62J8J45k66q7L19m37N5
$$ -87 -100 -353 -42 -140 -252 81 -178 -66 184 -116 0 261 85 260 98 116 261 -5 -92 227 -210 -155
1425a55J13k34J53O6k66L31K5p2L36j64j4K50k36J54J73m25J30P8k02L4k00j62
$$ -155 -42 -276 -123 -57 -323 8 33 -39 297 133 119 369 133 287 460 35 165 243 41 75 -125 -287
1447b87J65k02R1K8j14J50J85j84K13J61n2K39j6j39K57l89m4J59l21K1O1l41
$$ -287 -122 -324 -233 -205 -319 -169 16 -168 45 206 154 393 377 238 495 106 62 221 -100 -79 -18 -359
1469c59K58j60j58K59k8n1L07m7j1L09j52J76J05l41K25j3k10M1k15j44J52k11
$$ -359 -101 -261 -419 -160 -188 -239 68 21 10 319 167 343 448 107 332 319 109 150 -65 -209 -57 -268
1491b68j5L8j81J80J52j96L12L9j03M09l18J68K26k37M0j4j64J1o1j93J44k11
$$ -268 -283 -245 -426 -246 -94 -290 22 61 -42 367 49 217 443 206 246 232 68 79 18 -175 -31 -242
1513b42j7qL1N1K38l37L53J01j27K15P2k62K09q5n7qm8p6J3k60N2J07k57K65J1
$$ -242 -259 -267 -236 -185 53 -284 69 170 43 258 330 68 277 192 135 127 79 3 16 -244 -192 -85 -342 -77 -66
1538f6k08K30P4j02K36j91L2K68k65J99L0k79K64k59KJ01p6k80L24j10j43K51
$$ -66 -274 -44 30 -72 164 -27 5 273 8 207 237 -42 222 -37 -35 66 -10 -290 34 -76 -219 32
1560C2k81K58n7p4L60k58o7K54n1j51K83j33o3J71k26j3O1j16R1p7j39K62j83
$$ 32 -249 9 -48 -122 238 -20 -87 167 116 -35 248 115 52 223 -3 -16 45 -71 20 -57 -196 66 -117
1583a17L9J06k91K12R3k06K24K5j16J31j1l2L1P8j69J34j87P9J6k32K51j01j91
$$ -117 -78 28 -263 -51 42 -164 60 85 -31 100 89 57 88 166 -3 131 -56 23 39 -193 58 -43 -234
1606b34J08Q1k04K47j38K7J50kM4l6k9K61j60k32K37j02j28K75k58P0o7k19K12
$$ -234 -126 -45 -249 -2 -140 -113 37 35 79 43 14 275 115 -117 120 18 -110 165 -93 -23 -90 -309 -97
1629i7O9j53J67j48Q0M11k65j27L79k44N0O6q8K9p3j26J47r0j79J83j98qJ67k63
$$ -97 -28 -181 -14 -162 -82 329 64 -63 316 72 122 188 100 129 56 -70 77 -13 -192 -9 -207 -215 -48 -311
1653c11J27J45l1J58M2j22J61j41P9K01k63k7R1j35k5O1k15J0KN7J24k05k4L31
$$ -311 -184 -39 -70 88 130 8 169 28 107 308 45 18 109 -26 -51 10 -205 -195 -193 -136 -12 -217 -241 90
1677I0m3L0Q5l5M9p0RLP7k13J31j20o9J24l22M4K12k56Q6N5m0J55M1n0J75n9J0
$$ 90 47 77 162 127 176 106 115 118 195 -18 113 -7 -76 48 -274 -230 -18 -274 -188 -133 -173 -18 23 -27 148 89 99
1704I9K02k58R0ko4N8k48R0m3j81J27K02k15o4K29p5NJ34l7J44j58O2J58j18n4
$$ 99 301 43 133 131 67 125 -123 -33 -76 -257 -130 72 -143 -207 22 -53 -48 86 49 193 35 97 255 137 83
1729H3K5o8j17J20k83J94n5r0J50Pp5P9j41N8Q9m0J61J07j57j9O0j8J39k09r2
$$ 83 108 40 -77 43 -240 -46 -101 -191 -41 -34 -109 -30 -171 -113 -24 -64 97 204 47 28 88 70 209 0 -92
1754i2J60j55q6J44j70O1J43j40R1K9N6m6J1M8O6j48O3O6L7N4m7k22J38k5j10
$$ -92 68 -87 -173 -29 -199 -138 5 -135 -44 -15 41 -5 6 54 120 -28 35 101 138 192 145 -77 61 36 -74
1779g4J24q1o6Q5p6l6K48k92J26o0QJ18l0O7p5P4P2M8k31J64q7j04J74p5j19l1
$$ -74 50 -31 -97 -12 -88 -124 124 -168 -42 -102 -94 24 -6 61 -14 60 132 180 -51 113 26 -78 96 21 -98 -129
1805a29Q8OJ9Pq3L19k73J31j44OJ61k0q5K5O4n3R8j65qk1n5L5R0l23J35Q6p2J80
$$ -129 -41 -35 -16 -9 -92 227 -46 85 -59 -53 108 88 3 28 92 39 137 -28 -36 -57 -112 -77 13 -310 -175 -89 -161 19
1833A9Qj8J28j86J57N8r2J34n1q0N4n2k54P4J6p5N5k5R1l1o1J94n9k7P5K4o6Q7
$$ 19 27 9 137 -49 108 166 74 208 157 77 131 79 -175 -101 -85 -160 -105 -130 -39 -70 -131 63 4 -23 52 76 10 97
1861I7n7j5J57j58L6j07qQ1Nl08K35o6j5L1n4j2J84K2n1R8n3J04K2j51J68j05
$$ 97 40 25 182 24 60 -47 -55 26 31 -277 -42 -108 -123 -92 -146 -158 26 48 -3 95 42 146 168 17 185 80
1887H0p8J36j02m7j5m6p8J63j63M4O7j19J65J73j02oj7LK25j48j07M7j08K6ln0
$$ 80 2 138 36 -11 -26 -72 -150 13 -150 -106 -39 -158 7 180 78 72 55 58 283 135 28 75 -33 -7 -10 -60
1913f0J9m9j14J27p2P0Q6q8P4J36r7K3l2l4K22j32k7pJ1j04n8r6J74n3j4K36l70
$$ -60 -41 -90 -204 -77 -149 -79 7 -81 -7 129 32 55 23 -11 211 79 52 45 56 -48 -106 -202 -28 -81 -95 141 -229
1940b29J21K61k10k5J06j29K40k8q0m5J35l8L3o2o7Nj12l0K11r9k8K0K4j1R3r1
$$ -229 -108 153 -57 -82 24 -105 135 107 27 -18 117 79 112 50 -17 -12 -124 -154 57 -42 -70 -50 -26 -37 56 -35
1966c5Q8k3K2qk9J47k37J40r1J42k0Q6k51j3Q0p1j25K56p9m9pj01J62R4l8L3m6
$$ -35 53 30 52 44 15 162 -75 65 -26 116 96 182 -69 -82 -2 -73 -198 58 -21 -70 -77 -178 -16 78 40 73 27
1993B7l0O8pj38K49j35j5Q6k04J62n5j95J37Pp6P1ok6K00j57M9M9q4k2J19P4r4
$$ 27 -3 65 58 -80 169 34 19 105 -99 63 8 -187 -50 -43 -119 -48 -54 -80 120 -37 12 61 -23 -45 74 148 54
2020E4nj5R4j22L8K8k26j4J09j20J56nm3J13j50J31N2%j39J08Q0K5n0m6q3J65
$$ 54 49 34 128 6 44 72 -154 -168 -59 -179 -23 -28 -71 42 -108 23 75 75 -64 44 124 149 99 53 -30 135
2046A35j30o5l2k1L4l3J12J38k63J16J15j67J58q5K4J64j58q6J97j71P9P4j71
$$ 135 5 -60 -92 -113 -79 -112 0 138 -125 -9 106 -61 97 12 36 200 42 -44 153 -18 61 135 -36
2069c6J3L4k02R0N2o6K4L5m7J06j5N9K5J9L7K1q7L0k2j15LJ4j60K43k0j79Q4m8
$$ -36 -23 11 -191 -101 -49 -115 -91 -56 -103 3 -12 47 72 91 128 149 62 92 70 -45 -42 -28 -188 55 35 -144 -60 -108
2097a08O9P1j23Q7J52j01Q8q9Q2j5o9p1q0J16Q7rj95M8K3p9J32l1p2J18j73J18
$$ -108 -39 32 -91 -4 148 47 135 46 128 113 44 -27 -107 9 96 87 -108 -60 -37 -116 16 -15 -87 31 -142 -24
2123b4P2J9Q2m0j10R2j9n7J58j00j78j17K02m7J3l0JK7o7J46l9k2L4k6Q9Nj00
$$ -24 48 67 149 109 -1 91 72 15 173 73 -105 -222 -20 -67 -54 -84 -83 -56 -123 23 -16 -38 -4 -30 59 64 -36
2150c6J34k9j10J8k1m0K6j3M1N8n0q6OJ29j9n5K8R9o5o7J05QR4j20J17j77J7J7
$$ -36 98 69 -41 -23 -44 -84 -58 -71 -30 28 -22 -108 -102 27 8 -47 -19 80 15 -52 53 61 155 35 152 -25 -8 9
2178Il0J2rKj4J2N4o0Q0j5j52L9O0M0l6m5J28O8j22o9R1Pj18L0o7Q0p5j3J04l4
$$ 9 -21 -9 -18 -16 -30 -18 36 -24 56 41 -111 -72 -12 28 -8 -53 75 143 21 -48 43 50 -68 -38 -105 -25 -100 -113 -9 -43
2208d3o8J62n2n8M9lRN0j60K38o0o7P4lj48R9Jr8P0p7pJ25m3RN5j18R0K6j76J86
$$ -43 -111 51 -1 -59 -10 -13 -4 46 -114 124 64 -3 71 68 -80 19 20 -78 -8 -85 -92 33 -10 -1 54 -64 26 52 -124 62
2238F2p2jR8j01J56o6m7M1N6k46J38r6n5J12j40j0O7R0Q1L7m3L3N0j09M2m8mN2
$$ 62 -10 -11 87 -14 142 76 29 70 126 -120 18 -78 -133 -21 -161 -171 -104 -14 67 104 61 94 144 35 77 29 25 77
2266G7m8n6k6O6R0j14j04Q5R3j26o5J06m9K00q7J1n0O7N2m6j51J18k9k5o4L3m5
$$ 77 29 -27 -53 13 103 -11 -115 -30 63 -63 -128 -22 -71 129 42 53 3 70 122 76 -75 43 14 -11 -75 -42 -87
2293h7rrK6J60j45n7J85j22J47Mm0P9j01J4J20j98O4P3j75J88j13j42J36j58J11
$$ -87 -96 -105 -79 81 -64 -121 64 -58 89 93 53 132 31 45 165 -33 31 104 -71 117 4 -138 -2 -160 -49
2318d9J0k1R2J3n2q8J23k7Q0L8q3nj38L9J54k01N2l7O9O0q5r0J04N2j6J08l8n2
$$ -49 -39 -60 32 45 -7 -95 28 1 81 119 36 31 -107 -68 86 -115 -63 -100 -31 29 -56 -146 -42 10 -6 102 64 12
2346A2K4j04K00o4O9j51J29o9NL5k02RQ0r3J39j6j10R7r7R3l4P2N5o2%p6J4J39
$$ 12 36 -68 132 68 137 -14 115 46 51 86 -116 -107 -27 -120 19 3 -107 -10 -107 -14 -48 24 79 17 17 -59 -45 94
2374I4o5p7LN2j86K08M2n2L4j09rj5J70m5M8j67J72n4m5n4J55j30Q6M6j56J51
$$ 94 29 -48 -45 7 -179 29 71 19 53 -56 -65 -80 90 45 93 -74 98 44 -1 -55 100 -30 56 102 -54 97
2400I7j44l2Q0M4J3q1K3J23j48k4O3j29R8Rk8M7K1Ln7RL9M6n7k7L6L8K0j07j3
$$ 97 -47 -79 1 45 58 -23 0 123 -25 -49 14 -115 -17 -8 -36 11 32 35 -22 -13 26 72 15 -12 24 62 82 -25 -38
2429c8l8M4L1j04O5n5J9J29j19J70j58N1J15j31N2m3MO9j04J00j61O6RJ7n4j6
$$ -38 -76 -32 -1 -105 -40 -95 -76 53 -66 104 -54 -3 112 -19 33 -10 -6 63 -41 59 -102 -36 -27 -10 -64 -80
2455h0k2K36j42N6o7m4K35j64m0K61l23L6J11p1M8k48K71r0j15R1M4l4J30L6j29
$$ -80 -102 134 -8 48 -19 -63 172 8 -32 229 -94 -58 53 -18 30 -218 53 -37 -152 -61 -17 -51 79 115 -14
2480a4L5R7j13J22r3P3j14J7J29k27QJ24o2j16J49ko0J5M5p1L1j1K1k7J55k7J
$$ -14 21 118 5 127 34 107 -7 10 139 -88 -80 44 -18 -134 15 13 -47 -32 13 -58 -27 -38 -17 -44 111 84 85
2507H5o2M6O1m4j63q3R4N1j0l0N6n7L4k0J6J5j7J24j12M3N4L8j28PO0o2KL6j07
$$ 85 23 69 130 86 -77 -160 -66 -15 -25 -55 1 -56 -22 -42 -26 -11 -28 96 -16 27 81 119 -9 -2 58 -4 -2 34 -73
2536g3O4L0p6j2k8J59j77rJ23j1L6m9J03j0m0r4R5k5p1J51r2M3oq3J7M2o2oO8
$$ -73 -9 21 -55 -67 -95 64 -113 -122 1 -10 26 -23 80 70 30 -64 31 6 -65 86 -6 37 31 -52 -35 7 -55 -61 7
2565GM0qL2p2J28j54J22j8j7L7j68R9l9K0m7P5L9k5n3j01L1pJ09q0J20q2L3J21
$$ 7 47 39 71 -1 127 -27 95 77 60 97 -71 28 -11 9 -38 37 76 51 -2 -103 -72 -79 30 -50 70 -12 21 142
2593A42q7PjM0r5J17j87O2l9P9Q5j43m6R2n8JP4L4q7Q0J7r8j56R6J14J5m9p9K
$$ 142 55 62 61 101 6 123 -64 -2 -41 38 123 -20 -66 26 -32 -31 43 77 -10 70 87 -11 -167 -71 43 58 9 -70 -68
2622f8M3J3k9O3j56J9J21q8J01n7k7J87j62m2K07o7o8R6p6P5l5o2lJ11j20pN1
$$ -68 -25 -12 -41 22 -134 -115 6 -82 19 -38 -65 122 -40 -82 125 58 -10 86 10 85 50 -12 -15 96 -24 -31 20
2649B0q3M4j08J15Q6m6o5R5K0j63J95p8J00o0m6Rm0M0k10J70o8M5k6n1J20J17
$$ 20 -63 -19 -127 -12 74 28 -37 58 78 -85 110 32 132 72 26 35 -5 35 -175 -5 -73 -28 -54 -105 15 132
2675A32p8r0K0J9M6q4j4P2J7L7p3P2N1k06P3P0j47J10qj04Q9j79J94nm9j0J8J94
$$ 132 54 -36 -16 3 49 -35 -49 23 40 77 4 76 127 -79 -6 64 -83 27 19 -85 4 -175 19 14 -35 -45 -27 167
2703A67k38pQ5K0J24j91J88k91J97%r0m9K0J11L9k41K13r9l4L1R2M9l3rnm5k5
$$ 167 -71 -78 7 27 151 -40 148 -143 54 54 -36 -85 -65 46 85 -156 57 -42 -76 -45 47 96 63 54 49 4 -21
2730b1kj73J56N1n8M1j68J17R4JLQ2j49l5L4j2M6Qj4Q2o9n4%J32Nj04l4M4j9m1
$$ -21 -23 -196 -40 11 -47 -6 -174 -57 37 38 41 123 -26 -61 -27 -39 7 15 1 83 14 -40 -40 92 97 -7 -41 3 -16 -57
2760e7J23q0oJ45r4L2j25R7l7o0Q2n5M7K1n8L9%m5N6j1p9O5p9J5P0K9j8l6N9r4
$$ -57 66 -14 -20 125 31 63 -62 35 -2 -62 20 -35 12 33 -25 14 14 -31 25 14 -65 0 -79 -64 6 35 17 -19 40 -54
2790e4J33o9K5Kj37Q0J7JL1J05k24J04J01j61R5l3k6O1lK1kr6J9p4K0N8N2j1l
$$ -54 79 10 35 37 -100 -20 -3 -2 29 134 -90 14 115 -46 49 16 -10 51 48 69 67 -29 -10 -84 -64 -6 46 35 32
2819C2K6j98K38l3r0K0m2J7m1R3m3O1j2k3RQ6K4j06L7j52J89m9L3k9j0j5q4J0
$$ 32 58 -140 98 65 -25 -5 -47 -30 -71 22 -21 40 28 5 14 100 124 18 55 -97 92 43 76 47 37 22 -62 -52
2847e2K1p4P9j6O8M3r1k8R2J3Pr5P8k0m0M2P2j13o0Q9r8RpJ4Q7J18q9j21Q7p3
$$ -52 -31 -105 -26 -42 26 69 -22 -50 42 55 62 -33 45 25 -15 27 99 -14 -74 15 -83 -74 -81 -67 20 138 49 -72 15 -58
2877e8J09q8J27j5j17Q3j5j00K00q1n9n3q0J82j63O1o8J49n5P5Rj08P1Q4j2k7
$$ -58 51 -37 90 75 -42 41 26 -74 126 45 -14 -67 -147 35 -128 -67 -135 14 -41 34 43 -65 6 90 78 51
2903E1J9r3N1k4O8j22N8o0L4N7j04J27n0KJ5p5J6L2J04k00J18l2P9k5N3j57Q8
$$ 51 70 -23 28 4 72 -50 8 -52 -18 39 -65 62 12 14 29 -46 -30 2 106 -94 24 -8 71 46 99 -58 30
2930C0j02J51q8Q7j51kM5jP5l0n3Q5O3j09O2r6J47m3j4j06r2J70j14K8k2K9M7
$$ 30 -72 79 -9 78 -73 -75 -30 -31 44 14 -39 46 109 0 62 -34 113 70 56 -50 -142 28 -86 -58 -80 -51 -4
2957dj0m7O6O6p9P6J9j35K6P1n9L4K8m2Q0j03j3J36Op4j61J90n3q4N3M1J7NNk9
$$ -4 -14 -61 5 71 -8 68 87 -48 -22 49 -10 24 52 10 90 -13 -26 110 116 42 -119 71 18 -66 -13 28 45 50 55 26
2987B6k0L5r0J37j12O6Q9j38J9j6R2j88J08M6j12O0J21j62K2P4p3O7o9K0P5p2
$$ 26 6 41 -49 88 -24 42 131 -7 12 -4 88 -100 8 54 -58 2 123 -39 -17 57 -16 51 -18 2 77 5
3013EJ0o3J94o1qj55J28Km0k5N0k5JJj10R7p5P2M8n8j7kl7N7J22q1p8RM6j0o7
$$ 5 15 -48 146 85 77 -78 50 52 12 -13 37 12 13 14 -96 1 -74 -2 46 -12 -29 -31 -68 -11 111 30 -48 -39 7 -3 -70
3044g0N0R5r9k5NK3J55r3p9J19l2L1j19K4J58jj53J26l7j89J82q3L6L4j44O8J9
$$ -70 -20 75 -24 -49 -44 -21 134 41 -38 81 49 80 -39 -15 143 142 -11 115 78 -111 71 -12 24 58 -86 -18 1
3071AM7n9k8o7O6N4Q8L9j39L8k4K6o9K6Q9J7j15K1P3Jj42Q6r6N4J69j01j43J1
$$ 1 48 -11 -39 -106 -40 14 102 141 2 40 16 42 -27 -1 88 105 -10 11 84 85 -57 29 -67 -13 156 55 -88 -77
3099g7O4J29n5p1K5Kk3K6NK2o5J7q2L1Q4j12j23K11p5R7n8o7J54K5j11R3m0m1
$$ -77 -13 116 61 -10 15 17 -6 20 25 47 -18 -1 -83 -52 32 -80 -203 8 -67 30 -28 -95 59 84 -27 66 26 -15
3127a5j06KJ33l2L2o7P3M5j02P4N5j08J9Pm9M3m2J6J45Jp1o4O2k5l9J06j38m8
$$ -15 -121 -119 14 -18 14 -53 20 65 -37 37 92 -16 3 10 -39 4 -38 -22 123 124 53 -11 51 26 -13 93 -45 -93
3155i3P5L8l5j3J09k58J36K5r8L5J07p8K51j9j24j5p3l8K9K2r4M5N1j5J7o1J15
$$ -93 -18 20 -15 -28 81 -177 -41 -16 -114 -79 28 -50 201 182 58 43 -30 -68 -39 -17 -111 -66 -15 -30 -13 -74 41
3182D1n2m6J48l0j20L5rj09J71p0k8m4N7J99k01k8J25j03J7Q7p2j1J6%M6L1j05
$$ 41 -11 -57 91 61 -59 -24 -33 -142 29 -41 -69 -113 -56 143 -58 -86 39 -64 -47 40 -32 -43 -27 -27 19 50 -55
3209e5Q8m1o2M6K6k9jNP6p3J1M3jr5P2K7j42J05O1q3j0l8J2Q0k6pj8J15l3L8J9
$$ -55 33 -8 -70 -24 2 -27 -28 -23 53 -20 -9 34 33 -62 10 37 -105 0 61 -22 -32 -70 -58 22 -4 -11 -29 86 53 91 110
3240A10q3m9MM0M2K6n7p1l2opL7l7o9K09j66J85n7o0J47p8n3K9J1kr3J55j11O1
$$ 110 27 -22 -18 22 64 90 33 -38 -70 -76 -83 -46 -83 -152 57 -109 76 19 -41 106 28 -25 4 15 13 -80 75 -36 25
3269B5q6qL6J3rK3K1j34J88j55J87j27P6o2L6J4j2k0j59K24j39l3N1m3J66j20
$$ 25 -61 -69 -33 -20 -29 -6 15 -119 69 -86 101 -26 50 -12 24 38 26 6 -153 71 -68 -101 -50 -93 73 -47
3295d7K3J2L6m4r7K35o2npKJ6j03M1J18j98K9q3K1J70j23N5r4P2Q0J03j02m4o7
$$ -47 -24 -12 24 -20 -117 118 56 51 44 46 62 -41 0 118 -80 -51 -134 -113 57 -66 -11 -105 -33 47 150 48 4 -63
3323f3K27k00pP7M2j08J43J9l6r0J06k44P8j03J67M2n5L4l9K9j7K3j0R3j23J70
$$ -63 164 -36 -43 34 76 -32 111 130 94 4 110 -134 -56 -159 8 50 -5 29 -10 19 2 25 15 108 -15 155
3349A55j03P6l30K29o4J57n98O35k08O9j16J68j03L8J46k41J38l8J06n6J1q4N3
$$ 155 52 128 -202 27 -37 120 -478 157 -51 18 -98 70 -33 5 151 -90 48 10 116 60 71 -13 40
3372D0j6O5N5j13l7O6r9Q4n0j4J2j6j25J73Q4r4K9l0j4P5n9n7j4K7J62m0j07M8
$$ 40 24 89 144 31 -6 60 -39 45 -5 -19 -7 -23 -148 25 109 15 44 14 0 75 16 -41 -55 -28 134 94 -13 35
3400C5r3N9l1Q2p2L0n2j0M2RK0l7J08q0q2J15J10k19N9R5k37K06k4k8P0o5N7M2
$$ 35 -58 1 -30 52 -20 10 -42 -52 -10 -1 19 -18 90 10 -72 43 153 -66 -7 88 -149 57 33 5 75 10 67 109
3428A09j95J5J11r2N5j1j31K58m5K7p4NLK1j42P0q0P0K5R7j29kj4J86j44L0p0
$$ 109 -86 -71 40 -52 3 -8 -139 119 74 101 27 32 35 56 -86 -16 -96 -26 -1 96 -33 -35 -49 137 -7 23 -47
3455d7j4P2L0n4%Q9p5O2j02Mk5J7L4N1p2n8J19k8M0j18j4K2O3o4J45qmj5N3j14
$$ -47 -61 11 41 -13 -13 76 1 63 -39 -35 -60 -43 -9 42 -30 -88 31 3 43 -75 -89 -67 -4 -68 77 69 65 50 103 -11
3485a1J35j17k6R7m8k7R0r0m5n4L3Q8O5Lj52O2r6J73j5N8p0j16kM1N1pO1J0j67
$$ -11 124 7 -19 78 30 3 93 3 -42 -96 -63 25 90 93 -59 3 -93 80 65 123 53 -63 -65 -24 27 20 81 91 -76
3514g6O5n9Qp2J76q2p8J23O8l8j51P4J42m1k4pMQ2k07J19j40J58j21l7J23m7K7
$$ -76 -11 -70 -62 -134 42 -40 -118 5 73 35 -116 -42 100 59 35 28 32 114 -93 26 -114 44 -77 -114 9 -38 -11
3541a1KM0p4Q4p8O5l2m7Q3J04j49J2nnp9J19J0K1k0q5Q4j4o4J37j72M7J26o4n3
$$ -11 -9 31 -43 41 -37 28 -4 -51 32 136 -13 -1 -6 -11 -90 29 39 60 40 -45 39 25 -39 98 -74 -27 99 35 -18
3570a8l2J14PQ2j75Om9K7p3J46j61K05j18M9J7o1q1J11J26p9j03m9K20m9J16j69
$$ -18 -50 64 71 153 -22 -16 -65 -38 -111 35 -126 79 -39 10 27 -34 -115 -4 122 43 -60 -109 111 62 178 9
3596IJ50r0PJ84l24p45P64Km5r5K49j57P4K3j15J81p2J4O0q1K3l4pj4O4J8n5N6
$$ 9 159 69 76 260 -64 -809 -45 -43 -88 -183 66 -91 -17 6 -109 72 0 14 74 -7 16 -18 -25 -39 25 43 -12 44
3624D4j86J16l1j11J69nl5k1M6O8r8k0J55j9j26P2k3qL7l8rM6L4rM1j14P1o1p5
$$ 44 -142 -26 -57 -168 1 -4 -39 -60 -14 54 -44 -64 91 72 -54 18 -5 -13 24 -14 -23 23 57 48 89 -25 46 -15 -90
3653i0Q5L3M6q4p9L5J08K2n5n5K5PM5m2k4r1J26Q9r4j18J48l8j7K6j6QM7p6K9
$$ -90 -5 28 74 -10 -89 -54 54 76 21 -34 -9 -2 43 1 -23 -114 12 101 7 -111 37 -1 -18 8 -8 0 47 -29 0
3682@J14j10Q6r1k4J27o2p0K8k5K5L5M3j69j5O2m2J22k0k9P9m9R0j17J21jr3k
$$ 0 114 4 90 -1 -25 102 40 -30 -2 -27 -2 33 76 -93 -108 -46 -88 34 14 -15 64 15 105 -12 109 108 15 13
3710A3o2J02l3j01M0P1j55K6J43o6Q5k4j08J62j73R8N2L8Q5q2p3n0k0l2P2o4q
$$ 13 -49 53 20 -81 -41 30 -125 -99 44 -22 63 39 -69 93 -80 18 70 108 193 111 38 -12 -32 -64 8 -56 -64
3737f4N6m0L8l6oK03p8p4J51n6j36R2n6n1MN1j6P9j06P3J9n6o2Q3K5j02j15J99
$$ -64 -8 -48 -10 -46 -52 151 73 -1 150 94 -42 50 -6 -57 -53 -2 -18 61 -45 28 47 -9 -71 12 37 -65 -180 19
3765A9Pj1qK1LL0K9r3J02k0n2l6j1p2N2J04P9j98J04oo3JJ50k93J57J69m17P24
$$ 19 26 15 7 28 31 61 90 -3 99 79 27 -9 -20 -92 -40 64 143 -55 49 43 -20 -19 131 -162 -5 164 -253 471
3793D71o61M97o37n8k55N14O86k10k28r9q6L4M8L1r5M5O3Pp3O2j0j32L0P8NQ4
$$ 471 -190 307 -330 -388 -643 -129 557 347 119 20 -66 -32 16 47 -48 -3 60 67 -6 56 46 -86 -56 22 27 111
3819A11j01l8J37q5n2j3N1j7k6oK8o5P2O2j6J0l1n1N7L1p2j9N4K3M0m8n6L0Q2
$$ 111 10 -28 109 24 -28 -41 10 -7 -33 -39 -11 -76 -4 58 42 52 21 -30 27 58 -14 -33 21 44 84 36 -20 10 92
3848I2j31K5l4J13l7Mq6r8K77j73N6l6o7Q4L9qJ9J6J4l2j80J68j6j10M2M1N6k4
$$ 92 -39 -14 -48 65 28 32 -54 -152 125 -48 8 -28 -95 -11 28 20 39 55 69 37 -143 25 9 -101 -59 -18 38 14
3876A4rL6j13KRJ2P1m8K00j08j14J11k7k6n8N2p6m6J5Q2L4p8R7qm1L0L7j00M1
$$ 14 5 41 -72 -70 -61 -49 22 -26 174 66 -48 63 36 10 -48 4 -72 -118 -103 -21 13 -65 32 24 -17 13 50 -50 -9
3905iP1Or2m00L26J24l2M2k3rJ2q6k1J09j13m0R2op4K13k0m4M8q2N5k5L2j34J38
$$ -9 62 68 -24 -424 -98 26 -6 36 13 4 16 -70 -91 18 -95 -135 -43 -49 -123 90 70 26 74 -8 47 22 54 -80 58
3934E8Q0p6j7j23J68j01q9J7J45Q6k12K2J06k6K5O8j19M5K4q0N4m8kk0j6n1J21
$$ 58 138 62 45 -78 90 -11 -100 -83 62 148 -64 -42 64 38 63 131 12 57 81 1 55 7 5 -15 -31 -82 39
3961C9j01n5N0L9J15j00l7M4p6K7L6Q8M0q6j3j85K09q3M8l3Q3p7J8l1L3N7Njj43
$$ 39 -62 -117 -67 -28 87 -13 -50 -6 -82 -55 -19 69 109 23 10 -175 34 -49 -1 -34 49 -28 -10 -41 -8 49 54 53 -90
3990i0rk5J16m8O6p0J23p1r8K17o7Ql4o0r1K4L8J3J9J32j73PJ15J05k19L9P1k8
$$ -90 -99 -124 -8 -56 10 -60 63 -8 -106 111 44 52 18 -42 -133 -109 -71 -58 -39 93 -80 -73 42 147 -72 -33 38 10
4018A0MO1j17Q7m2n2J20p7j1K1k9m9J73k76J27RP5r7M0L0O2o2j6R7k4Om6p9l4
$$ 10 14 75 -42 45 3 -49 71 -6 -17 4 -25 -74 99 -177 -50 -41 34 -63 -23 7 69 7 -9 88 64 70 24 -55 -89
4047h9O3k2N4n3n0M9%R7r8O9k10K16k3l2Q4k4L2l7m7k1J0j2N2j9M9k2K7j08mJ00
$$ -89 -26 -48 6 -47 -97 -48 -48 49 -49 20 -190 26 3 -29 55 31 63 26 -21 -42 -32 -44 8 -11 38 16 43 -65 -69 31
4077C1J29j00j10O0ln0J20o3j05J18o7R7q1l4n8K23r0K8j36K2J03l1o0Q9o3j3
$$ 31 160 60 -50 10 7 -43 77 14 -91 27 -40 57 -24 -58 -116 107 17 45 -91 -69 34 3 -57 32 -31 -44
4103d4M3o8R8N8j49K85j43j51M2nM4L3j02N5J07j52J8mj8N7Mj04J06M2j9O0r0
$$ -44 -1 -69 29 87 -62 223 80 -71 -29 -34 10 43 -59 -4 103 -49 -31 -35 -53 4 8 -96 10 52 33 93 3
4130CJ13j20o9O4j13R5R7j28J04q9J4O8q1M8J01j09mK2L3J6q0L0O2k0j0j8j09
$$ 3 116 -4 -73 -9 -122 -27 70 -58 46 -43 -29 39 -42 6 107 -2 -6 16 49 65 -15 15 77 57 47 29 -80
4157h0J13kk9l5Pr8J56Jj4K5l1J8j8J4l1P1l2M2j47K3N2Q4r2n6Q2j58Q9pJ54R
$$ -80 33 31 2 -33 -26 -124 32 33 19 44 13 31 13 27 -4 67 35 77 -70 -47 5 89 -3 -59 23 -135 -46 -53 101 110
4187A10o8L1M1K5j92M2K4N7m3M4j25K5j8M1l2R5j50J81j15o0N0j18K10no0K3K5
$$ 110 42 73 114 139 -53 -11 13 70 27 71 -54 -29 -47 -6 -38 57 -93 88 -27 -87 -37 -155 55 50 -10 13 38
4214C8n4k9R2j06Q1J2k0R1l8o7K4L3r3M6N4Qj21k1J8m1LN5p8K14n2JL1r9O6p6
$$ 38 -16 -45 47 -59 22 34 14 105 67 0 24 57 -36 10 64 72 -49 -70 -52 -93 -90 -35 -113 101 49 50 81 -18 48 -28
4244b8J02n3k4K5oQ0j20l8L5L4l3%n4n1J50q6N6m5R3n7L5l3j2O5m5N1o7k8L2J03
$$ -28 74 21 -3 22 16 96 -24 -62 -27 7 -26 -26 -80 -131 19 -67 -11 -56 37 -20 15 -18 -30 35 -10 41 -26 -54 -22 81
4274H1j60P2O2n6N1lJ37k84L0J27R3k12J79j67R7n4o3J02n4P4n4nNm8J35k08J53
$$ 81 -79 -7 55 -1 50 47 184 -100 -70 57 150 -62 117 -50 47 -7 -70 32 -22 52 -2 -7 -2 -50 85 -123 30
4301C0K0J4j90R3j6Q1j02qQ8M3p6Q9K4j92J30kL3N2j6j50J13j3j38N4Q1q7L4l2
$$ 30 50 64 -126 -33 -49 32 -70 -78 10 53 -23 66 90 -102 28 26 59 111 95 -55 58 45 -93 -39 42 -45 -11 -43
4329d3J35j4r2P6q9l6J06o0Lj36J93j48J94j56Q8j1J1m4O2l2l8M2P1k8j05Q3j35
$$ -43 92 78 -14 62 -27 -63 43 -17 -14 -150 43 -105 89 -67 21 10 21 -23 39 7 -31 11 82 54 -51 32 -103
4356a03Q8Qr4J60n9Kp4O1R0k6j42J83q4j01J07j10L0J51n6j3P2o7M7m5O2j27M5
$$ -103 -15 -7 -101 59 0 2 -72 -11 79 53 -89 94 10 -91 16 -94 -64 87 31 18 90 23 70 25 87 -40 5
4383Ek2K8j28K8J23q1R3N1o3j54J94Lm5L6ol3L6K2q1J2O9j53OJ25K5m2j42l7J35
$$ 5 -17 11 -117 -89 34 -47 46 97 34 -120 74 77 32 68 62 29 65 87 6 18 87 -66 -60 65 90 48 -94 -131 4
4412DN1q2R1L9p5q5m8J26N5j8o0N8k3L1m5MrkO3j93J84j36l2J25o1N3P8n2m5o2
$$ 4 55 -27 64 103 28 -57 -105 21 76 58 -2 56 33 64 19 23 14 12 75 -118 66 -70 -102 23 -38 15 93 41 -4 -66
4442f6P6m1K4o4n3J76Q4j22N9p9J3Q6j8j3j00L2O7q7oPR7q0r3J07p4MNM0J5M1
$$ -66 10 -31 -7 -71 -124 52 136 14 73 -6 7 93 75 62 -38 -6 61 -26 -32 -25 72 -8 -101 6 -68 -64 -59 -19 -4 37
4472C7p4J35pj18P4q9j10O3M6L9mr6J10l0J54j00k3k0O3j37N0N4n2j16K16rp6
$$ 37 -37 98 91 -27 47 -42 -152 -89 -43 -4 -8 -104 6 -24 130 30 7 -13 50 -87 -37 17 -35 -151 65 56 -20
4499b0O0j35N6O0Oj0O8k36J74M9j47J46j9P2j63O3q3K7L5k7J0q9J39K8j58Q5n1
$$ -20 40 -95 -39 21 27 17 85 -151 23 72 -75 71 52 124 -39 24 -59 -32 3 -24 -14 -103 36 64 -94 -9 -60
4526f0M3k3m1R4k8Q0j6L1q1M1q1J32j9j62P9K2l9k2m0J02o9LP3l7m4PR9o9O8p9
$$ -60 -17 -40 -81 13 -15 65 49 80 -1 40 -41 91 72 -90 -11 11 -28 -50 -90 12 -57 -54 19 -18 -62 -55 44 -25 43 -36
4556c6RqJ2K7J31k57J78o9M3j6j7P4k1k25J45J36r7No5L9q4J25o5L3lj4q1P8L
$$ -36 -27 -35 -23 4 135 -122 56 -13 30 14 -3 71 50 -175 -30 106 9 14 -51 -12 -96 29 -36 -3 -6 -20 -101 -23 -20
4585b0q3J66l7K4o5J2M4p6J18k04L1km0J35l7R8j50J33j37N5L1j12J15N2qm1j7
$$ -20 -103 63 26 50 -15 -3 41 -35 83 -121 -90 -92 -132 3 -34 64 -86 47 -90 -35 -4 -116 -1 51 43 2 -15
4612a5K0p8Q4M5q6J1N2p6J91j30k0j9N8r0L9J5o3J01P3j9j08R9j40P5N2n9j28
$$ -15 5 -73 11 56 -30 -19 33 -43 148 18 -2 -21 37 -53 -14 1 -62 39 112 93 -15 84 -56 19 71 12 -116
4639a16M8K66j76j8N6L1k14J60k3p8Q2onP3j58O7M8r7J52lj2p7jk6P8o6R1j06
$$ -116 -68 198 22 4 60 91 -123 37 14 -64 18 12 7 80 -78 -11 37 -60 92 89 77 0 -1 -27 51 -15 76 -30
4667c0K5J6oj9l9J07p7Okp1Q8K8j05J72q9l7l5oK4O6j5N4J%O9j23J3L0K7j10j1
$$ -30 -5 11 5 -14 -53 54 -23 -17 -19 -90 -2 26 -79 93 4 -33 -68 -74 -50 16 1 55 56 56 125 2 15 45 72 -38 -49
4698d9P7p5K1P9q1L5j08K5K74j23j52l3J22Rl8N9J1Jj64l0J50P8o5j22J09jRj0
$$ -49 28 -47 -26 53 -28 7 -101 -76 198 75 -77 -110 12 21 -17 42 53 54 -110 -140 10 88 23 -99 10 9 18 8
4726HR1j14%Mlok5j05K06l0l1Q2o0j0j32L22j25j46QQ9q8M5j04N7J18q0m9P2k2
$$ 8 99 -15 -15 -11 -14 -20 -45 -150 56 26 -5 77 17 7 -125 197 72 -74 -66 23 -65 -20 -124 -67 51 -29 -78 -6 -28
4755b8L9o7N2k5L2Nl6OQ9K1n3p6Mo7J2N8l6K0%N7Lj23N6J15j0q9Q1kk2Nk0P4J7
$$ -28 11 -56 -4 -29 3 8 -28 -22 67 88 35 -41 -37 -104 -92 -34 -70 -50 -50 7 10 -113 -57 58 48 -41 40 38 16 21 1 75 92
4788I2q2qj4o1P9l7nl7o8J19R0m4Oo1N2J8p8P5J4LN7q5L5j72q3J34j0P9J2l0l0
$$ 92 10 2 -12 -73 6 -31 -36 -73 -141 -22 68 24 30 -31 21 39 -39 36 50 53 110 25 60 -112 -195 -61 -71 8 20 -10 -40
4819d0N0j9q1J64j22J61m9l8j8M3k6%L0n6j69J68K0m9p1p9J42L0P0l5oj0Q5j45
$$ -40 10 -9 -90 74 -48 113 64 26 8 51 25 25 55 -1 -170 -2 18 -31 -102 -181 -39 -9 61 26 20 10 95 -50
4847e0P2p7P6P6j21rN4M3j90J91K0L4j21j4J18j14n3J07j00J64j73J61j37OK4
$$ -50 22 -55 21 97 -24 -33 21 64 -126 65 85 119 -2 -16 102 -12 -65 42 -58 106 -67 94 -43 -37 -13
4872a3J71j38J1Mq9q5J65j36J71r6l7J12no3Q8n6J9n4P5l8rn8M1J70k87K7K03
$$ -13 158 20 31 35 -54 -139 26 -110 61 -35 -72 40 35 -28 60 4 23 -31 44 6 -3 -61 -20 150 -137 -110 93
4899I3j2j20R5j15k1J14j4j12K09j73N3O2j8J4q4jJ24j20O7p9Q8j02J77n9o0j70
$$ 93 81 -39 56 -59 -80 34 20 -92 117 -56 -3 59 41 55 -29 -30 94 -26 41 -38 50 -52 125 66 6 -164
4925a64J71q9L5K4Ml1j40K37o4M5j6O5l5n5JP0k4M3j34M3P3j7k6Q3j37n4K39j41
$$ -164 7 -82 -47 -23 -19 -50 -190 47 -17 28 12 77 42 -13 -12 58 34 77 -57 -14 59 42 16 99 -38 -92 147 6
4953FJ4jq3k2J00o7k7J81Po5j26R2nPM0r9Nn7O9M6l3N3l0j07J93kq9j6J8m8Qn5
$$ 6 20 19 -64 -86 14 -53 -80 101 108 43 -83 9 4 11 51 -48 -43 -100 -31 15 -18 35 5 -102 91 89 0 -16 2 -46 -38 -93
4985i3P0m8M0K9m1M7j71J36R4k8N6j43N9j9M7m4Q9r5L1L9j09Q4k6L7j6Lk28K82
$$ -93 -23 -71 -31 -2 -43 4 -167 -31 63 35 91 -52 7 -12 35 -9 80 -15 16 55 -54 30 4 41 25 28 -200 82
5013H2j43k2J10km2Qp9N4q3O2J12j84OJ19o5J18m0J1Rp5L2R3j21J01o1p7R6kn1
$$ 82 -61 -83 27 25 -17 -9 -88 -34 -117 -55 57 -127 -121 -2 -67 51 11 22 31 -44 -12 81 -40 61 0 -77 19 17 -34
5042c4Nk6lR7j28L6P4l6M0l1J01k0q8J65k91J29j5m5R0K3j38N3oo6M5R4k05J67
$$ -34 -29 -55 -58 39 -89 -53 21 -15 25 -6 95 75 -13 152 -139 -10 -25 -70 20 43 -95 -42 -48 -114 -69 25 -180 -13
5070a3j3m7OJ52j23N2p9O9N5q6P8j17O8l2j7n4O7L8P6j16L0j4rP4j16J54j06j3
$$ -13 -26 -73 -67 85 -38 14 -65 4 59 -27 51 -66 2 -30 -47 -101 -34 4 80 -36 -6 -20 -29 45 -71 83 -23 -36
5098c6J3M2j6j56J00J72m2j12K5P7q9N2kq4J32r6L7o7k4mN8P5n2lJ35q0j1n5M2
$$ -36 -23 19 3 -153 -53 119 77 -35 -10 67 -22 30 28 -56 76 -20 17 -50 -74 -78 -20 55 3 0 135 55 44 -11 31
5127C1%o0Q2j16J31r1P9n8j48J19J32j77N7L7j0M9k11N6J14k0k2l5M8M2N9k9j44
$$ 31 31 -29 53 -63 68 -23 56 -2 -150 -31 101 -76 -19 18 8 57 -154 -98 16 -4 -26 -61 -13 29 88 59 -85
5154h5P6N0m0J00k04J61J76j88LM3k2j06Q3L7r1o7J03J49j92JM1kj7N8k3j08J20
$$ -85 -9 41 1 101 -103 58 234 46 49 92 70 -36 47 84 -7 -74 29 178 -14 -13 28 26 9 67 44 -64 56
5181E6m7O1n1o0P0p0k6N6Q9j04k7P9R5j47J1L3J5L3k7o8J0K1LL2r4L0j27K06o3
$$ 56 9 70 19 -41 29 -41 -67 -11 78 -26 -53 26 121 -26 -15 18 33 66 39 -29 -19 2 5 37 -57 -27 -154 52 -11
5210a1P3p5o5J33j43P1J8k3Q8j70K2R9r5O9k5l7K7mJ9K6J8j08J35p8J07mq0P3
$$ -11 62 -13 -78 55 -88 -17 1 -22 66 -104 -82 17 -78 -9 -34 -71 -44 -48 -29 -3 15 -93 42 -36 71 67 -13 60
5238F0m3mON8j0J07l20K53j02O5j07M4m2K6m8K8R9l6m9n5%R7m0M5l9K6l5l5J52
$$ 60 17 13 19 77 67 174 -146 107 5 70 -37 7 -35 -9 -57 -29 70 34 -15 -70 -70 27 -13 32 -7 19 -16 -51 101
5267A01j17n0N5M5k5n8R0l1n0Q1k7j1L7mk6m7M4k5K3L8p7J09o5m3Q6j23N5J54
$$ 101 -16 -66 -11 34 9 -49 41 10 -40 41 14 3 40 36 10 -37 7 -18 5 43 -34 75 10 -33 53 -70 -15 139
5295A39j37%p6O5%Q8m1J0J6k0j70Q3R7M4j17J9J8m7pm7J33k5j8M8jOq0M2J0k7
$$ 139 2 2 -74 -9 -9 79 38 48 64 44 -126 -43 54 98 -19 0 18 -29 -36 -83 50 25 7 55 54 60 -20 22 32 5
5325EJ6Jj46J78j7R3j2j72J11r5o4J20q3N7J00lj40J7K6p3J44k4l0Q6q1J9P6n3
$$ 5 21 22 -124 54 37 130 118 -54 57 -38 -102 18 -65 -8 92 89 -51 -34 -8 -81 63 39 9 95 14 33 109 56
5353E6j04K8N9n5j2N7R1q8n2J03j65M6M0j6J9n3j1P0K7n6m1pR9r4R5o2pJ27k35
$$ 56 -48 -20 39 -16 -28 29 120 32 -20 83 -82 -36 4 -12 7 -46 -57 13 40 -16 -57 -64 35 -59 36 -26 -33 94 -141
5382a41K34k51J07Pk5N5L6nq0k7J06P9j19L2o0J18r4K2K1j7O6J2j09R7LJ19j79
$$ -141 93 -158 -51 -44 -69 -14 22 17 -63 -90 16 95 -24 8 -52 66 -28 -6 15 -2 64 76 -33 64 67 186 7
5409GK8j61J42l9o8J01J15j80Q1n5L8L3j32R1j0j2N4jP4q3q7J29k6Q3N3k22L4
$$ 7 35 -126 16 -23 -91 10 125 -55 26 -29 9 42 -90 1 -9 -21 33 32 106 23 -64 65 39 122 175 -47 -13
5436a3l9j96J85J6L17n16k06M02M14k87m30P84j077J046K19l45p06K73L55k95
$$ -13 -52 -248 -63 -47 270 -246 -452 -50 364 77 -353 431 -646 400 619 274 -432 -159 196 -99
5456i9K31l75J08J44O8j3n1Mq5J43j70J31p3N8n4O7kl5L8q7J07j47K21l7L6k54
$$ -99 132 -243 -135 9 77 64 13 17 -68 75 -95 36 -37 21 -33 34 32 -3 35 -52 55 -92 129 92 128 -126
5482a26K38p3m0P4R6k36Q6k0n6P3K8rm6J4o3O0k3j0O3r7M6L4m0P3j12%p5J16m2
$$ -126 112 39 -1 73 169 -67 19 -1 -57 16 44 35 -11 3 -60 0 -23 -33 30 -67 -21 13 -27 46 -66 -66 -141 -25 -67
5511f7P9m4q0M9L2K8j8OO0r9oP2l7L7k6L8r9J0M4L9j4J02j47n1J47ok7K0p1O9
$$ -67 12 -32 -112 -63 -31 -3 -21 -15 45 -54 -60 12 -25 12 -14 24 -75 -65 -21 18 4 106 -41 -92 55 49 22 42 -29 40
5541D0l8l5Q3j5p8Q4m7Jj08O0J07j13j3L9Q1k5N6n7m1Q0p1J6qNO8j51J82p8p8
$$ 40 2 -33 50 35 -43 41 -6 -5 -113 -53 54 -59 -72 -33 48 23 79 22 -19 61 -10 6 -2 3 71 -80 102 24 -54
5570e4Q5m6O7j7K0kj47N2J31j19k0J10n2J20nl6m0l3k3P7p2n0J02%k0l1L3r0O
$$ -54 31 -15 52 35 55 53 -94 -42 89 -30 -50 60 8 128 123 87 47 14 -9 68 -4 -54 48 48 28 -3 30 -60 -54
5599e4l5K8J38j29R2n2q3J23j37J70o6j06J59j36J38P2j01M1q9m5RM3N2m5N6j31
$$ -54 -89 -61 77 -52 40 -12 -95 28 -109 61 -5 -111 48 -88 50 122 21 62 -27 -72 -63 -20 32 -13 43 -88
5625h8K9J33j09L8q0Q8K4j05L1O1ln7R3r9J38p9j4L9j7m3J28j87J46m2J8M8j17
$$ -88 -59 74 -35 3 -77 11 35 -70 -39 22 19 -38 55 -44 94 15 1 40 23 -20 108 -79 67 25 43 91 -26
5652b6O8m9l4J6o1J5Q2J23j91N5J69j21m9rR1q3K0o8O0R9j80J28j06Q3o7Ol2J22
$$ -26 42 -7 -41 -25 -86 -71 11 134 -57 -2 167 46 -3 -12 79 -4 16 -52 8 107 -73 55 -51 32 -35 -29 -61 61
5680F1p7J9rl6J13M5q1m3k6O3o3pJ33k03J25k8K1kPm1q1J46oj02K36j87L8k6O8
$$ 61 -16 3 -6 -42 71 116 35 -8 -34 29 -34 -41 92 -111 14 -14 7 5 12 -29 -110 36 30 -72 164 -23 15 -11 57
5709E7r3M2k8%N3r5l6J16MPN9j27L3j8J4J7j9jK1j5k4J49q1r5J37RK3j81K9J3
$$ 57 -36 6 -22 -22 31 -64 -100 16 20 27 86 -41 -8 -26 -12 5 -14 -15 6 -9 -33 116 35 -60 77 86 109 -72 -43 -30
5739c0n9L9K2j9J07p7l0K4m3K3J5J03m6Q2j32n7J29kr9Q0j31J03r8O4R6OL1j06
$$ -30 -89 -50 -28 -47 60 -17 -47 -23 -66 -43 -28 75 29 111 -21 -78 51 49 -50 30 -101 2 -96 -32 64 70 101 -5
5767ek4Q1o9J8L1n5K5OM1j39J69p7L9m3J5p6K3m2J32j3m6k3q0K46j43J45r7j57
$$ -5 -29 52 -17 1 32 -23 2 8 49 -90 79 2 41 -2 13 -63 -40 -82 50 37 -9 -32 -112 134 -9 136 39 -118
5795a18K84n7j28J7M9j73J66r5M4m4P8o0J60j56nO1n1PK9o7N7q0Q5Qr5K1mK50
$$ -118 166 109 -19 -2 47 -126 40 -55 -11 -55 23 -37 123 -33 -38 23 -28 -21 8 -59 -2 -82 3 11 -84 -63 -67 183
5823A83j84JL7p9jP3K5M7j31l9M9K0O3j03N5l2j4L4L0Lo4K8l4L4j49J74q4J38
$$ 183 -1 0 37 -42 -43 30 55 102 -29 -68 -19 1 64 -39 16 -16 -30 4 34 37 -27 1 -33 1 -148 26 -58 80
5851H0J4q5n3nN8K1K8l4j25J83J03k63J74j02k2J6j3M5RM3j39L1N8L8n9%Jp6P6
$$ 80 94 9 -44 -49 9 30 58 24 -101 82 185 -78 96 -6 -28 -12 -25 20 29 72 -67 -36 22 60 1 1 2 -74 2
5880Bp0J04j47K6J95j94O2L8o3p1R4n0J06r5N1l3L0o7Q9P6k28K23r4l3J56o6n0
$$ 2 -68 36 -111 -85 110 -84 -22 16 -47 -118 -24 -74 32 -63 -12 -45 -15 -82 7 83 -145 78 -16 -49 107 41 -9
5907iJ8o1Q5m9k1M9j01J01o7j4M2k5JJ01j4n2k3K3m4J10p9MR3p8k0RK9J6Rr2j4
$$ -9 9 -52 33 -16 -37 12 -89 12 -55 -69 -27 -52 -51 50 36 -16 -39 -16 -60 50 -29 -25 68 -10 -30 -21 8 24 33 -59 -73
5938g3nM5P2o4J33k00J23n1N2N4q4nR8p0k8k0O9Jj53J38jl9j5J04K2j51N2J8R
$$ -73 -78 -33 39 -25 108 -92 31 -20 32 86 2 -3 95 25 -3 -23 46 47 -106 32 31 -8 -23 81 103 -48 4 22 31
5967C1N0L8j66RJ8L6k2Q7j3j08J19j26J7Roo3J44r5J5L4J0j1%L1P5j74LP6p3J08
$$ 31 81 119 -47 -38 -20 16 -6 81 68 -40 79 -47 -30 -21 -27 -90 54 -41 -26 8 18 7 7 38 113 -61 -58 18 -55 53
5997E3j41J70K4k0p7k4l9K5Q3P3k1j80R1M9L7j19r3Pk9K6N1P7KkM2O6n1r8k2J28
$$ 53 -88 82 106 86 9 -15 -54 -29 54 127 106 -74 17 66 103 -16 -109 -102 -131 -105 -54 23 25 23 65 131 80 -18 -40 88
6027H8j99L6O9J31q5q3Q1o1J40q9m4J6m4Kj7L7R0K6j81R4k1J4J5m2R0j59J25P
$$ 88 -111 -75 -6 125 40 -43 38 -23 117 28 -16 0 -44 -42 -59 -22 68 94 -87 7 -14 0 15 -27 63 -96 29 36
6055C6o6j0P3j41O7O4m2o4J84k2j22O8l0m7J07j08J73k04pQ3k6R9m8j0Mp9J35
$$ 36 -30 -40 33 -108 -41 23 -19 -83 101 79 -43 25 -5 -52 55 -53 120 -84 -91 -8 -34 65 17 7 11 -68 67
6082F7j62J33J1m7j8N6l0R2r4lo9O0k9r3Q6J6j8n1J49q5Q8j13J73j39J4m1J06
$$ 67 -95 38 49 2 -16 40 10 102 8 5 -64 -4 -33 -126 -40 -24 -42 -93 56 -29 59 -54 119 -20 -6 -47 59
6109E9Rj79J33J9j74J70q6Q3P8j78O3Q2LN5j41K7n0O5j2j53J70m3P7j65J8M1p2
$$ 59 68 -111 22 41 -133 37 -49 34 112 -66 -3 79 82 137 -4 23 -27 38 26 -127 43 0 77 -88 -70 -29 -101
6136a01J43n9P2q5n0J02j08J76n4j00Q7lm4Q2j18L3K6k1J02K8j11k3J1q0R3P2
$$ -101 42 -17 55 -30 -80 22 -86 90 36 -64 23 20 -24 58 -60 -27 -1 -22 80 108 -3 -26 -15 -95 -2 70
6162G0j24R2o5q9k4J62j08K72l97J06J71Om6j06R5m4j9R1o3L6o3P8Om1N1j33J26
$$ 70 -54 38 -27 -116 -140 22 -86 186 -211 -105 66 72 26 -80 15 -29 -48 43 -20 16 -47 31 37 -4 47 -86 40
6189D0p2r6Q3Q4Pm7M7R6j79J5J47m1RM8m8j44j7J03q7j1J26N9j18J2m3J12j01
$$ 40 -32 -128 -45 39 46 -1 46 142 -37 -22 125 84 93 141 93 -51 -68 35 -52 -63 63 122 4 16 -27 85 -16
6216a6P7k8j01K3j3Q5qL9j45RK1OJ84k03J23J0jq9N8Q1j53J60l4o1M4l4Q9p6o
$$ -16 61 33 -68 -45 -58 27 19 58 -87 -78 -57 -51 133 -70 53 63 62 -27 31 112 -41 119 85 24 68 34 123 47 41
6245D1N1q1J6l7O7l5j36J33J29j40n9O8M0j15N2j5Q5j7l4L6K8j1R2j33l0q4K4
$$ 41 92 11 27 -10 57 22 -114 19 148 8 -51 17 57 -58 -6 -21 64 47 13 49 77 66 158 25 -5 -89 -65
6272f5R1l5P6r0L7J8r3O8m9R7p7M7pO1Oj18J86q2n2k5Q5m5N9j24q7N9L3K7J6n
$$ -65 26 -9 67 -23 14 32 -61 7 -42 55 -22 25 18 79 85 -33 153 71 19 -6 79 34 93 -31 -118 -59 -26 1 17 12
6302A2K2P8k33P7O9N0NJ9j57L9R0n8l5JL0j6k5l1L5N5n6o9O8Qj7J39m0lp4LNL6
$$ 12 34 112 -121 -44 25 75 80 99 -58 -19 71 13 -22 -21 9 -7 -32 -63 -28 27 -29 -98 -30 -22 -39 100 60 57 -17 -14 -9 27
6334B7Mp2K9j76J37P3m6O0r5J76j13OM4j01J30m0Q4j19JPn1K1Kl2M2p6L9mQ2N4
$$ 27 31 -41 -12 -188 -51 22 -24 36 -59 117 4 10 54 -47 83 43 127 8 9 16 -35 -14 -12 -44 -2 -78 -39 -43 39 93
6364I3j17P6o1nJ73k18J2P3J8N7o4pL5q7L1l5K4N3p8R3R7j72M3lj31N2k7p1R8
$$ 93 -24 52 -9 -14 159 -59 -47 26 44 101 37 30 65 -22 9 -26 -2 51 -27 66 163 -9 34 31 -100 -48 -75 -146 -48
6393d8O3m7kO7O1j08P0p5PP3n7R5j51R9j01J00j06Q6o8mL4J1P6N3j54J04n1r3
$$ -48 15 -32 -34 33 94 -14 56 -19 -12 61 4 99 -52 47 -54 46 -60 26 -42 -46 -12 -1 75 128 -26 78 27 -66
6421f6J84Pj10P5l3m1p4J5N6l7N1o1M7J1k4j03K03r6N6j5J1p2j04J48m3K1n4K9
$$ -66 118 125 15 90 57 16 -58 -43 13 -24 27 -34 13 24 0 -103 100 4 60 45 56 -16 -120 28 -15 6 -48 -19
6449a9j0m8J83j39Q5P7j33O9m8k5N4j11J52j41%J62j2j14K0J2o0J03k9k7M8J1
$$ -19 -29 -77 106 -33 52 129 -4 65 17 -8 46 -65 87 -54 -54 108 96 -18 2 14 -46 57 28 1 49 60
6475F0j21R2n8nn7J67r7j8j9M4O8lkn3m1N7m2%Q4K4j09Ro8J2R2r2J9m6J45O5r7
$$ 60 -61 31 -27 -32 -89 78 -19 -37 -56 -12 56 53 51 -2 -43 14 -28 -28 56 80 -29 -20 -88 -76 16 -76 -57 -103 42 107 10
6506A0Q8j36Q0j6r1k1O5P9p0R1p3j97L90k43K7RN3J3n0j2R1k9j06O0n7J37q1o5
$$ 10 98 -38 42 26 -65 -86 -21 58 -12 79 6 -191 199 -44 -17 -8 45 58 8 -4 87 58 -48 12 -45 92 11 -54
6534e4N3o5L8M6KP0Jj32o0P4j14J85l0K7j29J50o8nJ50k48J12O5l7j66J06J6M0
$$ -54 -1 -66 -28 18 20 90 91 -41 -101 -27 -141 44 14 41 -88 62 -6 -11 139 -109 3 68 31 -135 -29 -13 27
6561B7j2m3P2j4L3j47Q6N1j1o1O6n8L9m7J7M0M6j62R3k4p9J52P0r7J9j05k2N9
$$ 27 15 -28 44 30 63 -84 2 53 42 -19 47 -11 28 -19 -2 38 84 -78 15 -9 -88 64 134 37 56 -49 -71 -12
6589a2nP0j10m4J83r6j9p9J69q9J02o5K8k5k1P3j14P8nJ1m0K1k8N0Kj7q2J23j01
$$ -12 -17 53 -57 -101 82 -14 -33 -112 57 -32 70 5 33 8 -13 60 -54 24 19 30 -10 11 -17 33 35 18 -64 59 -42
6618d2k3K6O5PM1mj8q2M8L2j25J88j32Q3j6Q5j40o8J0Q0QM6qM3k16J55m9KJ36
$$ -42 -65 -39 26 33 74 70 52 -30 18 50 -75 113 -19 64 48 133 -7 -75 -65 15 23 69 61 104 -112 43 -6 -4 132
6647A32j95N6J6Q1j82R9r0K4N8n1J25j9r8L0O5j6l8M1lo2m2J62j38j5P3lM2Nl1
$$ 132 -63 -7 9 90 -92 7 -83 -59 -1 -52 73 54 -44 -14 51 35 -3 38 35 -27 -69 93 -45 -60 13 10 52 57 26
6676B6m7J2N5J9r1Km0R0J2Qp3p5M6J61j37J13K0j51o3L6N3m7N1o7M2j3J10q2K5
$$ 26 -21 -9 46 65 -26 -24 -64 26 38 46 -27 -102 -56 105 -32 81 101 -50 -113 -77 -24 -71 -20 -87 -45 -58 52 -30 -5
6705el0N1L5M0j19N4r8J21N0j1p4J1Ll0M7n7P3r1m5J13k8o0QP6j01J32j80N4J24
$$ -5 -35 16 51 91 -28 26 -72 49 99 88 14 25 28 -2 45 -12 61 -30 -75 38 10 -50 -42 34 -67 65 -115 -61 63
6734F3j47j1J05rj2J30o4L3j42N6l8p6J19j7L0m4l2J26j06k6J53k01R1MO2q5M
$$ 63 -84 -95 10 1 -11 119 55 88 -54 2 -36 -112 7 -10 20 -24 -56 70 -36 -62 91 -110 -19 -15 47 -38 -34
6761c4P3j11J61q9M1r2N8q5O7n6M0R1mj43Q6Rn2K7M9q5Q1j27R7LK1L3q1l8J2J15
$$ -34 39 -72 89 0 41 -51 7 -78 -11 -67 -27 64 60 -83 3 12 -40 -13 36 -49 32 -95 2 5 26 59 -22 -60 -48 67
6791F7q1qN9K1N2r2j8J40j94J46j35jP3q6J58j85J06L6o2n0mJ00o8Nl7J7R8O9
$$ 67 -14 -22 37 58 110 18 0 140 -54 92 -43 -44 29 -57 101 -84 22 58 -4 -54 -58 42 -26 -21 -58 -41 57 126
6819A26q1o5qJ22j37J47j78K9J06o7k1M8p6q5J37J03r0r6M8j7L7m2J14n8n4K2
$$ 126 45 -20 -28 94 -43 104 -74 -45 61 -6 -27 21 -55 -140 -3 100 10 -86 -38 -55 -18 -60 54 -4 -58 -36
6845c6M1RJ0q3O2J30k14N5r6kJ13Q3no4o6k3K0M3J18j50J0J98m8l9r8J7J03Ml9
$$ -36 5 14 24 -59 3 133 -81 -26 -122 -124 -11 72 67 3 -63 -86 -66 -23 95 -55 -45 153 105 66 -32 -15 88 92 53
6874E3o2J8oJ21p7j8p8P5oJ3rn6k1m1J37m5R8r3Q2q8O9k7RQ0j40J8J10j21l7Q
$$ 53 -9 9 3 124 47 29 -49 26 20 33 24 -32 -53 -94 43 -2 96 3 85 -3 66 39 48 128 -12 6 116 -5 -42 -34
6904c4J26%M0j2j67J15K0l0lj6J26k61J19l0K1K2j47R0j3J34k0j02pO6j70J12
$$ -34 92 92 132 120 -47 68 88 58 55 39 165 -96 23 -7 14 36 -111 -21 -34 100 80 -22 -29 37 -133 -21
6930b1K3n8J4J05q1J22QOr7K1K9j61N8m0Q8j22K0L4qO2l6R1q7J41j36p2J48o1
$$ -21 2 -56 -42 63 -18 104 112 118 21 42 71 -90 -32 -72 16 -106 -86 -52 -60 2 -34 57 -30 111 -25 -97 51 -10
6958a0J22l5j8l5K0j02M3Q0m3p1J08l6R4j71J21j10p1R7m6rL0J4j8J36o5K0J4
$$ -10 112 77 59 24 44 -58 -15 65 22 -49 59 23 117 -54 67 -43 -114 -17 -63 -72 -42 -28 -46 90 25 45 59
6985E9o1qM3k3pN0j31K8K9MP6j64J53J0n1l5j0j7Q8j18J07L4J8j3M3j35L3m7p8
$$ 59 -2 -10 33 10 3 53 -78 -50 -21 -17 59 -105 48 58 7 -28 -38 -55 33 -85 22 56 74 61 104 -31 2 -45 -123
7014a23J76j26J33j38J3O1J5n0R5j01N4q5J26p0M1q3O4KKm3J31j56Q8m3K5R6j05
$$ -123 53 -73 60 -78 -65 -4 11 -39 56 -45 9 -76 50 -20 21 -62 2 4 6 -37 94 -62 26 -17 8 104 -1
7041aJ7M9o9K9q2J8j5M8k7NpJ31r8R4r4K5op1P1m5n9j4l7J51o8j6Q9K8r1L9j26
$$ -1 16 65 -4 25 -57 -39 -54 -6 -33 -28 -35 96 -2 92 -2 23 17 -54 17 -28 -87 -101 -138 13 -55 -71 18 46 -45 -6 -132
7072a32R9N6q4R4p2J20j02jO2lO9j36l6R7l8kq9J14k8N8q8J05m8J15q2m2o6P7
$$ -132 -33 23 -61 33 -39 81 -21 -22 40 37 106 -30 -66 31 -7 -9 -98 16 -12 46 -42 63 15 130 48 6 -60 17
7100A7j05L6j09J17m0K9L6o6J22j1K4q2J14p9k6J02O8j68N7j19O7M6N9j24K7k4
$$ 17 -88 -52 -161 -44 -84 -55 -19 -85 37 26 50 -32 82 3 -23 79 147 -21 36 -83 -16 30 89 -35 -8 -32
7126c2Q0J0r0j9N3M5Np5K7m3qK8M8r5L4m2R3l3J04r4n5J35j44J18Oj62N9k3J20
$$ -32 48 58 -32 -51 2 47 52 -23 4 -39 -47 -19 29 -66 -32 -74 19 -14 90 -4 -59 76 -68 50 56 -106 -47 -70 50
7155E0l3j5J9j9k1L8j5J5K2L4q9k2L0j09J76KN5j59l1J03rK0k2J0j8J19q2M2j00
$$ 50 17 2 21 2 -19 19 4 19 41 75 -14 -36 -6 -115 61 63 118 -41 -72 31 22 42 20 30 12 131 49 91 -9
7184il9K7jP6J5j03OM8K6p1J8O5J7J6L7j77J5P2J2O8j34J12m7j10J34o5k0l2m6
$$ -9 -48 -21 -22 54 69 -34 -28 20 46 -25 -7 58 75 91 128 -49 -34 38 50 118 -16 96 49 -61 73 8 -12 -44 -90
7213i0J93j44p7N8L6J57j50QK4J54j81j2l3Q5J2mk9q6J71j35k8J11l9N6j25R8
$$ -90 103 -41 -118 -60 -24 133 -17 -9 15 169 -12 -24 -57 28 40 36 7 -79 92 -43 -71 40 1 57 -68 30
7239C0j17P9nl7l0P7J23k21J09r8J78k12K16j25M3o4O4J06l2R1j23qr8K09j52
$$ 30 -87 -8 -13 -50 -80 -3 120 -101 8 -90 88 -124 92 -33 10 -54 10 116 84 175 52 44 -54 155 3
7264Cn8N7K4L0j76K42n7j16jl7R7J10qr0j3pK3M5n7j9m5Q2j8l9QK18k80J22P2
$$ 3 -55 2 26 56 -120 122 65 -51 -52 -89 8 118 110 20 7 0 23 68 11 -8 -53 29 11 -28 -20 198 -82 40 112
7293A12r3q9o8K89j46N5k30J05L7Q0j49J02o0L8M2L8k24K35m1m5M3j47N6J95j61
$$ 112 19 -70 -138 151 5 60 -170 -65 -28 52 -97 5 -55 -17 25 63 -161 74 33 -12 31 -116 -60 135 -26
7318b6M7rr2k5R8pn0P9mOpJ09j12j58J34jK4OK4p1J68j32lNl3l1J34q7J24j77
$$ -26 21 12 -80 -105 -7 -14 -64 15 11 17 10 119 7 -151 -17 -18 6 12 36 -35 133 1 -2 3 -30 -61 73 -14 110 -67
7348f7k3P1O3p4Q4k08J34p5K7J05k7p8P3O2n2j30Q5P1n2M6j32P0M8l6K5N5l5o
$$ -67 -90 -19 44 -30 54 -154 -20 -95 -68 37 10 -68 5 67 15 -115 -30 41 -11 35 -97 -27 21 -15 10 65 30 24
7376B4J7L4J10j57rj01J07K7N3j71Kl1J01K9o5M7m0l7J95j09J4j7Nl7J7j6JL9
$$ 24 41 75 185 28 19 -82 25 52 105 -66 -64 -95 6 35 -30 17 -23 -60 135 26 40 23 28 -9 8 -8 -7 32
7404C2q7K2J13j65O1P9Pj10K7J5j8Kq4P2JJ6R2r6O6l9j26J51K8J5j37N4K7q9P0
$$ 32 -55 -33 80 -85 -24 55 62 -48 -21 -6 -24 -22 -106 -34 -33 -17 75 -21 45 6 -120 31 59 74 -63 -9 18 -71 -1
7433aO8l8j11K14j56j0m3O9R0j19K6L3m2M0j5J5o1K7M4O2j13qP0l0Pl5N6n3O0
$$ -1 67 29 -82 132 -24 -34 -77 -8 82 -37 -11 22 -20 20 5 20 -41 -14 30 92 -21 -29 41 11 18 -17 39 -14 46
7462D6o0o7P6J4J6M3p1M5j12j1J47j24J13p0L6j56J34l3K7K2m4lo3J34j18J08
$$ 46 -14 -81 -5 9 25 68 -3 42 -70 -81 66 -58 55 -15 21 -135 -1 -34 -7 15 -29 -32 -95 39 -79 29
7488B9Ok2r8M4o2J18k2J27J15k81M4j0R2j4r5J17Oq7J9J5K0r7M3L6om1K5Lk1M1
$$ 29 35 13 -85 -41 -103 15 -7 120 235 -46 -2 -12 80 66 -29 88 94 7 26 41 61 -36 7 43 37 -4 21 24 3 44
7518D4M0r2J8L0m5n7J7qK6L6mk5Om9N3JK0o7J40o7p0R1q7J51j33j0R2j45Q7Q5
$$ 44 84 -8 10 40 -5 -62 -45 -53 -27 9 5 -20 -14 -63 -10 -9 11 -56 84 17 -53 38 -49 102 -31 -41 51 -94 -7 78
7548G8r3jl3M3M4m2o1K6O3j22J62j23Q3M7j16O1J3Pj18P9j7q6Q0k4N7p8mN8P9
$$ 78 -15 -16 -49 -6 38 -4 -65 -39 24 -98 64 -59 24 71 -45 16 29 36 -82 -3 -20 -106 -26 -50 7 -71 -75 -17 62
7577F2m5Rj18R5j14Q5j0ok3Q0n3O0m1R2j05rJ25j05k6P2m0k2j04K3J60j49J6J11
$$ 62 17 26 -92 3 -111 -26 -36 -42 -65 15 -38 22 -19 73 -32 -41 84 -21 -47 25 -15 -37 -141 -118 42 -107 -91 20
7605B0k1lK3j05rJ28po2L9m5k6R4QJ00j28q3q1J43n9J07m3M5j01J55L0j40Q7L4
$$ 20 -1 -4 19 -86 -95 33 26 -36 3 -42 -68 26 34 134 6 -77 -158 -15 -74 33 -10 35 -66 89 119 -21 66 100
7633A00q7K9o7M4p5L0O5j46J11j02N8J24o1j3Q6n9m3R6j60q9J98l8N4n8K1j1o8
$$ 100 13 42 -25 19 -56 -26 39 -107 4 -98 -40 84 23 10 96 37 -6 90 -70 -159 39 1 55 -3 18 7 -61
7660f1J19p71P33j32Q5P1m4j8L0KP8k12R8MP3j25R7n1Q7j09o1K43j26om3P9J3
$$ -61 58 -713 20 -112 -27 44 0 -18 12 14 92 -120 -22 -18 55 -70 27 -24 63 -46 -107 136 10 4 -39 40 53
7687E3m4r2Q5nL2j12J22k10J12Q6r0O4Q5o6R1j68l5R3J2J12O8k51O0Ok9N2n3j1
$$ 53 9 -83 2 -3 29 -83 39 -171 -59 27 -63 1 86 20 111 -57 -92 1 13 125 193 -58 2 8 -21 31 -22 -33
7715c3n2l4P9j1M6K3L0j7N8q7o5R2j7J1j8J7m0rL9r2mR3o4J31rMm1Lp9J41j1M
$$ -33 -85 -119 -40 -51 -5 18 48 31 89 2 -63 29 12 23 5 22 -18 -27 12 -80 -84 9 -55 76 67 71 30 33 -46 95 84 88
7747H8k0j06Jl2J11J23j6l4k17J48L0m12L69j6k11J71m3L14j95R4j4P5n09J07
$$ 88 68 -38 -37 -69 42 165 149 115 -102 46 76 -336 33 17 -194 -23 -66 248 53 147 133 208 -301 -194
7771a94K78j64K70l35K73j65N9k01K09j79K10m8j12J20o2O7o8Q3m1L1m3o4J02
$$ -194 84 -80 190 -145 128 -37 22 -179 30 -149 61 13 -99 21 -41 26 -42 41 0 31 -12 -76 26
7794B6r5P4k8K5Pm3J66p6J3j09M1j0P8n0j09O0N5Np8J36j67O8L3j51J24Q9l4L8
$$ 26 -69 5 -23 2 9 -34 132 56 69 -40 1 -9 69 19 -90 -30 25 30 -48 88 -79 -11 22 -129 -5 84 50 88
7822H8j6j89l0J59j10J17m3M2L5n2L7nL4j07R2KJ4n9j7j7joJ22k06J68M4j74J27
$$ 88 72 -117 -147 12 -98 19 -24 18 53 1 38 33 67 -40 52 54 68 9 -8 -25 -26 -32 90 -116 52 96 -78 49
7850D9l4L6p7l7O9pp1J68j23N0j1k26J34J10j11JR7O0k37J88p6J42j81Q8k7Q6
$$ 49 15 51 -26 -63 6 -1 -72 96 -27 23 12 -214 -80 30 -81 -80 17 77 -160 28 -48 94 -87 1 -26 60
7876F0o8PJ6j04J80j2l4j10J28j07o9qK16o9q7J59j11L4J17k02O2n4R1L8j14J52
$$ 60 -8 -1 15 -89 91 79 45 -65 63 -44 -113 -121 95 26 -61 98 -13 21 138 -64 -2 -56 35 73 -41 111
7902A11j04L6r2m8P9P4ro8kL1J9O5j15Q0K4m6n0R5j01L0m0m5O3j8M8j15K4QR1
$$ 111 7 43 -49 -97 -18 56 47 -21 -23 8 27 92 -23 57 81 35 -15 80 -21 9 -31 -76 -13 -31 17 -98 -74 -66 25
7931B5o4k8J77j34j5M3M2j04j6R1m9K0j52J83k9Q2l1j6l4okQ5n6r1O9J7QO5o8
$$ 25 -39 -67 110 -24 -39 4 46 -58 -74 17 -32 -12 -164 19 -10 72 41 25 -9 -15 -17 68 12 -79 -10 7 15 80 12
7960A2M4P1j78O0l7L7P5p1Kj7J6NJ00k05J24R1j44k3o6Q6P8m6P5j29k5N4N7q1
$$ 12 56 127 -51 9 -28 9 84 13 15 -2 14 19 119 -86 38 129 -15 -38 -104 -18 60 14 89 -40 -65 -11 46 -35
7988c5q1J90k0j45K9j3J24p1j7P7j2l3j1Qr4J15J7%K2kj00J3R6j20J54m7o9jq7
$$ -35 -116 74 54 -91 -62 -75 49 -22 -39 38 26 -7 -18 -10 -104 11 28 28 50 48 -52 -39 57 -63 91 44 -25 -26 -113
8017a13Q7K2k0K84k49MJ1L9m8K0n6J07k8m8P3j61J22r3N9K7j62J06n5L5J34r9
$$ -113 -26 -4 -24 260 11 15 26 65 17 37 -19 88 60 12 85 -76 46 -47 12 39 -123 -17 -72 -37 97 -2
8043bj0m9KJ11l7Q3m9k3n6%K2N3M8l3j4j03J28o2k4j33J01J35J2j78J24m8J00
$$ -2 -12 -61 -59 52 15 98 49 26 -30 -30 -8 45 93 60 46 -57 71 9 -15 -148 -47 88 100 -78 46 -2 98
8070I8j39O8j27J43j40J16J17j00O6o2k%j25M8K3K2o3K3oN5Kj2J22o0n8j2P7r2
$$ 98 -41 27 -100 43 -97 19 136 36 102 40 38 38 -87 -39 -16 6 -57 -34 -40 15 17 5 127 67 9 -3 74 -18
8098a8M4p9J10n0n7N6R5j86J78r1J9n9N4rq8Q7j9M2l9l9M5R3k3r0L9N7j42J20
$$ -18 26 -53 57 7 -50 6 101 -85 93 2 21 -38 16 7 -81 6 -13 29 -10 -49 -4 89 66 -24 15 72 -70 50
8126E0r7K6J40j04j16mJ04R3j66J64p6L7mp0J42j38m0N2j7O5j17L1J07o3M4Jj42
$$ 50 -47 -21 119 15 -101 -105 -1 92 -74 90 14 51 47 -23 119 -19 -59 -7 -24 41 -76 -45 62 -1 43 44 -98
8153i8J89l7p2k4m1k0R6k8M2P1p4q8J24J10p1P6j65R2p3j3%P7j30M5O8j03J36
$$ -98 91 54 -18 -42 -83 -103 -7 -35 7 78 4 -84 40 150 79 155 -10 82 9 -4 -4 73 -57 -12 56 -47 89
8180H9Kk0n2k6N1%n2j7K9L2q7
$$ 89 91 71 19 -7 44 44 -8 -25 4 36 -51
8191e1
$$ Imaginary data points
##PAGE= N=2
##DATA TABLE= (X++(I..I)), XYDATA
0@%%%%%%%%%%%%%%%%%qJ6j6J6j6J6k4L2l2M0m8N2o0P2q0Q8j04J18j32J48j66J84
$$ 0 0 0 0 0 0 0 0 0 0 0 0 0 0 0 0 0 0 -8 8 -8 8 -8 8 -16 16 -16 24 -24 28 -32 40 -40 48 -56 62 -70 78 -88 96
39I6k03K27k52K79l09L41l77M17m61N09n59O15o79P48q25R12j009J118j246J396
$$ 96 -107 120 -132 147 -162 179 -198 219 -242 267 -292 323 -356 392 -433 479 -530 588 -658 738
59G38j568J772k026K346k758L318m128N405p717J3213n1709l7425J09402K2847
$$ 738 -830 942 -1084 1262 -1496 1822 -2306 3099 -4618 8595 -43114 -80539 28863 51710
73E1710n9576l2595M4631K9217j2609j8253m280j5786M851K5997K289l3991j2661
$$ 51710 -7866 -40461 4170 33387 20778 2525 -1755 -17541 -12690 13307 15596 -18395 -31056
86c1056L6247L5634k8757m2315J2329L3182l051j9634m371Q274L423P265Q606
$$ -31056 5191 40825 12068 -30247 -17918 15264 12213 -7421 -11792 -3518 -95 7170 15776
99A5776j7195k0002K4205K8117j9330l1414O477K4157l423k0039K299R661k049
$$ 15776 -1419 -21421 2784 30901 11571 -19843 -13366 10791 7368 -12671 -10372 -711 -2760
112b760O027P560j1314r719J0653J4569r152k2730N093K2840l899j7406O086K0006
$$ -2760 3267 10827 -487 -10206 447 15016 5864 -16866 -11773 11067 7168 -10238 -4152 15854
126A5854j159k1562k447J7301n318j8852N625J6357j344j1463J524J3874L61j0684
$$ 15854 14695 -6867 -9314 7987 2669 -16183 -10558 5799 4455 -7008 -5484 8390 8751 -1933
140a933J595L336m801k02J792l198j323N941Q233m605j0154N591P062p765p424
$$ -1933 -338 2998 -1803 -2005 -213 -3411 -4734 1207 9440 4835 -5319 272 7334 -431 -7855
155g855K345O699J539p694j074Q583J817k392J027P77k356m595J466N337o415
$$ -7855 -5510 1189 2728 -4966 -6040 2543 4360 1968 2995 3772 1416 -3179 -1713 3624 -2791
170b791n951R971P928n142p247m47P322K089o118m135k077J436P585M51o647j205
$$ -2791 -8742 1229 9157 4015 -3232 -3679 3643 5732 -386 -4521 -6598 -5162 2423 2874 -3773 -4978
186d978O651R650j790j5450n114J2911Q158q536j3388M704J6450m47j1949k027
$$ -4978 1673 11323 9533 -5917 -11031 1880 10038 1502 -11886 -7182 9268 8821 -3128 -5155
200e155M671M922j27p442m562J344N006N380l377m689M808N353j55m293n258K389
$$ -5155 -484 4438 4311 -3131 -7693 -6349 -1343 4037 660 -4029 779 6132 5977 1684 -3574 -1185
216a185M077k191j528j320k090L707M589r50m646l107N657M059q942m877O680
$$ -1185 2892 701 -827 -2147 -4237 -530 4059 3109 -1537 -4644 1013 5072 -3870 -8747 -2067
231b067N340m81l093N45M295p77j665Q67l298j667K794j489l239o34K968M930
$$ -2067 3273 2792 -301 244 4539 3762 2097 2964 -334 -2001 793 -696 -3935 -4569 -1601 3329
247C329k526m209M295K227m525k301K018M149j019m336M292M034l946j053K371
$$ 3329 803 -3406 889 3116 -1409 -3710 -1692 2457 1438 -2898 1394 5428 1482 429 2800
262B800j5k281l157L66O04l391J689M156j798k20K952L03j348k213J602L526l266
$$ 2800 2785 504 -2653 -2287 -1683 -5074 -3385 771 -1027 -1247 1705 2008 660 -1553 49 3575 309
279C09k679L589J152j525r56J139K675k563m181K143K36m054R71L112P88l64q57
$$ 309 -2370 1219 2371 846 -110 1029 3704 1141 -3040 -897 -661 -4715 -3744 -632 156 -208 -1065
296a065L319R87l482J806J755k768p01M13l99k54j266K756J947l803r69K199j087
$$ -1065 2254 3241 -241 1565 3320 552 -149 264 -135 -389 -1655 1101 3048 -755 -1724 475 -612
313f12j363j518J138L555j696j410L554N15n33N69l16J06j594j743J691j651j944
$$ -612 -1975 -3493 -2355 1200 -496 -1906 1648 2163 1630 2199 1883 1989 395 -1348 343 -1308 -3252
330c252L550P55j771J22K70Q84r89k182K022J258k257J059Q41O9J388o44M85J322
$$ -3252 298 1053 -718 -596 -326 558 -431 -2613 -591 667 -1590 -531 310 379 1767 1123 1608 2930
348B930k433j026N91j527J34L47j73J498r03k33K227j337r14J674q95n35j69m91
$$ 2930 497 -529 62 -1465 -1331 -984 -1157 341 -562 -795 1432 95 -819 855 -40 -575 -744 -1235
366a235J737k1k47K341o62j403P92j207n20L72j854R47J108j271O79j51M7J779
$$ -1235 502 481 234 2575 1913 510 1302 95 -425 -53 -1907 -960 148 -1123 -444 -595 -548 1231
384A231p09q80N28j458N29J569j625N67J460Q7J071j340j425J021o59l36M22k193
$$ 1231 522 -358 170 -1288 -759 810 -815 -248 1212 1299 2370 1030 -395 626 -33 -369 53 -2140
402b140j32J561p8Q19k63j038K158N03j111o00j350J476K490j550o08O73l35J705
$$ -2140 -2272 -711 -789 30 -233 -1271 887 1390 279 -321 -1671 -195 2295 745 137 810 475 2180
420B180l01k760k93L19O68n1k865j84L047O72M97o64j254K494R22k017k27P6M88
$$ 2180 1879 -881 -1174 -855 -187 -238 -3103 -3287 -240 432 929 265 -989 1505 2427 410 183 259 747
439G47J041j387j15M75j311J105J37k207L58m35p87J463k74r4J547L76O17o5o98
$$ 747 1788 401 286 761 -550 555 692 -1515 -1157 -1592 -2379 -916 -1190 -1284 263 639 1256 1191 493
458D93K145m80l238J321J458j273j106j444J399K247j879j624K87P26J314j875
$$ 493 2638 2158 -1080 241 1699 426 -680 -2124 -725 1522 -357 -1981 -1694 -968 346 -1529
474a529j381L026P04l84J611q83j211J617J243m4l325k302L175J288k901j329
$$ -1529 -2910 116 820 436 2047 1164 -47 1570 2813 2769 -556 -2858 317 1605 -1296 -2625
490b625O5K377K207k906j655J989R10L97o30n09J301l32K50K259j748k009J421
$$ -2625 -2560 -183 2024 -882 -2537 -548 362 759 129 -380 921 589 839 3098 1350 -659 762
507G62O44l45j687k483J555J569q19m34k49J173K002k016o70K301m84r29N22M52
$$ 762 1406 1061 -626 -3109 -1554 15 -804 -1238 -1487 -314 1688 -328 -998 1303 819 -110 412 864
525H64L80j299j002K693K35j778r62j222J325K254k530j974J309J588J495j078
$$ 864 1244 -55 -1057 1636 1871 93 -869 -2091 -766 1488 -1042 -3016 -1707 -119 1376 298
541B98j292J160m5J066J568l189j602K574Q19l02j329j371J889J298q82j638j644
$$ 298 -994 166 121 1187 2755 -434 -2036 538 1357 1055 -274 -1645 244 1542 660 -978 -2622
558b622J919K434k812q77K102m72N31Q82m54l11j8N83O81k040m50J310k10R79
$$ -2622 -703 1731 -1081 -1958 144 -328 203 1085 631 320 302 885 1566 -474 -924 386 176 1155
576A155m53k650J599K410j902j815L15J619J94k269P77K246j189m84P74L87J488
$$ 1155 702 -1948 -349 2061 159 -1656 -1341 278 472 -1797 -1020 1226 37 -447 327 714 2202
593B202j276k524J717J517q45j541n54J899N14k243M57O28j383J130O56j659p2
$$ 2202 926 -1598 119 1636 791 -750 -1304 595 1109 -1134 -677 -49 -1432 -302 354 -1305 -1377
610a377L84J356J374j559o47J258N99P42j585k048J856R01j361l46p11L1J280
$$ -1377 -993 363 1737 178 -469 789 1388 2130 545 -1503 353 1254 -107 -453 -1164 -1133 147
627A47m92n5l47j133J764J256j432n17M28J475J496j793r40J250j4j05p16j438
$$ 147 -345 -400 -747 -1880 -116 1140 -292 -809 -381 1094 2590 797 -143 1107 1093 988 272 -1166
645a166J182L7j768M57N49q8N66n73K90Q12l63N37P2o43J601l8j643J105M04p51
$$ -1166 16 53 -1715 -1258 -709 -797 -231 -804 -514 298 -65 472 544 -99 1502 1464 -179 926 1330 579
665E79l70o54K24R5j540P67J14j019J104L67l71J319k90m00J278m78q0L81o00
$$ 579 209 -445 -221 -126 -1666 -899 -785 -1804 -700 -333 -704 615 325 -75 1203 725 645 1026 426
684D26L99j06q25O93r96m64J457j364j355J288L47j27k14p5J667j44p61J276p9
$$ 426 825 719 -106 587 -409 -873 584 -780 -2135 -847 -500 -627 -841 -916 751 607 -154 1122 1043
703A043m39Q73p42n15N10q48L4K26q84M86Ko30K46k15K92N78j234Q83J754j286
$$ 1043 604 1477 735 220 730 -118 -84 142 -742 -256 -254 -884 -638 -853 -561 17 -1217 -334 1420 134
723A34k87R32K48L26j032k82Q78p04r23P29o51j8N10p27M62k10l50J242m19n63
$$ 134 -153 779 1027 1353 321 39 917 213 -710 19 -632 -650 -140 -867 -405 -615 -965 277 -142 -705
743g05J135j70o5L23l83P01K01j348O60M27j145P8r1K0L29r46L21J106j082K26
$$ -705 430 260 195 518 135 836 1037 -311 349 776 -369 -291 -382 -362 -33 -979 -658 448 -634 -408
763d08R16o87M76l39J3L22l11n2J052q63o5J051p15n62L85l29L83m34o37N49m4
$$ -408 508 -179 297 -42 -29 293 -18 -70 982 119 54 1105 390 -172 213 -116 267 -167 -804 -255 -299
784b99J94n78Q7R99L89j285Q80K5m39N14%n19P85n16J56P3q06OO61j154L42m70
$$ -299 -105 -683 -596 403 792 -493 387 412 -27 487 487 -32 753 237 393 466 -340 -334 327 -827 -485 -955
806i55N52J0k3l27M79k65L85N41l00M84L56j090P52L5j328J570p25m30L55n27
$$ -955 -403 -393 -416 -743 -264 -529 -144 397 97 581 937 -153 599 634 -694 876 151 -279 76 -451
826d51j06N16j120M35K87l89O29K05n23J104K7m15P15n58J51N48p62LO3n13N94
$$ -451 -557 -41 -1161 -726 -439 -828 -199 6 -517 587 614 199 914 356 507 1055 293 296 359 -154 440
847D40o93q05Q14k91m12L27m54M84Q44m83N96R4l04R46j55n87P18o21l81M23r42
$$ 440 -253 -1058 -244 -535 -947 -620 -1074 -590 254 -229 367 461 157 1103 948 361 1079 458 77 500 -442
868d42RL81j058M33K58p20R52m14n4J151q94m0J707n83P09j063k34R45j55j025
$$ -442 -433 -52 -1110 -677 -419 -1139 -187 -601 -655 496 -398 -438 1269 686 1395 332 98 1043 888 -137
888a37P49q77N0Lk80k65M75r30J040L31p75j56Q10L54Q28M06j271N83j92mR1j034
$$ -137 612 -265 -215 -212 -492 -757 -282 -1212 -172 159 -616 -772 38 392 1220 1626 355 938 746 742 833 -201
910b01R1L27n94J42o48j76R57l56k58P25n22M96Q56q05L58K18m65P42l21n04L46
$$ -201 -110 217 -377 -235 -883 -1059 -102 -458 -716 9 -513 -17 839 34 392 610 145 887 566 62 408
931D08l44j2L60r77O1M49p83L73K03n59O13q5K0P47n97J82O67n14L83k0r76P19
$$ 408 64 52 412 -565 -504 -55 -838 -465 -262 -821 -208 -293 -273 474 -123 59 726 212 595 575 -401 318
953C18K55p50K78m49j52O63m21k06J41m90P59M09q46N11M8k18P89k37l53J80k1
$$ 318 573 -177 101 -348 -500 163 -258 -464 -323 -813 -54 355 -491 20 68 -150 639 402 49 229 208
974B08N02%j042K03M73m30L55o84l00J008m12m94M79j93J59K72l01L98k12l02
$$ 208 710 710 -332 -129 344 -86 269 -415 -715 293 -119 -613 -134 -327 -168 104 -197 201 -11 -313
994c13J110j74o88M12j05J08J97p69J81L37o71L0J62k02K66n19m4Q66m89o3M59
$$ -313 797 623 -65 347 242 350 547 -222 -41 296 -375 -345 -183 -385 -119 -638 -682 184 -305 -368 91
1015I1j66N40J51o02L81J37l16L42l85l89L63n95K76J22p91K73L26k64M93l78
$$ 91 -75 465 616 14 395 532 216 558 173 -216 147 -448 -172 -50 -841 -568 -242 -506 -13 -391
1035c91k36J233k21n35M44J99N15k46j033N78K32o16J85k74n70O02l80n1M33p42
$$ -391 -627 606 385 -150 294 493 1008 762 -271 307 539 -77 108 -166 -736 -134 -514 -565 -132 -874
1055h74L49P95l03K57p9p0Q81k20n80P37m76o8J73n97o1k9n43L33k12k31M35k32
$$ -874 -525 270 -33 224 145 75 956 736 156 893 417 349 522 -75 -136 -165 -708 -375 -587 -818 -383 -615
1077f15J46O48l33K92L98m26N60J31o70L81m9l06K51o27j3K13p31K24M52q93L25
$$ -615 -469 179 -154 138 536 110 670 801 131 512 463 157 408 -219 -232 -19 -750 -526 -74 -967 -642
1098f42M99k26N65k34k07Q38n3j63J15j89J59J21p50M12j98o18M84l4o26M95k32
$$ -642 -143 -369 196 -38 -245 593 540 377 492 303 462 583 -167 245 47 -571 -87 -121 -747 -252 -484
1119d84L3L11l14M56L03m02N53o9k79O71m42k46M23m25l9J70o80J29J34k68L66
$$ -484 -451 -140 -454 2 305 -97 456 387 108 779 337 91 514 89 50 220 -460 -331 -197 -465 -99
1140i9k31l09P41j87q4M85l63k0M33m50N03L5n93N21j59l96L57k80k31J68l92
$$ -99 -330 -639 102 -85 -169 316 -47 -67 366 -84 419 454 -139 382 223 -173 184 -96 -327 -159 -551
1161e51L55L27n77K76K86m55M14p9j81N30k31R6K53m41J58J38n05L36q4k48L45
$$ -551 -196 131 -446 -170 116 -339 75 -4 -185 345 114 210 463 22 180 318 -187 149 65 -183 162
1182A62j45o30O47j52k17K69l18M62j72k72O21q1m10N28j75j95N01k91j57L20
$$ 162 17 -613 34 -118 -335 -66 -384 78 -94 -366 255 174 -236 292 117 -78 423 132 -25 295
1202B95l91J11Lk78K53k11k11M76m23nM86l98J45M16l16J05K59j62L27k86k22
$$ 295 -96 15 18 -260 -7 -218 -429 47 -376 -381 105 -293 -148 268 -48 57 316 154 481 195 -27
1223b7M50m94jM22o26Q3N9m40L20Pl26M41p6j5L55r9P7M38m19L95O7n40K26L5
$$ -27 423 -71 -72 350 -276 -193 -134 -574 -254 -247 -573 -132 -208 -223 132 33 110 548 129 524 591 51 277 312
1247C12m41K00k85j30J94l12K3L42l16J29K37k12N17r7k3M71j85k03M45m33Nk7
$$ 312 -129 71 -214 -344 -150 -462 -439 -97 -413 -284 -47 -259 258 161 138 609 424 221 666 233 238 211
1269B11l72O9Ol97K28k24j07L49j93K5L54k02K85K72k06K63P4j91L26k55k83L34
$$ 211 -161 -92 -86 -483 -255 -479 -586 -237 -430 -405 -51 -253 32 304 98 361 435 244 570 315 32 366
1291C66n67L1J56l90q6K00l15L14J47l02N49j25q2N40k50J6K33j94J41J18n50
$$ 366 -201 -170 -14 -404 -490 -290 -605 -291 -144 -446 103 -22 -104 436 186 202 435 241 382 500 -50
1312e0J80m6l83J86j6j24J55l78J38L33l17L56J13k07L28Mj36K18k20R2K38m25
$$ -50 130 84 -299 -113 -129 -253 -98 -476 -338 -5 -322 34 147 -60 268 272 136 354 134 226 464 39
1334C9qJ33m18K30j31k73K57k3k34M50j52o4K76j97K32J41k69L81j44k95L07j08
$$ 39 31 164 -254 -24 -155 -428 -171 -194 -428 22 -130 -194 82 -115 117 258 -11 370 226 -69 238 130
1356A30k75K72k05m9J07l11J31J24j80J06m7K5M24k69o2K84j28rJ39j81J33mk87
$$ 130 -145 127 -78 -127 -20 -331 -200 -76 -256 -150 -197 -172 252 -17 -79 205 77 68 207 26 159 155 -132
1379a32L19kl40K26k13m5K08k41O5J7p4K59K2k81L56j35J0K36r3j11L07l79J03
$$ -132 187 185 -155 71 -142 -187 21 -220 -155 -138 -212 47 69 -212 144 9 19 255 162 51 358 -21 82
1402H2K37m24K75j04l50K22j13j27K78l00kM30l60K15K53l38L24lj86M34k58j41
$$ 82 319 -105 170 66 -284 -62 -175 -302 -24 -324 -326 104 -256 -41 212 -126 198 195 9 443 185 44
1424D4K43l36o2J75k07rJ69l08J08m7j45K90j34R4L57k69O6K63j43J17J16k59
$$ 44 287 -49 -111 64 -143 -152 17 -291 -183 -230 -375 -85 -219 -125 232 -37 29 292 149 266 382 123
1446A23R8q1j06K8k22R6J44m45L4J01j06K16J07k35M03j9r0L68j59l7J23k08P0
$$ 123 221 140 34 62 -160 -64 80 -365 -331 -230 -336 -120 -13 -248 155 136 46 414 255 218 341 133 203
1469B03J2k79J15l8l14Q3p5r9K36k36J11J67k4J56J75j40K67R3m11L68q3j86R4
$$ 203 215 -64 51 13 -301 -218 -293 -392 -156 -392 -281 -114 -138 18 193 53 320 413 2 370 287 101 195
1492A95k04o0Q2l62M7M4k71L70p6j7M00k34M8L28j72k1L67l32K1J04k45Q3k0k24
$$ 195 -9 -69 13 -349 -302 -258 -529 -159 -235 -252 148 -86 -38 290 118 97 464 132 153 257 12 95 75 -149
1516a49J08j48l9K51l55L0K21j65L94q0j44L04m7j74M36l20rJ53k32K0J58m06
$$ -149 -41 -189 -228 23 -332 -302 -81 -246 148 68 -76 228 181 7 443 123 114 267 35 55 213 -193
1538a93Q9N3k02M3M3J5J07j44K27J02j96J74M1k21K35N8k42K46r1k08O6q7m7J25
$$ -193 -104 -51 -253 -210 -167 -152 -45 -189 38 140 -56 118 159 -62 173 231 -11 235 144 -64 2 -85 -132 -7
1562gk08J53r3j55L67qj46J17l1Q5R8o3Rnj07J12lj86K02j01o1O9j03k2L3j65
$$ -7 -215 -62 -155 -310 57 49 -97 20 -11 74 172 109 118 113 6 118 115 -71 131 30 -31 38 -65 -87 -54 -219
1588b19P5J46q5O2L5m9pJ3J3K14j20L2J1j56R5Q9k27Q0Q5l18J80m2J7mJp9J91
$$ -219 -144 2 -83 -21 14 -35 -42 -29 -16 198 78 110 121 -35 60 149 -78 2 87 -231 -51 -93 -76 -80 -79 -158 33
1615C3k00J98J17k20J11J39p1J06o7j48J85j64M7j66j22J46O9j55J77j52k47L21
$$ 33 -167 31 148 -72 39 178 107 213 146 -2 183 19 66 -100 -222 -76 -7 -162 15 -137 -384 -63
1637f3J11j96J91q4R7Q5L3n4J49k30L3Q3j68O0q3k57J65r9KJ83j66J89r5J4L16
$$ -63 48 -148 43 -41 56 141 174 120 269 39 72 155 -13 47 -36 -293 -128 -227 -225 -42 -208 -19 -114 -100 216
1662B16j81j01L60j34OQ9j39kM7k81J17l1j81J16j40j4J88o2j01J70k7K78p6k78
$$ 216 35 -66 294 160 166 255 116 114 161 -120 -3 -34 -215 -99 -239 -253 -65 -127 -228 -58 -85 193 117 -161
1686a61L40j1j50K01n5j46J48j81oO2k04Q7r1j17K13Kq1K18l3J04J89k43J20%
$$ -161 179 168 18 219 164 18 166 -15 -21 41 -163 -76 -167 -284 -71 -69 -150 68 35 139 328 85 205 205
1710B05j05N8r0o2jJ2j44P3j47qJ77j28O7N2k38M20n6o6PJ02o5K10j71l4Q5j88
$$ 205 100 158 68 6 5 17 -127 -54 -201 -209 -32 -160 -93 -41 -279 141 85 19 26 128 63 273 102 68 153 -35
1736c5K7R7j18j9j00j74L21j25P8K3q5N6O6l8k8J61r9P1l3r2J95k19pK76k77j0
$$ -35 -8 89 -29 -48 -148 -322 -1 -126 -48 -25 -110 -54 12 -26 -54 107 8 79 46 -46 149 -70 -77 199 -78 -88
1762h8J16k36J64j2o2J31k1j65K48m7n7K00j70O5J37j46Q8r8n6Q4q6P1m7j7o2
$$ -88 28 -208 -44 -56 -118 13 -8 -173 75 28 -29 171 1 66 203 57 145 47 -9 75 -11 60 13 -4 -66
1787f6K6j21J37R1j83J52j58l4J62J8o9K53r3m5J15k08M7J77j32j42P3k03K27
$$ -66 -40 -161 -24 67 -116 36 -122 -156 6 24 -45 208 115 70 185 -23 24 201 69 -73 0 -203 24
1810B4j89P0J01q1K8R5k05M4K81k58K25K0j19J26r7k4m0k2J08p3j36R6j4j95J52
$$ 24 -165 -95 6 -75 -47 48 -157 -113 168 -90 135 155 36 162 65 41 1 -21 87 14 -122 -26 -40 -235 -83
1835h3n3q4K28jj30J91j02J07K30k68N6J43k18N9p7K2M3r3j26K00j66j06J00j12
$$ -83 -136 -220 8 7 -123 68 -34 73 303 35 91 234 16 75 -2 20 63 -30 -156 44 -122 -228 -128 -240
1859b40K48n6p2J85p5m0J58L0NN5k03O1p1lP0o9r9R2m8j46K24j91J8J00M8N9J2
$$ -240 8 -48 -120 65 -10 -50 108 138 143 198 -5 56 -15 -18 52 -17 -116 -24 -72 -218 6 -185 -167 -67 -19 40 52
1886E2J6J60o6j34K14j58L3Lj96Q6j02l7l6N1jK1l6K3L08k42M2M6M8l7O7j07J55
$$ 52 68 228 162 28 242 84 117 120 -76 10 -92 -129 -165 -114 -115 -94 -130 -107 201 -41 1 47 95 58 125 18 173
1913A73q2j82K96k20J8K9q8j39J02J41k33J62M2n7Q4j40J77P2m5o3N8j37K04j52
$$ 173 91 -91 205 -15 3 32 -56 -195 -93 48 -185 -23 19 -38 46 -94 83 155 110 47 105 -32 172 20
1937B0n2J23j57J04J2k51J57q4j23L17j03J2P3p2J16K4j58O2M0p2J68j93l5N8
$$ 20 -32 91 -66 38 50 -201 -44 -128 -251 66 -37 -25 48 -24 92 116 -42 20 60 -12 156 -37 -72 -14
1961a4j3n7J89j44MQ2k16J73k4O5%l8o2J27j12j3Q3oP1p6o0Nj1m6P8r8J17O0j95
$$ -14 -27 -84 105 -39 -35 47 -169 4 -20 45 45 7 -55 72 -40 -53 30 24 95 19 -41 -36 -47 -93 -15 -113 4 64 -131
1990a31J5M9%m0J69m4J39j84J11MO6j88J50M2j51M4p9M1l0n8Q7j23j5R2J3P0r9
$$ -131 -116 -67 -67 -107 62 18 157 -27 84 88 154 -34 116 158 7 51 -28 13 -17 -75 12 -111 -126 -34 -21 49 -50
2017e0J28o2O2j79J83J22j62Q4k11J4L1ml0J29n4J8m4j96K05k9n9J49j29J07l7
$$ -50 78 16 78 -101 82 204 42 126 -85 -71 -40 -44 -74 55 1 19 -25 -221 -16 -45 -104 45 -84 23 -14
2042a4J6L8O3K0o8L3o4K7j40kJ87k34Q6J10j13L1M4j11N7L6O3Nj14M3R5j0r5K80
$$ -14 2 40 103 123 55 88 24 51 -89 -91 96 -138 -52 58 -55 -24 20 -91 -34 2 65 70 -44 -1 94 84 -11 269
2070B69k60P9K3k02K9o7j12J93p7o9K66k18J18J45m9N2l9kj1o3P7N3q7j00N7p1
$$ 269 9 88 111 -91 -62 -129 -241 -48 -125 -194 72 -146 -28 117 68 120 81 79 68 5 82 135 48 -52 5 -66
2096f6K0L6j27Q4k3%P8j22M6R2n1j8K02j08j1O3o7L8j0p5k5J04r7K7j28L9J23
$$ -66 -46 -10 -137 -53 -76 -76 2 -120 -74 18 -33 -51 151 43 32 95 28 66 56 -19 -44 60 -37 -10 -138 -99 24
2123B4j98Q6J49p9%J43r4k9N5j05K45J6l25J89q5j1K8j55J62O8k46J12K2J2p9
$$ 24 -174 -88 61 -18 -18 125 31 2 57 -48 197 213 -112 77 -8 -19 9 -146 16 84 -162 -50 -28 -16 -95
2148i5J78j36N8J9O8j26J20j10J50j17K4O1j44J7J38j31J6o6L1m2L9k7J10o8M0
$$ -95 83 -53 5 24 92 -34 86 -24 126 9 33 94 -50 -33 105 -26 -10 -76 -45 -87 -48 -75 35 -33 7
2173GQ1j27J16o0L8O3j89L0j1k4P3l7jj28J39k8L0J6qL9j50K38p5m8J04o0k7R5
$$ 7 88 -39 77 17 55 118 -71 -41 -52 -76 -3 -40 -41 -169 -30 -58 -28 -12 -20 19 -131 107 32 -16 88 28 1 96
2201I6l4j09P2mK9J07k79N7R0r3k5J8O8l5O2Qj10l5J80p6O7N4r5QL8o6k7K8P1
$$ 96 62 -47 25 21 50 157 -122 -65 25 -68 -93 -75 -7 -42 20 28 -82 -117 63 -13 54 108 13 21 59 -7 -34 -6 65
2230F5J2j84O8MJn3J30k24J54J3Nl1j6K02p1J5j77P2J08N5j27j04M3%MK9n3j5
$$ 65 77 -107 -39 -35 -34 -87 43 -181 -27 -14 -9 -40 -56 146 75 90 -87 -15 93 148 21 -83 -40 -40 -36 -7 -60 -75
2258g5K0lk7J30j39N0J63j47jJ19r1J13Qr7p5L2J1Q0j62L7Q9j40LJ01p0L3K2k6
$$ -75 -55 -58 -85 45 -94 -44 119 -28 -29 90 -1 112 120 23 -52 -20 -9 71 -91 -54 35 -105 -102 -1 -71 -38 -16 -42
2286d2J01l0M1k2J2l1Q6q0j10P1j19J38L5j37Q4K2j84J75l6K0J32p3r8J29l2J41
$$ -42 59 29 70 48 60 29 115 35 -75 -4 -123 15 50 -87 -3 19 -165 10 -26 -6 126 53 -45 84 52 193
2312A93j48m4qJ45k35J49m0j42R8L1L1p5m0P2L5Pq8J08L8J5Lj13J44j92J58j14
$$ 193 45 1 -7 138 -97 52 12 -130 -32 -1 30 -45 -85 -13 22 29 -59 49 87 102 105 -8 136 -56 102 -12
2338a2nk9nml5lQ1o3OM9L4l4q3J39M9k8j07j27K54l7J8o1J6j12J65j89J05n1M1
$$ -12 -17 -46 -51 -55 -90 -93 -12 -75 -69 -20 14 -20 -103 36 85 57 -50 -177 77 40 58 -3 13 -99 66 -123 -18 -69 -28
2367b8k1J13j37K7M5m8K12j21n8n7J0Q0qRk9M4L0p6P5q9j2L7J9L4k7L0l2J4j28
$$ -28 -49 64 -73 -46 -1 -49 163 42 -16 -73 -63 17 9 18 -11 33 63 -13 62 -27 -39 -2 17 51 24 54 22 36 -92
2396i2N5J9R3N0j14l1k0J10j9j14P7Q0j23j5L9j09J00j3KJ14p8l1J5n7M6pL0Q1
$$ -92 -37 -18 75 125 11 -20 -40 70 51 -63 14 94 -29 -44 -5 -114 -14 -27 -25 89 11 -20 -5 -62 -16 -23 7 88
2424H8J9p4L4n8qP2l9n6L9n8n3J92j66m9J73r8J72j02J7j22R0oJ2M2mj3q7J46
$$ 88 107 33 67 9 1 73 34 -22 17 -41 -94 98 -68 -117 56 -42 130 28 45 -77 13 7 19 61 57 44 -43 103
2452A03j43P0j8M9r3L8J7k1J9p5L2m8N6K01k91N5J08o4J36m9j22j13P0j11J67
$$ 103 -40 30 12 61 -32 6 23 2 21 -54 -22 -70 -14 187 -104 -49 59 -5 131 82 -40 -153 -83 -194 -27
2477b7O8n6k2J17r5O1j07J81j34JJ83j75j1K6J35j36Pl6J5Lq1rK9M1K9J39j72
$$ -27 41 -15 -37 80 -15 46 -61 120 -14 -13 170 -5 -16 10 145 9 16 -20 -5 -2 -83 -92 -63 -22 7 146 -26
2504b6j0P3j21J39J8L2L0j21j17K53j22j6Q1o1O4om3r9j25k5K06n3J8n7R7PJ33
$$ -26 -36 37 -84 55 73 105 135 14 -103 150 28 12 93 32 96 90 47 -52 -177 -202 4 -49 -31 -88 9 16 149
2531A49j37k1N8o3P2qq4L7j14jJ58p0Rom6n7J20n0RJ64j37qQ6J8j14L9j5J46j10
$$ 149 12 -9 49 -14 58 50 -34 3 -111 -112 46 -24 -15 -21 -67 -124 -4 -54 -45 119 -18 -26 60 78 -36 3 -12 134 24
2560B4L6k6p6M4n2N5oj23O4N7j00J65k3j2j4m2LQ2j9o0P2o2L6M2j25N8l4O4m6
$$ 24 60 34 -42 2 -50 5 -1 -124 -60 -3 -103 62 39 27 13 -29 -26 56 37 -23 49 -13 23 65 -60 -2 -36 28 -18
2589a8m8J20p3N7p5N9m9p2L3J00j3l3J0j6M3O8n8o3j3J36o8o7J91j98J01j74O
$$ -18 -66 54 -19 38 -37 22 -27 -99 -66 34 21 -12 -2 -18 25 93 35 -28 -41 95 27 -40 151 -47 54 -120 -114
2616a14J04P3k7%rk6J01n4N3j07l6J11j22M3J7K3j13P0n4O6K6k2J0o7J7J46j28
$$ -114 -10 63 36 36 27 1 102 48 101 -6 -42 69 -53 -10 7 30 -83 -13 -67 -1 25 3 13 -54 -37 109 -19
2643a9J4N9p8J43p7o2J17j20L0l2m6K0M2J40j28n3pJ12L0j14n0J09l9P8j36R6
$$ -19 -5 54 -24 119 42 -20 97 -23 7 -25 -71 -51 -9 131 3 -50 -57 55 85 -29 -79 30 -9 69 -67 29
2669B9K4k5j4j06J35k8j0L5%r8J01k7j1J19mq3O6k16J71M2j8k2m3J16k2n1m0j30
$$ 29 53 28 14 -92 43 15 5 40 40 -58 43 16 5 124 120 37 103 -113 58 100 82 60 17 133 111 60 20 -110
2697a10Q1N3r8K2M5M7p8N0n6k7J35r9m0Q0J05L6k21O5N4n9O2%j5L4j8k1Q5p5N2
$$ -110 -29 24 -74 -52 -7 40 -38 12 -44 -71 64 -35 -75 5 110 146 -75 -10 44 -15 47 47 32 66 48 27 112 37 89
2726H9j14o2L3jJ00k6Rn5K8L9k8j9K7J0j6q9L1J0K2k6J4M1J3Mj03J33qp6Q1o6
$$ 89 -25 -87 -54 -55 45 19 28 -27 1 40 12 -7 20 30 14 -75 -44 -34 -12 -38 -24 17 30 34 -69 64 56 -20 61 -5
2756eJ6%N6l9j01R1l0mm1lL0M2L6p2M6L5m3k1P8j47J40j71N8oM4J8n2L9j2k9k2
$$ -5 11 11 67 28 -73 18 -12 -16 -57 -60 -30 12 48 -24 22 57 14 -7 71 -76 64 -107 -49 -55 -11 7 -45 -6 -18 -47 -69
2787f9O2n7L5K1j0k0J3L2l3R4j67J52o8Q8%q6J40j97R4R5j30p0M9L6n4R5p3K7
$$ -69 -7 -64 -29 -8 -18 -38 -25 7 -26 68 -99 53 -15 73 73 -13 127 -70 24 119 -11 -81 -32 4 -50 45 -28 -1
2815aJ09r2m0J27l5j31N5J47k14J3R3j09P1M9j37J61j8r3j1O7P1q7R1p3j4k9J
$$ -1 108 16 -24 103 68 -63 -8 139 -75 -62 31 -78 -7 42 -95 66 48 -45 -56 11 82 -5 86 13 -1 -30 -29
2842b9j24K04n2N5j27J7K2R5j72K9J19l4Q9j56L2n2J00Nr9N6o1K1J3n1J98q3p
$$ -29 -153 51 -1 54 -73 -56 -34 61 -111 -82 37 3 92 -64 -32 -84 16 21 -78 -22 -83 -62 -49 -100 98 15 8
2869HL8J7Pk38J23R5r3l9L4J57j53N6qL6mn0L5k8k9K5k7J06r0K9n7J44L2j44L3
$$ 8 46 63 70 -168 -45 50 -43 -82 -48 109 -44 12 4 40 36 -14 21 -7 -36 -11 -38 68 -22 7 -50 94 126 -18 15
2898A5j8J71j69K8J9N8q1k0k6N6j15J00L0R8j79K6m3N5l6l8N9n3l0NN8L4p2R0
$$ 15 -3 168 -1 27 46 104 23 3 -23 33 -82 18 48 146 -33 -7 -50 5 -31 -69 -10 -63 -93 -88 -30 4 -68 22
2926B2o7l9R0lO2p5N7j1r6L7R0o9O9j14N8l7N9Oq8jO3k6N2j7j9M6r7Q1l0%J1O1
$$ 22 -45 -84 6 3 65 -10 47 36 -60 -23 67 -2 67 -47 11 -26 33 39 -49 -50 13 -13 39 22 3 49 -48 33 3 3 14 75
2958G5o9R6j80kJ62j15l0O1qk3M3J7J7k1J15k23P0L9M6lj13%%R9o4J6j66K14K2
$$ 75 6 102 -78 -80 82 -33 -63 -2 -10 -33 10 27 44 23 138 -85 -15 24 70 67 -46 -46 -46 53 -11 5 -161 53 75
2987G5j3j06k3J38l8m2KP3j36m5J20K5OKr0J25n5O0q6k3l0M7j46J29O8k9l3J0
$$ 75 62 -44 -67 71 33 -9 -7 66 -70 -115 5 30 36 38 -52 73 18 78 -8 -31 -61 -14 -160 -31 37 8 -25 -15
3015a5%Q9np4P3m4j3rlP7q7N0J9q9KP9jr2L9j7Jm5J49j44N4R0l5o0M1n3N8N8o3
$$ -15 -15 74 69 -5 68 24 11 2 -1 76 -11 39 58 -31 -29 50 49 -43 -4 -21 -20 -65 84 -60 -6 84 49 -11 30 -23 35 93 30
3048C0J4J7M7j19J08q0k9N3n8l7R6q8J52n1j47J31m1J9Q0j01m2Q3m7J2M9j02O8
$$ 30 44 61 108 -11 97 17 -12 41 -17 -54 42 -46 106 55 -92 39 -2 17 97 -4 -46 37 -10 2 51 -51 17
3075A7j22J9MJ24k7o0O5K6l0q0Q9L7q7j5J5J9P8j14l2O9k3J29p0q8N8p3N9J17
$$ 17 -105 -86 -82 42 15 -45 20 46 16 -64 25 62 -25 -40 -25 -6 72 -42 -74 -5 -28 101 31 -57 1 -72 -13 104
3103A04j19Q3p8K2N4j37J59j00pP7j07K0QQJ4j52J28j7N0m8N2K4m8j2Jm8J48j18
$$ 104 -15 68 -10 12 66 -71 88 -12 -19 58 -49 -29 -21 -13 1 -151 -23 -40 10 -38 14 38 -10 -22 -21 -69 79 -39
3131c9P9R3j59P7j6m9N9j18J05Lj11J23l0n1L2kM6j2j29J77j18M5R7j08Pj8O1
$$ -39 40 133 -26 51 35 -14 45 -73 32 35 -76 47 17 -34 -2 -4 42 30 -99 78 -40 5 102 -6 1 -17 44
3158D4j14N6O1k7j07R8j21K4J7J01R9k42O7J00l7J6o0K43k88M7NN0oo5R4n2pp0
$$ 44 -70 -14 47 20 -87 11 -110 -86 -69 32 131 -111 -44 56 19 35 -25 218 -70 -23 -18 32 26 -39 55 3 -4 -74
3186g4J65j5o1j30R6j05J61r5N9P3K5n8qn7J6K8p5rM0l1Jl0p0J52l4j0J34j03
$$ -74 91 76 15 -115 -19 -124 37 -58 1 74 99 41 33 -24 -8 20 -55 -64 -24 -55 -54 -84 -154 -2 -36 -46 88 -15
3214a5L4j09L4J80j27K0J2l4m3J94j74P2j15RN7J6l1M5J42j63M5Km1o4L7l4M9
$$ -15 19 -90 -56 124 -3 17 29 -5 -48 146 -28 44 -71 -62 -5 11 -20 25 167 4 49 51 10 -54 -17 -51 -2
3241bq2L6M5J0M5q5J83q0o1L8n7j33J12l9L6n4P6K0KL9j09M3NJ06j02m5M5O7k1
$$ -2 -84 -48 -3 7 52 -33 150 70 9 47 -10 -143 -31 -70 -34 -88 -12 8 10 49 -60 -17 -12 94 -8 -53 -8 59 38
3270C8k6O1j43R8j13Q2j24N9n8J46l2Q2M7j11j2l8J13l5O6o7l7j11K85j46Pp9
$$ 38 12 73 -70 28 -85 -3 -127 -68 -126 20 -12 70 117 6 -6 -44 69 34 100 33 -4 -115 170 24 31 -48
3296d8j6J0R0j28Q2J64j76J02j6K1q0J08j0q8o8Q1J4n3k2J37j84L0Kj4LJ13j96
$$ -48 -64 -54 36 -92 -10 154 -22 80 64 85 5 113 103 15 -53 28 42 -11 -33 104 -80 -50 -48 -62 -59 54 -142
3323a42J94L4j57J03PkN3j05K2qM0K7o9q7J04j6K6n8k3J64j78J41j02Q3j56K23
$$ -142 52 86 -71 32 39 37 90 -15 7 -1 39 66 -3 -90 14 -2 24 -34 -57 107 -71 70 -32 51 -105 118
3349A18n1mr2M64p23L36O44p13m5K2O8q0o6J81p6j9P5K0O1j35J4k4Q5j36k1J31
$$ 118 67 63 -29 435 -288 48 692 -21 -66 -44 24 -56 -122 59 -17 -36 39 59 120 -15 -1 -25 60 -76 -97 34
3375C4P7j06m0j30K18o2j03J66p8O3q3J5J27j10j13O9J42j31L4m3O8K7M4l6m4
$$ 34 111 5 -35 -165 53 -9 -112 54 -24 39 -44 -29 98 -12 -125 -56 86 -45 -11 -54 14 41 85 49 5
3400EL7mM5j80K37j09j44J03n6J9K00l21J65m4M9O3k8j65J50o7J6m2M8R7m6N5
$$ 5 42 38 83 -97 140 31 -113 -10 -66 -47 153 -168 -3 -47 2 65 37 -128 22 -45 -29 -71 -23 74 28 83
3426H3j15J06kJ6p0Qp9M2k9K7K1l1P7j4k0nj02J74M7j66J46j10N8j10O8N7q1p2
$$ 83 -32 74 72 88 18 26 -53 -11 -40 -13 8 -23 54 40 20 15 -87 87 134 -32 114 4 62 -48 20 77 -4 -76
3454g6J18j42PJ02k0jJ03o6j4j07J27N4m2k8O7K3o3k1q9M5Q1j28L4R6j74P8Q3
$$ -76 42 -100 -93 9 -11 -12 91 25 11 -96 31 85 43 15 82 105 42 21 -68 -23 58 -70 -36 60 -114 -36 47
3481D7n4O4o3p9J35R7n0m1r1J12n1L0j28Q1lLn1OM7r3M5M1q7N7j8PL7j0L2J12
$$ 47 -7 57 -6 -85 50 147 97 56 -35 77 26 56 -72 9 6 9 -42 -36 11 -82 -37 4 -83 -26 -44 -37 0 -10 22 134
3511A34k0Jj52K9k0k5M6P4n1n7j5K0R0K4k20P5J24q6N6M3p0J35k8j64J82j04J
$$ 134 114 115 -37 -8 -28 -53 -7 67 16 -41 -56 -36 54 78 -142 -67 57 -29 27 70 0 135 107 -57 125 21 22
3538B2J7j1j51m3J06k2R6q1j4J96r9l4R2l9r0n2J63M5o5q2J04jk2k8P3j91K02
$$ 22 39 28 -123 -166 -60 -82 14 -67 -81 115 16 -18 74 35 -55 -107 56 101 36 -46 58 57 35 7 80 -111 91
3565I1m5r4J02j08J08l0Pl3k6J17j15l8J50j45J53j88P5M5l7J2n8J04m6JJ07k04
$$ 91 46 -48 54 -54 54 24 31 -2 -28 89 -26 -64 86 -59 94 -94 -19 26 -11 1 -57 47 1 2 109 -95
3591i5J57j26K23j50o9k02K07l71J13N55J79O64j263J44n2Q9j62K53j74J23Jp9
$$ -95 62 -64 159 9 -60 -262 -55 -426 -313 242 421 1085 -178 -34 -86 3 -159 94 -80 43 44 -35
3613c5OP8J1rj65J05Q0j18O2Q5r2om3P2l8N0P5j83J21j4N4j21J0m4j4K5P3J1J3
$$ -35 -29 49 60 51 -114 -9 71 -47 15 100 8 2 -41 31 -7 43 118 -65 56 42 96 -25 -15 -59 -73 -48 25 36 49
3642D9L9q5J36j75O2nJ2l5m6L4M9j2q7J7R6j58J19R3j40m8P6K6O0o3P4j67KJ32
$$ 49 88 3 139 -36 26 21 33 -2 -48 -14 35 23 -64 -47 49 -109 10 103 -37 -85 -9 17 77 14 88 -79 -77 55
3670E5n3m1J29j45nJ07j41P1L3o9J17jj02J11j44J84j40L1N9N9j25J7R7j03q6
$$ 55 2 -39 90 -55 -60 47 -94 -23 10 -59 58 57 -45 66 -78 106 -34 -3 56 115 -10 7 104 1 -85
3695h5J35j5N4p0j64P3mP7q3R6J9J1m3Q0j29J19l2p4O6L1o0Qm1K3M3j11ql8L9
$$ -85 50 35 89 19 -145 -72 -76 1 -82 14 33 44 1 81 -48 71 39 -35 31 62 2 10 -31 -8 35 -76 -84 -122 -83
3724h3lQ6m9Q6pQ4q7m1P2L6j15Q4p0j14R0m4O8j16J45N0j81K30q7Oj53J46m9K9
$$ -83 -86 0 -49 37 30 114 27 -14 58 94 -21 63 -7 -121 -31 -75 -7 -123 22 72 -109 121 34 40 -113 33 -16 13
3752A3j35K64j61P9q1n8J39k5q0j7Q9p6J77j52M8K9r3P7o4M0P3J4j30M1N0r2J06
$$ 13 -122 142 -19 60 -21 -79 60 35 -45 -62 27 -49 128 -24 24 53 -40 37 -27 13 86 100 -30 11 61 -31 75
3779G5q7j3J25j60O2Q0j13K08k60K26N5p3j35J93N17j007n0J13k32P87o36M68
$$ 75 -12 -25 100 -60 2 82 -31 177 -83 143 198 125 -10 183 700 -307 -357 -244 -476 311 -325 143
3801A43k88O4K78k34M0J2Q2j81Q5j3r0k7K49p7j35J36L7p7M3pj42Q6J08k2l2p6
$$ 143 -145 -81 197 -37 3 15 97 -84 1 -12 -102 -129 120 43 -92 44 81 4 47 40 -102 -16 92 70 38 -38
3827c8J14m9p7N3j13R2N4N9j50J07r0J9J00q6N0m1L1P9j27Pk2l6J07j9N9j4Ro5
$$ -38 76 27 -50 3 -110 -18 36 95 -55 52 -38 -19 81 -5 45 4 35 114 -13 -6 -28 -64 43 24 83 69 78 13
3855A3l9j36J00qR7r4Q6O4j70R1K2O7j08P1j31O9o5R3j10L3O4j17R0q1J65j18
$$ 13 -26 -162 -62 -70 27 -67 19 83 -87 4 26 93 -15 56 -75 -6 -71 22 -88 -55 9 -108 -18 -99 66 -52
3881e2J41j58M2M9R8j46j0%J65j03M1j0j50J57o8j4N7n8l2K3P0k3l6J00j29L5
$$ -52 89 -69 -27 22 120 -26 -36 -36 129 26 67 57 -93 64 -4 -18 39 -19 -51 -28 42 19 -17 83 -46 -11
3907a1J43k64J48O9j37k1J23n8m0O6j11J18j4M4p6j23J62Qr3J00o8m8J24R1p6
$$ -11 132 -132 16 85 -52 -73 50 -8 -48 18 -93 25 11 55 -21 -144 18 26 -67 33 -35 -83 41 132 56
3932E6o0o0L4L1l2M7L0n9k0Q1j1p1N9Qp2M1K3%Pq0QL7M9p3J08L6j21O9q3K4PJ8
$$ 56 -4 -64 -30 1 -31 16 46 -13 -33 48 37 -34 25 33 -39 2 25 25 32 -48 -40 -3 46 -27 81 117 -4 65 -18 6 13 31
3964C1j22K4rJ62K2o0m7J45j68Q3j02L7J25j58m3K35m1q1Lm8k2KJ44j6J9j38j
$$ 31 -91 -67 -76 86 108 48 1 146 -22 61 -41 -4 121 -37 -80 155 114 33 36 -12 -34 -32 112 96 115 -23 -24
3991b4J14j1m5j33J51o5lM3l6O5o4k7lM0k9K0M7r5N5k6LN7K0K0j73L4J10M6j22
$$ -24 90 79 34 -99 52 -13 -16 27 -9 56 -8 -35 -38 2 -27 -7 40 -55 0 -26 -23 34 54 74 -99 -65 45 91 -31
4020c1J32j28L1O8K2l1N0j69RL9m6J30j63j9m2J64o7Q3nQmj67K28o5Lp3J45oj33
$$ -31 101 -27 4 72 94 63 113 -56 -47 -8 -54 76 -87 -106 -148 16 -51 32 27 35 31 -136 92 27 30 -43 102 96 -37
4049c7Q3k7J03j71l1K21j83P7j46M7OJ10p6K2PL6j60J50qoK2lJ09r7k8j4M1k9
$$ -37 46 19 122 -49 -80 141 -42 35 -111 -64 -58 52 -24 -2 5 41 -119 31 23 17 39 36 145 48 20 6 47 18
4077A8K7r1N4n7j0m1J20j26J42M2jj21J30Ln4r0L5P1o4j0P8qj42O0K2J11j34K9
$$ 18 45 -46 8 -49 -59 -100 20 -106 36 78 77 -44 86 89 35 -55 -20 51 -13 -23 55 47 -95 -35 -13 98 -36 -7
4105gm2k0Q7m2L7N0N2j38Q3o3j8k7o5J45j22P7q4J65j35O5Rr1J13l8l2J0J26m1
$$ -7 -49 -69 18 -24 13 63 115 -23 60 -3 -21 -48 -113 32 -90 -13 -97 68 -67 -2 7 -84 29 -9 -41 -31 95 54
4133E4p3J14j46jP9j29J09o3K4l4O6R2J2j50J16l0k2l4l2ko4M0J41p2J25j03m8
$$ 54 -19 95 -51 -52 27 -102 7 -56 -32 -66 0 92 104 -46 70 40 18 -16 -48 -50 -114 -74 67 -5 120 17 -31
4160c1j4J79j24m0P5m0L7o9L2rp7R2L1J2m1J4p2J1O5p6RL2p5Q7m5l9J19n2L2L5
$$ -31 -45 134 10 -30 45 5 42 -27 5 -4 -81 11 42 54 13 27 -45 -34 31 -45 -36 -4 -79 8 -37 -76 43 -9 23 58
4190E8k4j0j3L0J1p2J12k13R8R0j65J29M3j23J14j02K7N4O0l3n4j5N1j0r9N8o2
$$ 58 34 24 11 41 52 -20 92 -121 -23 67 -98 31 74 -49 65 -37 -10 44 104 71 17 2 53 43 -56 2 -60
4217f0N3n6P8j0k2Q0p9lj3J15j13NM7L8Mn2r3J44j28no0P2L0pJ39j20jn5P4O1
$$ -60 -7 -63 15 5 -17 63 -16 -19 -32 83 -30 -25 22 60 64 12 -81 63 -65 -70 -130 -58 -28 -35 104 -16 -17 -72 2 63
4247F3r8m1M7L4n2N3R4n9q0Ok5M2m7J03ln7P1L4p2k8k7R1J8J9j43M6P0o9K5jP8
$$ 63 -35 -76 -29 5 -47 6 100 41 -39 -33 -58 -16 -63 40 37 -20 51 85 13 -15 -42 49 67 86 -57 -11 59 -10 15 14 92
4278I2j82K2J7mM9l0O1M6j19P0O8o2p9M5k4j89J63O6j6q0M9L6P0j35o8P7L9m6
$$ 92 -90 -68 -51 -55 -6 -36 25 71 -48 22 90 28 -51 -6 -30 -219 -56 10 -6 -86 -37 -1 69 -66 -134 -57 -18 -64
4306f4P9oR3j77J08MM3mk20J68p2Q1k3K3j22N4Q5qr0N6J5l5N4j24J03M0J00j49
$$ -64 15 9 102 -75 33 37 80 76 -144 24 -48 33 10 33 -89 -35 50 42 -48 8 23 -12 42 -82 21 61 161 12
4334A2k8J7J6J02k8l1r2N4ll8M0n2m8K4M7l6k1K6K9N3j46J15mK7m3N3j5J7kj48
$$ 12 -16 1 17 119 91 60 -32 22 19 -19 21 -31 -79 -55 -8 -44 -65 -39 -10 43 -103 12 8 35 -8 45 30 47 45 -103
4364a03J83q2l8N0n0k8J23J07k12J25r3n0M9O8p7nJ19j24M0l3R4r8R0m0j22O4
$$ -103 80 -2 -40 10 -40 -68 55 162 -50 75 -18 -68 -19 49 -28 -33 86 -38 2 -31 63 -35 55 15 -107 -43
4390d3J6R9l3l3K4m5L9J5k9l3M8M3o3l3k0N9Nl8J01j05j2P1q9J29p1J30j74q5
$$ -43 -27 72 39 6 30 -15 24 39 10 -23 25 68 5 -28 -48 11 16 -22 79 -26 -38 33 -56 73 2 132 -42 -127
4418a27J20j24J41q3P1R7j39O8L0j37K7J17p5P5r7K6K6r7J06m8K0K2j6M7q0p6
$$ -127 -7 -131 10 -73 -2 95 -44 24 54 -83 -56 61 -14 61 -36 -10 16 -81 25 -23 -3 19 3 50 -30 -106
4444a06J73m8j15J47j9n5K7l2N1p0l4J59j10p3L3P8l2P2r4K4K8K8k7N7j01J3N4
$$ -106 67 19 -96 51 32 -23 4 -28 23 -47 -81 78 -32 -105 -72 6 -26 46 -48 -24 4 32 5 62 -39 -26 28
4471B8p0J15j53M8O0o4k4J51m8p7Rq2N3J11k5q5j6J39j33Q6m1J03l5m8K4r6Q9
$$ 28 -42 73 -80 -32 28 -36 -60 91 43 -34 -25 -107 -54 57 32 -53 -69 70 -63 23 -18 85 50 2 26 -70 19
4498A9o3N2r8R0lJ3p4N6J00n8j37Q9M4k9j1J9K2k2%P0r9mn9N5k7k2J48j17l4P0
$$ 19 -44 8 -90 0 -3 10 -64 -8 92 34 -103 -14 30 1 -10 9 31 9 9 79 -20 -24 -83 -28 -55 -77 71 -46 -80 -10
4528a0J2k6J8n5J91r3L6J6j46N9K1J4j09N3J5O1j24l3J12mJ8M4l7n8K7n3J08n8
$$ -10 2 -24 -6 -61 130 37 73 89 -57 2 23 37 -72 -19 -4 57 -67 -100 12 8 26 70 33 -25 2 -51 57 -1
4556aj1m7R3n0O0k5O1r8k1K44k75O3R1n8J7O1o0j05J23k0jPj88J72P2j35K3o9
$$ -1 -12 -59 34 -16 44 19 80 -18 -39 205 -70 -7 84 26 43 104 44 -61 62 42 41 48 -140 32 104 -31 -8 -77
4584g7J31L5k03Q1L3R9q1R3j28K7k2p1Q7k6Q5k10J66O3l6k2L3l3k7O4q1m4k9R4
$$ -77 54 89 -114 -33 0 99 18 111 -17 10 -12 -83 4 -22 63 -147 19 82 46 24 57 24 -3 61 -20 -64 -93 1
4612ANQ8r4j9rN6o3J0j21J49l3j2K5N3j02N3LL3qq0K3L5K8n8Jl9R0k2K7R0j49
$$ 1 6 94 0 -19 -28 28 -35 -25 -146 3 -30 -42 -17 36 -66 -13 -10 23 15 -65 -42 -7 21 -37 -36 -75 15 -7 20 110 -39
4643c9P2p8q4P3J44p2o3MJ20j1n7JM3Qk2m9j00J70J3r5L3Q0k00p6K07q3rl2J34
$$ -39 33 -45 -129 -56 88 16 -47 -43 77 66 9 10 53 61 39 -10 -110 60 73 -22 11 91 -109 -185 22 -61 -70 -102 32
4672C2m4L8J3n7l0J07j59J58j6qO7k30J44r7R7l1Q2J30j60O5j85J53%j60J19J45
$$ 32 -12 26 39 -18 -48 59 -100 58 42 34 101 -129 15 -82 15 -16 66 196 36 101 -84 69 69 -91 28 173
4698A73j24J37j07q9J09j73qJ07K8R2j43m9M1k2J08o7n8O2R0k1j63j1K3J04j3
$$ 173 49 186 79 -10 99 -74 -82 25 53 145 2 -47 -6 -28 80 13 -45 17 107 86 -77 -88 -65 39 26
4723B6j4j01N4j9%N1o6O8n0Q7k1q5J31j14P6O1p4K04j93Q1l7k6j24P5R9l7j88
$$ 26 12 -89 -35 -54 -54 -3 -69 -1 -51 36 15 -70 61 -53 23 84 10 214 21 102 65 39 -85 -10 89 52 -136
4750a36P9l8P6K4m7O7m4J2M0p1J07l8j25R8mL8P0k63J15j8j0m2K69p8o9O3j22
$$ -136 -57 -95 -19 5 -42 25 -19 -7 33 -38 69 31 -94 4 0 38 108 -155 -40 -58 -68 -110 159 81 12 75 -47
4777d7J13J7o0j5O0l3j14LJ13Q1q7n1Q6j14K2l1n9J90j13P8m2P2j6q9o6J24q0
$$ -47 66 83 23 8 68 35 -79 -76 37 118 31 -20 66 -48 -26 -57 -116 74 -39 39 -3 69 53 -36 -102 22 -58
4804e8P0p7Q3n6PP3L3o7kL4p3L0m7R8J7j0j69J37j01L9L3K3k7R4ml5p8J3O8N7
$$ -58 12 -65 18 -38 -31 42 75 8 6 40 -33 -3 -50 48 65 55 -114 23 -78 -39 -6 17 -10 84 80 45 -33 -20 48 105
4834A05k1q4N5j27o0J71o0n6R4l3J39j72J34jl0r1pJ8P8Lj12Q2l1j8M1Q8o3p9
$$ 105 84 0 55 -72 -132 39 -21 -77 17 -16 123 -49 85 84 54 -37 -44 -26 52 55 -57 25 -6 -24 17 105 42 -37
4862c7Q4M5j30rM3qr4J36j13L3O1M0j17M8O0l9J33l9j06N3j03L3QJ01n7N1Kp6
$$ -37 47 92 -38 -47 -4 -12 -106 30 -83 -50 11 51 -66 -18 42 3 136 97 -9 44 -59 -26 -18 83 26 77 79 3
4890CP3l6l9J2O3o2j16J69r1k6J01J8m5jJ9j0J01n1l1N4j34K8n8J14o1J00r9j
$$ 3 76 40 1 13 76 14 -102 67 -24 -50 51 69 24 23 42 32 133 82 51 105 -29 -1 -59 55 -6 94 -5 -6
4918fJ6P7j05K2K6P7mj07r9J26n5M9j06Q8k3J3P6o8l4K5M5k7q6P0k0O0O4m3o4
$$ -6 10 87 -18 4 30 107 103 -4 -103 23 -32 17 -89 -1 -24 -11 65 -3 -37 -12 33 6 -80 -10 -30 30 94 51 -13
4947a3M1l8Q6K9J5l9j39Q1Rj10K7M6O7j51K8J13K8o6qn0K3J27j78O3P7j01rK1
$$ -13 28 -10 76 105 120 81 -58 23 32 -78 -51 -5 62 -89 -61 52 80 14 6 -44 -21 106 -72 -9 68 -33 -42 -21
4975b1j24J50O8p7J9J20j86N1N3j31J02j08lK8MJ9O6N6p0j19J68j60J44j15k2
$$ -21 -145 5 73 -4 15 135 -51 0 53 -78 24 -84 -87 -59 -55 -36 30 86 16 -103 65 -95 49 -66 -88
5000h8O4k9K4O7l5L8q6j11J72l0O8L1j02M3l3k3J04j08m2O3Q8Nq1Jk1KM5l2MO6
$$ -88 -24 -53 -29 38 3 41 -45 -156 16 -14 54 85 -17 26 -7 -30 74 -34 -76 -13 75 80 -1 0 -21 -19 26 -6 -2 64
5030F4L0j30J03o8q1J34Ko4RNJ17r4J4p3r6L9P4pN8m3J05J1mj72J5MmN7J00nr3
$$ 64 94 -36 67 -1 -82 52 54 -10 -1 4 121 27 41 -32 -128 -89 -15 -22 36 -7 98 109 105 -67 -52 -48 -52 5 105 100 7
5061GJ5NP0j41N1k8N1J7N1J1j42MN2QJ2j33J23k9mL7M3k10M4J66j34N1J4rO6j96
$$ 7 22 27 97 -44 7 -21 30 47 98 109 -33 -29 23 31 43 -90 33 4 0 37 80 -130 -86 80 -54 -3 11 2 68 -128
5091a28N8N7R3j06O1m6m2M9N0N1L8j07M4n8j10P7j7Om9M0R7J2n5q0KP7r5K22j47
$$ -128 -70 -13 80 -26 35 -11 -53 -4 46 97 135 28 72 14 -96 -19 -36 -30 -79 -39 58 70 15 -65 -63 14 -81 141 -6
5120fo5l0O7R5j07J05j2Pn5o8RL1J6O6q7j2m6J24P2o2j04Q3n1P1j8j11J49o7J57
$$ -6 -71 -101 -34 61 -46 59 47 54 -1 -69 -60 -29 -13 53 -34 -46 -92 32 104 42 -62 21 -30 41 23 -88 61 -6 151
5149A51j12L0n8q6Q5L8j96J04O7o7N4p7P9M9K0K8j23P8j16Q8j5l5L9J8o5N7q0
$$ 151 39 69 11 -75 10 48 -148 -44 23 -44 10 -67 12 61 81 109 -14 64 -52 36 21 -14 25 43 -22 35 -45
5176d5N5j07m7J00Q5R6jk6k18O9P4j0L5m1j22J87k7k3j02R4l9k2j04K49r7N6m3
$$ -45 10 -97 -144 -44 41 137 136 110 -108 -39 35 25 60 19 -103 84 57 34 -68 26 -13 -35 -139 110 13 69 26
5203B6l5L1n6J16m5j3k8J09j08P6j48L1m6M7L0K3J09k21J29p1P8j35P0J54j48
$$ 26 -9 22 -34 82 37 24 -4 105 -3 73 -75 -44 -90 -43 -13 10 119 -102 27 -44 34 -101 -31 123 -25
5228b5p2J05m7m9k6J15k2m1Nm2J20L8m2o5J9P7k4j14J02rq1l6K24l2j8N7o5ol7
$$ -25 -97 8 -39 -88 -114 1 -21 -62 -57 -99 21 59 17 -48 -29 48 24 -90 12 3 -78 -114 110 78 60 117 52 46 9
5257Ij17JJ34k4N6M8j81R4m5%J3l3p9J43J3qj52R7L7k4m4L2M4p1J17n8r0J75j25
$$ 9 -108 -107 27 3 59 107 -74 20 -25 -25 -12 -45 -124 19 32 24 -128 -31 6 -18 -62 -30 14 -57 60 2 -88 87 -38
5286c8o2J28l8P8j32MJ19k20J48P3r5M7m2J2p0Q2M5L4p9KM2n9L5k8M5P0l7rm1
$$ -38 -100 28 -10 68 -64 -60 59 -161 -13 60 -35 12 -30 -18 -88 -6 39 73 -6 -4 38 -21 14 -14 31 101 64 55 14
5315A4Nk8qP0O8j0j14nJ82r2k26J38N2j9p7J72j09K8lKK5oo2Q0r6P0m4j04J44
$$ 14 19 -9 -17 53 121 111 -3 -8 174 82 -144 -6 46 27 -50 122 13 41 38 40 65 59 -3 77 -19 51 7 -97 47
5344D7n3P5m2m4q4J45o3J54j43N3j2o3J1L1j73J31N9lo1k6M2l7j40Q8J10l4R3
$$ 47 -6 69 27 -17 -101 44 -19 135 -8 45 33 -30 -19 12 -161 -30 29 26 -35 -61 -19 -56 -196 -108 2 -32 61
5371F1m3J27k88J95j8j13P3p5O3J27j34nN1k6l7K9J05j27L9K1j4O9j53J22q4P2
$$ 61 18 145 -143 52 34 -79 -6 -81 -18 109 -25 -30 21 -5 -42 -13 92 -35 4 25 11 80 -73 49 -35 37
5397C7o3P4n2l2J07Jj08J02K5Q8j43L5j30j28K66j17R0L5K4k8k5j35J00p7N3P
$$ 37 -26 48 -4 -36 71 72 -36 66 91 179 36 71 -59 -187 79 -38 52 87 111 83 58 -77 23 -54 -1 6
5423Fj6L1j3j44J77j00j3M8o9p8K21j15p9K42j73P2m9L0K59k76L27m38N7j68L82
$$ 6 -10 21 8 -136 41 -59 -72 -24 -93 -171 50 -65 -144 98 -75 -3 -52 -22 237 -39 288 -150 -93 -261 121
5448A21q6j50p79P16N25m36O6r8L3J17j3pj5L3JqJ46j00j09K3K7ok3N2l9o3J14
$$ 121 35 -115 -894 -178 347 -89 -23 -121 -88 29 16 9 -6 27 28 20 166 66 -43 -20 7 1 -22 30 -9 -72 42
5475D2k09R9m0L7J00j9n0Q9q3N7J05j03j9N5K8j08j0Q2j33J16O4l2O0j20k4R4
$$ 42 -167 -68 -108 -71 29 10 -40 49 -34 23 128 25 6 61 89 -19 -29 53 -80 36 100 68 128 8 -16 78
5501G8l9L7m7o5J03l7j06K2N4N1K7l0Kp2k0o2J01M4j4l6m1J2J16n2k9k5J21m0
$$ 78 39 76 29 -36 67 30 -76 -54 0 51 78 48 50 -22 -42 -104 -3 41 27 -9 -50 -38 78 26 -3 -28 93 53
5529E3K8j62J36K0p1J5p2P9J8j2m1N3q2K2K4Qj37J31j2N0p6j1K2k8O7J5M9q4p5
$$ 53 81 -81 55 75 4 19 -53 26 44 32 -9 44 -38 -16 8 16 -121 10 -2 48 -28 -39 -17 -45 22 37 86 2 -73
5558g3LJ90k10J6Q5M5n8O0m7L6j09R7j71L7O1J03j13P3j2l5J0M6k6Jm1J28r6j21
$$ -73 -70 120 -90 -74 11 56 -2 58 11 47 -62 35 -136 -99 -38 65 -48 25 13 -22 -12 34 8 9 -32 96 0 -121
5586a21Q8k9Q9n6K5o5L9N6k5J4nl0K9p2j27K45p5N9J7m3k7J16p8On4J21j8j69
$$ -121 -33 -62 27 -29 -4 -69 -30 26 1 15 10 -20 9 -63 -190 55 -20 39 56 13 -14 102 24 30 -24 97 79 -90
5614i0L3M4nN3J5n2n1J35j51N0l6P6k1j0k2J4M0l7Mq1Q5j05J31O4j02J04q6O6
$$ -90 -57 -13 -18 35 50 -2 -53 82 -69 -19 -55 21 0 -10 -32 -18 22 -15 -11 -92 -7 -112 19 83 -19 85 -1 65
5642F5k2k8K1O1j26R5j40J17L1j77L9N9l7J6K8K2j2m4J42j28l3O2K6q9o2K47k22
$$ 65 43 15 36 97 -29 66 -74 43 74 -103 -64 -5 -42 -26 2 24 12 -32 110 -18 -51 11 37 -52 -114 133 -89
5669h9P1j0o1R7ln2L7o7R6j06J60r8P1o5j6L4l4O2j39Q2O0r3J75j76k4J45j35
$$ -89 -18 -28 -89 8 5 -47 -10 -77 19 -87 73 -25 46 -19 -35 -1 -35 27 -112 -30 30 -63 112 -64 -88 57 -78
5696g8J26j30j7K9O9l9k3K9l6J20Ko7J33j74j28J61K2n6J0N2r6K7j2QM7q0N1k3
$$ -78 48 -82 -99 -70 -1 -40 -63 -34 -70 50 52 -15 118 -56 -184 -23 -1 -57 -47 5 -91 -64 -76 -68 -21 -101 -50 -73
5724g3Q9o2O2r4J31j56J39K5j00n1J19o0o5J56n6J6k6k6O4r3J52j32Q0P5n5L6
$$ -73 16 -46 16 -78 53 -103 36 61 -39 -90 29 -31 -96 60 4 20 -6 -32 32 -61 91 -41 39 114 59 95
5750I5O0q0j5q3J42p9o9jR1Q8k14J44r9L8K3j35J13N9n1j35l9K20j18K6J49j21
$$ 95 155 75 60 -23 119 40 -29 -30 61 149 -65 79 -20 18 41 -94 19 78 27 -108 -147 73 -45 -19 130 9
5776IQQ4Mj14N4n0m2J6P0j09J60j05j8J9j42J48Nl0Q1n3L0J3Ol1J5R2q8J1n1n9
$$ 9 17 101 105 -9 45 -5 -47 -31 39 -70 90 -15 -33 -14 -156 -8 -3 -33 48 -5 25 38 44 13 28 120 32 43 -8 -67
5806f7L3M5o7L8n7O1rj4m8J2Q7j8n4N3J09j92J16j3M8q0n9P4l2PN4m3l3M6K1j0
$$ -67 -34 11 -56 -18 -75 -14 -23 -37 -85 -73 14 -4 -58 -5 104 -88 28 15 63 -17 -76 -2 -34 -27 27 -16 -49 -3 18 8
5836HN8k9l4n2O2j0L0Q3r6m1n5J23m1p6J01o7pL1l5lP5l1l8o9J40n2k3J13q6Q1
$$ 8 66 37 3 -49 13 3 33 116 20 -21 -76 47 6 -70 31 -36 -43 -12 -47 -50 25 -6 -44 -113 27 -25 -48 65 -21 60
5866F0n4nql9N7K4K1j15R0K1p9J55j55L6o0L7n4J37j27m2J09Ql7o8J43O0k18J27
$$ 60 6 1 -7 -46 11 35 56 -59 31 52 -27 128 -27 9 -51 -14 -68 69 -58 -100 9 17 -20 -88 55 115 -103 24
5894B4p8M8kN7j8j32Q1p3J09O1o3j37K20j17O4m0Rj0j8J05l0j46J69L4j46Q6m0
$$ 24 -54 -6 -8 49 31 -101 -20 -93 16 77 14 -123 97 -20 44 4 13 3 -15 90 60 -86 83 117 -29 57 17
5921A7MJ10j59l0J2N3L0kK9J3q9n2j5O6O5o0J7m7J23j80J18J19q4o7lM1n7N8j24
$$ 17 21 131 -28 -58 -46 7 37 35 64 77 -12 -64 -79 -13 52 -8 9 -38 85 -95 23 142 58 -9 -12 29 -28 30 -94
5950i4KR7L5pJ0m8n3K01j95P0QP1p5mn7q4J76m7j2k6O3o3J05j3r2R8L8j02m5j8
$$ -94 -92 5 40 33 43 -5 -58 143 -52 18 26 97 22 18 -39 -123 53 6 -6 -32 31 -32 73 60 -32 66 104 2 -43 -61
5980f1L8N7j08P2K0oP3k7l1j66J42P8m1o3m7m1J66j40J78p5L9o5J8k1M0L1p5L7
$$ -61 -23 34 -74 -2 18 12 85 58 27 -139 3 81 40 -23 -70 -111 55 -85 93 18 57 -8 10 -11 29 60 -15 22
6008B2l0Q0k9q2O2k2Q4j42P2Qk8j01J00k5L2O2Qj07J2l3M0qn7k1O6J7l1J11j02
$$ 22 -8 72 43 -39 23 1 85 -57 15 23 -5 -106 -6 -31 1 63 71 -36 -24 -57 -17 -25 -82 -103 -37 -20 -51 60 -42
6037d2L2O0k3l0l9q7J13Q7n1o0O6q3n8M6K9K4M7n2L7m0oN2j20L1J63j04j4J32
$$ -42 -10 50 27 -3 -42 -129 -16 71 20 -40 26 -57 -115 -69 -40 -16 31 -21 16 -24 -30 22 -98 -67 96 -8 -22 110
6065A10j9l6l1P6j37P0k0P0J6q2m0j7K2jM2r0Q4p0J5R0n3p3M5k7NJ5m8J59j14
$$ 110 91 55 24 100 -37 33 13 83 99 17 -23 -40 -18 -19 23 -67 17 -53 -38 52 -1 -74 -29 -56 -51 -36 -84 75 -39
6094c9LK3J14j04kR9J9n5j29j3J53q4R2r9P6n2lqO5J4j04K7j6j00J58k4m7l9P6
$$ -39 -36 -13 101 -3 -5 94 113 58 -71 -84 69 -15 77 -22 54 2 -1 -9 56 70 -34 -7 -23 -123 35 11 -36 -75 1
6123AL4j12N8Qj1L5n4J13m8o8l9L3Q0p6j2lN1M9j80J40O0j2j12P1JN4q6J10q9
$$ 1 35 -77 -19 -11 -22 13 -41 72 24 -44 -83 -50 30 -46 -58 -61 -10 39 -141 -1 59 47 -65 6 7 61 -25 85 -4
6152dR1j51j9R3n6R7k8R4j21r9P5k6R3%j6n0N1P2J09j80JL6j7Np4lj3O2j34J68
$$ -4 87 -64 -83 10 -46 51 23 117 -4 -103 -28 -54 39 39 23 -27 24 96 205 25 26 62 45 50 -24 -27 -40 22 -112 56
6182E6nL1rj05Qk4k3Lmk0J1J04q1J09j5K0%R1l0j64L3M4r8P7Rr2J05o3rM3n2L7
$$ 56 51 82 73 -32 -24 -48 -71 -68 -72 -92 -81 23 -58 51 36 56 56 147 117 -47 -14 30 -68 9 18 -74 31 -32 -41 2 -50 -13
6214a3N3j8Lj3j3M1M3j73J12j23J03M1j2o0Oo9Q0n3K3J09Rpj31P8q1J3k4M8N4
$$ -13 40 22 25 12 -1 40 83 -90 22 -101 2 43 31 -29 -23 -92 -12 -65 -42 67 76 69 -62 16 -65 -52 -76 -28 26
6243B6j5N9j57J22jn3pJ9l7P4P3j2j21N9J20k38PJ60j16K9OrM7j55L2P6J01j13
$$ 26 11 70 -87 35 34 -19 -26 -7 -44 30 103 91 -30 29 149 -89 -82 78 -38 -9 -3 -12 35 -120 -88 -12 89 -24
6271b4J1K3l6M0nJk3j4mLO0q9P9%j36K30j41M2M6okq1j1L5K2r6J67p3L3l9n6j0
$$ -24 -13 10 -26 14 9 10 -13 -27 -31 -28 32 -57 22 22 -114 116 -25 17 63 57 55 -26 -37 -2 20 -76 91 18 51 12 -44 -54
6303e4O7p6K9l1J26m2n4n3L9J34k2n3m2J26j01o9J76q3m1J3M6K2p6JlL5m4Q0J6
$$ -54 13 -63 -34 -65 61 19 -35 -88 -49 85 63 10 -32 94 -7 -76 100 17 -24 -11 35 57 -19 -18 -21 14 -30 50 66
6332F6P5Ol5j47O6r5J40j0N3j44m7R6j13M3L3O4n9j4L4N5rj11J05j44J12k4J18
$$ 66 141 147 112 -35 31 -64 76 66 119 -25 -72 24 -89 -46 -13 51 -8 -22 12 67 58 -53 52 -92 20 -4 114
6359A14j59J23j90J8O8j73K13jj0kL6n9k3p4K02q2jkpl0Q6J00j93J71o3Q4j17
$$ 114 -45 78 -112 -94 -26 -199 14 13 3 1 37 -22 -45 -119 83 1 0 -2 -9 -39 47 147 -46 125 62 146 29
6386B9o7k9J30r6M2j24J91k05J4K06r7O8j71J76j7ll9O5k8m4RN5l0k9n4lJ14m9
$$ 29 -38 -67 63 -33 9 -115 76 -129 -115 91 -6 62 -109 67 50 47 8 73 45 1 10 65 35 6 -48 -51 63 14
6414A4l0K02j51n5R2j6J3l6p2J00l3n0N9m1N5n6M2k05J93m1m9J34j04R6j6o4M3
$$ 14 -16 186 35 -20 72 56 69 33 -39 61 28 -22 37 -4 51 -5 37 -168 25 -16 -65 69 -35 61 45 -19 24
6441B4O5j21lJK6m0J08j55J55j36n8J55l9%O4k2p6P1o5J39q8p6j6R6o5L7J01o3
$$ 24 89 -32 -35 -34 -8 -48 60 -95 60 -76 -134 21 -18 -18 46 24 -52 19 -46 93 5 -71 -87 9 -56 -19 82 19
6469A9j72J68L0l4J30j74L4j31N2J81j72L9Q7j32P4MK4lN6m6nn1J47j25n9O6K1
$$ 19 -153 15 45 11 141 -33 1 -130 -78 103 -69 -30 57 -75 -1 3 27 24 80 34 29 -22 125 0 -59 7 28
6496B8l7l6K5on7L8M0l4O8k9j7L9Ko7l5J24m6J42j34PJ7q3Jkm6J19o1K8J3R0j62
$$ 28 -9 -45 -20 -26 -83 -45 -5 -39 29 0 -17 22 24 -43 -78 46 0 142 8 15 32 -51 -50 -52 -98 21 -40 -12 1 91 -71
6527g1R8l1M5o2jr8R0k2J27j04J33j02j1q9J37N4n5k7m8J29r9L4j14N6Q3k6p5
$$ -71 27 -4 41 -21 -22 -120 -30 -52 75 -29 104 2 -9 -98 39 93 38 11 -37 92 -7 27 -87 -31 52 26 -49
6554d9N0j2J13p8M0l7n0r9J47q8k6L2O8k4j0PJ48j88P4J9m7J0l4L1P2n0m0m3N8
$$ -49 1 -11 102 24 64 27 -23 -122 25 -63 -89 -57 11 -13 -23 -16 132 -56 18 37 -10 0 -34 -3 69 19 -21 -64 -6
6583fJ1m7O8o3J04k8Kj4p1NO9j24J7j2nN8j6L5J36j32K2L1r2J73j24LN6j09M8
$$ -6 5 -42 26 -37 67 39 41 27 -44 -39 30 -94 -77 -89 -94 -36 -52 -17 119 -13 9 40 -52 121 -3 0 56 -53 -5
6612eN8j23Qr8J90o2nr8J35l3q9J47q9R2k03J97o2J27k03J44PL4r6O7p3J9K7r0
$$ -5 53 -70 -62 -160 30 -32 -37 -135 0 -33 -122 25 -64 28 -175 22 -40 87 -116 28 35 69 -27 40 -33 -14 13 -77
6640g7R7n6J09p5P7k4j2r5J30%j20JK2J03j51J17j06J45r7l5K01k64J97n7Nr4
$$ -77 20 -36 73 -2 75 51 39 -56 74 74 -46 -45 -23 80 -71 46 -60 85 -12 -47 154 -110 87 30 35 -59
6666e9n6K69j34m0J5R2j30N0k2p0R3M1K6j15O8n1KRJJ0p8P5rj9Q9L6j51k9J41
$$ -59 -115 154 20 -20 -5 87 -43 7 -15 -85 8 49 75 -40 28 -23 -21 -12 -11 -1 -79 -4 -13 -32 57 93 -58 -87 54
6695E4On2PQ5o6J5Mj34P1M3o6N3J0M1n7J05j16J8L4m6J06r3l3Pn1m5Q1P4Kj49
$$ 54 60 8 15 100 34 49 53 -81 -10 33 -33 20 30 71 14 119 3 21 55 9 115 22 -11 -4 -55 -100 -19 55 57 -92
6725i2J09n5jm3J49n5l0J9L4l3n6R8k5JK7K4k8k7j8LJ6K1lnq7O0n5Q8j15J40j8
$$ -92 17 -38 -39 -82 67 12 -18 1 35 2 -54 44 19 20 47 71 43 16 -2 1 17 38 35 30 -57 3 -52 36 -79 61 43
6756D3M0j01nm2K4m3N2P6n1J5J1p0J41j90OJ61p8P7o8Pk3O4q8rR3j8p0J08L3r4
$$ 43 83 -18 -23 -65 -41 -84 -32 44 -7 8 19 -51 90 -100 -94 67 -11 66 -2 5 -18 46 -42 -51 42 24 -46 62 95 1
6786Ao8J02O3p6m7Q4j57R6J7qM8k7J9N5p1m7R8j16M2q8l2P7L0J7q7R0N6j29LL6
$$ 1 -67 35 98 22 -25 59 -98 -2 15 7 55 28 47 102 31 -16 82 -34 8 -80 -112 -35 -5 12 -75 15 71 -58 -55 -19
6816a9qL5K2%p9J64p8m0l4O2o8J15m8J1or3J80j3j26P4K6m5l4N9L1j13R9l9qj22
$$ -19 -27 8 30 30 -49 115 37 -3 -37 25 -43 72 24 35 29 -64 116 103 -23 51 77 32 -2 57 88 -25 74 35 27 -95
6846i5J23O9j72o3Q9P0j23l7K6K15r9LljK2J9o4KO9j01JQ3L1p3K8Lm1j0J35l9
$$ -95 28 97 -75 -138 -49 21 -102 -139 -113 102 3 6 3 2 24 43 -21 -19 50 -51 -50 33 64 -9 19 22 -19 -29 106 67
6876F7l8l3k4KJ09n5MnK1j29J22n9K1M4j01P7Ork9r9J11rn1J82j28R9j10m2Q6
$$ 67 29 -4 -28 -26 83 28 32 27 48 -81 41 -18 3 47 -54 23 29 20 -9 -108 3 -6 -57 125 -3 96 -14 -56 30
6905C0k03J16o1J4Q8N7j20Q1j6j26K35oq3p9O1n1M3K1%j1M4k0K9r1M2Q5o3j03
$$ 30 -173 -57 -118 -104 -16 41 -79 2 -14 -140 95 89 6 -73 -12 -63 -20 1 1 -10 34 14 43 -48 -6 79 16 -87
6933h7O7k2L6N5j48R6j7M7q1M3r6N4M3p7J39m8m5J33j40R4p3J5mK7k8M7%p2J23
$$ -87 -20 -42 -6 49 -99 -3 -20 27 -54 -11 -107 -53 -10 -87 52 4 -41 92 -48 46 -27 -12 -16 11 -17 30 30 -42 81
6962H1j56N1k7O3p6n9P7m5J4O9k5n5N8M3P6n2o9l0J48l7j57R6m1N2j6o3J02K7
$$ 81 -75 -24 -51 12 -64 -123 -46 -91 -77 -8 -33 -88 -30 13 89 37 -32 -62 86 49 -108 -12 -53 -1 -17 -80 22 49
6990D9p2K5J14j24k2j47K96j43P9ql0j57K43r7rO2o7NM1q2K5R2j19R4l2k6K2r
$$ 49 -23 2 116 -8 -30 -177 119 -24 55 47 17 -140 103 6 -3 59 -8 -3 38 -44 -19 73 -46 48 16 -10 12 3
$$ [...]
8191b1
##END NTUPLES=NMR FID
##END=
