##TITLE=1H_DE-80H_X3
 200.13MHz, d2o
 8 sc
 
 19ns.26.2.2025
##JCAMPDX= 6.0         $$ Bruker NMR JCAMP-DX V2.0
##DATA TYPE= NMR FID
##DATA CLASS= NTUPLES
##ORIGIN= UXNMR, Bruker Analytische Messtechnik GmbH
##OWNER= pz
$$ XWIN-NMR		Version 3.5
$$ Fri Jul 24 12:52:05 2026 Russian Standard Time (UT+4h)  Yarkov@DPX200
##.OBSERVE FREQUENCY= 200.1313
##.OBSERVE NUCLEUS= ^1H
##.DELAY= (6, 6)
##.ACQUISITION MODE= SIMULTANEOUS
##.ACQUISITION SCHEME= undefined
##.AVERAGES= 8
##.DIGITISER RES= 18
##SPECTROMETER/DATA SYSTEM= spect
##.PULSE SEQUENCE= zg30
##.SOLVENT NAME= CDCl3
##.SHIFT REFERENCE= (INTERNAL, CDCl3, 0, 14.3821)
##AUDIT TRAIL= $$ (NUMBER, WHEN, WHO, WHERE, WHAT)
$$ ##TITLE= Audit trail, XWIN-NMR		Version 3.5
$$ ##JCAMPDX= 5.01
$$ ##ORIGIN= Bruker BioSpin GmbH
$$ ##OWNER= Yarkov
$$ C:/Bruker/XWIN-NMR/data/yarkov2/nmr/H-C/1/audita.txt
$$ ##AUDIT TRAIL=  $$ (NUMBER, WHEN, WHO, WHERE, WHAT)
(   1,<2026-07-24 12:51:08.09 +0400>,<Yarkov>,<DPX200>,
      <created by zg, POWCHK disabled, PULCHK disabled
       configuration hash MD5:
       00 E9 B6 7A A2 85 ED C7 34 08 36 98 17 FE 4E 26
       data hash MD5: 16K
       B8 1C FE 35 1F C3 C8 8A 2D 0F C2 E5 DE CE E5 F1>)
$$ ##END=
$$ 
$$ hash MD5
$$ 82 0B 9C 3E D5 22 00 0E CB 12 86 77 66 6C A5 42
##$RELAX= 
##$RELAX= 
##$RELAX= 
##$RELAX= 
##$RELAX= 
##$RELAX= 
$$ Bruker specific parameters
$$ --------------------------
##$DU= <C:/Bruker/XWIN-NMR>
##$EXPNO= 1
##$NAME= <H-C>
##$PROCNO= 1
##$TYPE= <nmr>
##$USER= <yarkov2>
##$AMP= (0..31)
100 100 100 100 100 100 100 100 100 100 100 100 100 100 100 100 100 100 
100 100 100 100 100 100 100 100 100 100 100 100 100 100 
##$AQSEQ= 0
##$AQ_mod= 1
##$AUNM= <au_zg>
##$AUTOPOS= <>
##$BF1= 200.13
##$BF2= 200.13
##$BF3= 200.13
##$BF4= 200.13
##$BF5= 200.13
##$BF6= 200.13
##$BF7= 200.13
##$BF8= 200.13
##$BYTORDA= 1
##$CFDGTYP= 0
##$CFRGTYP= 5
##$CHEMSTR= <none>
##$CNST= (0..31)
1 1 145 1 1 1 1 1 1 1 1 1 1 1 1 1 1 1 1 1 1 1 1 1 1 1 1 1 1 1 1 1 
##$CPDPRG= <>
##$CPDPRG1= <>
##$CPDPRG2= <>
##$CPDPRG3= <>
##$CPDPRG4= <mlev>
##$CPDPRG5= <mlev>
##$CPDPRG6= <mlev>
##$CPDPRG7= <mlev>
##$CPDPRG8= <mlev>
##$CPDPRGB= <>
##$CPDPRGT= <>
##$D= (0..31)
0 0.7 0 0 0 0 0 0 0 0 0 0.03 0 0 0 0 0 0 0 0 0 0 0 0 0 0 0 0 0 0 0 0 
##$DATE= 1784883067
##$DBL= (0..7)
120 120 120 120 120 120 120 120 
##$DBP= (0..7)
150 150 150 150 150 150 150 150 
##$DBP07= 0
##$DBPNAM0= <>
##$DBPNAM1= <>
##$DBPNAM2= <>
##$DBPNAM3= <>
##$DBPNAM4= <>
##$DBPNAM5= <>
##$DBPNAM6= <>
##$DBPNAM7= <>
##$DBPOAL= (0..7)
0.5 0.5 0.5 0.5 0.5 0.5 0.5 0.5 
##$DBPOFFS= (0..7)
0 0 0 0 0 0 0 0 
##$DE= 6
##$DECBNUC= <off>
##$DECIM= 32
##$DECNUC= <off>
##$DECSTAT= 4
##$DIGMOD= 1
##$DIGTYP= 9
##$DL= (0..7)
0 120 120 120 120 120 120 120 
##$DP= (0..7)
150 150 150 150 150 150 150 150 
##$DP07= 0
##$DPNAME0= <>
##$DPNAME1= <>
##$DPNAME2= <>
##$DPNAME3= <>
##$DPNAME4= <>
##$DPNAME5= <>
##$DPNAME6= <>
##$DPNAME7= <>
##$DPOAL= (0..7)
0.5 0.5 0.5 0.5 0.5 0.5 0.5 0.5 
##$DPOFFS= (0..7)
0 0 0 0 0 0 0 0 
##$DQDMODE= 0
##$DR= 18
##$DS= 0
$$ [...]
##$SUBNAM2= <"">
##$SUBNAM3= <"">
##$SUBNAM4= <"">
##$SUBNAM5= <"">
##$SUBNAM6= <"">
##$SUBNAM7= <"">
##$SUBNAM8= <"">
##$SUBNAM9= <"">
##$SW= 18.0517328524113
##$SWIBOX= (0..15)
0 0 2 0 0 0 0 0 0 0 0 0 0 0 0 0 
##$SW_h= 3612.71676300578
##$TD= 16384
##$TD0= 1
##$TE= 0
##$TE2= 300
##$TE3= 300
##$TEG= 300
##$TL= (0..7)
0 120 120 120 120 120 120 120 
##$TP= (0..7)
150 150 150 150 150 150 150 150 
##$TP07= 0
##$TPNAME0= <>
##$TPNAME1= <>
##$TPNAME2= <>
##$TPNAME3= <>
##$TPNAME4= <>
##$TPNAME5= <>
##$TPNAME6= <>
##$TPNAME7= <>
##$TPOAL= (0..7)
0.5 0.5 0.5 0.5 0.5 0.5 0.5 0.5 
##$TPOFFS= (0..7)
0 0 0 0 0 0 0 0 
##$TUNHIN= 0
##$TUNHOUT= 0
##$TUNXOUT= 0
##$USERA1= <user>
##$USERA2= <user>
##$USERA3= <user>
##$USERA4= <user>
##$USERA5= <user>
##$V9= 5
##$VALIST= <valist>
##$VCLIST= <CCCCCCCCCCCCCCC>
##$VD= 0
##$VDLIST= <DDDDDDDDDDDDDDD>
##$VPLIST= <PPPPPPPPPPPPPPP>
##$VTLIST= <TTTTTTTTTTTTTTT>
##$WBST= 1024
##$WBSW= 4
##$XGAIN= (0..3)
0 0 0 0 
##$XL= 0
##$YL= 0
##$YMAX_a= 147112
##$YMIN_a= -184478
##$ZGOPTNS= <>
##$ZL1= 120
##$ZL2= 120
##$ZL3= 120
##$ZL4= 120
##$ABSF1= 10
##$ABSF2= 0
##$ABSG= 5
##$ABSL= 3
##$ALPHA= 0
##$AQORDER= 0
##$ASSFAC= 0
##$ASSFACI= 0
##$ASSFACX= 0
##$ASSWID= 0
##$AUNMP= <proc_1d>
##$AZFE= 0.1
##$AZFW= 0.1
##$BCFW= 1
##$BC_mod= 2
##$BYTORDP= 1
##$COROFFS= 0
##$CY= 83.5205535888672
##$DATMOD= 1
##$DC= 2
##$DFILT= <>
##$DTYPP= 0
##$F1P= 10.8118882576601
##$F2P= -7.23987719738617
##$FCOR= 0.5
##$FTSIZE= 0
##$FT_mod= 4
##$GAMMA= 1
##$GB= 0.15
##$INTBC= 1
##$INTSCL= 1
##$ISEN= 128
##$LB= 0.25
##$LEV0= 0
##$LPBIN= 0
##$MAXI= 10000
##$MC2= 0
##$MEAN= 0
##$ME_mod= 0
##$MI= 1.114404
##$NCOEF= 0
##$NC_proc= 0
##$NLEV= 6
##$NOISF1= 3.799351
##$NOISF2= 2.8
##$NSP= 1
##$NTH_PI= 0
##$NZP= 0
##$OFFSET= 14.38212
##$PC= 1
##$PHC0= -7249.983
##$PHC1= 2.82197
##$PH_mod= 1
##$PKNL= yes
##$PPARMOD= 0
##$PSCAL= 0
##$PSIGN= 0
##$REVERSE= no
##$SF= 200.129724274929
##$SI= 16384
##$SIGF1= 3
##$SIGF2= 2
##$SINO= 400
##$SIOLD= 16384
##$SREGLST= <1H.CDCl3>
##$SSB= 0
##$STSI= 0
##$STSR= 0
##$SW_p= 3205.1282051282
##$SYMM= 0
##$S_DEV= 0
##$TDeff= 0
##$TDoff= 0
##$TI= <>
##$TILT= no
##$TM1= 0
##$TM2= 0
##$TOPLEV= 0
##$USERP1= <user>
##$USERP2= <user>
##$USERP3= <user>
##$USERP4= <user>
##$USERP5= <user>
##$WDW= 1
##$XDIM= 8192
##$YMAX_p= 0
##$YMIN_p= 0
$$ End of Bruker specific parameters
$$ ---------------------------------
##NTUPLES= NMR FID
##VAR_NAME=  TIME,          FID/REAL,        FID/IMAG
##SYMBOL=    X,             R,               I
##VAR_TYPE=  INDEPENDENT,   DEPENDENT,       DEPENDENT
##VAR_FORM=  AFFN,          ASDF,            ASDF
##VAR_DIM=   8192,          8192,            8192
##UNITS=     SECONDS,       ARBITRARY UNITS, ARBITRARY UNITS
##FACTOR=    0.0002768,     1,               1
##FIRST=     0,             0,               0
##LAST=      2.2672688,     0,               0
##MIN=       0,             -184478,         0
##MAX=       2.2672688,     147112,          0
$$ Real data points
##PAGE= N=1
##DATA TABLE= (X++(R..R)), XYDATA
$$ plain form
0 0 0 0 0 0 0 0 0 0 0 0 0 0 0 8 -8 8 -8 8 -15 16 -16 24 -24 32 -33 40 -48 56 -64 72 -88 96 -112 127 -144
35 -144 160 -181 204 -228 254 -284 316 -349 388 -429 474 -522 577 -635 701 -771 847 -935 1032
54 1032 -1140 1260 -1398 1554 -1735 1947 -2200 2504 -2884 3373 -4021 4932 -6316 8677 -13736
69 -13736 47674 -131365 -155027 136528 72799 -99373 -15012 77256 -52848 -29399 113089
80 113089 15036 -145220 -2890 115329 -32950 -88673 65254 50238 -77556 -2368 93742
91 93742 -35381 -92349 53484 67928 -66468 -22785 82134 -6777 -73773 42254 56830
102 56830 -71825 -41218 79112 8026 -79472 29326 77447 -57003 -67441 68155 43581
113 43581 -73504 -16946 70141 -5810 -48844 40756 33270 -66414 -18351 78394 2179 -77914
$$ packed form
0@%%%%%%%%%%%%%Qj6J6j6J6k3L1l2M0m8N6o5P3q8J04j20J36j60J84k08K39k71
35a44L04l41L85m32M82n38O00o65P37q17R03r96J099j212J336j472J618j782J967
54A032k172K400k658K952l289L682m147M704n388O257p394Q953j1248J4993k2413
69a3736O1410j79039k3662K91555o3729j72172Q4361R2268j30104K3449J42488
80A13089r8053j60256J42330J18219j48279n5723J53927j5016j27794P5188R6110
91I3742j29123n6968J45833J4444j34396M3683J04919q8911o6996J16027J4576
102E6830j28655L0607J20330p1086q7498J08798M8121j34450j0438J35596k4574
113D3581j17085N6558Q7087p5951m3034Q9600p486r9684M8063R6745p6215q0093
$$ plain form
125 -77914 14970 68391 -32360 -56463 42798 36031 -54335 -20624 55909 7886 -44923 5950
137 5950 28426 -17812 -5430 35662 -9628 -45527 23186 50563 -30504 -47418 30437 32109
149 32109 -29944 -12290 26872 -14209 -30883 31558 29040 -43793 -21236 50028 11259 -45100
161 -45100 7193 38148 -25338 -25777 46526 17810 -56863 -5486 58255 -10710 -54739 20994
173 20994 37312 -35458 -20103 43706 238 -47077 18165 41070 -36004 -28561 50878 15223
185 15223 -53287 7115 56668 -20704 -48994 29598 29638 -38958 -7588 41653 -16580 -39550 36949
198 36949 29591 -55895 -23564 57852 9621 -50105 13065 42727 -28516 -24647 43746 5670
210 5670 -53225 11557 55411 -22022 -43881 33640 25819 -44756 -9831 42948 -14524 -41376
$$ packed form
125g7914R2884N3421j00751k4103R9261o767r0366L3711P6533m8023n2809N0873
137E950K2476m6238J2382M1092m5290l5899O8713K7377q1067j6914P7855J672
149C2109o2053J7654L9162m1081j6674O2441k518p2833K2557P1264l8769n6359
161d5100N2293L0955o3486m39P2303k8716p4673N1377O3741o8965m4029P5733
173B0994J6318p2770J5355O3809m3468m7315O5242K2905p7074P443P9439l5655
185A5223o8510O0402M9553p7372k8290P8592M0o8596L1370M9241n8233k2970P6499
198C6949p358q5486L2331Q1416m8231n9726O3170K9662p1243L869O8393l8076
210E670n8895O4782M3854p7433k1859P7521p821p0575L4925N2779n7472k6852
$$ plain form
222 -41376 32625 33921 -42868 -19559 48215 2733 -47385 14869 41801 -26386 -25172 39399
234 39399 10280 -42753 6944 38428 -26471 -33521 38315 21612 -46259 -8357 45250 -9010
246 -9010 -40490 22971 28720 -33314 -11901 43297 -794 -42950 16236 38953 -27935 -27870 36910
259 36910 13758 -40756 970 37733 -17567 -34416 26568 22919 -34943 -9660 38159 -4601
271 -4601 -35167 18681 29009 -27719 -16690 36231 6853 -35734 7381 32401 -20769 -25964
283 -25964 28982 13110 -35455 -1161 34637 -12758 -31771 22603 22372 -31344 -10146 37412
295 37412 -742 -34485 15736 30515 -25332 -20703 32878 9458 -35880 3243 34400 -16667
307 -16667 -30254 24650 17937 -33127 -7308 34524 -4908 -31850 17092 26611 -25296 -16242 32227
$$ packed form
222d1376P4001J296p6789K3309O7774m5482n0118O2254K6932o8187J214O4571
234C9399k9119n3033M9697L1484o4899p050P1836j6703o7871L7902N3607n4260
246i010l1480O3461N749o2034K1413N5198m4091m2156N9186K2717o6888O5O4780
259C6910k3152n4514M1726L6763n5300j6849O0984l649n7862K5283M7819m2760
271d601l0566N3848J0328n6728J1029N2921k9378m2587M3115K5020n3170n195
283b5964N4946j5872m8565L4294L5798m7395j9013N4374k31n3716K1198M7558
295C7412l8154l3743N0221J4779n5847M629N3581k3420m5338L9123L1157n1067
307a6667j3587N4904o713n1064K5819M1832l9432k6942M8942R519n1907R054M8469
$$ plain form
320 32227 5911 -31503 7964 29641 -17999 -22998 25284 11921 -31593 -2211 30717 -10760
332 -10760 -27758 20259 18693 -28723 -9033 32011 -1708 -29957 14631 27682 -22106 -17660
344 -17660 29629 6935 -32073 5112 29976 -16630 -24701 24309 14422 -31875 -5886 31651
356 31651 -6915 -29808 17877 23297 -24873 -12418 30253 2503 -29524 9771 27823 -18069
368 -18069 -19570 25987 9964 -30302 -413 27869 -11781 -24854 19024 16235 -25983 -7445
380 -7445 27980 -3679 -27191 14365 23352 -20574 -13611 27250 5736 -27260 5128 25221 -14945
393 -14945 -20068 22480 10941 -28450 -2695 27779 -8522 -26103 15464 19225 -21819 -9889
405 -9889 26284 768 -25377 11230 23581 -18720 -16141 25503 9066 -27167 373 25444
$$ packed form
320C2227k6316l7414L9467K1677m7640m999M8282j3363m3514K9382L2928m1477
332a0760j6998M8017j566m7416J9690M1044l3719k8249M4588J3051m9788M446
344a7660M7289k2694l9008L7185K4864m6606q071M9010r887m6297K5989L7537
356C1651l8566k2893M7685N420m8170J2455M2671k7750l2027L9295J8052m5892
368a8069j501M5557j6023m0266K9889K8282l9650j3073M3878k789m2218J8538
380g445L5425l1659k3512M1556Q987m3926O963M0861k1514l2996L2388K0093m0166
393a4945n123M2548j1539l9391K5755L0474l6301j7581M1567L761m1044J1930
405i889L6173k5516k6145L6607J2351m2301K579M1644j6437l6233K7540K5071
$$ plain form
417 25444 -10859 -22577 17375 13552 -24465 -5577 25840 -4295 -24742 12613 20163 -19063
429 -19063 -11894 25340 4896 -24763 5930 23247 -13880 -17480 19982 8887 -24634 -476
441 -476 24660 -9989 -24550 15932 17743 -22272 -9900 24118 683 -22080 10075 19863 -17144
454 -17144 -12690 24711 6588 -26074 2346 24135 -10829 -19352 16796 10316 -22833 -2850 22926
467 22926 -7939 -22780 15765 18106 -21609 -10181 25510 2474 -24185 7209 22434 -12524
479 -12524 -14614 18830 6018 -22458 2621 21770 -12208 -19853 17478 13232 -22135 -7461 21037
492 21037 -2314 -18513 12785 15491 -19164 -8036 24744 2129 -24770 5508 23435 -10563
504 -10563 -17265 15598 8581 -20276 -1687 19111 -8214 -17478 14397 11736 -20207 -5914 22847
$$ packed form
417B5444l6303j1718L9952l823l8017J8888L1417l0135k0447L7355P550l9226
429a9063P169L7234k0444k9659L0693J7317l7127l600L7462j1095l3521K4158
441d76K5136l4649j4561M0482J811m0015J2372L4018k3435k2763L2155R788l7007
454a7144M454L7401j8123l2662K8420K1789l4964q523L6148o480l3149J9983K5776
467B2926l0865j4841L8545K341l9715J1428L5691k3036k6659L1394J5225l4958
479a2524k090L3444j2812k8476K5079J9149l3978p645L7331m246l5367J4674K8498
492B1037k3351j6199L1298K706l4655J1128L2780k2615k6899L0278J7927l3998
504a0563o702L2863p017k8857J8589K0798k7325r264L1875k661l1943J4293K8761
$$ plain form
517 22847 -137 -20993 8127 18296 -12601 -10126 17639 2202 -18862 7113 19662 -14587
529 -14587 -19116 17143 13007 -19979 -6884 17990 -2102 -14793 9870 9562 -16869 -4301 22293
542 22293 1213 -20585 5618 18272 -10499 -11728 15289 4876 -18126 1939 17871 -9197
554 -9197 -17923 11884 11485 -16050 -4824 18134 -2277 -17950 8270 16081 -11194 -9939 15157
567 15157 5188 -14409 3367 13428 -11842 -11918 17079 8406 -20427 -5462 18230 -1323 -16241
580 -16241 6386 10678 -12299 -4151 17329 -1431 -18630 7396 18617 -9256 -13090 13303 7506
593 7506 -14792 -835 13867 -7085 -12148 12504 7517 -17555 -4436 17417 -2008 -17459 7589
606 7589 15813 -10916 -9761 14173 4049 -13984 4219 14585 -9317 -11650 14289 7800 -17905
$$ packed form
517B2847k2984k0856K9120J0169l0897K475K7765j5437k1064K5975J2549l4249
529a4587m529L6259m136l2986J3095K4874k0092j2691K4663l08k6431J2568K6594
542B2293k1080k1798K6203J2654k8771j229K7017j0413k3002K0065J5932k7068
554i197q726K9807l99k7535J1226K2958k0411j5673K6220P811k7275J255K5096
567A5157r969j9597J7776J0061k5270p6K8997q673k8833J4965K3692j9553j4918
580a6241K2627M292k2977Q148K1480j8760j7199K6026J1221k7873l834K6393n797
593G506k2298J3957J4702k0952n063K4652m987k5072J3119K1853j9425j5451K5048
606G589Q224k6729J155K3934j0124j8033J8203J0366k3902k333K5939o489k5705
$$ plain form
619 -17905 -4625 16332 -1942 -13870 6949 7707 -13565 -3373 16795 -1346 -17292 7180
631 7180 17313 -9570 -12052 12740 6017 -13370 1754 13898 -7365 -12575 10973 7805 -15008
644 -15008 -3825 14806 -2897 -14557 7700 11292 -11442 -7035 13850 2932 -12311 4233
656 4233 11620 -9486 -8214 14762 5399 -16114 -1634 14764 -3408 -13164 5865 7107 -10796
669 -10796 -2429 13400 -2773 -14513 6636 12900 -8927 -8184 12048 4687 -11392 1795 11679
682 11679 -6823 -9974 10558 6169 -13225 -2410 12488 -3458 -12761 6573 9822 -10142 -6360
695 -6360 12039 1904 -11103 3984 10200 -7640 -6485 12427 4281 -13954 -816 13538 -3249
708 -3249 -11486 6203 6398 -10106 -2462 10952 -2952 -11937 6721 10725 -9388 -7307 11802 3726
$$ packed form
619a7905J3280K0957j8274j1928K0819P58k1272J0192K0168j8141j5946K4472
631G180J0133k6883k482K4792o723j9387J5124J2144k1263n210K3548l168k2813
644a5008J1183J8631j7703j1660K2257L592k2734M407K0885j0918j5243J6544
656D233P387k1106J272K2976r363k1513J4480J6398j8172r756J9029J242j7903
669a0796Q367J5829j6173j1740K1149O264k1827P43K0232p361j6079J3187R884
682A1679j8502l151K0532m389j9394J0815J4898j5946r303J9334L249j9964L782
695f360J8399j0135j3007J5087O216j7840J155J8912q146j8235J3138J4354j6787
708c249q237J7689J95j6504P644J3414j3904q985J8658M004k0113K081J9109q076
$$ plain form
722 3726 -10941 2144 11001 -5676 -7938 9086 4603 -11561 -1240 11416 -3801 -11365 6731
735 6731 7749 -10416 -4848 10885 807 -10208 4265 9498 -7146 -5767 11007 3033 -11520
748 -11520 1429 11471 -4658 -9397 7072 5302 -9870 -2500 9802 -2839 -10243 5983 7905
761 7905 -8752 -4851 10513 1976 -9846 2583 9657 -4866 -6323 8406 3620 -9695 140
774 140 9370 -4123 -9065 5843 6029 -9018 -4000 8960 -68 -8900 3672 7692 -6069 -4471
788 -4471 9019 2533 -8898 1453 9486 -3951 -7544 6655 4774 -8823 -2136 8481 -2426
801 -2426 -8847 4366 6558 -7331 -4409 8872 1539 -8961 2434 8678 -4697 -5668 7862 3697
815 3697 -8410 -342 8696 -2913 -8224 5046 5353 -8151 -3254 8025 -750 -8612 3310 7123
$$ packed form
722C726j4667J3085Q857j6677k262J7024m483j6164J0321J2656j5217p564J8096
735F731J018j8165N568J5733j0078j1015J4473N233j6644J379J6774p974j4553
748a1520J2949J0042j6129m739J6469j770j5172P370J2302j2641p404J6226J922
761G905j6657L901J5364q537j1822J2429P074j4523j457J4729m786j3315R835
774A40R230j3493m942J4908J86j5047N018J2960r028q832J2572M020j3761J598
788d471J3490o486j1431J0351Q033j3437l593J4199j881j3597O687J0617j0907
801b426o421J3213K192j3889K922J3281p333j0500J1395O244j3375r71J3530m165
815C697j2107Q068R038j1609n311J3270L07j3504M897J1279q775p862J1922L813
$$ plain form
829 7123 -5912 -4825 8205 2671 -8214 1461 8565 -3705 -6265 6691 4181 -8000 -1599 8262
843 8262 -2025 -8271 3906 5713 -7094 -3635 7824 392 -7854 2798 7468 -4630 -4974 7365
857 7365 3383 -7537 415 8057 -2835 -6527 5137 4020 -7235 -2407 7161 -1248 -7721 3302
871 3302 6040 -5937 -4050 7329 1577 -6958 1626 7248 -3215 -4957 5992 3735 -7002 -848
885 -848 7167 -1997 -6929 3764 4564 -6106 -3371 6171 144 -6960 2230 6101 -4300 -4108 6315
900 6315 2716 -6293 508 6859 -2051 -5583 4411 3942 -6139 -2062 6230 -1197 -6659 2775 4791
915 4791 -5207 -3701 6162 1470 -6363 1387 6591 -3000 -4384 5671 3161 -5931 -359 6732 -1550
930 -1550 -6309 3390 4413 -5641 -2939 5800 71 -6337 1839 5173 -3994 -3699 5667 2288 -5661
$$ packed form
829G123j3035J087J3030n534j0885R675P104j2270k560J2956k510j2181O401R861
843H262j0287o246J2177J807j2807L459J1459p432q246J0652M670j2098l44J2339
857G365l982j0920P952P642j0892l692J1664j117j1255M828R568q409o473J1023
871C302K738j1977J887J1379n752q535Q584N622j0463j742J0949k257j0737O154
885h48Q015r164m932J0693Q00j0670K735R542o027p104R190L871j0401J92J0423
900F315l599r009O801O351q910l532R994m69j0081M077Q292p427n462R434K016
915D791r998J506R863m692p833P750N204r591j384J0055k510r092N572P091q282
930a550m759R699J023j0054K702Q739n729o408Q176L334r167K95R366l379p949
$$ plain form
945 -5661 682 6359 -2254 -4702 4535 3307 -5349 -1322 5552 -1020 -5985 2418 4221 -4907 -2962
960 -2962 5470 649 -5965 1277 5444 -2735 -3711 4905 2783 -4890 34 5610 -1959 -4894 4002
975 4002 3494 -5186 -2403 5064 -231 -5823 1399 4580 -3627 -3303 4879 1526 -5162 554 5557 -1637
991 -1637 -3849 3831 3315 -4292 -1309 4666 -935 -4647 2464 3245 -4386 -2639 4330 168 -5293 1295
1007 1295 4961 -2779 -3653 4518 2402 -4636 -137 5291 -858 -3891 2891 3074 -4452 -1996 4715
1022 4715 -200 -5132 1361 3842 -3355 -3231 3659 1123 -4205 1183 4876 -2257 -3724 4167 3083
1037 3083 -4396 -1144 5057 26 -4196 1470 2767 -3762 -2358 4228 54 -4891 876 4045 -2512
1052 -2512 -3159 3312 2028 -3589 340 4558 -1510 -3608 3659 2838 -4022 -995 4415 -224 -4914
$$ packed form
945e661O343N677q613k448R237j228q656M027O874o572m965Q403J803r128J945
960b962Q432m821o614P242M167q179r76Q616k122p673M924N576p569k935Q896
975D002n08q680K783P467n295n592P222L181q207L24Q182l353o688N716N003p194
991a637k212P680n16p607K983N975n601l712P111P81p631J747O969m162n461O588
1007A295L666p740q74Q171k116p038M499N428o149l033O782J83p526K456O711
1022D715m915m932O493K481p197J24O890k536n328N388L693p133j467P891j084
1037C083p479L252O201n031m222N666J297o529J404O586m174m945N767L169o557
1052b512o47O471j284n617L929M218o068k098P267q21o860L027N410m639m690
$$ plain form
1067 -4914 926 3294 -2975 -2853 3643 898 -4197 497 3746 -1892 -2840 3328 2716 -3492 -838 4001
1083 4001 -344 -3449 1883 2714 -2971 -1680 3135 -407 -4343 656 3497 -2157 -3061 3084 1848
1098 1848 -3518 -510 3525 -684 -2294 2619 2241 -3166 -1106 3849 -304 -4095 1298 3320 -2607
1113 -2607 -2680 2577 619 -3482 234 3466 -1538 -2863 3150 2446 -3581 -1001 4182 479 -3119 1162
1129 1162 2563 -2300 -1757 2978 196 -3951 843 3189 -2343 -3093 2352 1635 -2989 -251 3328 -580
1145 -580 -2616 2240 2259 -2816 -806 3788 121 -3500 1060 3013 -2326 -2635 2626 892 -3370 174
1161 174 2809 -2093 -2618 2810 2070 -3091 -667 3766 103 -3199 1392 2643 -2259 -1238 2911 -19
1177 -19 -3417 663 2672 -2196 -2800 2401 1373 -3169 -489 2826 -840 -2211 2153 1800 -2262 -500
$$ packed form
1067d914N840K368o269J22O496k745n095M694L249n638r48O168o12o208K654M839
1083D001m345l105N332Q31n685J291M815l542l936M999K841n654r04O145j236
1098A848n366L008M035m209j610M913l78n407K060M955m153l791N393K022n927
1113b607p3N257j958m101L716L232n004j325O013p04o027K580N183l703l598M281
1129A162J401m863N43M735k782m147M794K346n532p50N445p17m624K738L579l908
1145e80k036M856J9n075K010M594l667l621M560J953n339l09N261j734m262L544
1161A74K635m902n25N428p40n161K424M433l663l302M591J251m902J021M149k930
1177a9l398M080K009m868o04N201j028m542K680L315l666j371M364l53m062J762
$$ plain form
1193 -500 3245 -40 -2880 1400 2668 -2121 -1966 2276 397 -2872 84 2120 -1489 -2093 2257 1329
1209 1329 -2917 -359 3202 -160 -2341 1417 2287 -1767 -1067 2324 118 -2630 758 2347 -1869
1224 -1869 -2183 1929 934 -2575 -677 2114 -579 -1924 1531 1560 -1870 -447 2785 62 -2136 1002
1240 1002 2318 -1579 -1490 1807 717 -2520 -212 2009 -1313 -1929 1665 1023 -2228 -561 2512 -100
1256 -100 -2172 1181 2217 -1376 -974 2342 350 -2107 469 1956 -1441 -1914 1569 919 -2378 -611
1272 -611 2083 -638 -2130 1148 1535 -1695 -653 2356 317 -1999 846 2279 -1206 -1375 1874 648
1288 648 -2219 -32 1860 -947 -1939 1209 1186 -2217 -610 2139 -177 -1964 1209 1818 -1368 -878
1304 -878 2096 579 -1932 426 1985 -1083 -1633 1692 714 -2293 -497 1829 -739 -2046 1052 1398
$$ packed form
1193e00L745l285k840M280J268m789J55M242j879l269K956K036l609o04M350r28
1209A329m246K558L561l362k181L758Q70m054P00L391k206k748L388J589m216
1224a869l14M112r95l509J898K791k693j345L455K9l430J423L232k723k198L138
1240A002J316l897Q9L297j090l237K308K221l322o16L594o42l251J667L073k612
1256a00k072L353J036l593M02L316j992k457K576J487l397m73L483o50l297J767
1272f11K694k721j492L278L87l230J042L009k039k316K845J433l485j69L249j226
1288F48k867K187J892k807r92L148k3l403J607K749k316j787L173O09l186M90
1304h78K974j517k511K358J559l068n50L325r78l007J796K326k568j307L098L46
$$ plain form
1320 1398 -1662 -680 2208 193 -1900 895 1976 -1115 -1066 1736 678 -1911 61 1827 -1009 -1717
1336 -1717 1194 818 -2005 -661 1834 -341 -1785 916 1510 -1417 -743 1957 556 -1637 618 1776
1352 1776 -871 -1256 1386 757 -1837 -320 1682 -762 -1780 924 995 -1399 -589 1713 74 -1588
1368 -1588 732 1702 -880 -901 1591 648 -1536 130 1680 -674 -1433 936 765 -1639 -642 1367 -243
1385 -243 -1660 631 1233 -1105 -673 1531 542 -1331 337 1688 -543 -1091 1218 714 -1450 -233
1401 -233 1384 -461 -1455 623 962 -1264 -900 1370 173 -1476 480 1402 -625 -744 1406 743 -1205
1418 -1205 26 1634 -471 -1309 787 826 -1454 -707 1153 -179 -1463 410 1139 -906 -757 1299
1434 1299 571 -1361 306 1499 -353 -957 1005 812 -1222 -269 1288 -297 -1470 512 922 -1182
$$ packed form
1320A398l060R82K888k015k093K795J081l091M9K802j058k589J972J766k836p08
1336a717K911l76k823J344K495k175j444K701N94k927O74K700j401k193K255J158
1352A776k647l85K642o29k594J517K002k444j018K704P1k394Q10K302j639j662
1368a588K320R70k582k1K492r43k184J666J550k354p59K369j71k404R97K009j610
1385b43j417K291O02k338M32K204r89j873J668J351k231n48K309n04k164J217
1401b33J617j845r94K078L39k226L64K270j197j649J956R22k027j19K150o63j948
1418a205J231J608k105q38K096L9k280P47J860j332j284J873P29k045J49K056
1434A299p28j932J667J193j852o04J962j93k034R53J557j585j173J982M10k104
$$ plain form
1450 -1182 -895 1139 97 -1363 297 1225 -609 -736 1232 791 -1135 -58 1468 -361 -1113 920
1466 920 812 -1115 -752 1077 -157 -1532 259 960 -863 -831 951 380 -1135 137 1261 -191 -812
1483 -812 1052 765 -1073 -259 1144 -171 -1119 598 687 -1019 -931 899 124 -1228 99 1183 -565
1500 -565 -795 986 711 -869 -5 1204 -42 -831 572 759 -915 -450 949 -47 -1174 247 665
1517 665 -791 -862 902 395 -966 12 1152 -352 -809 748 748 -850 -300 1098 243 -925 261 854
1535 854 -760 -610 764 16 -1131 28 950 -341 -831 706 711 -823 -121 1069 -116 -801 680
1552 680 898 -659 -452 981 144 -1262 -3 841 -630 -826 739 381 -1034 -259 1014 -233 -783
1569 -783 713 914 -684 -498 1160 90 -945 287 794 -630 -755 822 122 -1184 -81 1022
$$ packed form
1450a182K87K034j042j460J660R28j834j27J968m41j926J077J526j829p52K033
1466I20j08j927L63J829j234j375J791P01j823L2J782n71j515J272J124j452o21
1483h12J864k87j838Q14J403j315r48J717Q9j706Q8J830p75j352J327J084j748
1500e65k30J781k75j580Q64J209j246p89J403J87j674M65J399r96j127J421M18
1517F65j456p1J764n07j361R78J140j504m57J557%j598N50J398q55j168J186N93
1535H54j614J50J374p48j147J159R22j291m90J537Nj534P02J190j185o85J481
1552F80K18j557K07J433q37j406J259Q44j471j96J565l58j415P75J273j247n50
1569g83J496K01j598J86J658j070j035J232N07j424j25J577p00j306J103J103
$$ plain form
1585 1022 -362 -984 534 602 -823 -279 1014 -19 -748 758 755 -730 -496 923 113 -1035 127
1602 127 759 -649 -882 472 207 -919 -2 926 -227 -809 740 611 -621 -305 1003 261 -721 285
1620 285 820 -462 -575 821 171 -854 -25 718 -572 -861 389 519 -749 -240 822 242 -696 441
1638 441 678 -379 -321 790 148 -846 -33 746 -409 -677 366 221 -711 -229 562 -264 -723 351 800
1657 800 -364 -407 809 227 -688 72 761 -154 -442 511 288 -764 -360 653 -215 -926 340 609 -564
1676 -564 -387 590 170 -605 248 777 -344 -398 789 440 -593 -56 700 -202 -771 288 429 -646 -404
1695 -404 602 -102 -784 295 597 -431 -373 816 385 -676 170 841 -70 -548 603 339 -674 -160
1713 -160 646 -119 -862 185 513 -697 -476 787 67 -622 148 730 -317 -459 733 421 -665 -61
$$ packed form
1585A022j384o22J518O8j425N44J293j033p29J506lj485K34J419q10j148J162
1602A27O32j408k33J354k65j126R17R28j153n82J549j29j232L16J308p42r82J006
1620B85N35j282j13J396o50j025Q29P43j290k89J250J30j268N09J062n80r38J137
1638D41K37j057N8J111o42r94Q13P79j155k68J043j45r32M82P91q26m59J074M49
1657H00j164m3J216n82r15P60O89r15k88R53k23j052M04J013q68p11J266K69j173
1676e64J77R77m20p75Q53N29j121n4J187l49j033N37P56r02n69J059J41j075K42
1695d04J006p04o82J079L02j028N8J189m31j061Q46O71r11m78J151k64j013N14
1713a60Q06p65p43J047L28j210K21J263p20o89P70N82j047j42J192l12j086O04
$$ plain form
1731 -61 745 -244 -736 236 425 -671 -278 598 -72 -720 322 591 -587 -458 768 295 -658 173 660
1750 660 -175 -458 556 438 -738 -9 709 -238 -704 313 433 -644 -448 484 53 -610 167 619 -329
1769 -329 -452 494 486 -585 17 735 -43 -592 429 302 -534 -300 514 50 -715 226 651 -538 -378 590
1789 590 296 -595 36 760 -138 -410 558 395 -591 -190 663 -201 -691 256 499 -422 -586 464 81 -640
1809 -640 -61 771 -131 -439 542 404 -525 -53 683 -89 -589 299 587 -462 -313 609 65 -722 38 473
1829 473 -382 -543 522 270 -600 -89 677 -190 -504 446 473 -494 -215 666 36 -680 22 507 -450 -472
1849 -472 402 84 -745 -109 640 -344 -591 418 430 -515 -149 785 -32 -652 343 502 -565 -349 639 230
1869 230 -644 -42 615 -401 -511 526 271 -570 -146 699 -1 -594 482 520 -563 -228 641 44 -586
$$ packed form
1731f1Q06r89m92R72J89j096L93Q76o70o48J042K69j178J29J226m73r53Q31M87
1750F60q35k83J014j18j176P29P18r47m66J017J20j077J96R32m31o63P77M52r48
1769c29j23R46qj071O02P18p78n49J021j27q36K34Q14m64p65R41M25j189J60R68
1789E90k94q91O31P24q98k72R68j63r86M01Q53q64m90R47K43r21j64J050l83p21
1809f40N79Q32r02l08R81j38r29M72P36p72n00Q88K88j049J49R22n44p87P60M35
1829D73q55j61J065k52q70N11P66q67l14R50K7r67K79Q81o30p16P02M85r57k2
1849d72Q74l18q29O36P49r84k47J009J2r45L66R34q17o20R95J59j067K16R88m09
1869B30q74O02O57j016j10J037k55q41M24Q45p00n93J076L8j083L35Q69n97o30
$$ plain form
1888 -586 183 573 -481 -557 372 47 -803 -98 577 -221 -683 429 429 -531 -32 646 21 -519 345 540
1908 540 -458 -312 641 198 -628 12 561 -336 -515 309 199 -546 -265 554 -160 -450 488 534 -473 -110
1928 -110 633 126 -523 59 454 -359 -483 386 232 -621 -55 488 -125 -554 340 381 -607 -354 586 30
1948 30 -520 261 546 -419 -365 539 143 -586 -26 580 -186 -594 358 292 -666 -146 589 -144 -615 363 442
1969 442 -354 -191 651 113 -654 176 609 -283 -517 483 294 -558 -23 579 -236 -657 318 371 -468 -98
1989 -98 636 -23 -539 271 623 -386 -279 694 169 -661 6 663 -395 -554 463 309 -542 -121 518
2008 518 -163 -603 378 514 -518 -202 635 115 -586 223 564 -212 -442 491 158 -644 42 463 -308 -470
2028 -470 446 362 -474 -83 509 -1 -443 258 469 -375 -183 489 127 -612 82 489 -275 -333 356 153 -593
$$ packed form
1888e86P69L90j054p6R29l25q50P05O75p98m62J112%r60M99O78o25n40Q64J95
1908E40r98J46R53m43q26O40N49q97j79Q24j10p45K81Q19p14k90R38M6j007L63
1928a10P43n07o49N82L95q13j24Q69j54q53N66N43o13m29Q94M1r88K53R40n56
1948C0n50P81K85r65N4R04l96p29N60O06p66m08R52o6r58N20P35p33m71R78P9
1969D42p96J63Q42n38p67Q30M33q92k34J000j89q52N35O02q15m21R75N3q39L70
1989i8P34o59n16Q10L52j009J07R73n25q30O67O57j058j59J017j54q51M21O39
2008E18o81m40R81J36j032L16Q37n20p01Q09L41p76k30R33l33q02O86M21p71j62
2028d70R16q4q36L91N92n10m42P01K11q44J92O72l62p39O94M07p64n8O89k03p46
$$ plain form
2049 -593 -73 511 -169 -549 283 417 -492 -122 598 53 -446 247 549 -325 -391 332 147 -497 -118 427
2069 427 -176 -465 335 247 -631 -147 436 -70 -596 166 400 -318 -325 508 300 -431 59 682 -293 -403 348
2090 348 294 -384 -176 521 -100 -556 79 358 -409 -202 573 44 -476 216 500 -201 -331 511 253 -531
2110 -531 -187 483 -137 -540 200 356 -565 -180 448 -65 -690 206 534 -260 -312 547 156 -434 69 585
2130 585 -269 -397 450 416 -539 -162 582 -126 -524 247 264 -464 -166 547 0 -629 257 559 -247 -437 592
2151 592 254 -473 137 584 -209 -429 366 256 -636 -141 401 -179 -540 296 429 -477 -334 565 177 -475
2171 -475 123 553 -280 -289 359 195 -550 26 461 -73 -446 234 305 -498 -133 348 -15 -458 262 338 -248
2192 -248 -238 434 212 -394 60 500 -30 -235 376 222 -461 -134 455 -111 -503 102 311 -375 -353 373 123
$$ packed form
2049e93N20N84o80l80Q32J34r09L70P20n45m99O93L02q74o6P23j85o44L79N45
2069D27o03k89Q00q8q78M84N83n06n26P62K34p18pQ33k08p31M90O23r75j10P51
2090C48n4o78K08O97o21m56O35K79p67K07P75n29n20O92K84p01j30Q42k58p84
2110e31L44O70o20m03P40J56r21L85O28n13o25Q96L28p94n2Q59l91n90N03N16
2130E85q54j28Q47l4r55L77P44p08l98P71J7p28K98P13n47o29Q86L02q06j90J029
2151E92l38p27O10M47p93k20P95j10q92M95N42n80l61Q36J33r06J43Q99l88o52
2171d75N98M30q33rO48j64p45N76M35n34l73O80P1q03L65M81l63m43P20P6n86
2192b48J0O72k22o06M54M40n30k05O11j54o83L27N89n66l92O05K09o86K2P26k50
$$ plain form
2213 123 -365 247 433 -296 -310 371 164 -428 -87 530 -112 -480 223 252 -292 -169 422 -39 -545 195 410
2234 410 -225 -248 527 116 -420 -55 495 -172 -378 369 227 -426 -144 450 -162 -524 112 360 -281 -199 400
2255 400 152 -466 130 423 -91 -295 284 232 -410 -32 443 -92 -415 230 155 -399 -199 399 -57 -503 232
2276 232 228 -351 -212 405 185 -253 123 419 -51 -180 287 237 -525 -62 404 -123 -405 150 311 -344 -171
2297 -171 372 87 -376 184 408 -240 -150 370 195 -258 15 377 -124 -331 262 220 -325 -217 315 36 -458
2318 -458 120 312 -271 -411 337 119 -341 -17 295 -131 -211 266 281 -350 -28 431 -18 -410 231 301 -321
2339 -321 -134 499 -55 -343 162 339 -240 -213 418 255 -388 -4 409 -188 -179 444 224 -405 -151 242 70
2360 70 -482 72 292 -387 -161 274 -1 -375 158 420 -122 -325 210 230 -358 -2 403 -130 -247 176 239
$$ packed form
2213A23m88O12J86p29j4O81k07n92L41O17o42l68P03K9n44J23N91m61n06P40K15
2234D10o35k3P75m11n36L65N50o67k06P47j42o53K82N94o12l62O36K48o41Q2N99
2255D00k48o18N96K93n14k04N79n2o42L78M75n35l23O45p5n54K00N98m56m46P35
2276B32mn79J39O17k20m38L76K96m70j29M67n0p62M63M66n27k82N55J61o55J73
2297a71N43k85m63N60K24o48R0N20j75m53K73L62n01k07N93m2n45J08N32k79m94
2318d58N78J92n83j40P48k18m60L24L12m26q0M77J5o31L22M59m49l92O41P0o22
2339c21J87O33n54k88N05J77n79K7O31j63o43L84M13n97RO23k20o29K54L93j72
2360G0n52N54K20o79K26M35k75l74N33K62n42k03N35K0n88L56M05n33j17M23O3
$$ plain form
2381 239 -275 -172 311 -40 -323 138 276 -141 -271 376 42 -287 37 279 -2 -260 242 278 -291 -100
2401 -100 245 -72 -346 205 292 -246 -260 317 42 -417 95 251 -90 -71 266 177 -356 -108 272 -34 -298
2422 -298 135 371 -189 -241 304 -69 -304 197 202 -237 -162 323 57 -324 113 306 -95 -186 206 92 -296 -112
2444 -112 270 -187 -318 170 85 -336 -116 274 10 -309 40 254 -205 -183 205 163 -177 103 354 -97 -232
2465 -232 164 207 -162 -76 305 96 -254 24 31 -283 -287 212 -31 -305 -15 311 -86 -103 250 147 -220 -81
2487 -81 210 6 -243 34 149 -326 -68 162 71 -292 17 306 -164 -159 325 133 -333 23 269 -130 -226 84
2509 84 165 -146 -23 236 18 -271 133 221 -205 -240 271 -25 -221 13 301 24 -248 270 185 -207 -50 260
2531 260 -13 -187 191 145 -191 -218 267 62 -252 112 140 -152 -221 101 196 -210 -47 430 31 -124 298 181
$$ packed form
2381B39n14J03M83l51k83M61J38m17j30O47l34l29L24K42k81k58N02L6n69J91
2401a00L45l17k74N51Q7n38j4N77k75m59N12J56l41J9L37q9n33K48L80l06k64
2422b98M33K36n60n2N45l73k35N01Nm39P5M85k66l81M37J93m01r1L92j14l88J84
2444a12L82m57j31M88q5m21K20L90k64l19L49K14m59K2L88m2l40K80K51m51j35
2465b32L96M3l69Q6L81k09l50K78Pl14mM99k43k74K90L26l97j7L53j03l67J39
2487h1K91k04k49K77J15m75K58K30r1l63L09K89m70NM84j92m66L56K46l99r6L10
2509H4Q1l11J23K59k18k89M04Q8m26l5N11k96j96K34K88k77k72N18q5l92J57L10
2531B60k73j74L78m6l36k7M85k05l14L64K8k92o9L22R5m06J63M77l99j55M22j17
$$ plain form
2553 181 -237 -85 130 -62 -350 138 237 -180 -166 247 94 -220 130 224 -136 24 164 232 -348 84 256
2574 256 42 -195 213 105 -301 -44 99 -83 -182 149 136 -292 -153 191 -90 -262 99 237 -92 -60 256
2595 256 205 -85 48 211 -71 -232 103 86 -195 -59 228 39 -321 112 35 -146 -220 198 127 -205 130 167
2617 167 -82 -152 146 138 -160 43 167 -52 -317 4 154 -148 -87 147 41 -166 -67 152 -107 -131 172 158
2639 158 -140 31 124 -58 -149 89 180 -164 -94 104 106 -147 9 23 -123 -102 86 145 -146 -132 292 -135 -122 82
2663 82 78 -114 -27 211 9 -69 43 210 -220 -167 55 92 -169 67 169 -98 -59 64 159 -146 13 157 30
2686 30 -100 202 126 -78 -101 152 46 -129 -9 142 -110 -163 137 -23 -152 26 305 -77 -67 231 154 -187
2708 -187 51 255 17 -193 84 90 -187 -166 96 52 -106 -82 132 31 -99 222 163 -104 -61 268 -63 -166
$$ packed form
2553A81m18J52K15j92k88M88R9m17J4M13j53l14L50R4l60J60J40O8n80M32J72
2574B56k14k37M08j08m06K57J43j82r9L31j3m28J39L44k81j72L61J38l29L2L16
2595B56n1k90J33J63k82j61L35j7k81J36K87j89l60M33p7j81p4M18p1l32L35L7
2617A67k49p0K98qk98K03J24k19k65L21J50l02O1K34j06k07R9K19k59k4L03j4
2639A58k98J71R3j82r1K38R1l44P0J98Kk53J56J4j46K1J88N9k91J4M24m27J3K04
2663H2mj92Q7K38k02p8J12J67m30N3K22L7k61K36J02k67L9J23R5l05J59J44j27
2686C0j30L02p6k04k3K53j06j75J20J51k52n3L00j60j29J78K79l82J0K98p7l41
2708a87K38K04k38k10K77Ok77K1K62m4j58K4K14j01j30L21n9k67M3L29l31j03
$$ plain form
2730 -166 127 92 -165 -46 171 33 -162 13 171 -212 -132 80 43 -138 -10 87 -42 -158 1 86 -101 -28
2752 -28 178 86 -126 55 31 -85 -213 157 27 -155 -21 167 -9 -54 65 162 -115 -147 180 20 -84 105
2774 105 108 -105 -124 195 27 0 64 80 -176 -174 16 1 -71 -95 126 -76 -59 20 133 10 -114 244 117 -177
2798 -177 45 -70 -24 -92 -18 34 -160 -108 83 -31 -59 37 148 -52 -120 148 51 -111 49 29 28 -209 63 28
2822 28 -104 82 167 -158 -72 53 -5 -136 -626 -383 -177 -117 244 48 -180 34 144 -48 -71 145 208 -63
2844 -63 -127 163 62 -90 -17 116 -119 -99 -12 32 -92 2 88 77 87 -24 117 -7 18 158 -28 -88 34 120
2868 120 -80 -31 154 99 -189 27 25 -123 -49 60 102 -45 -41 -27 -46 -166 68 137 -124 -59 3 212 89 71 196
2893 196 -266 -71 16 130 -157 -38 -8 -104 -116 -90 4 -92 5 119 -14 -85 -45 0 -64 -96 121 17 -128 76
$$ packed form
2730a66K93l5k57J19K17j38j95J75J58l83Q0K12l7j81J28R7j29j16J59Q5j87P3
2752b8K06r2k12J81k4j16j28L70j30j82J34J88j76m5J19R7k77l2L27j60j04J89
2774A05Lk13j9L19j68k7O4J6k56KJ90j5p2k4K21k02J7P9J13j23j24L58j27k94
2798a77K22j15M6o8P4N2j94N2J91j14k8R6J11k00o8K68r7j62J60k0jk37K72l5
2822B8j32J86Q5l25Q6J25n8j31m90K43K06O0L61j96k28K14J10j92k3K16O3k71
2844f3o4K90j01j52P3J33k35K0Q7M4j24R4Q6j1J0j11J41j24K5J40j86o0J22Q6
2868A20k00M9J85n5k88K16kj48P4J09M2j47MJ4j9j20K34O9k61O5O2K09j23j8J25
2893A96m62J95Q7J14k87J19L0r6j2K6R4r6R7J14j33p1M0M5o4l2K17j04j45K04
$$ plain form
2917 76 148 -69 -198 -46 34 -50 -14 158 -48 -99 101 71 -106 10 -34 -1 -18 23 82 -44 -111 -8 77 -119 -38
2942 -38 39 -62 -71 -31 169 -144 -84 156 82 75 68 89 -69 22 117 31 -88 -30 50 -57 -125 -18 101 -120 46 202
2968 202 69 -11 161 138 39 -102 164 51 11 66 2 -123 6 -16 -49 -77 -20 27 91 -98 -37 14 -32 22 89 22
2994 22 -114 -34 69 -10 -41 73 218 -116 -34 1 -3 0 -35 89 -19 -37 122 11 46 78 77 -49 -36 88 60 11
3020 11 67 -6 -69 -81 70 85 -108 -47 22 108 -139 -35 199 -309 -64 326 -512 -192 13 109 53 25 127 62
3044 62 -36 67 7 -64 25 -14 -14 -112 -31 -24 52 -32 126 69 -85 66 -18 -20 -78 89 -20 -16 -87 -60 105 -95 74 34
3072 34 -8 -151 -40 24 -75 -55 27 -43 -50 42 -5 -2 24 131 14 25 -48 7 -3 93 -21 52 -80 -63 28 63 -82 -66
3100 -66 51 -26 34 120 15 57 42 11 -87 9 206 -34 -114 37 1 -6 -95 -3 63 -47 23 74 7 -138 77 -191
$$ packed form
2917G6P2k17j29J52Q0q4L6J72k06n1K00l0j77J16m4L3j7M1N9j26o7J03Q5j96Q1
2942c8P7j01rM0K00l13O0K40p4ppK1j58R1R5q6j19N8Q0j07o8J07J19k21J66J56
2968B02j33q0J72k3r9j41K66j13m0N5o4j25J29k2l3k8N7M7O4j89O1N1m6N4O7o7
2994B2j36Q0J03p9l1J14J45l34Q2L5mLl5J24j08j8J59j11L5L2jj26J3J24k8m9
3020A1N6p3o3j2J51J5j93O1O9Q6k47J04K34n08K45L90q38L20K05R6n6k8J02o5
3044F2r8J03o0p1Q9l9%r8Q1PP6q4J58n7j54J51q4kn8J67j09Mp1K7J65k00J69m0
3072C4m2j43J11O4r9K0Q2p0pR2m7LK6J07j17J1p3N5j0R6j14P3j32J7R1L5j45J6
3100f6J17p7O0Q6j05M2j5l1r8R6J97k40q0J51l6pq9R2O6j10P0N1o7j45K15k68
$$ plain form
3126 -191 51 -238 217 -49 58 -75 66 63 -139 71 -55 11 -65 80 -72 -82 5 -88 -44 -2 15 -12 -79 3
3150 3 20 -17 -49 28 -24 -132 -114 -44 -95 -104 113 34 -33 -59 55 34 -52 16 49 -56 -6 -79 11 4 96 108 104 57 -22 -30 -3
3181 -3 -32 52 -67 -78 35 27 0 -52 62 39 4 18 122 108 17 66 -40 -23 57 113 -35 -18 -75 -7 -109 -21 63 -3
3209 -3 -56 -35 -42 117 -57 44 131 -64 95 48 36 -55 -49 -64 -1 2 21 -25 12 -69 -33 -90 7 1 3 3 -95 78 57 -46
3239 -46 44 53 -65 36 23 69 -102 24 23 2 -36 66 28 -103 62 -77 -83 48 60 40 3 68 -39 140 -5 107
3265 107 49 -22 -48 -22 -60 -53 -90 -132 -98 -115 8 70 76 -83 -9 2 30 125 67 -53 24 34 89 -52 3 -88 -19 99
3293 99 -19 -5 -60 23 53 76 -1 -19 -93 -38 -57 10 -57 -42 86 -49 33 13 137 11 -14 -68 -4 -46 56 -20 -80
3320 -80 -79 -77 46 -32 -42 -41 2 56 34 49 -32 50 61 100 -54 -97 59 17 -101 -100 -26 -83 83 6 2 -134 153 86 34
$$ packed form
3126a91K42k89M55k66J07j33J41lk02K10j26O6p6J45j52j0Q7r3M4M2J7k7o7Q2
3150CJ7l7l2P7n2j08J8P0n1rK17p9o7k6J14k1q6O8L3j05N0p3R0pR2J2mm7p9qK7
3181ck9Q4j19j1J13qk7n2J14k3l5J4J04j4r1M9j06J7Q0N6j48J7n7O8j02Q8Q4o6
3209cn3K1pJ59j74J01Q7j95J59m7j2r1Oj5O3LJ9m6L7q1L6n7R7oK%r8J73k1j03
3239d6R0Rj18J01j3M6j71J26jk1l8J02l8j31J65j39oJ31J2k0l7O5j07J79j45J12
3265A07n8p1k6K6l8Pl7m2L4j7J23O2Oj59P4J1K8R5n8j20P7J0N5j41N5r1O9J18
3293I9j18J4n5Q3L0K3p7j8p4N5j9O7o7J5J28j35Q2k0J24j26k5n4O4m2J02p6o0
3320h0JKJ23p8j0JM3N4k2J5q1Q2J1L9j54m3J56m2j18JP4n7J66p7mj36K87o7n2
$$ plain form
3349 34 521 -198 45 -35 45 -33 26 -67 -81 -18 -45 -189 47 -14 -137 51 82 -86 -89 -87 54 24 18 20 59 -84 -4
3376 -4 3 -137 -13 -29 -32 38 -25 -73 -102 -22 58 62 -56 70 113 -31 48 30 33 -55 14 70 -104 -21 -5 178 -24 -201
3404 -201 62 -9 -108 -105 28 -79 91 11 145 -98 57 41 101 8 -81 153 52 211 101 73 45 58 66 53 -1
3429 -1 -85 -41 -86 19 -77 64 -85 119 -11 -41 55 -45 18 24 31 -15 -52 -73 -36 -1 -67 -52 -1 15 2 49 90 -73
3457 -73 -54 16 -22 35 -92 70 2 1 11 14 -9 65 -7 -82 70 65 -14 24 -31 -44 -49 -9 -12 -72 22 2 1 37 121 93 -19
3488 -19 -55 -52 50 -31 -64 50 -54 89 -70 -3 44 -76 -65 18 -17 -18 31 -32 7 24 75 41 116 -201 205 -363 -118
3515 -118 34 25 -132 -102 96 -51 -32 -9 53 -32 18 63 -41 -87 158 -34 95 143 -97 43 -76 -88 -41 -4 -43
3540 -43 -9 23 -4 -120 9 49 73 -35 62 43 84 -25 -32 30 58 130 65 39 28 153 25 48 -48 -104 -127 81 52
$$ packed form
3349C4M87p19K43q0Q0p8N9r3j4O3k7j44K36o1j23J88L1j68lKJ41l0oKL9j43Q0
3376dPj40J24j6lP0o3m8k9Q0Q0Mj18J26M3j44P9j8Lq8O9N6j74Q3J6J83k02j77
3404b01K63p1r9LJ33j07J70q0J34k43J55j6O0r3q9K34j01J59j10k8k8J3Qj3n4
3429aq4M4m5J05r6J41j49K04j30l0R6j00O3OPm6l7k1L7L5o6J5N1J6j3M7M1j63
3457g3J9P0l8N7j27J62o8jJ0Lk3P4p2p5J52np9L8n5j3nM0lo0R4k0jL6Q4k8j12
3488a9l6LJ02q1l3J14j04J43j59O7M7j20J1Q3l5jM9o3L9J7N1l4P5l17M06n68K45
3515a18J52rj57L0J98j47J9K3O2q5N0M5j04m6K45j92J29M8k40J40j19j2M7L7l9
3540d3L4L2k7j16J29M0K4j08R7j9M1j09pO2K8P2o5k6j1J25j28K3r6n6k3K08k9
$$ plain form
3567 52 -159 0 34 -23 -60 -52 -130 60 -88 -35 -54 -25 4 79 -20 18 26 70 -812 -138 21 47 -110 37 42 20 55
3594 55 -17 63 -55 133 53 -60 -39 -29 48 45 -50 66 -83 -64 85 12 -192 42 8 60 -42 64 24 -42 25 -85
3620 -85 21 20 80 -20 36 -121 109 -61 -86 29 27 57 -61 37 -33 -111 -23 -44 103 -19 79 113 26 64 136 53 54
3647 54 81 133 30 -45 44 -13 -123 -101 12 -41 25 76 13 -12 -15 123 -31 -22 43 -9 -18 -16 78 -48 20 58 26 15 -91
3676 -91 -66 14 -11 81 152 -4 -43 -25 -47 -12 81 19 -84 -61 -8 56 40 49 -14 27 18 13 7 -38 -27 -47 40 -89 -89 -40 -56
3707 -56 -7 -17 6 -2 16 116 129 -11 -14 75 20 -11 -6 -51 40 -173 7 55 -73 59 155 -41 23 -20 59 130 408 -181
3735 -181 -4 147 -71 44 -45 47 17 45 -45 -64 -3 -103 14 76 87 -68 79 40 146 20 25 91 4 -44 -87
3760 -87 45 -68 -14 -8 -60 -24 -66 -20 31 130 -6 -21 65 93 82 73 -94 12 62 -58 -56 34 -95 -9 86 -75 0 -47
$$ packed form
3567E2k11J59L4n7l7Qp8J90j48N3j9K9K9P5r9L8QM4q82O74J59K6j57J47Nk2L5
3594E5p2Q0j18J88q0j13K1J0P7lr5J16j49J9J49p3k04K34l4N2j02J06m0o6O7j10
3620h5J06jO0j00N6j57K30j70k5J15kL0j18R8p0p8Q8k1J47j22R8L4q7L8P2q3J
3647E4K7N2j03p5Q9n7j10K2J13n3O6N1o3k5lJ38j54RO5n2rKR4j26O8L8l2j1j06
3676i1K5Q0k5R2P1j56l9J8k2L5R3o2j03K3N3O4j6Ro3M1rnom5J1k0Q7j29%M9j6
3707e6M9j0K3qJ8J00J3j40lQ9n5l1Nm5R1k13J80M8j28J32R6j96O4m3P9P1K78n89
3735a81J77J51k18J15q9R2l0K8r0j9O1j00J17O2J1j55J47l9J06j26NO6q7m8m3
3760h7J32j13N4On2L6m2M6N1R9j36j5Q6K8j1rj67J06N0j20KR0j29Q6R5j61P5m7
$$ plain form
3788 -47 -46 -111 -77 -77 -38 -54 85 117 35 38 11 73 -50 -58 -43 -52 -46 15 35 -25 -113 -101 -54 -64 -47 134 7 49 8 41 -27
3819 -27 98 127 22 -55 29 83 63 23 -69 12 -33 -25 -75 -46 -47 -18 17 -80 43 -54 99 -29 118 -4 18 5 49 -48
3847 -48 -48 32 22 86 -88 56 -153 -2 -32 -80 38 2 101 -28 -43 24 120 4 -89 -16 91 72 -43 150 52 -20
3873 -20 -61 57 -36 -76 51 -31 -4 49 11 -53 -17 13 127 -100 -19 17 -8 -3 -35 -23 -45 -77 12 -33 -48 41 41 -63 -38
3902 -38 -26 39 -40 -5 58 -8 -9 99 -142 69 -62 19 -27 22 -62 -41 -66 32 -25 169 93 15 -150 -247 54 -27 -2
3929 -2 -66 77 160 69 72 8 104 48 16 100 15 10 -29 58 58 -1 16 43 -79 28 -86 -7 12 -44 -40 -2 48 19 -40 47 -43
3960 -43 21 -85 -8 -43 -16 -6 53 -7 30 -2 54 81 77 -36 152 53 25 144 -173 -57 -52 26 83 75 65 -36 27 -16
3988 -16 46 -39 9 -8 -343 18 92 -120 23 -74 37 -45 97 -64 81 4 -63 18 10 -37 -99 -69 -3 -21 79 3
$$ packed form
3788d7Jo5L4%L9j6J39L2q2Lk7O2j23qJ5rOO1K0o0q8J2M7j0J7J81j27M2m1L3o8
3819b7J25K9j05p7Q4N4k0m0r2Q1m5Qn0K9jK9L5r7J23r7J53j28J47j22K2j3M4r7
3847d8%Q0j0O4j74J44k09J51l0m8J18l6R9j29j5O7R6j16r3P3J07j9j15J93r8p2
3873b0m1J18r3m0J27q2K7N3l8o4L6L0J14k27Q1L6k5Nl2J2k2l2Q9m5j5Q9%j04K5
3902c8J2O5p9L5O3o6jJ08k41K11j31Q1m6M9q4K1k5R8n7J94p6p8j65r7L01q1K5
3929bo4J43Q3r1Lo4R6n6l2Q4q5nl9Q7%n9J7K7j22J07j14P9J9n6ML8N0k9n9Q7r0
3960d3O4j06P7l5K7J0N9o0L7l2N6K7mj13J88r9k8J19l17J16NP8N7qj0j01O3m3
3988a6O2q5M8j7l35L61P4k12J43r7J11q2J42j61J45p7o7Q1qm7o2L0O6j8J00p6
$$ plain form
4014 3 44 67 -49 32 35 14 12 34 -57 -47 46 14 -21 10 -12 -46 -148 -47 -14 -71 -6 66 -21 -57 -39 -51 -26 -85 89 77
4044 77 103 114 -89 -51 -23 -27 31 48 39 8 -77 -26 -83 17 76 69 -20 21 -27 167 19 48 82 34 91 -6 112 -3 28
4073 28 -55 25 43 -37 51 33 -9 0 -80 -85 7 52 7 -43 125 120 -131 74 16 59 -12 -40 44 214 -92 -44 -45 -8 100
4102 100 -50 18 -1 -8 116 68 50 -31 129 110 -8 -75 72 4 -46 -31 -34 -25 28 -41 14 -18 -10 49 -54 -103 -201 37
4130 37 9 -8 5 -38 -13 47 24 -8 -41 -68 57 -110 -40 18 20 58 -26 -102 -36 -143 -67 -97 -47 -29 66 -70 -60 110
4158 110 88 -103 -39 -10 -59 60 45 -70 -20 -9 82 -36 18 26 -139 -71 8 4 72 37 66 -61 -20 -4 2 -28 71 -7
4186 -7 24 -45 -75 39 -142 46 -17 59 54 33 97 1 -56 23 50 -8 32 -38 44 -89 152 -91 -67 -27 146 299 489
4213 489 -461 272 -25 16 43 -80 -81 -33 -8 59 -12 78 -26 13 -23 -11 -47 -93 102 -85 -106 -106 120 -27 42 -53
$$ packed form
4014CM1K3j16Q1Lk1kK2r1J0R3l2l5L1k2l4j02J01L3n7O5P2q7l6J8j2K5n9J74j2
4044G7K6J1k03L8K8mN8J7rl1q5N1n7J00N9pq9M1m8J94j48K9L4m8N7r7J18j15L1
4073B8q3Q0J8q0Q8j8m2Rq0nR2M5m5n0J68nk51K05n8M3p1k8Q4J70l06M8jL7J08
4102A00j50O8j9pJ24m8j8q1J60j9j18o7J47o8n0J5lRN3o9N5l2QN9j03m9r8K38
4130C7k8j7J3m3K5O0k3l2l3k7J25j67P0N8KL8q4p6O6j07P6l0N0J8R5j36J0J70
4158A10k2j91O4K9m9J19j5j15N0J1R1j18N4Qj65O8P9mO8l5K9j27M1J6Ol0R9p8
4186gL1o9l0J14j81J88o3P6nk1O4r6n7P9K7n8M0p0Q2j33K41k43K4M0J73J53J90
4213D89r50P33k97M1K7j23jM8K5O7p1R0j04L9l6J2l6m6J95j87k1%K26j47O9r5
$$ plain form
4239 -53 9 -27 -117 51 -47 -20 -15 53 -18 57 102 105 -28 -109 10 4 -22 -6 -12 27 35 9 -17 -15 -111 -57 33 -47 27 -51 -50 111
4271 111 -27 -50 -90 -68 -7 -31 127 12 -59 -2 27 -118 -115 37 2 42 -25 53 -39 -91 -38 29 -50 8 -71 7 12 -25
4299 -25 -7 7 -129 -50 26 95 33 39 -13 38 -25 128 20 31 1 47 23 -93 73 -10 113 -42 103 40 -70 48
4325 48 20 51 39 34 171 -17 42 7 43 122 -60 -84 171 58 19 36 23 -46 124 -21 -16 -50 -65 41 66 64 -70
4352 -70 -15 -23 -5 -60 55 -67 39 27 32 23 -147 -145 5 -31 -1 -13 -24 -130 -81 93 -58 -142 -43 57 -6 2 16 -4
4380 -4 -17 -35 42 -25 -22 -60 -11 18 40 -37 143 14 159 42 2 40 65 86 -97 7 4 93 0 29 32 77 -5 56 100
4409 100 37 122 30 -37 59 -23 -72 -126 -68 165 -59 -75 -37 -67 -60 17 -14 6 57 53 -38 -95 41 -62 92 -8 84 8
4437 8 -55 -82 60 12 -76 52 96 24 11 88 -14 152 -57 6 -53 -29 -27 -57 -20 -90 -38 64 40 -39 97 -49 -116
$$ packed form
4239e3O2l6r0J68r8K7NO8p1P5M5Lj33q1J19ok6J6oL9Qk6k6Kr6N4R0q0P4p8JJ61
4271A11j38k3m0K2O1k4J58j15p1N7K9j45LJ52l5M0o7P8r2n2N3O7p9N8p9P8Nl7
4299b5J8J4j36P9P6O9o2On2N1o3J53j08J1l0M6k4j16J66q3J23j55J45o3j10J18
4325D8k8L1j2nJ37j88N9l5L6P9j82k4K55j13l9J7j3o9J70j45Nl4j5J06K5kj34
4352g0N5qJ8n5J15j22J06j2Nrj70KJ50l6L0j2j1j06M9J74j51q4R9J00o3QJ4k0
4380dj3j8P7o7Ll8M9K9K2p7J80j29J45j17m0L8K5K1j83J04lQ9r3K9LM5q2O1M4
4409A00o3Q5r2o7R6q2m9n4N8K33k24j6L8l0PP7l1K0N1mr1n7J36j03J54j00R2p6
4437Ho3k7J42m8q8J28M4p2j3P7j02J66k09O3n9K4Kl0L7p0N2J02k4p9J36j46o7
$$ plain form
4464 -116 -67 27 36 -32 23 55 77 31 131 -39 51 25 -1 25 -63 42 -27 65 9 47 39 74 83 -35 -119 -29 -1 -76 59
4493 59 57 7 -98 79 4 115 51 -24 31 -75 -109 -3 -36 -64 -90 31 17 -67 -6 69 -7 14 -11 0 -6 3 -36 -86 120
4522 120 124 -71 -3 -33 -29 48 30 62 -97 -20 39 -96 6 -10 -67 -42 -79 56 34 -90 61 13 55 -5 128 -84
4548 -84 31 56 38 -53 -50 77 8 14 -88 23 -106 20 -96 26 43 0 -19 49 149 10 -8 -5 -38 -103 12 -27
4574 -27 -69 -110 21 60 16 53 -6 94 45 -16 60 -121 57 -81 -36 3 91 -40 27 -96 -78 44 -45 -9 -10 17 -37
4601 -37 -16 106 -48 -31 72 29 5 -30 69 15 -72 2 26 4 -35 78 -112 0 66 -46 -12 12 121 -156 -35
4626 -35 -84 -82 -28 -17 2 -31 -103 36 -33 -47 -38 69 37 -48 35 -20 6 -84 -37 -27 57 -40 40 -142 -34 65 -86 -38 3
4655 3 50 41 -99 57 61 34 32 88 -15 -69 9 13 -18 31 38 103 -10 -57 -35 81 -33 69 -27 55 88 -63 106 99 -17
$$ packed form
4464a16M9R4Ro8N5L2K2m6J00j70R0k6k6K6q8J05o9R2n6L8qL5Rj18q4R0K8p5J35
4493E9kn0j05J77p5J11o4p5N5j06l4J06l3k8k6J21j4q4O1P5p6K1k5J1oRl9n0K06
4522A20Mj95O8l0MP7j8L2j59P7N9j35J02j6n7K5l7J35k2j24J51m8M2o0J33k12
4548h4J15K5j8r1LJ27o9Oj02J11j29J26j16J22J7m3j9O8J00j39j8Ll3o5J15l9
4574b7m2m1J31L9m4L7n9J00m9o1P6j81J78j38M5L9Q8j31O7j23J8J22q9L6jK7n4
4601c7K1J22j54J7J03m3k4l5R9n4q7P4K4k2l9J13j90J12O6j12L4K4J09k77J21
4626c5m9KN4J1J9l3p2J39o9j4RJ07l2q5Q3n5K6r0M7J0Q4r7Q0j82J08R9j51M8M1
4655CM7rj40J56Mk7kN6j03n4P8Ml1M9PO5j13m7K2J16j14J02r6Q2L3j51J69pj16
$$ plain form
4684 -17 142 24 -87 -63 126 64 71 71 5 -46 57 -90 74 65 -3 1 32 -48 33 27 7 39 -26 22 -60 -57 39 -8 2 -72
4714 -72 -85 -28 -35 27 -55 -89 106 -4 35 32 47 -72 -66 -59 -34 -135 93 54 128 48 -42 -83 107 90 147 -23 -20 23 90
4743 90 57 -49 40 -67 27 63 -114 -76 34 -24 64 -11 97 -100 -4 1 63 15 -58 -42 -44 -33 -43 -70 100 67 -30 -85
4771 -85 26 -17 14 -25 -60 86 -98 -74 45 24 -21 -3 36 5 138 18 -39 114 23 2 -1 84 -103 10 -34 -72
4797 -72 22 -23 -55 -78 -43 -47 104 157 6 21 84 101 24 -60 -40 -57 -71 -76 98 7 27 -51 -85 -64 109 51 36 15 60
4826 60 81 -24 46 -62 18 18 -23 -49 -61 0 -12 84 -7 -126 15 9 -99 -2 97 60 100 87 -50 189 -26 32 100
4853 100 -17 -38 -51 20 -27 107 -68 37 3 69 33 91 24 31 11 -67 91 49 -41 -59 -51 102 -3 -47 33 2 -22
4880 -22 69 25 -57 -45 -63 -116 -84 63 37 -35 -40 -5 -7 76 42 -25 -19 6 -26 52 20 35 48 -155 4 -3 167 -20 24 107
$$ packed form
4684a7J59j18j11K4J89o2P%o6n1J03j47J64ro8ML1q0Q1ok0L2o5M8q2LR6m7J0p4
4714g2j3N7pO2q2l4J95j10L9lJ5j19OPK5j01K28l9P4q0r0m1J90j7N7j70LM3O7
4743I0l3j06Q9j07R4L6j77L8J10n8Q8p5J08j97R6NO2m8p3J6kJ1j0k7J70l3r7n5
4771h5J11m3L1l9l5J46j84K4J19k1m5J8L9l1J33j20n7J53r1k1lQ5j87J13m4l8
4797g2R4m5l2k3L5mJ51N3j51J5O3J7p7q4K0j7j4nJ74r1K0p8l4K1J73n8j5k1M5
4826F0K1j05P0j08Q0%m1k6j2O1j2R6r1j19J41oj08R7R9l7M0j3j37K39k15N8O8
4853A00j17k1j3P1m7J34j75J05l4O6l6N8o7Pk0p8J58m2r0j8QJ53j05m4Q0l1k4
4880b2R1m4q2J2j8n3L2J47k6p2nL5kQ3l4o7OK5l2P8l2J5J3k03J59pJ70j87M4Q3
$$ plain form
4910 107 -53 -46 -64 19 38 -191 -34 2 -48 22 19 -96 -23 -17 -25 -24 -25 -1 89 -42 37 -43 -55 39 -73 50 3 -87 99
4939 99 -103 87 31 17 31 -14 25 68 -50 -4 -5 8 22 19 -24 125 -117 45 -135 359 -46 55 120 -164 297
4964 297 251 21 -37 78 163 102 -85 119 -188 -239 -52 -184 -95 -106 0 42 10 -88 -89 86 211 0 19 -5 116
4989 116 -25 -32 157 12 -33 -131 -55 -72 13 176 166 169 -19 -87 -10 18 32 39 -70 -97 -28 73 45 46 166 16 -33
5016 -33 119 40 100 -17 -199 -78 184 29 136 91 358 114 199 224 -30 -248 41 -135 143 237 76 -158
5038 -158 -182 -23 -348 395 -232 438 -448 -257 55 -15 110 -25 90 13 87 136 -6 -58 14 -33 -40 3 36 -59
5062 -59 89 -11 27 -72 37 -92 5 -112 22 41 -6 6 147 79 -31 147 -4 29 -5 -21 -31 40 69 134 -66
5087 -66 3 90 -57 -210 -8 13 -73 -2 -77 22 -39 50 146 19 -28 61 -48 -16 56 -44 14 -89 5 -79 16 30 31
$$ packed form
4910A07j60Pj8Q3J9k29J57L6n0P0lj15P3OqJjK4R0j31P9q0j2R4j12J23m7r0J86
4939I9k02J90n6j4J4m5L9M3j18M6jJ3J4lm3J49k42J62j80M94m05J01O5k84M61
4964B97m6k30n8J15Q5o1j87K04l07n1J87j32Q9j1J06M2l2r8jJ75J25k11J9k4J21
4989A16j41pJ89j45m5r8P6j7Q5J63j0Lj88o8P7K8J4Pj09k7O9J01k8JJ20j50m9
5016c3J52p9O0j17j82J21K62j55J07m5K67k44Q5K5k54k18K89j76K78R4j61k34
5038a58k4J59l25P43o27O70q86J91L12p0J25j35J15p7P4M9j42n2P2m7pM3L3r5
5062e9J48j00L8r9J09j29R7j17J34J9m7J2J41o8j10J78j51L3l4j6j0P1K9O5k00
5087f6O9Q7j47j53K02K1q6P1p5R9o1Q9R6j27m7Q9j09L2P2j00N8j03R4q4R5J4J
$$ plain form
5114 31 33 -45 -79 93 27 -51 49 -54 68 146 5 -106 -99 106 53 -121 77 -8 -58 -38 -29 -99 64 -94 -2 -72
5140 -72 -57 -78 -38 5 23 20 -30 59 -56 38 -14 75 -12 -53 -145 -42 82 -40 24 40 62 -16 -71 79 59 66 -54 62
5168 62 -4 88 18 24 47 -34 -58 53 -76 -13 105 -37 -50 -55 -124 -16 -84 -73 -97 19 20 66 -4 -1 95 -48 -69 37
5196 37 50 67 -130 -40 78 -30 23 -48 -149 -30 92 -29 -19 -78 77 106 3 71 -24 -22 -62 -26 37 -5 70 28
5222 28 8 -133 64 22 -83 -5 34 9 49 10 -17 -25 -55 15 35 -19 -7 -74 -34 6 -16 103 54 115 -153 22 64 47
5250 47 -11 -35 -14 -102 -20 -13 -65 7 91 -34 67 280 -273 108 -246 230 166 7 61 8 -61 146 407 149 189
5275 189 154 308 -139 95 141 -137 221 216 -45 -188 -268 -6 -269 14 465 257 56 -99 -115 -348 -116 -218
5297 -218 244 183 -548 -138 513 201 -1 93 331 -4 -11 450 -180 -323 -219 413 378 540 241 493 -210 272
$$ packed form
5114C1Kp8l4J72o6p8J00j03J22P8j41j11PK05n3j74J98q5n0K0Rp0J63j58R2p0
5140g2J5k1M0M3J8ln0Q9j15R4n2Q9q7m1r2J03J24j22O4J6K2p8n5J50k0Pj20J16
5168F2o6R2p0OK3q1k4J11j29O3J18j42j3no9J08o8J1k4J16JM6p0LR6j43k1J06
5196C7J3J7j97R0J18j08N3p1j01J19J22j21J0n9J55K9j03O8r5Km0L6O3m2P5m2
5222B8k0j41J97m2j05P8L9k5M0l9k7ql0P0K0n4J2o7M0M0k2J19m9O1k68J75M2j7
5250D7n8k4K1q8Q2Pn2P2Q4j25J01K13n53L81l54M76o4j59N4n3o9K07K61k58M0
5275A89l5J54m47K34M6k78L58nk61j43q0K62k63K83M51k08k01j55j6k33K32j02
5297b18M62o1p31M10O51l12k02R4K38l35pM61o30j43J04O32l5J62k99K52p03M82
$$ plain form
5319 272 35 -359 -50 -167 173 -356 228 -309 140 876 -372 -357 -394 -57 -502 260 -279 287 -805 68
5339 68 -435 -92 506 -670 -208 1045 -302 178 312 -174 66 -208 47 290 442 -408 127 885 214
5358 214 161 983 -101 -166 -36 431 -171 954 443 28 882 -922 -254 -580 327 -73 -367 355 138 185
5378 185 -307 259 -99 -648 481 547 213 -439 -103 73 -451 -845 -111 479 204 468 -85 -131 12 -220
5398 -220 140 -327 189 319 240 194 -20 155 12 -5 -290 345 16 27 1 -91 -5 -74 117 -17 -86 31 -30
5421 -30 48 -81 153 50 38 2 32 -21 9 46 -81 -29 3 16 -67 48 -63 15 24 77 -18 -11 67 -23 -127 -8 -13 12
5449 12 -28 -97 10 -50 19 -98 10 -41 44 -58 19 -51 -122 1 54 25 5 -48 -128 -9 -47 47 36 -114 -67 39
5475 39 9 95 -24 -39 43 211 48 32 -8 59 48 -80 62 13 -92 -43 -53 28 -31 -56 62 107 -20 -113 15 -17
$$ packed form
5319B72k37l94L09j17L40n29N84n37M49P36j248J5l7L37m45P62n39N66j092Q73
5339F8n03L43N98j176M62J253j347M80J34m86K40k74K55K43J52q50N35P58o71
5358B14n3Q22j084o5J30M67o02J125n11m15Q54j804O68l26R07m00k94P22k17M7
5378A85m92N66l58n49J129O6l34o52L36J76n24l94P34N90k75K64n53m6J43k32
5398b20L60m67N16J30p9m6k14J75j43j7k85O35l29J1k6r2Q6o9J91j34o9J17o1
5421c0P8j29K34j03j2l6L0n3L0L7j27N2L2J3q3J15j11P8RN3r5PP8r0j04J19nK5
5449A2m0o9J07o0O9j17J08n1Q5j02P7p0p1J23N3k9k0n3q0J19l8R4j1j50M7J06
5475C9l0Q6j19j5Q2J68j63j6m0O7j1j28J42m9j05M9j0Q1n9k5J18M5j27r3J28l2
$$ plain form
5501 -17 30 -90 22 91 -65 11 47 -25 67 -72 -2 12 -77 -92 6 -13 38 -43 102 -24 29 -69 -31 -2 88 60 41
5528 41 -5 -42 62 235 -29 -94 -30 11 -34 32 15 122 -34 78 20 -70 20 -66 -30 16 79 -32 15 1 19 0 41
5555 41 43 -23 -67 -72 100 -8 -23 50 -113 -9 102 -21 -13 57 4 -42 213 -166 -69 -45 40 -19 107 -44 -1 -22 -75
5582 -75 58 -50 -34 -71 102 164 -11 -5 -119 -99 -16 -22 124 -46 28 -25 6 129 -78 -13 0 69 -19 29 25 -47 65
5609 65 81 8 2 25 23 -5 42 43 -89 -81 -168 -23 -8 -73 -25 42 -15 -28 -41 152 -16 78 49 114 2 -36 57 31 11 -51
5639 -51 -42 19 0 -40 -21 -21 27 72 69 -28 17 -124 8 112 -88 40 -52 -56 -40 74 60 152 62 -27 36 -79 -59 -42 -31
5668 -31 -188 21 20 -164 5 57 3 -60 -62 58 -99 28 53 19 -60 -5 -53 38 -74 66 19 -28 -79 45 1 -9
5694 -9 -10 43 -42 137 14 -42 23 31 11 93 6 -28 -14 41 -42 18 -35 -111 25 39 -108 -70 -5 25 -114 -11 82 -98
$$ packed form
5501a7M7j20J12O9j56P6L6p2R2j39P0J4q9j5R8j9N1q1J45j26N3r8L8K9R0k8j9
5528D1m6l7J04J73k64o5O4M1m5O6j7J07j56J12n8r0R0q6L6M6O3j11M7j4J8j9M1
5555D1Ko6m4nJ72j08j5P3j63J04J11j23QP0n3m6K55l79R7K4Q5n9J26j51M3k1n3
5582g5J33j08J6l7J73O2j75Oj14K0Q3oJ46j70P4n3L1J23k07O5J3O9q8M8mp2J12
5609F5J6p3oK3kk8M7Jj32Qq7J45J5o5M8O7n7j3j3J93j68R4k9O5j12l8R3k6k0o2
5639e1RO1j9m0J9%M8M5lr7M5j41J32J04k00J28r2mJ6J14j4R2r0q9O3j15K0J7J1
5668c1j57K09jj84J69N2n4o3kJ20j57J27K5l4p9N5m8R1j12J40m7m7n1J24m4j0
5694ijN3q5J79j23n6O5Qk0Q2q7l4J4N5q3O0n3p6J36J4j47L8O5L0j39J03R3j80
$$ plain form
5722 -98 30 103 80 30 81 98 -4 -34 -57 -106 94 114 -56 -63 -60 58 -28 29 -17 -70 -47 160 -51 49 4 -29 -2
5749 -2 29 36 7 -36 18 -46 127 -59 80 -20 -38 -36 -26 -2 14 65 40 99 -85 -23 66 113 -40 39 78 128 -6 101
5777 101 31 76 20 -67 -83 -4 35 -33 16 -58 -101 31 -42 124 38 -13 382 72 -72 55 72 -74 -32 50 183 -47
5803 -47 -30 -78 -61 82 105 63 57 -60 4 -14 81 58 -114 22 5 10 -12 119 -45 -154 -43 -76 -210 105 -103 -91
5829 -91 285 -93 25 -15 -78 -2 49 15 -33 -39 -53 -89 29 -126 -77 201 -2 -106 -57 36 -13 22 -25 14 -83 -26 -79
5856 -79 38 -52 92 -152 132 79 -10 112 93 41 6 -8 -1 8 13 63 40 53 -75 67 -40 25 82 -27 173 27
5882 27 36 -67 -9 -79 78 -93 -171 49 -18 -54 -137 21 -70 -16 -82 -10 -90 -21 9 103 -23 51 78 29 -84 101 22
5909 22 31 49 -30 -38 -63 -6 52 -107 -8 35 -129 36 -1 48 65 -86 22 7 16 -7 -63 -55 -55 38 -107 45 -76 22 -69
$$ packed form
5722i8J28P3k3n0N1J7j02l0k3m9K00K0j70pLJ18q6N7m6n3K3K07k11J00m5l3K7
5749bL1Pk9m3N4o4J73j86J39j00j8KJ0K4J6N1k5N9j84O2Q9M7j53P9L9N0j34J07
5777A01p0M5n6q7j6P9L9o8M9p4m3J32p3J66q6n1L95l10j44J27J7j46M2Q2J33k30
5803d7J7m8J7J43K3m2oj17O4j8R5k3j72J36j7Nk2J31j64j09J11l3j34L15k08J2
5829i1L76l78J18m0o3P6N1l4m8oj4l6J18j55M9K78k03j04M9R3m9L5m7L9r7N7n3
5856g9J17r0J44k44K84n3q9J22j9n2l5j4PRNN0k3J3j28J42j07O5N7j09K00j46
5882B7Rj03N8p0J57j71p8K20o7l6q3J58r1N4o6P2q0O9L0R4j26P4K7m9j13J85p9
5909B2RJ8p9qk5N7N8j59R9M3j64J65l7M9J7j51J08j5Rk3n6Q%R3j45J52j21R8r1
$$ plain form
5938 -69 -65 71 106 -13 3 -7 -136 94 6 -24 142 67 -135 4 -55 -59 180 -87 -16 -73 -31 -57 -91 113 11 -4
5964 -4 -55 21 9 -58 -83 -49 -10 37 31 27 26 -7 37 -109 -76 65 -64 84 -61 -12 2 -72 -69 62 45 11 22 13 -108 29
5994 29 17 21 -81 -21 -33 5 -97 67 -102 -22 116 66 -30 87 1 21 41 -25 -39 27 29 -16 43 17 65 -52 -9 62
6022 62 -160 -53 -24 11 88 -17 -155 -97 -43 31 -42 101 13 -41 33 114 91 53 -12 -118 10 -51 -73 -58 -19 -1 52
6049 52 38 -23 -8 -30 -47 -55 6 -43 113 52 35 -77 -10 -16 -86 55 4 4 -97 -19 -6 -106 -28 45 -47 29 -46 -36 -4
6078 -4 143 -93 -117 -44 -80 -38 -78 -38 -34 -95 -85 -3 70 -38 44 40 -2 -96 62 76 61 -15 -52 -102 -6 -149 15 49 96
6107 96 -109 41 -85 398 487 -432 -416 -351 223 -131 25 -83 -8 105 35 101 13 -13 -31 -18 16 -103 119 64
6131 64 35 -118 -22 62 105 -58 15 97 -26 28 1 -126 154 80 54 8 27 -71 90 91 13 -24 8 -26 14 -2 8 12
$$ packed form
5938f9MJ36L5j19J6j0j29K30q8l0J66p5k02J39n9mK39k67P1n7M2k6l4K04j02j5
5964dn1P6j2o7k5L4L9M7omjl3M4j46L3J41j29J48j45M9J4p4LJ31j7l4J1rj21J37
5994B9j2Mj02O0j2L8j02J64j69Q0J38n0r6J17q6K0K0o6j4O6Km5N9k6M8j17M3P1
6022F2k22J07K9L5P7j05j38N8N4P4p3J43q8n4P4Q1k3l8o5j06J28o1k2J5L9J8N3
6049E2j4o1J5k2j7qO1m9J56o1j7j12O7op0J41n1%j01P8J3j00P8P3r2P6p5J0L2
6078dJ47k36k4P3l6M2m0M0Mo1J0Q2P3j08Q2mm2r4J58J4j5p6l7n0R6j43J64L4M7
6107I6k05J50j26M83Q9r19J6O5N74l54J56j08P5J13p0O6q8k6j8J3L4j19K22n5
6131F4k9j53R6Q4M3j63P3Q2j23N4k7j27K80p4k6m6J9r8J61Jp8l7L2l4M0j6J0M
$$ plain form
6159 12 61 47 98 -53 3 96 9 -80 -54 -8 -17 31 106 1 -99 118 41 27 67 105 93 -12 -22 -21 29 49 4 -7 -63
6188 -63 62 5 59 -62 109 -32 -97 43 60 -53 69 51 56 -81 -26 -118 51 139 96 -50 62 5 110 -255
6212 -255 -118 -181 610 643 -139 38 -16 31 -26 52 -150 23 -56 -20 -40 54 60 -113 -33 10 -19 -33 -60 13 66 12 -16
6239 -16 88 -15 -78 -41 42 23 5 -11 -24 22 -61 -47 -79 57 -102 -41 52 -15 2 -53 26 -8 -6 104 20 -103 -7 -43
6267 -43 87 76 -146 87 -3 -15 -47 -8 38 -70 146 24 -4 2 17 37 21 -17 3 31 42 -53 83 58 -128 33
6293 33 6 -69 60 -101 -59 -51 -23 53 -8 -24 76 -7 6 -17 77 -55 -37 0 -38 -35 -57 -15 14 -59 95 56 -75 8
6321 8 -17 -25 30 -25 12 72 -66 -59 -8 83 55 111 -11 -45 -52 51 105 21 -22 -23 37 -46 114 -19 89 12 2 -33 -21 -2
6351 -2 -11 -96 -41 42 86 4 51 -39 -7 0 -23 66 44 0 -58 -76 1 17 -33 1 -6 17 14 0 -60 52 100 25 38 29 93 76 31
$$ packed form
6159A2M9j4N1j51N6R3q7q9K6M6rM8P5j05j00K17p7j4M0L8j2j05j0JN0K0m5j1n6
6188f3J25n7N4j21J71j41o5J40J7j13J22j8Nj37N5r2J69Q8m3j46J12n7J05l65
6212b55J37o3P91L3p82J77n4M7n7P8k02J73p9L6k0R4Oj73Q0M3k9j4k7P3N3n4k8
6239a6J04j03o3L7Q3j9j8j6j3M6q3J4l2J36j59O1R3o7J7n5P9l4KJ10q4j23R6l6
6267d3J30j1k22K33r0j2l2L9M6j08K16j22k8OJ5K0j6l8K0K8J1r5J36k5j86J61
6293C3k7p5J29j61M2QK8P6o1j6J00q3J3k3R4j32J8L7l8Lk2M2K9p3J54l9j31Q3
6321Hk5qN5n5L7O0j38PN1R1k8N6j22l4pJ03N4q4m3jO0q3J60j33J08p7j0l5J2J9
6351brq5N5Q3M4q2M7r0L2Pk3Q9k2m4n8j8P7J6n0L4pK3lj4o0J12M8p5J3rO4j7m5
$$ plain form
6384 31 8 -67 22 -81 -36 -2 -15 -75 -37 62 -41 22 16 -31 -11 -24 20 29 -12 -60 -63 7 34 -55 -60 -3 16 -71 -34 68 -2
6415 -2 -78 91 16 11 -8 24 -103 13 -55 72 -64 19 29 73 -31 11 -63 -47 -65 104 -137 55 13 92 -71 124
6441 124 459 330 28 73 37 21 117 -56 -14 19 -126 14 -48 0 -40 -15 27 69 24 22 -141 53 43 -10 27 -45
6467 -45 35 73 -97 324 661 86 -437 536 407 -125 -99 55 275 122 -288 180 802 -273 8 158 42
6488 42 -93 43 39 -65 -381 -241 -153 -276 -297 -337 746 494 106 -131 -467 -6 -103 -14 -124 -161 3 359 -211
6511 -211 51 166 54 333 -216 20 450 97 420 31 384 -85 -71 -70 -273 -20 -179 -41 45 -23 -98 8
6533 8 -43 74 60 74 13 82 -47 -22 -37 69 -200 -360 302 -141 142 -164 360 303 18 83 49 -6 0 -90 -11 10
6559 10 -100 -55 -5 10 -81 -42 -46 -14 41 47 68 26 35 22 -24 9 -13 -78 57 4 59 2 -4 13 11 6 -66 25 82 3 -7 -33
$$ packed form
6384C1k3p5Q9j03M5L4j3o0L8R9j03O3om7K0j3M4Rm1m8lP0K7q9nN7J9q7L7J02p0
6415bp6J69p5nj9L2j27J16o8J27j36Q3J0M4j04M2p4J6j8J69k41J92m2P9j63J95
6441A24L35j29l02M5l6j6R6j73M2L3j45J40o2M8m0K5M2M2m5kj63J94j0n3L7p2
6467d5Q0L8j70M21L37n75n23R73j29n32K6J54K20j53m10M68O22j075K81J50j16
6488D2j35J36mj04l16J40Q8j23k1m0J083k52l88k37l36M61r7Q9j10l7J64L56n70
6511b11K62J15j12K79n49K36M30l53L23l89L53m69J4Jk03K53j59J38Q6o8p5J06
6533Hn1J17j4J4o1O9j29K5j5J06k69j60O62m43K83l06N24n7k85O5l4n5Or0P9K1
6559A0j10M5N0J5r1L9mL2N5OK1m2Rj3m6L3k2o5J35n3N5n7oJ7knp2R1N7p9j0k6
$$ plain form
6591 -33 -25 75 111 10 117 113 10 59 -7 -40 36 -26 -104 6 -77 -75 53 67 10 -21 -16 -23 197 49 47 -53 90 -84
6619 -84 90 81 -47 44 31 7 26 -15 -36 -26 -104 -34 -97 -88 -21 -9 88 85 57 -3 -56 -55 20 -71 -17 77 36 71 8 97 96 -8
6651 -8 -83 30 26 -18 -151 -28 89 -87 -25 14 -110 42 33 -42 102 1 -7 -13 16 -32 41 4 40 -40 -4 -88 39 42
6679 42 78 -68 -46 -59 130 7 94 -54 -74 3 -64 27 94 -47 89 -54 -45 -66 32 58 -86 64 -102 19 -37
6704 -37 -17 -83 149 -30 -100 -570 -2 43 -64 54 26 53 57 71 60 -85 -26 -69 -1 21 45 -30 -12 -22 -16 14 -28 -87
6732 -87 -13 43 -29 56 49 61 68 76 -22 13 75 -88 -74 35 -72 50 84 19 45 24 68 -44 -57 6 24 -6 0 -19 -20 -1
6762 -1 -46 5 9 1 146 -14 24 35 -29 11 41 84 -92 -125 91 35 58 38 109 91 -13 36 66 -59 -10 -2 -47 -4 -63
6791 -63 25 63 -17 -73 -97 11 -103 -15 3 -75 68 -52 -40 92 -4 35 40 37 16 71 -71 -37 55 -26 40 -77 -30 -54
$$ packed form
6591c3QJ00L6j01J07mj03M9o6l3P6o2p8J10q3KJ28J4n7l1NpK20j48kj00J43j74
6619h4J74rj28R1j3k4J9m1k1J0p8P0o3RO7J2R7lk8o0n3JP5r1N4R4m1L5o3Q9jj04
6651hp5J13mm4j33J23J17j76O2L9j24J52rp5J44j01qoK9m8P3l7L6q0L6q4J27L
6679D2L6j46K2j3J89j23Q7j48k0P7o7R1O7j41J36j43Rk1R8K6j44J50j66J21n6
6704c7K0o6K32j79p0m70N68M5j07J18k8K7MJ4j1j45N9m3O8K2K4p5J8j0OL0m2n9
6732h7P4N6p2Q5pJ2PQr8L5O2j63J4J09j07J22L4o5K6k1M4j12j3O3J8l0Oj9jJ9
6762am5N1MqJ45j60L8J1o4M0L0M3j76l3K16n6K3k0P1j8j04M9L0j25M9Qm5M3n9
6791f3Q8L8q0n6k4J08j14Q8J8p8J43j20J2J32r6L9Nlk1N5j42L4R2q1O6j17M7k4
$$ plain form
6819 -54 48 3 -67 -32 8 -160 18 105 70 108 29 -60 -25 30 170 52 -86 -282 116 -47 21 -256 120 37 337
6844 337 57 135 -111 227 190 730 -367 -679 126 832 532 -116 -307 99 12 173 150 -61 -34 4 -18 -52
6866 -52 -20 -82 -29 57 -67 -9 97 13 -14 -93 -62 -152 -54 73 44 22 -56 9 0 42 138 -24 -25 46 -3 -54 -31 -47 42
6895 42 14 -130 -4 44 -58 169 -76 -15 70 -18 26 60 31 102 5 72 144 -27 -164 -59 23 -13 8 79 126 -78
6921 -78 -45 -55 -21 40 37 63 85 69 28 47 4 -25 0 4 -9 -144 -15 36 -33 50 -27 28 -62 -83 67 -13 -32 23 -81
6950 -81 -38 33 -30 69 -56 -39 16 -48 24 70 -152 -127 130 -26 -80 35 44 -32 3 42 -41 54 -4 51 -6 79 69 100
6978 100 -21 -22 -122 5 -153 58 -18 -39 -126 30 -21 -118 -102 -18 -20 -15 45 -31 3 -66 20 -1 -87 -115 50 74 17 114
7006 114 46 8 75 -1 122 -114 69 -41 49 -72 -33 51 -26 27 66 -1 -49 -54 -25 18 64 142 -22 -2 16 8 -15 48
$$ packed form
6819e4J02m5p0L5M0j68J78Q7l5L8p9q9L5N5J40j18j38j96L98j63O8k77L76q3L00
6844C37k80P8k46L38l7N40j097l12Q05P06l00o48j91M06q7J61k3k11K7L8k2l4
6866e2L2o2N3Q6j24N8J06q4k7p9L1r0R8J27k9k2p8O5rM2R6j62jP1m9n1K3j6Q9
6895D2k8j44J26M8j02K27k45O1Q5q8M4L4k9P1r7O7P2j71j37J05Q2l6K1P1M7k04
6921g8L3j0L4O1lK6K2j6m1J9m3k9K5Mj3j35J29N1o9Q3p7N5r0k1J50q0j9N5j04
6950h1M3P1o3R9j25J7N5o4P2M6k22K5K57j56n4J15Rp6L5L9q3R5n8N5n7Q5j0L1
6978A00j21jj00J27j58K11p6k1q7J56n1r7J6Q4kNO0p6L4o9Q6k1q6k8J65K4n7R7
7006A14o8l8O7p6J23k36J83j10R0j21L9Q4p7N3L9o7m8nK9M3M6P8j64K0J8qk3O3
$$ plain form
7034 48 101 73 56 116 -10 16 93 41 -27 30 -19 12 -45 -45 220 -90 20 84 -111 56 -12 -1 58 -24 -29 -38 -83 87
7062 87 -7 5 29 98 2 -20 66 47 2 -83 -83 -29 -146 -109 87 3 -5 -32 18 85 53 -8 -5 -38 -56 26 67 32 72 66 -52
7093 -52 106 48 -53 6 -46 -28 17 -123 51 15 62 -122 -150 179 -177 -105 54 -53 -64 4 -25 35 11 -22 -36 137
7119 137 7 -30 -13 23 27 51 22 -74 -48 -63 21 60 -45 0 66 3 49 -56 -114 -33 -54 -33 48 -29 91 -32 91
7146 91 -62 -121 6 -1 -30 -40 47 86 -50 -5 -11 -35 -110 -16 44 23 -120 50 13 52 80 -29 88 -73 -17 36 1
7173 1 9 -12 -58 65 71 102 -142 8 -37 -88 35 36 30 -122 -71 -29 -66 -19 -50 -26 36 -103 -31 45 45 29 -63 27 -40 -78
7203 -78 -59 -38 94 -21 -131 -49 110 98 -20 53 59 -102 44 -49 99 14 87 -81 -83 93 33 68 70 59 -62 -37
7229 -37 36 60 -31 72 -82 8 -121 -53 -8 9 87 -53 -104 77 -31 -11 -20 87 -37 -21 -33 -85 -20 37 3 -23 -39
$$ packed form
7034D8N3k8j7O0j26K6P7n2o8N7m9L1n7%K65l10J10O4j95J67o8J1N9q2nrm5J70
7062H7r4J2K4O9r6k2Q6j9m5q5%N4j17L7J96q4qk7N0O7l2o1Ll3j8Q2M1l5M0oj18
7093e2J58n8j01N9n2J8M5j40J74l6M7j84k8L29l56P2J59j07j1O8k9O0k4l3j4J73
7119A37j30l7J7L6MK4k9r6K6j5Q4L9j05M5O6o3M6j05n8Q1k1K1Q1p7J20j23J23
7146I1j53n9J27pk9j0Q7L9j36M5ok4p5R4O0k1j43J70l7L9K8j09J17j61N6N3l5
7173AQk1m6J23OL1k44J50m5n1J23Joj52N1M2l7M7l1K4O2j39P2P6%j6r2R0o7l8
7203g8J9K1J32j15j10Q2J59j2j18P3Oj61J46r3J48q5P3j68kJ76o0L5Kj1j21K5
7229c7P3K4r1J03j54R0j29O8M5J7P8j40n1J81j08K0rJ07j24J6j2n2O5N7l4k6j6
$$ plain form
7256 -39 37 -30 -64 -24 -24 88 -48 -2 65 59 -17 10 -17 94 54 -58 -79 18 18 17 -2 -136 -67 63 -33 26 36 -84 -36
7285 -36 -79 -87 40 21 8 22 -45 -23 -5 -19 3 -30 -41 15 -111 -102 -62 31 -23 29 -15 -83 7 -26 8 115 66 -1 147
7314 147 -74 -18 181 -252 -19 -38 14 -16 -15 -13 47 36 74 72 91 -8 60 -51 67 -68 27 -7 10 -90 -72 64 -20
7341 -20 38 -9 22 26 74 -69 -76 -69 -28 48 -42 37 9 23 29 48 -45 38 78 -8 81 22 68 -74 -92 24 -50 31 -95 108
7371 108 35 107 12 -16 -52 -1 155 -10 -4 -9 35 -57 -26 -28 -37 -4 32 42 13 69 49 31 -51 15 26 -85 -47 -58 64 36
7401 36 -65 -25 -89 19 20 -84 106 54 60 -26 -41 -90 -67 45 14 11 -60 -107 -57 19 -11 10 24 -33 11 -22 -32 -29 4 -38
7431 -38 30 -90 87 -13 -54 130 21 22 42 -52 -33 41 -86 -5 -90 -53 86 -25 12 30 -51 -93 42 10 65 -81
7457 -81 59 17 -51 -36 -49 71 42 -14 41 24 -50 -59 38 -38 -11 -76 -35 -129 28 -28 55 -1 25 90 -1 -63 -23 -34 50
$$ packed form
7256c9P6o7l4M0%J12j36M6O7op6K7k7J11m0j12k1R7%jj9j34O9J30r6N9J0j20M8
7285c6m3qJ27j9j3J4o7K2J8j4K2l3j1N6j26RM0R3n4N2m4o8R0l3L4J07m9o7J48
7314A47k21N6J99m33K33j9N2l0JKO0j1L8kJ9r9O8j11J18j35R5l4J7j00J8J36q4
7341b0N8m7L1MM8j43pPM1P6r0P9k8J4OJ9r3Q3M0q6Q9n9M6j42j8J16p4Q1j26K03
7371A08p3P2r5k8l6N1J56j65OnM4r2L1krL3L6J0k9N6k0j8q2O6J1j11L8j1J22k8
7401C6j01M0o4J08Jj04J90n2Oq6j5m9K3J12l1lp1m7N0P6l0K1J4n7M4l3j0LL3m2
7431c8O8j20J77j00m1J84j09JK0r4J9P4j27Q1q5L7J39j11L7J8q1m2J35l2N5j46
7457h1J40m2o8J5j3J20k9n6N5j7p4rR7p6K7o5M1r4J57n6Q3n6K6O5r1o2M0j1Q4
$$ plain form
7486 50 120 8 2 -75 -18 49 3 -6 81 17 2 -80 -95 -41 -4 -142 80 -152 53 1 187 50 330 -86 -231 -273
7512 -273 -485 257 533 -43 126 -182 -256 364 149 -30 -44 63 -135 87 -59 33 -80 155 14 -20 144
7533 144 118 24 23 17 81 6 115 39 40 -71 -40 -47 -118 -20 52 -45 4 63 1 -56 52 -29 118 23 61 73 92 67 109 -113
7563 -113 -31 24 4 -19 -60 -95 77 -26 -109 -37 -30 -32 0 -37 58 13 -53 -7 77 46 17 -6 75 22 -20 27 120 65 -46
7592 -46 38 -69 81 41 -21 -3 -39 23 22 79 1 29 17 -28 -82 43 -86 19 39 50 46 91 -23 -18 -30 50 105 -86
7620 -86 -51 53 89 -7 22 9 56 25 -30 45 131 -11 77 10 23 -9 28 49 -38 31 29 68 -33 -6 -1 32 26 -68 -2 -116
7650 -116 -2 61 33 105 -50 20 -143 -2 -111 9 -55 -97 -58 -1 35 47 72 -48 10 -89 31 28 17 105 -56 -42
7676 -42 -55 120 -49 7 24 -45 -33 4 -86 -22 44 -24 -5 -73 -41 36 -10 -37 -9 -47 28 -35 63 -45 3 -75 -12 -14 -50
$$ packed form
7486E0P0j12op7N7O7m6rQ7o4j5q2j5N4L7j38K22k32K05n2J86j37K80m16j45m2
7512b73k12P42K76n76J69l08p4O20k15j79j4J07j98K22j46R2j13K35j41l4J64
7533A44k6r4joO4p5J09p6Jj11L1pp1R8P2r7M9N9o2n7J08q1J47r5L8J2J9k5M2k22
7563a13Q2N5k0k3m1l5J72j03q3P2PkL2l7R5m5o6M6Q4l1k9k3Q1n3m2M7R3n5j11
7592d6Q4j07J50m0o2J8l6O2jN7p8K8j2m5n4J25j29J05K0J1mM5j14Nj2Q0N5j91
7620h6L5J04L6r6K9j3M7l1n5P5Q6j42Q8o7J3l2L7K1q7O9kL9j01K7NL3or4O6j14
7650a16J14O3k8P2j55P0j63J41j09J20o4m2L9N7L6J2K5j20N8r9J20lj1Q8j61J4
7676d2j3J75j69N6J7o9J2L7r0O4O6o8J9o8L2P7m6k7K8l8P5o3R8j08M8p8O3kl6
$$ plain form
7705 -50 52 -10 22 -154 114 39 -28 59 10 -17 38 3 67 -24 -81 -38 -32 121 -3 23 -51 -2 -82 32 11 -90 57
7732 57 42 -75 -11 -62 58 -13 -64 -87 -75 31 -51 5 -65 11 -60 22 21 59 -26 -55 21 -73 8 -136 20 23 -13 108
7760 108 -161 -23 -122 -94 -19 147 -4 56 25 17 36 -28 10 38 45 4 -39 102 -2 -95 -42 -39 19 -39 70 25 43 -42
7788 -42 12 44 -56 -43 -40 72 25 56 -15 64 -37 37 -79 -20 115 -52 107 33 114 66 -55 29 -24 28 -29 -31 51
7815 51 -36 118 47 -33 -48 -29 -88 26 142 -40 -73 44 0 -14 26 -3 -86 -62 52 -4 34 -55 -3 -68 -30 32 0
7842 0 12 13 -70 34 16 -65 44 -52 -14 -3 26 36 15 79 -6 14 49 23 13 -30 -33 -9 -118 -8 -83 88 -1 45 14
7871 14 107 28 40 3 47 -45 47 -10 -2 55 28 120 -108 99 -64 -61 48 96 34 91 -18 56 42 74 7 -37 43 -77
7899 -77 37 25 -10 15 -6 89 66 12 -23 21 7 3 25 -8 -28 61 -8 -16 65 78 37 -7 -15 -65 -30 8 76 -37 -32 -102 111
$$ packed form
7705e0J02o2L2j76K68p5o7Q7m9k7N5l5O4r1n7M3OJ53j24K6p4M9q0J14k1j01J47
7732E7j5j17O4n1J20p1n1k3J2J06q2N6p0P6p1Q2jL8q5k9P6r4Q1j44J56Ll6J21
7760A08k69J38r9K8P5J66j51O0l1qJ9o4L8K8Pm1m3J41j04r3N3LN8n8J09m5J8q5
7788d2N4L2j00J3LJ12m7L1p1P9j01P4j16N9J35j67J59p4Q1m8j21Q4n3N2n7kQ2
7815E1q7J54p1q0j5J9n9J14J16j82l3J17m4j4M0k9q3K4J14n6L8q9N2o5L8O2l2
7842@J2Jq3J04j8q1J09r6L8J1K9J0k1O4q5K0L5k6j0m3lK4j09J10p5J71q9M6l1
7871A4R3p9J2l7M4r2R2n7QN7k7R2k28K07j63LJ09M8o2N7j09P4j4L2o7m4Q0j20
7899g7J14j2l5K5k1R5k3n4l5M4j4mK2l3k0Q9o9qQ1J3m1m4qn0L5L8O8j13Np0K13
$$ plain form
7930 111 36 332 -38 -328 -109 -83 71 -19 150 -63 79 -12 -53 78 112 -86 38 68 -3 0 -84 51 81 29
7954 29 87 -10 5 -5 41 99 -90 33 -120 -4 30 5 -21 54 18 -109 -34 105 29 28 7 -35 -68 -35 -6 -64 42
7981 42 -9 43 90 -64 12 16 -45 -56 -59 46 61 81 31 -7 50 54 9 27 33 26 -41 48 -37 44 -134 -142 -85 -36 3 -45 19 -121
8013 -121 -103 65 -44 21 -140 64 -51 -29 -13 -36 62 38 82 65 42 77 24 -155 11 -41 63 -37 -60 -56 -17 -16
8039 -16 34 38 -28 -97 3 -54 0 -33 -80 -75 -121 -88 -27 -76 69 47 -18 99 6 10 -67 27 31 -62 25 72 -27 -43 28 49 -36
8070 -36 15 -21 40 18 -10 -54 -23 101 81 -11 162 31 47 -21 -11 64 -55 53 -48 -23 13 60 46 101 -74 -9 -81
8097 -81 109 5 -26 21 -7 -159 63 -33 -76 -59 -49 1 2 26 72 -106 -45 101 -23 36 -19 -29 -103 46 -22 -36 109
8124 109 79 -9 91 32 -41 -52 -44 -20 75 -29 -1 20 7 -128 -5 0 -69 156 166 145 -86 41 34 77 -24 -105 -34
$$ packed form
7930A11p5K96l70k90K19K6J54r0J69k13J42r1m1J31L4j98J24L0p1Lq4J35L0n2
7954B9N8r7J5j0M6N8j89J23j53J16L4k5k6P5l6j27P5J39p6jk1m2l3L3K9n8J06
7981D2n1N2M7j54P6Mo1j1lJ05J5K0n0l8N7Mm5J8Opo7Q9q5Q1j78qN7M9L9m8O4j40
8013a21J8J68j09O5j61K04j15K2J6k3R8k4M4j7k3L5n3j79J66n2J04j00k3ML9J
8039a6N0Mo6o9J00n7N4l3m7Nm6L3O1m9J45k2o5J17r3Mp7R4Mr3Q7M7r9j6P1K1q5
8070c6N1l6O1k2k8m4L1J24k0r2J73j31J6o8J0P5j19J08j01K5L6M7j4N5j75O5p2
8097h1J90j04l1M7k8j52K22r6m3J7J0N0JK4M6j78O1J46j24N9n5j0p4J49o8j4J45
8124A09l0q8J00n9p3j1QK4R5j04K8K1j3j35J23No9K25J0k1k31J27pM3j01q1P1
$$ plain form
8151 -34 -149 -63 38 82 -96 58 -3 -7 -21 -44 -81 -68 80 -18 59 2 71 22 -21 19 56 38 18 -22 -128 -53 129
8178 129 26 67 48 0 87 -65 -87 -56 2 -96 -90 -46 -105
$$ packed form
8151c4j15Q6J01M4j78J54o1mj4k3l7J3J48r8P7n7O9m9m3M0L7j8k0m0j06P5J82
8178A29j03M1j9m8Q7j52k2L1N8r8OM4n9
8191a05
$$ Imaginary data points
##PAGE= N=2
##DATA TABLE= (X++(I..I)), XYDATA
$$ plain form
0 0 0 0 0 0 0 0 0 0 0 0 0 0 3 -8 8 -8 8 -16 16 -16 24 -24 32 -32 40 -48 56 -64 72 -88 96 -112 128 -144 160
35 160 -184 205 -229 256 -285 317 -352 389 -431 477 -525 581 -639 706 -777 855 -943 1041
53 1041 -1148 1269 -1407 1563 -1744 1955 -2205 2509 -2884 3361 -3991 4869 -6166 8295 -12375
68 -12375 22956 -108712 -184478 147112 106145 -110023 -45981 97147 -19329 -47119 83784
79 83784 23014 -136250 -6774 134945 -9294 -101570 52788 68798 -73945 -30832 83339
90 83339 -22811 -97566 43956 82955 -60702 -45337 74665 6974 -80927 25045 66593
101 66593 -56508 -47433 80677 28798 -77836 11543 78863 -45993 -75148 62660 55638
112 55638 -72478 -30727 72531 4974 -61764 21441 39365 -55515 -25067 75615 12420
$$ packed form
0@%%%%%%%%%%%%Lj1J6j6J6k4L2l2M0m8N6o4P2q8J04j20J36j60J84k08K40k72L04
35A60l44L89m34M85n41O02o69P41q20R08j002J106j220J345j483J632j798J984
53A041k189K417k676K970l307L699m160M714n393O245p352Q860j1035J4461k0670
68a2375L5331j31668p5766L31590m0967k16168O4042J43128j16476k7790J30903
79H3784o0770j59264J29476J41719j44239r2276J54358J6010j42743M3113J14171
90H3339j06150p4755J41522L8999j43657J5365J20002o7691q7901J05972M1548
101F6593j23101R075J28110n1879j06634Q9379O7320j24856k9155J37808p022
112E5638j28116M1751J03258o7557o6738Q3205J7924r4880L0448J00682o3195
$$ plain form
123 12420 -77554 7775 75025 -23383 -62887 37990 46552 -49160 -27913 56121 13272 -52727
135 -52727 -2394 36205 -12615 -17416 26566 -2560 -40709 18081 50102 -26716 -49139 32077
147 32077 41601 -29783 -22444 28317 -975 -28950 23308 29792 -39620 -27140 46653 15721 -49373
160 -49373 -3017 42126 -15688 -31184 37477 22654 -52011 -11063 59607 -1648 -56512 16996
172 16996 47596 -28201 -29416 39247 8831 -47886 7388 43657 -28458 -36030 43999 22380
184 22380 -52809 -3761 56023 -13975 -53223 26905 42130 -32905 -17466 41966 -4322 -41756
196 -41756 26333 33569 -48785 -28046 57526 16795 -55667 644 45982 -22247 -35082 36591
208 36591 15851 -48094 5080 57334 -15549 -49715 28717 35718 -39738 -18066 44665 -2356
$$ packed form
123A2420q9974Q5329O7250r8408l9504J00877Q562r5712K1247Q4034m2849o5999
135e2727N0333L8599m8820m801M3982k9126l8149N8790L2021p6818k2423Q1216
147C2077R524p1384P339N0761k9292k7975N2258O484o9412J2480P3793l0932o5094
160d9373M6356M5143n7814j5496O8661j4823p4665M0948P0670o1255n4864P3508
172A6996L0600p5797j215O8663l0416n6717N5274L6269p2115p572Q0029k1619
184B2380p5189M9048N9784o9998l9248Q0128J5225p5035J5439N9432m6288l7434
196d1756O8089P236q2354K0739Q5572m0731p2462N6311M5338o8229j2835P1673
208C6591k0740o3945N3174N2254p2883l4166P8432P001p5456K1672O2731m7021
$$ plain form
220 -2356 -43048 23440 37189 -40227 -29090 44587 10100 -49330 6054 45916 -20198 -33160
232 -33160 34526 18934 -41014 -609 42395 -16000 -35336 33771 28272 -43465 -16214 45513
244 45513 -1818 -45257 14974 34274 -29242 -21076 38630 5247 -43947 9096 42513 -21314
256 -21314 -32602 34407 22315 -38545 -5621 40077 -9487 -36794 22268 28580 -32173 -17824
268 -17824 35806 1165 -38516 10894 32010 -23888 -22954 33107 12777 -35682 1199 35728
280 35728 -13188 -28548 26368 20633 -32489 -7181 35212 -6698 -34900 16644 26437 -28490
292 -28490 -17712 34163 4208 -37081 8226 33081 -20334 -25112 30819 16699 -33532 -1975
304 -1975 36508 -9577 -32707 20921 24199 -29882 -13472 33438 -4 -35037 9903 28684
$$ packed form
220b356m0692O6488J3749p7416J1137P3677l4487n9430N5384L9862o6114j2962
232c3160O7686j5592n9948M0405M3004n8395j9336O9107n499p1737K7251O1727
244D5513m7331m3439O0231J9300o3516Q166N9706l3383m9194N3043L3417o3827
256b1314j1288O7009j2092o0860L2924M5698m9564k7307N9062O312o0753J4349
268a7824N3630l4641l9681M9410K1116n5898R34N6061k0330m8459L6881L4529
280C5728m8916j5360N4916n735n3122K5308M2393m1910k8202N1544R793n4927
292b8490J0778N1875k9955m1289M5307K4855n3415m778N5931j4120n0231L1557
304a975L8483m6085k3130N3628L278n4081J6410M6910l3442l5033M4940J8781
$$ plain form
316 28684 -22314 -22280 29146 11660 -31790 1978 32169 -12541 -25698 23244 18675 -28138 -6674
329 -6674 32105 -4329 -30325 14855 22628 -26178 -15234 29891 2756 -32324 7788 29025
341 29025 -18582 -22751 26869 13339 -30336 354 32774 -10038 -26882 21416 20079 -28736
353 -28736 -10800 31724 -1333 -32097 11561 25802 -22918 -19198 27356 7206 -30509 4050
365 4050 29777 -13401 -23149 23424 16129 -27726 -4300 30378 -5292 -26480 15558 20365 -23616
378 -23616 -13074 26418 816 -29073 8390 25028 -18345 -19099 24391 9972 -27006 539
390 539 27539 -9043 -21829 19868 16595 -25412 -6718 28497 -3425 -28101 11363 22186 -19957
403 -19957 -15955 23431 4576 -26983 5035 24764 -14918 -19675 23433 13790 -25746 -3346 27638
$$ packed form
316B8684n0998L4N1426j7486m3450L3768L0191m4710j3157M8942m569m6813K1464
329f674L8779l6434k5996M5180P773m8806J0944M5125k7135l5080M0112K1237
341B9025m7607m169M9620j3530m3675L0690L2420m2812j6844M8298j337m8815
353b8736J7936M2524l3057l0764M3658J4241m8720L720M6554k0150l7715L4559
365D050K5727m3178r748M6573p295m3855K3426L4678l5670k1188M2038M807m3981
378b3616J0542L9492k5602k9889L7463J6638m3373p54M3490j4419l6978K7545
390E39K7000l6582j2786M1697l273m2007J8694L5215l1922k4676L9464J0823m2143
403a9957M002L9386j8855l1559L2018J9729l9682m757M3108r643l9536K2400L0984
$$ plain form
416 27638 -4842 -23777 14701 18566 -21552 -10217 24872 -459 -26899 7498 21625 -16930
428 -16930 -16757 22331 8488 -25460 738 25009 -9256 -19774 18424 14360 -21789 -4102 25497
441 25497 -4759 -25144 12783 20935 -20058 -15064 22453 4362 -24422 4082 20771 -14066
453 -14066 -16398 21617 10221 -25205 -1230 26718 -5673 -21205 14778 15514 -20000 -6596 23100
466 23100 -3041 -23989 11032 19945 -20028 -15421 23044 5596 -25560 2429 23968 -9503
478 -9503 -18280 16612 11401 -20024 -697 23403 -7004 -20661 15333 16434 -20713 -11257 21177
491 21177 1801 -20806 6752 16304 -17111 -12420 22078 5160 -24808 2542 25473 -7420
503 -7420 -19868 13988 13989 -17512 -4656 20422 -3415 -18757 11033 14124 -18457 -9861 21093
$$ packed form
416B7638l2480j8935L8478L865m0118J1335L5089k5331k6440L4397J4127l8555
428a6930J73L9088j3843l3948K6198K4271l4265j0518L8198m064l6149J7687K9599
441B5497l0256k0385L7927Q152m0993M994L7517j8091k8784K8504J6689l4837
453a4066k332L8015j1396l5426K3975K7948l2391j5532L5983P36l5514J3404K9696
466B3100k6141k0948L5021Q913l9973M607L8465j7448l1156K7989K1539l3471
478i503q777L4892n211l1425J9327K4100l0407j3657L5994J101l7147R456L2434
491B1177j9376k2607K7558R552l3415M691L4498j6918k9968K7350K2931l2893
503g420j2448L3856Jl1501J2856K5078k3837j5342K9790L091l2581Q596L0954
$$ plain form
516 21093 2134 -22952 3621 19781 -10771 -14153 15924 6950 -17556 3399 20330 -10341
528 -10341 -19031 16766 16944 -18685 -10273 18899 1826 -17553 5086 11366 -14357 -7528 19536
541 19536 2471 -22059 2160 20171 -7536 -14438 13953 9394 -16007 -645 18742 -5367
553 -5367 -18044 10759 14841 -14703 -9203 16432 241 -19330 4672 16763 -10326 -13337 13675
566 13675 8002 -14587 -395 14833 -6960 -11912 15702 10922 -18755 -6894 19616 1845 -18060
579 -18060 3373 13046 -10281 -8341 14249 501 -18836 4361 19066 -8187 -15818 11873 11213
592 11213 -13332 -3439 15326 -2445 -12704 10274 10114 -15512 -6587 17187 609 -18335 4110
605 4110 16058 -10156 -13754 12294 6910 -14237 528 15182 -6157 -12438 12829 10611 -15728
$$ packed form
516B1093j8959k5086K6573J6160l0552l382L0077q974k4506K0955J6931l0671
528a0341q690L5797J78l5629Q412K9172j7073j9379K2639O280k5723O829K7064
541A9536j7065k4530K4219J8011k7707o902K8391m559k5401J5362J9387k4109
553e367j2677K8803M082k9544N500K5635j6191j9571K4002J2091k7089l011K7012
566A3675n673k2589J4192J5228k1793m952K7614m780k9677J1861K6510j7771j9905
579a8060K1433R673k3327J940K2590j3748j9337K3197J4705k7253p631K7691o60
592A1213k4545R893J8765j7771j0259K2978j60k5626Q925K3774j6578j8944K2445
605D110J1948k6214l598K6048n384k1147J4765J4654k1339o281K5267k218k6339
$$ plain form
618 -15728 -5667 17888 1716 -15436 4015 10235 -11119 -6328 14617 71 -18132 3728
630 3728 17220 -8731 -15006 11592 9686 -12534 -1136 14689 -4047 -12888 9877 10690 -12973
643 -12973 -5799 15003 166 -15633 4708 12366 -10601 -10041 12328 4585 -13568 537 12253
656 12253 -6615 -9445 13100 7629 -15001 -2861 16417 -352 -13850 4931 10428 -8510 -5291
669 -5291 11591 -1077 -15088 3995 13408 -8297 -11014 10458 6645 -11680 -1125 12311 -3709
682 -3709 -10111 9704 9008 -11504 -4123 13184 -354 -13019 4766 10897 -9217 -9111 10416 3607
696 3607 -12441 538 10653 -5997 -8167 10720 5787 -12858 -1913 14772 -446 -12097 5184
709 5184 9368 -8235 -4558 10309 -759 -12289 4180 10742 -8843 -9962 10261 5256 -11702
$$ packed form
618a5728J0061K3555j6172j7152J9451O220k1354M791K0945j4546j8203K1860
630C728J3492k5951o275K6598j906k2220J1398J5825j8736q841K2765Q13k3663
643a2973P174K0802j4837j5799K0341P658k2967N60K2369p743j8153J4105J1716
656A2253j8868k830K2545n471k2630J2140J9278j6769j3498J8781N497j8938L219
669e291J6882j2668j4011J9083R413k1705k717K1472l813j8325J0555J3436j6020
682c709o402J9815o96k0512P381J7307j3538j2665J7785O131k0114J06J9527o809
696C607j6048J2979J0115j6650k170J8887m933j8645J0945J6685j5218j1651J7281
709E184M184j7603L677J4867j1068j1530J6469O562j9585j119K0223n005j6958
$$ plain form
722 -11702 -654 11526 -3484 -8992 8107 7012 -9803 -2290 12224 -864 -11450 5342 9435
735 9435 -9295 -7016 10188 2188 -11375 1211 9379 -6220 -7918 9215 4740 -11130 -167
748 -167 12289 -2474 -9775 6549 7985 -8252 -3640 10174 -378 -10514 3986 8683 -8228
761 -8228 -7059 9198 2852 -10697 66 9703 -3713 -7853 7149 5659 -8411 -1157 10294
774 10294 -1528 -8910 5454 7698 -7629 -5355 8597 1400 -9895 1207 7884 -5638 -6503
787 -6503 7420 3282 -9069 -265 9803 -2000 -8017 5985 6963 -7304 -3032 9146 -81 -8863
801 -8863 3323 7581 -6491 -6281 7567 2396 -9810 -146 8566 -3883 -7284 6559 5053 -7770
815 -7770 -1562 9326 -674 -7974 4637 7368 -6471 -4138 8179 931 -8832 1559 7414 -5235
$$ packed form
722a1702J1048J2180j5010n508J7099j095j6815P513J4514j3088j0586J6792M093
735I435j8730K279J7204q000j3563J2586Q168j5599j698J7133m475j5870J0963
748a67J2456j4763p301J6324J436j6237M612J3814j0552j0136J4500M697j6911
761h228J169J6257o346j3549J0763R637j3416m140J5002j490j4070P254J1451
774A0294j1822p382J4364K244j5327K274J3952p197j1295J1102O677j3522q65
787f503J3923m138j2351Q804J0068j1803o017J4002R78j4267M272J2178r227q782
801h863J2186M258j4072K10J3848n171j2206R664Q712j2449l401J3843j506j2823
815g770O208J0888j0000p300J2611K731j3839K333J2317p248r763J0391N855j2649
$$ plain form
829 -5235 -6731 6709 3476 -8515 -706 8663 -2412 -7193 5837 5882 -6826 -2311 8665 200
843 200 -8165 3191 7108 -5826 -5172 7148 1469 -8583 662 7322 -4085 -6633 5968 4390
857 4390 -7614 -1095 8349 -1282 -6853 4734 6031 -5844 -3056 7499 626 -7837 1997 6622
871 6622 -5217 -5558 6070 2262 -7652 -381 7023 -2564 -5943 5036 4795 -5998 -1594 7816 -180
886 -180 -6721 3307 6029 -4839 -4129 6009 1554 -7085 432 6144 -3847 -5773 4986 3112 -6518
901 -6518 -1079 6894 -891 -5868 3789 5427 -4898 -2552 6658 693 -6474 1962 5661 -4397 -4863
916 -4863 5158 2175 -6834 -438 6225 -2465 -5739 4446 3909 -5640 -1296 6914 -109 -6099 3169
931 3169 5826 -4285 -3682 5964 1399 -6438 578 5388 -3530 -5049 4383 2711 -5992 -1105 6031
$$ packed form
829e235j496J3440l233j1991P809R369j1075m781J3030M5j2708M515J0976q465
843B00q365J1356L917j2934O54J2320n679j0052R245O660j1407k548J2601j578
857D390j2004O519R444r631n571J1587J297j1875K788J0555o873q463R834M625
871F622j1839l41J1628l808r914P271P404r587l379J0979k41j0793M404R410p996
886a80o541J0028K722j0868P10J0138m455q639P517N712r991j926J0759j874r630
901f518N439P973p785m977R657J638j0325K346R210n965p167Q436L699j0058m66
916d863J0021k983r009O396O663q690l274J0185n37r549M344Q210p023n990R268
931C169K657j0111O03R646m565p837P016M810q918j519R432j672q703M887P136
$$ plain form
946 6031 -1406 -5445 3840 4511 -4452 -1870 6134 530 -5643 2011 5244 -3670 -3880 4949 1396 -6282
962 -6282 -239 5254 -2425 -4963 3480 3198 -4890 -1295 5522 -529 -4837 3511 4758 -3990 -2721
977 -2721 5455 1135 -5613 680 5037 -2855 -4424 3781 1830 -5615 -900 5204 -1243 -4807 2966
992 2966 4032 -3832 -1939 5075 746 -4359 2063 4467 -3220 -2999 4343 1254 -5143 216 4770
1007 4770 -2420 -4858 3327 2673 -4659 -1294 5056 -175 -4434 2389 3923 -3271 -2176 5030 1327
1022 1327 -4719 833 4543 -2655 -3832 3194 1844 -4522 -534 4267 -2020 -4763 3181 3439 -4157
1037 -4157 -1917 5103 1013 -4219 1223 3930 -2321 -2294 4364 1232 -4705 14 4156 -2360 -4327
1052 -4327 2454 2251 -3817 -1105 3826 -1145 -3812 2756 3357 -3450 -1498 4700 849 -4495 972
$$ packed form
946F031p437m039R285O71q963K582Q004n604o173P654L233q914k10Q829l553p678
962f282O043N493p679k538Q443k82q088L595O817o051m308Q348J247q748J269
977b721Q176m320o748O293M357p892j569Q205j951p445M715O104o447l564P773
992B966J066p864J893P014m329n105O422K404p687K21P342l089o397N359M554
1007D770p190k438Q185o54p332L365O350n231m259O823J534p194J095P206l703
1022A327o046N552L710p198j177P026j350o366L988M801o287k743P944K58p596
1037d157K240P020m090n232N442K707o251K7O658l132n937M719M142o516j967
1052d327O781k03o068K712M931m971k667O568O01o807J952O198l851n344N467
$$ plain form
1067 972 4175 -1916 -3082 3258 1603 -4251 -631 3468 -1517 -3692 2422 2717 -3550 -1888 3889
1082 3889 477 -3543 1533 3728 -2043 -1842 3383 891 -3799 430 3910 -1605 -3628 2467 1936
1097 1936 -3829 -1449 3210 -251 -3033 1739 2408 -2653 -1469 3680 766 -3542 1191 4110 -1897
1112 -1897 -2984 2429 1700 -3257 -459 3120 -1318 -3528 2058 2352 -3651 -1730 3947 905 -3485
1127 -3485 701 3212 -1468 -1872 3109 1299 -3103 419 3744 -1648 -3367 2125 2177 -3006 -1439 2851
1143 2851 -540 -3353 1362 2473 -2514 -1355 3646 807 -3473 893 3583 -1437 -2569 2775 1897
1158 1897 -2926 -402 2932 -1533 -3136 2106 2078 -3359 -1584 3514 254 -3624 825 3219 -1586
1173 -1586 -1525 3012 943 -2912 607 3274 -1326 -2733 2172 1880 -3059 -1221 2576 -677 -2740 1229
$$ packed form
1067I72L203o091j166O340j655n854L620M099m985k175O114K95o267J662N777
1082C889l412m020N076K195n771K01N225k492m690M229L480n515k023O095n31
1097A936n765K380M659l461k782M772O69n061J184N149k914m308M733K919o007
1112a897j087N413p29m957K798L579m438k210N586K94o003J921N677l042m390
1127c485M186K511m680m04M981j810m402L522L325n392j719N492N2n183J567M290
1143B851l391k813M715J111m987J159N001k839m280M366K690n020j132N344q78
1158A897m823K524L334m465j603N242k8n437J775N098l260l878M449K394m805
1173a586O1M537k069l855L519K667m600j407M905k92m939J838L797l253k063L969
$$ plain form
1189 1229 2019 -2410 -1335 2857 410 -2967 1037 3218 -1394 -1965 2504 1374 -2507 -123 2572
1204 2572 -980 -2312 1662 1449 -2950 -1257 2707 -194 -2908 634 2278 -1456 -1380 2396 849 -2282
1220 -2282 740 2795 -1164 -2148 1957 1547 -2485 -949 2257 -371 -2496 774 1496 -2137 -1304 2320
1236 2320 215 -2310 678 2524 -1053 -1573 2010 1438 -1939 -99 2368 -637 -2128 1308 1259 -2256
1252 -2256 -1144 2137 -60 -2642 416 1976 -1373 -1504 1986 804 -2041 384 2364 -630 -1837
1267 -1837 1698 1597 -1948 -903 2157 -248 -2449 640 1493 -1743 -1268 1779 336 -2222 235 2341
1283 2341 -904 -1627 2002 1306 -1735 -129 2167 -366 -1897 1110 1436 -2010 -1189 1918 -4 -2400
1299 -2400 435 1820 -1483 -1495 1613 644 -1874 190 2268 -467 -1511 1738 1547 -1786 -454 2061
$$ packed form
1189A229P90m429J075M192k447l377M004K181m612n71M469j130l881K384K695
1204B572l552j332L974k13m399J693L964k901k714L542J644l734P6L776j547l131
1220b282L022K055l959r84M105m10m032J536L206k628k125L270P22l633Q33L624
1236B320k105k525K988J846l577n20L583n72l377J840K467l005j491L436m9l515
1252b256J112L281k197k582L058J560l349j31L490j182k845K425J980k994j207
1267a837L535j01l545J045L060k405k201L089Q53l236M75L047j443k558K457K106
1283B341l245p23L629o96l041J606K296k533j531L007L26l446Q21L107j922k396
1299b400K835J385l303j2L108r69k518K064K078k735j044L249j91l333J332K515
$$ plain form
1315 2061 -271 -2106 647 1586 -1714 -1478 1667 191 -2169 277 1970 -984 -1375 1601 1123 -1662
1331 -1662 -189 2203 -199 -1743 1253 1339 -1555 -863 1764 -114 -1981 434 1580 -1310 -1335 1511
1347 1511 513 -1888 149 1849 -587 -1306 1386 1235 -1398 -447 1911 -150 -1767 720 1379 -1489
1363 -1489 -1095 1417 219 -1918 27 1599 -896 -1402 1393 925 -1505 61 1723 -75 -1233 967
1379 967 1233 -1214 -749 1499 10 -1744 426 1167 -1141 -1219 1231 361 -1590 -86 1689 -339 -1170
1396 -1170 1064 1103 -1128 -331 1685 121 -1353 556 1191 -1066 -984 1200 276 -1640 -105 1092 -694
1413 -694 -1206 1027 856 -1222 -190 1609 52 -1189 727 1280 -939 -628 1309 202 -1333 222
1429 222 1182 -794 -1138 1047 395 -1411 -310 1400 -428 -1309 986 1090 -1065 -453 1415 191 -1266
$$ packed form
1315B061k332j835K753R39l300K36L145j476k360K446J693k954l91K976m78k785
1331a662J473K392k402j544K996Q6k894O92K627j878j867K415J146k890k5K846
1347A511r98k401K037J700k436p19K692j51k633R51K358k061j617K487O59k868
1363a489L94K512j198k137J945J572k495n06K795m68k430J566J662j798j158K200
1379I67K66k447M65K248j489j754K170P41k308p8K450q70j951J504J775k028q31
1396a170K234L9k231P97K016j564j474J909O35k257Q2K184r24j916J535J197j786
1413f94n12K233j71k078J032J799j557j241J916N53k219L11J937j107j535J555
1429B22R60j976l44K185o52j806J101J710j828q81K295J04k155O12J868j224j457
$$ plain form
1446 -1266 500 1240 -950 -894 1146 258 -1570 39 1133 -718 -1129 900 763 -1278 -378 1361 -19
1463 -19 -1023 760 1160 -804 -487 1219 401 -1309 154 1086 -700 -1093 754 366 -1258 -260 1079
1480 1079 -273 -1187 736 1030 -919 -313 1266 74 -962 592 1055 -718 -803 952 379 -1275 -124
1497 -124 1118 -687 -1194 627 358 -988 -300 1030 -95 -1004 565 929 -634 -476 1157 414 -1022
1514 -1022 133 1037 -467 -888 643 507 -1152 -436 880 -295 -1286 509 799 -719 -411 1044 395
1531 395 -965 346 1057 -513 -545 955 403 -1100 -171 847 -367 -1040 493 758 -949 -622 799
1548 799 -49 -975 410 1002 -511 -546 1025 409 -952 -57 1080 -116 -822 577 371 -969 -387 734
1566 734 -310 -965 476 860 -881 -744 1032 407 -1018 346 1138 -336 -657 845 548 -1037 -91
$$ packed form
1446a266J766P40k190N6K040q88j828J609J094j851m11K029j37k041R00J739j380
1463a9j004J783M00j964L17J706q18j710J463R32j786l93J847l88j624R98J339
1480A079j352r14J923K94j949O06J579j192j036J554M63j773q5J755n73j654J151
1497a24J242j805n07J821k69j346O88J330j125r09J569L64j563J58J633p43j436
1514a022J155R04j504m21J531j36j659P16J316j175r91J795K90j518L08J455o49
1531C95j360J311P11j570l2J500n52j503R29J018j214o73J533K65j707L27J421
1548G99q48r26J385N92j513l5J571o16j361Q95J137j196p06J399k06j340N82J121
1566G34j044o55J441L84j741J37J776o25j425J364P92j474l21J502k97j585R46
$$ plain form
1583 -91 1110 -232 -1002 375 555 -824 -570 738 -68 -828 183 748 -632 -583 1016 322 -849 208
1601 208 1047 -166 -679 629 477 -854 -258 888 -269 -1064 318 587 -751 -519 944 181 -817
1618 -817 63 884 -240 -556 781 522 -649 40 802 -269 -790 366 633 -626 -524 684 85 -867
1636 -867 146 637 -403 -398 792 336 -675 -52 848 -36 -488 413 518 -597 -367 529 -31 -867 162
1655 162 507 -624 -627 630 356 -803 -8 865 -74 -518 614 514 -604 -259 762 -73 -676 177 532
1674 532 -620 -713 464 191 -685 -213 566 -364 -680 557 624 -712 -195 828 17 -565 352 614 -441
1693 -441 -379 682 175 -859 111 736 -669 -592 533 295 -699 -117 791 -116 -746 465 572 -581 -50
1712 -50 948 18 -774 332 699 -547 -673 463 250 -916 -182 524 -352 -656 526 397 -582 -193 799
$$ packed form
1583i1J201j342p70J377J80j379K54J308q06p60J011N65j380M9J599o94j171J057
1601B08Q39j213n13J308j52j331N96J146j157p95J382K69j338K32J463p63r98
1618h17Q80Q21j124l16J337k59j171O89P62j071n21J156K67j259J02J208n99r52
1636h67J013M91j040NJ190m56j011O23R00q84m52R01J05j115K30Q96n60q36J029
1655A62L45j131lJ257k74j159P95Q73r39m44J132j00j118L45J021q35o03Q53L55
1674E32j152r3J177k73q76M72P79r30l16J237O7j336N17J023q11n82R17K62j055
1693d41O2J061n07j034R70O25j405P7J125k38r94N82R08r07o30J211J07j153N31
1712e0R98r30p92J106L67j246j26J136k13j166P34P06q76l04J182j29r79L89R92
$$ plain form
1731 799 97 -636 365 706 -379 -450 644 150 -700 50 616 -516 -607 485 209 -722 -160 718 -183
1750 -183 -625 394 627 -456 -218 764 170 -682 224 735 -378 -543 601 254 -715 -177 742 -242 -536
1769 -536 399 525 -670 -165 810 38 -598 379 641 -435 -317 604 278 -754 134 507 -406 -634 448
1788 448 220 -641 -169 571 -218 -521 336 493 -466 -242 682 159 -571 252 609 -373 -545 354 219 -613
1808 -613 -147 604 -223 -671 367 335 -563 -304 632 60 -584 318 605 -297 -353 599 287 -583 25 603
1828 603 -240 -627 372 235 -519 -276 577 -137 -737 344 492 -426 -207 607 222 -557 194 666 -344
1847 -344 -386 455 313 -676 -86 524 -204 -621 281 388 -515 -400 592 13 -553 107 619 -302 -426 603
1867 603 262 -570 -64 681 -210 -592 447 351 -713 -97 513 -37 -566 92 538 -480 -326 643 299
$$ packed form
1731G99p02p33J001L41j085p1J094m94q50P50N66j132r1J092k76r31N62Q78r01
1750a83m42J019K33j083K38R82n94q52R06N11j113j65J144l47r69N38R19r84k94
1769e36R35J26j195N05R75p72o36R77K62j076J18R21l26j032Q88L73r13k28J082
1788D48k28q61M72P40p89l03Q57J57r59K24R24n23p30Q23L57r82j72Q99j35q32
1808f13M66P51q27m48J038l2q98K59R36n72o44R02K87r02n6R52l12q70O08N78
1828F03q43l87R99j37p54K43Q53p14o00J081J48r18K19Q14l85p79P51M72j010
1847c44m2Q41j42r89N90O10p28m17R02J07r03J15R92n79n66O60N12r21j24J029
1867F03l41q32N06P45q91l82J039r6j064O16O10n50n29O58M46j018J54R69l44
$$ plain form
1886 299 -736 100 630 -207 -397 490 347 -597 -81 568 -101 -671 222 473 -702 -380 500 79 -673
1905 -673 143 710 -397 -289 531 241 -575 51 706 -231 -524 387 281 -486 -213 552 -14 -702 94 431
1925 431 -430 -321 606 189 -613 119 588 -173 -423 542 380 -524 -57 626 -24 -506 181 382 -493 -479
1945 -479 558 118 -672 125 547 -266 -420 555 345 -477 14 654 -170 -584 397 295 -514 -216 496 -54
1965 -54 -565 115 558 -440 -367 607 188 -585 84 667 -146 -463 476 448 -450 -114 622 -31 -665 321 458
1986 458 -458 -374 641 24 -659 38 657 -330 -453 508 359 -653 31 615 -247 -497 442 485 -513 -286
2006 -286 551 -237 -699 193 418 -459 -455 574 99 -749 161 620 -175 -403 498 373 -553 -125 726 -154
2026 -154 -581 414 393 -542 -312 483 -95 -583 65 509 -352 -443 442 197 -469 81 502 -135 -446 403 321
$$ packed form
1886B99j035Q36N30q37j90Q87j43r44N16O49o69n70Q93K51j175L22Q80m21p52
1905f73Q16N67j107J08Q20k90q16O26O55r37k93R11j06p67K73P65n66o88P96L37
1925D31q61J09R27m17q02P32M69p61k50R65j62r04M67O83o50m82O87K01q75J4
1945d79J037m40p90P97M22q13j54R75k10q22M91O40q24m14R81j02q09K98P12n50
1965e4n11O80M43r98P3R74m19p73O69N83q13l17R39k8q98L36P36o53o34R86J37
1986D58r16Q4J015o17o83O97O19r87j23R61j49j012O84N84q62k50R39M3r98K27
2006b86Q37p88m62Q92K25q77MJ029m75q48R10M59p95k28R01j25r26M28Q51q80
2026a54m27R95k1r35K30P95n78m88O48M44q61r1Q85k45o66N50M21o37l11Q49q2
$$ plain form
2047 321 -458 -14 561 -81 -565 183 310 -384 -393 477 216 -478 73 513 -301 -532 475 421 -241 21 529
2068 529 21 -433 322 437 -347 -204 486 110 -503 158 396 -270 -395 367 264 -489 -64 519 -150 144
2088 144 513 387 -181 -245 553 39 -517 96 444 -386 -331 311 146 -586 -92 460 -162 -345 473 347 -558
2109 -558 -235 669 36 -484 239 471 -376 -355 511 144 -640 -12 489 -378 -441 366 350 -652 39 589 -61
2130 -61 -494 374 435 -381 -203 691 0 -546 230 405 -504 -416 342 -53 -592 42 526 -408 -359 415 381 -565
2152 -565 61 542 47 -307 277 562 -509 -214 558 20 -561 131 408 -374 -458 351 85 -515 88 425
2172 425 -246 -433 397 194 -504 83 535 -103 -377 229 392 -320 -322 280 45 -470 24 443 -318 -407 394
2193 394 294 -455 -46 468 -53 -305 273 221 -409 -106 500 -78 -426 96 518 -300 -216 366 152 -452 -27
$$ packed form
2047C21p79M44N75o42m84P48J27o94rQ70k61o94N51M40q14k31J007n4o62K62N08
2068E29n08m54P55J15p84J43O90l76o13O61K38o66j25P62j03p53M25N83o69K94
2088A44L69j26n68o4P98n14n56O13L48q30N5O42j65p32M94N52o22j83Q18j26r05
2109e58L23R04o33n20P23K32q47K1Q66l67p84O28N01q67o3Q07j6j002O91N50o50
2130f1m33Q68O1q16J78Q94o91n46P76J75r09Q8P58l95n39O34M84r34M9P74l4r46
2152e65O26M81m95l54N84K85j071K95P72n38n81O92K77p82q4Q09k66o00O03L37
2172D25o71j87Q30k03o98N87M52o38k74O06J63p12kO02k35n15M94M19p61q9Q01
2193C94j00p49M09N14n21k52N78n2o30L03O06n78l48N22M22q18Q4N82k14o04M25
$$ plain form
2214 -27 488 -292 -294 316 388 -312 24 397 113 -455 160 321 -410 -179 504 -23 -441 172 327 -203 -348
2235 -348 315 209 -446 11 376 -50 -259 391 263 -254 -21 500 93 -463 240 422 -309 -292 340 58
2255 58 -545 -50 246 -108 -420 342 208 -505 -4 539 -118 -370 226 313 -294 -160 478 127 -525 34 465
2276 465 -275 -457 360 26 -410 -112 549 -236 -329 368 400 -401 -338 522 -10 -501 29 382 -281 -282 234 119
2298 119 -400 19 309 -203 -420 223 254 -288 -152 560 -9 -372 178 311 -319 -210 470 86 -341 118
2318 118 310 -295 -348 346 226 -528 -18 362 -83 -351 319 228 -212 -104 479 26 -383 217 411 -287 -248
2339 -248 341 -6 -438 -64 321 -155 -361 276 132 -294 -132 382 -115 -338 294 276 -162 -224 423 114 -409
2360 -409 85 353 -342 -302 212 63 -331 -11 419 -73 -318 258 275 -301 -101 371 118 -356 163 381 -139
$$ packed form
2214b7N15p80kO10P2p00L36L73k84n68O15J61p31K31O83n27m18O13J55n30j45
2235c48O63j06o55M57L65m26k09O50j28n17K33N21m07n56P03J82p31J7O32k82
2255E8o03M95K96l54l12P62j34p13N01N43o57k52N96Q7o07J34O38l51o52N59M31
2276D65p40j82Q17l34m36K98O61p85r3O97L2q01O3Q60n32m91N30L53o63jN16j15
2298A19n19M19K90n12k17O43L1n42J36P12n69l63N50J33o30J09O80l84m27M59
2318A18J92o05n3O94j20p54N10L80m45k68O70r1m40J08N83m53m09O00J94o98L9
2339b48N89l47m32L74L85m76k06O37j44m26J62N14m97k23O32j8m38o2O47l09n23
2360d09M94K68o95M0N14j49l94L20M30m92k45N76J7n76K00M72k53m74N19K18n20
$$ plain form
2381 -139 -255 337 46 -346 135 300 -271 -347 264 190 -295 -6 508 122 -172 213 206 -266 -163 406 125
2402 125 -295 131 378 -221 -199 219 115 -400 -156 333 -154 -432 240 220 -208 -163 382 77 -361 190 277
2423 277 -144 -146 281 5 -492 47 268 -196 -283 275 138 -390 -12 350 -142 -395 338 152 -227 18 444
2444 444 73 -320 32 323 -161 -191 249 -61 -232 -28 240 -250 -159 245 149 -315 84 327 -17 -110 141
2465 141 181 -162 -125 399 71 -347 20 306 -141 -280 270 59 -279 -13 16 -127 -329 -18 98 -148 30
2486 30 245 149 -152 275 190 -60 -51 112 37 -287 -95 275 -114 -256 97 88 -201 -110 186 -9 -132 122 158
2509 158 -276 -68 345 62 -262 135 223 -126 -190 69 90 -195 26 375 -92 -303 168 95 -287 -146 289
2530 289 134 -200 88 286 -34 -111 145 142 -274 22 248 -153 -188 176 100 -336 -77 276 124 -267 128 110
$$ packed form
2381a39j16N92k91l92M81J65n71p6O11p4m85K89N14l86k94L85pm72J03N69k81
2402A25m20M26K47n99K2M18j04n15K44M89m87k78O72k0m28M5N45l05m38N51Q7
2423B77m21kM27k76m97N39K21m64q7N58j37n28L78L62m92k53P33j86l79K45M26
2444D44l71l93L52K91m84l0M40l10j71K04K68m90R1M04r6m64L99K43l44r3K51
2465A41M0l43L7N24l28m18L67K86m47j39N50k11l38K66K9j43k02L11J16k46J78
2486C0K15r6l01M27q5k50RJ63p5l24J92L70l89j42L53rk89R1K96j95j23K54L6
2509A58m34K08M13k83l24L97Q8l49o4K59K1k85K21L49m67k11M71p3l82J41M35
2530B89j55l34K88J98l20p7K56lm16K96K26m01l5L64p6m36K59L53j52l91L95j8
$$ plain form
2552 110 -156 25 320 -10 -199 96 232 -157 -182 251 83 -334 17 212 -237 -250 141 127 -329 -92 207
2573 207 -9 -189 201 200 -218 34 273 30 -235 155 225 -100 -155 263 172 -234 -43 202 -195 -265 118 59
2595 59 -133 6 213 -12 -134 178 153 -96 35 147 1 -215 -26 121 -57 -133 196 101 -230 -74 138
2616 138 -61 -219 120 214 -103 -48 180 22 -167 114 157 -151 13 189 54 -158 -83 117 50 -94 241 152
2638 152 -105 -27 159 28 -232 77 207 -169 -128 56 23 -155 -3 220 -57 -116 173 94 -245 -159 214 36
2660 36 -269 27 223 -47 -127 266 80 -119 53 294 14 -136 201 106 -300 48 207 -103 -220 78 162
2681 162 -116 -9 239 41 -128 -50 47 -56 -128 180 86 -201 -13 165 10 -284 43 34 -182 -34 141 -109
2703 -109 -154 -2 187 -79 -29 35 71 -222 -25 190 -64 -151 165 8 -171 65 122 -76 -189 170 164 -78 -46
$$ packed form
2552A10k66J81K95l30j89K95J36l89k5M33j68m17L51J95m49j3L91j4m56K37K99
2573B07k16j80L90jm18K52K39k43k65L90P0l25n5M18r1m06J91K45l97p0L83n9
2595E9j92J39K07k25j22L12k5k49J31J12j46k16J89J47j78p6L29r5l31J56K12
2616A38j99j58L39R4l17N5K28j58j89K81M3l08J64J76j35k12P5K00o7j44L35q9
2638A52k57P8J86j31k60L09J30l76M1J84l3j78J52K23k77n9K89p9l39Q6L73j78
2660C6l05K96J96k70q0L93j86j99J72K41k80j50L37r5m06L48J59l10j17K98Q4
2681A62k78J07K48j98j69P8R7j03p2L08r4k87J88J78j55k94L27rk16J48J75k50
2703a09m5J52J89k66N0O4L6k93J97K15k54q7L16j57j79K36N7j98j13L59ok42L2
$$ plain form
2726 -46 70 -13 -104 7 145 -101 24 240 46 -177 9 250 -78 -62 147 4 -98 -157 104 46 -189 40
2748 40 124 -171 -22 179 -25 -123 58 317 -20 -72 148 0 -176 -25 61 -179 -159 127 -19 -112 -179 68 -26
2771 -26 -47 -16 118 -52 -71 180 8 -95 114 47 -67 -27 110 97 -172 32 20 -125 -198 8 49 -116 -83 144
2795 144 35 -103 77 109 -43 -36 152 72 -147 -46 82 -85 -183 -14 54 -203 -76 64 -58 -45 146 111 -158
2818 -158 -113 40 68 -91 2 169 -23 -89 165 163 -29 -224 65 -196 51 374 116 -209 -123 91 -143 -162 72
2841 72 186 15 -98 214 36 -62 -56 134 -51 -101 -37 46 -92 -47 102 -117 -102 78 162 -133 -23 210 57
2864 57 -22 83 125 -55 -54 51 -38 -113 -139 122 16 -150 -25 12 -236 -16 -8 93 -40 -17 133 -7 -135 162
2888 162 168 -361 59 565 -303 27 62 15 -109 -71 31 -35 -43 -88 32 -148 80 56 150 -149 -22 180 -97 -41
$$ packed form
2726d6J16q3r1J11J38k46J25K16j94k23J86K41l28J6K09j43j02n9K61n8k35K29
2748D0Q4k95J49K01k04r8J81K59l37n2K20j48j76J51Q6k40K0K86j46r3o7K47r4
2771b6k1L1J34j70j9K51j72j03K09o7j14M0J37j3k69K04j2j45p3K06M1j65L3K27
2795A44j09j38J80L2j52PJ88q0k19J01J28j67r8J69O8k57J27J40j22J3J91l5k69
2818a58M5J53K8j59R3J67j92o6K54kj92j95K89k61K47L23k58l25Q6K14k34j9K34
2841G2J14j71j13L12j78r8OJ90j85n0O4Q3j38M5J49k19J5J80Q4k95J10K33j53
2864E7p9J05M2j80JJ05q9p5k6K61j06j66J25L7k48K20QJ01j33K3J50j40j28K97
2888A62On29M20N06q68L30L5m7j24L8J02o6qm5J20j80K28k4R4k99J27K02k77N6
$$ plain form
2912 -41 103 34 23 -41 -69 -49 -14 12 -37 -70 -66 20 20 -4 -38 99 95 -125 131 29 -118 55 162 -17 -71 121 19
2939 19 -212 30 11 -105 -66 51 108 38 -176 85 -34 -36 0 191 87 -56 56 -6 40 -15 144 -76 -73 67
2963 67 8 -32 -68 -10 6 -84 47 114 -138 -9 77 5 -75 99 201 0 -38 159 -8 -6 13 93 -7 -32 -69 12
2989 12 -151 -16 -10 -70 -93 -62 -22 -86 -36 7 98 61 49 2 -103 -63 38 119 -17 25 194 69 5 -62 -82 -92 -52
3016 -52 27 29 -12 5 94 5 -104 27 -47 -103 59 104 44 -4 -5 -8 298 -69 -87 -300 -456 68 167 61 -33 119 26
3043 26 -83 -18 112 34 10 21 16 24 -87 60 166 -57 -51 104 -45 13 -61 36 14 -43 114 -28 59 -11 18 -22 -9
3070 -9 34 82 13 -99 -44 -83 -78 -31 -8 -51 57 50 -3 -18 93 33 27 137 23 -41 -94 -9 84 -30 -49 -58 23 -2 9 -18
3100 -18 -13 -108 73 77 -13 -33 28 -94 70 43 45 -70 -68 122 -49 -133 -9 127 -124 113 -56 -19 -159 64 -156
$$ packed form
2912d1J44o9j1o4k8K0L5K6m9l3MQ6%k4l4J37mk20K56j02j47J73J07j79n4J92j02
2939A9k31K42j9j16L9J17N7p0k14K61j19kL6J91j04j43J12o2M6n5J59k20LJ40
2963F7n9m0l6N8J6r0J31O7k52J29Q6p2q0J74J02k01l8J97j67KJ9Q0j00k5l7Q1
2989A2j63J35Oo0k3L1M0o4N0M3R1l7j2m7j05M0J01Q1j36M2J69j25o4o7k0j0M0
3016e2P9Km1J7Q9q9j09J31p4n6J62M5o0m8jlL06l67j8k13j56N24R9j06r4J52r3
3043B6j09O5J30p8k4J1nQj11J47J06k23OJ55j49N8p4R7k2n7J57j42Q7p0K9m0J3
3070iM3M8o9j12N5l9NM7K3m3J08pn3j5J11o0oJ10j14o4n3Q5R3j14j9rQ1k5J1k7
3100a8Nr5J81Mr0k0O1j22J64k7Kj15KJ90j71q4J24J36k51K37j69L7j40K23k20
$$ plain form
3125 -156 296 173 -186 100 139 -23 120 12 -86 99 58 -55 -116 43 -3 21 56 82 -88 -98 -60 98 -21
3148 -21 -18 149 31 -76 82 78 23 40 61 95 18 19 -59 -93 35 4 -6 -108 -30 25 -116 -116 -106 69 45 37 -23 25 34
3177 34 55 32 38 -39 34 -58 57 -20 74 -58 -63 92 -8 -114 -106 15 -35 20 -10 -5 5 -146 -95 -42 -73 33 -10 95
3205 95 47 -17 -19 -98 8 86 -118 90 -22 58 -55 -34 92 47 -43 17 13 -46 -83 26 -43 -78 96 74 -192 -114 -23
3232 -23 26 -162 -99 71 99 29 3 -2 -12 125 -42 16 39 -52 -47 -2 -45 -123 -102 -86 -57 -34 -119 -151 -2 27 -107 42
3260 42 -14 81 -6 -41 15 -59 64 30 -20 24 -27 -46 -9 -23 68 56 -126 59 -49 -12 -36 -62 25 3 -21 130 -27
3287 -27 -19 7 226 -91 -22 -10 15 151 -67 89 -12 29 -103 -73 -66 -27 4 -42 -27 78 41 152 -26 -20 221 -49
3313 -49 94 121 11 -173 -33 49 -79 -49 6 -56 -122 -55 -37 -83 52 -2 -90 -36 89 44 32 -57 27 15 80 -50
$$ packed form
3125a56M52j23l59K86L9j62J43j08r8J85m1j13o1J59m6K4L5K6j70j0L8J58j19
3148b1LJ67j18j07J58mn5J7K1L4p7Jp8l4J28l1j0j02P8N5j41%J0J75k4qo0M8R
3177C4K1k3Op7P3r2J15p7R4j32nJ55j00j06QJ21n0N5l0NJ0j51N1N3l1J06m3J05
3205I5m8o4kp9J06P8k04K08j12Q0j13K1J26m5r0O0mn9l7J09o9l5J74k2k66P8R1
3232b3M9j88O3J70K8p0k6nj0J37j67N8K3r1NM5m3p8K1J6K9K3q5l2J49K9j34J49
3260D2n6R5q7l5N6p4J23l4n0M4n1j9L7j4R1j2j82J85j08L7k4k6Q7k2k4J51j57
3287b7QK6K19l17O9J2K5J36k18J56j01M1j32L0PL9L1m6J5J05l7J11j78OK41k70
3313d9J43K7j10j84J40Q2j28L0N5o2o6O7J8m6J35n4q8N4J25m5j2q9Q4j2O5j30
$$ plain form
3339 -50 8 -121 -73 -127 -3 13 -39 -115 176 222 -111 -8 -347 -56 5 -29 -63 -2 -91 83 -21 4 -63 -130 -74 55
3365 55 -72 -50 46 -152 -105 -65 73 20 -73 -18 -59 -26 -4 80 -17 -49 -2 98 62 -115 21 54 -43 -37 37 135 -42
3392 -42 -31 36 -9 -23 23 -2 -72 -40 132 0 9 76 -20 -15 -18 -16 -3 -28 -53 -46 4 -96 24 56 -25 17 -40 16 -64 9 34
3423 34 -78 -56 96 -1 54 -121 -162 -83 -16 -11 -4 59 -149 87 -66 51 50 23 -91 -44 -2 37 3 43 76 45 52 103
3451 103 -57 101 130 37 -12 82 57 -5 5 -77 -34 100 21 4 2 128 68 60 20 -53 26 -48 -20 -65 -17 -43 -43 -146 -86
3480 -86 29 -89 -31 36 -1 10 -77 61 22 54 18 -42 115 13 18 66 -19 7 -28 -154 -22 -1 -74 -11 102 50 16
3507 16 -42 30 19 40 54 -227 -208 85 50 11 -27 -24 -66 -12 -15 106 -27 -6 68 17 51 55 39 -2 -31 101 61 -51 138
3536 138 81 -4 14 88 11 2 -1 31 -166 35 -115 -46 44 2 138 -172 2 21 117 -34 -6 52 58 52 -22 -68 -83 56
$$ packed form
3339e0N8j29M8n4J24J6n2p6K91M6l33J03l39K91O1l4l4O1q9J74j04K5o7o7N6J29
3365E5j27K2R6j98M7M0J38n3r3N5m1L3K2Q4r7l2M7J00l6j77J36L3r7OP4R8j77
3392d2J1O7m5j4M6k5p0L2J72j32RO7r6NlKJ3k5k5PN0j00J20L2q1M2n7N6q0P3K5
3423C4j12K2J52r7N5j75m1P9O7NPO3k08K36j53J17jk7j14M7M2L9l4M0L3l1PN1
3451A03j60J58K9r3m9R4k5o2J0q2M3J34p9j7kJ26o0qm0p3P9p4K8m5M8k6%j03O0
3480h6J15j18N8O7l7J1q7J38l9L2l6o0J57j02NM8q5K6l5j26J32K1p3O3J13n2l4
3507A6n8P2j1K1J4k81J9K93l5l9l8Lm2N4lJ21j33K1P4n1L4Mj6m1k9J32m0j12J89
3536A38n7q5J8P4p7rlL2j97K01j50O9R0m2J36l10J74J9R6j51K8N8Oop4m6j5J39
$$ [...]
8191e1
##END NTUPLES=NMR FID
##END=
