##TITLE=1H_DE-80H_X3
 200.13MHz, d2o
 8 sc
 
 19ns.26.2.2025
##JCAMPDX= 6.0         $$ Bruker NMR JCAMP-DX V2.0
##DATA TYPE= NMR FID
##DATA CLASS= NTUPLES
##ORIGIN= UXNMR, Bruker Analytische Messtechnik GmbH
##OWNER= pz
$$ XWIN-NMR		Version 3.5
$$ Tue Jul 21 14:02:52 2026 Russian Standard Time (UT+4h)  Yarkov@DPX200
##.OBSERVE FREQUENCY= 200.1313
##.OBSERVE NUCLEUS= ^1H
##.DELAY= (6, 6)
##.ACQUISITION MODE= SIMULTANEOUS
##.ACQUISITION SCHEME= undefined
##.AVERAGES= 8
##.DIGITISER RES= 18
##SPECTROMETER/DATA SYSTEM= spect
##.PULSE SEQUENCE= zg30
##.SOLVENT NAME= CDCl3
##.SHIFT REFERENCE= (INTERNAL, CDCl3, 0, 14.3821)
##AUDIT TRAIL= $$ (NUMBER, WHEN, WHO, WHERE, WHAT)
$$ ##TITLE= Audit trail, XWIN-NMR		Version 3.5
$$ ##JCAMPDX= 5.01
$$ ##ORIGIN= Bruker BioSpin GmbH
$$ ##OWNER= Yarkov
$$ C:/Bruker/XWIN-NMR/data/yarkov2/nmr/H-C/1/audita.txt
$$ ##AUDIT TRAIL=  $$ (NUMBER, WHEN, WHO, WHERE, WHAT)
(   1,<2026-07-21 14:02:00.09 +0400>,<Yarkov>,<DPX200>,
      <created by zg, POWCHK disabled, PULCHK disabled
       configuration hash MD5:
       00 E9 B6 7A A2 85 ED C7 34 08 36 98 17 FE 4E 26
       data hash MD5: 16K
       E2 F3 3C 7C 8A 27 28 46 6C 4E 74 73 99 1C 55 CD>)
$$ ##END=
$$ 
$$ hash MD5
$$ 68 14 CC CE F8 C3 E6 C4 0A 7E 64 AA 34 B4 FF C9
##$RELAX= 
##$RELAX= 
##$RELAX= 
##$RELAX= 
##$RELAX= 
##$RELAX= 
$$ Bruker specific parameters
$$ --------------------------
##$DU= <C:/Bruker/XWIN-NMR>
##$EXPNO= 1
##$NAME= <H-C>
##$PROCNO= 1
##$TYPE= <nmr>
##$USER= <yarkov2>
##$AMP= (0..31)
100 100 100 100 100 100 100 100 100 100 100 100 100 100 100 100 100 100 
100 100 100 100 100 100 100 100 100 100 100 100 100 100 
##$AQSEQ= 0
##$AQ_mod= 1
##$AUNM= <au_zg>
##$AUTOPOS= <>
##$BF1= 200.13
##$BF2= 200.13
##$BF3= 200.13
##$BF4= 200.13
##$BF5= 200.13
##$BF6= 200.13
##$BF7= 200.13
##$BF8= 200.13
##$BYTORDA= 1
##$CFDGTYP= 0
##$CFRGTYP= 5
##$CHEMSTR= <none>
##$CNST= (0..31)
1 1 145 1 1 1 1 1 1 1 1 1 1 1 1 1 1 1 1 1 1 1 1 1 1 1 1 1 1 1 1 1 
##$CPDPRG= <>
##$CPDPRG1= <>
##$CPDPRG2= <>
##$CPDPRG3= <>
##$CPDPRG4= <mlev>
##$CPDPRG5= <mlev>
##$CPDPRG6= <mlev>
##$CPDPRG7= <mlev>
##$CPDPRG8= <mlev>
##$CPDPRGB= <>
##$CPDPRGT= <>
##$D= (0..31)
0 0.7 0 0 0 0 0 0 0 0 0 0.03 0 0 0 0 0 0 0 0 0 0 0 0 0 0 0 0 0 0 0 0 
##$DATE= 1784628119
##$DBL= (0..7)
120 120 120 120 120 120 120 120 
##$DBP= (0..7)
150 150 150 150 150 150 150 150 
##$DBP07= 0
##$DBPNAM0= <>
##$DBPNAM1= <>
##$DBPNAM2= <>
##$DBPNAM3= <>
##$DBPNAM4= <>
##$DBPNAM5= <>
##$DBPNAM6= <>
##$DBPNAM7= <>
##$DBPOAL= (0..7)
0.5 0.5 0.5 0.5 0.5 0.5 0.5 0.5 
##$DBPOFFS= (0..7)
0 0 0 0 0 0 0 0 
##$DE= 6
##$DECBNUC= <off>
##$DECIM= 32
##$DECNUC= <off>
##$DECSTAT= 4
##$DIGMOD= 1
##$DIGTYP= 9
##$DL= (0..7)
0 120 120 120 120 120 120 120 
##$DP= (0..7)
150 150 150 150 150 150 150 150 
##$DP07= 0
##$DPNAME0= <>
##$DPNAME1= <>
##$DPNAME2= <>
##$DPNAME3= <>
##$DPNAME4= <>
##$DPNAME5= <>
##$DPNAME6= <>
##$DPNAME7= <>
##$DPOAL= (0..7)
0.5 0.5 0.5 0.5 0.5 0.5 0.5 0.5 
##$DPOFFS= (0..7)
0 0 0 0 0 0 0 0 
##$DQDMODE= 0
##$DR= 18
##$DS= 0
$$ [...]
##$SUBNAM2= <"">
##$SUBNAM3= <"">
##$SUBNAM4= <"">
##$SUBNAM5= <"">
##$SUBNAM6= <"">
##$SUBNAM7= <"">
##$SUBNAM8= <"">
##$SUBNAM9= <"">
##$SW= 18.0517328524113
##$SWIBOX= (0..15)
0 0 2 0 0 0 0 0 0 0 0 0 0 0 0 0 
##$SW_h= 3612.71676300578
##$TD= 16384
##$TD0= 1
##$TE= 0
##$TE2= 300
##$TE3= 300
##$TEG= 300
##$TL= (0..7)
0 120 120 120 120 120 120 120 
##$TP= (0..7)
150 150 150 150 150 150 150 150 
##$TP07= 0
##$TPNAME0= <>
##$TPNAME1= <>
##$TPNAME2= <>
##$TPNAME3= <>
##$TPNAME4= <>
##$TPNAME5= <>
##$TPNAME6= <>
##$TPNAME7= <>
##$TPOAL= (0..7)
0.5 0.5 0.5 0.5 0.5 0.5 0.5 0.5 
##$TPOFFS= (0..7)
0 0 0 0 0 0 0 0 
##$TUNHIN= 0
##$TUNHOUT= 0
##$TUNXOUT= 0
##$USERA1= <user>
##$USERA2= <user>
##$USERA3= <user>
##$USERA4= <user>
##$USERA5= <user>
##$V9= 5
##$VALIST= <valist>
##$VCLIST= <CCCCCCCCCCCCCCC>
##$VD= 0
##$VDLIST= <DDDDDDDDDDDDDDD>
##$VPLIST= <PPPPPPPPPPPPPPP>
##$VTLIST= <TTTTTTTTTTTTTTT>
##$WBST= 1024
##$WBSW= 4
##$XGAIN= (0..3)
0 0 0 0 
##$XL= 0
##$YL= 0
##$YMAX_a= 300737
##$YMIN_a= -418355
##$ZGOPTNS= <>
##$ZL1= 120
##$ZL2= 120
##$ZL3= 120
##$ZL4= 120
##$ABSF1= 10
##$ABSF2= 0
##$ABSG= 5
##$ABSL= 3
##$ALPHA= 0
##$AQORDER= 0
##$ASSFAC= 0
##$ASSFACI= 0
##$ASSFACX= 0
##$ASSWID= 0
##$AUNMP= <proc_1d>
##$AZFE= 0.1
##$AZFW= 0.1
##$BCFW= 1
##$BC_mod= 2
##$BYTORDP= 1
##$COROFFS= 0
##$CY= 83.5205535888672
##$DATMOD= 1
##$DC= 2
##$DFILT= <>
##$DTYPP= 0
##$F1P= 10.8118882576601
##$F2P= -7.23987719738617
##$FCOR= 0.5
##$FTSIZE= 0
##$FT_mod= 4
##$GAMMA= 1
##$GB= 0.15
##$INTBC= 1
##$INTSCL= 1
##$ISEN= 128
##$LB= 0.25
##$LEV0= 0
##$LPBIN= 0
##$MAXI= 10000
##$MC2= 0
##$MEAN= 0
##$ME_mod= 0
##$MI= 1.114404
##$NCOEF= 0
##$NC_proc= 0
##$NLEV= 6
##$NOISF1= 3.799351
##$NOISF2= 2.8
##$NSP= 1
##$NTH_PI= 0
##$NZP= 0
##$OFFSET= 14.38212
##$PC= 1
##$PHC0= -7259.724
##$PHC1= 15.42198
##$PH_mod= 1
##$PKNL= yes
##$PPARMOD= 0
##$PSCAL= 0
##$PSIGN= 0
##$REVERSE= no
##$SF= 200.129724274929
##$SI= 16384
##$SIGF1= 3
##$SIGF2= 2
##$SINO= 400
##$SIOLD= 16384
##$SREGLST= <1H.CDCl3>
##$SSB= 0
##$STSI= 0
##$STSR= 0
##$SW_p= 3205.1282051282
##$SYMM= 0
##$S_DEV= 0
##$TDeff= 0
##$TDoff= 0
##$TI= <>
##$TILT= no
##$TM1= 0
##$TM2= 0
##$TOPLEV= 0
##$USERP1= <user>
##$USERP2= <user>
##$USERP3= <user>
##$USERP4= <user>
##$USERP5= <user>
##$WDW= 1
##$XDIM= 8192
##$YMAX_p= 0
##$YMIN_p= 0
$$ End of Bruker specific parameters
$$ ---------------------------------
##NTUPLES= NMR FID
##VAR_NAME=  TIME,          FID/REAL,        FID/IMAG
##SYMBOL=    X,             R,               I
##VAR_TYPE=  INDEPENDENT,   DEPENDENT,       DEPENDENT
##VAR_FORM=  AFFN,          ASDF,            ASDF
##VAR_DIM=   8192,          8192,            8192
##UNITS=     SECONDS,       ARBITRARY UNITS, ARBITRARY UNITS
##FACTOR=    0.0002768,     1,               1
##FIRST=     0,             0,               0
##LAST=      2.2672688,     0,               0
##MIN=       0,             -418355,         0
##MAX=       2.2672688,     300737,          0
$$ Real data points
##PAGE= N=1
##DATA TABLE= (X++(R..R)), XYDATA
$$ [...]
979G68L75j37m83n06k19K05L29O3l78o62m49K5K47P43J47j08k93j40J56N14N20
$$ 768 1143 1006 523 17 -202 3 332 395 17 -645 -1094 -1069 -822 -79 68 -40 -333 -473 -317 197 717
1000G17L40l58m26l04J5L83L10k41n68l31m85K48K97L48j9k24j97m8J65M32P25
$$ 717 1057 699 273 -31 -16 367 677 436 -132 -463 -948 -700 -403 -55 -74 -298 -495 -543 -378 54 779
1021G79M1l23l75L4J27M50K6k08m99m97j64P3K78K53k23l99l9q6L29P61L03k48
$$ 779 820 497 122 156 283 733 759 551 52 -445 -609 -536 -258 -5 -228 -627 -666 -752 -423 338 641 393
1043C93k41j19K33P9M27J17l45m84k85k01K33K67l0m32j48k44j7N84L89K10j14
$$ 393 152 33 266 345 772 889 544 60 -225 -426 -193 74 44 -388 -536 -780 -797 -213 176 386 272
1064B72l70N9O5M77M69j45m43l78l05K18P0K15k03m06l51j40J40N74L42j02j58
$$ 272 -98 -39 26 503 972 827 384 6 -299 -81 -11 204 1 -405 -756 -896 -756 -182 160 58 -100
1085a00q3O9K01N24J82k21k91l14L3K7J87M8k64l88l44N3J82M02J22j79q1l6J83
$$ -100 -183 -114 87 611 793 572 281 -33 0 27 214 262 -2 -390 -734 -681 -499 -97 25 -154 -235 -271 -88
1108h8L46M08O9k7l97k65R5J34J65j4l11n94j56K09J0K92O8l16k01J24K72L54
$$ -88 258 666 735 708 311 46 141 275 440 426 115 -479 -635 -426 -416 -124 -56 -372 -573 -449 -177 177
1130A77L37P8j29l50M1R7K03N6k14m81j70k46K71J64P1j63k44j08K10K78K80L50
$$ 177 514 592 463 113 154 251 454 510 296 -185 -355 -601 -330 -166 -95 -258 -502 -610 -400 -122 158 508
1152E08l9k45j95J83J73J78R8k81m80j69j16K71r0J94l01l14M6P8L91L98p6J7
$$ 508 469 224 29 212 385 563 661 380 -100 -269 -385 -114 -204 -10 -311 -625 -579 -501 -110 288 212 229
1174B29j82j10L59K13K09j57k84m04M1m7J21M7j68k11k98o1K42M39J64M1k92o
$$ 229 47 -63 296 509 718 561 277 -127 -86 -133 -12 35 -133 -344 -642 -703 -461 -22 142 183 -109 -115
1196a15J27K54L27l0m1l31k00n1J44K10j78k61k52l21J48P8M41qpm3q6J72L64
$$ -115 12 266 593 563 522 191 -9 -60 84 294 116 -145 -397 -718 -570 -492 -51 -59 -66 -109 -195 -23 341
1219C41K52n1j11k03o5r0N1K28k26k53k96k39J47M05L7J3k20r2J01K64L48Q1R4
$$ 341 593 542 431 228 163 73 124 352 126 -127 -423 -662 -515 -110 -73 -60 -280 -372 -271 -7 341 422 516
1242E16k13l13R7K45J93j43k15l78j76Q9p5J05J10j24j12j07J48L45L39J07j53
$$ 516 303 -10 87 332 525 382 167 -211 -387 -298 -373 -268 -158 -282 -394 -501 -353 -8 331 438 285
1263B85n3k32K08K78j05J66l62k51k17k7L24l8j67j20j13j83L24K93J85N1k63
$$ 285 232 0 208 486 381 547 185 -66 -283 -310 14 -24 -191 -311 -424 -607 -283 10 195 246 -17
1284a7p0J88R5J94J87k50j56j53k15J80O9j10m1k91r5P3J02K45K67k23m6l4K41
$$ -17 -87 101 196 390 577 327 171 18 -197 -17 52 -58 -99 -390 -485 -412 -310 -65 202 -21 -67 -101 140
1307A40J72K60j31k7k26k75J38l7K46j33l52k01o6N0K05K73l5p2j63Q4J72K25
$$ 140 312 572 441 414 188 -87 51 14 260 127 -225 -426 -492 -442 -237 36 1 -71 -234 -150 22 247
1329B47K10j1j82j84n2j2J69J47j82k29k13N4q1J37Q1J7k03l2J36J94J89J18m0
$$ 247 457 446 264 80 28 16 185 332 150 -79 -292 -238 -319 -182 -101 -84 -287 -319 -183 11 200 318 278
1352B78l1k35L4K03J52j12k97j91r4J3J72P8k5j57k00J46J14Q1K53J06k03J8K0
$$ 278 247 12 46 249 401 289 -8 -199 -293 -280 -108 -30 -55 -212 -412 -266 -152 -71 182 288 85 103 123
1375A23jL02l9j43j75j45j4M0N8j47J33k47o2j9M4J50L84k38m0j16P5L22J49r3
$$ 123 122 424 385 242 67 -78 -92 -52 6 -141 -8 -255 -317 -336 -292 -142 242 4 -36 -152 -77 245 394 301
1399C01j12j55m5j1M5O1m3j64j03j20J29R5Q9Q7j28m5n2J52K60P9q3j55n1RJ03
$$ 301 189 34 -11 -22 23 84 41 -123 -226 -346 -217 -122 -33 54 -74 -119 -171 -19 241 320 237 82 31 40 143
1424A43J1M0j11k49p5k16K75R8Q6p4j29L5K4R2J97J04j38r6M1J30j10K40j3k89
$$ 143 154 194 83 -166 -241 -457 -182 -84 2 -72 -201 -166 -142 -50 147 251 113 17 58 188 78 318 305 16
1448A6k06j24M9K49o2K3j82o3j57L19J86K6pJ40k95J69J34K3R1J7m78J27q4o0
$$ 16 -190 -314 -265 -16 -78 -55 -237 -300 -457 -138 48 74 67 207 -88 81 215 238 329 346 -132 -5 -89 -149
1472a49J37K5j72r4MJ7J04J13J45p4j13K2L6J75R0j7M7k49j32K8J22j3O7k33k03
$$ -149 -12 13 -159 -253 -249 -232 -128 -15 130 56 -57 -35 1 176 266 249 296 47 -85 -57 65 52 119 -114 -317
1497c17l1J89J14L7n3N5j44J22K6Q9K16r1j8j14q4O0J50l8j53j25j46q0O2K45
$$ -317 -348 -159 -45 -8 -61 -6 -150 -28 -2 87 303 212 194 80 -4 56 206 168 15 -110 -256 -336 -274 -29
1521b9j5N6j93j7K0K02K18O3p0p0j35J6J05J6P7j07k20Nj8Q3j6j5n3k22M6K11
$$ -29 -44 12 -181 -198 -178 24 242 305 235 165 30 46 151 167 244 137 -83 -78 -96 -13 -29 -44 -97 -319 -273 -62
1547f2J24r6J99q0K3j29j0K84M6j21n8j66p7O7P2j21j8J9j33m8K21J51O7j46J4
$$ -62 62 -34 165 85 108 -21 -31 253 299 178 120 -46 -123 -56 16 -105 -123 -104 -237 -285 -64 87 154 8 22
1572B2%j01K73J08l6j83k2j80P2n7J48M1k13j40N8p6K67J79j39n4j72R6J04J44
$$ 22 22 -79 194 302 266 83 61 -119 -47 -104 44 85 -128 -268 -210 -286 -19 160 21 -33 -205 -109 -5 139
1596A39J09k5m8j05j14O0nL5l0j64N9n5J5R3oL2k4O9q8J28J14J8r3n4jr9K06j42
$$ 139 248 223 175 70 -44 16 11 46 16 -148 -89 -144 -129 -36 -42 -10 -34 35 -53 75 189 207 114 60 59 -40 166 24
1624B4K6J9j56j34O3J13L5l2Jo6l8J58J60o4K08k40Jj13MK37J9m0j83j18o2L7
$$ 24 50 69 -87 -221 -158 -45 -10 -42 -41 -107 -145 13 173 109 317 77 78 -35 -31 206 225 185 2 -116 -178 -141
1650a41J31k8Pj07L1LJ17J33l1jL7k05M4J04O0N5q9j25j31O9K1NJ2q7l5O4kJ04
$$ -141 -10 -38 -31 -138 -107 -104 13 146 115 114 151 -54 -10 94 154 209 120 -5 -136 -67 -46 -41 -29 -116 -151 -87 -89 15
1678A5n8J46j5q6j7Q0J31O2k12J13j43r1oJ36j25J4M7k18P3P2J16J4r4LK4M6N6
$$ 15 -43 103 88 2 -15 65 196 258 46 159 16 -75 -81 55 -70 -56 -9 -227 -154 -82 34 48 -46 -43 -19 27 83
1705H3M9J09k17J5j1j65K44n3M8p1k75P1kJ22N2j6Q7j19q2J66N6R0l2N0j27j50
$$ 83 132 241 24 39 28 -137 107 54 102 31 -244 -173 -175 -53 -1 -17 70 -49 -131 35 91 181 149 199 72 -78
1731g8J20J57j41qp9m1j13R2J08q0Q6o8j36J76m7J85j7Rp4N2r4J11K0k9j04J5
$$ -78 42 199 58 50 -29 -70 -183 -91 17 -63 23 -45 -181 -5 -52 133 116 125 51 103 9 120 140 111 7 22
1757B2p1l0J6j0N2K2m3n2j69K29R9N2m3q0J17j10O5K25k48Q8o4j30qp2R2p4R6
$$ 22 -49 -79 -63 -73 -21 1 -42 -94 -263 -34 65 117 74 -6 111 1 66 291 43 131 67 -63 -71 -143 -51 -125 -29
1784b9N3j43K8P5L9K6k04L9L2K05PJ00j70P2M1j37q8L9K8Op8j50Q6L7K1J13r7
$$ -29 24 -119 -91 -16 23 49 -155 -116 -84 121 128 228 58 130 171 34 -54 -15 13 19 -59 -209 -123 -86 -65 48 -49
1811d9Q9j52R3M0L7o2K6l1M1Q4MRr5o6k8j81K58j8j53O7K6o6J02j0L8J51q9M4
$$ -49 40 -112 -19 21 58 -4 22 -9 32 116 120 129 34 -32 -60 -241 17 -1 -154 -87 -61 -127 -25 -35 3 154 65 109
1839A09k44J75M7K1j40Q2J3j04K3p7R4qp7J2l8N2n0J16O5Lj71J04J27o9N0O4j97
$$ 109 -135 40 87 108 -32 50 63 -41 -18 -95 -1 -9 -86 -74 -112 -60 -110 6 71 74 -97 7 134 65 115 179 -18
1866a8K7r1P0M5P2j17q2jo3K33j07KJ8m9M8L5R5l6L6K3p0r9j12J75L0l0m6o1n5
$$ -18 9 -82 -12 33 105 -12 -94 -95 -158 75 -32 -30 -12 -61 -13 22 117 81 117 140 70 -29 -141 34 64 34 -12 -73 -128
1895a28Om6J17J6Q6l8j3JO6JL7L1j20r7J74p9L1J0p2j09N5k0JN8l1k1n8J47JJ43
$$ -128 -122 -168 -51 -35 51 13 0 1 67 68 105 136 16 -81 93 14 45 55 -17 -126 -71 -91 -90 -32 -63 -84 -142 5 6 149
1925A49j1n1o7O6m9R8q3J0Mj32K1j0O6l1L8q4r6R6j0J08l7L2K2J7q1Q4l1lJ24
$$ 149 138 87 20 86 37 135 52 62 66 -66 -45 -55 11 -20 18 -66 -162 -66 -76 32 -5 27 49 66 -15 69 38 35 159
1954A59j79P3j37N2k2J19j70J18o2pJ7N8kO0k9o0JK03j09J04j77J0j2K5nj0q6
$$ 159 -20 53 -84 -32 -54 65 -105 13 -49 -56 -39 19 17 77 48 -12 -11 192 83 187 10 20 8 33 28 18 -68
1981f8R1j06M8M8n4Q2m1J16j76P5q9J12K2o6N7m6r8P8j7J14q9j0L9k7q2k6J74
$$ -68 23 -83 -35 13 -41 41 0 116 -60 15 -74 38 60 -6 51 5 -93 -15 -32 82 -7 -17 22 -5 -87 -113 61
2008F1j42R7j54M6Q0Q4r4N8m7J07m7o3M2q0O5O5k41J52n3r3K13P0q6j2On7P0m1
$$ 61 -81 16 -138 -92 -12 72 -22 36 -11 96 49 -14 28 -52 13 78 -163 -11 -64 -157 56 126 40 28 34 -23 47 6
2036FJ8k8O1J22k00k1l4R2j04J65p9M4j23m9J65l9o4J7k0J70m4Rj2m5R3j73J17
$$ 6 24 -4 57 179 -21 -42 -76 16 -88 77 -2 42 -81 -130 35 -4 -68 -51 -71 99 55 64 52 7 100 -73 44
2063D4q6J15n1j15J60r1j6P8J0m8l5m2P6J1m0O1J8K1Lo3j4M0P3j76N0o0J03o4
$$ 44 -42 73 22 -93 67 -24 -40 38 48 0 -35 -77 -1 10 -30 31 49 70 73 10 -4 36 109 -67 -17 -77 26 -38
2091c8Q5j43J09J9J57j70O8Nj03o2J01L1J2N5q4j03m7JR5N1j17L0M7m6M7o6R5
$$ -38 47 -96 13 32 189 19 87 92 -11 -73 28 59 71 126 42 -61 -108 -107 -12 39 -78 -48 -1 -47 0 -66 29
2118B9j3o4R8p1m1J07j2o8J13n8j16oK10M0m3j52L5N8K9qr8R3j22M9o8J19m6m1
$$ 29 16 -48 50 -21 -62 45 33 -35 78 20 -96 -102 108 148 105 -47 -12 46 75 67 -31 62 -60 -11 -79 40 -6 -47
2146d7O0n3J50j68J14n8l0jP0O8j12J91k20Q6j08J15O2k27J32O9j02O8k4Ko2M8
$$ -47 13 -40 110 -58 56 -2 -32 -33 37 105 -7 184 -36 50 -58 57 119 -108 24 93 -9 59 35 37 -25 23
2172B3Pn3J12j77J58j26R6K5j6n7N8r8N4j04J28n2N3q2N4k2nk4m0R1jKJ25j29
$$ 23 30 -23 89 -88 70 -56 40 65 49 -8 50 -48 6 -98 30 -22 31 -51 3 -19 -24 -48 -88 3 2 4 129 0
2200@N3l1j35k2L69r0k41j65N41m94J56k61R48j093k46Q14m64N45J78p61P50n22
$$ 0 53 22 -113 -135 234 144 -97 -262 279 -215 -59 -320 628 -465 -711 103 -361 184 362 -399 351 -171
2222a71J15J59m3J36l04qr9M42k24R2l11K21J91N0k67j9j9J62j36N0J04r8q6J09
$$ -171 -56 103 60 196 -108 -116 -215 227 3 95 -216 5 196 246 -21 -40 -59 103 -33 17 121 23 -63 46
2246D6L1n8mk3j19Q9N2m0K9M6P0j12L6Q2o7j40J16O5l5q1JJ3J49j37j0j5j15J22
$$ 46 77 19 15 -8 -127 -38 14 -26 3 49 119 7 43 125 58 -82 34 99 64 -17 -16 -3 146 9 -1 -16 -131 -9
2274in9J09j3L1j01j3J88q5mJ4N1j51j8N3K5o8L8J1n8o6J34M2l3m6Kk7J66l9K10
$$ -9 -68 41 28 59 -42 -55 133 48 44 58 109 -42 -60 -7 18 -50 -12 -1 -59 -125 9 51 18 -28 -26 -53 113 74 284
2303B84l06J3P3j24Q6Q0k5j09LL5k7M9L0p1M6j19K3J20JQ4k70J21P0k2o3N2n1
$$ 284 -22 -9 64 -60 26 106 81 -28 -25 10 -17 32 62 -9 37 -82 -59 61 62 146 -124 -3 67 45 -18 34 -17
2330a7J7J26j24r3R8k9P9j92O4J6K1k2Q1K3n7j3R3r7o4J23K1j9n0q7Q1J8R9j55
$$ -17 0 126 2 -91 7 -22 57 -135 -71 -55 -34 -56 25 48 -9 -22 71 -26 -90 33 54 35 -15 -102 -21 -3 96 -59
2358e9O3j21R0k0m9N8M5l2n5J03JmP0l6j04L7J32p0OJ3j68J40j77R8k6QQ7j6J15
$$ -59 4 -117 -27 -47 -96 -38 7 -25 -80 23 24 20 90 54 -50 -13 119 49 55 68 -100 40 -137 -39 -65 -57 30 14 129
2387A29r4j09Q2Q8r9J10m3l7Q3n9r5O5%j62J40Pj01J05j34J13N6j11J04n3O5L4
$$ 129 35 -74 8 96 -3 107 64 27 110 51 -44 21 21 -141 -1 6 -95 10 -124 -11 45 -66 38 -15 50 84
2413H4K%j01J54j80J14n0l9jj11O6Q4n2%j4L1O0p4j04J69q2K8O1oJ25j35o1J8
$$ 84 86 86 -15 139 -41 73 23 -16 -17 -128 -62 22 -30 -30 -44 -13 47 -27 -131 38 -44 -16 45 39 164 29 -32 -14
2441a4%K4L3j31j6R3J47n1p7l8n6J36r4J15o7O5l5j4J7q7J41j29P0n1j01J04k3
$$ -14 -14 10 43 -88 -104 -11 136 85 8 -30 -86 50 -44 71 4 69 34 20 37 -50 91 -38 32 -19 -120 -16 -39
2468c9p1K8N2L8M9j07P4l8R5p0q3J12j4N3n5O6j63P2M7O5j14l5l1n6R5K2qP3j26
$$ -39 -110 -82 -30 8 57 -50 24 -14 81 11 -72 40 26 79 24 90 -73 -1 46 111 -3 -38 -69 -125 -30 -8 -16 57 -69
2497f9M7Lk0m5J56p3M3J1l9j1l0O4l3N9j20K22j73K2j9P7p1k7q2K7J70kp8mL0
$$ -69 -22 -19 -39 -84 72 -1 42 53 14 3 -27 37 4 63 -57 165 -8 14 -5 72 1 -26 -108 -81 89 87 9 5 35
2526C5R9k0j26M6k2p0r0K37l8o3L1p4J02l6j31J90K9m8j12KJ43lr2J06r9j7L0
$$ 35 134 114 -12 34 12 -58 -148 89 51 -12 19 -55 47 11 -120 70 99 51 -61 -59 84 81 -11 95 -4 -21 9
2553Im0l3J37j14J01j67P8P1M8Mj30Q3l8O6n5q0J6Q5k0R5j29O7Pq5P4j1j23P3
$$ 9 -31 -64 73 -41 60 -107 -29 42 90 94 -36 47 9 75 20 -60 -44 41 21 116 -13 54 61 -24 50 39 -84 -11
2581a1p5J16j5n8l3J5K7rK8P4P3r0n8J39j35J6J13r6n4P2q3j3M2j1K0Pm0J41j13
$$ -11 -86 30 15 -43 -76 -61 -34 -43 -15 59 132 42 -16 123 -12 4 117 21 -33 39 -44 -57 -15 -26 -6 1 -39 102 -11
2610a1O2j18O3K1K3nn4ML6k4n6O6l5RJ8J1J33q4r3qM3k4J2M5qJ09q8k6k1M2k4
$$ -11 51 -67 -4 17 40 35 -19 -15 21 -3 -59 7 -28 -19 -1 10 143 59 -34 -42 1 -23 -11 34 26 135 47 21 0 42 18
2641A8m7m8J39M2j48J19n3j5Rk6J55j04m4J1N7o7n7N9J23k15J51r2rN0n2m7Q4
$$ 18 -29 -77 62 104 -44 75 22 7 16 -10 145 41 -3 8 65 -2 -59 0 123 -92 59 -33 -42 8 -44 -91 -7
2668gL9O8j22O3m2K0K4k6m7M4O7q6J3J3N1r3r1J49K3j67R3%L1j36M7j0J28n7J04
$$ -7 32 100 -22 41 -1 19 43 17 -30 14 81 -5 8 21 72 -21 -112 37 60 -107 -14 -14 17 -119 -72 -82 46 -11 93
2697I3j49M1K1j82K12Pr1N2K0O8k08J50J4PJ1j28J30l7j9m1J37j78J38o9n7J20
$$ 93 -56 -15 6 -176 36 43 -48 4 24 92 -116 34 48 55 66 -62 68 31 12 -29 108 -70 68 -1 -58 62
2723F2j43J55j6L4j70J08M3j99L2J60j56M3QK4pj7nJ6L7J8m2j9J6K9M3qj62L8
$$ 62 -81 74 58 92 -78 30 73 -126 -94 66 -90 -47 -39 -15 -22 -39 -44 -28 9 27 -15 -34 -18 11 54 46 -116 -78
2751g8Q5K8L2j03P9Kj2k7pj5nrM5L4K3j00J01j48J51j19pN1n4qP5o8K5L5r1mJ72
$$ -78 7 35 67 -36 43 45 33 6 -1 -16 -21 -30 15 49 72 -28 73 -75 76 -43 -50 1 -53 -61 14 -54 -29 6 -85 -89 83
2782H3o4M6n3K4%l5P2k7K1r9l8R0M7p8M8n9M2J4Qj5j23M3M0k8K8J23m2k07J63
$$ 83 19 65 12 36 36 1 73 46 67 -32 -70 20 67 -11 37 -22 20 34 42 27 -96 -53 -13 -41 -13 110 68 -139 24
2811B4k6JQj9q7J28Lk7J7j8M0j16L8O1P7j70k0j1J71m8o1M3O7M4j21J30n7J2j40
$$ 24 -2 -1 7 -12 -99 29 32 5 22 4 44 -72 -34 27 104 -66 -86 -97 74 26 -35 8 75 119 -2 128 71 83 -57
2840e7J13Np0Q1J27j49o8JP2p7N2m4J8rJ5m0O2p6kk1J87j65j1Q2l0N8m0j13QQ6
$$ -57 56 61 -9 72 199 50 -18 -17 55 -22 30 -14 4 -5 10 -30 32 -44 -46 -67 120 -45 -56 26 -4 54 14 -99 -91 -5
2870eN4p0J3o9Q6O6o2p8J52j12mr8J28l7m6oQ1N9n5N1j28R3K8J4j20K0J28j19
$$ -5 49 -21 -8 -77 9 75 13 -65 87 -25 -29 -127 1 -36 -82 -88 -7 52 -3 48 -80 13 41 55 -65 -45 83 -36
2898c6N5N8r4J01k1K5j69J49j15J69n1m7j00J7J34o5MJ3J8Jk0n6m9J21j3o0J4
$$ -36 19 77 -17 84 63 88 -81 68 -47 122 71 24 -76 -59 75 10 14 27 45 46 26 -30 -79 42 29 -31 -17
2925a7J27j62Q2j5J6q1l1J70j12jP0n8N9q7q0J12J3r0l0J74o4K5l3n5J18N6j72
$$ -17 110 -52 30 15 31 -50 -81 89 -23 -24 46 -12 47 -40 -120 -8 5 -85 -115 59 -5 20 -13 -68 50 106 -66
2952f6oJ19j04L7O1J4p7N3n8n1J95j94L2M9j8J28n6Ql8P8kj51Q3k06J19K5M8K1
$$ -66 -72 47 -57 -20 41 55 -22 31 -27 -78 117 -77 -45 4 -14 114 58 66 28 106 104 -47 36 -170 -51 -26 22 43
2980D3j21K31j80K6Nk2JQ0k9l8n4M1K2q3J96p0j04J22M6j43qJ9J9M7r9P5o5L7
$$ 43 -78 153 -27 -1 4 -18 -17 63 34 -4 -58 -17 5 -78 118 48 -56 66 112 -31 -39 -20 -1 46 -53 22 -43 -6
3008fp4R2J4k9j22j9K05n3lp3K2Q7j16J4J00m0J01r6o0qL4Nk8qK6J00j90J70J10
$$ -6 -80 12 26 -3 -125 -144 61 8 5 -68 -46 41 -75 -61 39 -1 100 4 -56 -64 -30 -25 -53 -61 -35 65 -125 45 155
3037A55j30kq3j0M6L5L3j56J48j02Q9l5K8J13j72R1Mj8j86J18k9J21k3k7n4j3
$$ 155 25 23 -60 -70 -24 11 44 -112 36 -66 23 -12 16 129 -43 48 52 34 -152 -34 -63 58 35 8 -46 -59
3063e9M1k3R4mkn0LM2p7NK9N0l7j08K11j36N4k6jL6j72J17kN4rP6j34L8j3P2J08
$$ -59 -18 -41 53 49 47 -3 0 42 -35 -30 -1 49 12 -96 115 -21 33 7 6 42 -130 -13 -15 39 30 106 -28 10 -3 69 177
3094A77k15QJ5KJ34k34J30j4o1P6q1k7N3J92o5m1o8RK9n6q4L6J26j02J43m5L3
$$ 177 -38 -30 -15 -13 121 -113 17 3 -58 18 -63 -90 -37 155 90 49 -19 -10 19 -37 -121 -85 41 -61 82 37 70
3121G0j02J10Pm0o9p6N8R7J3l9n5L8L4o7l6M5o4P6k5M8O0j26R9N7J6n3r9j1Ll5
$$ 70 -32 78 85 45 -24 -100 -42 55 68 29 -26 12 46 -21 -57 -12 -76 0 -25 23 83 -43 56 113 129 76 -23 -34 -31 -66
3151f6Q8j16J32q4j1J81j98N4L8Qm5j23J13j7QN2q6J74j37j4NR0m2J8Mj61J52
$$ -66 22 -94 38 -46 -57 124 -74 -20 18 26 -19 -142 -29 -46 -38 14 -72 102 -35 -49 -44 46 4 22 26 -135 17
3178A7J2L7P8r0r8L6K2n8o5J84q8P9j0q5Q4j27Q9j17L7J15j55M1M1P5p7m7l7J27
$$ 17 29 66 144 54 -44 -8 14 -44 -109 75 -13 66 56 -29 55 -72 17 -100 -63 52 -103 -62 -21 54 -23 -70 -107 20
3206B0J07j83K5M2q6Q7j47J59Qj49K02o9j44J92j16L8K8oK0m1R2j63M2k1l6N1
$$ 20 127 -56 -31 11 -75 12 -135 24 32 -117 85 16 -128 64 -52 -14 14 8 28 -13 79 -84 -42 -63 -99 -48
3232d8k7J81o5n6N8j26R5P4k61Q1J13O6l8j68J10nNr9J37J1R6l8j99M2J30j86
$$ -48 -75 106 41 -15 43 -83 12 86 -175 -94 19 85 47 -121 -11 -16 -11 -110 27 38 134 96 -103 -61 69 -117
3258a17J42r3k6J92j11k4R6n1r3k2Q0P4n7M1k9M0p8Q1q9J56p6j7M4m7k7J23q7
$$ -117 25 -68 -94 98 -13 -37 59 8 -85 -107 -27 47 -10 31 2 42 -36 45 -44 112 36 19 63 16 -11 112 25
3285B5o5K0k1J62k8j40NR0l2P1n1j06N0k2J36j96L3N4l1Q0m2K1q9P3N4j18R1p9
$$ 25 -40 -20 -41 121 93 -47 -42 48 16 87 36 -70 -20 -42 94 -102 -69 -15 -46 34 -8 13 -76 -3 51 -67 24 -55
3313e5K7J00k3n8k8M8L4M2oL8k49M1J24n2P4r1r6J20q2J74K4j36R2l9J7k7k8m6
$$ -55 -28 72 49 -9 -37 11 45 87 81 119 -130 -89 35 -17 57 -34 -130 -10 -92 82 106 -30 62 23 40 13 -15 -61
3341f1J28j61J15m4p9K30k62K15j69Q0J3P1j36K1N6l1K1N6L6r4K2k2R4l1j8j43
$$ -61 67 -94 21 -23 -102 128 -134 81 -88 -8 5 76 -60 -39 17 -14 7 63 99 5 27 5 99 68 50 -93
3367i3K2M2M9j71J60m7k3R9J1k44J36J2O0j3jk4rP1J1j0j06J12l6J8n3N6J9L7
$$ -93 -71 -29 20 -151 9 -38 -61 38 49 -195 -59 -47 13 0 -1 -25 -34 37 48 38 -68 44 8 26 -27 29 48 85
3395H5o5k6j2n3P5N1P9p0p1O9j85J28o2J7K0NM5j60J18LPK3o6pN0l3N7j13J63
$$ 85 20 -6 -18 -71 4 55 134 64 -7 62 -123 5 -57 -40 -20 -15 30 -130 -12 -9 -2 21 -45 -52 -2 -35 22 -91 72
3424G2j07L2K3J7r3R6q7J5L5J15k01P3K4p5L2j1J03l1M2j61N6j18J64P0j14P8
$$ 72 -35 -3 20 37 -56 40 -47 -32 3 118 -83 -10 14 -61 -29 -40 63 32 74 -87 -31 -149 15 85 -29 49
3450D9o8Q2l4j08J49j40J25J6l1p5J03j33J14n4Mj7k4L9L8k8J32r0k2j18J18r5
$$ 49 -19 63 29 -79 70 -70 55 71 40 -35 68 -65 49 -5 -1 -18 -42 -3 35 7 139 49 27 -91 27 -68
3476f8K23j76P2K2o6l4P9L9r8M4K4q6K9Q3k9r7r5oJ11J09r0n1j6J02l9L2n3N6
$$ -68 155 -21 51 73 7 -27 52 91 -7 37 61 -25 4 87 58 -39 -134 -140 -29 80 -10 -61 -77 25 -14 18 -35 21
3504B1m0J62j23L1oq3L8J5jo9LP6q6P6N5j03M0M3l3m6M5R2o7m6J02n0o8O3j9p2
$$ 21 -19 143 20 51 45 -38 0 15 14 -55 -52 24 -62 14 69 -34 6 49 16 -30 15 107 40 -6 96 46 -22 41 22 -50
3534e0j9k1J54k6r1L1j0m8R5m6l7J29o7K8J4p2J3N6Pk0l4J21q5k0R0rp4NM1q4
$$ -50 -69 -90 64 38 -53 -22 -32 -80 15 -31 -68 61 -6 22 36 -36 -23 33 40 20 -14 107 22 2 92 83 9 14 55 -29
3564b9K3N4j17J05j8J0m9P4k88K10L1Q8Kp0o9N5M1j64P7P1k0J0K2l1lR1j60J19
$$ -29 -6 48 -69 36 18 28 -21 53 -235 -25 6 94 96 26 -43 12 53 -111 -34 37 17 27 49 18 15 106 -54 65
3592F5r8j12L5J43M0L0n5n1j3J03n9l6l1Q5q2P4k5p8nMN1MK8p9J24k8P2q7J3K4
$$ 65 -33 -145 -110 33 73 103 48 -3 -16 87 28 -8 -39 46 -36 38 13 -65 -70 -66 -15 -11 17 -62 62 34 106 19 32 56
3622E6Oq0O9n0Pmq7m3J08J09j02N6j37Q9j02K01O1j23P8r8kp6R3j7K2p4P8L0l2
$$ 56 62 -18 51 1 8 4 -83 -126 -18 91 -11 45 -92 -3 -105 96 157 34 112 14 12 -64 29 12 34 -40 38 68 36
3651C6r3K6M6m8P0j7m5n1l7K20j29O2J2o6J0m9L7J03n9j9m9J32q3J48j07l1M8
$$ 36 -57 -31 15 -33 37 20 -25 -76 -113 107 -22 40 52 -14 -4 -53 -16 87 28 9 -40 92 9 157 50 19 67
3678F7Rj10J66j12L8q5qj9J05QrR8j18N1j23J61j36J00q7j6J5q9R8n9N9Kq0Q9
$$ 67 76 -34 132 20 58 -27 -35 -54 51 59 50 148 30 81 -42 119 -17 83 -4 -20 -5 -94 4 -55 4 6 -74 15
3706A5N4j20Rp9J19j52J51n7N6J48j45j10K14r6mj9J03n5j1L9j41J08k2J1r1L0
$$ 15 69 -51 -42 -121 -2 -154 -3 -60 -4 144 -1 -111 103 7 3 -16 87 32 21 60 -81 27 5 16 -75 -45
3732d5o0J90j31J26k6K0j01J11K8q6J0q6J50m8k4K0Mj9O3l0q6p8R5o1R7n0J1L3
$$ -45 -105 85 -46 80 54 74 -27 84 112 26 36 -50 100 52 28 48 52 33 96 66 -20 -98 -3 -64 33 -17 -6 27
3760B7J02j97J4Q7nj9K9MPo1k7nK9j4PM4j14k2J70K0n1j00K2mJ88l2j54P5j63
$$ 27 129 -68 -54 33 28 9 38 42 49 -12 -39 -44 -15 -29 -22 22 -92 -114 56 76 25 -75 -53 -57 131 99 -55 20 -143
3789a43J23M6j11J9Q7l5L7Q3o8M8j79K7J11o5K5j45J80N8nj23%J06J2j55l8N9
$$ -143 -20 26 -85 -66 21 -14 23 106 38 86 -93 -66 45 -20 5 -140 40 98 93 -30 -30 76 88 -67 -105 -46
3815d6L6L0Nl0R1k6M6j68J53k0k0j4l6K8L1o3O7q9j3J20j70Q7J25k13J07j2Q5
$$ -46 -10 20 25 -5 86 60 106 -62 91 71 51 37 1 29 60 -3 64 -25 -38 82 -88 -1 124 -89 18 6 91
3842I1r2k1J06K5j59N2O9m1L4o3pj37J01l7N6n7J46n7Q3j0j52r0J63j9O2km6l0
$$ 91 -1 -22 84 109 -50 2 71 30 64 1 -6 -143 -42 -79 -23 -80 66 9 92 82 -70 -160 3 -16 46 44 -2 -32
3870c2K7K3j33J43p8J3pJ59k07Q9JpP2m9q8J33l7K1kL5ro7o2n0O8Q1k7k3J04K
$$ -32 -5 18 -115 28 -50 -37 -44 115 -92 -3 -2 -9 63 14 -74 59 22 43 41 76 67 0 -62 -112 -44 37 10 -13 91 93
3900I3j59O2j24K54j81J0N9q9m8J14j40J83l9j8N3j8N2L6j61j8O1P6K0j81J98
$$ 93 -66 -4 -128 126 -55 -45 14 -75 -123 -9 -149 34 -5 -23 30 12 64 100 -61 -79 -18 58 78 -103 95
3925I5r8j6K1J3l6J33n3nr2J10q2M7j7n1J44j32q9M3oP6Q1k02K32j17Qo2P5j4
$$ 95 -3 -19 2 15 -21 112 59 54 -38 72 -10 37 20 -31 113 -19 -108 -65 -71 5 86 -116 116 -1 7 -55 20 6
3953FP9m0q4J02q7J1o9o4J73O3q5jK0l6p0J35O8j36j40J54n0j3O4J2r8Q5l8J23
$$ 6 85 45 -39 63 -24 -13 -82 -146 27 90 5 4 24 -12 -82 53 121 -15 -155 -1 -51 -64 0 12 -86 -1 -39 84
3981H4j52P3mq2J70k09J77q3o0J04K5J1j06K01k27J66j4j47N4J8J37k10l5M3L5
$$ 84 -68 5 1 -81 89 -120 57 -26 -86 18 43 54 -52 149 -78 88 74 -73 -19 -1 136 -74 -109 -66 -31
4006c1m1O5O6q1M2n0l2J02l8J13j76O2O2l1m2o7j3P3P1j5N1n2j53J05O1L2p7L7
$$ -31 -72 -7 59 -22 20 -30 -62 40 2 115 -61 1 63 32 -10 -77 -90 -17 54 39 90 38 -115 -10 51 83 6 43
4034D3lk0N0j11M8J0j49J65j2o8J17j59P5J31j18J30j26K6K4jm1k0P2r7J09j01
$$ 43 40 20 70 -41 7 17 -132 33 21 -47 70 -89 -14 117 -1 129 3 29 53 52 11 -9 63 -34 75 -26
4060b6O4j18P5N1j01J30k2j03J27j02oL6k1Q7j40M8p8J21j01J96n4J1j09N1o8
$$ -26 38 -80 -5 46 -55 75 53 -50 77 -25 -31 5 -16 71 -69 -21 -99 22 -79 117 63 74 -35 16 -52
4085e2R1p5L8R6j96J02n0K5m1K6J34k16P4P3l8q0J20J4%l9O5oj91K82j05J0p%
$$ -52 39 -36 2 98 -98 4 -46 -21 -62 -36 98 -118 -44 29 -9 -89 31 45 45 6 71 65 -126 156 51 61 54 54
4113E4K8j36OM4k2Rpo9J88j68J19p8L5oJ8n5J16l8rr4J0Rj7M9j4J60r6J7m8k8
$$ 54 82 -54 -48 -4 -26 -17 -24 -93 95 -73 46 -32 3 -3 15 -40 76 38 29 -65 -55 -46 -63 -14 -28 132 36 53 5 -23
4143b3j45J44R0o8O1j28J6N0k5M9k3krL5O4q9J3%q3Q1r4J32m7M3k2k2p7J03o4
$$ -23 -168 -24 66 -2 59 -69 -53 -3 -28 21 -2 -4 -13 22 86 -3 10 10 -73 8 -86 46 -1 42 20 -2 -79 24 -40
4172d0O4Mn2L3o0M0l9P6K6r6l3M4M7j9o0P7j01J58j23K2l5J46r1L1j92J36Q6o7
$$ -40 24 28 -24 9 -51 -11 -50 26 52 -44 -77 -33 14 -5 -65 12 -89 69 -54 -32 -67 79 -12 19 -173 -37 49 -18
4200a8J17r2J1K6k3j2M8o1J05j95P8K9n4LJ16l0m6k6n0N3P0r7P0r1J5RJ32q7R0
$$ -18 99 7 18 44 21 9 57 -4 101 -94 -16 13 -41 -38 78 48 2 -24 -74 -21 49 -48 22 -69 -54 -45 87 0 90
4229I0k5nq8R0q4J43q1r0J53l9j31O3j24R2o9J02n4J11j07LLQ1j68Q3P7p3P5p7
$$ 90 65 60 -28 62 -22 121 40 -50 103 64 -67 -4 -128 -36 -105 -3 -57 54 -53 -50 -47 34 -134 -51 26 -47 28 -49
4257d9jk8L1j6K3O5j2J00j55OO8j51J15j20J86Np3R3q9O3m5o9J19j59Q2M8k9J9
$$ -49 -50 -78 -47 -63 -40 25 13 113 -42 -36 32 -119 -4 -124 62 67 -6 87 -2 61 16 -53 66 -93 -11 37 8 27
4285B7Pj10J5J26l7j5r2j2K21k01P2Q1k06L5J44j33L6%OL2L9o6J6Q9k9l0KK1l0
$$ 27 34 -76 -61 65 28 13 -79 -91 130 -71 1 82 -124 -89 55 -78 -42 -42 -36 -4 35 -31 -15 74 45 15 17 38 8
4314Hj08J11N5j0n6j04J34M6q2O2J3k11J80J3o8K9J0j12J91j57Q6j25K27k12N3
$$ 8 -100 11 66 56 0 -104 30 76 -6 56 69 -142 38 51 -17 12 22 -90 101 -56 30 -95 132 -80 -27
4339b7n9Q7q4K07o2k9n3k1J41j24J22m9qO3Q3k19O4l7M9n0o8J40j42J09k3Q1q5
$$ -27 -86 1 -83 124 62 33 -20 -41 100 -24 98 49 41 104 187 -32 32 -5 44 -6 -74 66 -76 33 10 91 6
4366FmJ6Mm4J09m2m7l2MN5o8Q2J6m3qL5N0j46O3j49J54k8o5KJ40q5l1j19J64M1
$$ 6 2 18 22 -22 87 45 -2 -34 -30 25 -43 39 55 12 4 39 89 -57 6 -143 11 -17 -82 -80 60 -25 -56 -175 -11 30
4396C0J0J2n4rnQ2o3M2q1o9J40J32k13J1lR4M7j9r8P1p3J3L3p6Q0N2M9j23q9N5
$$ 30 40 52 -2 -11 -16 66 3 45 -36 -105 35 167 -46 -35 -38 56 103 84 -14 57 -16 -3 30 -46 34 86 135 12 -77 -22
4426b2m3J79k3l6j53J26j16J02L7qo3o9J17j2j1np2J64j37L7l6Q7r1K4O7l9k1
$$ -22 -65 114 91 55 -98 28 -88 14 51 43 -20 -89 28 16 5 0 -72 92 -45 -8 -44 43 -48 -24 43 4 -17
4453a7Q6J4k8r6J14qj42K02q9p7J5Q2j05K2J5r3J42o2j1L9M3Q0j42j7O0l1oP4
$$ -17 69 83 55 -41 73 65 -77 125 36 -41 -26 56 -49 -27 -12 -105 37 -25 -36 3 46 126 -16 -33 27 -4 -10 64
4481F4k7k8K9Lo5K0L4o9n2J10p6Q6o6m8J16l5K1P2j45J01r2M0Jp7P1L2m3K7JP9
$$ 64 37 9 38 41 -24 -4 30 -39 -91 19 -57 29 -37 -85 31 -4 17 89 -56 45 -47 -7 -6 -83 -12 20 -23 4 5 84
4511H4j06K7K3l7RJ15m2r7N7O7j99K04k24J12Q2p8J4N3j5m2qp9J13r6m2J10on1
$$ 84 -22 5 28 -9 0 115 73 -24 33 100 -99 105 -119 -7 75 -3 11 64 49 7 -1 -80 33 -63 -105 5 -1 -52
4539e2M4j5J7l5O8kQ9j42R0j1k7n8L8n5o6J95n9o8N6n5J12o6M0K6j18K1K3j1R5
$$ -52 -8 -23 -6 -41 27 25 114 -28 62 51 24 -34 4 -51 -117 78 19 -49 7 -48 64 -2 38 64 -54 -33 -10 -21 74
4568G4mJ9j59R7j8L6J2j58J78p0MJJ8M9k00L4J00P0n8j13J59j05m6Q1K2q2L1J6
$$ 74 70 89 -70 27 9 45 57 -101 77 7 11 12 30 79 -121 -87 13 83 25 -88 71 -34 -80 1 23 -59 -28 -12
4596a2O8l4j03Q2M0l1N1P5j78l7Q5J5n8j63K31K6jj23Q6j47J10J8K5Q0Krq2L3
$$ -12 56 22 -81 1 41 10 61 136 -42 -79 6 21 -37 -200 31 57 56 -67 19 -128 -18 0 25 105 107 98 16 49
4624D9j22O2p0J74j52J20k3l0Q8j04P0%j6M4j1n3o9J0J8NN2p6J08r9O6p1RN6j30
$$ 49 -73 -11 -81 93 -59 61 38 8 96 -8 62 62 46 90 79 26 -43 -33 -15 -10 42 -34 74 -25 41 -30 -21 35 -95
4653i5J78q8Pl9j1L1O6Nnr1J14Oq6K9Kj22R6j7N8k8K8j32J01m1J15n0l6K2J02
$$ -95 83 -5 2 -37 -48 -17 49 54 49 -42 72 78 -8 21 23 -99 -3 -20 38 10 38 -94 7 -34 81 31 -5 17 119
4682A19k13J28o4P6O1r7mM5j15R6q9R5pj19J94j71M6J12j44KJ36j71Q4M2p6KM0
$$ 119 -94 34 -30 46 107 10 6 51 -64 32 -57 38 31 -88 106 -65 -19 93 -51 -49 87 -84 0 42 -34 -32 8
4709Hr7M1N5K9N6q4M1n2R6j01O9M7j69P1n5NN9l1J2K2l6RP8j5Oj29J03K9j9j9
$$ 8 -89 -48 7 36 92 8 49 -3 93 -8 61 108 -61 10 -45 -40 19 -12 0 22 -14 -5 73 58 64 -65 38 67 48 29
4739B9R3j53N5l3j1L9m9RrM3mnM5j03Q3Lj4Jj8l5M1j13J59k7k6pJ47j46k9M7l
$$ 29 122 -31 24 -9 -20 19 -30 -21 -30 13 9 4 49 -54 29 32 18 19 1 -34 7 -106 53 26 0 -7 140 -6 -35 12 9
4770IM7p8J60n6q9K9R4j84J67j41%l5J43j5J7j42J91p6q3J10q9Q6r0N6J53k24
$$ 9 56 -22 138 82 -7 22 116 -68 99 -42 -42 -77 66 51 68 -74 117 41 -42 68 -21 65 -25 31 184 -40
4796d0P2q9L1M0j10Q5m5N1j9n8J2K4M7N5p5n7Q9r1L1J38j13k3J6R4j08J0J3K4
$$ -40 32 -57 -26 14 -96 -11 -56 -5 -24 -82 -70 -46 1 56 -19 -76 13 -78 -47 91 -22 -45 -29 65 -43 -33 -20 4
4824DK3L1p2R9k5k7n3K0K4j14N0J53q0r6N6J0l8L9n7N8L1m5l3P5k6oN9r0jN4j24
$$ 4 27 58 -14 85 60 33 -20 0 24 -90 -40 113 33 -63 -7 3 -35 4 -53 5 36 -9 -42 33 7 1 60 -30 -31 23 -101
4855a01M7JN8k1k0lR3M9p2K6l4q5J25m7m3L4J1J5j02QK7n8M7J02j7qj06M2rJ60
$$ -101 -54 -53 5 -16 -36 -39 54 103 31 57 23 -62 63 16 -27 7 18 33 -69 -61 -34 -92 -45 57 40 32 -74 -32 -41 119
4885A19k26J17M2K7r8j3j1P4n7J0p1ON3J23j52P9KO1j12J8j8M2j9r2J72j30m3
$$ 119 -107 10 52 79 -19 -32 -43 31 -26 -16 -87 -81 -28 95 -57 22 24 85 -27 -9 -27 15 -4 -96 76 -54 -97
4912i7J41n0Q3j20nK6o3Q9j08O8l2j0J4m8J16J3P0rj7m8K5O2oo4O5j26K6k5j1
$$ -97 44 -6 77 -43 -48 -22 -85 4 -104 -36 -68 -78 -64 -112 4 17 87 78 61 13 38 100 94 30 95 -31 -5 -30 -41
4941d1L4N5j1j22J31r1Q5j31M4P7Nj1q1J1K5Q6q6m1N3k3L2r0O3n1J81l0j46L9
$$ -41 -7 48 37 -85 46 -45 40 -91 -47 30 35 24 -57 -46 -21 65 -21 -62 -9 -32 0 -90 -27 -78 103 73 -73 -34
4969c4L4l1J56p6j01l1m3Q5N3j12J2J12q8N2j4J23j65O0k2l5J17l4k5j0P5j22
$$ -34 0 -31 125 49 -52 -83 -126 -41 12 -100 -88 24 -64 -12 -26 97 -68 -8 -30 -65 52 18 -7 -17 58 -64
4995f4K5J07j38L2K6NL7j45J36p4P2k9no4J08J3k09K45o7K0K3n7j3N7q0N6lO5
$$ -64 -39 68 -70 -38 -12 -7 30 -115 21 -53 19 -10 -15 -79 29 42 -167 78 11 31 54 -3 -16 41 -39 17 14 79
5023G9p4L0L2m4J2j12K7Q7m8Kk7Q0j3j02J68j09K8m5L7j10r3K98j65M6L1J8l2
$$ 79 5 35 67 23 35 -77 -50 37 -11 -9 -36 44 31 -71 97 -12 16 -29 8 -102 -195 103 -62 -16 15 33 1
5050Aj11P2n2J15l3J14n3nj4k4P4q7m0k6J62q9M1o1JJ6o1O6j10N6J12j7j37J82
$$ 1 -110 -38 -90 25 -8 106 53 48 34 10 84 -3 -43 -69 93 4 45 -16 -15 1 -60 6 -104 -48 64 47 -90 92
5078I2q0q0M0L4L3M8k01N1K1k7P4j0q6k8J52p0N2Q3n8oJL8n8o1J1M4j08K5L8m5
$$ 92 12 -68 -28 6 39 87 -114 -63 -42 -69 5 -5 -91 -119 33 -37 15 98 40 34 35 73 15 -46 -35 9 -99 -74 -36 -81
5108h1J29K3n4k2J73k45O8N5r4Nl0N1K1M6m5k0J4Q4j73J30k0Q1m7n7r1J56j15
$$ -81 48 71 17 -5 168 -77 -9 46 -48 -43 -73 -22 -1 45 0 -20 -6 78 -95 35 15 96 49 -8 -99 57 -58
5135e8K2K2%kJ47q4q1L4j9j4N7Lm1l1K9P9j07O5n9NQ8j7r4m6O0K9N1j3M2o3l2
$$ -58 -36 -14 -14 -16 131 47 -34 0 -19 -33 24 27 -14 -45 -16 63 -44 21 -38 -33 55 38 -56 -102 -42 -13 38 25 67 4 -28
5166b8m7J22nj1j08P5Jn6K2J46q3j1l7J60r6mk1J7K6k2k5j1J24j34o3O9J3M9k5
$$ -28 -75 47 42 31 -77 -2 -1 -57 -35 111 28 17 -20 140 44 40 19 36 62 40 15 4 128 -6 -69 0 13 62 37
5195C7m4mJ8PP3n0lj24J0J6N6l8Q8k5N3k7j15P4l2M9l4K2j20M6R5l8J9n1k0J30
$$ 37 -7 -11 7 14 87 37 34 -90 -80 -64 -8 -46 42 17 70 43 -72 2 -30 19 -15 7 -113 -67 28 -10 9 -42 -62 68
5225F8k9K6j43P4J0Q6r7mo1J0rO4on6J41j17J51j7j68J52r1P3j22M7J9j3n8J03
$$ 68 39 65 -78 -4 6 92 -5 -9 -70 -60 -69 -5 -11 -67 74 -43 108 91 -77 75 -16 57 -65 -18 1 -12 -70 33
5253C3j48J64o3O5p1o2R8j8RN5j95P1J39r6O4M7j30P0ok8K4j3j04LJ48L6j39R4
$$ 33 -115 49 -14 51 -20 -82 16 -2 7 62 -133 -62 77 -19 45 92 -38 32 26 -2 22 9 -95 -92 56 92 -47 47
5281D7m2Jj19N5O7j1k5RO2o8M4l0j7q1J70n7j5J22j88P5J5k9Rm0J09l3k2P3j08
$$ 47 5 6 -113 -58 9 -2 -27 -18 44 -24 20 -10 -27 -108 62 5 -10 112 -76 -1 14 -15 -6 -46 63 30 8 81 -27
5310b7J38p6n0O5M8rj21qn5J13q2J56j86J32j22O8KJ41j19m3P9M0j8j22M6R8n0
$$ -27 111 35 -15 50 98 89 -32 -40 -95 18 -64 92 -94 38 -84 -16 -14 127 8 -35 44 84 66 -56 -10 88 38
5337C8Mj03Q8k6M0k5j13K27j32j2J1J04j11l5Q1K7j3l4Lj1Q4j10q1M6j1M8QJ69
$$ 38 42 -61 27 1 41 16 -97 130 -2 -14 -3 101 -10 -45 36 63 50 16 19 8 92 -18 -99 -53 -64 -16 -8 161
5365A61k40J74j53N7J32j62J08k3M1n4R7j89k5nJ59p3%kq7J12j16O4o4O9j8JM6
$$ 161 -79 95 -58 -1 131 -31 77 54 95 41 138 -51 -76 -81 78 5 5 3 -84 28 -88 -24 -88 -19 -37 -36 10
5392A0k2j1rL4M8j07m1N8J47k45J92k6q4l5J77K4k17J24j6l3M1Rj08N3O2m0J5
$$ 10 -12 -23 -32 2 50 -57 -98 -40 107 -138 54 28 -56 -91 86 110 -107 17 1 -32 9 18 -90 -37 25 -15 0
5419@M9m7K6j07J19K7j23mO6mL1o3L4J8p2j8N4Q0j11J38j24R5m3l0J6p2j9J18
$$ 0 49 2 28 -79 40 67 -56 -60 6 2 33 -30 4 22 -50 -68 -14 66 -45 93 -31 64 21 -9 7 -65 -84 34
5447C4n0J6Jj08J26KK5q0J6l4l0J28k36K72j08Oj5R0Jj33J56j50OK1j12J11L0
$$ 34 -16 0 1 -107 19 21 46 -34 -18 -52 -82 46 -190 82 -26 -20 -35 55 56 -77 79 -71 -65 -44 -156 -45 -15
5474a5%M4O0j03j3J58j10J9k11J95r3J38j73K7P7j3Q3q3J04j01N3j15J07kk15
$$ -15 -15 29 89 -14 -27 131 21 40 -171 24 -69 69 -104 -77 0 -13 70 -13 91 -10 43 -72 35 33 -182
5499a82K10p5M0k8j24N0J90q9n8Q1L7k2j1k5l7J07M3j05k4O8L4%k22O2J65j56
$$ -182 28 -47 -7 -35 -159 -109 81 -8 -66 15 52 30 19 -6 -43 64 107 2 -22 46 80 80 -142 -80 85 -71
5525g1J6LQ1l0rK9j5o3P1N8n3O9j03l%Q4p9JJ7j20K11j70N2kN8K6p1K5L7p3M3
$$ -71 -55 -52 29 -1 -10 19 4 -59 12 70 17 86 -17 -20 -20 64 -15 -14 3 -117 94 -76 -24 -26 32 58 -13 12 49 -24 19
5556A9o0k0p9J41o1J49l3m9j57J61Q4K3p9l2no0n3R9O1nn2J26j57JR3J03j64p5
$$ 19 -41 -61 -140 1 -60 89 56 7 -150 11 95 118 39 7 2 -58 -111 -12 49 44 -8 118 -39 -38 55 158 -6 -81
5584h1m1J43M2o3nq1q2J87o4m1P5K1l5J9M1j30J25R2j92O7N5mq7O3Rq0K03j60
$$ -81 -122 21 63 0 -5 -86 -168 19 -45 -86 -11 10 -25 -6 35 -95 30 122 -70 -3 52 48 -39 24 33 -47 156 -4
5612dl7Pk2jplJ60n8j1jk6Qnj05J8J4Q8M0j06Q8P7j30Op4J43q0N6j19K2P7N0j31
$$ -4 -41 -34 -56 -57 -64 -67 93 35 24 23 -3 5 0 -105 -87 -73 15 55 -51 37 114 -16 -10 -84 59 -21 35 -84 -62 15 65 -66
5644f6J36q7R4n5N1l7j2r1J45N7j87J8pQ4J6L7o7o5L2J2N3J9j56J69j24M8O8o2
$$ -66 70 -17 77 22 73 36 24 -67 78 135 -52 -34 -41 43 59 96 29 -36 -4 8 61 80 -76 93 -31 17 85 23
5672B3p4L3m6jJ21j26P3K3%j8R1o7M9m8q6J78j10n8k8K9Q4q0J23o3JNj55O5K9
$$ 23 -51 -18 -64 -65 56 -70 3 26 26 8 99 32 81 33 -53 125 15 -43 -71 -42 42 -38 85 22 23 28 -127 -62 -33
5701c3M4j8N2j26P8l0M4K5O2j23r7J82Pj34Jj14J52J9q1R4O9p8Mn2K3l3k3J51
$$ -33 11 -7 45 -81 -3 -33 11 36 98 -25 -122 60 67 -67 -66 -180 -28 -9 -90 4 73 -5 -1 -53 -30 -63 -86 65
5729F5N2p1j06P0R0j8j18J27j56J32j31Q7M5m1N5j30O2j00J44m4jL3j74Q9R7p2
$$ 65 117 46 -60 10 100 82 -36 91 -65 67 -64 23 68 27 82 -48 14 -86 58 14 13 46 -128 -39 58 -14
5755a4P0Mq5N5m5J18k13L9M6m9QN7j0O0mN7j88M1k4N7J3k0o5O8%j0Oj65K69L6
$$ -14 56 60 -25 30 -15 103 -110 -71 -25 -74 -66 -9 -19 41 37 94 -94 -53 -77 -20 -7 -27 -92 -24 -24 -34 -28 -193 76 112
5785A12j11j0l6J5L6qM0l8j02K6P0J9j9Q6j14L3kj4%m3O1n3O0m3J13j32Q2l8j4
$$ 112 1 -9 -45 -30 6 -2 38 0 -102 -76 -6 13 -6 80 -34 -1 -3 -17 -17 -60 1 -52 8 -35 78 -54 28 -10 -24
5814b4N7J3p2q1J5M5J37j56P9q3lJ52r2J11l7Nok3O2n7l8M2o1M6q2k2J33n7l4
$$ -24 33 46 -26 -107 -92 -47 90 -66 13 -70 -73 79 -13 98 61 66 60 37 99 42 4 46 -15 31 -51 -73 60 3 -31
5843c1L4J1k4l1N4K6m5P1j1j13j5J86p5J2L6o7M2n6r7R8J28m5j01r2R7P0n8m7
$$ -31 3 14 -10 -41 13 39 -6 65 54 -59 -74 112 37 49 85 18 60 4 -93 5 133 88 -13 -105 -8 62 4 -43
5871d3M7n9J47j02O5J00k62J57q6k4J05j16O2n3J11n6j20Q6M5r3KO7o8J18q0K2
$$ -43 4 -55 92 -10 55 155 -107 50 -36 -60 45 -71 -9 -62 49 -7 -127 -41 4 -89 -87 -20 -88 30 -50 -28
5897b8J1l5QJ34r9J4q0J69k9j50J07j7n9J02M7p7O2o8j7K9p3J02j22lO4P9m8j2
$$ -28 -17 -52 -44 90 -9 5 -75 94 65 -85 22 5 -54 48 95 18 80 12 -5 24 -49 53 -69 -72 -8 71 23 11
5925A1r9J79j20J7Q1l3l9N0j32Q8k0LJ9q4M8N6l6N7l7j07J77r9J57p9j11o5J2
$$ 11 -88 91 -29 -12 69 36 -3 47 -85 3 -17 -14 5 -79 -31 25 -11 46 9 -98 79 -20 137 58 -53 -118 -106
5952a06N2R0j02J22M2q7L0n2r0J96lp1o8Ol4P0KN4j01M8Q5j50O3m7O3n1O1J88
$$ -106 -54 36 -66 56 98 11 41 -11 -101 95 92 21 -47 -41 -75 -5 -3 51 -50 -2 83 -67 -4 -51 12 -39 22 210
5980B10j86j09J64l9n2R7o0l5j7P7n0J02q1n1kj29J08oJ21J9M5j33Q0o5o4k6J89
$$ 210 24 -85 79 40 -12 85 25 -10 -27 50 0 102 21 -30 -32 -161 -53 -59 62 81 126 -7 73 8 -56 -82 107
6007A07j73J62j24K3P0l4p3jKR1j31J39m3r4J50l3o4J82j52l8J31r9P0n8j12J78
$$ 107 -66 96 -28 -5 65 31 -42 -43 -41 50 -81 58 15 -79 71 38 -26 156 4 -34 97 -2 68 10 -102 76
6033G6m2j2k8M0o5M7O3j27P5m3n8N9O9j7k1k2j7J4Q4j01K9j39J16o5J35K6j11
$$ 76 34 22 -6 34 -31 16 79 -48 27 -16 -74 -15 54 37 16 -6 -23 -9 75 -26 3 -136 -20 -85 50 76 -35
6060c5R9j47j3K09j30j0L1M3k1j38R8j04K09k31J18LQ6j01M8o3J01j17R9r9L9
$$ -35 64 -83 -96 113 -17 -27 4 47 26 -112 -14 -118 91 -140 -22 -19 67 -34 14 -49 52 -65 34 -65 -26
6085b6k4K5m8P0n2J6J07j55O7J61j32j51Q9qJ2K6K2r2N2K4P5rJ17j61k3p7j0P6
$$ -26 -50 -25 -73 -3 -55 -39 68 -87 -20 141 9 -142 -53 -61 -49 -23 -1 -93 -41 -17 58 49 166 5 -18 -95 -105 -29
6113b9O8L3j27R0j28L3j3K28j85P4j1o8NK7k8O9P3j66J50q1J4l5lO3p1M7j00J79
$$ -29 39 72 -55 35 -93 -60 -73 155 -30 44 33 -35 -30 -3 -31 38 111 -55 95 14 28 -7 -10 53 -18 29 -71 108
6141A08j16K1q0J6j1N5p3K2k2Q2k9J6j6JK3q5K9J52j45M2R9j6o6j19J35pl2l2
$$ 108 -8 13 -67 -51 -62 -7 -80 -58 -80 2 -27 -11 -27 -26 -3 -88 -59 93 -52 -10 89 73 7 -112 23 16 -16 -48
6169d8J58k01J57j44L6r8J41Pq7K07j62Pm1P8p4K3J23n8j4l6P8r4Q4o4Q4r7l3
$$ -48 110 -91 66 -78 -42 -140 1 8 -79 128 -34 -27 -68 10 -64 -41 82 24 10 -26 52 -42 42 -22 62 -35 -68
6196f8Q0J0N4m6n0Q6m0ko5R6k8j26J03JN5p7R7j41QJ33j16N9m9j5jM8nJ2j24J82
$$ -68 12 22 76 30 -20 66 26 24 -41 55 27 -99 4 5 60 -17 80 -61 -53 80 -36 23 -26 -41 -42 6 1 13 -111 71
6226G1j41Q4j18M7R6N2j7q9M5n3lJ01j37L1Q6o6nMPL1k0o9LLN1M8o9k3L9J06j09
$$ 71 -70 14 -104 -57 39 91 74 -15 30 -23 -26 75 -62 -31 55 -11 -16 -12 -5 26 6 -63 -60 -57 -6 42 -27 -50 -11 95 -14
6257a4P0j05P7j9r8J33m1p4K1p9J29J9Nn5m7M4O2j08j3J19k3R1j35q0j4MK13l0
$$ -14 56 -49 28 9 -89 44 3 -71 -50 -129 0 19 24 -31 -78 -34 28 -80 -93 26 3 94 -41 -121 -135 -131 82 52
6285E2j26N2j0M1n0J36r0l3p0J97r6m4J8O9o8M7o3J44j6m3nk4l5K6m4M4m7q1J79
$$ 52 -74 -22 -32 9 -41 95 5 -28 -98 99 3 -41 -23 46 -22 25 -38 106 90 47 42 18 -17 9 -35 9 -38 -119 60
6314F0p1j1J0k3l3m1J54j4Jj45L2J54j1k4l5J0K5NJ22j69K7jr2LJ2J06n1K4K5
$$ 60 -11 -22 -12 -35 -68 -109 45 31 32 -113 -81 73 62 38 3 13 38 43 165 -4 23 22 -70 -67 -55 51 0 24 49
6343D9l7o2p6R2l0J25j24N5O5%j53P6k2J8J8l0J6j2koj00K30j69J46j05J02K0
$$ 49 12 -50 -126 -34 -64 61 -63 -8 57 57 -96 -20 -42 -24 -6 -36 -20 -32 -34 -40 -140 90 -79 67 -38 64 84
6370H4j21M5p7M0K6Q5o7q5K5N0j53K61j52L8J28j14n7q8L8P1p7J33l4N9m6j06
$$ 84 -37 8 -69 -29 -3 82 15 -70 -45 5 -148 113 -39 -1 127 13 -44 -132 -94 -23 -100 33 -1 58 12 -94
6396i4Q8N9Mr3J4l8J10qk2j04Q5K12l56K52r0k1Q7k06J05J37j14l4P0Rpnr6J64
$$ -94 -6 53 57 -36 -22 -60 50 42 20 -84 1 213 -143 109 19 -2 85 -121 -16 121 7 -27 43 52 45 40 -56 108
6424A08p4n6n3L8J71j77N8m9k8P3l6R0M7j36O8j06L3Q5Mj01M7J25l7L0r2l5p8
$$ 108 34 -22 -75 -37 134 -43 15 -34 -62 11 -25 65 112 -24 44 -62 -29 56 60 -41 6 131 94 124 32 -3 -81
6451h1O8L5J23j02k4j1N0J2l3kM1p6r4J95m1n0K9k9r0R1K1P9r2o8R9j31J14mo0
$$ -81 -13 22 145 43 19 8 58 70 37 35 76 0 -94 101 60 10 39 10 -80 11 32 111 19 -49 50 -81 33 29 -31
6480c1n9J47Lj00l6R9l4l1P8o5k9J46j09O2q8J99j94r1L1J15K1r9O2k1J28j95
$$ -31 -90 57 60 -40 -76 23 -11 -42 36 -29 -58 88 -21 41 -47 152 -42 -133 -102 13 34 -65 -3 -24 104 -91
6506i1M2Q7J1Rj9j62J70Om7jm5L1P3o0k2NN2m8l4J2N2j05P9P9q4L3o1N7N0j22
$$ -91 -49 38 49 58 39 -123 47 53 6 5 -40 -9 64 4 -18 -13 39 -9 -43 -31 21 -84 -5 74 -10 23 -38 19 69 -53
6536e3k0L5J08M1r9K5r8mO4P8l6r3K6j05K13q9J2m7Q4p1l2%k6J9O3o8J26p5M3
$$ -53 -73 -38 70 111 12 37 -61 -65 -1 77 41 -52 -26 -131 82 -7 5 -42 42 -29 -61 -61 -87 -68 -5 -73 53 -22 21
6565B1M8r0K5k%p0O4J9J6p7L1Jo3J30m8q5J46m9K9r3M0K8J1m5LO9N7j05r2J11
$$ 21 69 -21 4 2 2 -68 -4 15 31 -46 -15 -14 -77 53 5 -80 66 17 46 -47 -7 21 32 -13 -10 59 116 11 -81 30
6595C0j40J11M2m6K5m5N9k0mm7m2N2J09p3J8n1l2J31o1o8K3R2k48J70J17j41Q1
$$ 30 -110 1 43 -3 22 -23 36 16 12 -35 -77 -25 84 11 29 -22 -54 77 16 -52 -29 63 -185 -15 102 -39 42
6622D2j34J27n2n9J42lk9MJ4o2Q0r8L7J6o3k9K00j25j09P2L0m0J7M6l4J4R1rp0
$$ 42 -92 35 -17 -76 66 63 34 38 52 -10 70 -28 9 25 -38 -67 133 8 -101 -29 1 -39 -22 24 -10 4 95 86 16
6651A6K1j1j9r8P5N7%K4j79J99j54MM9J04o6L2J1l6kJ3p7PL5K9n0J49j48o5N0
$$ 16 37 26 7 -91 -16 41 41 65 -114 85 -69 -65 -16 88 22 54 65 29 27 40 -37 -30 5 34 -16 133 -15 -80 -30
6680c0jJ29j46O7l5N0n3k5J34j45k5J90j88M0L0P4K1n6l2J6r2P6K9j24Q3Q0j09
$$ -30 -31 98 -48 19 -16 34 -19 -44 90 -55 -80 110 -78 -38 -8 66 87 31 -1 15 -77 -1 28 -96 -13 67 -42
6707d2Q2k6O6j80O2n0J27r4lJ32j30P7J11j20J7K3j25J14p6K6k0N5j0o7R3o3q
$$ -42 40 14 80 -100 -38 -88 39 -55 -58 74 -56 21 132 12 29 52 -73 41 -35 -9 -29 26 16 -51 42 -21 -29
6734b9P1n4J14j61Q5M4r1r7J17l5P5J2j6p1N2p9P9L4k16J71Q4j39m4J93j83J54
$$ -29 42 -12 102 -59 26 70 -21 -118 -1 -36 39 51 35 -36 16 -63 16 50 -166 5 89 -50 -94 99 -84 70
6760G0n7o4J26r6M5j47Q9jL4J36j86J54j27L6N9j62J86j51Rj2J8O8o6M3K8K%j12
$$ 70 13 -51 75 -21 24 -123 -34 -35 -1 135 -51 103 -24 12 71 -91 95 -56 -47 -59 -41 27 -39 4 32 34 34 -78
6788g8P9M5K1j27J16p9l9QO0L3j1QOl6o8j7J05m0M9K2n1l0n9J54j18N9K2m3J5
$$ -78 1 46 67 -60 56 -23 -62 -54 6 39 28 36 42 6 -62 -79 26 -14 35 57 6 -24 -83 71 -47 12 34 -9 6
6817Fl7j5Q7q1m0K3M4q3K28j63R3O2j77l0R6J00j77P1K1l2O6o6Q0p5J0rnk6M3
$$ 6 -31 -46 41 -40 -80 -57 -13 -96 132 -31 62 124 -53 -83 13 113 -64 7 28 -4 62 -4 76 1 11 2 -3 -29 14
6846A4nM3N8j45Q9j49K31j56j4O6mM6N1j17q1Q4K3l2j0L1j3N0K1m9o4j0J47m3
$$ 14 9 52 110 -35 54 -95 136 -20 -34 32 28 74 125 8 -73 11 34 2 -8 23 10 60 81 32 -32 -42 105 62
6874F2O5m5l6n9Kk5Q8j6j85J60j46J49J7n5N6M0J6o3kL9j46N1P0j1j79J41R7j12
$$ 62 127 82 46 -13 -11 -36 52 36 -149 11 -135 14 31 -24 32 72 88 25 23 62 -84 -33 37 26 -153 -12 85 -27
6902b7L9O8o7om2MQj00Q1R6p8n9J84j33M2j5p4Q1l3K0K2l0K0o5L9J8M2%j15P6
$$ -27 12 80 13 7 -35 -31 -23 -123 -42 54 -24 -83 101 -32 10 -5 -79 2 -31 -11 11 -19 1 -64 -25 -7 35 35 -80 -4
6932dj9m8K7N1J0n6O7l9J14j92K1O9k6kj1J2k8K9mk1o7P7Q2l6k5J0J8J12j59j4
$$ -4 -23 -71 -44 7 17 -39 28 -11 103 -89 -68 1 -25 -27 -38 -26 -54 -25 -29 -50 -117 -40 42 6 -19 -9 9 121 -38 -52
6962e2M8j9R2n1ml0n9L5N8o8J22q2o4K3M8J8K6q2l0J42l3k7M5j49J83j08O3l5
$$ -52 -4 -23 69 18 14 -16 -75 -40 18 -50 72 -10 -74 -51 -3 15 41 -41 -71 71 38 11 56 -93 90 -18 45 10
6990A0K8J5j30J03o4Q5p3J00j16M5k5l1J06j83J01J2J7kp0p4J91p7M6R5j63K7
$$ 10 38 53 -77 26 -38 47 -26 74 -42 3 -22 -53 53 -130 -29 -17 0 -2 -72 -146 45 -32 14 109 -54 -27
7016b7o4J24P7j22J0J3l9M7K3r1N7N4r8L2k6P3j11K9k4Q5m8M8J0l2mm6J06J3j40
$$ -27 -91 33 110 -12 -2 11 -28 19 42 -49 8 62 -36 -4 -30 43 -68 -39 -63 22 -26 22 32 0 -4 -50 56 69 -71
7045g1N9K6NL2J7q1M4L0q9qR4k4j56J41j9L9Nn5Jk7j2R5j50J06j5O7j8j20k2p
$$ -71 -12 14 19 51 68 -13 31 61 -28 -36 58 34 -122 19 0 39 44 -11 -10 -37 -49 46 -104 2 -13 54 36 -84 -106 -113
7075a13J54l0n3n1R4N4j51N4L0L6l4R1N1j07%J9r6j9M5P1j11PN7p3N0J5j03J20
$$ -113 41 11 -42 -93 1 55 -96 -42 -12 24 -10 81 132 25 25 44 -52 -71 -26 45 -66 -59 -2 -75 -25 -10 -113 7
7103Gj2q5L9MM1j02P3P3p7O4k5n0J43r7K2L0n7KMJ15k4qk02J53R1j22n0P6n8n6
$$ 7 -5 -90 -51 -47 -6 -108 -35 38 -39 25 0 -50 93 -4 18 48 -9 -7 -3 112 88 80 -122 31 122 0 -50 26 -32 -88
7133h8J88j09J8M6o7o2N7J2r5k2J12p7N5M5j60J09O1j11N5J0jl0J03K1p1q0J76
$$ -88 100 -9 9 55 -12 -74 -17 -5 -100 -122 -10 -87 -32 13 -147 -38 23 -88 -33 -23 -24 -54 49 70 -1 -81 95
7160I5j21j3kLJJJ20n8M3p8j89K38k9k5Mn9LO7Pj57K25%p3M9l1j5j5r9mM5QL1
$$ 95 -26 -39 -41 -38 -37 -36 84 26 69 -9 -198 40 11 -14 -10 -69 -66 1 8 -149 76 76 3 52 21 6 -9 -108 -112 -67 -59 -28
7192b8M3o1KO3l3mL6q6J82j32jP0o9Jl3j01J05J53j15J3O7mk9N5K7p9j15M5J03
$$ -28 15 -46 -44 19 -14 -18 18 -68 114 -18 -19 51 -18 -17 -50 -151 -46 107 -8 5 72 68 39 94 121 42 -73 -28 75
7221G5on7m5pJ8K3Lp6N0L2J00lj2n2l7L8k7K3Mq5n8J53j32Q8j2J0l3j20J46M8
$$ 75 69 12 -33 -40 -22 1 4 -72 -22 10 110 107 95 43 6 44 17 40 44 -41 -99 54 -78 10 -2 8 -25 -145 1 49
7251D9o6j9J58p9p3k1O6K8M1rr3J03j58P0K8m4Ol0M3JMp5N8L1L9j12N9l1K7Q4
$$ 49 -17 -36 122 43 -30 -51 15 43 84 75 -18 85 -73 -3 25 -19 -13 -43 0 1 5 -70 -12 19 58 -54 5 -26 1 85
7281H5j51P9j8r8J70Lj76J70p8jl4K35k84J51K6q2K2p9l0P5O1j55K13n1j0l0m6
$$ 85 -66 13 -5 -103 67 70 -106 64 -14 -15 -49 186 -98 53 79 -3 19 -60 -90 -15 46 -109 104 53 43 13 -33
7308c3O3L1j3j19K02r1j29P6j2R1o0q9J05j12J34j0J8M7j85M9K6l3M9L5K8j00
$$ -33 30 61 48 -71 131 40 -89 -13 -25 66 6 -83 22 -90 44 34 52 99 -86 -37 -11 -44 5 40 68 -32
7334c2K7L5j44k0K00o0Q0l3j19N1J26j10p0N8J01r6Jm3J21r9J2n6J34m9K1m4o2
$$ -32 -5 30 -114 -134 66 6 86 53 -66 -15 111 1 -69 -11 90 -6 -5 -48 73 -26 -14 -70 64 15 36 -8 -70
7361g0J37p7k8J23p0rMK9j39J4K24j39n6J76p4m0K0J0p8mQ7m2J18j46Mn7J08j12
$$ -70 67 -10 -38 85 15 6 10 39 -100 -86 138 -1 -57 119 45 5 25 35 -43 -47 40 -2 116 -30 -26 -83 25 -87
7389h7J15Ml6O8k13J98k3l2L6m4LM5k8Rk4j32J66N4r9m8O0pp2N4N8m4Rj03J01
$$ -87 28 32 -4 64 -149 49 26 -6 30 -14 -11 34 6 15 -9 -141 25 79 -20 -68 -8 -15 -87 -33 25 -19 -10 -113 -12
7418a2Ko2J94k02O3L3%L8oN8j38P8p2l1k5J56o8oj9M0p6k0J52k6j20K4J31j38
$$ -12 -10 -72 122 -80 -17 16 16 54 48 106 -32 46 -26 -57 -82 74 6 0 -19 21 -55 -75 77 51 -69 -45 86 -52
7446e2rO0P7k7M1j49Q4P2Mqo0j12O9l7POJ9N2j20J82r0J7j5K0j35J59j6J3rj15
$$ -52 -61 -1 76 49 90 -59 25 97 101 93 33 -79 -10 -47 -40 -34 -15 37 -83 99 9 26 11 31 -104 55 39 52 43 -72
7476g2L0m8P3K5J15o9m3j03J11On5k3N4M0j0p4M2k7J15m1p6k0j4J14k1J08j73
$$ -72 -42 -90 -17 8 123 54 11 -92 19 25 -30 -53 1 41 31 -43 -1 -28 87 46 -30 -50 -64 50 29 137 -36
7503c6J28p4pO1nm5LQ7j1Nj2j00M7k0M5n0n7J09k09J81q8J31j11m0P0j09J86p6
$$ -36 92 18 11 72 67 22 25 112 101 106 94 -6 41 21 66 16 -41 68 -141 40 -48 83 -28 -68 2 -107 79 3
7531CK8j23J06l6J02L3j3n8L2Lj19jk5R8k5J6Lk4m7J04m8K1j06P4lj6O7p6J1p2
$$ 3 31 -92 14 -22 80 113 100 42 74 77 -42 -43 -68 30 5 21 24 0 -47 57 9 30 -76 -2 -5 -21 46 -30 -19 -91
7561i1O5k5L7o1O4M2j24J38J7p2n0J8j04J64Pk2j08P4J43j30J0r7oO9K0j12J32
$$ -91 -26 -51 -14 -75 -11 31 -93 45 62 -10 -60 -42 -146 18 25 3 -105 -31 112 -18 -8 -105 -111 -42 -22 -134 -2
7588bO3j11RJ49p9qj63J74J0j38N4lpJ7P5m2p1J37n3l9L5J6rr1j6R6pO3k8n1l6
$$ -2 61 -50 -41 108 29 21 -142 32 42 -96 -42 -45 -52 -35 40 -2 -73 64 11 -28 7 23 14 -77 -93 3 -4 59 31 -20 -56
7619e6J64p9M9j5p1o8P8J14q4j27J09N7L0j43O4o3K2K1j5J5J11k61J20M0q5M3
$$ -56 108 29 78 63 -8 -76 2 116 32 -95 14 71 101 -42 22 -41 -19 2 -13 2 113 -148 -28 12 -73 -30
7645c0o0J39L1j29P8j5L2o7j2M2m0l3MJ07nj04J26n4p6M7K4l7J2j46J89m3PR1
$$ -30 -90 49 80 -49 29 14 46 -21 -33 9 -31 -64 -60 47 42 -62 64 10 -66 -19 5 -32 -20 -166 23 -20 -13 78
7673G8j68j5J31o8K7J41q8l2L0p2N9q4k8J31j4L9r8Q6o8J07k01K22r9p1M6m9M8
$$ 78 -90 -105 26 -42 -15 126 38 6 36 -36 23 -61 -89 42 28 67 -31 55 -13 94 -107 115 16 -55 -9 -58 -10
7700a0qJ5j15K12j26l1J7O3k5p0J9k6M1m1J75j17q0J43K7m5n3k1N0J18k64P2N5
$$ -10 -18 -3 -118 94 -32 -63 -46 17 -8 -78 -59 -85 -44 -85 90 -27 -107 36 63 18 -35 -56 -6 112 -152 -80 -25
7727b5m0Q5j3On1J8N2j43P1n8L1R6k57K74q3J15j32K1L2jK3k9Q2p8Q2m5n4q2J57
$$ -25 -65 20 7 13 -38 -20 32 -111 -40 -98 -67 29 -228 46 -37 78 -54 -33 -1 -2 21 -8 74 -4 78 33 -21 -103 54
7756E4l8K2J00n6j01j21J28o7Q0r8K2N3n1l2P4K3r2L8M5m6J25j2k8l9J23K0m6
$$ 54 16 38 138 82 -19 -140 -12 -79 1 -97 -75 -22 -73 -105 -31 -8 -100 -62 -17 -63 62 50 22 -17 106 126 80
7783H0K3r5JK0Jp9J6J17j04O5j04Q5k0l5J38j45J11L8q8p4j14K48r6lQ5p6j8Q2
$$ 80 103 8 9 29 30 -49 -33 84 -20 45 -59 26 6 -29 109 -36 75 113 25 -49 -163 85 -11 -14 71 -5 -23 59
7811E9q3J00L8j08K0q0N7o7P9m8m9K2O6oJ48j49N1j21O7J20j54K0M8j28J02K5
$$ 59 -24 76 114 6 26 -54 3 -64 15 -33 -82 -60 6 0 148 -1 50 -71 -4 116 -38 -18 30 -98 4 29
7837B9l6K3J16j51K2M2M4k3n1l0J05k1k5l8n2j4P6l7o2Q4J7k7N5j55J34p4m0J25
$$ 29 -7 16 132 -19 3 45 89 66 15 -15 90 69 44 6 -46 -60 16 -21 -83 1 18 -9 46 -109 25 -49 -89 36
7865C6o7L6P8%m7r5JN1j5J1O3P5m3j52P5M1p6O1l0PP3j52Q4m2OQ8r4q7J13j0M0
$$ 36 -31 5 83 83 36 -59 -58 -7 -22 -11 52 127 84 -68 7 48 -28 33 3 10 83 -69 15 -27 -21 67 -27 -114 -1 -11 29
7896B9j0N6j27K8J5k3L7j01J59m0j1n0O4q2J03n4K8k5l1L2P8k09N9J29m0p9K7
$$ 29 19 75 -52 -24 -9 -32 5 -96 63 23 12 -38 26 -56 47 -7 21 -4 -35 -3 75 -134 -75 54 14 -65 -38
7923c8L7J70j36oJ4k3Qr7M5r1J69j7m1k4N1j06K41o4q9rn5Jl0J7O0J60j34n1p8
$$ -38 -1 169 33 27 41 18 26 -71 -26 -117 52 35 -6 -30 21 -85 156 92 3 -6 -61 -60 -90 -73 -13 147 13 -38 -116
7952a16P4l6J13j1N9p3p8R2K1m3N6o9pN2n4L4o1O2qJ4o2L8k0J20j02mj6J23r3
$$ -116 -42 -78 35 24 83 10 -68 24 45 2 58 -11 -18 34 -20 14 -47 15 7 21 -41 -3 -23 97 -5 -9 -25 98 5
7981EL5n5J19j36Q4j3q6o4J06mj47K79j50J00k6j00Q0L5j12N7l4lQ2Qj11L5K7
$$ 5 40 -15 104 -32 52 39 -47 -111 -5 -9 -156 123 -27 73 47 -53 27 62 -50 7 -27 -30 52 60 -51 -16 11
8008A1J20j48rNj4P8n7N5J3n9L3Jj31J40j38Q1M1o3o6P1ok5Q9p3jJ20j04O4L3
$$ 11 131 -17 -26 -21 -35 43 -14 41 54 -5 28 29 -102 38 -100 -19 22 -41 -107 -36 -42 -67 22 -51 -52 68 -36 28 61
8037F1p5K9j64J89m1o4J06K0q7LJ38j46J4l9j0J04j01m6J86j19O7L6n2Ll6O8j19
$$ 61 -14 15 -149 40 -1 -65 41 61 -26 -23 115 -31 -17 -56 -66 38 -63 -109 77 -42 25 61 9 12 -24 44 -75
8064g5K5n6K00j6q1J8lo5K6nQ0l9k5p3K01q5j02J39q1J2mNL8j48J16Rpm7K6MP8
$$ -75 -50 -106 94 78 -3 15 12 -53 -27 -32 48 9 -16 -89 112 27 -75 64 -17 -5 -9 -4 34 -114 2 11 4 -43 -17 -13 65
8095F5l6k8O5n6o6m1J24J1o4n9M4J37j45J07l9J4%Lm7k4J6N1Rj06J08j12p0J42
$$ 65 29 1 66 10 -56 -97 27 38 -26 -85 -41 96 -49 58 19 33 33 36 -11 -35 -19 32 41 -65 43 -69 -139 3
8123Cpl3j0l0J06l0N1m8O7j16J09n6M5K7n5L7j12L7K6NP1j92P4O9o6O3J6k0k3
$$ 3 -4 -37 -47 -77 29 -1 50 2 69 -47 62 6 51 78 23 60 -52 -15 11 16 87 -105 -31 38 -28 35 51 31 8
8152Hl1P8p2Qp3M2J1O0J2l7k5J1q0N6m4J05p1J17j58J16k6n1J8M7j8J14n7K5p3
$$ 8 -23 55 -17 -9 -82 -40 -29 31 43 6 -19 -8 -88 -32 -76 29 -42 75 -83 33 7 -44 -26 21 3 117 60 85 12
8181A2l3P8m5Q2k2j35J59m4o3K4
$$ 12 -21 57 12 94 72 -63 96 52 -11 13
8191A3
$$ Imaginary data points
##PAGE= N=2
##DATA TABLE= (X++(I..I)), XYDATA
0@%%%%%%%%%%Qj6J6j6J6k4L2m0M8n6P2q8J04j20J42j66J92k24K56k96L41l87M39
$$ 0 0 0 0 0 0 0 0 0 0 0 8 -8 8 -8 8 -16 16 -24 24 -32 40 -48 56 -64 78 -88 104 -120 136 -160 181 -206 233
33B33m97N63o35P14q00Q92r95J111j236J371j519J680j855K049k259K488k744
$$ 233 -264 299 -336 378 -422 470 -525 586 -650 721 -798 882 -973 1076 -1183 1305 -1439
50a439L023l328L669m049M472m949N491o113O835p683Q698r940J1494j3511J6252
$$ -1439 1584 -1744 1925 -2124 2348 -2601 2890 -3223 3612 -4071 4627 -5313 6181 -7330 8922
65H922k0198K6400l7634O4358k45573k14630M96805J76951j92177j75396J34299
$$ 8922 -11276 15124 -22510 41848 -203725 -418355 78450 255401 63224 -112172 22127
76B2127J28250K1598l9500l7406o5450L7165P1805p9111k26752n5014J89847J40421
$$ 22127 150377 171975 132475 95069 29619 66784 138589 59478 -167274 -222288 -32441 107980
88A07980j45947j89456K9648J56170O6412o809j3498j3084P692P1192L7488o7863
$$ 107980 -37967 -227423 -197775 -41605 24807 17998 4500 -8584 -892 70300 107788 39925
100C9925l1183J11288O1734j20071j27166K7320P6426j945m7282m5665o5454l1217
$$ 39925 8742 120030 181764 61693 -65473 -38153 38273 36328 -10954 -56619 -122073 -153290
112a53290O4991O7650k0414k2792M9191M3484k1428O88P8270M6041m8310l6639
$$ -153290 -88299 -20649 -41063 -63855 -14664 28820 7392 8080 86350 132391 84081 47442
124D7442J9668k1704p3628j460Q1096O36j22742o8458O5865O4207j6708k1602
$$ 47442 67110 45406 -28222 -29682 51414 52050 -70692 -139150 -73285 -9078 -25786 -47388
136d7388J6449N664j3229K0534M2284Q998L153L0252K491m6756k0954M1568L4820
$$ -47388 -30939 -25275 -38504 -17970 24314 33312 36465 66717 69208 22452 1498 43066 77886
149G7886k6569m8414l2964l0672q878L5833K6349k9226l9130J0949M3930K0013
$$ 77886 51317 2903 -30061 -60733 -69611 -33778 -7429 -36655 -75785 -64836 -20906 -893
161h93J332K5565L3812l854l1633j4177J6714J8853L350q182l3087n0953j1549
$$ -893 439 26004 59816 55962 24329 10152 26866 45719 49069 40887 7800 -43153 -54702
174e4702L9124K7983j6703l0305j2996l95Q832K6165K2288k332m07J4386L57j6533
$$ -54702 -15578 12405 -4298 -34603 -47599 -47994 -39162 -12997 9291 6959 6552 20938 21295 4762
188D762M544M3073L3620l2264o8868k6297L1120L0460j4965l6833j4143L466P54
$$ 4762 9306 52379 85999 53735 -15133 -41430 -10310 20150 5185 -31648 -45791 -42325 -41571
201d1571M645J4088K0602K1417N127j7700j6936J2966L7984K0518j8385l2467
$$ -41571 -36926 -22838 -2236 19181 24308 6608 -10328 2638 40622 61140 42755 10288
213A0288k0852j533J5208J2783n236j9432j9060o121J053J091J1838K0607N964
$$ 10288 -10564 -12097 3111 15894 10658 -8774 -27834 -33955 -32902 -31811 -19973 634 6598
226F598j6987j7303J1907L4449K2313J485p554j4928j5319j706J1790R773j0025
$$ 6598 -10389 -27692 -15785 18664 40977 42462 34908 19980 4661 2955 14745 24518 14493
239A4493k4196k0903j0848N045J9943J2540m878o890J945M855J380J1660K8027
$$ 14493 -9703 -30606 -41454 -36409 -16466 -3926 -8804 -15694 -13749 -8894 -7514 4146 32173
252C2173J2649k2963k7497n58K1388J6175m283j5016j7764j4710l31Q846K689
$$ 32173 44822 21859 -5638 -6196 15192 31367 27084 12068 -5696 -20406 -20737 -11891 -9202
265i202k359j668l541j0156o293J6877L1368J4125q538j3940p140P015J8346J3810
$$ -9202 -11561 -13229 -16770 -26926 -33219 -16342 15026 29151 20613 6673 -467 6548 24894 38704
279C8704p633k5725j6847J393n3m163M131P949m572j8112j0202J2382K1681J4360
$$ 38704 31071 5346 -11501 -10108 -10161 -14324 -10193 -2244 -6816 -24928 -35130 -22748 -1067 13293
293A3293K796j0875j3889R51J7120J7692K183r682q636q186q486K289R401J955
$$ 13293 16089 5214 -8675 -7724 9396 27088 29271 19589 10953 2767 -5719 -3430 5971 7926
307G926j0026j4363r887l512O157J8593J4628o446j3641j526J1995J5054R284
$$ 7926 -2100 -16463 -26350 -29862 -23705 -5112 9516 3070 -10571 -12097 -102 14952 24236
320B4236L074o086j4394r275K852N710L000k008q729j3363j0673K910J4804R860
$$ 24236 27310 21224 6830 -2445 407 6117 9117 7109 -1620 -14983 -25656 -22746 -7942 1918
334A918j291o471p754k439R028J7248J2259l826j1461m261J477L603N849L478
$$ 1918 627 -5844 -13598 -16037 -7009 10239 22498 18672 7211 2950 4427 8030 13879 17357
348A7357n255j3664j3518m203M563P278O461k455j1343o771N941J4915J2985L322
$$ 17357 12102 -1562 -15080 -19283 -14720 -7442 -981 -3436 -14779 -21550 -15609 -694 12291 15613
362A5613l611o587n080L149Q572N070j785q022j0092p222k828O009R275L45r805
$$ 15613 12002 5415 335 3484 12056 17126 15341 7319 -2773 -9995 -12823 -6814 2461 2806 -6999
377f999j0970l166Q057J2377Q286O38o998n161L873P523O812M204j529p455j0491
$$ -6999 -17969 -21135 -13078 -701 7585 8223 1225 -3936 -63 7460 14272 18476 16947 9492 -999
392i99o598K573O636L015m529j2164r446K123J0896J0676L054m768m205j17L635
$$ -999 -7597 -5024 1612 4627 98 -12066 -21512 -19389 -8493 2183 5237 469 -3736 -3853 -218
407b18O705O468L170k467q843p879l02N894O912n93j0857j1262l216M635P072
$$ -218 6487 12955 16125 13658 4815 -3064 -3366 2528 9440 8847 -2010 -13272 -16488 -11853 -4781
422d781L452J10k820m922l91O887R220O912P59n597o064k873K999O468K109n623
$$ -4781 -1329 -1219 -4039 -8961 -9352 -2465 6755 13667 14426 8829 2765 -108 2891 9359 11468 5845
438E845r676q411j186N087N827K961k741o522l157L581Q000P361K167j363l560
$$ 5845 -3831 -12242 -13428 -8341 -2514 447 -2294 -8816 -11973 -8392 -392 6969 9136 7773 4213
453D213l960M76N548N901J168o571r814n915J288O115L393l469o016m032o81M102
$$ 4213 253 729 6277 12178 13346 6775 -3039 -8954 -7666 -1551 1842 -1627 -7643 -11675 -12356 -8254
469h254O801N148K574j425m177j927L675Q406M747m301q563o774j361M122L123
$$ -8254 -1453 3695 6269 4844 667 -1260 2415 10821 15568 11267 2704 -4070 -5431 -1309 1814
484A814j318l012m365m983l79N292P128K741j827k391j991R42O572P215J742l781
$$ 1814 496 -2516 -6881 -11864 -12243 -6951 177 2918 1091 -1300 -3291 -2349 4223 11438 13180 9399
500I399o900m597J559M351J794k960n738n543l570J868O100K959p06p55j171q54
$$ 9399 2499 -2098 -539 3812 5606 2646 -3092 -8635 -12205 -10337 -4237 -1278 -1984 -2739 -3910 -4764
516d764K764O654O759R71o011o482q50N370L969k532n098l243l482k566J491L275
$$ -4764 -2000 4654 11413 12384 6373 -109 -959 4411 8380 5848 750 -2493 -5975 -8541 -7050 -3775
532c775K108m52k727l158m54O029R288L263m438m850L6M450L067j025j301j300
$$ -3775 -1667 -2119 -4846 -8004 -8458 -2429 6859 10122 5684 834 870 5320 8387 7362 6061 4761
548D761m522n778k206L377M028p60l824m029j515L614P118N000n89l717j059K665
$$ 4761 239 -5539 -7745 -4368 -340 -1100 -4924 -8953 -10468 -6854 264 5264 4675 958 -101 2564
564B564K398J377J796j70l061n531m088J696M338L60l799m874k289M37K746N122
$$ 2564 4962 6339 8135 7965 4904 -627 -4715 -3019 1319 1679 -2120 -6994 -9283 -8846 -6100 -978
580i78L013j848k312M40K563L620L417J078j967l749l092m20J327K079q51m393
$$ -978 2035 187 -2125 -1685 878 4498 7915 8993 7026 3277 185 -235 1092 3171 2320 -2073
596b073m457k441Q15M620L677q58k839p39K001K727K859K999J099k269k733j778
$$ -2073 -6530 -8971 -8156 -3536 141 -717 -3556 -4295 -2294 433 3292 6291 7390 5121 2388 610
612F10R15L297J202l267n026l312n17J710K264O46j684j951M35J228J804L844
$$ 610 1525 4822 6024 2757 -2269 -5581 -6098 -4388 -2124 -1478 -3162 -5113 -4678 -3450 -1646 2198
628B198L332L54k684k752M75L597K563j383m265l687r43k8P45J049k93j508j637
$$ 2198 5530 5884 3200 448 923 4520 7083 5700 1435 -2252 -3195 -3223 -2478 -1429 -1722 -3230 -4867
645d867j289J285L947L670O28j691j888M96K127K683J472j547l042k593j101M17
$$ -4867 -6156 -4871 -924 2746 3374 1683 -205 291 2418 5101 6573 5026 1984 -609 -1710 -1293
661a293J040L18j073k681k616R0K469L175K041o53j359p54J328L111K148K05j258
$$ -1293 -253 65 -1008 -3689 -6305 -6215 -3746 -571 1470 817 -542 -1296 32 3143 5291 5496 4238
678D238k419j939l63R42J313k47k682l128j159Q92K234J753M98r22j457J72K299
$$ 4238 1819 -120 -483 459 1772 1525 -1157 -4285 -5444 -4552 -2318 -565 -67 -989 -2446 -2274 25
695B5K588J742K60j531j672q21N22J384N10j343k818k889o17J630J592O87n80
$$ 25 2613 4355 4615 3084 1412 591 1113 2497 3007 1664 -1154 -4043 -4660 -3030 -1438 -751 -1331
712a331j514m47R13K024K704J426k97j669j342L88J710R58k26j892k605j546j85
$$ -1331 -2845 -3292 -2379 -355 2349 3775 3478 1809 467 855 2565 3523 3297 1405 -1200 -2746 -2931
729b931R91R57J3j260j421m28J551K331J914P74o74j293j07J122J756J018r46
$$ -2931 -1940 -983 -970 -2230 -3651 -4079 -2528 -197 1717 2491 1817 524 417 1539 3295 4313 3367
746C367k068j963j005K63Q62L34o06j730j466N1J696K198J288l88p28l31M91J568
$$ 3367 1299 -664 -1669 -1406 -544 -210 -816 -2546 -4012 -3961 -2265 -67 1221 833 105 -226 265 1833
764A833J761L05p54j865j618j72O20O95k99j762j630q47L51J628J244N86m41p23
$$ 1833 3594 3899 3145 1280 -338 -510 110 805 506 -1256 -2886 -3733 -3382 -1754 -510 76 -365 -1088
782a088l8J402J850J127J85j116j328p29J02R72M22j072j803j593m77Q24J014
$$ -1088 -1126 276 2126 3253 3438 2322 994 265 367 1339 1761 689 -1114 -2707 -3184 -2360 -1346
799a346P17o5p99l80M15J341J956R44l59r85r79K15Q45M71Nj133j908j051j87
$$ -1346 -629 -694 -1493 -1873 -1458 -117 1839 2783 2424 1439 460 675 1520 1991 1996 863 -1045 -2096 -2283
818b283O26R41l0n47r04k58P69J722J404M30m77p30k7M57P37Q38p07j244j166
$$ -2283 -1657 -716 -746 -1293 -2197 -2455 -1686 36 1440 1870 1393 663 636 1093 1830 2668 1961 717 -449
837d49r81J02P43K74j66j238p89K55Q66J322J118j26m82l87P4J049R58K35o60
$$ -449 -1430 -1328 -585 -311 -477 -1715 -2504 -2249 -1383 -61 1057 931 449 62 136 1185 2143 2378 1718
856A718j015j208q6L01M20m3p80j068n46J34J168J044L21j99o43p1P92R85P41
$$ 1718 703 -505 -591 -290 130 87 -693 -1761 -2307 -2173 -1005 39 360 161 -482 -553 239 1224 1965
875A965J56q11q88n16l9N10L81l05r89j010m01M38R36N46J21o37l66L05P62Q91
$$ 1965 2121 1310 422 -94 -133 377 758 453 -536 -1546 -1947 -1509 -573 -27 94 -543 -909 -604 158 1049
895A049O16j50o18n77k23K92M96N2o16j088o72n2M83Q41J22l91n17n0N09P08P58
$$ 1049 1665 1515 897 320 97 389 885 937 321 -767 -1439 -1491 -1008 -167 -45 -436 -953 -1003 -494 214 972
916I72L68m23n34k26J80L34N79j37p77r82m99K11N58L11p9o27m76J12M98P84P35
$$ 972 1340 917 383 157 337 671 1250 1113 336 -646 -1145 -934 -376 -65 -144 -771 -1247 -1135 -637 147 882
937H82m2m20k87j44M32P70N1l55q53o25j25K49M19Q7l78n55j16k7N20O72L95j39
$$ 882 840 420 133 -11 421 1191 1242 887 34 -591 -716 -467 -48 39 -339 -894 -1010 -1037 -517 155 550 411
959D11k75l17J69O12N82P6n62n54m91j53N58J48j06m09p12j73K21N04O30K01l82
$$ 411 136 -181 -12 600 1182 1258 696 142 -349 -502 56 204 98 -311 -1023 -1196 -975 -471 159 360 -22
980b2k92Q3K89O93K89M6m68o76j68L50J14K12l06o69m71L7J77M82L14J4k54l91
$$ -22 -314 -231 58 751 1040 1086 618 -58 -226 124 238 450 144 -525 -996 -959 -782 -300 14 28 -226 -617
1002f17J73O21M70L68j61m63m01R6K42K68j35l60o32k99J71J60L01K03k68m55
$$ -617 -444 177 647 1015 854 391 -10 86 328 596 461 101 -531 -830 -659 -499 -198 5 -263 -718
1022g18j2L19N85L40L06k44j95l28K47L62N9k6n35n42k19Q8J79L76j83k81m17
$$ -718 -730 -411 174 514 820 576 381 53 300 662 721 695 160 -382 -601 -513 -334 42 -141 -422 -839
1043h39J36L98L69L48O1k24k11q8M19K36K43j74n45l83o0Q4J86J15j80n23l21
$$ -839 -703 -305 64 412 473 249 38 -50 369 605 848 674 129 -254 -314 -230 -44 71 -109 -632 -953
1064i53K82L38L40L39j94k66k7J77N44K72l9l44m27j44RL4J87j2m76m67M1J30
$$ -953 -671 -333 7 346 152 -114 -141 36 580 852 813 469 42 -102 -93 -59 128 116 -360 -827 -786 -656
1086f56L58L02M0j69j93K56L16K85J59P5m51k64qJ00J83j0l12n18k28q3J72M58
$$ -656 -298 4 44 -125 -318 -62 254 539 698 773 322 58 50 150 333 323 11 -507 -735 -818 -646 -188
1108a88R4Rk21r2J77L99L01K74k66k90j35J87J40pq9k84l81j75m8K22J49M4o7
$$ -188 -94 -85 -306 -398 -221 178 479 753 487 197 62 249 389 382 293 9 -372 -547 -595 -373 -224 -180 -247
1131b47j72m7J45L76N13O2l10j35k46L60J72J68k14l47m92m6j0K47j6O2j96l05
$$ -247 -419 -466 -321 55 568 630 320 185 -61 299 471 639 425 78 -414 -460 -470 -223 -239 -177 -373 -678
1153f78J88J00M94K00J34l02j53P0L99J67L5j33m14l99m2J27J17J9j63k84o7K1
$$ -678 -490 -390 104 304 438 136 -17 53 452 619 654 521 107 -292 -334 -207 -90 -71 -234 -518 -585 -564
1175e64K92L17J72K6j55m5K09J66K69Pl30k21k67nK54J4k80j45l77m5J26L43J58
$$ -564 -272 45 217 243 88 43 252 418 687 694 364 143 -124 -129 125 139 -141 -286 -663 -708 -582 -239 -81
1198h1J76j56j30O1L26L10K59j63k77l23J2k0J68n7o2m47k85J70J50J56K55j78
$$ -81 95 -61 -191 -130 196 506 765 602 325 2 14 -6 162 105 43 -404 -689 -519 -369 -213 42 -136
1220a36r1k6Q3N07J04J23j50j31k03j1J59P8n9m72k32q7pK17K96q8j33j30Q5K33
$$ -136 -227 -253 -170 337 441 564 414 283 80 69 228 306 247 -225 -457 -544 -551 -334 -38 -126 -259 -389 -304 -71
1244g1J93L25R8l51l0j77K19K11Nj92k40k74j58Q0J93L7j11j34k23J17L70L23
$$ -71 122 447 545 194 164 -13 206 417 422 230 -10 -284 -442 -362 -169 -132 -243 -377 -600 -483 -113 210
1266B10J69j48k4j21pL54lQk35k43j36j12K02M0q9j05l68LL16K19J66J32k52L
$$ 210 379 231 207 86 79 433 430 438 203 -40 -176 -288 -86 -46 -135 -240 -608 -605 -289 -70 96 228 -24 -21
1290b1J0L14J56P3k5l03k69j63J71P6m1p3k38o4j59L40K60M3j81m7K0K0L27K41
$$ -21 -11 303 459 532 507 204 -65 -228 -57 19 -22 -95 -333 -397 -556 -216 44 87 -94 -141 -121 -101 226 467
1314D67j7Ol78r9O3L7J61j06j81k45j48P4K32J48Q3k58k21J26J97J67J59P8j22
$$ 467 450 456 78 -21 42 79 240 134 -47 -292 -440 -366 -134 14 97 -161 -382 -256 -59 108 267 345 223
1337B23n5j50R7K64l6j16k87j97j31J46M2J41j21j6j49J10J71J76J48l8o0k11
$$ 223 168 18 115 379 343 227 -60 -257 -388 -242 -200 -59 -180 -196 -345 -235 -64 112 260 222 162 -49
1359d9K21K1J27J00k35k24k71P0J27O7j55J0k21R2m2K93J25K26k21q2j04L42J9
$$ -49 172 193 320 420 185 -39 -310 -240 -113 -46 -201 -191 -412 -320 -362 -69 56 282 61 -21 -125 217 236
1382B36J54j02j49k25p5Q4J07N5j26j78k36Q8J78J72J6Mp6M7m1K68J82m5q1j92
$$ 236 390 288 139 -86 -161 -77 30 85 -41 -219 -455 -367 -189 -17 -1 3 -73 -26 -67 201 383 338 257 65
1406F5k5j2J13l1Mk63j84l6L1L86n7L2K6k31J6J75K57l1J12k18k8j21J09J36J4
$$ 65 40 28 141 110 114 -149 -333 -369 -338 48 -9 23 49 -182 -166 9 266 235 347 129 101 -20 89 225 239
1431B39o9l08j59NJ04R7N5M2k51o4R8J76J90j5M2j33j36J65P0O5Lj26j78n5n4
$$ 239 170 -138 -297 -292 -188 -91 -36 6 -245 -309 -211 -35 155 140 182 49 -87 78 148 213 216 90 -88 -143 -197
1456a97J33qn9J2k68Q4J00J37J49N0j0n7j46K31K34K2j31j05l55J0J96m8J7mk40
$$ -197 -64 -72 -131 -119 -387 -303 -203 -66 83 133 123 66 -80 151 385 407 276 171 -184 -174 22 -26 -9 -13 -253
1481b53r9l9K19J55O0Qq4m9O0J23J02R6K9j89k09N1J24k7J2j05m6j91j7O7J67
$$ -253 -352 -391 -172 -17 43 51 -33 -82 -22 101 203 299 328 139 -70 -19 105 78 90 -15 -61 -252 -269 -202 -35
1506c5m8m4l1L1J37J03Q2J30p4k96o8J68L0J4j31l6q9k32J03J45J20q5j76J49
$$ -35 -83 -127 -158 -127 10 113 195 325 251 -45 -113 55 85 99 -32 -68 -157 -389 -286 -141 -21 -106 -282 -133
1530a33l5J59J09J39j49J6j06R0KK24p7n1k34p5p2R9J35j62k8m6l7J02K07J8O6
$$ -133 -168 -9 100 239 90 106 0 90 92 316 239 188 -46 -121 -193 -94 41 -121 -149 -195 -232 -130 77 95 161
1555A61j80N3nR0p0K50o7m8j51j15J4JJ38j64m5j48Q3J59O2j2J07m4j32J15P2
$$ 161 -19 34 29 119 49 299 232 184 33 -82 -68 -67 71 -93 -138 -286 -203 -44 18 6 113 69 -63 52 124
1580A24Q1N3M4k19r2j64J8J93N2k10n4j4k9J08J4J75j18k0r5K31N4o2J53j13r5
$$ 124 205 258 302 83 -9 -173 -155 38 90 -120 -174 -188 -217 -109 -95 80 -38 -58 -153 78 132 70 223 110 15
1605A5n5p9K28k5N8j80k05J25p2J08Q7K3j28p0J38J26kJ63q4j38o4p4L20j48J59
$$ 15 -40 -119 109 84 142 -38 -243 -118 -190 -82 5 28 -100 -170 -32 94 92 255 171 33 -31 -105 215 67 226
1630B26l28Q8j67K3J33L8L4p3j41N2M3J44R3J7q0j31O4L5P8p8J9j56l9KJ47j36
$$ 226 -102 -14 -181 -158 -25 13 47 -26 -167 -115 -72 72 165 182 102 -29 35 70 148 70 89 -67 -106 -104 43 -93
1656i3K1N7j76L5N6J05%M6M2j40k9O0J80K5Q6j42q7r2M9J2r0P4j42pL5o6K46j3
$$ -93 -72 -15 -191 -156 -100 5 5 51 93 -47 -76 -16 164 189 275 133 46 -46 3 15 -75 -1 -143 -150 -115 -181 65 52
1684E2K3%q8M4j8R4j2J0m1J4j26J8J00J3n9j32m3J8J7J09M2j23M5K1K9LL8K34
$$ 52 75 75 -13 31 13 107 95 105 64 78 -48 -30 70 83 24 -108 -151 -133 -116 -7 35 -88 -43 -22 7 10 48 282
1712B82m5r3j62L3k9R5jq3r7j37J89L7N9m2j7j16lJ23n0K19k0P7l10K15K6p3p4
$$ 282 237 144 -18 15 -14 81 80 -3 -100 -237 -48 -11 48 6 -11 -127 -130 -7 -57 162 142 219 -91 124 150 77 3
1739CQ5n2j06j59R7Q9p5N6O2k9j56J74r7J76k6N0k3l5Q3r8J18j8j19MJ3o7L7J3
$$ 3 88 36 -70 -229 -132 -43 -118 -62 0 -29 -185 -11 -108 68 42 92 69 34 117 19 137 119 0 4 17 -50 -13 0
1767@j23k5P6p8K22j90J24P0j47J42j42J30O3M3r5n5j55QJ63r8m2Q3o4j54J82
$$ 0 -123 -148 -72 -150 72 -118 6 76 -71 71 -71 59 122 165 70 15 -140 -132 31 -67 -109 -26 -90 -244 -62
1792f2QP6j42L6Q2Q6j97J17K02j64pM1m2J38j28m1l7%L2j70J82k4j9O2r0m7l8
$$ -62 -54 22 -120 -84 -2 84 -113 4 206 42 35 76 34 172 44 3 -34 -34 -2 -172 10 -14 -33 29 -61 -108 -146
1819a46P3J96n4l6K7l3P5q4N1Pr8l2j11M0J11j12Q0o6m5lJ59N3M4p4M8nK6k1k3
$$ -146 -73 123 69 33 60 27 102 18 69 76 -22 -54 -165 -125 -14 -126 -46 -112 -157 -160 -1 52 96 22 70 65 91 70 47
1848D7J26j04j25K0o2l2J35k5p8l6r2J16O8P4m9J85k41M8K2L4K0L5K0Rk22J02
$$ 47 173 69 -56 -36 -98 -130 5 -20 -98 -134 -226 -110 -42 32 -17 168 -73 -25 -3 31 51 86 106 115 -107 -5
1874ek3Q7K6j90j12O5J39o4R3j59J69o2J12j09R1L6R7j44p6L0%m9K20j28o6j41
$$ -5 -28 59 85 -105 -217 -152 -13 -77 16 -143 26 -36 76 -33 58 94 191 47 -29 1 1 -48 172 44 -22 -163
1900a63J39l8j01K16k34J36j92L03p7J93O3j53J1j48J66q7j9N6j42j8l4L4N0q8
$$ -163 -24 -62 -163 53 -181 -45 -237 66 -11 182 245 92 103 -45 121 34 15 71 -71 -89 -123 -89 -39 -127
1924a27J43p3M6r3J55m7L5K9j15K4n2mK06j7p4j23L7J8K4q1J45l8l0r1O8rK0J02
$$ -127 16 -57 -11 -104 51 4 39 68 -47 -23 -75 -79 127 110 36 -87 -50 -32 -8 -89 56 18 -12 -103 -35 -44 -24 78
1952G8N4k68Q2M1J37j16N0P2q9O8o7L2p6m5Q5j19J17j47M0L4J7mR0m0J1o2P5o1
$$ 78 132 -136 -54 -13 124 8 58 130 41 109 42 74 -2 -47 38 -81 36 -111 -71 -37 -20 -24 66 26 37 -25 50 -11
1980a1K7j0m5Q1k9L9j0r7j4m0q5J85k7K7J4k6J8Kj4J99p6J0o2j09P2QJ1j57M9
$$ -11 16 6 -39 42 13 52 42 -55 -69 -109 -194 -9 -36 -9 5 -21 -3 -1 -15 184 108 118 56 -53 19 27 38 -119 -70
2009g0n1J72ml9P8j12p3M0J31p6lJ00m8Q7j84N0J20m5j65P4n6J07l1R2Pp7op3
$$ -70 -121 51 47 8 86 -26 -99 -59 72 -4 -7 93 45 132 -52 -2 118 73 -92 -18 -74 33 2 94 101 24 18 -55
2037e5l2J16j8J01j0m0m4L6l8o2J9N4p4k3K7O7j2Q1j21j3pQpM4O0j4l4m3N7l9
$$ -55 -87 29 11 112 102 62 18 54 16 -46 -27 27 -47 -70 -43 24 12 93 -28 -41 -48 -40 -47 -3 57 43 9 -34 23 -16
2067a6J77j68K9r5M9mJ3M3j32N2m9J0P1J97j48Q4j15m6J49j20J15q6J9j4K8q3
$$ -16 161 -7 22 -73 -24 -28 -15 28 -104 -52 -101 -91 -20 177 29 113 -2 -48 101 -19 96 10 29 15 43 -40
2093d0R1N5j60N2k7L3O3j39JN6L5l4j05J36m8pO3l8m8m5J52n6m0J29j59n6J33
$$ -40 51 106 -54 -2 -29 4 67 -72 -71 -15 20 -14 -119 17 -31 -38 25 -13 -61 -106 46 -10 -50 79 -80 -136 -3
2120cq2p3J52L9%n9o8J21r8J49j8l0j9n2m1K15o4j00L6l1p8P2l2J5J7j6j8RrQ8
$$ -3 -85 -158 -6 33 33 -26 -94 27 -71 78 60 30 11 -41 -82 133 69 -31 5 -26 -104 -32 -64 -49 -32 -48 -66 -57 -66 22
2150B2K9p9m3mJ09l6j3k3O0j21L6P4o5k2M3m7J89j39K3L7l4p3Q5M2j29J9j0K20
$$ 22 51 -28 -71 -75 34 -2 -15 -38 22 -99 -63 11 -54 -76 -33 -80 109 -30 -7 30 -4 -77 8 50 -79 -60 -70 150
2178A50j79R8l2Rl4o9L2N4q5L7J03k1Nl9J9k4K17k38p7L7N8l8N0r3J21J02j13
$$ 150 -29 69 37 46 12 -57 -25 29 -56 -19 84 63 68 29 48 24 241 3 -74 -37 21 -17 33 -60 61 163 50
2205E0p3OQ8K12l23L52m48j3J81J6m13N98k03M61o28j99J87r2M28l34n1K25R1
$$ 50 -23 -17 71 283 -40 312 -136 -149 32 48 -365 233 30 491 -137 -336 -149 -241 187 -147 -198 27 118
2228A18j32Q4k55K98k54J94k05K09j64J39NL8r1J18p2Mo7M5M3J0m2l2o6j9OM2
$$ 118 -14 70 -185 113 -141 53 -152 57 -107 32 37 75 -16 102 30 34 -33 12 55 65 23 -9 -75 -94 -88 -46
2254d6j14J06O8Ln3J10m2m5k5J38j18Q2r5Q2PM5j17o6l9K06q6k5q2M3M7q5Q1l9
$$ -46 -160 -54 14 17 -36 74 32 -13 -38 100 -18 64 -31 51 58 103 -14 -80 -119 87 1 -24 -106 -63 -16 -101 -20 -59
2282e9n5R0l9J17n3M7O6m4k7L2m8n3J17j37j64K41k8j73J85M1j04J32j77M2O5
$$ -59 -114 -24 -63 54 1 48 114 70 43 75 27 -26 91 -46 -210 31 3 -170 15 56 -48 84 -93 -51 14
2307A4k9L5M6q6J6L3m1R5Qj98J6mj6J37l7l1p4M1J00q6J58l2n8N7k09J82R1m1
$$ 14 -15 20 66 -20 -4 29 -12 83 91 -107 -91 -95 -111 26 -11 -42 -116 -75 25 -61 97 65 7 64 -145 37 128 87
2335H7q6J6P2j83J31l2K5j02k0J39j09M5r8J71L2p6mk6J2J45p1j2o8k0jl7J04
$$ 87 1 17 89 -94 37 5 30 -72 -92 47 -62 -17 -115 56 88 12 8 -18 -6 139 68 56 -12 -32 -33 -70 34
2362C4j9Jj08N6K1%m1O2m6k1J19j13R8J10q7j62J57M7j07j4L0No7n8J02l1l3j0
$$ 34 15 16 -92 -36 -15 -15 -56 6 -40 -61 58 -55 43 153 66 -96 61 108 1 -13 17 22 -45 -103 -1 -32 -65 -75
2390g5J3N4m1N8j7Q6p2j2L5j5l2J16q8K7J10j43k2O2q5j41J91J20j58L4N6j36
$$ -75 -62 -8 -49 9 -8 78 6 -6 29 14 -18 98 10 37 147 4 -18 44 -41 -182 9 129 -29 5 61 -75
2416g5k8J41p3J08J8j37J09k8K3Rj56Q2k1l9J39m7Po9K3r2J81o7n0P6J3J9N3k36
$$ -75 -103 38 -35 73 91 -46 63 35 58 67 -89 -7 -28 -67 72 25 32 -37 -14 -106 75 8 -42 34 47 66 119 -117
2444a17K1J11l6K6kj8m0O1Oj04J33k9n3N5k0J12j76P2j3j1j8Q9L9q1J2m1q6Q1
$$ -117 -96 15 -21 5 3 -15 -55 6 12 -92 41 12 -41 14 -6 106 -70 2 -11 -22 -40 49 88 7 19 -22 -108 -27
2472b7m3J75k1k8j3q2P7RJ04j01l2j08J51n4J3NO8r4qL6j02N8m6M9N8n3j7k0K8
$$ -27 -70 105 84 56 43 -39 38 47 151 50 18 -90 61 7 20 25 93 -1 -9 27 -75 -17 -63 -14 44 -9 -26 -46 -18
2501a8N0j12J16nk6m7J20j20R9m1R2n8L1k00RJ09l1j0N5k1l4J77k47J64p1L1M4
$$ -18 32 -80 36 31 5 -42 78 -42 57 16 108 50 81 -119 -110 -1 -32 -42 13 -8 -42 135 -112 52 -19 12 56
2528E6j09J57j33J5J18r3Kj0p3L9j3Q6Oo4K7m2L0Q0o0Q8j60J54j34P4j31N7M5
$$ 56 -53 104 -29 -14 104 11 13 3 -70 -31 -44 42 48 -16 11 -31 -1 79 19 107 -53 101 -33 41 -90 -33 12
2555A2k1K0N3j35J26j7q8mK6Rl4M3l3j03J64l3kl8J15K5p9o9J49j86P6l9J5jJ10
$$ 12 -9 11 64 -71 55 38 -50 -54 -28 -19 -53 -10 -43 -146 18 -15 -17 -55 60 85 6 -63 86 -100 -24 -63 -48 -49 61
2584F1j53O5J1j6rm4J32j07L7k2M6KJ5l8K6rQ1qp9O9j20L6o8J29q0J01m4Q1o4
$$ 61 -92 -27 -16 -32 -41 -85 47 -60 -23 -45 1 3 18 -20 6 -3 78 70 -9 60 -60 -24 -92 37 -43 58 14 95 31
2613C1l6o5j7O7O6l3n3q8K62o5q9J17j31jK9N5m1l2N1n7J7p2M9jJ1k0M9K2q2K6
$$ 31 -5 -70 -87 -20 46 13 -40 -128 134 69 -20 97 -34 -35 -6 49 8 -24 27 -30 -13 -85 -36 -37 -26 -46 3 25 -57 -31
2643c1KJ0j4m0J23r7J10j39J3P4j49J14M0j15J0J77j68L9L4PM4j90J76O9r8J20
$$ -31 -29 -19 -33 -73 50 -47 63 -76 -63 11 -138 -24 16 -99 -89 88 -80 -41 -7 0 44 -146 30 99 1 121
2669A21j81J43k04J91j86R5k3J51l1p3Qk0p4Q9jQ6j13O1k9k8o5O8l6J09k8J4q7
$$ 121 -60 83 -121 70 -116 -21 -44 107 76 3 11 -9 -83 6 5 91 -22 39 10 -18 -83 -15 -51 58 30 44 -43
2696d3J2o7J20j7j23J10l0Q9j9K7j35L0P8K6l0oj13L8R3j08k9J53o2r2J17k9N8
$$ -43 -31 -98 22 5 -118 -8 -38 51 32 59 -76 -46 32 58 28 22 -91 -53 40 -68 -97 56 -6 -98 19 -10 48
2723D8p4l2J14p2J5J6n1M6%O4o2K0qK4j22J02j6j66J38q8rJ39r5P9mr6L7J60k12
$$ 48 -26 -58 56 -16 -1 15 -36 10 10 74 12 32 24 48 -74 28 12 -154 -16 -104 -113 26 -69 10 6 -90 -53 107 -105
2752a05Q9pj4L4p2P8J5l0L6o5J07l4r5M0K8l6P6l2lK6K9o1k9N3Mo4L9J2j50Q6
$$ -105 -16 -23 -37 -3 -75 3 18 -12 24 -41 66 32 -63 -23 5 -31 45 13 10 36 65 4 -25 28 32 -32 7 19 -131 -45
2782d5M6NJ0mQ1rj05J5J0jo5J05Mj68J38N5j07N1j2q0J10j23N8n9N7J55j31n6
$$ -45 1 6 16 12 93 84 -21 -6 4 3 -62 43 47 -121 17 72 -35 16 4 -76 34 -89 -31 -90 -33 122 -9 -65
2810f5N7l5N0k2m2M9r9L0R1m1N9O7j92M5nP2j44J28l4lP8m6L7J1J1r9R2o6oo3
$$ -65 -8 -43 7 -15 -57 -8 -107 -77 14 -27 32 99 -93 -48 -53 19 -125 3 -31 -34 44 -2 35 46 57 -42 50 -16 -22 -85
2840h5J35K0k4j6m9K6j17K07k25J55j6L4O6p7j34L1O0K5NO4m0j6p2r0J24P9o4
$$ -85 50 70 46 30 -19 7 -110 97 -128 27 11 45 111 34 -100 -69 -9 16 21 85 45 29 -43 -133 -9 70 6
2867Fm7qM4O9K8L2r1N7q1k6nk5O1M4m6p7O7j2P4Q1j29k7LJ2m3p0J89p9k9m8O7
$$ 6 -41 -49 -5 64 92 124 33 90 9 -17 -22 -47 14 58 12 -65 2 -10 64 145 16 -11 -8 4 -39 -109 80 1 -28 -76 -9
2898iM9q9Qn6J14K3k0j2Q8q0L8q7qP5r9n6M6K8j8M2mK7K2N1j76N6j5N4J40k06
$$ -9 40 -49 -41 -97 17 40 20 8 96 16 54 -33 -41 34 -65 -121 -75 -47 -65 -23 -27 0 22 73 -103 -47 -62 -8 132 -74
2928g4J10j09N1J2%o8J08n3O2j42J04l6N3J03j42l2P1K2n5o0O4p0L7Q0L7j56O7
$$ -74 36 -73 -22 -10 -10 -78 30 -23 39 -103 1 -35 18 121 -21 -53 18 40 -15 -75 -11 -81 -44 36 73 -83 -16
2955a6L6L5K6n8p6O1%j8n4J19r4Q6j3k6L6L8nj90J06N9J6po1l2P2n9J14P9k35
$$ -16 20 55 81 23 -53 8 8 -10 -64 55 -39 47 34 8 44 82 77 -113 -7 52 68 61 0 -32 40 -19 95 174 -61
2984f1P5k9L8n8J03r4O2L7j33JP0j32J83k5m7P2l9p2R1O1j01J00j79J23j41K34
$$ -61 14 -15 23 -35 68 -26 36 73 -60 -59 11 -121 62 37 -10 62 23 -49 42 103 2 102 -77 46 -95 139
3010A39q2j5j37M2M6J8p6J7N5J7j03R%N8K7Rj3K5j35R2r3R6J2m5k0J9N1O3n2r2
$$ 139 57 42 -95 -53 -7 11 -65 -48 7 24 -79 -70 -70 -12 15 24 11 36 -99 -7 -100 -4 8 -37 -57 -38 13 76 24 -68
3040f8N5OL3ll5J7j1j1p4R5R1p1r7J28r0m5J50p2J0M1k18K08l2o9J36j25Q8K3
$$ -68 -13 -7 26 23 -12 5 -6 -17 -91 4 95 24 -73 55 -35 -80 70 -2 8 49 -169 39 7 -62 74 -51 37 60
3068F0J9n7K4n1J0J2q5K7Q4M7pj33L3NN1j5p9J3p4J11o3J3J00l1J0k4K0l7l3L0
$$ 60 79 22 46 -5 5 17 -68 -41 43 90 83 -50 -17 -12 39 24 -55 -42 -116 -5 -68 -55 45 14 24 0 20 -17 -50 -20
3098b0k1j7J52j22m1M2lO4J5Mj10N8Rp7J23q8J04q7nQ4r1n0J09j71J29m8pM3k5
$$ -20 -41 -58 94 -28 -69 -27 -30 34 49 53 -57 1 10 -67 56 -32 72 -15 -20 64 -27 -77 32 -139 -10 -58 -65 -22 -47
3127d7L9Oj57J43N8k8j4m4K6j00N9O1M8J6m6j4j05J57j8j59J00o8J21Q0r6j04
$$ -47 -8 -2 -159 -16 42 14 0 -44 -18 -118 -59 2 50 66 20 6 -99 58 40 -119 -19 -87 34 114 18 -86
3153h6J09p8J07p9O2k8n2L5P2n5l6P1M2o0m7J7M9j09J90m9j48M9R4j9j50J04j31
$$ -86 23 -55 52 -27 35 7 -45 -10 62 7 -29 42 84 24 -23 -6 43 -66 124 75 -73 -24 70 51 -99 5 -126
3180a26J43l3j2l8J41p0J0L1K1j92K38l4r3J8J7jN6o2j25J64q6L4m6j3MM2j1j8
$$ -126 17 -16 -28 -66 75 5 15 46 67 -125 113 79 -14 4 21 20 76 14 -111 53 -33 1 -45 -58 -54 -12 -23 -41
3208d1l3Q0J7j1n1Q1k3k2q2P3o1J11m4PJ3j01J39k0O2j81rj7J30J4j05%J07j42
$$ -41 -74 6 23 12 -39 42 19 -3 -85 -12 -73 38 -6 1 14 -87 52 32 94 -87 -96 -113 17 31 -74 -74 33 -109
3236a09J8J03o7j4n8J70m7J18r2Nl1J06j61Q5nM8j50J9J40r6L9o9J0q1J95o4J7
$$ -109 -91 12 -55 -69 -127 43 -4 114 22 27 -4 102 -59 26 21 69 -81 -62 78 -18 21 -48 -38 -119 76 12 29
3263B9P7j30mMM2o1k0N0jn9Q7r9P6o7QN8jn2L3Q2p5KQ1j05qm5O8J02n7p4Q4q9
$$ 29 106 -24 -28 -24 18 -43 -63 -13 -14 -73 14 -85 -9 -76 -68 -10 -11 -63 -30 52 -23 -21 60 -45 -53 -98 -30 72 15 -59 25 -64
3295f4RPM1J06j12J4Q7j54J05j73Q5l8L3N3L5K3j32M4O1l0J5J04j40m4M5R0j69
$$ -64 -55 -48 -7 99 -13 1 88 -66 39 -134 -49 -87 -54 -1 34 57 -75 -31 30 0 15 119 -21 -65 -20 70 -99
3322i9N6M3q9J05m9L2kj9l3M2L4n9J4J00q6j07M2J82m8m9MPK1o9J07r7M2k0j0
$$ -99 -43 0 -89 16 -33 -1 -3 -22 -55 -13 21 -38 -24 76 -10 -117 -75 107 59 10 14 21 42 -27 80 -17 25 5 -5
3351el0N5j4N6k03Q4K6l2K7n8L2o2Q8M8r6J27k5k2j11R3M8o0p7N5J3o5J49J0m7
$$ -5 -35 20 6 62 -141 -57 -31 -63 -36 -94 -62 -124 -36 12 -84 43 18 -4 -115 -22 26 -34 -111 -56 -43 -108 41 51 4
3380Dj03J20K7j55N9k6L3j2P8q4N6Q8P5j68J1k2M5j14R1J6k5P2j45Q9mk5O2q2
$$ 4 -99 21 48 -107 -48 -74 -41 -53 25 -59 -3 85 160 -8 3 -19 26 -88 3 19 -6 66 -79 10 6 -19 43 -39
3408c9L5M5lj6j9L6p2R0n4J5k1J08j7r5k0L1p3L3NL4N1%k3l3l6J13j57RLL6Q9
$$ -39 -4 41 38 22 3 39 -33 57 3 18 -3 105 88 -7 -27 4 -69 -36 -31 3 54 54 31 -2 -38 75 -82 -73 -70 -34 55
3439E5r7N3m5L2l8Q6j38N9R4j21J17p0O2l9p2J4M2o2Q3j75J75o2jJ77j11Ql6m
$$ 55 -42 11 -34 -2 -40 46 -92 -33 61 -60 57 -13 49 10 -62 -48 -6 -68 15 -160 15 -47 -48 129 18 26 -10 -14
3467a4R0j33N9j7L1j3k4P0pK0j07r4J49kP0j24KJ01K4j60Q9k7P6m6j3N1j60J91
$$ -14 76 -57 2 -15 16 3 -21 49 42 62 -45 -139 10 8 78 -46 -44 57 81 -79 10 -17 59 13 0 51 -109 82
3495H2m4L2J5J6k21R4p2Q2j6M8M1n1j6N3o2Oj2M5L7l5r3R4J7N2k17J39KL1j29
$$ 82 38 70 85 101 -120 -26 -98 -16 -32 16 57 6 -10 43 -19 -13 -25 20 57 22 -71 23 40 92 -125 14 16 47 -82
3524h2mP8L6j32R9n3P4p7N0j25J39O0n8k5p1Q3o5J75j60K9oN0l2o2J18K3j05J6
$$ -82 -86 -8 28 -104 -5 -58 16 -61 -11 -136 3 63 5 -20 -91 -8 -73 102 -58 -29 -35 15 -17 -79 39 62 -43 -27
3552b7L1N1M4j08J07q8l8R1j56K05j14L6mp7lJ20n2J9j28J22K3rl4m4l6R3p5n
$$ -27 4 55 99 -9 98 10 -28 63 -93 112 -2 34 30 -47 -50 70 18 37 -91 31 54 45 11 -33 -69 24 -51 -56
3580e6N2M2n6L2L4j70J02N9j4K2q7P8j33J05J4rk8p4M4nn8J41j2P5k8o1J13r5
$$ -56 -4 38 -18 14 48 -122 -20 39 25 47 -40 38 -95 10 24 15 -13 -87 -43 -48 -106 35 23 98 70 9 122 27
3608B7L6j16J34j68M1m9R6L0Nn3R1o0k8o5L7R5n1q1J04Lm7M2Nq1j03J01R9j0j31
$$ 27 63 -53 81 -87 -46 -95 1 31 36 -17 74 14 -14 -79 -42 53 2 -79 25 28 -19 23 28 -53 -156 -55 44 34 -97
3637i7J13K5J4j01J37ol3j06J20q0N0j02j6O2J16j38K1N9K3j9q9K9O1J1j60J29
$$ -97 16 41 55 -46 91 85 52 -54 66 -14 36 -66 -82 -20 96 -42 -21 38 61 42 -47 -18 43 54 -106 23
3663B3Oo9m0O0jR3n2m1nL7k1n6N9l1j1ok5P2o8L2j0q5P6rN7p0J63j17m6J62j05
$$ 23 29 -40 -80 -20 -21 72 20 -21 -26 11 -10 -66 -7 -38 -49 -55 -80 -8 -76 -44 -54 -139 -63 -72 -15 -85 78 -39 -85 77 -28
3694b8J32j43n2N2J14j55P8j5l7Q2o1L5k7R2j0m2J2n3O0m5J0K1j8R7l3j92J09
$$ -28 104 -39 -91 -39 75 -80 -2 -17 -54 28 -33 2 -25 67 57 15 27 -26 34 -11 -1 20 2 99 66 -126 -17
3721a7NQKl6qQ3K0k6o6Q2j19N1j1Oj2l0l9O6k7R5mp2J0R4m7p6O2O1n1Q0n5O6j56
$$ -17 -12 -4 -2 -38 -46 37 57 31 -35 47 -72 -21 -32 -26 -38 -68 -107 -41 -68 27 23 -49 -39 55 8 -68 -6 55 4 84 29 95 -61
3754f1O8pR1o7ll7N9O9j06k3J9Qj33Q2J07k7j01J34j7K7j13k8O3N9k7K2j01mm2
$$ -61 7 0 91 24 21 -16 43 112 6 -17 2 10 -123 -41 66 39 -62 72 55 82 -31 -59 4 63 36 58 -43 -47 -89
3783h9Q0K3n0N2M1q0K1j2K9j00J65j01L1L7o6Q4o1l7J63j01L2n4Jl7j48K44j18
$$ -89 -9 14 -36 16 57 -23 -2 -14 15 -85 80 -21 10 47 -19 65 4 -33 130 29 61 7 8 -29 -177 67 -51
3810e1M9j7O5n9N3k9L5j03LM4M9n4m5N9K9n7N2j19O9k2K3j27J56O0j09M3N8J3
$$ -51 -2 -19 46 -13 40 11 46 -57 -54 -10 39 -15 -60 -1 28 -29 23 -96 -27 -49 -26 -153 3 63 -46 -3 55 68
3838F8r6oN3q0J13n8K5k3J7qK9n0J2K2m0m1J79k25O1J20m5K4K4o5M9j9o4J42j71
$$ 68 -28 -34 19 -61 52 -6 19 -4 13 5 34 -16 -4 18 -22 -63 116 -109 -48 72 27 51 75 10 59 40 -24 118 -53
3867e3J22j51J53j33R9mk5L7j36J44K7J3r8J0L0l0K8P8l7j60N9P7j11N9O7qQo4
$$ -53 69 -82 71 -62 37 33 8 45 -91 53 80 93 -5 5 35 5 33 111 74 -86 -27 50 -61 -2 65 57 65 1
3895Aj09Q2J12m0k9j0J1N5j7j31P7O8j00Q4n2nQ1K1j73Q2j16J06J6k1N3o2j8N0
$$ 1 -108 -26 86 46 17 7 18 73 56 -75 2 70 -30 54 2 -3 78 99 -74 8 -108 -2 14 -7 46 -16 -34 16
3923A6J6l3M4j12r0J63N2j54J84j45J05J7j57M2K3M9l2R0o9%J4k8k1J29r5q7J02
$$ 16 32 -1 43 -69 -159 4 56 -98 86 -59 46 63 -94 -52 -29 20 -12 78 9 9 23 -5 -26 103 8 -79 23
3950B3L2l1r2J92L2j70J7P9O2j69MK9m7j1Q0R9j91j59K08L4M0j23K2R6j26Q1l
$$ 23 55 24 -68 124 156 -14 3 82 144 -25 -21 8 -39 -50 30 129 -62 -221 -13 21 61 -62 -40 56 -70 11 8
3977Hj6l9L7J54m5r5J2l3m1Q4J4n8J03j2j38O3jmL6j1r2J46j23j1N6P6n2mj02
$$ 8 -8 -47 -10 144 99 4 16 -17 -58 26 40 -18 85 73 -65 -2 -3 -7 29 18 -74 72 -51 -62 -6 70 18 14 -88
4006h8J82o1k4j41J61m9l6R3p5J89j61J3rN1nq7O7Q7j62R6KnMk5r3R5k9k3J7N8
$$ -88 94 33 9 -132 29 -20 -56 37 -38 151 -10 3 -6 45 40 -47 20 107 -55 41 43 38 42 17 -76 19 -10 -33 -16 42
4036D2P5j50q9J42L4j38J05j16J54M0m9l3p5P7L4j07L3J6o1J01Nl9pK5l3O0qm4
$$ 42 117 -33 -122 20 54 -84 21 -95 59 99 50 17 -58 19 53 -54 -21 -5 -66 35 40 1 -6 19 -14 46 38 -6
4064fKk6l1N9R4q1o3OJ0L4J8np0J3m8K6p4J26p4P6J02r7m6J37j05K5J3J7j2k3
$$ -6 -4 -30 -61 -2 92 11 -52 -46 -36 -2 16 11 -59 -46 -94 -68 -142 -16 -90 -14 88 -9 -55 82 -23 2 15 32 20 -3
4094cLO1k5n5J10q5l4P1k6RO1L3j16R9j07NL2j38KJ38j88N4J91j34j1Nl3J53o2
$$ -3 0 61 36 -19 91 6 -28 43 17 26 87 120 4 103 -4 1 33 -105 -103 35 -153 -99 92 -42 -53 -48 -81 72 10
4123A0k6O7j35J4M1K6P9o6J24k58J33n9KR4L5p4L5N9Kp8n8J20j50J63j9p6Q0j68
$$ 10 -16 51 -84 -70 -29 -3 76 10 134 -124 9 -50 -48 46 81 7 42 101 103 25 -33 87 -63 100 81 5 85 -83
4151h3J08k2lqp7J75j26P8j11Q6q5J63q9k4L2Qj71R6J08j0o1l3J18r3r8J65j93
$$ -83 25 3 0 -8 -85 90 -36 42 -69 17 -68 95 6 -18 14 22 -149 -53 55 45 -16 -49 69 -24 -122 43 -150
4178a50M5lJ31n3L2K6K5m8k9n6O3L5qP0j88J37K2o0J9j03M5J29Q0j89J02p1qj0
$$ -150 -105 -108 23 -30 2 28 53 5 -24 -80 -17 18 10 80 -108 29 51 -9 10 -93 -48 81 161 -28 74 3 -5 -15
4206a5o4J25j48J02J53j79J12j39mJ11r9R1n1r3P6M9r2J5L9J4J7p4L5n3O7O0n8
$$ -15 -79 46 -102 0 153 -26 86 -53 -57 54 -45 46 -5 -98 -22 27 -65 -50 -11 3 20 -54 -19 -72 -5 55 -3
4233cp3Q5m9O1l8KL2q3J22r9O2K1o6j6J3Q1m5j82J30l6M6OqM6j7J0m6J30n6k3
$$ -3 -76 9 -40 21 -17 -15 17 -66 56 -43 19 40 -26 -42 -29 52 7 -175 -45 -81 -35 -29 -37 9 -8 2 -44 86 30 7
4263GJ24j55km6J42L6m0j8lM2j31j2J29Kn1r1J89k50R2j5L6p5J07m9M7k3j7jl2
$$ 7 131 -24 -26 -72 70 106 66 48 45 87 -44 -56 73 75 24 -67 122 -128 -36 -51 -15 -90 17 -32 15 -8 -25 -26 -58
4292e8k4P1O4k9l8j2l6L3p7J80n6n5n3J23km6N2j60N0J22P8p1l1J1K2j3M4k4N4
$$ -58 -82 -11 53 24 -14 -26 -62 -29 -106 74 18 -37 -90 33 31 -15 37 -123 -73 49 127 56 25 36 58 45 89 65 119
4321A19p1j7j93J69r8o3J63mj1J2n5R4j04LJ90j86O1J7l5R4q9K7K8j37KR7l3j0
$$ 119 48 31 -162 7 -91 -154 9 5 -6 6 -49 45 -59 -56 134 -52 9 26 -9 85 -4 23 51 -86 -84 13 -20 -30
4349c0N1k3j5j2l2K7rJ11j26N9j02J33o8L7P3j40m3L5Q5L2l3o1j7R1K9j62Q2l7
$$ -30 21 -2 -17 -29 -61 -34 -43 68 -58 1 -101 32 -36 1 74 -66 -109 -74 11 43 10 -51 -68 23 52 -110 -28 -65
4377f5J09p7q4j8J10nM1j13J50o2j1Q6q3J25j45K7M2Lq4P2k1K1l4R9l2j30O0J21
$$ -65 44 -33 -117 -135 -25 -30 11 -102 48 -14 -25 61 -22 103 -42 -15 27 30 -54 18 -3 18 -16 83 51 -79 -19 102
4405A02j27J7rk8N7nJ4Pj07R3n7P9j23J0P4J9j7LN4mJ6q0L1o7J16n6N1r6o1J11
$$ 102 -25 -8 -17 -45 12 7 21 28 -79 14 -43 36 -87 -77 -3 16 -1 2 56 52 68 -12 19 -48 68 12 63 -33 -94 17
4435A7o6O4n1oK3O7j00J3K7jJ17j23J56j69P8r6Q6K8Klk1j03M2k9q7J13k1N3P6
$$ 17 -49 15 -36 -42 -19 48 -52 -39 -12 -13 104 -19 137 -32 46 -50 36 64 66 63 42 -61 -19 -48 -135 -22 -43 10 86
4464H6r6O2p1R2Rl9j9j03Q6Ol2J10j42jj0M6J3j6l5O8p9QM9m8R3j3J5j98J66j1
$$ 86 -10 52 -19 73 82 43 24 -79 7 13 -19 91 -51 -52 -62 -16 -3 -19 -54 14 -65 -57 -8 -56 37 24 39 -159 7 -4
4494dNl3k0N7j08J73m8Jr5P0q1J8N8rJ0R6J3r5l0L4j04J46Ql5k1l6M6J09j10r9
$$ -4 1 -32 -52 5 -103 70 22 23 -72 -2 -83 -65 -7 -16 -6 90 103 8 -22 12 -92 54 62 27 6 -30 16 125 15 -84
4524h4J3J6J16j41j1R6L1LM9n2n9J0P7o7l7k6R8j0n5q6J95q1j1K3Mp1MR0M1l8
$$ -84 -71 -55 61 -80 -91 5 36 39 88 36 -23 -13 64 -3 -40 -66 32 22 -33 -119 76 -5 -16 7 11 -60 -56 34 75 37
4554C7n2M4n1J14mm9l7m3P2ok0K0j22P9O2mj66J15M5mJ9l0n1j7N8m2qM6l5k0N1
$$ 37 -15 29 -22 92 88 39 2 -41 31 25 5 25 -97 -18 44 40 -126 -11 34 30 49 19 -32 -49 9 -33 -41 5 -30 -50 1
4585AN7j0j44J76j06r6Q3K8J0J4q0OQj9N0P0m2l4R9N0k5p2ro3J37k08RJ23j34
$$ 1 58 48 -96 80 -26 -122 -39 -11 -1 13 -67 -61 -53 -72 -22 48 6 -28 71 121 96 24 15 -48 89 -119 -110 13 -121
4614a21J33Q9j11L9K1k6kj83J66N7j37L3K6k4K5mK6l6k4N3K8o0J3K3n8k6P0K3
$$ -121 12 101 -10 29 50 24 22 -161 5 62 -75 -42 -16 -40 -15 -19 7 -29 -53 0 28 -32 -19 4 -54 -80 -10 13
4642A3J7M5r3J03j53pP6J4o0J4m9P4J01q8o7L5Q0j11O3QN7k8j5n2k3Q1k8kp5N8
$$ 13 30 75 -18 85 -68 -75 1 15 -45 -31 -80 -6 95 7 -60 -25 55 -56 7 15 72 44 29 -23 -46 35 7 5 -70 -12
4672a2mm1n1J49pk6l6R2j8j12J72q1n1L1P4mj24N0l0N5r7K0QJ6M4k5R0j22J19
$$ -12 -16 -57 -108 41 34 8 -28 64 46 -66 106 25 -26 5 79 75 -49 1 -29 26 -71 -51 -43 -27 17 -8 82 -40 79
4701G9j6j04p8J70j8M5j06J6j10N8l1K49j28J9j23J9P6nL1m1n9J47p0j1n6k1O1
$$ 79 63 -41 -119 51 33 78 -28 -12 -122 -64 -95 154 26 45 -78 -59 17 12 43 2 -57 90 20 9 -47 -68 -7
4728gN3j01JN0r7J56k9q4Q3j7m7k9N9K3J7K3j7n6J6qj04J35k0jM0L8q3j21J35
$$ -7 46 -55 -54 -4 -101 55 26 -58 25 8 -39 -68 -9 14 31 54 37 -19 -3 -11 -115 20 0 -1 39 77 -6 -127 8
4757Hk9M4R2q4ll8L9j04M4M0M3K5Ln8k0J7j5J0rN1j28J26k6q1KP9Q0k52R6O1m9
$$ 8 -21 23 115 31 28 -10 29 -75 -31 9 52 77 80 22 2 19 4 14 5 56 -72 54 28 -53 -51 28 108 -144 -48 13 -36
4788c6M1L5o8J8p6J02m9J11j8p5l9o5J37K1r1j15K00j13K3oO7j21K25n8r4mM0
$$ -36 5 40 -28 -10 -86 16 -33 78 60 -15 -54 -119 18 39 -52 -167 33 -80 -57 -63 4 -117 108 50 -44 -48 -8
4815hL7o2R1j3Q3q8n7P2q6jL8J2o6J10n9n2M1m0Q5m8r0L5Q3j4K6j4K6L3j7j11
$$ -8 29 -33 58 45 128 40 -17 55 -31 -32 6 18 -48 62 3 -49 -8 -48 37 -11 -101 -66 17 3 29 15 41 74 57 -54
4845e4J11j25J00Kn1J4K8l8J9l1o1J4J22o6ll0R0K3l1L4o7M8Lj08J08j00O8oN
$$ -54 57 -68 32 34 -17 -3 25 -13 6 -25 -86 -72 50 -16 -19 -49 41 64 33 67 0 48 51 -57 51 -49 19 13 18
4874A8o6Q5L2o0k6O4Ll6J01p9r0J11j7R4j51n2J13p6O8m1K8m5j7l2J54j58R4P
$$ 18 -48 37 69 9 -17 47 50 14 115 36 -54 57 40 134 -17 -69 44 -32 36 -5 23 -22 -39 -71 83 -75 19 26
4902B6p6l9J90j56J20P3p5j53J29K4j12J2J02K9p7j46J33q6Q4j90K37n6J17j23
$$ 26 -50 -89 101 -55 65 138 63 -90 39 63 -49 -37 65 94 17 -129 4 -82 2 -188 49 -7 110 -13
4926a3K2N3j23K3M6J06j21N3j25R9J7p2o1Q3k0J12j36k0p8J77mK7J4k3j49Q4K8
$$ -13 9 62 -61 -38 8 114 -7 46 -79 20 37 -35 -96 -13 -33 79 -57 -77 -155 22 18 45 59 36 -113 -29 -1
4953aoj3o9RM7j42J41j4l9Q4j2L2qj81N5J50L0R8j30j02J55j14k2MP6n9M3N9j26
$$ -1 -7 -20 -89 -80 -33 -175 -34 -48 -87 -3 -15 17 9 -172 -117 33 63 161 31 -71 84 -30 -52 -48 28 -31 12 71 -55
4982e5Q2r3K1N0o0m4K22q8R6j51n9J53j83Q4Qj7J19r4Lm8J1KNJ47j88k8R2lRj7
$$ -55 27 -66 -45 5 -55 -99 123 35 131 -20 -79 74 -109 -25 -17 -34 85 -9 -6 -54 -43 -41 -36 111 -77 -105 -13 -16 -7 -24
5012b4J82j91P0k8K8N4p8j51J39N6r0J8Mr6J35o1J06p3k3P7m3l8o7O1M1P3j88
$$ -24 158 -33 37 9 37 91 13 -138 1 57 -33 -15 -11 -107 28 -33 73 0 -23 54 11 -27 -94 -33 8 81 -107
5039a07J56J8r2pl2M2N6j1J7j13O9J7o6N3K4J12j8j74K7J01o9K6k2N5m2j9J3J9
$$ -107 49 67 -25 -32 -64 -22 34 23 40 -73 -4 13 -53 0 24 136 118 -56 -29 72 3 29 7 62 20 1 14 33
5067C3o7J28j83Q4K7J0p5QK7Lj8j02J71L9q7J3j4P2j31K6k4LJ40mr5p8J33j7p
$$ 33 -34 94 -89 -5 22 32 -43 -35 -8 -5 -23 -125 46 85 -2 11 -3 69 -62 -36 -60 -57 83 79 -16 -94 39 22 15
5096A5K1p6L1L8L6j04J65j70r1J91q0J16j8r6J59j89N3L9r8N8n9O6k9o4mK1Q9
$$ 15 36 -40 -9 29 65 -39 126 -44 -135 56 -24 92 74 -22 137 -52 1 40 -58 0 -59 7 -22 -86 -90 -69 20
5123B0n6j16J13L2kMJ02j82M0P6%R0r9o6L5j6J04p7J4r1R5NP6m0k7k8k6p0J19
$$ 20 -36 -152 -39 -7 -9 -5 97 -85 -45 31 31 121 22 -44 -9 -25 79 2 16 -75 20 25 101 61 34 6 -20 -90 29
5152B9j33J17k7J29K4k25Q8mL7m0K3p9J14L3j09P0K3j46pQ5mJ0J2j34K42j15J4
$$ 29 -104 13 -14 115 139 -86 2 -2 35 -5 18 -61 53 86 -23 47 70 -76 -83 2 -2 8 20 -114 128 13 27
5179B7J9m6QN7j1j28O3L9J6j02J03n9P7m6O6j07J3K3On3M3J7j2K7r1L2Q9J4r7
$$ 27 46 0 8 65 54 -74 -11 28 44 -58 45 -14 63 17 83 -24 -11 12 18 -35 8 25 13 40 -51 -19 70 84 -13
5208a3n7R9m7n0K1L5K05j11q8q6J27r4J13Op8J25K5j81J28P7l27K23k1R8j41P2
$$ -13 -70 29 -18 -68 -47 -12 193 82 -6 -92 35 -59 54 60 -18 107 132 -49 79 156 -171 52 31 129 -12 60
5234F0qk9j0OP9j84J02l6n1P2K7Nq6M4O7pn5m0j4K5L7n7kK7MRrM2m2L3L5m5q7
$$ 60 52 23 13 19 98 -86 16 -20 -71 1 28 33 -53 -9 58 51 -4 -44 -58 -33 4 -53 -55 -28 -24 -15 -24 18 -24 9 44 -1 -88
5267h8M4O4o9j6O4K28k24J28j58N1k8j2Q0j37m0J52n1k8LQ0K3p5J6j0L4p7N1p7
$$ -88 -44 20 -49 -65 -1 227 3 131 -27 24 -4 -16 64 -73 -113 39 -12 -40 -37 43 66 -9 7 -3 31 -46 5 -72
5295g2L0m8P7l2P0O5q6J9k3Pn5R9q9L5L4J1o5l1J10K4p4j15O4Q1qq3O1j14R2N5
$$ -72 -42 -90 -13 -45 25 90 4 23 0 7 -48 51 -38 -3 31 42 -23 -54 56 80 6 -109 -45 36 28 -55 6 -108 -16 39
5325C9p6L6Lp1J21p4O9n0N0L5j1j95N9J5rp5J18o4M9O5o4O1l9j6k3L6R7j15L7
$$ 39 -37 -1 2 -69 52 -22 47 -3 47 82 71 -124 -65 -50 -59 -134 -16 -80 -31 34 -30 31 -8 -24 -47 -11 86 -29 8
5354Ho2K7n0J28j21J67j45P4m8p1J06k5O7l0K2p2J19m1p6P1j59J32j05R9m3l9
$$ 8 -54 -27 -77 51 -70 97 -48 26 -22 -93 13 -12 55 25 47 -25 94 53 -23 48 -111 21 -84 15 -28 -67
5380f7L5M7j54J18M5%kQ9j89J1J5NR9r5L1L3J09q9o4Q7j03M0L0j9k6Q8p7J2m8
$$ -67 -32 15 -139 -21 24 24 22 111 -78 -67 -52 -47 52 -43 -12 21 130 41 -23 64 -39 1 31 12 -14 74 -3 9 -39
5409c9J4J4QL9r3J50j80M9N9p5N8J00k65J90l5k4O6l4J9n9l5Q7N2j02R4l1pMk9
$$ -39 -25 -11 -3 36 -57 93 -87 -38 21 -54 4 104 -161 29 -6 -30 36 2 21 -38 -73 14 66 -36 58 27 20 24 -5
5438en4J22j00K1O0r2J42o0r0N8Q5%J2K4k44J84n5O8m3j4QM4j73J9m3Q8R4j61
$$ -5 -59 63 -37 -16 44 -48 94 34 -56 2 87 87 99 123 -121 63 8 76 33 19 27 71 -102 -83 -126 -38 56 -105
5466a05qJ88j09P6j1j04N1m7lQ3J17j14Ln1K9M3M7r8Q9j82J01N4J02k28O0M5o7
$$ -105 -113 75 -34 42 31 -73 -22 -69 -72 11 128 14 17 -34 -5 38 85 -13 76 -106 -5 49 151 -77 -17 28 -39
5493c9M6r4Q2Mj01J44j26N8L7nJ2m3p5J9M3j28K52j0o2j20J55k3J31j91k6J23
$$ -39 7 -87 -5 -1 -102 42 -84 -26 11 6 18 -25 -100 -81 -38 -166 86 76 14 -106 49 26 157 -34 -60 63
5519F3r3j3R9j1P9j46K2p0JJ08m0M0j0p9J6J8p6J69j26J38j85J53q4k5R1j27J01
$$ 63 -30 -43 56 45 124 -22 0 -70 -69 39 -1 39 29 -50 -34 -16 -92 77 -49 89 -96 57 -27 -52 39 -88 13
5546A3m5mn7J5Q6j5q0J63j3r7PN7j35J37o8P3L9mj01j7k3NQ8nm8j8K0N6N6j28
$$ 13 -32 -36 -93 -78 8 -7 -87 76 63 -34 -27 30 -105 32 -36 37 76 72 -29 -46 -69 -64 24 19 -29 -47 -27 29 85 -43
5576d3Q1M0n1j5k8l0P2j19R3o6R7j8o1P2%j42L6J41q1k7R7q4k4J35j06O1k6J5
$$ -43 38 78 27 12 -16 -46 26 -93 0 -66 31 13 -48 24 24 -118 -82 59 -22 -49 48 -36 -60 75 -31 30 4 19
5604A9Lo6J35j09j04J35n2j08J25K3Q7j57J36j47K8R7n4J7j06J25m3J14n6j28
$$ 19 22 -44 91 -18 -122 13 -39 -147 -22 1 88 -69 67 -80 -52 45 -9 8 -98 27 -16 98 42 -86
5628h6P5krL6P0j24j28J08jO2L3n0O3oj16O8P8k03J23J3j6LP8O8j48rp0R2N0j12
$$ -86 -11 -13 -22 14 84 -40 -168 -60 -61 1 34 -16 47 41 -75 -7 71 -132 -9 4 -12 -9 69 137 -11 -20 -90 2 52 -60
5658f0P9j8m7L0j4jQ0o8J0lQ1j07J43j27o3L7M0J8m1R6m6j45J68j45R0J9kO1j45
$$ -60 19 1 -46 -16 -30 -31 49 -19 -9 -12 69 -38 105 -22 -85 -48 -8 10 -31 65 19 -126 42 -103 -13 6 4 65 -80
5687h0K08k15k0R2Q0j46Q2O4q4P6j46Q9J16j00O3j20o1J30j13J20j7l9M2j35K2
$$ -80 128 -87 -107 -15 65 -81 1 65 -19 57 -89 0 116 16 79 -41 -102 28 -85 35 18 -21 21 -114 -92
5712i2J32l8o1R9m3M2j18J03l9R8j25Q1j07M2L7O7r1L4O0j16J8P6p7l1r6J99k7
$$ -92 40 2 -59 40 -3 39 -79 24 -15 83 -42 39 -68 -26 11 78 -13 21 81 -35 -17 59 -18 -49 -145 54 27
5739B7n7J12j06J10j50NkK6M8l4J16r1l0j21J16%J1Q5q8J1N7n9m3O3P7j9m1N3
$$ 27 -30 82 -24 86 -64 -59 -61 -35 13 -21 95 4 -26 -147 -31 -31 -20 65 -23 -12 45 -14 -57 6 83 64 23 76
5767G6j16k8J18j18J9P1J4m6J1r9O7K2K0P5M6j63L1J09j18J09k9l3j5j7Ok2l3
$$ 76 -40 -68 50 -68 -49 22 36 -10 1 -98 -31 -9 11 86 132 -31 0 109 -9 100 71 38 23 6 12 -10 -43
5794d3J09N0j59R5o6M1l1K6l1j7R6n3J16j51O3K2j39J32rj42J07jK0P6j57N4P6
$$ -43 66 116 -43 52 -14 27 -4 22 -9 -26 70 17 133 -18 45 67 -72 60 51 -91 16 15 35 111 -46 8 84
5821H4q4p9J52q7Q6n1m8O6n1M7p6Q3n4J5o7J25j34R3O9q6l6N0j20J47q5L6J21
$$ 84 0 -79 73 -14 72 21 -27 39 -12 35 -41 42 -12 3 -64 61 -73 20 89 3 -33 17 -103 44 -41 -5 116
5848A16r8q6J75j29P0Lk5K5m3L6m6P1j21j7J03l9l8pm3J1J7L0M9R7r7n9P9Qn6
$$ 116 18 -68 107 -22 48 51 26 51 8 44 -2 69 -52 -69 34 -5 -43 -50 -93 -82 -65 -35 14 111 14 -45 34 42 -14
5877a4K1o5P2K8l0O8l2MK3j2N9j01o9R5Kk4j07K7R6J2j45J11j07P0M5M0n5o1O5
$$ -14 7 -58 14 42 12 80 48 52 75 63 122 21 -48 47 49 25 -82 -55 41 53 -92 19 -88 -18 27 67 12 -49 16
5906A6j5Q0j44R8n6P7j15jR8n5M8LJ01k36J01l8K2j5kO3m2P2r5R2M3j23Q1k4P
$$ 16 1 81 -63 35 -21 56 -59 -60 38 -17 31 34 135 -101 0 -38 -16 -31 -33 30 -12 60 -35 57 100 -23 58 34 41
5935D1k08J21N5o4J14o8J31rp6Pp6Mr3K02m7n5L8p3L3O6M5j80Q5j00N1l8J80l8
$$ 41 -167 -46 9 -55 59 -9 122 113 37 44 -32 -28 -121 81 34 -21 17 -56 -23 43 88 -92 -7 -107 -56 -94 86 48
5963D8j45P0L3J55j93Ok4R4M1o5l6rL4r4M7K2r7J77j59R5l5J12k6K3m5r1M8j1
$$ 48 -97 -27 6 161 -32 -26 -50 44 85 20 -16 -25 9 -85 -38 -16 -113 64 -95 0 -35 77 51 74 29 -62 -14 -25
5991b5RN4n1pkj6K28j87K8NJq1M6p6O1K2J11n7n3O7l8L3j28J1K3O9m4j54J40J1
$$ -25 -16 38 -13 -20 -22 -38 190 3 31 36 37 -44 2 -74 -13 9 120 63 10 77 39 72 -56 -45 -22 47 3 -151 -11 0
6021@K8l9j01J27N7j79R6J4j0Ql1m8J28Q1j22m6KPn5J95l5j41J54j55p3K94j49
$$ 0 28 -11 -112 15 72 -107 -11 3 -7 1 -30 -78 50 131 9 -37 -35 -28 -83 112 77 -64 90 -65 -138 156 7
6048Gn7Rk4P1K0Rj02L2Q7j26Q0Qj1kP7j24P8j01pP7j6n3N2J10l8o4l1P8nK2L7
$$ 7 -50 -41 -65 6 26 35 -67 -35 52 -74 6 14 3 1 78 -46 32 -69 -76 1 -15 -68 -16 94 56 -8 -39 39 34 56 93
6079I3k2nj05N2K8m8K1j0k7OQ4nL3r2K4j1O0L9j67J2k0J09r2R0O2j51oO3L0K8
$$ 93 71 66 -39 13 41 -7 14 4 -23 -17 67 62 95 3 27 16 76 115 -52 -40 -60 49 -43 47 109 -42 -48 15 45 73
6109G3r4N0L3j24Q8L8k3n6L7q2K6J33j38n0J39qRk9qp1K35r3k6K8o3m8J4O6o0
$$ 73 -21 29 62 -62 26 64 41 -15 22 -60 -34 99 -39 -89 50 42 51 22 14 -57 178 85 59 87 24 -24 -10 56 -4
6138doM4m4J23j06O0K4l0j13J9P2n8K1n5M8J04j71J12m5m1O3k1l8k6K09j09q8
$$ -4 -10 34 -10 113 7 67 91 61 -52 -33 39 -19 2 -53 -5 99 -72 40 -5 -46 17 -4 -42 -68 141 32 -56
6165e6L3R8l3J1J9n6Ro0m1J31j7j1JJ3j37kJ09l1QL4R5j05M7N3j57L3j06K09q4
$$ -56 -23 75 42 53 72 16 25 -35 -76 55 38 27 28 41 -96 -98 11 -20 -12 22 117 12 59 112 -45 -12 -118 91 7
6194Gm4l3R8M3r1P5m8j09P5QQ3n1k5M8m3j36J57N9j90P2R7kk3l4p5R4j8P9j57
$$ 7 -37 -70 28 71 -20 55 7 -102 -27 -19 64 13 -12 36 -7 -143 14 73 -117 -45 52 50 27 -7 -82 12 -6 73 -84
6223h4J8O5m2J7J13j79O8k7J29k03J59p6j6J43N5o0r2O6oj19J32k9l9l4M3P4p
$$ -84 -66 -1 -43 -26 87 -92 -24 -51 78 -125 34 -42 -58 85 140 80 -12 54 48 -71 61 32 -7 -41 2 76 69
6250F9m5q7P9KL9j31k1N0M1r8J08l9m3K2j1O8j14J26J31k39O5q4J07N7l9o0L0
$$ 69 24 -63 16 18 57 -74 -95 -45 -4 -102 6 -33 -76 -54 -65 3 -111 15 146 -93 -28 -112 -5 52 13 -47 -17
6277a7N2p0O8r9O6lr1J49n1lR9n3j4j30J21r5K4P5o3j3J25p0k8J1o8J09M1k9r2
$$ -17 35 -35 33 -66 0 -3 -94 55 4 1 100 47 33 -97 24 -71 -47 28 -35 -48 77 7 -21 -10 -78 31 72 43 -49
6306d9NJ3J32j12K9k6n4J9M1N5m5Mp0N0OM8O1k19Q3Q4q1P4o2Q8p2p2Q0%n4L5k
$$ -49 -44 -31 101 -11 18 -8 -62 -43 -2 53 8 12 -58 -8 -2 46 107 -112 -29 55 -26 48 -14 74 2 -70 10 10 -44 -9 -11
6337a1P4n2L3k3j9J9j07M0L7R1m0j20j7P5o1R7L4r5L9K8k7m1J08K6j08J22l5j12
$$ -11 63 11 44 21 2 21 -86 -46 -9 82 42 -78 -95 -20 -81 16 50 -45 -6 22 -5 -46 62 88 -20 102 67 -45
6365d5K9J02j04O8j82J93l1j5n0MQ7o3O6j19O4j6KJ02l9n7N3j19J46j01J25j07
$$ -45 -16 86 -18 50 -132 61 30 15 -35 -31 56 -7 59 -60 4 -12 -10 92 53 -4 49 -70 76 -25 100 -7
6391gp5NPJ2J07on4K4N7j01J3mK3O0p0J9p6M8J15k00J49o2O5j1j58M0P9j07J09
$$ -7 -82 -77 -70 -58 49 43 -11 13 70 -31 -18 -22 1 61 -9 10 -66 -18 97 -103 46 -16 49 38 -120 -80 -1 -108 1
6420Ao7k7J18m0Rj8m0M6K0o8N8j8L7L8n2k8l9J09j6L2p6L9J4r9J71j8j14J4O7
$$ 1 -66 -93 25 -15 -6 -24 -64 -18 2 -66 -8 -26 11 49 -3 -31 -70 39 23 55 -21 18 32 -67 104 86 -28 -14 53
6449E3j55J76n8j10J36K6j14J14m6l9Qj25J51J0J0J3m8r4K55j65K4n0K7L0r9R6
$$ 53 -102 74 16 -94 42 68 -46 68 22 -17 -9 -134 17 27 37 50 2 -92 163 -2 22 -28 -1 29 -70 26
6475B6j02J33j56R6J2lL6k5n3P6q7J57o0j4j12K32j97q9J31J58j02n4J16k09Q9
$$ 26 -76 57 -99 -3 9 6 42 17 -36 40 -47 110 50 36 -76 156 -41 -130 1 159 57 3 119 -90 -1
6500ak1Q6j63P6J07p4l7M4k6J32j22L8r9m3J21kj4Q5r9K4oR8Q1k69Q5J0K1m6l8
$$ -1 -22 64 -99 -23 84 10 -27 17 -9 123 1 39 -60 -103 18 16 2 87 -12 12 6 104 185 -84 1 11 32 -14 -52
6529e2K1krK8j03OJ22Qk8l6M5k6J17r5jj36J87l5J8Jj8nn3j40J64M7j27N4O4Q0
$$ -52 -31 -33 -42 -14 -117 -111 11 19 -9 -45 0 -26 91 -4 -5 -141 46 11 29 30 12 7 -46 -186 -22 25 -102 -48 16 96
6559I6j44P3O2j29j3K8j9j13J04Q7m8L8q1J9J4J06j1r0j47J54mn4J57rN8k29J46
$$ 96 -48 25 87 -42 -55 -27 -46 -159 -55 32 -16 22 -59 -40 -26 80 69 -21 -168 -14 -18 -72 85 76 134 -95 51
6586E1q1RQ3J3p4J23j12q1M0Q0p8o1P3L2j1q0R4p3J38q7L5o1M6k9P6m7l3lk9k7
$$ 51 -30 -21 62 75 1 124 12 -69 -29 51 -27 -88 -15 17 6 -74 20 -53 85 -2 33 -28 18 -11 65 18 -15 -18 -47 -74
6616g4M2N4M6o4J9M7K0Pj67R8j6KLO6n5l7j7j1Q7j45J22L9o6j40J39K5r9J53j09
$$ -74 -32 22 68 4 23 70 90 97 -70 28 12 14 17 83 28 -9 -26 -37 50 -95 27 66 0 -140 -1 24 -75 78 -31
6645c1P2l4O5j62Q3Q7l8p2rM8k0k1R2LOj47J86j45O2on2K3J25j39o6P6k6p8J04
$$ -31 41 7 72 -90 -7 80 42 -30 -39 9 -11 -32 60 63 69 -78 108 -37 25 19 -33 -10 115 -24 -90 -14 -40 -118 -14
6674a4Q7j46J19q4J9P5l4l7K9k2j1kJ2j0M6j07J37L8j10J71j68Q5p8J57q4r9J8
$$ -14 73 -73 46 -38 -19 56 22 -15 14 -8 -19 -21 -9 -19 27 -80 57 95 -15 156 -12 73 -5 152 68 -31 -13
6701a3J4n1MJ35j26K3OPq5MK3LRJ34j31O7j3K4o8N6ooJ4o7O0j2o4J53j40L7M9
$$ -13 1 -50 -46 89 -37 -14 -8 -1 -86 -82 -59 -56 -47 87 -44 23 10 34 -34 22 16 10 24 -43 17 5 -59 94 -46 -9 40
6732D0j91O3J03L2k2k7O1j16J94k26L5Q0J9l9m6J45l4p3o8j4l7K49j92J24n8R
$$ 40 -151 -88 15 47 25 -2 59 -57 137 -89 -54 26 45 6 -40 105 71 -2 -70 -84 -121 128 -64 60 2 11
6758A1k3j25J01m4J37o3K5P0j08r3K00l0l7K8p9rN1J56j44q8J73j64M9P0l2m8
$$ 11 -12 -137 -36 -80 57 -6 19 89 -19 -112 88 58 21 49 -30 -39 12 168 24 -64 109 -55 -6 64 32 -16
6784a6K6r5R8m0O6o1N5p4k0J41j23N0Ml8J29j12J2j3k8J22j98O4N3m7J23q6r7
$$ -16 10 -85 13 -27 39 -22 33 -41 -61 80 -43 7 11 -27 102 -10 2 -11 -39 83 -115 -51 2 -45 78 -8 -105
6811a05J40q6P2LJ9o2Lk4R1j10R8J3o5p4P3k5N8m3j3Q1k7J5o8n3N8O2m2OQ6n8
$$ -105 35 -51 21 24 43 -19 -16 -40 51 -59 39 52 -13 -87 -14 -39 19 -24 -37 44 17 32 -36 -89 -31 31 -11 -5 81 23
6841B3m3n4J9Rl1J18j05N0Q6j15lL7K7q3J12l8k0l2KL2p6J33r8O8L5r7%O2n9M9
$$ 23 -20 -74 -55 -46 -77 41 -64 -14 72 -43 -46 -9 18 -65 47 9 -11 -43 -41 -9 -85 48 -50 18 53 -44 -44 18 -41 8
6871Hk9J00o1j07M9J62j49j02K49j50qO0J6J7j30m2P5N5j00Q6L2l2N0o9j03L1
$$ 8 -21 79 18 -89 -40 122 -27 -129 120 -30 -38 22 38 55 -75 -117 -42 13 -87 -1 31 -1 49 -20 -123 -92
6897i2Q6O6r8j5K8O7Ql5o7K8N1j08J21m8n2K8J32j55J15q1J03r9J0O9j06L8q7
$$ -92 -6 60 -38 -53 -25 42 50 15 -52 -24 27 -81 40 -8 -60 -32 100 -55 60 -21 82 -17 -7 62 -44 -6 -93
6924i3N9J38k02K71k87J59M3k46J20R6l7o2N0Lp5J10oj06J0QM1L6RK4r9k7J5J1
$$ -93 -34 104 -98 173 -114 45 88 -158 -38 58 21 -41 9 12 -63 47 41 -65 -55 -47 -6 30 39 63 -36 -63 -48 -37
6952c7n0J64j3n5k5P4l3q8R7n1Q3j25kN1N0O4j10L1K6Lp2m7NN7j20J18r0P8K3
$$ -37 -87 77 64 9 -16 58 25 -63 34 -17 66 -59 -61 -10 40 104 -6 25 51 54 -18 -65 -60 -3 -123 -5 -95 -17 6
6981Fj31J17J47q2j10J6J01Qj61J79o2j4q4K0L7O1j25J25Po0M6k7L4p6o7J39m0
$$ 6 -125 -8 139 57 -53 -37 64 72 -89 90 28 14 -70 -50 -13 48 -77 48 55 -5 41 14 48 -28 -95 44 4
7008Dm5M6j78J14J33J3j11J4P7n2j05O2N6q8R4j27J84r0l5p7L8J39lp1O9j30N2
$$ 4 -41 5 -173 -59 74 87 -24 -10 67 15 -90 -28 28 -60 34 -93 91 1 -34 -111 -73 66 63 -8 61 -69 -17
$$ [...]
8191A6
##END NTUPLES=NMR FID
##END=
