##TITLE=1H_DE-80H_X3
 200.13MHz, d2o
 8 sc
 
 19ns.26.2.2025
##JCAMPDX= 6.0         $$ Bruker NMR JCAMP-DX V2.0
##DATA TYPE= NMR FID
##DATA CLASS= NTUPLES
##ORIGIN= UXNMR, Bruker Analytische Messtechnik GmbH
##OWNER= pz
$$ XWIN-NMR		Version 3.5
$$ Wed Jul 22 15:14:07 2026 Russian Standard Time (UT+4h)  Yarkov@DPX200
##.OBSERVE FREQUENCY= 200.1313
##.OBSERVE NUCLEUS= ^1H
##.DELAY= (6, 6)
##.ACQUISITION MODE= SIMULTANEOUS
##.ACQUISITION SCHEME= undefined
##.AVERAGES= 8
##.DIGITISER RES= 18
##SPECTROMETER/DATA SYSTEM= spect
##.PULSE SEQUENCE= zg30
##.SOLVENT NAME= CDCl3
##.SHIFT REFERENCE= (INTERNAL, CDCl3, 0, 14.3821)
##AUDIT TRAIL= $$ (NUMBER, WHEN, WHO, WHERE, WHAT)
$$ ##TITLE= Audit trail, XWIN-NMR		Version 3.5
$$ ##JCAMPDX= 5.01
$$ ##ORIGIN= Bruker BioSpin GmbH
$$ ##OWNER= Yarkov
$$ C:/Bruker/XWIN-NMR/data/yarkov2/nmr/H-C/1/audita.txt
$$ ##AUDIT TRAIL=  $$ (NUMBER, WHEN, WHO, WHERE, WHAT)
(   1,<2026-07-22 15:12:49.79 +0400>,<Yarkov>,<DPX200>,
      <created by zg, POWCHK disabled, PULCHK disabled
       configuration hash MD5:
       00 E9 B6 7A A2 85 ED C7 34 08 36 98 17 FE 4E 26
       data hash MD5: 16K
       91 C7 85 2D 4D BF EB A4 76 79 B0 4A 1F D0 FE 0C>)
$$ ##END=
$$ 
$$ hash MD5
$$ 65 0A D6 8E 00 7B 8F D9 5C 9B 44 16 31 8B E6 EB
##$RELAX= 
##$RELAX= 
##$RELAX= 
##$RELAX= 
##$RELAX= 
##$RELAX= 
$$ Bruker specific parameters
$$ --------------------------
##$DU= <C:/Bruker/XWIN-NMR>
##$EXPNO= 1
##$NAME= <H-C>
##$PROCNO= 1
##$TYPE= <nmr>
##$USER= <yarkov2>
##$AMP= (0..31)
100 100 100 100 100 100 100 100 100 100 100 100 100 100 100 100 100 100 
100 100 100 100 100 100 100 100 100 100 100 100 100 100 
##$AQSEQ= 0
##$AQ_mod= 1
##$AUNM= <au_zg>
##$AUTOPOS= <>
##$BF1= 200.13
##$BF2= 200.13
##$BF3= 200.13
##$BF4= 200.13
##$BF5= 200.13
##$BF6= 200.13
##$BF7= 200.13
##$BF8= 200.13
##$BYTORDA= 1
##$CFDGTYP= 0
##$CFRGTYP= 5
##$CHEMSTR= <none>
##$CNST= (0..31)
1 1 145 1 1 1 1 1 1 1 1 1 1 1 1 1 1 1 1 1 1 1 1 1 1 1 1 1 1 1 1 1 
##$CPDPRG= <>
##$CPDPRG1= <>
##$CPDPRG2= <>
##$CPDPRG3= <>
##$CPDPRG4= <mlev>
##$CPDPRG5= <mlev>
##$CPDPRG6= <mlev>
##$CPDPRG7= <mlev>
##$CPDPRG8= <mlev>
##$CPDPRGB= <>
##$CPDPRGT= <>
##$D= (0..31)
0 0.7 0 0 0 0 0 0 0 0 0 0.03 0 0 0 0 0 0 0 0 0 0 0 0 0 0 0 0 0 0 0 0 
##$DATE= 1784718769
##$DBL= (0..7)
120 120 120 120 120 120 120 120 
##$DBP= (0..7)
150 150 150 150 150 150 150 150 
##$DBP07= 0
##$DBPNAM0= <>
##$DBPNAM1= <>
##$DBPNAM2= <>
##$DBPNAM3= <>
##$DBPNAM4= <>
##$DBPNAM5= <>
##$DBPNAM6= <>
##$DBPNAM7= <>
##$DBPOAL= (0..7)
0.5 0.5 0.5 0.5 0.5 0.5 0.5 0.5 
##$DBPOFFS= (0..7)
0 0 0 0 0 0 0 0 
##$DE= 6
##$DECBNUC= <off>
##$DECIM= 32
##$DECNUC= <off>
##$DECSTAT= 4
##$DIGMOD= 1
##$DIGTYP= 9
##$DL= (0..7)
0 120 120 120 120 120 120 120 
##$DP= (0..7)
150 150 150 150 150 150 150 150 
##$DP07= 0
##$DPNAME0= <>
##$DPNAME1= <>
##$DPNAME2= <>
##$DPNAME3= <>
##$DPNAME4= <>
##$DPNAME5= <>
##$DPNAME6= <>
##$DPNAME7= <>
##$DPOAL= (0..7)
0.5 0.5 0.5 0.5 0.5 0.5 0.5 0.5 
##$DPOFFS= (0..7)
0 0 0 0 0 0 0 0 
##$DQDMODE= 0
##$DR= 18
##$DS= 0
$$ [...]
##$SUBNAM2= <"">
##$SUBNAM3= <"">
##$SUBNAM4= <"">
##$SUBNAM5= <"">
##$SUBNAM6= <"">
##$SUBNAM7= <"">
##$SUBNAM8= <"">
##$SUBNAM9= <"">
##$SW= 18.0517328524113
##$SWIBOX= (0..15)
0 0 2 0 0 0 0 0 0 0 0 0 0 0 0 0 
##$SW_h= 3612.71676300578
##$TD= 16384
##$TD0= 1
##$TE= 0
##$TE2= 300
##$TE3= 300
##$TEG= 300
##$TL= (0..7)
0 120 120 120 120 120 120 120 
##$TP= (0..7)
150 150 150 150 150 150 150 150 
##$TP07= 0
##$TPNAME0= <>
##$TPNAME1= <>
##$TPNAME2= <>
##$TPNAME3= <>
##$TPNAME4= <>
##$TPNAME5= <>
##$TPNAME6= <>
##$TPNAME7= <>
##$TPOAL= (0..7)
0.5 0.5 0.5 0.5 0.5 0.5 0.5 0.5 
##$TPOFFS= (0..7)
0 0 0 0 0 0 0 0 
##$TUNHIN= 0
##$TUNHOUT= 0
##$TUNXOUT= 0
##$USERA1= <user>
##$USERA2= <user>
##$USERA3= <user>
##$USERA4= <user>
##$USERA5= <user>
##$V9= 5
##$VALIST= <valist>
##$VCLIST= <CCCCCCCCCCCCCCC>
##$VD= 0
##$VDLIST= <DDDDDDDDDDDDDDD>
##$VPLIST= <PPPPPPPPPPPPPPP>
##$VTLIST= <TTTTTTTTTTTTTTT>
##$WBST= 1024
##$WBSW= 4
##$XGAIN= (0..3)
0 0 0 0 
##$XL= 0
##$YL= 0
##$YMAX_a= 70298
##$YMIN_a= -80989
##$ZGOPTNS= <>
##$ZL1= 120
##$ZL2= 120
##$ZL3= 120
##$ZL4= 120
##$ABSF1= 10
##$ABSF2= 0
##$ABSG= 5
##$ABSL= 3
##$ALPHA= 0
##$AQORDER= 0
##$ASSFAC= 0
##$ASSFACI= 0
##$ASSFACX= 0
##$ASSWID= 0
##$AUNMP= <proc_1d>
##$AZFE= 0.1
##$AZFW= 0.1
##$BCFW= 1
##$BC_mod= 2
##$BYTORDP= 1
##$COROFFS= 0
##$CY= 83.5205535888672
##$DATMOD= 1
##$DC= 2
##$DFILT= <>
##$DTYPP= 0
##$F1P= 10.8118882576601
##$F2P= -7.23987719738617
##$FCOR= 0.5
##$FTSIZE= 0
##$FT_mod= 4
##$GAMMA= 1
##$GB= 0.15
##$INTBC= 1
##$INTSCL= 1
##$ISEN= 128
##$LB= 0.25
##$LEV0= 0
##$LPBIN= 0
##$MAXI= 10000
##$MC2= 0
##$MEAN= 0
##$ME_mod= 0
##$MI= 1.114404
##$NCOEF= 0
##$NC_proc= 0
##$NLEV= 6
##$NOISF1= 3.799351
##$NOISF2= 2.8
##$NSP= 1
##$NTH_PI= 0
##$NZP= 0
##$OFFSET= 14.38212
##$PC= 1
##$PHC0= -7264.547
##$PHC1= 21.42198
##$PH_mod= 1
##$PKNL= yes
##$PPARMOD= 0
##$PSCAL= 0
##$PSIGN= 0
##$REVERSE= no
##$SF= 200.129724274929
##$SI= 16384
##$SIGF1= 3
##$SIGF2= 2
##$SINO= 400
##$SIOLD= 16384
##$SREGLST= <1H.CDCl3>
##$SSB= 0
##$STSI= 0
##$STSR= 0
##$SW_p= 3205.1282051282
##$SYMM= 0
##$S_DEV= 0
##$TDeff= 0
##$TDoff= 0
##$TI= <>
##$TILT= no
##$TM1= 0
##$TM2= 0
##$TOPLEV= 0
##$USERP1= <user>
##$USERP2= <user>
##$USERP3= <user>
##$USERP4= <user>
##$USERP5= <user>
##$WDW= 1
##$XDIM= 8192
##$YMAX_p= 0
##$YMIN_p= 0
$$ End of Bruker specific parameters
$$ ---------------------------------
##NTUPLES= NMR FID
##VAR_NAME=  TIME,          FID/REAL,        FID/IMAG
##SYMBOL=    X,             R,               I
##VAR_TYPE=  INDEPENDENT,   DEPENDENT,       DEPENDENT
##VAR_FORM=  AFFN,          ASDF,            ASDF
##VAR_DIM=   8192,          8192,            8192
##UNITS=     SECONDS,       ARBITRARY UNITS, ARBITRARY UNITS
##FACTOR=    0.0002768,     1,               1
##FIRST=     0,             0,               0
##LAST=      2.2672688,     0,               0
##MIN=       0,             -80989,          0
##MAX=       2.2672688,     70298,           0
$$ Real data points
##PAGE= N=1
##DATA TABLE= (X++(R..R)), XYDATA
$$ [...]
893a27J74j34m4K31l5j09J47M0K2q5j96K13p2j92J89p3K6L1j54J25J5m6QQ9j35
918i2J17l0K4J38j70K5J82j89J48k48jO4K16j70o5r6P0J20k75rJ51J76K6n4j77
943a19K44Lk40K66j2j76kp4M13k24m23J72K55j26k4p6K4K31l35K03J76j53J5J8
967C6O8O7j01j70J75Q7j26p8q7P3J41j52l1j9m2J89L2r3N7N9K7j29O6J46Rj73
993C1K9J31k78j13R8J72l2j94qK73O6l89p7K34K03r8j08J52M7j11L1m4R5j13j62
1018a65J75P5l69J78k9J9K69j34j5k0J07J02n2j18kJ28l1j98M3l3J89j19j66J67
1042Aj3j70R9J59R3k66L9J16J05k33N7P5j3Oj43P5K00j97k27L09p1j66J05j60
1066b20L20r8k32J98J00l8j0P5j03N8l0J39j47K4l3N4p3J1j8R7j88j09J58J21
$$ plain form
893 -127 47 -87 -131 100 65 -44 103 143 165 80 -116 97 25 -167 22 -51 -25 6 -148 -23 -8 -54 -46 43 -92
918 -92 25 -5 19 157 -13 12 194 5 153 -95 -96 -32 184 14 -51 -147 -77 43 -232 -241 -90 86 112 58 -119
943 -119 125 128 -112 154 142 -34 -36 -110 303 79 -344 -172 83 -43 -67 -143 -119 112 -223 -20 156 3 18 36
967 36 104 171 70 -100 75 162 36 -42 -129 -56 85 -67 -98 -117 -159 30 62 -31 26 85 112 -17 49 195 204 31
993 31 60 191 -87 -200 -102 70 38 -156 -164 109 175 -214 -291 -57 146 48 -60 92 139 28 59 15 110 -3 -165
1018 -165 10 85 -284 -106 -135 -116 153 19 4 -16 91 193 141 23 21 149 118 -80 -37 -70 119 0 -166 1
1042 1 -12 -182 -83 76 169 -97 -58 58 163 -70 -13 62 49 55 -88 -13 187 -10 -237 72 1 -165 -60 -220
1066 -220 100 2 -230 -32 68 30 20 95 -8 50 20 159 12 36 3 57 -16 -5 -23 74 -114 -223 -65 56
1090E6M1j42J78m6N9j33N1J33j10k79J90K03k03m7q7K71j04j69R7Q7k07J54N0
1113D3L7N9j94P2K44j63j76J64Mm9lk3P5j33j24K40j63M7l2J33L5j09kJ15j01
1138dn6LJ26k3m6NJ44J4l31M0K07m1j94K6K51j23o3O9K33k21j24K55L3p0j87R3
1164A6Q6N3k09J01J13j74Q2j27J05k2k21J04K26l06M8K05j5m0j42R0K10l94J31
1187h0K68ok37n5J72J9k30K6K54k13o5J49J0J28k00O1J93j02k20L45q6J1j54n3
1211f5J43r9j57M9K30k76R3k9K06q6j44M0K30k12n9L13p5j11l5J12J22k39o4J80
1235F7m4p3j65J62N0j28m3K63j9j76J58J08kj47L0O0K5l46K48J20j79j13J42L
1259AL8k67J37J73j83k6J59lk1J12l0p1J11j91K33Lk69M1K3J84k53k06K31J33
$$ plain form
1090 56 97 -45 133 87 146 13 64 197 87 -192 -2 201 -2 -49 -136 135 31 -138 -41 46 -161 -7 43
1113 43 80 139 -55 17 261 98 -78 86 90 41 38 15 90 -43 -167 73 -90 -43 -75 58 93 -16 -18 97 -4
1138 -4 -60 -57 69 46 0 5 149 163 -168 -128 79 38 -156 -130 121 -2 -65 4 237 16 -108 147 180 110 -77 16
1164 16 102 155 -54 47 160 -14 68 -59 46 24 -197 -93 133 -173 -125 80 65 25 -117 -27 183 -211 -80
1187 -80 188 182 -55 -110 62 81 -149 -123 131 -82 -147 2 12 140 -60 1 194 92 -128 217 131 142 -12 -65
1211 -65 78 -21 -178 -129 101 -175 -82 -111 95 9 -135 -95 135 -77 -136 177 102 -9 -44 68 190 -49 -113 67
1235 67 23 -50 -215 -53 -3 -131 -174 89 70 -106 52 160 158 11 41 101 126 -220 28 148 -31 -144 -2 1
1259 1 39 -228 -91 82 -101 -127 32 29 8 120 90 19 130 -61 172 175 -94 -53 -30 154 -99 -305 -74 59
1283E9j98K9J30p6Q6j45K76r2j2L9M7j07j01p5K06L3k57J76K8j78q6J70o9J09
1307hn8l7K76k24o5K93J0j56l4K1J19m2n4j30J48k60J61o8NJ47q7l2J66k73J37
1332d5J41r4mK1J41Oj25j46L56k33l7o7m3M7R0j20J94k08N1J40m8n2O9L4l1K8
1358F5j28P1J16j12M77l66q0j3j24P8moj16K59j10q4J09k4J02j16j31J96n0K9
1382C8k0p2J21J2r3P4j4j10K0n3J9N1L7o7P6j78J27L7k03L38k6m5J3j58J54k3
1408E5J3q0J14r3o2l6M6L5k8j37N4J66j44J03PO8O8l02J53O9r2N0P8n69K66L68
1434A70k35Q9j11J10j02l2O4J6j04J50PO2o3l4R6O5k7o7l7Q8o2rJ5o8J11j63J19
1461D8m0j4onOJ10j02pJ95k88K08r2L4P3l8K5Nj79j21J83m0Q0j46P4n2%L0J08
$$ plain form
1283 59 -139 -110 20 -56 30 -115 161 69 57 96 143 36 -65 -140 66 99 -158 18 46 -132 -218 -48 -117 -8
1307 -8 -66 -103 173 -51 -116 177 187 31 -3 18 137 95 41 -89 59 -201 -40 -108 -103 44 -43 -75 91 -182 -45
1332 -45 96 2 -2 19 160 166 41 -105 251 18 -19 -86 -129 -82 8 -112 82 -126 -75 65 17 -35 34 68 37 65
1358 65 -63 8 124 12 489 123 43 30 -94 -16 -20 -26 -142 117 7 -77 32 8 110 -6 -137 59 9 38
1382 38 18 -54 67 79 -14 60 46 -64 -44 -97 -78 -27 10 -57 19 -159 -32 5 -198 140 114 69 82 -76 78 55
1408 55 68 -12 102 9 -53 -89 -43 -8 -36 -173 -119 47 -97 6 13 81 149 -153 0 69 -23 27 105 -464 -198 170
1434 170 -65 24 -87 23 -79 -111 -47 -31 -135 15 22 84 21 -13 83 148 121 54 17 105 43 34 49 -19 92 -71 48
1461 48 8 -6 -12 -17 -11 99 -3 -10 185 -103 105 13 47 120 82 107 112 -67 -188 -5 -45 35 -111 -37 -89 -89 -59 49
1489D9q4o4J05J4Q7j21R6L5j17o7Q3jl3K5j35K48r6m9nM0o4J39r9NN0k9J6o3R0
1518E5M5p7o5P1q0Q3j33K2k9Q0j1j1j7J11l6q7P6P8n3p8K35j91K4n5R2J4o4n0
1546e1P0q0O3L0j86J50Rp3J04l2j7J6J50j54Q9j25p4J66k0Nq4L1Pn5J81j56n5
1573i1K4J38j09K7K3J5n3L7J5L1r4q1J07P2p6m4R2j43MJ24k4rp8k2Q2O4j98J12
1601e5K1On5R2j8MN7j15P6L5r6O8j8N0k0p4l6J15j42kJ09r9J73k55J49N0jqmj12
1631a05J06N0j14J38j15oM1j22R4K7jl9m7Q4m9m2Q9j14P9kP6L7r1P8p8N5n2n1
1659g4J08Q5j40J08j03J48j26M8mP9j09j7j5p7J2L3R1j30L6P0lm4K5j7p4J91j66
1686f5O5M2J63o2M34o66J35P06o02n93N5N46o0r0o8J38k31K19J08p1j94M01k97
$$ plain form
1489 49 -35 -99 6 20 107 -14 82 117 0 -67 16 15 -18 7 -128 120 24 -25 -30 10 -54 85 -14 -9 41 12 28 -35 55
1518 55 100 23 -42 29 -51 32 -101 -79 -108 -28 -39 -50 -67 44 8 -79 -3 75 22 -56 179 -12 12 -43 49 63 -1 -51
1546 -51 19 -61 2 32 -154 -4 5 -68 36 4 -13 3 153 -1 88 -37 -111 55 35 40 -44 -13 -6 -61 120 -36 -91
1573 -91 -67 71 -38 -11 12 27 -26 11 26 57 -37 -118 -11 61 -15 -59 33 -110 -106 18 -6 -15 -93 -115 -33 31 -167 -55
1601 -55 -34 -28 -83 9 -9 -5 52 -63 13 48 -48 20 2 52 32 -42 -78 37 -105 -107 2 -97 76 -179 -30 20 19 11 7 -105
1631 -105 1 51 -63 75 -40 -46 -5 -127 -33 -6 -7 -46 -93 -9 -58 -100 -11 -125 -46 -48 28 65 -26 52 -26 29 -23 -74
1659 -74 34 119 -21 87 -16 132 6 54 50 129 20 3 -12 -89 -77 -44 47 -83 -47 23 20 -24 1 -16 -90 101 -65
1686 -65 0 42 205 143 577 -89 46 752 150 -443 -388 158 98 8 -60 78 -153 66 174 103 -91 310 13
1709A3j2j7K13k93KP0R4k08J5J37j18L8J03NQ1j9o3K5q2N3k5L0p1N7p5J22m9r2
1737f6P0j02r3Q0n9K06K3j34K13j10Q7L7j5j02M4l0J02j20o5P4K0j45O1q6J58
1762D8p2P9l8K7j1j51K40q1k5k8n8R1o8J1R1o5K6l0J17j02n1qj5J1J56jn5j1p2
1791d5%K7PL7J10j04k9j18J36k0L3j15kJ55j72J27L5p3n8KN9P4j06O2K6p0Lj0
1819b9M9l1Q1j61J44n7k4J3Pj24J46Qj57J54k12J71J18q7k8J42q3RO0q0n7P8p1
1846b1PR1k8l2j4J9o6mJ29r0M3K8n0L0LJ3NJ3r2ln3M5J6j9K0mJ5j28K31j45P3
1877C2N6j15PM8M2j62J78j57J06Pq6O2Pk7k6J29j20q8O5J7q2O6k3Q7o2N5r5N9
1905b0J03j8Pp5n1J33j41M2O7J9j83O4P2nJ54j92Mj5J06k5N5l9l3j0P0j46j3L7
$$ plain form
1709 13 1 -16 197 -96 -94 -24 70 -138 -123 14 -104 -66 37 42 123 104 41 66 -16 37 12 42 -29 28 -47 75 26 -66
1737 -66 4 -98 -191 -111 -170 36 59 -75 138 28 115 152 137 35 79 49 151 31 -34 40 60 -85 -24 -110 48
1762 48 -24 55 17 44 33 -118 122 41 16 -12 -70 21 -47 -36 55 -10 16 -14 103 1 -50 -58 -73 -62 94 93 38 27 -45
1791 -45 -45 -18 -11 26 136 32 3 -115 21 1 34 -81 -83 72 -100 27 62 -11 -69 -67 -8 66 -40 22 48 -22 -19 -29
1819 -29 20 -11 70 -91 53 -4 -28 -15 -8 -132 14 22 -135 19 -193 -22 96 9 -19 123 40 49 109 29 -28 50 -21
1846 -21 -14 77 49 17 3 22 -44 -48 81 -9 34 62 12 42 45 58 63 76 -16 -19 -72 -27 -11 -30 -10 -14 1 -127 104 -41 32
1877 32 88 -27 -20 28 70 -92 86 -71 35 42 -44 18 25 -2 -28 101 -19 -107 -42 -25 -107 -41 -64 23 -39 16 -79 -20
1905 -20 83 65 72 -3 -54 79 -62 -20 47 66 -117 -53 19 14 168 -24 -20 -35 71 46 101 62 29 19 89 -57 -70 -33
1933c3l1K6N5M9j05J9Km7J36q2J2K7k9j8O6k8N4O4k18K16q2Q4Qq5m6j4q7J00J9
1962C2l0M4j82J35k0p2O5O6j28Q6j6l3J20n4o0J29o8l1K3Q3N8o3j89M4j07J00
1988f8K69k40PJ03j33o6P6JK9J46r0m4j19J44j7J3N4j3L4j52QjJ9K0Q2p3O0l9
2016A0M0lr1j4%R3J48k27L0q2J17l1lk8j10K15j14J02l0n3K5J29o0j28N4j4Q3
2043E8m5n1k6N2K1l8l6j7J69j29m6K48j92K5N5Oj11l1P1J7mKj08J28o0pO8n0J55
2072A24j27P2j46N6Pj28J60k5N7j23P5PJ30j35J54q1n9Ll6j2J37j51k4L3N9r4
2098f7M4J50j13m5M9L2j4K5n3k4L7n5o9J01l6JN4l5k1K3j7n8R4L9o2k1j3P6J00
2127A22k8j51Q7p9J14j49K58k70k36N88oq5R9K77n02N25m78K69k64q26Q74J75
$$ plain form
1933 -33 -64 -38 17 66 -39 -20 -18 -65 71 -11 1 28 -1 -19 47 19 73 137 -81 135 53 137 145 60 14 0 -87 13 32
1962 32 2 46 -136 -1 -21 -93 -28 38 -90 -4 -20 -53 67 13 -47 82 14 -17 6 89 147 84 -105 -61 -168 -68
1988 -68 201 -39 -32 71 -62 -128 -52 -51 -22 124 34 -10 -129 15 -2 11 65 52 86 -66 -58 -59 -40 -20 62 -11 49 10
2016 10 50 47 -44 -58 -58 35 183 -44 -14 -96 21 -10 -13 -41 -151 64 -50 52 22 -31 -6 123 63 -65 -11 -25 58
2043 58 13 -38 -64 -12 9 -29 -65 -82 87 -42 -88 160 -32 -7 48 54 -57 -88 -17 0 -4 -2 -110 18 -42 -49 19 -31 124
2072 124 -3 69 -77 -21 -14 -142 18 -7 50 -73 2 9 139 4 158 77 18 21 -15 -27 110 -41 -65 -32 27 -67
2098 -67 -23 127 14 -31 18 50 36 61 8 -16 21 -34 -103 -2 -38 -37 17 -18 -39 -16 -33 -91 3 42 -20 -41 -54 22 122
2127 122 94 -57 30 -49 65 -84 174 -96 -332 256 250 165 264 541 39 564 86 355 91 -735 139 314
2149C14l78l58N03J0R9J00o61K30J33m11N08p14M69L87M58m91o91J30P80n94K84
2170A07K22j14M1l51J21p8J13o8L7m8m2L7l0n2J48j19J32oJ3l5m2o4J12j03k1
2195i0J1R7n0j14J28k3R1m2J8k7l5J58j25K0J0L7l7nl7J9k5P5o1L4n8M8N0j2L6
2224I1j08M5Ln2r5J89o1K9o4L1Pk7l8pPK2k7j3J83n1m2r3L7%N3R0r6N6Nr1J37
2255A20r0rO9r4n9R6o3K4q3J23j1r4n8K0L4J18j6r4J26j16J31k49P88o13l05M70
2281A65k96K41j81J07m6RP5n0l9Q6l7m7pL6L0K9q0k9M7j01J16n6kJ13j34N5j0
2308fj2k1M0k9L6L7r7K2K2K0j1o1O4O0r1O4k9l9NKJ5N0m6J2r8N8j4J54r3j2j4
2339a2L4j8j8J88k32J11l8N9j16P3j30M4J02j7j16J15Q8j18q0J1r1J72J02j18
$$ plain form
2149 314 -64 -422 81 91 190 290 -371 -141 -8 -419 89 -625 -156 231 689 198 -493 -363 417 -177 107
2170 107 329 215 256 -95 26 -52 61 -7 30 -18 -60 -23 -53 -105 43 -76 56 50 63 28 -14 -78 34 -69 -90
2195 -90 -79 18 -32 -146 -18 -41 50 8 26 -1 -36 122 -3 17 27 64 27 22 -15 4 -21 54 -7 27 -31 17 67 55 91
2224 91 -17 28 31 -21 -116 73 12 41 -23 8 15 -12 -50 -57 -50 -28 -55 -68 115 64 22 -71 -34 -34 19 109 13 69 74 -17 120
2255 120 30 21 90 -4 -63 33 -30 -6 -89 34 23 -71 -129 -109 -75 43 27 -67 59 -57 74 -175 613 0 -305 165
2281 165 -131 110 -71 36 -10 -1 74 24 -15 71 34 -13 -20 16 46 75 -5 -34 13 -88 28 -28 -30 83 -51 4 -6
2308 -6 -18 -39 1 -28 8 45 -52 -30 -8 12 1 -60 4 64 -27 37 8 -31 -26 -24 -9 41 -5 7 -91 -33 -47 107 14 2 -12
2339 -12 22 4 -14 174 -58 53 15 74 -42 31 -99 -55 47 30 -86 29 117 -1 -81 -70 -161 11 113 -5
2363ej3J26j09o4J34j94K31j1m4j04L9J4L8j26J36M3j49N0j5L8J2n0l2J62j01
2388Fk2q4J01L5p6k0J16k6r0k0J16p0O7on7N3p4nmJ45j47J7M7Q2k4j08k5J8m4
2417i9O1J24o4P1l9j02M8J0p3J10l0o6j6P5k2r8J95m1j28J08l2o7R1Jr9O4k8P7
2445C1o2m1j64K63j10Q7r6K6J08j7p6RJ42j71L8M2LK3p7J25j69R5mP4o2n6J54
2472A15j14p0J74m4p8J7J07j20r4P8l2n0O7J10p5m4K2oLM1oN0J7j02J4j4J20q8
2500bp0J90j25Q2j09j12J99r1L8NOM3o3JP0oM8j36k89L90j51J01j20J86j61P9
2526Cm5K9Mqj5R4L0p0l1rmP0j62J61l3r1J24r8J9J18k9p0o1K5L5L1j3m7J39m6
2556E0q8L6p1Q5r0M1k1J51q3q3M4j66J33J50j09l4o9J95j17J07r7j4O2m6L9J01
$$ plain form
2363 -5 -18 108 -1 -65 69 -125 106 95 51 -53 -14 0 38 -88 48 91 -58 -8 -23 15 27 -23 -55 107 6
2388 6 -16 -100 1 36 -40 -60 56 30 -60 -80 36 -34 33 27 -30 23 -51 -56 -60 85 -62 -45 2 84 60 -48 -73 -55 -99
2417 -99 -38 86 22 93 54 -48 0 10 -63 47 17 -49 -65 10 -12 -110 85 44 -84 24 -8 -75 16 17 -82 -18 -46 31
2445 31 -31 -72 -236 27 -83 4 -92 -66 42 25 -51 -42 100 -71 -33 9 12 35 -42 83 -86 9 5 79 17 -39 115
2472 115 1 -69 105 61 -17 0 107 -13 -107 -29 -61 -111 -44 66 -9 -53 -31 -37 -34 7 1 51 68 -34 -20 -34 86 -2
2500 -2 -72 118 -7 75 -34 -146 53 -38 0 5 11 54 -9 -8 62 56 104 -32 -321 69 -82 19 -101 85 -76 3
2526 3 -42 -13 -9 -17 -32 62 92 22 -9 -18 -22 48 -114 47 14 -77 47 -51 -32 86 57 -13 -74 -49 -14 17 4 -43 96 50
2556 50 -38 -2 -73 12 -78 -37 -58 93 10 -73 -29 -195 -62 88 -21 -55 -124 71 -46 61 -36 -50 12 -34 5 106
2582A06q3L0j48J54j36J04n7P6J4k04J00kK9J59o4K0o7L2m9m6K1oO6o9J00j91
2608a11J67r5p0J17j09J03Mj6k3J1p2Q2O1j65J6K8P5k3QO9M4kj67n2K42j44M6
2635B4r8o6R3L6j0j8L2n8Q9J7l6l1J36m5j04Rp5O7N4m2K3L1q5M4NL1Nq5N9j14
2665a12J54l1n8M4j34J89j4NM3o5K4M5q9J48o6j02J4o9R3J2q1J26j86J65o1N0
2691D4q5JP2j6k1p4J18K0j04R1q9L0L9n8P9Rj02m3Q8l3R0k7P7o2p7M5k2P0Q5k49
2721a04J60k2j29M9K3Q3k6n6m3J29p7OqJ01M3k18K06j65K3O4r5J26j48J4o3J33
2747FML4k6M0r9O7J7O4j36K8l1L7j02J67M0j23l1Q4N7q0J43j64qm2pjO1k4l2R3
2777C6l8J08j63J70k05J20q3Q6j02K2J20r8L6kJ39p9j1j51J33k24K48j28J27l5
$$ plain form
2582 106 23 53 -95 59 -77 27 -30 46 60 -144 -44 -46 -17 142 78 98 31 63 14 -32 -11 -17 49 -20 80 -111
2608 -111 56 -39 -109 8 -101 2 6 -10 -33 -22 -94 -12 49 -116 -100 -72 3 -20 -12 57 101 99 -68 -120 122 -22 24
2635 24 -74 -140 -47 -11 -21 -39 -7 -65 24 41 5 -26 110 65 -39 -30 -105 -38 16 -26 -3 28 -57 -13 -8 23 28 -57 2 -112
2665 -112 42 11 -47 -3 -137 52 38 43 86 21 45 90 1 149 83 -19 -5 -74 19 31 -50 76 -110 55 -6 44
2691 44 -41 -40 32 16 -5 -79 39 59 -45 46 -43 -13 26 -32 47 56 -46 -89 -1 -34 56 29 106 44 -33 12 -10 60 145 -104
2721 -104 56 34 -95 -46 -23 60 34 -22 -65 64 -13 -7 -15 86 129 -89 117 -48 -25 39 -56 70 -78 -64 -127 6
2747 6 10 44 18 58 -41 26 43 107 -29 -1 -32 5 -97 70 110 -13 -44 40 97 17 160 -4 -12 -54 -61 -62 -1 -25 -57 36
2777 36 -2 106 -57 113 -92 28 -55 31 -71 -49 71 -27 9 7 146 67 56 -95 38 -186 62 -66 61 26
2801B6K5Lj21K55j84R2j54M9LJ09k7m9J3Lo6O4j31J26oj40J54j38J14j3j45J79
2827D1J7m5K6J09j91K9k3J78j41J6l6J17n9m9p8Q4K3r9K68k77L8J11n7P5jj38
2853f2Q6L3n9O1m0r8J82j51l5J58o8o2L6m9K5mK7jM0p2Q4j01L5M6P2o8on2R5m
2883D8m6M1M7j23LK0M5MO1j99K08p4m4l4J57l9k20J6J16J5K2mj24J65j13R5J3
2910E6j25J9RL5R9o4O9j65J49J0K3J4k31m5M1O1l6O8P2j01R3j24J28p6P4o0K5
2937A8j11J23q8M6N9o4N0j9N4q6M0o2J11q8Mn5J9l8l8QP7k2J26l1o2J21n6j01
2965f5j1J24K1o2RL5p8O9j21P5J1M0k2n3K3R3j94J93k5j06J5J9K1l3J7q5N6m9
2993h3NJ62l1j0r8j5q5O3R9r3J13q7O5J5O4j05P2K2n2J5j12J49j65R8o7J03o6
$$ plain form
2801 26 51 54 -67 188 4 96 -58 -9 -6 103 76 27 40 43 -23 41 -90 36 30 -110 44 -94 20 7 -138 41
2827 41 58 13 39 148 -43 -14 -37 141 0 16 -20 97 38 -11 -89 -5 18 -81 187 -90 -52 59 2 77 76 -62
2853 -62 24 57 -2 59 19 -79 103 -48 -83 75 7 -55 -19 -68 -43 -47 -20 -21 19 -53 31 -70 -35 11 83 15 9 -43 52 48
2883 48 2 43 90 -33 -30 -10 35 39 100 -99 109 35 -9 -43 114 75 -145 -129 -13 2 24 20 -104 61 -52 43 56
2910 56 -69 -50 -41 -6 93 29 98 -67 82 92 115 129 -102 -147 -106 -45 -81 -13 59 -42 51 -73 55 -21 53 -7 18
2937 18 -93 30 -58 -12 47 -17 33 14 68 -18 22 -40 71 -17 -13 -68 -49 -87 -125 -117 -40 -62 64 33 -29 92 36 -65
2965 -65 -76 48 69 7 16 51 -27 42 -79 -4 7 47 25 -28 -5 88 -106 87 62 -44 -29 -10 11 -22 -5 -90 -34 -83
2993 -83 -78 84 53 43 -55 -70 -155 -92 7 -86 27 -60 5 20 84 -21 51 73 21 36 -76 73 -92 6 -61 42 -24
3020b4J03r8k6J59j89L9O6m3q0J48p1p1J18n7m5n0P3j4oj5J02l2q5L8L7N1n8l
3048c3K2qJ07o4m7qK9J6pLr7J43J2N1O4k41J75j79J08L2k8p1j6J23q3o1J8k7O8
3077AJ6o4o8N9O7j1l2O4k5r1J14j0j21J93r4q8P0n3Q1L2r4OM0K0O8j42R5m7j00
3106a14N9J74n5j73R1J09r5kJ9P4j60m6J45KK2p0J30j52K7o8J19r2P7M2j07M9
3132Ek6m1J39n0J01j06k4O8r0O7o3O0O1j25jJ26j04qJ17j95O0j8%j7p5J45k8n1
3160g3O1q2M8K4R7p0J01j22n3J73n4p6l9M6PRO4o7p0J08j79J45L3J3o4P5j11l4
3188i0Q4o6J40m1j6QLq9J02m8%Q0o5j5J02q0J1M1j19p8J12P1l8m4O7r9L8Q9r2
3217c2qJ3L7j1j33R7P9l4j16J2J32k6n2N1N7p8L6m6J3k3O1o5j8Q4K3j70L0Q6P4
$$ plain form
3020 -24 79 -19 -45 114 -75 -36 30 -13 -93 55 -16 -87 31 -26 -71 -121 -48 -62 -68 -83 19 -13 -98 -60 -23 28 -30 -33
3048 -33 -11 -19 88 24 -23 -31 -2 14 7 10 -87 56 68 119 183 -58 117 -62 46 78 50 -21 -37 86 3 -58 -40 -67 1
3077 1 17 -47 -115 -56 11 0 -32 32 7 -84 30 20 -101 92 -2 -90 -20 -73 8 40 -54 -48 -8 12 80 -62 33 -14 -114
3106 -114 -55 119 64 -109 -18 91 -4 -6 13 87 -73 -119 26 28 50 -20 110 -42 -15 -83 36 -56 21 63 -44 5
3132 5 -21 -62 77 27 128 22 -2 66 -24 43 -20 40 101 -24 -25 101 -3 -11 106 -89 -29 -47 -47 -64 -139 6 -22 -73
3160 -73 -12 -94 -46 -22 75 5 106 -16 -69 104 50 -26 -65 -19 -12 -3 61 -6 -76 32 -147 -2 31 44 -20 55 -56 -90
3188 -90 -6 -72 68 27 11 19 22 -67 35 -13 -13 67 2 -13 89 9 20 61 -58 -136 -24 47 9 -35 32 -67 -29 60 -32
3217 -32 -40 -27 10 -1 -134 -37 42 8 -108 -96 36 10 -42 9 66 -12 24 -22 -9 -32 29 -36 -54 30 53 -117 -87 -1 73
3246G3o8m0N0J3J9o6P5j51J01n1J9p6P5n1L3L2r8J53k3q7M0J8J8o9k0L3MM6P5
3275G7q1J7M2l2j30P6p1lP7O2p1K8m8NP2r3Q0n8l5J85j69P5j18M2R2n7R4j36J21
3304D3Jj3n5Q1o8j54K55j61K1P6j0l9J22n2M0nj36N7j5Pj87J99P4o5n0MK4m0j1
3333e7J50l6j23j0j8R8Q8j43J20j46J05j08P6o8R1M1r7Q9j51J14j7Qnl9L5L2L3
3360F2p5P8%k6k4o9l0Q0j2N2j22J70k32J24j27J92Nr4P4j92J10QJ33o2K08l47
3386a16J38J00l1j4o6Ro9j6J39j4r0J11k1j01n7J48n5M1Pq2O8l1J01j87R8k7L7
3413B0J6q8n5R9rj7J5N8j52J32J2p8J4N0j13Q0j03J67O5q4l5K6J13j36M1o2J08
3440H4M5j13m9O3N3p0J0m3J44j29K4j00K4K4k8o8R8l7N4L2l9k5P2o2J2J8k8P4
$$ plain form
3246 73 5 -35 15 28 47 -19 56 -95 6 -45 -26 -102 -27 -78 -45 -13 -111 42 19 -68 -28 -10 8 -61 -81 -48 -44 2 77
3275 77 -4 13 55 23 -107 -31 -102 -105 -28 34 -37 -9 -57 -52 20 -73 7 -51 -86 99 -70 5 -113 -71 21 -36 58 -78 43
3304 43 44 31 -24 57 -11 -165 90 -71 -50 26 16 -23 99 47 87 82 -54 3 -12 -5 -192 7 81 16 -34 -30 -6 -46 -57
3333 -57 93 57 -66 -76 -94 4 92 -51 69 -77 28 -80 -4 -72 19 60 -37 52 -99 15 -2 6 1 -38 -3 29 62
3360 62 -13 65 65 39 15 -54 -84 -4 -16 36 -86 84 -148 -24 -151 41 46 -48 26 -166 -56 -48 85 23 231 -116
3386 -116 22 122 91 77 11 20 -49 -65 74 60 -30 81 60 -41 -98 50 -5 36 43 -39 29 -2 99 -88 10 -17 20
3413 20 36 -52 -107 -8 -17 -34 -19 39 -113 19 31 -47 -33 17 -96 -16 -119 48 113 29 -6 20 133 -3 38 -24 84
3440 84 129 16 -33 30 83 13 23 -20 124 -5 19 -81 -57 -33 -61 -129 -31 -68 -14 18 -21 -46 26 -36 -24 -6 -34 40
3468D0l6L4k2O6j30J35j43J12P9j12q0RO8pN2n4j6Qj7j1J8lN2LL1j23Q6m3J07
3497A03J2j41O1Ll6qk2OK0P9j00ql7J06l4o4L5N7O%m5O3j8m3R3j25J45j78R0J7
3527C7rJ9M3rj18OK9Nj0P8l5p5J7OR7p1k3Q5o6j62K10j5K4m3L2m6p0M0K2N8j64
3558a08K70j80OK2m2L8M4K6m1l9K3l2Q8o4k9n7K2M3K0o9k2qQ8p9J35o4M6M8j33
3587d8Q5Nj16L6Q0q9M9rJ36j26K0l7m2J03K8p3J07m2j24Q1j0N8mN8j44O9p7J6
3615a0j5j0K8j13J50nr4k7M1P2m4K4M9J2O0n8p6K1Jj38M4O1j3J30j08O6Jo0L7
3644B6j18k5J24%L2l3m1J41j77J70j42J65j13J8L9m9Kj3j44M9n9O7J24k8r9J04
3670B0n6J32m2j06L0M1Ml3k6J49p7j04J14p7m8O0J87j30J6j32O7l5n0K40o8j74
$$ plain form
3468 40 4 38 16 82 -48 87 -56 56 135 23 -57 -48 20 13 65 11 -5 3 -14 -25 -7 -10 42 45 76 -47 39 -4 103
3497 103 115 -26 35 38 2 -6 -28 -22 -2 77 -23 -31 -68 38 4 -60 -25 32 38 38 -7 56 38 -5 88 -37 108 -70 20 37
3527 37 28 47 90 81 -37 -31 -2 3 -7 71 36 -39 -22 -16 81 10 -13 72 6 -156 54 39 63 20 52 6 -64 -24 -2 56 -108
3558 -108 162 -18 -12 10 -32 6 50 76 35 -4 19 -13 75 11 -18 -75 -53 -10 10 -59 -81 -89 -1 -80 55 -9 37 85 -48
3587 -48 37 42 -74 -38 42 -47 2 -7 129 3 23 -14 -56 47 75 2 109 67 -57 24 14 72 68 126 -18 51 -26 -10
3615 -10 -25 -35 -7 -120 30 25 -69 -96 -55 17 -27 -3 46 58 118 60 -16 5 6 -132 -88 -27 -40 90 -18 48 49 -11 26
3644 26 -92 -117 7 7 39 6 -35 106 -71 99 -43 122 9 27 66 17 19 6 -138 -89 -148 -81 43 15 -84 20
3670 20 -36 96 54 -52 -22 19 23 -10 -36 113 36 -68 46 -31 -79 -19 168 38 54 -78 -11 -46 -96 144 76 -98
3696i8J39O1o8n5J15j04q3Q3L1j12J65j19J01%o6krK7M1j03Q9m8Ok4L2J45j97
3723e3k8J95n9L6j68R3P5p3J8m9j3k7J29N6k47M1J24r5P4l9m0J10J7j13p9R9j15
3750a31R0L2J7Nj3o5kM0J15j68j6N0PmM6nJ1M6p1RM6n2k4O7m7M5k9o7J03M4j77
3781i8J24N4Q4j44O7m6j7o4K7rQ7q1O4J7n5Nr7J00o8j8o2J39KK8J0M6l0q7Q3J3
3811G4m4p3Q7K1l3K9m7k9k1nJ09o9M7j74J24R9p3K8n1k2L7n9J7J3l4K9J9Q5j27
3840d3ml7P4J17j25ll3J18p1j2P0j07J5J09o6m6J3J1N0J9j16Q3r0Q1J34j22l6
3867a7k4Q9m0J13j34Oj4L2N2j17j7P2L6j17O2k4P0j01L6lp9R3l8J74j50Q3j39
3894i6J58r7J3l9K2J67o0m1p1L1M5qP3k4o2p4J19j5n8m2L9RJ1n7N1P5j42J19m5
$$ plain form
3696 -98 41 102 34 -21 94 -10 -93 -10 21 -91 74 -45 56 56 -10 -12 -21 6 47 -56 33 -15 -9 -33 -1 144 -53
3723 -53 -81 114 55 91 -77 16 91 18 36 -13 -26 -53 76 132 -115 -74 50 -45 29 -10 -50 60 77 -36 -115 -16 -131
3750 -131 -41 -9 8 13 0 -65 -67 -27 88 -80 -96 -46 -39 -43 3 -2 9 55 -16 -7 39 -13 -37 30 -17 28 -1 -68 35 79 -98
3781 -98 26 80 164 20 87 41 24 -40 -13 -22 65 -16 48 65 10 15 -82 18 -50 -68 -130 9 11 39 49 95 65 -22 61 74
3811 74 30 -43 44 65 32 61 14 -15 -36 -41 68 -1 46 -128 -4 95 22 50 -1 -23 14 -45 -28 -15 -49 -20 -1 84 -43
3840 -43 -47 -84 -10 107 -18 -21 -54 64 -7 -19 51 -56 -41 68 2 -44 -31 -20 30 49 -67 16 -74 7 141 19 -17
3867 -17 -41 48 8 121 -13 -7 -21 11 63 -54 -71 1 37 -80 -18 -42 28 -73 -37 -40 -119 -26 -64 110 -40 43 -96
3894 -96 62 -35 -22 -61 -39 128 68 27 -44 -13 32 24 97 73 11 -63 56 41 -17 -59 -20 -11 0 -57 -6 69 -73 46 1
3923AP2k3j33pR3J0M6j7p2L5j3L5m1J0Q0p7K5N1q0N1p1L9qK3M9Jj2k4K2o9k2K1
3955ek2K6j7P6n9L6pm1n0P1n1M2R9j18j17J44J3MLk5q0R8R1j53J13m8%q1J00k5
3985A7j07J94o9j02J53q6L8j02Q4N1j34O5R0j62J08Q0j36P1o3L1K4l1O2j20J8
4010b6%NQ3p1j6R6j07O1p4k4J29r3N0pM6k8J25j09k6L6k06K16j07J44j21J33j09
4037@J46j93j7J5Q5O8q5k1m9R0j21O3J2P7j27J46j98O9R3L0r0k6JO6Q8j85J58
4064I5j19R2j54K18q3o4J7on9J06Qo8L5n9P0L8r6k4J29p1o4L6L9o7J7o1J19rJ
4093A6j06J47LK0o9j0QK1J2K3m5K2K7Mp8m0K15j40o8J07k7j01J2qQ2KL8mN%j7
4124E1k9o8l9P6M1On1J3n0J8R2r5K48k40M6Mp7Q3mp1l0Q6K2n4J01jl2m6o5J2J69
$$ plain form
3923 1 73 50 -83 -90 3 13 59 42 -30 5 -8 27 -14 -4 76 -1 24 75 -5 46 -25 14 6 29 78 79 67 43 65 -4 -26 -5
3955 -5 -27 -1 -18 58 -1 35 28 -13 -63 8 -43 -1 98 -20 -137 7 20 24 27 2 -78 20 111 -42 71 23 23 -58 42 17
3985 17 -90 104 35 -67 86 0 38 -64 20 71 -63 2 92 -70 38 118 -18 53 -10 21 45 14 76 -44 -26
4010 -26 -26 -21 62 -9 -25 71 -36 25 -49 -73 56 -37 13 6 52 24 149 40 14 50 -156 60 -47 97 -24 109 0
4037 0 146 -47 -64 -49 36 104 19 -2 -51 39 -82 -19 -7 70 -57 89 -109 -40 53 83 -7 -33 -32 34 122 -63 95
4064 95 -24 68 -86 132 49 -15 2 -4 -63 43 51 -17 18 -41 29 67 -29 -53 76 5 -59 -23 16 -51 -34 -95 24 15 16
4093 16 -90 57 60 80 11 1 9 30 42 65 20 42 69 73 -5 -45 170 30 -38 69 42 -59 -47 -55 27 29 67 63 68 68 51
4124 51 22 -46 -85 -9 32 38 -13 0 -50 -32 60 -35 213 -27 19 23 -54 29 25 -46 -76 10 32 -22 79 78 46 0 -65 -53 116
4155A16n4k4j10J40p5k1qN2O7l5k2j50J02j09P9P4%p8Q5n6L7L3l9n7J27j11o4
4182a01J15M9m4j5n6K00k58J88L3j33J57k26R9R4j32l5K3P6L1n6q0j2J03P1m8
4207D3L9j65J08R9j52Q9L1j01J04k5j36R0m6P0J3n4j0j28K9L7k8K0R8K1j37M9
4233d2l4Q5o5O6J3o8N9p0J1L9n2JJ2O8m7k9l0J31j06O4j0rr4J88j30nM2q4J39
4262D3j44P7mP5j01l4M4Q6j00j4k0J60j13Q0L9o9M9j67J71m9j08L6J69o9L3k5
4288D5q0j08J27j3k5K7Q9r7j2mJ50nj50J69j82R3m0J0Lp3JJ2L6J5j01O9KQ9J0
4317E7l8P0M4j69j0l9J64q1M4j24K66o7r5m5N2j05J11n4O3J10j54p4P7k8N7k06
4343a74J53l11L68M6K77j31m66J63j40K62o7J09j37P4n7J05p8j0k5J7J6k9rN5
$$ plain form
4155 116 62 38 -72 68 -7 -28 -36 16 83 48 26 -124 -22 -131 -52 22 22 -56 29 -27 10 43 4 -53 74 -37 -101
4182 -101 14 63 19 4 -52 148 -110 78 111 -22 135 -91 8 102 -30 -65 -42 34 65 9 -71 -83 20 91 43
4207 43 82 -83 25 124 -28 61 92 -9 95 70 -66 24 -22 48 61 7 -3 -131 -102 -65 -93 -73 25 46 -91 -42
4233 -42 -76 9 -56 10 23 -45 14 -56 -45 -6 -58 -57 -45 23 -24 -53 -83 48 -58 6 -4 -13 -107 81 -49 -54 -12 -96 43
4262 43 -101 -24 -28 47 -54 -88 -44 42 -58 -72 -92 68 -45 35 74 5 54 -113 58 9 -99 -63 106 37 70 45
4288 45 -35 -143 -16 -29 -54 -27 62 -35 -47 -51 99 94 -56 113 -69 24 -16 -6 -3 -76 -75 -63 -27 -12 -113 -44 -42 47 57
4317 57 19 89 133 -36 -46 -85 79 -2 42 -82 184 117 22 -23 29 -76 35 -19 44 154 0 -74 3 -25 32 -174
4343 -174 -21 -332 36 82 359 228 -238 -75 -215 47 -20 89 -48 26 -31 74 -4 -14 -39 -22 -6 -35 -44 11
4367A1J0Q6j13m1K7L5%j05K6N2P5j24jJJ00r1Q0K6j4j3l1O1k0n0J8n4JR6l7p6
4397f5K8O8J0oj36R3M8k0n9N5l2L7n4J6K2O4m8q1Q9P2j39O3O4p7l3M3q8J47r3
4426a2J3K9j3r2J5L8n9M4O9M7l4j05N7M2K3O3j6o7m2P1j12J13O2j85N6k0N3Q1
4454A19o5O8r2o8K4N3k6%L6n3l8J1J00q7rL0L9n0j7K0R8j10ro4O1M3q4k6J44l8
4484A0l0P6ppp2J9Q0q1Q0n3j45M4J10l9Q5r3M0L7r4J7k1J29j5j11J50j47k2m8
4512a08J77q2Q6j28J28j41R3o4q2J67k2k8M0m4M2r0j15K17n7l7R2j16J33pj3K3
4538F4j3K1j18P1k2P0k0j74J88k2j50J54K1j49K43j18j7o3N1j14L3J1l5L2OM5
4564el5M3k1kL8k3l2O3K9l0rm3L8j28J27N7K4K3k39N2N6j7N7j2q3J11k8K6l8o9
$$ plain form
4367 11 21 107 -6 -47 -20 15 15 -90 -64 -12 63 -61 -62 -61 39 -52 28 54 40 27 -4 57 37 -13 5 -49 -48 48 11 -65
4397 -65 -37 31 41 35 -101 -8 40 20 -39 16 -16 21 -33 -17 5 69 21 -60 29 101 -38 25 89 12 -21 22 -66 81 -12
4426 -12 1 30 17 -75 -60 -22 -81 -37 32 79 45 -60 -3 39 62 125 109 42 0 71 -41 72 134 -51 5 -15 38 119
4454 119 54 122 30 -38 -14 39 13 13 49 -4 -42 -31 69 -18 -27 3 42 -8 -25 -5 93 -17 -26 -90 -29 14 -70 -96 48 10
4484 10 -20 56 49 42 -30 -11 69 -12 68 15 -130 -86 24 -15 70 -23 17 54 -40 -23 -44 85 70 -41 109 -38 -60 -108
4512 -108 69 -13 73 -55 73 -68 25 -39 -121 46 24 -4 36 -8 34 -56 -171 46 -11 -48 44 -72 61 54 41 64
4538 64 51 72 -46 25 3 73 53 -121 67 45 -105 49 70 -79 164 46 29 -34 17 -97 -64 -53 -88 -56 -50 -5
4564 -5 -40 3 -18 -20 18 -5 -37 26 55 25 16 -27 11 -117 10 67 91 114 -125 -73 -17 -34 23 11 -72 39 11 37 -1 -70
4594g0J04O3j11N7o0j60J71P1j73J7J27o6k8KJ57m7lj10J03Ql3o0J74o4j18M7
4620bP9j09J32j04K7m5J7nk4R1j48Q6J21j83QM8P2j23J67k05J41j12J06j10Q4
4645IL5r8J68j67J20k5l8Q2j74J20M6l5j08M5P1j11J08N6n0j30J53j30J23p0r
4670ij20J13m9O4pp3N5J0nN1N2r7P6Mj7r3PO0n3J11k3o4O5m9J8m4M0o0N8J33j21
4701C3K0p9P7l9P6l0Q1p0j7J7j25M0j7J3ll3l4J23Q4l42N52l32Q5j01l6J22r0
4728b5M3K9L6n4k6k1o0l8J14K3k1M2j8j08J41p9LM2r0J75r9r0J52K0o5mn2L8r5
4757h7N8oJ5M4r5N2n2K2m2J17p2P1J2p9O4q4p4M6j0J94r7N2r8M7N0p0Qj5o7J64
4787F8n3M2m7j03K22j22MK9l0J5MLl1L4j66m8L02j76O5l5l5R3j10M8j9J68j56
$$ plain form
4594 -70 34 97 -14 43 -17 -177 -6 65 -108 -91 36 -30 -58 -56 101 54 51 -59 44 52 19 -41 133 69 -49 -2
4620 -2 77 -32 100 -4 23 -22 -5 -10 -34 57 -91 -5 116 -67 -59 -11 61 -62 105 -100 41 -71 35 -75 9
4645 9 44 -54 114 -53 67 42 4 86 -88 32 78 43 -65 -20 51 -60 48 104 54 -76 77 -53 70 0 -9
4670 -9 -129 -16 -65 -1 -8 -81 -26 -16 -21 30 82 -15 61 65 48 -45 -38 22 -31 80 57 -7 58 9 27 -17 23 -37 21 154 33
4701 33 53 -26 51 12 88 58 139 69 52 69 -56 -16 -33 -20 -23 -56 -90 33 117 -225 327 -5 80 -21 -57 65 -25
4728 -25 18 47 83 29 3 -18 -78 -116 -2 21 0 42 24 -84 57 -22 -19 23 -67 108 9 -81 71 91 26 22 -30 8 -87
4757 -87 -29 -35 -20 24 -71 -19 -71 -49 -91 26 -46 25 37 -42 22 -62 -136 -90 -100 94 -3 49 -49 -2 48 -22 -14 -29 -96 68
4787 68 15 57 10 -93 129 7 11 40 10 25 29 32 1 35 -131 -179 123 -53 12 -23 -58 35 -75 -27 -46 122 -34
4814c4Q2lm0mn9J37J3j73J32j17R6o4m2J25lj7q0P0J0o8LM5q8N5J8K8k3M2J0l5
4844A6Q1o1m2K9p4l6M9O0p0L8M5j1L8j11J10j79J23o4O8j11J42Qll0r2P9Q8o3
4872B7M1m8j13Q7q1Q1j3R4j58n6J78m3J6O0j49j1K2J4M8p9J45n2m3jO7l2o9J02
4900C4o6l0J7K09q5j5m4k3m1M1K1J3p6J04P1j47N0q3J23N3j49M1J5pK6j5j6K8
4928D9m3l1k6N7j2k4L4k3M2o9J37j05Q4q0K8j72J12J12j13K7o9K19j34m8Q8r3
4954e3j0k3L7J36oo1p9qO3Rp6N9j3O5k8r5Q2l6M0l8P1k5J31k19Q0l1n0Mk1K2o9
4985a42J47m3N5j3qj1L0K3n9PJ24o6L5l4k8j16J31p2K8l8J11j16j3M2K2J9n3J1
5013b7l2K7p3Q3qJ6M0l4L%Q6k3j23K11o1j46J01q8J25j24P2jJ4j5Jj7PMJ2P3o9
$$ plain form
4814 -34 48 45 5 1 -58 79 92 -81 51 -66 30 -34 -76 49 46 29 -51 19 29 -39 -36 9 -79 -24 -6 22 -1 41 51 16
4844 16 97 36 -6 23 -51 -87 -38 22 -48 -10 35 24 62 -49 61 -118 5 -59 9 -102 40 48 45 15 -77 2 90 27
4872 27 68 20 -93 -6 -87 -6 -19 75 -83 -139 39 -4 12 72 -77 -88 -66 -52 -4 -83 62 10 -33 -34 33 1 -68 34
4900 34 -32 -62 -45 164 79 64 20 -3 -44 -3 18 31 -45 59 130 -17 33 -50 73 126 -23 18 33 26 52 37 21 49
4928 49 6 -25 -51 6 -6 -30 4 -19 23 -46 91 -14 70 -10 18 -154 -42 70 -43 -16 -85 134 0 -48 40 -53
4954 -53 -63 -86 -49 87 81 20 -59 -67 -4 5 -71 -12 -25 40 12 -83 -1 -37 3 -35 36 11 142 -77 3 -28 -78 -74 -95 -73 -142
4985 -142 5 -38 17 4 -4 -15 15 38 -21 -14 110 44 79 45 17 -99 32 -40 -12 -50 61 -55 -68 -26 -4 15 -38 -27
5013 -27 -59 -32 -105 -22 -30 -14 26 -8 -5 -5 81 58 -65 146 85 -61 40 -48 77 -47 25 24 38 23 24 7 14 18 30 103 34
5044C4M8m7q5J58j49m9R6KQj36J29L7n7J2pO2j5J7mk7j9q8QO5J2j5l6k3J07m4
5074fQ9j20O2J0j6N2pk0J4l6m9P8r6j9J18j8j29J04j12N2M9k9O7K3k0K3j00L5
5102aK2K6m0P8l2n0Or8K2R3K3j34J32R3j35l3P5o8K3K7o1M4Q3l6q3J6J20j32N2
5131C2K8L1j34k3J20p4l4POL8nR5j61J18J0nl0j06J07l8J3p3Q6q9J27j8l4n6J25
5160F3j07O7n5n7P5lK6l1j8K8J6P5j53J7Q3M1j13J94j89j11J19O9j43J61l8lk0
5187gm3J81j63M3m9P0p8k0N1M4l4j4J14j38J03j43R5P1o5J5o0M8n3O1j2K0Q0j31
5215a4pO2n8J5l6k3P4r3J15j84J45m5J02n6j04R3k3K6N7n4pJ13j16j0K1q5J05
5242A3MJ6L7J0q9m5O3%j5N6K7j79J29p4J07L3m7L9j13MN0n4R3p3j12N3K7j6Q4
$$ plain form
5044 34 82 35 -50 108 -41 -90 6 8 16 -120 9 46 -11 1 -6 56 41 58 54 27 8 -80 -72 -7 5 -10 -46 -69 38 -6
5074 -6 83 -37 25 35 19 71 64 44 58 22 -27 51 -45 -64 54 36 -93 11 -101 -49 0 -29 38 61 41 64 -36 -1
5102 -1 21 47 7 85 53 3 9 -89 -67 26 49 -85 47 140 5 -28 47 -21 2 29 -32 12 95 59 -24 -8 112 -20 32
5131 32 60 91 -43 -66 54 -20 -54 -47 -41 -3 -8 87 -74 44 54 49 19 -87 20 -18 -5 -78 8 -81 46 28 -6 -62 63
5160 63 -44 23 -32 -89 -14 -17 9 -22 -40 -12 4 79 -74 -57 26 67 -46 148 -41 -152 -33 36 -107 54 16 13 -7
5187 -7 -50 131 -32 11 -38 32 -46 -66 -15 29 -5 -19 95 -43 60 -83 12 83 18 33 -27 21 -32 29 17 37 117 -14
5215 -14 -21 41 -17 -2 -38 -61 13 -80 35 -149 -4 -49 53 -3 -107 -14 -37 -11 46 -8 -15 98 -18 -28 -7 -92 13
5242 13 17 33 70 80 -9 -54 9 9 -6 50 77 -102 27 -47 60 93 46 85 -28 -24 26 -28 65 -8 -120 -67 -40 -56 28
5271B8j9K6j7J62j51n2q6N2J08k4J00k12R4jJ3q9lJ93j05r3R2q8Q4J8n9r4K32
5298A09mj15J6K9p4N9q4j3Q8o9J30Rp7J14j06q6O6k5K9q8K3K9N0Kl1K3J54j49
5326Iq8R3P5j25J44j26N9j10J27m7O1j79N9J9J09j01P1J3k0n2n3N1N7m1K8n6k0
5353d3J5j6M6o1k1l1M2M0QO0K5m4k9o2K7L7L5q0j4J20p6J33M3j37j55K03j29P9
5381A5J94j41j33m3M9L24n67L47P8p1j36o9M00J1m56R3L16n81N44m05M06L2K87
5404D94l08M86q32K18j00J11m41M36J76j26Q8q7m79K69j08L72K6q8k01p75P15
5425a54K88K40l88m12L55k91J045q94K95l44J2M27m39N33o77O0J286j26r10l08
5445d02P33m55kk62M37J26k61R2L97m9m66P5M8n8k1J40j11P8n2P0j8n0P6j07M3
$$ plain form
5271 28 9 35 18 180 29 -23 -109 -57 51 27 127 -85 9 8 21 -68 -71 122 17 -76 16 -72 12 30 -29 -123 109
5298 109 105 -10 6 35 -39 20 -64 -77 11 -58 72 81 4 118 12 -74 -8 -33 -4 -92 -69 -40 10 12 -19 4 158 9
5326 9 -79 14 89 -36 108 -18 41 -69 58 11 72 -107 -48 -29 80 -21 50 63 43 -9 -62 -11 46 5 33 -23 -43
5353 -43 -28 -44 2 -59 -80 -111 -69 -29 -21 39 64 20 -9 -71 -44 -7 28 -52 -66 54 -22 111 154 17 -138 65 -64 15
5381 15 209 68 -65 -108 -59 265 -302 45 123 52 -84 -153 247 258 -198 -105 211 -370 174 -231 175 207 494
5404 494 186 672 -160 58 -42 69 -372 64 240 114 202 115 -364 -95 -203 169 195 107 -94 -869 -154
5425 -154 134 374 -14 -426 -71 -362 683 -211 84 -260 -248 179 -260 273 -404 -344 942 816 -94 -402
5445 -402 331 -124 -126 -388 49 175 -86 6 403 354 -112 -37 11 -47 -68 72 -39 39 -13 57 39 -11 65 -42 1
5470AK5k1l7m6J08j22L0J1Q2j02L6K7o7J5J3j67K33M5j07P1o2n4O4Q0M2l8N2q4
5498B8j8j9qM9m3m1j1Q9J1QQ4m8J0j73J4M2l1Q4P8p1m7L9o5j7O6j2K9o3O5j6k4
5529a1m6O8Ln8lJ17o8P3j36R6O4n4j45P4O8k5Qn8J38k11J48j6K3P0j16N7p5k6
5557d1J00n9o4J66k28L5J54p7l5JK0q4M4k3P3L5L8k2lK6p9R3kM0r4J52k01j2J04
5586E7Q2j31j33L12j42j43Q5P6n7M1m6R9k36J51J2k6O7j00r9R5j2P1m6l0L0r7
5612a20J50j4n7o8P9nr2J0R7J8j1M8M7j50J82j76J55m6j16J41j13O5QM8q2NJ55
5639A58k39N5O7O5j71O4k4NJ05j31K2N7l5no8L8J8N7l6l5l0J11j14J6P3n6Q8r
5667D6k9J11j63j05Q1J40l5J4o1r2P7L8l7J7M2o5jo7m8N1J6J31j16L5mM3o9O3
$$ plain form
5470 1 26 5 -32 -78 30 -92 -62 -51 31 -71 -35 -8 -75 -60 -47 -214 19 64 -43 28 -34 -88 -24 56 98 60 112 28
5498 28 10 -9 -17 32 -11 -52 -63 26 37 45 129 81 91 -82 -68 -26 -57 27 105 34 -13 26 -39 -56 10 -2 27 -36 29 13 -11
5529 -11 -57 11 14 -44 -47 70 2 75 -61 35 99 45 -100 -26 42 17 25 -33 105 -106 42 26 49 119 3 60 -15 -41
5557 -41 59 0 -64 102 -126 -91 63 -14 -49 -48 -28 -112 -68 -91 -18 17 55 33 30 56 -23 70 68 108 14 166 -35 -47 57
5586 57 139 8 -125 187 45 -98 -13 63 6 47 1 100 -136 15 27 1 68 -32 -131 -36 -48 23 -23 -53 -23 -120
5612 -120 30 16 -41 -109 -30 -35 -127 -117 -20 -2 -13 35 82 -68 114 -62 93 47 -69 72 -41 24 32 80 -2 3 158
5639 158 -81 -26 41 106 -65 -1 -25 -20 85 -46 -24 33 -2 -7 -75 -37 -19 38 2 -33 -63 48 -66 -50 23 -33 55 46
5667 46 17 128 -35 -140 -59 81 46 60 -1 -93 -16 22 -15 2 44 -21 -22 -89 -137 -86 -70 61 -55 -20 -24 19 -50 13
5695A3L8p3k2K8j5P4l2r3Q7o2J25j08J21j51O1pl4R8Q5j65N3j5k3J8%q9N7m6J5
5724f2J02K2j65J20J9o3M2K7L4l9q5J3O6j07j1O3R3p2n1Q0n8L6j10J21P3o2q3
5751e7P5m1o1PJ88j31M0R1q2j7p7j5J80j17n9M7p1O2L1j6RrM8J1k1qj5L5m1l1
5781d5J43o1O3j28O5oL3o5p6J67m5o4j6lR8l5q8j0K3R8L0r1N9M0j23l0M0O1j05
5810g1P6j7QJ1K8Ql0m7j3O0q1N1l4O0l2O0k3qNmlq0O7k2R2M1n8k5l8J19j40J59
5842A19q2j9j37J8J48m8j7l0J17r5m6k8O2L5K11j50p9K5j1nP6j31K33k68R9P3
5868G0r8jQ9n4L7n4K7J3Pl8L5o1p7PP7OKO7j08N7K9j7m4J3M2n2o5O0l6P7mO9l7
5901C8K9j05O4n3o8R9J00j08m1N9J30j63q5P7l0k8J08l1l4J50j8j7j30J83j54
$$ plain form
5695 13 51 -22 -44 -16 -31 43 11 -82 5 -57 68 -40 81 -70 -9 -16 -50 48 133 -32 21 6 -17 1 1 -88 -31 -77 -62
5724 -62 40 62 -103 17 36 -27 15 42 76 37 -48 -35 31 -76 -87 -24 69 -3 -54 26 -32 4 -106 15 88 26 -57
5751 -57 18 -23 -84 -77 111 -20 20 111 29 12 -65 -80 100 -17 -76 -29 -100 -38 -7 -23 -14 -23 25 36 15 7 -8 27 -14 -45
5781 -45 98 37 100 -28 37 31 64 -1 -77 90 45 -19 -35 -38 60 25 -63 -73 -50 48 78 -13 46 86 -37 -67 -27 34 -71
5810 -71 5 -12 -4 7 35 43 13 -34 -47 13 -68 -17 -51 9 -23 37 14 6 11 7 4 -76 -9 -31 61 102 44 19 -19 100 -40 119
5842 119 37 18 -119 -101 47 -1 -18 -48 69 -26 -72 -100 -38 -3 208 58 -21 4 -7 -12 64 -67 166 -102 -3 70
5868 70 -28 -29 60 6 43 -11 16 29 36 -2 33 -28 -105 -98 -21 -15 -13 54 -54 3 32 15 -29 -16 26 -26 -91 -31 -67 10 6 75 38
5901 38 67 -38 26 -27 -95 4 104 -4 -45 14 144 -19 -104 -27 -57 -85 23 -8 -42 108 90 73 -57 126 -28
5926b8J47k5l7l5p5R0q1M2m0M4l4j9l7J15k8ol1P6n1l9PJ84r8p8Q5p3k8N0K4k1
5956@Mk3k0J17m2r7J89j47o5O3M4r8J19MK6k5Pj43L4Q9j16J75p6j26Q1j0J18j0
5984G2o6p6J05k4K1j35O3O2j94J2J99o2p0J48j61Q6M9l2K2j24J57n4P5o2M5l0
6010B6n5R4K9j0j40R3N5q5m3O6j9p1j9O8M9n9m7O3j15R2pM2M1j0P1r4J9l4N3p
6040D6l5J1M5j46K6K8J17q7m5p7K73j71P6j07j76J35M76k41Mj57k6j63K0J63M40
6065D29o54k92R37j03l99M02o72R11n97k59P28n34l37J350j41n75o79K96j81P0
6085c00M48j73o91Q50L48q15O14O7l34j09j79L57K16p6n11l86N96j47L15o77K69
6106c18K29j25j46Q5J02K44J45j2o03J77M12j31k06K72l25J01N54n92L59l55K63
$$ plain form
5926 -28 119 94 57 22 -53 37 -44 -2 -42 2 -32 -51 -88 27 -1 -7 -38 38 -13 -52 -45 139 41 -37 48 -25 -53 -3 21 0
5956 0 4 -19 -39 78 36 -61 128 -19 -84 -21 23 -75 44 48 74 49 56 -87 -53 36 -80 95 19 -107 -26 -36 82 72
5984 72 6 -70 35 11 32 -103 -40 22 -172 -160 39 -23 -93 55 -106 -20 29 -3 19 -105 52 -2 73 11 56 26
6010 26 -29 65 94 84 -56 37 92 7 -36 30 11 -60 -79 -11 38 -21 -68 -5 -120 -28 -35 7 48 38 109 15 34 0 53 46
6040 46 11 22 67 -79 -53 -25 92 5 -40 -117 156 -15 61 -46 -222 -87 389 148 152 -5 -31 -194 -174 -11 429
6065 429 -225 -517 420 317 -82 320 -352 559 -38 -297 431 -103 -440 910 769 194 -485 -189 -370 -300
6085 -300 148 -25 -716 134 482 -333 281 348 14 -95 -274 83 299 223 -288 -674 -78 -225 90 -587 -318
6106 -318 -89 -214 -360 -275 -173 71 216 204 -399 -222 190 59 -147 125 -200 -99 455 -137 222 -133 130
6127A30j61J50l97L53k37L80m96J61Q9pJ16q7pl0J06r6J19j47J7m8K06q7N1p9
6151aN8j67J51O1j67J24m1o5K9M7j71J04r6J20PR6p7J8j28J64k5r9Q7M6j20q1
6177a26K43j16k9O7p1l6R5p1M5m0j12J97j19J95r3j63P0L6J18q7O9Pj48J13k9
6202A5N5k9k3l8p3R0qo7m6L5P5KNJP5n8k0J7o4P1j00l9Q7O7ll1N6lj01Q8l1l8
6234c3N%J99j44Pm0n5Q5j01J81n6Nl1j4k7N1j4Jlo8J70n5m3k1PkL2J5l8l2Lj2
6266b8M9j2O6q8l8O9k3j08J6M6J0P4p1L3J37j34j2n8M6p7J07K4l2N1j2k7K02j63
6294D7j70J28n1R2j51J62o7j1R6q6o9J21N3j22J16j27J80r6L2l2J0P3r3n8J2l7
6320d8L1%Jj3P1n1k7J55j00j2l4p9N0J9j5R0q4J08M4k01K19j95J16r1M9n5qN8
$$ plain form
6127 130 -31 119 -278 75 -162 218 -278 -117 -28 -35 81 -6 -13 -43 63 -33 86 -61 -44 -92 114 27 78 -1
6151 -1 57 -110 41 102 -65 59 18 -47 -18 29 -142 -38 -134 -14 -7 89 12 30 -98 66 41 -58 29 75 -45 -126
6177 -126 117 1 -28 39 -32 -68 27 -44 1 -39 -151 46 -73 122 29 -134 -64 -28 90 3 72 79 -69 44 15
6202 15 70 41 18 -20 -93 -3 -11 -78 -124 -89 -14 -12 -7 -6 69 11 -9 8 -56 15 -85 -124 -37 30 27 -4 52 49 -52 36 5 -33
6234 -33 -28 -28 171 27 34 -6 -61 24 -77 104 48 53 22 8 -19 32 18 19 16 -52 118 63 20 -1 6 4 36 51 13 -19 -16 -28
6266 -28 21 9 75 -13 -51 18 -5 -113 -97 -51 -41 33 -38 -5 132 -2 -14 -72 -26 -103 4 28 -4 47 35 8 210 47
6294 47 -123 5 -46 46 -105 57 -10 -21 75 -11 -80 41 94 -28 88 -39 141 45 77 45 55 128 35 -23 -11 -48
6320 -48 -17 -17 -16 -29 42 -9 -36 119 19 7 -27 -106 -56 -37 -52 38 -46 62 106 -95 124 -71 45 -46 3 -52 -60 -2
6348bo2P1q8M6n8k1J52m9J8J0l7N1j06J54j39J8j4J5K7J05p8l6M7J2K1k4Nj10
6376g2k1J06m4N2M3j0j03J01k3O2j18p7J41O2j76J1Q4L2r6J2m6R1M6o3O6j09Q
6403d1J74k03M4J07J9o9K1j03N0j12KJ44n7K1L5j00R9p7J00p1R2n8k4k3K9M8j10
6430f3Q5j6pjj16J12J0M9k8l6J23m6j09M3lK4Q4q1r5P8N2j09nP4l8m3Q7m1k1L6
6460aJ23q1qLj12R6o4n3J32r0P9q5N1K2l8J27j64LO3L5J5j76J34Mn9QJ26j25M1
6489FK3oo5M2%N2K7j52J11m2O9l7m4n6N0QJ1k7L0l5m7K0J03J4j11O9Lr5Q4O8j00
6520b7J10k18J09J00j22n8P4k5O3l8mR5j22P0l1J38p0Nq5R3L0j1o0oQq7J19m2
6548HJ5q0K9Q4M6j31M0j7KK4Pk3r1J68j83J53K1m9o4J2M6n0j7m8J22M0j50J5R3
$$ plain form
6348 -2 -64 7 -81 -35 -93 -114 38 -11 7 17 -20 31 -75 79 -60 -42 -56 -41 -14 91 13 -23 24 36 57 33 38 -72
6376 -72 -93 13 -31 21 64 54 -49 52 29 91 -27 -104 37 99 -77 -66 18 50 -46 -34 -80 11 57 -6 60 -49 -41
6403 -41 133 -70 -26 81 100 31 52 -51 -1 -113 -111 33 -24 -3 32 -68 31 -46 54 -17 75 17 -7 -30 -1 47 -63
6430 -63 22 6 -1 -2 -118 -6 4 53 25 -11 112 66 -43 0 -3 21 105 24 -71 7 59 -50 -55 19 -19 -62 25 -16 -37 -1
6460 -1 122 41 33 36 -76 20 -44 -97 35 -55 24 -61 -10 12 -26 101 -63 -60 3 38 53 -123 11 15 -44 -36 90 -35 6
6489 6 29 23 -42 0 0 52 79 -73 38 -4 65 28 -16 -72 -22 -14 -3 -30 0 -35 -82 -62 41 55 -56 13 16 -79 5 73 -27
6520 -27 83 -135 -26 74 -48 -106 -32 -57 6 -32 -36 59 -63 7 -24 114 44 49 -36 57 87 76 16 10 18 -69 50 8
6548 8 23 -57 -28 56 102 -29 11 -6 -4 20 27 4 -87 81 -102 51 72 23 -41 -29 17 -33 -50 -98 24 64 -86 -71 22
6577B2K4ll9N3pK9j34R5j47K9Q0mn2P4j35J59j20J62l3l7l2J6l1j18J99J7lO9
6605A33j44J3Q3r3J9q4M4k2J8M7o6R2j22J05K3q4q4J64m7Jl0o8O4J23j31J9J06
6632G9j66Q9PL0j37N8K2k0P2jJ1P4o4n5L2j59J16MR5j65Q0j3J78k20J00l7Nk2
6660gp0O0k8n4O4Kq6P8K5K4K4l1Q7q8j12K04r4l0J49o1m2n4J05j45Q5J21j51L5
6688A0J7l7j1M0J0r1j1J50q1o1Qo2l2J86m9kM4j77J59M9m6K8%l1k7rR7j34K1R6
6718E4k0j3KJ11j37O7L0r1O3p9Mj2O5j3O1j06L5o6L8m7QM0o9M3M0J6m4P2j30P9
6748Aq2J28j07M9l9N5M6o5Nj05R4n4J59j24p0K29j26L9r3J20j04R3J4q2Ok4N7
6775B0p3M7J04J1p2j3m8k4M8j19J09k4l4J07q4J1O3j09J2J17j00J29j04P0O1j79
$$ plain form
6577 22 46 43 4 57 50 79 -55 40 -107 -78 2 -2 -54 20 -115 44 -76 86 53 16 -16 0 -31 -149 50 67 64 133
6605 133 -11 2 85 -8 11 -73 -29 -51 -33 14 -52 40 -82 23 46 -38 -122 42 -5 -4 -34 -102 -38 85 -46 -27 79
6632 79 -87 2 9 39 -98 -40 -18 -38 34 33 44 118 54 -1 31 -128 -12 -8 87 -78 2 -11 167 -53 47 10 15 -7
6660 -7 -77 -17 -45 -99 -35 -33 -119 -41 -16 8 32 1 88 0 -112 92 -2 -32 117 56 14 -40 65 -80 5 126 -25 10
6688 10 27 -10 -21 19 29 -62 -73 77 -4 -65 -57 -119 -151 35 -14 -16 28 -149 10 59 13 41 41 10 -17 -26 71 -63 -42 54
6718 54 34 21 23 134 -3 64 94 3 66 -13 -9 -21 44 31 92 -14 21 -45 -7 -54 -46 -6 -75 -32 8 24 -20 52 -78 1
6748 1 -81 47 -60 -11 -50 5 51 -14 -9 -114 -20 -74 85 -39 -109 120 -6 33 -60 60 -44 49 63 -19 -13 -37 20
6775 20 -53 -6 98 109 37 24 -24 -48 0 -119 -10 -34 -68 39 -45 -34 29 -80 -68 49 -51 78 -26 44 105 -74
6801g4J6J91j09r4R2o9L5P5j3M3j49j17J99p1j32K51l1n2K6j18J16l0J4k9o7L7
6827f0J6J65j64l8j1M7M2n4M4P3j7m2O2j53J33l1k5p1J12l3oN5O0Mj24Kj3R1r5
6856c1l0J04j3q7J75j3q5K1m1K3o9R2k08J72q6J12K3o4O6k9j4L5j24l7J72j44
6882h0mJ71l7m5P9j40J97k84J01l8K12q2p0mN3r3L5k5M4M2M9q6l8M1j50J02O4
6909A4L5n6R1j60J49m7KP3j49J00L2j60J43j10j27K32K9k07N2j1O2o2P4jJ6L6
6935E0m1n3J34j6k9r6O3J6r4O3J09j23m5P9O7j53L2R2pRp5K8J7K1j02Q0q0j2J10
6964D4r0L7mj5N9K6j29Q4J2Kj20P2Pj5P8j79J47q2J39n0j14L8L4J10p2Nj9J36
6992A41j83O2o8l2L5j04R1p3K31p6K6j07J28j49J26j04Q4M2k4n2n7J55L0j33J1
$$ plain form
6801 -74 -58 133 24 -70 22 -47 -12 63 50 93 -56 -173 26 -45 -177 74 43 -9 17 -101 15 -15 -1 -30 -97 -60
6827 -60 -44 121 -43 -81 -92 -45 -3 -57 -13 60 43 1 63 -90 43 12 -13 -84 28 -5 -11 44 104 108 -16 -14 -27 64 -31
6856 -31 -61 43 30 -57 118 105 20 41 0 23 -46 46 -162 10 -76 36 59 -5 61 32 18 53 -71 -108 64 -80
6882 -80 -84 87 50 5 84 -56 141 -143 -42 -80 132 50 -20 -24 29 -64 -29 -54 -10 32 81 -5 -43 -2 -152 -50 14
6909 14 49 -7 84 -76 73 26 28 101 -48 52 84 -76 67 -43 -170 62 91 -116 -64 -75 -13 -75 -1 -2 14 50
6935 50 9 -44 90 74 45 -51 12 28 -66 -3 106 -17 -62 17 84 -69 -37 55 48 57 -18 10 27 48 -54 26 -54 -66 44
6964 44 -46 -9 -13 -28 31 57 -72 12 24 26 -94 -22 -15 -30 48 -131 16 -66 73 23 -91 -53 -19 91 19 24 5 141
6992 141 -42 20 -48 -80 -45 -149 -58 -131 100 24 50 -57 71 -78 48 -56 28 70 46 -6 -63 92 122 -11 0
7017@p3O1O9n6M3j9K5j12P3M3j69J8J16J1O9j72R5K5q1m9L5N5K5k4p2J7O3l3k5
7046d2M5P7o7n1L6j4R3r5p4R0rmJ6J02L3j09m6R2n1R2j03m3p6J19J07or3r3O7
7075gQ9m5l4N1p4J9O7q0Q2q3l8m8J06M9j20P5j5j31J76p3L5j8J76o9p6J6m9%J3
7104fR0j21NK6J59k47O7NJ03j00o7P6J4P2l8j02L8J4p2M6J3R5q7M6O3j41J46n6
7132D1o5J2PRp3P5n1J22j6j48R9L2L1j11J30j95Q4PK4JM6j28N6P1o1J38j51N9
7160D5j67N8k6R5j07J33J1mL2j32N8p0KL0J16l9j20J00j8K9%n0k4J14q4N1J1l3
7188A1J17J9p6o7M5M4p4o2K9LO8K5J06j77q0J23Qp9QOn7R3Q2m5j10J44r9M6n9
7217hM3k7l1j1J08l0J1k9m0J19j61R2j3l1O6K4Lr2j1l1J23r2R4j23q3J63J8L1
$$ plain form
7017 0 -73 -12 57 1 44 25 50 -62 11 54 -115 -97 19 30 99 -73 22 47 -34 -83 -48 7 32 8 -64 -47 16 -17 -42
7046 -42 3 80 13 -38 -2 -16 77 -18 -92 -2 -11 -15 1 103 136 27 -19 73 22 114 11 -32 -108 11 118 112 19 -74 -7
7075 -7 82 37 3 54 -20 -1 66 -14 68 -15 -53 -101 5 54 -66 9 -6 -137 39 -34 1 -17 159 90 14 30 -19 -19 -6
7104 -6 84 -37 -32 -6 153 -94 -27 -22 81 -19 -86 -10 4 76 38 -64 -26 -12 -84 -38 -25 70 -17 29 92 -49 97 41
7132 41 -24 -12 -5 4 -69 6 -45 77 61 -87 12 44 75 -36 94 -101 -17 -10 14 15 61 -67 -11 60 -1 137 -14 45
7160 45 -122 -64 -90 5 -102 31 42 38 70 -62 -4 -74 -72 -42 74 35 -85 15 -3 26 26 -24 -48 66 -18 33 44 11
7188 11 128 147 71 4 49 93 19 -43 -14 -11 57 82 188 11 -69 54 62 -17 -9 -3 -60 33 115 70 -40 104 5 51 -8
7217 -8 35 8 -23 -34 74 44 55 26 -14 105 -56 36 23 -8 58 82 85 -7 -18 -49 74 -18 76 -47 -130 33 51 82
7245H2j3j29M8rN9n2Q9j81K0O3k8N2j4o2L3J58q3Lo0LL2r8P2M5R6j21J7k7r8R5
7275hm0j0K35j65J6o6Q2q1N4J15j53k6J41j10Nj3Q5j83P9K1O9k5j05oM5m5J8J31
7303F0k00K14m4n4J5L0q1P2k0k0N4J07m9j05l7J19q1J7j1l5L2K0p3N2k8N5l8J08
7331G9o2K5j3k0L3j10L1R6j00j0L2L0N1j2q4J10o2K7j5p0N7Qo4L7M0j2Qm2OL0
7361B4m4P7L5l1j1J3k18J03j0P8n3J14m0P2j09k7j21J73k4l1o3J25q6O7k3K6K37
7388B53k80J18j55M5J10j42J4O3ll0JMN8K9j5m1J07p2k0Jm2o2o8K27mp5j2p6J38
7417G1j59J3Q9p5J30l2l5l8P4j00J7j7kJ77k04J30k9k1o1J08k3k6J4J34J46l55
7443g4m6J37o9p2K86j88k25j49L67k65M57n1k01M4J01K20l25nl7L2K36k64Q8j00
$$ plain form
7245 82 69 -60 -12 -21 38 -14 75 -106 -86 -23 -51 1 -13 -75 -42 116 33 36 -24 -21 11 -87 -15 30 126 5 22 -5 -103 -8
7275 -8 -48 -58 177 12 28 -38 44 -37 17 132 -21 -47 94 -16 -11 -24 61 -122 -43 -22 47 22 -83 -89 -44 -89 -71 60
7303 60 -140 74 30 -24 -9 21 -60 12 -8 -28 26 133 84 -21 -58 61 -20 -3 -14 -49 -17 3 -70 -18 -46 9 -29 79
7331 79 17 42 29 9 42 -68 -37 59 -41 -51 -19 11 62 50 -34 76 14 41 26 -44 13 21 -43 -6 34 22 30 -12 -6 24
7361 24 -20 57 92 61 50 63 -155 -52 -62 16 -37 77 37 109 0 -27 -148 25 1 -30 -93 32 -54 13 -10 16 253
7388 253 -27 91 -64 -19 91 -51 -37 26 23 -7 -6 -2 56 85 70 29 136 64 44 45 3 -59 -127 100 96 21 9 -67 71
7417 71 -88 -75 14 -61 69 37 2 -36 38 -62 -45 -62 -64 113 -91 39 10 -11 -72 36 13 -13 1 135 281 -74
7443 -74 -120 17 -52 -124 162 -26 -251 -400 -33 -298 159 108 -93 -49 52 272 -53 -58 -95 -63 173 -91 -3 -103
7467a03K64j83L5n5r6J48poL8nj24J61o5m2M6o7L0L3oj2J0PRK6l0j3N3Qj28K9
7497d5O5o1J12m4J12j06j4K1j03Q2m3q3N4K8K0M7j11Q9P0q0RJ0N2l4q3N4j9OK
7526GJ6LL4n4np5J27k9q7R1n3Q6o8jn1J31n2o2J33j07J57r7j61Q5J7m3m5J66r6
7555c3K2J03j19j9K1L9J2r1J23JL7o6p2K9nQ0N8j85PO3K4J9j00P1j81K11m6O7
7583G0m8k2J2K4j47J19rn5L3j06J83q2J9J27j07OL8l3M6o0m7J53j45K4L4Rr8O1
7611aJ7M%q4J32m1n3P8q7M2J1J3j16J03j23J34j3o9J1K0L3q0J83j27Pk1L7j23
7639a13N7QK20j22L3j23R6j12R7m2m5K1J06l8O1j49M9O1j16J57j5K1k2Qk06J12
7665Dj5K0m3m8J50j61Q8J9j56J61Kqj60K30q0J40j24j8N1K0q3k2M3M9n1o8J47
$$ plain form
7467 -103 161 -22 13 -42 -138 10 3 -3 35 30 -94 67 2 -40 6 -61 -31 2 -4 -16 -6 1 10 36 6 -7 46 54 -74 -45
7497 -45 20 -41 71 27 139 33 19 40 -63 19 -24 -107 -53 -25 -5 42 -69 20 90 10 19 29 81 47 -36 18 -1 5 7
7526 7 23 26 60 6 1 -74 53 24 -63 28 -25 61 -7 -8 -59 72 20 -42 91 -16 141 44 -117 -32 -15 -58 -103 63 -33
7555 -33 -11 92 -27 -46 -25 14 26 -65 58 59 96 30 -42 -13 -18 62 120 -65 -58 5 29 48 -52 19 -162 49 3 70
7583 70 22 0 12 36 -111 8 -1 -56 -23 -129 54 -28 -9 118 11 17 55 22 68 8 -39 114 -31 -7 27 36 -62 -1
7611 -1 16 20 20 -64 68 27 -26 52 -35 7 18 31 -85 18 -105 29 16 -53 -42 -22 11 -69 114 -13 -6 -27 10 -113
7639 -113 -56 -48 172 50 83 -40 56 -56 41 -1 -46 -25 81 43 104 -45 4 65 -51 106 91 112 90 98 -108 4
7665 4 -11 9 -34 -82 68 -93 -5 14 -142 19 21 13 -147 83 3 143 19 1 52 72 -11 -33 10 59 8 -60 87
7692H7q0L9q0Q7j46Q2M3o9R1j01j3J04j16J50m4j32J69j19J3j8l4J9R6m9L2j9
7718hM6%n9M3K0q2l4J95j47k4j9LJ19l7oo4l5O6J61n2m3j1k7N%p9O6k3R3m9p8
7749f0J3O8l9l5O6o1Q1o3J9j1J7P7j13J4J41j97O4j4L4L0J6j66Q9L0k6R8j41O6
7777cN4k9j6J10k25j0N4J41n9l4QJ7j05Q1P7j53M6L6J6n4RJ31j20j5rK7L4Qn3
7806c6nN7L2j35O5M4r0N5N6J44j12K2n7j15J01m3k7N8KL8m1l4Jkq9O8O1P5j13
7835b0rj5o3N4nM2j28N7M6J1K2N0p5J48j32r9L5J17m4J9o3J4J2K6k5P9j09rL4
7864c0L2J50p9m1J04m7j29L1J8R9j2p6K3j04R1j11j5O5J0l2m1J18n1K9J20j14
7890Hk0Q2k9J3P3j16k2P6mk4no3R0j30R6ll2R4o7L3r4Q7j05k3Q9M7m3J4rj12R1
$$ plain form
7692 87 7 46 -34 53 -93 -11 32 -37 54 -47 -60 44 -72 78 34 -98 71 -48 -35 -53 -87 -68 28 -21 11 -8
7718 -8 38 38 -21 22 42 -40 -74 121 -26 -50 -69 -66 53 16 10 -54 -89 -23 138 86 43 32 5 10 10 -69 -3 -26 67 18 -60
7749 -60 -47 21 -18 -53 13 -48 33 -30 -11 -22 -5 72 -41 -27 114 -83 -19 -33 1 31 47 -119 -30 0 -26 72 -69 -3
7777 -3 51 22 6 116 -109 -119 -65 76 17 -17 -9 8 -97 -16 61 -92 -46 -10 6 -48 -39 92 -28 -43 -52 -25 9 17 -36
7806 -36 -41 16 48 -87 -22 22 -68 -13 43 187 75 97 40 -75 26 -17 -44 14 16 54 13 -21 -20 -22 -111 -43 18 93 -20
7835 -20 -29 -44 -107 -53 -58 -16 -144 -87 -41 -30 -8 42 -33 115 -17 -116 -81 36 -8 11 -52 -38 -26 0 -25 54 -55 -64 -30
7864 -30 2 152 73 32 136 89 -40 -9 9 108 96 20 43 -61 30 -81 -96 -31 -21 -53 -94 24 -27 2 122 8
7890 8 -12 70 41 54 127 11 -11 65 61 37 32 -31 59 -71 25 22 -10 84 17 50 -44 43 -62 -85 4 51 8 22 13 -99 -8
7921hJ26r6M2j56J35m9m3kL4J05k23R5J16j28m9L3j9l7P4J0R6JM4p3J0J0K9l3
7949D4ko2L3L5j80J77n4j4Q6k3o8J38p5k0J1j7n0l1q0O0J30j09K1NK1n0K02j92
7977f4k5J20k6o4L1L8J9n8kM0jL3J1j19K15k64K14qj09M9L6o2M3j14J56p2M7K9
8005I3r6o2J10r6PR5m6LK5l5N4p6LJ18j50P8K3n0N8Nqo4r0K20o7J27j71J8o0n5
8035h9J14N5j38J69k54K69j59O2jm7O2j7J15j46K7j8J1q9J57j87L4O5l5P7j23
8060h6J09j6nn1k5N1Om0J01n3J3l6j4n2k6P8J01o3L6m6J52m3j6lr3J23r6N0q1
8089b5q6N7R4j31o0J15K7pO8j13K52j57lq6O6n1K6O9q0m3O9K9L4m4M8j34Q4N4
8117G2j48P2n0L5Q6o6k8MN2p4O3r7j3J27j81Q0J93j3j14j12J74j04J2l9R3k2K7
$$ plain form
7921 -8 118 22 64 -92 43 -6 -49 -51 -17 88 -135 -40 76 -52 -101 -68 -87 -124 -50 -40 56 57 101 28 38 48 77 44
7949 44 42 -20 13 48 -132 45 -9 -23 63 40 -28 110 35 15 26 9 -41 -72 -152 -92 38 -71 -50 -45 -24 -74 128 -64
7977 -64 -89 31 5 -59 -28 10 29 -29 -31 9 8 41 52 -67 148 -116 98 90 -19 30 66 4 47 -67 89 17 64 93
8005 93 -3 -65 45 -51 -44 51 5 8 33 -2 52 -24 -21 97 -53 25 48 -2 56 61 53 -11 -101 119 52 179 8 26 -34 -89
8035 -89 25 80 -58 111 -143 126 -33 29 28 -19 43 26 141 -5 22 4 15 -74 83 -104 -70 -5 -40 37 -86
8060 -86 23 7 2 -49 -74 -23 -17 -57 44 -9 4 -32 -46 -98 -124 -46 55 -8 28 -18 134 91 75 72 -21 102 6 56 -25
8089 -25 -111 -54 40 -91 -151 -36 -9 -16 52 -61 191 34 31 -55 11 -40 -14 55 -25 -68 1 30 64 20 68 -66 18 72
8117 72 -76 -4 -54 -19 67 1 -27 -23 29 -45 18 -79 -92 35 -146 -66 127 114 0 -112 62 -42 -30 -69 24 2 29
8144B9o1J01j31O1Qn9J23%n4J07o3L8P4j88K9P8j21L3j24N1J30j32N1M7K4l6p8
8171f3J4l6J14k4l9J0j12O6j4J28k5k4J8K9mr1O1k2PQ5
$$ plain form
8144 29 -32 69 -62 -1 7 -52 71 71 17 124 61 99 173 -15 14 92 -29 4 -120 -69 61 -71 -20 27 51 15 -63
8171 -63 -49 -85 29 5 -34 -24 -136 -70 -84 44 19 -5 13 42 38 -53 8 -14 -7 78
8191G8
$$ Imaginary data points
##PAGE= N=2
##DATA TABLE= (X++(I..I)), XYDATA
0@%%%%%%%%%%%%%%%%Pj5J6j6J6j6K4l2L2l7M5m9N7o8P6q8J02j14J28j45J63j82
38i6K04k29K54k81L12l46L83m24M70n18N72o31O94p65Q44r30J026j136J259j401
58g39J566j759J989k270K621l074L689m570N948q432J4302n5102l5158J17587
72C6598L3700p1210n0162L5048L2522k263o386N464l1485j2187L7122L4817k9989
85A1589m8326Q455M8283N316l2445q007J2557J017K915R503J959k3406o814K9378
99A1974J2961k7003j1816J8542M478j3709R02J6517j0926k7720J8634L3056j8330
112G560l9062J4609M0042n326m0851J565M0231j767l0360J769K2945k235j9204
125a0084O891J7976j4556j9838K1128K0168k1461k3885J5132L0016q782k9303
$$ plain form
0 0 0 0 0 0 0 0 0 0 0 0 0 0 0 0 0 0 7 -8 8 -8 8 -8 16 -16 16 -21 24 -25 32 -36 40 -48 54 -60 68 -77 86 -96
38 -96 108 -121 133 -148 164 -182 201 -223 247 -271 301 -330 364 -401 443 -487 539 -597 662 -739
58 -739 827 -932 1057 -1213 1408 -1666 2023 -2547 3401 -5031 9271 -45831 -80989 36598
72 36598 70298 -912 -51074 -16026 16496 14233 7847 13311 -18174 -30361 6761 41578 11589
85 11589 -36737 -28282 20001 25317 -7128 -15135 -2578 -1561 1354 10857 12816 -10590 -17404 11974
99 11974 24935 -2068 -13884 4658 9136 -4573 -3671 12846 1920 -25800 -7166 25890 7560
112 7560 -31502 -16893 23149 17823 -23028 -21463 18768 17001 -13359 -11590 11355 9120 -10084
125 -10084 -3193 14783 227 -19611 1517 21685 224 -23661 -8529 21487 12705 -16598
137a6598L324K2350K180r549l473n40M1M591J0714o436k1035M671K3071j443k1439
152i571k658J6070K562j4812K698J5461r962j5752J2368J8644q431k0369L874
165i878K0155j427j4302L649O354o782l283J0641O995j5621j3655J6729J7927
178A7502j2765j8083N134J5503R64j1193M13N247m733L51Q492j517r996j309R900
193C910L785j0661l023Q998q54p271K094O587j642q151N65R304k18p222J523L461
209A185j559p28L652K116o462m594R143O541r082p474N214Q017k062q047Q76N387
225B123j620j482K273p17k696P64M383P33o269p46O853Q6n613o40L955J187m421
242a847j423M541k12m325J059L016p28k172K31L067j18k935J854K282k089j068
$$ plain form
137 -16598 -13274 9076 11256 1707 -1766 -2306 -2265 2326 13040 6604 -14431 -9760 13311 11868 -9571
152 -9571 -12229 3841 6403 -8409 -5711 9750 -212 -15964 -3596 15048 6617 -13752 -9878
165 -9878 10277 8850 -5452 -1803 4551 -2231 -5514 5127 12122 -3499 -17154 -425 17502
178 17502 4737 -13346 -8212 7291 8255 -2938 -2525 2722 -2011 -1660 6832 5315 -4681 -5990 3910
193 3910 7695 -2966 -5989 3009 2155 -5116 -3022 3565 1923 -6228 -5663 3641 3423 -3799 -2276 1185
209 1185 -374 -1102 2550 4666 -1796 -6390 2753 9294 212 -7262 -2048 5969 3907 -4140 -3264 2123
225 2123 503 -979 1294 577 -2119 -1355 3028 3761 -2508 -3254 3599 3685 -1928 -2568 1387 2574 -1847
242 -1847 -3270 1271 1059 -3266 -2207 809 81 -2091 -1860 1207 1089 -1846 8 2290 201 -867
258h67J956J213j477k625K016K691k598k475J661J660o88j828L89J617p91o60
274h06J936m50j643Q58J531J25k082p83K288L16k266j15Q89O9m26n66P36N0q45
293a184P95P99p19k61P44O15j96q09M79J065q13p69O81J30k73n51N2O26l51o22
313e62O47M5m34K61K31J15k38l96P45J32q31R7K95j4j84k69K0K40k63o5J94m4
335b78NR7O9J08j0j18L49k7j42J39J6L1q6l4K2Q1k36J2J35p8l3J14j17R6l0n9
361B6J03j04p2L3l8q6J36j77P6%m7Q6j7K4L4j73P1J80N8j36J92j81m2J71o8J0
387E9r1k35M09N5k26o7R1P6K82l32j14K84k93L37J68m30j01K23J92l9m15r1K19
410c9j04J06N1k78j3Q6p8M22q4l24J29J84O4R3k51J30K94l80K3J76m6Nm61J91
$$ plain form
258 -867 1089 2302 825 -1800 216 2907 309 -2166 -505 1155 467 -1361 -972 645 -146 -806
274 -806 1130 680 -963 -105 1426 1551 -531 -1314 974 1290 -976 -1091 -202 -133 -559 -1125 -389 -339 -1184
293 -1184 -389 410 -309 -570 174 789 593 -216 263 1328 515 -254 427 557 284 -267 -215 411 60 -562
313 -562 85 130 -304 -43 188 303 65 -331 414 546 -285 -188 107 93 -91 -360 -340 -100 -363 -428 -234 -278
335 -278 -273 -176 -107 1 -9 -127 222 195 53 192 208 239 153 119 141 222 -14 -2 133 55 22 136 19 115 85 26
361 26 129 25 -47 -14 -52 -138 -2 -179 -103 -103 -150 -64 -81 -57 -23 -196 -125 55 113 -23 169 -12 -54 117 49 59
387 59 -32 -267 142 197 -29 -96 -5 71 353 21 -93 191 -102 235 403 -27 -128 95 287 248 -167 -258 -39
410 -39 -143 -37 14 -264 -277 -191 -269 153 69 -255 -126 58 122 215 -36 94 388 8 31 207 161 166 -295 -104
434a04M50m13k66J47R3J33J64l74Q1J33l97M84K31j22j74m68N14R45p72q74k45
455h34Q11P52n37r59P2M36M03L44o44m47J07M14Q29Q6j164m51N75J326K40j715
475c56r84J346Q59k98q75o71N89O29j52Q4n09l80P23K35L90j21j065R8J145K57
495I44o85q39M7J271l83r08K04J95J43j36m53M33L49l98oJ44M34J92o74K06O95
516G75n16o04O21K75l12j020L3J498j73j268l74O81R06K1r73l31Q82M13P2m07
536A99l97K73N4J93M51p44r58K35J107N05j209j295P91J492j37q55o49N76J119
555G51r3o06Jq5J18J26J11L05r72o01Q78Q59n68j104L4R80N64q38l37L56K08K95
577C82k24o6K43l44o9L05K17m40m10k0O72m8p07q4N90P0j60k92L5Q71k30m51p4
$$ plain form
434 -104 346 -67 -333 -186 -93 40 204 -170 -89 44 -353 131 362 240 66 -402 112 1057 285 -589 -834
455 -834 -23 729 192 -767 -695 -259 144 488 -156 -603 -496 -82 747 833 -331 -782 -207 1119 1359 -356
475 -356 -1340 6 865 567 -308 -979 -390 239 87 171 -338 -718 5 240 630 509 -556 -458 687 944
495 944 259 -580 -533 738 355 -553 -349 -154 -11 -147 -600 -167 182 -216 -222 -78 356 548 -126 80 775
516 775 259 -345 276 551 239 -781 -748 750 577 -691 -1065 -384 522 543 -430 -761 121 534 606 199
536 199 -198 75 129 322 773 29 -929 -694 413 918 -291 -1586 -795 697 560 -295 -944 -368 751
555 751 658 52 53 -32 86 212 323 628 -344 -945 -67 792 224 -880 -846 134 698 -140 -477 -121 87 382
577 382 158 92 335 -9 -78 227 444 4 -406 -426 246 198 -509 -593 -3 67 -93 -385 -350 521 291 -160 -234
600b34M07L73k71n19K76K75j72j70J2M9j36j54L60L03p51j50M35M81p5o42m6P03
622C54K3k16k35j36K68K81k74q4j08j06J36j07J92o2k10J36M57k46p9k8j94M46
644B08J0r1k06K6K11Q7l75q5L78k80j39K00J2o8j10J46L09k08l54L88K1j6L4p6
668B2J35Q3k89j2O1J20O2l18pJ86j62J6J90j81K5J36L0Oq2j04L05j33n0K9M2l2
694G8Lj15j7j44nK05N7k94J44M6l4P7k2Q4J36k46N3K48j13j21O1j14O7m1j63J72
720Bj16n8J23q6jlJ35J25j01j12J70j5O0J0n7J3J44k59O4o3k23K88p1j22Q3j29
746a99N6J60j70P9J99j6Mq6J28L8j19j18J85n8j55J47j89Ro5j11K30J31k07Q6
770d1m1K04K0j42Q3J12k24L2J54j51n7N6j05P4j72j6K02o1j50J73M0M6j27N2K18
$$ plain form
600 -234 173 546 275 -244 32 307 135 -35 -23 26 -110 -264 96 399 -352 -502 -67 414 339 -303 -349 354
622 354 377 161 -74 -210 58 339 65 -19 -127 -233 -97 -204 -12 -74 -284 -148 309 63 -16 -44 -238 208
644 208 218 127 -79 -53 158 245 -130 -215 163 -117 -256 -56 -44 -112 -222 -76 233 25 -329 59 80 64 98 22
668 22 157 240 -49 -61 0 120 182 -136 -143 43 -119 -103 87 -94 -69 67 97 103 21 -83 222 89 39 68 110 78
694 78 81 -34 -51 -195 -200 5 62 -232 -88 -42 -76 1 -21 63 199 -47 6 254 141 20 81 -33 34 -7 -170 2
720 2 -114 -172 -49 -135 -136 -139 -4 121 20 -92 78 63 123 133 76 89 233 -26 38 -25 -248 40 -31 -153 -70 -199
746 -199 -143 17 -153 -74 125 109 113 27 155 193 74 -44 141 83 -72 75 -114 -105 -170 -281 -51 80 -127 -41
770 -41 -82 122 142 0 83 195 -29 3 157 6 -51 5 -100 -26 -198 -214 -12 -73 -223 -50 -10 36 -91 -39 179
795A79l6j64J35j19l7J66j52J79n4k96J89j5j51N0P4k3Q1j49K31J05j12j09J58
818A30j1p4O8m1l0or9K8q6j09L02r0j07J10r8J82R8l45J45R7K7j7RN5p3n3o1L03
846B54l49j0J30j43P2k7j06K38j48n9K40j09J8R1nL9%q6M6Kj41J75j14j59J66
871A5p4Q3K7k23Q1P5q5K17j85j51K24K2LJ37r6j09J07Rn0m6J8Q4j23J2K08k50
897g0k38L14J4J5p0j73M16Jk80J38o5J15l8j43Q2J28k42K7J53j32P0j33L4Q8q5
922g4j11K13Q2r3J36j89J79Mj33J63m8q6J17q6l11K51M0l5n4k08K41N2k49K82
946H3N1k47O3J03K02r1l46M4M19j03j65p7kP8p4j9O2r2p6J5J36J80j81j97L16
971H2J17j51Jo0J36q0k0K8Lk52L24q0k59K07j03K1m7l1K23Q2j95J33J40o1j68
$$ plain form
795 179 143 -21 114 -5 -42 124 -28 151 97 -199 -10 -25 -176 -126 -52 -75 6 -143 88 193 81 -28 130
818 130 119 45 113 72 42 36 -63 -35 -121 -230 72 -18 -125 -15 -113 69 167 -178 -33 64 91 74 83 138 65 12 -49 254
846 254 -95 -105 25 -118 -46 -73 -179 59 -89 -148 92 -17 1 92 87 126 126 40 86 88 -53 122 8 -151 15
871 15 -59 24 51 -172 -91 -16 -101 116 -69 -220 4 26 29 166 70 -39 68 77 27 -19 -1 83 -40 -28 180 -70
897 -70 -308 6 20 35 -35 -208 208 209 -71 67 2 117 79 -64 18 146 -96 -69 84 -48 22 -111 -77 11 -74
922 -74 -185 28 110 17 153 -36 143 147 14 177 129 43 160 74 -237 14 54 19 -35 -243 -2 50 -199 83
946 83 134 -113 -50 53 255 164 -182 -138 281 178 13 -64 -66 12 -62 -81 -19 -111 -187 -172 -36 144 -37 -234 82
971 82 199 48 49 -11 125 45 25 53 56 -196 128 48 -211 -4 -107 -86 -133 -164 59 141 -54 79 219 158 -10
996a0J24k3k1j32j32L17m7k11m6J18J53r0j78K20R7k52L1J73m5p9j38J86J77j14
1020G8j84K53k02R6j44p7Q9Q6L2j5q5MJ45n9Ml0l4J06n1j6K23j20k06O9O4M9m0
1047C5k96K10K06j42j85L9K22L8k28O5K18j90j73L78p0rj38M3J34j20j90J40p
1070b0p4J5L2J8J09k01K08J9j63J50Qj11L7J02j56R6j50J42M2j78m6J97k7%k5
1095B4m1P0j7n8J80M2r4j73L3J96j09r6l3K03q4q1N4J48k29j6k3K07n9q5J6J83
1121A58j22j40Q9J75j44qM0qo0j7K7J0j7j23J49L5p8M8MrK5j70J25J44k38J18
1147A3J35n5j68JK97j53j57k6K38k28j48K72P0p0n7l6J84m9k53K88J65k63k7j3
1171d0J52K0k23N9J44k25m3K07l5p8j12K41N3k14k7J97O7j62P0o6O5j15K4K52
$$ plain form
996 -10 114 91 70 -62 -194 123 76 -135 -181 -63 90 0 -178 42 139 -113 -82 91 46 -33 -171 15 192 78
1020 78 -106 147 -55 41 -103 -180 -91 -5 27 12 -73 -69 76 17 21 -9 -43 63 12 -4 219 99 -107 -38 26 75 35
1047 35 -261 -51 155 13 -172 -133 89 127 -101 -36 182 -8 -181 197 127 118 -20 23 157 37 -153 -13 -20
1070 -20 -94 -79 -47 -29 80 -121 87 106 -57 93 101 -10 27 129 -27 69 -81 61 103 -75 -121 76 49 49 24
1095 24 -17 53 36 -22 158 200 106 -67 -34 162 53 -43 -76 127 43 -38 16 164 -65 -81 -104 103 44 -41 -25 158
1121 158 36 -104 -15 160 16 8 48 40 -20 -37 -10 0 -17 -140 9 44 -34 14 18 9 34 -136 -11 133 -105 13
1147 13 148 93 -75 -74 223 70 -87 -113 125 -103 -251 21 91 21 -36 -72 112 63 -190 98 263 0 -27 -40
1171 -40 112 132 -91 -32 112 -113 -156 51 16 -62 -174 67 120 -94 -121 76 143 -19 51 -15 50 -65 -41 211
1195B11j23j21m2J31n3Rn1Q8k8j80K41K7o9j66J63M9Nj78J56J44k90J0J33M0j28
1220b2j61J82J20j17j63K73q7o5k5N9N5q8J1J78J53k76p0J47n3l8j20OJ02j79
1244a78J11N7n1L1J28j07J86j92O3J35q0n7j5J88j54r1n8J69m6j59J07K8j68Q1
1268g2l3J35L5j87K11O9j29n1J97n0k7j22J41L3k41N4M8n2r8O1J07Pj61O5K11
1293A51j66l79N22j52J68j52l0J70K4k08NJ58j90qj13J92l0k94L78J5m0l8J14
1316I7oJ1j34J34R8k49P3R5o1q4L0QR9l18Q5J99j25r7J54Q0m5L5j16R4Q0k41J61
1343E7N1On4r4K8N8q7r0J08q7P3o2l0J29n6J42q2oo4J84l2L4p0JJ30k14p2J71
1371G2j45r3K2Q1k6M8j29J84M0p0R0o2l4n5J20J68j71j06O0J85j67p3M1K0p9r1
$$ plain form
1195 211 88 -33 -75 56 3 12 -39 49 21 -159 82 109 40 -126 37 86 91 -87 69 213 -77 -67 66 106 -22
1220 -22 -183 -1 119 2 -161 112 25 -40 -65 -6 49 -39 -28 150 303 27 -43 104 51 13 -107 -101 1 -178
1244 -178 -67 -10 -61 -30 98 -9 177 -15 48 183 103 46 31 219 65 -26 -84 85 39 -120 -13 15 -153 -72
1268 -72 -105 30 65 -122 89 158 29 -22 175 125 98 -24 117 150 -91 -37 11 -41 -139 -78 29 36 -125 -60 151
1293 151 -15 -394 128 -24 144 -8 -38 132 156 -52 -47 111 -79 -87 -200 -8 -38 -332 46 61 21 -17 97
1316 97 91 102 -32 102 200 -49 24 119 58 -26 4 12 111 -207 -122 77 -48 -145 9 89 44 79 -37 57 137 -104 57
1343 57 108 114 60 -34 -6 52 -35 -125 -17 -104 -31 -93 -123 6 -50 92 10 4 -60 124 92 126 56 57 187 -27 -99 72
1371 72 -73 -166 -144 -63 -89 -41 -170 14 54 -16 74 12 -22 -77 43 211 40 -66 -6 179 12 -61 -20 0 -79 -170
1397a70J71N6q9o7O9L8K8n1k9J77j39P1J8J00j58j5n9J54o9j28J83j96QQ9j04
1422a12K5R4j36J07K9o3o9J28j21J92J21l7m0j28O3J41j93j0Q5L4j22o0M3O7k20
1447a82M1R3J28p7k9P0O1o3M6K0K9j15L0m8M6j0Pj55J24r5j6P5j5l%J22m7J07
1475A44j56O6k0m4J48o8l8P1j30R0r3k3K3L1r9J15j2Q2o2r3J40q4K1R0r3L0J16
1502A52p4n1j9Qp1J17k04O9K2J7J13j16l9J18j9Q6o5k3m2j9n2J69q2j7J20j57
1528e9J9l6N2K7j31Q1ol0K3M7M5m6Q8j08K2k7K3l1L4j3M0p9P3J08k18J5QJ21q1
1557c9J1j5J17k49J39N8m1L7Lj0n4J35k2r7k0J01q0K8%M8pk25J21NJ04j54J73
1584F7j3M1j68J18m1J06p6l0P9l4n7l5J00j3m4R7Mj22m5K8m6J59j47J9L5Rk3M3
$$ plain form
1397 -170 1 57 -32 -99 -30 8 36 -15 -44 133 -6 65 83 183 25 10 -49 105 36 -92 91 -105 -97 -8 -112
1422 -112 -87 7 -129 -22 7 -56 -125 3 -118 74 195 158 118 -10 53 194 1 -9 76 110 -12 -72 -29 38 -182
1447 -182 -141 -48 80 3 -26 44 105 42 88 108 137 22 52 4 50 40 47 -108 16 -79 -95 -20 -35 -38 -38 84 37 144
1475 144 -12 54 34 -10 138 70 32 103 -27 63 -30 -53 -30 1 -98 17 5 87 25 -68 72 -12 9 99 6 36 152
1502 152 78 27 8 16 -55 62 -142 -73 -51 -34 79 -37 -76 42 23 109 44 21 -21 -40 -92 77 -5 -22 98 -59
1528 -59 -40 -76 -24 3 -128 -47 -53 -83 -60 -13 32 -14 74 -34 -12 -39 -16 -47 -13 -26 14 -65 8 116 -102 -87 -79 42 -39
1557 -39 -28 -43 74 -175 -36 22 -19 18 21 11 -43 92 70 -27 -47 54 -26 2 2 50 43 -182 -61 -56 48 -106 67
1584 67 54 95 -73 45 4 110 34 4 83 49 -8 -43 57 44 0 97 101 -21 -66 -38 -84 75 -72 -53 -18 -9 -32 11
1612A1p4Q9L9p6K8k3N2O3m5Ooo3j4Q0J1k32J58J4m0Mk7l6P0r3K17q4m9r5J79l9
1642B5K5M4q4Oo5R2P2j20p2R0o9Q1q7O0O1nl1j0P4j26Q1J7K3o0L7p9o8N0J03j04
1672c9P3pk3k0L7oK1n8j12M8P2j2L9j36J17J62k08L6J74n99P08j43r7o6k64M50
1698A47J42j63k67K95q65L05N31r1r3k35P38m44L7o7O1j2k2L9P8p2j10p8P4N6
1722a6j4Q8o3o9K8K0lJ22p5o6J30n0q5j5J20l3j72J25j10O6L6l2J00M8o0m9K5
1749dK9K7p2K4N5j7K9J34j47j17P3r5j0Q0n4K4J2l2k0P9J15r7Q2n1j21J6J25J11
1777A78j06K9j33J48o4j2Oj04J7K6jO4m8K1k8J06j59p2K99k04R2P7k14J00n0J
1803c1j0R8l8M1o5j11Q1m5L4l8M3K0J42r1P7j39J14o1k8o2N0K4P1kK9j55J43o5
$$ plain form
1612 11 -63 26 65 -11 17 -6 46 109 64 70 64 1 -13 67 78 -154 4 18 -22 -18 -45 -81 -11 -104 113 29 -20 -115 64 25
1642 25 50 94 10 16 -49 43 115 -5 -77 13 -56 25 -62 -2 59 54 23 13 87 -39 42 59 82 22 59 -20 -88 -38 65 -39
1672 -39 34 27 4 -16 21 15 36 -22 -134 -86 -14 -26 13 -123 -6 156 -52 -16 158 -441 267 124 27 -39 -303 147
1698 147 289 126 -141 154 -711 -406 125 34 -59 -294 444 0 37 -30 31 19 -3 36 114 42 -68 -146 -72 -16
1722 -16 -30 58 -5 -74 -46 -26 -29 93 18 -48 82 32 -53 -68 52 19 -153 -28 -138 -72 -36 -68 32 80 20 -29 -4
1749 -4 25 52 -20 4 59 42 71 205 58 -59 14 -81 -91 -11 -65 -41 -29 -61 -81 -2 113 16 98 47 -74 -58 67 178
1777 178 72 101 -32 116 52 40 46 -58 -41 -15 -16 48 0 21 -7 99 -60 -132 167 -37 55 132 -82 18 -32 -31
1803 -31 -41 57 19 60 -5 -116 -35 -80 -46 -84 -41 -21 121 30 107 -32 82 21 -7 -69 -19 5 76 74 103 -52 91 26
1831B6o5nLR1j87N8j0K37m8o5j09J00P6j29N2j31N9J5K2nO1l3O8q8j60J74j6P7
1859F8l4l8K7PK3j42K17j34Q9p8j8Mm8Q9n1qL6l0L4mj32Q3M3Nl5j9J39j32K03
1888A64j38p4J16l2n5R7j44N6M6j19J01nrM1q8n9J46j13R3J14j61M6N2o4K46k83
1914b6L7M1j29R9Q4j71P6M6j16J10r8q6J05J32j01k5M9J3k5KJ6j16J33Jl6M3p5
1941a7j13K6J9J37Ok15J53j13P9P6L1m9o9J00L6Ol4p7P7r4J18j4j28M7NJm8Q4
1969C0j99J98K4k05L5J67o0M6q8J09o9MQ5r5L9J6Q1j12n7J18r6K4n4J10j58J27
1995B0J2O1o4jo7Q4q5J09n5mQ7j91R3N0r7j9J2M8J7k2q4N8M0j9n1l7K07j46J32
2024H8j01k6O2Lk9Q2p2m6M6r6N0R3q1n2k2J29k9k0JP6N4r2J8j17Q1J0K9m0n5Q9
$$ plain form
1831 26 -39 -44 -41 50 -137 -79 -89 148 100 35 -74 26 102 -27 25 -106 -47 -32 -10 -15 46 13 81 -7 -167 7 -9 68
1859 68 34 -4 23 30 53 -89 128 -6 83 5 -13 -9 -57 32 -19 -27 9 -21 13 9 -123 -40 3 8 -27 -46 93 -39 164
1888 164 26 -48 68 36 -19 78 -66 -10 36 -83 18 13 4 45 -43 -102 44 -69 24 138 -23 23 75 11 257 -26
1914 -26 11 52 -77 22 106 -65 11 57 -59 51 -47 -133 -28 104 3 -22 27 40 15 17 33 -83 50 51 15 58 -17
1941 -17 -130 -104 -85 52 58 -157 -4 -117 -38 38 69 20 -49 51 87 93 59 -18 59 -35 83 69 -59 -12 -7 -6 -54 30
1969 30 -169 29 53 -152 -117 50 -10 36 -52 57 -12 -8 77 -18 21 37 118 6 -51 67 -29 -5 -59 51 -107 20
1995 20 32 93 29 28 -39 45 -40 69 14 10 97 -94 -1 49 -48 -67 -55 -7 10 -12 -96 -38 2 -17 -68 -105 102 -44 88
2024 88 -13 -39 23 26 -3 79 7 -39 7 -89 -39 54 -27 -79 -101 28 -1 -21 -20 56 110 18 36 -81 0 10 39 -1 -56 33
2054C3Pr9O1J7k0j09RP3n4J48m2p9K07k03k8JK84o1p3l4%m3J04j91J24R8r7l9
2082fr7J07j12N1O2L9n6j3M3r9R1L1j7K8n8P7m7l6O0k9lO0J2or2K7l9M4J9j20
2112g9O0j7M7k1J9K5L1j42J64n7lJ6R9Op8j34P2J10k09Q1j95L32l13M72l08k1
2138d3K4J73l42p0N37j95j56N14j371M32L99O0r09Q95P80p17p76J166l99Q77q01
2159G8l35Q86q26K32O69p29r6K43j39j5l98L00j30K25J41k30J94j97J41oOj6P1
2182F9j45J25m6m9J57k15PR5k9L7L1O0j21M6m2j9J12q5K3n6n4J60j20R4N8p4m
2209A5m2rpN5J04j63J56j55k0KrK1K9o0J15q1Q3p7l9P5O6k7R4n8j03M0r7P5j21
2238a38K45j85O0j19L31k35k9J09Om0qK3O6l9j25J14j6n9JK4Q4j23n9J70j16O5
$$ plain form
2054 33 40 -59 2 19 -1 -110 -101 -28 -82 66 24 -55 152 -51 -79 -78 206 145 72 38 38 -5 99 -92 32 130 33 -6
2082 -6 -103 4 -108 -57 5 44 -12 -25 18 -81 10 41 24 52 -6 71 24 -12 48 19 16 76 88 82 -10 17 -22 22 41 -79
2112 -79 -19 -36 11 -10 9 34 65 -77 87 30 27 43 142 148 70 -64 8 118 -91 -10 -205 127 -186 286 -22 -43
2138 -43 -19 154 -188 -258 279 84 -72 442 -929 -497 -98 -38 -947 -52 728 11 -765 401 2 879 78
2159 78 -257 629 -197 35 704 -25 -121 122 -17 -32 -430 -130 -260 -35 106 -124 70 -127 14 8 14 -2 69
2182 69 -76 49 3 -46 111 -104 -97 -2 -31 6 37 97 -24 22 -20 -39 73 -12 11 -45 -99 61 -59 35 93 19 15
2209 15 -27 -36 -43 12 116 -47 109 -46 -66 -64 -73 -52 -23 -83 32 -49 34 -43 -82 -7 59 32 126 68 -35 5 -92 -17 -138
2238 -138 107 -78 -18 -137 194 -41 -70 39 45 5 -3 20 86 47 -78 36 20 -39 -38 -14 70 -53 -112 58 -58 7
2264Gl1Qq6j5qJ55n3m6J54l1j4k8Q8o19N28k8QJ32k64J06o5J45r4L7q%P4r3J13
2293G2l3j00P9K2K9n3p6O1M2j39J51m3o0j4J1N8l0j06lJ99j20R6k4l7K6Pj87K01
2321B9QQ3jp3o7p8J45r6Q8j8k6N0K4O6j41%N5n7MJ0lm5PLL8jPn0RM3n3N8o0J07
2355F5Pj04R6j6J37j89lJ05j63Q8j12P1O9jJ0%Qj13J13lp3m2L2J6j76K45j23Q4
2383B8j49J49N1j61l9PP5L6j9J19j05po7J11J1m7K1Lm5n6J41j41j6J27j06N7L7
2410A5n6K08p4n2N4p5n4L4J4L9r8R1k5O4j12P4m8j6j9M1p7J5K6K7l2KP5Nr3O5
2440A8n8j9J06l8j2k2m0L4Om0j2P8Mn8N5QJ7l4Q5n6j7j11J42M7l1j0j4k4q8P3
2470a1J48k9o6Qq4m0J27l6JoPqo2J08r0Q9j02P6qM0l6k4m4O1K5lj97J01J22j33
$$ plain form
2264 7 -24 -16 -102 -117 -125 30 -23 -69 85 54 40 12 100 -519 9 -19 -11 121 -143 -37 -102 43 -51 -14 -22 -22 52 -41 72
2293 72 39 -61 18 40 69 16 -60 1 43 -96 55 12 -48 -62 -51 7 -23 -129 -132 67 -53 43 19 -18 8 15 -172 29
2321 29 37 120 119 46 -21 -99 46 -50 38 20 -6 44 68 134 -7 -7 48 -9 -5 5 2 -43 -36 -33 5 4 11 -39 -30 13 -40 18 -42 65
2355 65 72 -32 64 48 185 -4 -7 98 -65 23 -89 -18 51 50 60 60 68 -45 68 65 -8 -50 -18 -2 -178 67 -56 28
2383 28 -121 28 79 -82 -121 -114 -39 -3 -22 97 -8 -15 -82 29 40 -7 14 17 -28 -84 57 -84 -100 27 -79 -22 15
2410 15 -41 167 93 41 95 20 -34 0 14 53 -45 46 21 85 -27 47 -1 -17 -36 5 -72 -57 -31 -4 -36 -34 41 46 -47 18
2440 18 -40 -59 47 9 -3 -25 -65 -31 -25 -65 -77 1 5 -53 2 10 27 -7 78 22 5 -106 36 83 52 42 28 4 -84 -11
2470 -11 137 108 42 50 -34 -74 53 17 18 12 19 11 -51 57 -33 56 -46 30 22 62 26 2 -42 19 44 41 -156 -55 67 -66
2500f6J38o0j00P9qOM2p2nP8L4j52J52k3r6O2K5nM04l81p7o1k2J33n2J4k7J0p
2529c7oM8j49J16J04m8M3p6k3J47r6M2n6K6JO3k62R7M4L2L8j23R4KR3j62K6J6
2557flN0q7N1P9Oo0KJ0l7L9j46J68k11K01pk7J9J2K5k8n2J1M9K3j13K4J9l3OL2
2588A6m2L8k1J5Q4j60J0J07j30J17n2k6J20q3o3R4J9%j0o5J06K7j80J38q3K7q0
2615g7k0J85m8j33M4L1p1K28j64mKp5J44kL3j00n4J79m1%kr4l2N0P1o7Jj4j10
2644a40Q2R4q6J19pn6j9L3j9j17J49n3k5o5J52m9N0jj01J40Mj64L0k6p0J72q9
2671f2J09m2J1k0k9N0m9K1J2m3O5J41j73l0l9M7j2K1O0n8N1k7n3on0O1P1n9J9
2700a3J12p2q5J92j85J03J5r3N5p7r8J46n6K8jJ26p1N0r6J7K4P5n1m6m1q9J21
$$ plain form
2500 -66 72 12 -88 -9 -17 -11 31 -41 -46 32 66 -86 66 43 -53 9 34 29 433 52 -25 -86 -108 25 -27 -13 -40 -30 -37
2529 -37 -43 5 -144 -28 76 28 71 -5 -28 119 23 65 9 35 36 99 -163 -66 -22 10 48 -75 19 21 114 -48 -22 -6
2557 -6 -9 41 -46 5 84 90 30 32 42 5 44 -102 66 -145 56 49 22 41 53 78 50 -2 9 58 81 -32 -8 11 -22 -16 16
2588 16 -26 12 -9 6 90 -70 -60 47 -83 34 -18 -44 76 -7 -70 24 43 43 33 -32 74 101 -79 59 -24 3 -77
2615 -77 -97 88 40 -93 -49 -18 -89 139 -25 -29 -27 -102 42 40 73 -27 -81 98 57 57 55 -39 -71 -21 50 -17 -16 -30 -140
2644 -140 -58 36 -50 69 62 6 -13 20 1 -116 33 -20 -45 -110 42 -7 43 42 -59 81 85 -79 -49 -75 -145 27 -62
2671 -62 47 5 16 -4 -33 17 -32 -11 1 -42 23 164 -9 -39 -78 -31 -43 -22 38 -20 31 4 -49 -55 -105 -44 27 -32 -13
2700 -13 99 27 -58 134 -51 52 67 -26 29 -48 -146 0 -56 -28 -29 97 26 76 -20 -3 21 96 45 -1 -42 -131 -10
2727a0Mk7N2N9j21j8r2J44pJ45j13m0N3j90K01j05L9J7N2n2N6l9p9l3R0J5P3J07
2755A81k22Q3l4J2k8L3o1N0O4p8rM1l0pO8n4k6l1K52j37r2j5pQpL9l6JO3P1j00
2786hJ15p8L8j5m4r3J94K2j37O6o9r3J20l2nm8O5j2R4n3q1M1p0O5L6No8J2Q8k03
2816a48K00M6r2J25j55OK9k3j9J00j17O5O4j6N2j86P2Q4j14jK6J73j12m6lJ7m8
2843b1K1Qj5nJ8N3j44J97j16M7kk1LN2j5j22J16j10P6m5k7L2O4J0n6m5L6N9j15
2872f7N8l2N1kM5q0J13p8O9r0QQ0p1k2nJ04j40J22n8J8q3mK2K2jj8P5N7q7O5o1
2903A0LK9%J9p7J29j31R1j1jK7n4o4R0o4P1j26m7j5J33R3j29K3K8M1n7L1r9J04
2932D7l9k2P1j35J00Rp1O8n1M4O1O7r5p8O3j0o3N1m4L4l2P6L2o0o0l7M2K4o8P4
$$ plain form
2727 -10 -6 -33 19 78 -43 -61 -153 -9 -16 129 16 -24 29 -161 40 -65 -26 -9 43 -9 47 8 -71 -104 -14 1 74 181
2755 181 -41 42 8 20 -8 25 -36 14 78 0 -9 32 2 -5 63 9 -17 -48 204 67 -25 -40 -47 -39 -46 -7 -43 -42 21 92 -8
2786 -8 107 29 67 52 8 -85 109 131 -6 60 -9 -102 18 -14 -19 -67 -2 -14 80 27 -54 -13 -83 -18 18 23 -45 -33 55 -148
2816 -148 52 98 6 131 -24 -18 11 -12 -31 69 -48 17 81 65 117 -69 3 87 -27 -28 -2 171 59 13 10 27 -21
2843 -21 0 8 -7 -12 6 59 -85 112 -4 43 41 20 23 75 60 -62 54 -56 20 -25 -52 -20 44 54 -2 -47 -11 48 -67
2872 -67 -9 -41 10 8 53 -27 86 8 77 -13 -5 75 4 -18 -23 81 -59 63 5 23 -60 -64 -42 -20 -21 -39 36 93 6 71 10
2903 10 13 42 42 61 -16 113 -18 73 62 61 88 34 -30 60 -4 67 -59 -106 -121 12 105 -24 -1 27 68 11 42 -57 47
2932 47 8 -14 57 -78 22 31 -40 28 -23 21 82 149 54 -24 39 29 -34 17 -27 7 -25 51 83 23 -37 -74 -32 -8 -76 -2
2962bk7j4K2p8J47N2j27l6J89q4j77J87q6p8Q9O8Mk7r7O3o9J13j09Q0k1rN9l0
2990BK3j2Q6j91J01M2K9j53J5J41k58J62J11n0J0j17J31Qj23J05k3l1k4N9L6N
3016H4p2J09j84J39k1l7N3rn6j0q2K4j00K07l1R2j33O7l1k4O8q3j9Q7P9j89LN9
3044a0l6J08r7J9l4L1M0KQQ1l2Jq0ok6R0r3R2lj87L4M3L7l1N2L0k8O3l9m6p8P6
3076a9O0p9J6K1Q5j80J16K6L2p3l7j9P8m6k1M9k4q9P5j10Q6K8O4j03J29j35Q2
3103A2P1M7q2q9R0q1m9J9P1j81K03k6L4L9p9m5l0Q1j47J42L7l6K4j0Po6J8K4P0
3132F8p4j2L8j1K0n0L5%q5J68j03l3J19k6o2M6Oj07P6m3J17k3m7Qk6qo1Q4j0q4
3162h0J09o1O4m0J6M4J3q6kk6K5J1RK2K7j1nm1mKk2J4m7J01j36Q5L8j5j8qP5k2
$$ plain form
2962 -2 -29 -43 -21 -99 48 100 -27 -63 126 42 -135 52 -34 -112 -23 45 49 22 -75 -12 -81 32 -77 3 -18 -27 32 2
2990 2 25 13 99 -92 9 51 80 -73 -58 83 -175 -13 98 48 58 -59 72 80 -43 62 39 8 -16 43 79 84
3016 84 12 121 -63 76 55 18 71 62 6 -4 -86 -62 -162 45 14 106 -27 40 9 -15 53 -30 -49 38 117 -72 -69 -10
3044 -10 -46 62 -35 -16 -50 -19 21 23 31 112 80 81 1 -5 -31 59 -34 58 55 -132 -98 -55 -18 -49 3 33 5 68 29 -17 -95 -19
3076 -19 41 -38 -22 -1 84 -96 20 46 78 5 -32 -51 27 -19 -40 9 -15 -104 -29 -139 -53 -25 39 -64 65 -70 12
3103 12 83 130 48 -41 49 -32 -81 -62 9 -172 31 5 39 78 -1 -46 -76 5 -142 0 37 1 25 15 22 -44 -26 -2 68
3132 68 -6 -18 20 9 29 -21 14 14 -71 97 -6 -39 80 54 -8 38 44 -63 13 -30 87 64 17 25 -1 -9 -70 14 4 -80
3162 -80 29 -32 32 -8 8 52 65 -21 -23 -49 -24 -13 -4 18 45 34 29 -12 -16 -14 -36 -22 -69 32 -104 -19 19 4 -14 -22 53 31
3194C1Q4j68M7NP7l1j13P6j00P0O0P3lp1q4n1M1J41q6n2L5R3l9k4K1J0K5l5n0
3223a8J23p0j20J10N5q2N4j11mK2P1n0N5j7j8L9p5K7J18j39NJ63j24N5p4Pj1L3
3251B4nkN9r1K7J9Rm3k2m3K1J47j39P7j1m1M1kp2Q0j21M4Q3q6J66j60l2J12j75
3280a36J06R5j14qO5Q1j17nQ8j15K9Q9p6oO6K3n3p6P5o9J26p9n8l4J14l0k7k3
3308f9M3ML5N2K3P%j06j1J8Np6M4O8l8qJ3P6q6No1L2R5rq5l5J9m9Q9k6Q1j48L5
3341f3J30m1L1m6Mj00J18j10Q5j7mL3J12j26L2o0k7P3k9O2J8o5n4R6Q3j99K5N
3369c4RK3k9R6n4o4N2mm2N7kP9j16N7j0J1J4n5p7O0K8Q3j42J04j27J74j10Q4j06
3398d1M5Lm7N8p9Q6j04O2P8q6L6O5j8J08k20LK9oO6k8K9N0n5m8nR1j2j22K02l30
$$ plain form
3194 31 115 -53 -6 -1 76 45 -68 8 -92 -22 38 111 108 37 -47 -98 -57 84 -2 -54 -19 74 35 11 32 42 67 32 -18
3223 -18 105 35 -85 25 80 -2 52 -59 -63 -41 30 -20 35 18 0 39 -36 -9 109 -30 -25 138 14 69 -5 2 -9 24
3251 24 19 17 76 -15 12 31 40 -3 -25 -68 -47 100 -39 38 27 -14 27 25 -47 33 -88 -44 39 -47 119 -41 -73 39 -136
3280 -136 -30 65 -49 -57 8 89 -28 -33 55 -60 -31 58 -18 -24 42 65 12 -64 11 -58 68 -11 -69 -103 11 -19 -46 -69
3308 -69 -26 -22 13 65 88 95 95 -11 -22 -4 1 -75 -31 37 -1 -9 4 80 -6 -1 -62 -30 65 56 -29 -64 -45 -94 -5 -31 50 -98 -63
3341 -63 67 26 57 11 15 -85 33 -77 8 -9 -13 20 132 6 38 -22 -49 24 -5 57 75 10 -44 52 135 -64 -39 -34
3369 -34 -25 -2 -31 65 11 -53 -1 -5 -47 10 8 87 -29 28 18 29 43 -12 -89 -29 -1 82 -60 44 -83 91 -19 65 -41
3398 -41 4 7 -40 18 -61 25 -79 -17 61 -25 11 76 58 166 -54 -51 -22 -28 38 10 39 89 34 -14 -19 72 60 -62 140 -190
3428a90K09Q7j07j8J09j23P3m3k7N9o9Q9j39J14p6OK2J37r1Mr1o6J33N1n1p2Q3
3455A3N2P6l7o4l2%N8j35Q0R8j80L3M1j15J60j3jR0j36K3j39K01j06P6m2o3%J36
3483G4q8K4N4q4Q0p8oQ0n7N5j01J32j27O2k8nl4ll1R4r4M5p1J51rK6p2pQ5q3L2
3514A6j42J0R7N2P5j90M0o4J71p8M1j2q0N0j5L1j21J22k7j6j00M4J24p1r9J36
3540fl9J05q3J8J4k7R6o9lQ0o5m1j0J7J20p5P9j46L6m0J15k2n8K6j03J36l0PN4
3569H6lM7j19K9Qqj41J10O2p5k1q5J49j19L7N9L5n1O4j53P8R3K3p8j4J7l1O3k7
3598C5o6L1j5n5J50r1P2J1q2J0K2q5K2N2q3O2P8m8L8k5J6K0j39P8q1J26j57J98
3626I4j50J49j34J9J61n7j53J03k66K30RL6kN5r5M6p9j9Pj1m1J04r5L5J81k58
$$ plain form
3428 -190 19 106 -1 -19 90 -33 40 -3 -30 29 -40 49 -90 24 -52 -46 -24 113 22 26 -65 -131 2 53 2 -70 13
3455 13 65 141 104 40 8 8 66 -69 11 109 -71 -38 3 -112 48 35 34 124 -12 11 -128 73 -33 43 1 -62 -62 74
3483 74 -14 10 64 -20 60 -18 -24 56 -1 54 -47 85 -42 20 -8 -13 -47 -50 -81 13 -81 -36 -107 44 35 61 -11 -18 67 -16 16
3514 16 -126 -116 -19 33 108 -82 -42 -106 65 -13 28 16 -64 -14 -29 2 -119 3 -24 -40 -140 -96 28 -43 -142 -6
3540 -6 -45 60 -23 -5 9 -18 78 9 6 86 21 -20 -30 -13 107 32 111 -35 1 -39 76 54 -4 22 -81 55 25 32 86
3569 86 83 130 11 40 48 40 -101 9 71 -4 -25 -110 39 -80 -43 16 51 0 64 -89 -11 82 105 27 13 30 -1 62 35
3598 35 -31 0 -15 -70 80 -11 61 72 -10 0 22 -63 -41 11 -72 -10 68 20 58 33 49 69 -70 8 -73 53 -104 94
3626 94 -56 93 -41 -22 139 82 -71 32 -234 -4 5 41 39 94 -1 45 -34 -53 -46 -57 -98 6 -89 -54 127 -131
3652a31J75q4P0o1L5%Q4j29J1O8j06N8o7O2k9J23N2j23j0r9N7Q9LL4p8j04J09
3679In0P4M0j01R0r0O1P8l6j52K5jP7K5N0m8n7O5k1J8j4lj66J88o5OR6q9L5J1
3709E5j89P0O3R0r9j5K5L8M1j25L3n5N5J23j41MnP7o9%N3K3j00J30j1m7n0J3l9
3738e2L6L7p4lmQ3L5o0j2J7m8N9p1K2J13m0O8j00n7L1J06j19k4J9l4J38j42J22
3766D6o4P9p3N3jo9KL8P1m2r6K9l5J00l5J9j16J57o7l2K9Q1n6j3N2pn2jP5J0r
3797G3n6n2N4M2p7K7j31J63o8pL4o2J52n0K7j89J19P3M6p2o8m1J04j12R9PjRL4
3826G7N2k08o8J70l5O7k54J89L4m2L1l7K0l2N5P1o6m3K0O0r0M5m8M0J06j47R9
3853F6q9L7O3j44N4R2Mk7p0O3k8J4n5M8j7n8P8rm3qkm2Q3J0L8j11P3l2J27k01
$$ plain form
3652 -131 44 -40 30 -31 4 4 88 -41 -30 38 -68 -10 -77 -15 -44 79 131 8 -2 -101 -44 45 48 82 4 -100 9
3679 9 -41 33 73 -28 62 -28 33 111 75 -77 -52 -53 24 49 99 51 -6 59 38 56 42 39 -127 61 -4 2 98 9 44 55
3709 55 -134 -64 -1 89 -10 -25 0 38 79 -46 -13 -68 -13 110 -31 -27 -32 45 -24 -24 29 52 -48 82 71 24 -26 -13 -52
3738 -52 -16 21 -53 -56 -60 23 58 -2 -14 3 -45 14 -57 -35 78 38 106 6 -51 -20 86 -33 -57 -38 -72 66 -76 46
3766 46 -18 61 -12 41 40 -29 -27 11 82 40 -56 -27 -62 38 3 22 -94 63 -4 -36 -7 74 18 5 57 50 -2 -3 72 82 73
3797 73 17 -35 19 61 -16 11 -120 43 -25 -32 2 -60 92 42 69 -120 -1 72 118 46 -22 -63 41 -71 28 35 34 43 77
3826 77 129 -79 -147 23 -12 55 -199 -10 24 -18 13 -24 -4 -36 19 90 24 -19 1 61 -29 16 -32 8 114 -33 66
3853 66 -23 14 77 -67 -13 79 83 56 -14 49 21 35 -20 28 11 -47 31 22 -21 -29 -31 -73 10 20 58 -53 20 -12 115 -86
3883h6J46K0o9Q1j44R0o2J2k1Q3n6M6N4o3r7M6m1R2J4j55P6M4j4K1N8r6j74K04
3911Ij9j71J48O5J7p7J9p4J46j30O7o4N5J3L9Jo8J6N7l2p5J69j24O2K0p8K1j4
3939bO1O6j30j3l3Q3j2j09O7m6L9O6ro8J25l3q2r7J34q9O6j25J44j42R6om7n6
3967a52J00N9L9jm2L5m1J01q9M4N8r0M2n2l5rN5L1k2r1L4l5J78o3j6j19oM3JK6
3997a7PNJ4%p7J35j03N3l6m3P4L6m3n1J56Pp2kJ2j21J04j2k7Pj1m1J33r8O5Pj4
4028D7o8P0K1j57J86j52N1n2K7k7M3L1j5%m8oK4m9Q5r6J14n5j5Q6r5Q1j5L7m4
4057IP7p3J8Rj17Q2M5J02k55M0O3L9L1j16o5J31j34J52L9j17J08M1j24Q8j46m7
4083a20J28j0qj9j5Q2M4p8LJ3k4jL4lJ1j1o2L8%n5K6n7J33r9N4J3K9k9j7J34p7
$$ plain form
3883 -86 60 80 11 92 -52 38 -24 -12 -33 50 -6 40 94 31 -66 -20 -61 31 45 -110 -34 10 -4 17 75 -21 -195 9
3911 9 -10 -181 -33 32 49 -28 -9 -83 63 -67 0 -64 -9 4 43 44 -24 -8 49 17 -58 111 -13 49 69 -9 12 -2
3939 -2 59 125 -5 -18 -51 32 20 -89 -22 -68 -29 37 28 -40 85 52 -30 -127 7 -82 -16 -141 3 -139 -43 -49 -96 -152
3967 -152 -52 7 46 45 3 38 -3 98 9 53 111 21 63 11 -24 -33 22 53 31 -60 -26 -61 117 54 38 -81 -87 -44 -43 -17
3997 -17 -10 -5 9 9 -68 67 -36 17 -19 -62 12 48 5 -46 110 117 45 43 55 -66 38 26 -1 6 -5 -46 87 -11 54 61 47
4028 47 -21 49 70 -87 99 -53 -2 -54 -27 -54 -11 20 5 5 -43 -49 -25 -74 11 -85 29 -26 -41 45 -50 31 16 53 9
4057 9 86 13 31 40 -77 5 50 152 -103 -63 0 39 70 -46 -111 20 -114 38 77 -40 68 109 -15 73 -73 -120
4083 -120 8 -2 -10 -29 -44 38 82 4 7 20 -4 -5 29 26 37 26 -36 2 2 -53 -27 -84 49 -50 4 17 46 17 0 134 57
4114E7n6M2j04mr0K35j65J69L3l8j6j88R3N0K0p2m0J13j46J85j39N1J35k6r6j29
4140a26J12K0L9j29O4J2L2L6j13J4L3Kr9J64r7m3N6k7N6Nj4P6l1%O8k48J10J3
4168a5M9M8j28O7j53J21M9k9j90J57j9l6PP1l5J6J07o3Q9j34LN7j7J3P1j37N3
4195B2j58J68m4j57K03q5m9O5J39j60K8O4lr7L2J20j14J01j10kj6J05j43M9J26
4220H4k02k3J95l7O3k7k0Mj05R8j00L2J33r1L1k1N2q4O2j3lJ7j01J8P1n1M0p3
4248e1m9J54p0PQ6n5jj6j04J52J2n4n3J0m5N5%O3L2r4m8M0L7r8R1L7mO0q7K5Q8
4279A20j80M5J0N7j0j6L0q1OJ06j88L2P2M0j8n5J02j2m8o2J31j11Q2j09J20k2
4305D1q7R6j6r3M9O8p0N6N1j53K5K4j9n1Q7k5K8J37j69K1m1n2J49j23J24l7qj6
$$ plain form
4114 57 1 43 -61 -65 -155 80 -85 84 117 79 63 -125 -32 18 38 -34 -74 39 -107 78 -61 -10 125 99 3 -126
4140 -126 -14 6 45 -84 -20 -8 24 60 -53 -39 -6 -4 -103 61 -36 -79 -23 -50 6 11 -3 73 42 42 110 -138 -28 -15
4168 -15 34 82 -46 21 -132 -11 38 9 -181 -24 -43 -79 -72 -1 -36 -20 87 24 113 -21 -18 39 22 35 106 -31 22
4195 22 -136 32 -12 -169 34 -51 -100 -35 104 -56 -28 36 33 -64 -32 88 -26 75 -35 -37 -53 52 -91 -42 84
4220 84 -118 -141 54 17 80 53 33 37 -68 30 -70 -38 95 4 35 14 66 -18 44 31 28 45 -56 -38 33 -18 22 -51
4248 -51 -100 54 -16 -9 77 22 21 5 -99 53 65 11 -42 -32 -77 -22 -22 41 73 -21 -69 -29 8 -90 1 38 34 94 7 32 120
4279 120 -60 -15 -5 52 42 26 56 -25 -19 87 -101 -69 3 43 25 -30 72 60 12 -50 81 -30 52 -57 63 41
4305 41 -46 50 34 -59 -10 58 -12 44 95 -58 -33 -9 -28 -79 8 -17 11 148 -21 0 -41 -93 56 -67 57 20 12 -4
4333dm4J5R4m2L8J8j2j55K3M0J93o16K39k80q6N38J68j04K9J6o2n3P1n5L7%n6
4360e0M2L5q6J2R6k5m6k6M1jQj8Kj13J34n3k4o5J38q5R7M8pj18K8LK4l3J59m4
4390G3j64R3K1o5JK0o6J05n1M6n2J50j52N5o2R6rp9k3K3J17m1o2K6Q6j34O9ro4
4419e2J3L0ll5P2PN5j40J4n3J68j08l9J27o5P3n2N1r0MO9K7j12R8m5j07J19l5
4447iP6o5k9J25j3p3oO0m4r3M8k7P7j45J74q8R9j22PP8p9qK7P2jK3o8q9K02r7
4477A2j04L4l6J80j11O7o6M9qO5j64J59j2J3m6k3j7J6l4m3M4J8K5J0k6JM2l0n3
4506c8J0p5J18k0J06o2p2L5l5J5J9O1j62L0L9Q8r8K1k2J62n0o0O4q6M5R2k38J28
4534A5K3q4J37k05O8o2L3R5r5J43m0qm5P0p3K1J0n2L4J07p8j11J63n9p5M6j7l
$$ plain form
4333 -4 -48 -33 61 19 57 75 63 -92 -69 -29 164 -452 -213 -493 -579 -41 127 23 52 68 6 -47 24 -31 6 6 -50
4360 -50 -8 27 -59 -47 49 24 -22 -48 -7 -8 0 -18 -16 -129 5 -48 -72 -137 1 -84 13 61 54 -64 -36 -33 -9 -42 117 73
4390 73 -91 2 23 -42 -41 -21 -87 18 -33 13 -39 111 -41 14 -48 48 39 -40 -63 -40 77 36 -26 0 86 -48 21 12 -52
4419 -52 -39 -9 -12 -47 25 32 87 -53 -39 -92 76 -32 -71 56 -9 64 12 63 -27 -23 46 73 -39 59 14 -93 26 -9
4447 -9 67 2 -27 98 85 12 6 66 22 -71 -23 -50 27 -118 56 -32 67 -55 -48 30 -49 -57 -30 42 41 64 -4 -93 109 12
4477 12 -92 -58 -94 86 -25 42 -24 25 17 82 -82 77 65 78 32 9 -8 8 -26 -69 -25 -7 18 28 2 3 45 15 -38
4506 -38 -28 -103 15 -5 101 39 -33 2 -33 -18 1 62 -100 -70 -31 57 -41 -20 -42 120 70 10 74 -12 33 125 -113 15
4534 15 38 -46 91 -114 -46 -108 -75 20 -75 68 28 20 -25 45 -28 -7 3 -49 -15 92 14 -97 66 7 -68 -22 -39 -42
4562d2K7qJ21r1q8J06kp3j1P1j7lM9j10N7R9j33Q7k1J4j8Q8j40O6n4n5Lm7Q3J22
4592H0j14m1J21NK6l8M3Lj76Q7oO3q6j0k1j6J83j32O1m8l3Q8p5M6L8m9J17n0o
4621F0l6O2j31J14q9r6J10p9J0Q8O6j22j3O8j6J04Jr2K7l0P9Np7J12j86K05j11
4648C3N8n4j7j05K0Q8k2J2J0M5j37J08j19K9M5k5R1l6k2M1K5j14N5l3K3j9J0j9
4676b9N1j22J23kJ08k32J52mKj7k9pr6LJ39j57J44Q1j83J09j0M2o0n4Q4r8R3r9
4704f8M8QJK0Q1j20L9p6J05o1J2L0k6J4l8k16M55O0l24J20r3L6M2Lo8QqR9J3r6
4734@p6O1O1l1KQj60J27J48j26J01j24j4J10j9k20J80p5J19j52K2J08j10Q4L1
4759E5j13K3QK9m1p2J56N2j72L0J27r1Rm1n1M3J09m9j04O8J00j21Q9j8j25R4Q6
$$ plain form
4562 -42 -15 -23 98 7 -81 25 23 -50 -61 10 -7 -10 39 -71 -14 85 -48 39 18 32 14 102 -38 28 -26 -81 -78 -125 -42 80
4592 80 -34 -75 46 51 77 39 82 85 -91 -4 -10 53 -33 -43 -64 -80 103 -29 32 -16 -49 39 -36 10 48 -1 116 66 60
4621 60 24 86 -45 69 -20 -116 -6 -85 -75 13 79 -43 -56 12 -4 100 101 9 36 6 85 90 13 125 -61 144 33
4648 33 91 37 20 -85 -65 23 1 13 23 68 -69 39 -80 -51 -6 -31 60 24 2 43 68 -46 9 -24 -1 -20 -10 -29
4676 -29 22 -100 23 21 129 -103 49 45 47 30 1 -6 -102 -99 40 -117 27 108 -75 34 24 66 6 -48 36 -62 31 -68
4704 -68 -20 -12 -11 9 90 -30 9 -67 38 -23 -11 19 -7 7 -31 -247 208 268 -56 64 -29 7 49 52 -16 -8 -16 83 96 0
4734 0 -76 -15 46 15 17 25 -135 -8 140 14 115 -9 -23 87 68 -152 28 -47 72 -80 -58 50 -60 24 55
4759 55 -58 -35 -27 2 -39 -111 45 97 -75 -45 82 -9 0 -41 -92 -49 60 11 -93 -25 75 -46 43 25 -100 -6 80
4786H0r0km0M0NJ01q4J9N1k21R8l3P1j04J99m3j0N1j18L3P5m4Lj40P5m2O1l9j6
4815f4P3P0j07J18j74lJ01m8R8o6N9o9J03n7k0J3n7M5Q2j05k6N6p7J06j2j20M1
4842d0J0k8O5P8j76K9M4k5j1O1m2K1L0m3M5r5J91n6m7L4J8p3L2p4O1NK9l6nO5
4872F7n3j9k1p3L9m4R1LJ6R1j10n3q8J57J17q5J5r8J79j68R4j03pO6q3J95j47
4899b2L5m3o3L3N4o9K7l5jQ2OO8j00P3K5r0M2o0J70k18J00m0j3J5P9N9r5M4p2
4928iL7k9q4P2o0l8R9K8n1K7O5k7P7k3n4k1N2k5k1p2J41j88J84J7m3m0J32k18
4956g2M6J05k12J77lp5M3P4q2R8j38nm0J99k23J25m9M2K6l5P2N3p5R8j03m3km5
4984d4oP0p2P7n1M0mo8R7r8l3N8Q4j60J84n7l0l7P2j70K08j10l3j5J25Q3j48l7
$$ plain form
4786 80 -10 -12 -52 -12 -7 94 10 29 80 -141 -43 -76 -5 -109 90 47 37 88 -30 3 78 34 37 -103 -28 -70 -9 -48 -64
4815 -64 9 79 -28 90 -84 -87 14 -34 64 -2 57 -12 91 34 14 27 -30 15 97 -8 -34 22 -55 51 39 -81 -40
4842 -40 -30 -58 7 85 -91 -62 -18 -43 -54 7 -35 -14 16 -27 18 -77 114 58 11 45 63 -10 22 -52 9 14 43 7 2 67
4872 67 14 -5 -26 -99 -60 -104 -13 -10 6 97 -13 -66 -154 3 120 35 50 -48 131 -37 57 -46 -53 13 -70 125 -22
4899 -22 13 -30 -93 -60 -6 -75 -48 -83 -84 -2 4 72 -28 45 70 -20 22 -38 132 -86 14 -26 -39 -24 55 114 19 63 -9
4928 -9 28 -1 -85 -13 -73 -111 -12 16 -35 -8 57 30 107 84 30 9 61 36 15 -57 84 -104 80 97 54 14 146 -72
4956 -72 -26 79 -133 44 41 -34 9 83 1 99 -39 -44 -84 115 -108 17 -32 10 36 1 73 126 51 149 46 3 1 -44
4984 -44 -50 20 -52 25 -26 14 10 -58 39 -59 -92 -34 50 -110 74 17 -13 -50 22 -148 60 -50 -83 -98 27 110 -38 -75
5012g5N0Mk5R1J4j03P8O6j60J5J07L5o5k9l5O5k6l7k3k6J47j07J53n5j00J30j83
5039i4K19p8r4J20m0M0j16R0k9K0m4p5J82p9j42Q8N1K4rP9rn3Q5j35K1n3nl5M3
5068b8J91j76%J61j65M9Q5j2j36PM1p7J62l6j1l8j14J38J9l7q6N9O3j26R0j1J01
5095A13j26o6M6n7J1J21m6p8J46j10N2P7r9Q1j29J44n5q6O5O9j21O5J8ko8L6J4
5122A5N5J8l0j10O6m2P1m2j06j5J35O2r6j9K7r3pJ21q6N2L3Nj7qj8J9O9j36M7
5151c0K8mJ1O9Nq9j7L4K7nr7l2J35J7r6O8o9J05m5O1l4j26J48j0k0o6n3o4J57
5180Hl3J6j3q4J59j05L7L1p4R5n5P8o5m9N1N1M1l9K8q2k5l9R4m4pl3RM4nJ00j45
5211e5PQ9j4m2L8mo3J1N4m4M8j90K46j40O7p1N9N8o2Q5p2j9j34J32K9L5j37J08
$$ plain form
5012 -75 -25 -21 -46 45 59 -44 34 100 -60 -45 62 97 32 3 -32 33 7 -30 -53 -79 68 -39 114 59 -41 89 -94
5039 -94 125 47 -47 73 33 73 -43 47 18 38 -6 -81 101 22 -120 -32 19 43 34 113 104 51 136 1 22 -31 -36 -71 -28
5068 -28 163 -13 -13 148 -17 32 117 105 -31 -24 17 -60 102 66 55 17 -97 41 60 23 -63 -4 59 -67 23 12 113
5095 113 -13 -79 -33 -90 -79 42 -4 -82 64 -46 6 83 -16 65 -64 80 25 -61 4 73 -48 17 35 33 -35 1 15
5122 15 70 88 58 -52 14 -28 43 1 -105 -120 15 77 -19 -38 -11 -104 -111 10 -76 -24 9 14 -3 -11 -29 -10 59 -77 -30
5151 -30 -2 -6 5 74 79 -10 -27 7 34 29 -68 -100 35 52 -44 24 -45 60 15 76 42 -84 64 54 34 -32 -85 -149 8
5180 8 -25 -9 -22 -106 53 -52 -15 16 -58 37 -18 60 -5 -54 -3 48 89 50 78 -4 -29 -68 26 -18 -25 -58 -49 -5 -10 90 -55
5211 -55 -48 41 27 -15 23 19 -44 -33 21 -23 25 -165 81 -59 8 -63 -4 54 -8 77 5 -14 -148 -16 13 48 -89 19
5239A9P4j40O4L4J%n2k1l8L1L3l9J21j26P5N9pN0j32P9j17LL0o3K7J34j17P2j25
5268g1J1N8M8l1M5j17J1K7r7J11l5K3q0J73K8q0joO1p1J3P1n2q2n0K8O4OP5j07
5298b7oJ26j2j41l7l2J34j6O2n5J34j18j08J26l1k2P1j06J6o8L9m3J26O3q1L9
5324C3R0j71N6j0k9J73k03j6Q8m8R6m5p4Q2l1j22J53l7l4j2J21n1jO6q6p0J02
5351B0Jj4J13j59%j9J22k9KN7m3j75J25k4K4j19J01O4n7J3M0k4n5K8O2j42J42
5378E4j03L8P9k52K31k33K75m1M3K39k58k5j03j81L42k17P7O1l18Q1J05L81l19
5401d4l46J58L08n11L23L7J08k77j11K43o8J00J44m06M21J09j98k37M28m66R5
5422a90p70P76j43l8k68N87p5n1l44M16m6j32J002j197m3P92P0J02q28l7kl23
$$ plain form
5239 19 93 -47 17 51 52 52 0 -21 -59 -28 5 -34 87 -39 36 95 88 138 6 85 -32 -29 1 -62 -35 99 -18 54 -71
5268 -71 -60 -2 46 15 60 -57 -46 -19 -116 -5 -40 -17 -97 76 104 24 23 17 78 7 20 91 39 -43 -93 -65 -1 5 80 -27
5298 -27 -33 93 81 -60 -97 -129 5 -11 51 -4 130 12 -96 30 -1 -23 48 -58 -42 -110 -71 -114 12 75 -6 33
5324 33 123 -48 8 -2 -31 142 -61 -77 11 -37 59 14 -60 22 -9 -131 22 -15 -49 -61 60 9 8 74 -12 -82 20
5351 20 21 7 120 -39 -39 -58 64 35 37 94 51 -124 1 -23 1 -118 -17 47 -10 3 43 19 -36 -8 54 -88 54
5378 54 -49 -11 68 -184 47 -186 89 48 91 330 72 47 -56 -237 105 -112 -35 26 -292 -211 -106 275 -44
5401 -44 -390 -232 76 -435 -112 -75 33 -244 -355 -112 -180 -80 64 -342 79 188 -10 -247 181 -285 -190
5422 -190 -960 -184 -327 -365 -633 -46 -121 -172 -516 -100 -146 -278 724 -473 -516 276 346 448 -380 -417 -419 -742
5444g42J266m66n05O00l23J57M2l83M20q4p0J31n4qL3R7j08m3j01K07l5J9r4l3
5468g7J18m3j9K13j45o8K6M1m5L5N9m7j4O7p7q8J10r5P2K1m3j9n7Q3Om1P6Nj51
5497i7J69j68K48r4J2o4J3jk6O3j45K07j28j31J60Jj02J57o0K3o6J06j05K0N6
5522D8j34J32n9k4n5J10M7j47J00O2j90J54k3M9r0k3L6L5q8Q4j68RJ3J10r6R8
5548a0J0J06p2j3OM0O1o0r9lo6O6J3J7o1O3P3j95J27n5N0Q5j31J21k2r9%J46j36
5577c8NJ3O5K4Jk9q3J0L4M0J5j17RP0k3J21k13R2j06K25o4J9K0k13J14P1j83J72
5605E1n5J07k8j27J7j9J19q1r7J95q5l7Q2j62P4k7p3J12P4oj35K03m9j95K00l2
5631B6Lm4qM2K6m7L8j7n4J8P4l4K5n9O%%Q3j23J3qJ9ql7R9j9J36k14P2rK7q0Q2
$$ plain form
5444 -742 524 58 -447 153 -170 -13 29 -354 66 -18 -88 43 -11 -19 14 111 3 -40 -141 66 31 50 -44 -77
5468 -77 41 -2 -21 192 47 -21 5 46 1 36 95 48 34 101 24 -64 46 -49 23 44 1 -18 -75 8 14 -27 49 54 -97
5497 -97 72 -96 152 58 70 6 19 18 -8 55 -90 117 -11 -142 18 19 -83 74 14 37 -29 77 -28 -8 48
5522 48 -86 46 -13 -37 -92 18 65 -82 18 80 -110 44 21 70 -20 -43 -7 28 -60 24 -144 -135 -122 -12 -108 -10
5548 -10 0 106 34 21 27 67 128 68 -31 -34 -100 -34 -21 -4 -65 -2 71 -124 3 -52 -2 83 -48 73 51 -48 -48 98 -38
5577 -38 -33 -20 45 69 70 41 -42 -32 2 42 57 -60 -51 19 -4 117 -96 -4 -110 115 51 70 90 -123 -9 62 -121 51
5605 51 -4 103 75 -52 -35 -54 65 -16 -113 82 -3 -40 42 -120 -46 -73 -146 -34 40 34 -101 102 53 -142 58 26
5631 26 29 -15 -23 19 45 -2 36 19 -35 -17 57 23 48 -11 -5 -5 -5 78 -45 -32 -40 -21 -29 -66 33 14 150 -64 8 -1 26 -54 28
5664B8j34J13RM8o4M8o9j53K09J9n3jL2p6L2q8oJ63j62J57J3k5j27J32p4Q6LL7
5692I7j13mK8j8Q5j28Q2k7j6Qq6Q2j6Q3ml0K1N5j48R7r4O0n5J54mk16J52Lq2J
5722c3o0J81J5j25L7k2rNK5j49K03j75M8J5K5J24j06m5O7k0L8M0j67K05o9rk7
5749A2r4J11L3j50J62K8l4q4j8l0J14j00%j8J34q3o3J15Mj75J72p7J48k2j29p
5775e1J31r5n6L4M5o5R0J52k33M0n7J46j38J31K1j29JO1P4j00p1l1M7pJ22j14
5801e2J3J65j04j07L7N3j32J55l7N9r6R6Qj04K0L9M0q2j29J89o0M3n5N8M1j1n2
5828eJ03m2r9N3n4J41j86L8J33j12l0M8P7j18L9N6L5j34j05J93j08P7L3n0qK9
5854DJ8j09J13Ll0n2Q5rqK0%j71K14o0J4p1P8j10J4N0p4J34lj5j16R7o1M3j37
$$ plain form
5664 28 -106 7 16 64 0 48 -21 -174 35 54 1 0 32 -44 -12 -100 -106 57 -105 52 65 40 -87 45 -29 57 60 97
5692 97 -16 -20 8 -10 75 -53 29 2 -14 -6 -92 -10 -26 57 53 23 44 99 -49 48 -46 14 -41 113 109 -107 45 48 -34 -33
5722 -33 -93 88 103 -22 15 -7 -16 -11 14 -135 68 -107 -59 -44 -19 105 -1 -46 21 1 39 79 -88 117 48 39 12
5749 12 -82 29 62 -88 74 102 68 -16 -34 -64 50 -50 -50 -68 66 -17 -80 35 39 -136 36 -41 107 85 -44 -51
5775 -51 80 -15 -71 -37 8 -57 33 185 -48 -8 -65 81 -57 74 95 -34 -33 28 102 2 -69 -100 -53 -60 62 -52
5801 -52 -39 126 22 -85 -48 5 -127 28 -9 50 -46 50 58 -46 -26 13 53 -29 -158 31 -29 14 -41 17 58 47 -5
5828 -5 98 56 -43 10 -44 97 -89 -51 82 -30 -60 -12 65 -53 -14 42 77 -57 -162 31 -77 0 33 -17 -25 4
5854 4 22 -87 26 29 -1 -53 32 23 15 35 35 -136 78 18 32 -39 39 -71 -57 -7 -81 53 50 35 -81 16 -45 -2 -139
5883a39J67j07K17j09p1p5P9O5j10P8L7p0K7q4J46lj10K7Q8o1o5J28j7p1j6J13
5909F4j27j5P1QjJ4k0j0J4P1m5rl2J57j63J63j78J3LJ0j08P4K6P0qJ7q3j7O3l
5939A9J8Kj2o4J17j19J15r9M8N6l1%K7K4mj55J26j28JO2K7k8m3N2q9L3Q8K7l2
5968C8m4J2n0J34n4l7m2O1j15L1J9N3L0Or3K8J05j24O2N9k2j24J6QKn4J42k6l7
5997a6J4J5l3O3n3N8r5Q9j66R1n1K6M6M8P0j99J41m3K1q0r3K00m2n9J3M1J9M3
6025F8n2j85J65J11j34m2R0p4l7Q7J7p9J83k03J34n4j4%k5K9J29k05P9j5L3n3
6051d7J8j51J24J94j57J24j42K2q8j66R5j7j86N6N13j39l21J96P5J234q59n22
6073a44M37p63Jr3L09K03m49O79l39J7j29O11l11K33j72j84M40l35K17Kp36M94
$$ plain form
5883 -139 28 -79 138 29 -42 -117 -38 27 -83 -5 32 -38 -11 -95 51 48 -62 -35 53 -8 -73 55 38 -33 -49 64
5909 64 -63 -78 -7 1 0 14 -6 -16 -2 69 24 15 -17 140 -23 140 -38 -25 -22 -12 -120 -46 -20 50 42 59 -24 -41 22 19
5939 19 37 39 27 -37 80 -39 76 -23 25 81 50 50 77 101 97 -58 68 -60 -59 3 30 2 -41 11 -78 -45 43 70 38
5968 38 -6 6 -44 90 36 -1 -43 18 -97 -66 -47 6 36 42 -51 -23 82 -42 20 79 57 -67 -51 -43 -41 -95 47 21 -16
5997 -16 -2 13 -20 43 -10 48 -47 42 -124 -33 -84 -58 -12 36 106 -93 48 5 26 -54 -147 53 11 -48 -35 6 25 68
6025 68 16 -169 -4 107 -27 -69 21 -53 -90 -3 14 -65 118 -85 49 -5 -19 -19 -44 -15 114 -91 -12 -27 6 -47
6051 -47 -29 -180 -56 138 -19 105 -37 -15 -103 -269 -174 -191 -377 -321 192 53 -268 -72 3 1237 378 -144
6073 -144 293 -470 -469 -562 -253 -50 -499 180 -159 -142 -271 340 29 262 90 -94 346 11 228 230 -506 -12
6095a2K09n00K15K48J04k67l09K37K72m44M83k40n28P44k58K0J91l47l4K39j42
6116a19J01J26k37J77k81l95P64J47K1n34K96l50M60k14K16n2n9j78P4J6J39J5
6138A33j82j0R8j01M7r4J42n9J4j18O0N0Q4L6j00k2J23k9q6O7q3M4l5J09j65R9
6164B2L2j61J87j24O8J9o8P4l4l0Q7l7N0r7p9J85mj21lJ5kL0Jj0j4r2J52r9Q4
6193C1j30J25l6n5p5K71p2j18K3j3Pn7O7lL3l3P7J38j02q1K3m0J25q6L2j04n1
6220a04jO8J39p7lM2l1k1o2J41k85J45k0J9nL9k5MJ01r5k7P2J55p0k35J62mO2
6248H4k8R3j08j02J42m6l4Q7lj0q0j2J9P6j45J70j40R7k5o4K1j2j1k4R0n4N4j6
6276A9j46J84j16k8J61k2o8l3J44j84J83j29K4j1Q2np0POO7l5J13j54j9l7P5L9
$$ plain form
6095 -12 197 -303 -88 160 264 -3 -312 -75 197 -247 236 -4 -532 212 -46 -26 165 -182 -216 23 -119
6116 -119 -18 108 -129 48 -233 -628 136 283 304 -230 66 -284 176 -38 178 126 67 -111 -37 -21 118 133
6138 133 -49 -59 39 -62 -15 -109 33 -26 -12 -130 -70 -20 64 100 0 -22 101 72 -14 53 -30 14 -21 88 -77 22
6164 22 54 -107 80 -44 24 43 -25 49 15 -15 72 35 85 -12 -91 94 90 -31 -34 -19 -21 9 10 0 -14 -106 46 -53 31
6193 31 -99 26 -10 -65 -140 131 59 -59 -36 -49 -42 -99 -32 -35 -2 -35 42 180 78 -3 20 -20 105 19 51 -53 -104
6220 -104 -105 -37 102 25 22 64 33 12 -50 91 -194 -49 -69 -50 -55 -16 -41 -37 64 -31 -58 14 169 99 -136 26 22 84
6248 84 56 149 41 -61 81 35 1 88 85 75 -5 -17 2 78 -67 103 -37 60 35 -29 -8 -20 -31 -55 35 -19 35 19
6276 19 -127 57 -59 -87 74 52 -16 -49 95 -89 94 -35 -11 -22 60 55 -15 -8 -2 65 30 143 -11 -30 -67 8 47
6303D7J8j5K3q5K8p0Q1n1J06q2O5j3o8J02o3j39J50r4NO9q9N8J7K6mp9o5N9j5
6332g8J86o4R2l2j83OM0M3k7pRJ48o7j71K17j7j36R6l8o0O8k6J29j36j9m2O6M5
6360D2j07N6l5n5J21lr5o0P7J01m4LkN2J8mL2n4L0j26J09r1K9n3J48n4q8rO8j01
6390i5P7M6P9n9o3j7K6j00R4n0J51j90N8j9M1M8m2kK4n7N7k3%k5P8m7L0M2j40
6419g8N8k8L0rJ52k05J48n6P9q6P3m1K3r1n7Q4o7q0K11m1K8p1n1Q7J9q2q9J46
6447Flk3J9m7O6k4j5K6J1P2j09R7m0P0j80k3M3J75j08l8L6n4mJ10j10j9N3Q1q9
6476b1N1q3L4K7Rq7K05j04k1n3p1J25j6o9J3Q0m7J3O3j06J07k8L5l8m8J04q8O8
6504E4n7L7J7j23R1Rm2n0j3j6J06j4%M3r4L5KP2j10J01l7l1P5j12R2n4N4j1L0
$$ plain form
6303 47 65 50 73 -12 16 -54 27 -24 82 0 65 52 -16 86 23 -116 34 -60 -55 14 -75 -17 0 26 22 -57 -122 -63 -78
6332 -78 108 44 136 104 -79 -73 -33 10 -17 -24 -15 133 66 -105 112 95 -41 55 17 -43 25 -1 128 -8 -27 -69 -3 42
6360 42 -65 -9 -44 -99 22 19 -76 -136 -59 42 -2 1 -1 51 69 65 97 43 73 -53 56 -35 -6 -59 89 35 -53 -62 6 -95
6390 -95 -18 28 107 48 -15 -32 -6 -106 -12 -62 89 -101 -43 -62 -21 27 -15 -17 7 -50 7 -16 -16 -41 37 -10 20 62 -78
6419 -78 -20 -48 -18 -27 125 -80 68 12 91 5 78 37 60 -31 -88 -4 -71 -151 60 19 47 -24 -75 12 31 -51 -140 6
6447 6 3 -20 -1 -48 18 -6 -21 5 16 88 -21 76 36 106 -74 -97 -54 121 13 -25 11 -43 -47 63 -47 -66 -13 68 -21
6476 -21 30 -53 -19 8 17 -70 135 31 10 -43 -114 11 -5 -74 -61 19 -28 -15 48 -58 49 21 56 18 -30 74 -14 54
6504 54 -3 34 51 -72 19 28 -14 -64 -77 -93 13 -1 -1 42 -52 -17 -15 57 -53 48 11 -20 55 -57 35 -19 35 24 54
6533E4n0j02J41o7n2K4L8J4M7L2j15M1K6o3R9j35mj9J14m5O4q3J06p1J3LK2q0
6561d8O3K8J6Mj30m8R3O4N6q8jJ0k2q5LJ59n2N6j42J59o2J9o9K5m3%J9rJ23J1
6591A09q4Q9k33J04l1J13m3l5L7n9K9K4j6r1R1L9k8p0N8Kk6M7Pm3l2Q7j9L5r0
6620b9k5M4rL4m0N7l5Jp4M2L2R2r4M1kJ7j83J92oj61K5Q0l3K1n7j5K7J32k34J35
6650b5k3J8R6j25J05j09P5j0R8k9j06n3L8Q1m1J21k02O6j7R1r2L1K0k8MpQ4j6
6678D5o4M0l4K6n1Q8j32R8p5K1J19o0lj37J72J1k2nqj15M2J49k00L7O9j30J66
6705D7j00J41Q9j30n5J51J3j40KO5j18R9k07O9Q9k3r0K12j00K8o8J14p1j4j7Q4
6731G0J2r8n5J24n9J8pj8N0Q2j08l5J46j27M2p9J6J01j08m8M7N3K2k1k5Jl5k0
$$ plain form
6533 54 4 -98 43 -24 -76 -52 -14 0 47 79 -36 5 31 -32 67 -68 -72 -91 23 -22 42 -41 65 -6 7 10 32 -48
6561 -48 15 43 59 63 -67 -115 -22 42 98 10 9 19 -3 -88 -85 74 22 78 -64 95 33 52 -17 8 -35 -35 -16 -25 98 109
6591 109 25 114 -119 -15 -46 67 24 -11 26 -33 -4 20 4 -87 4 43 15 -55 3 5 -21 26 33 -10 -42 45 26 61 -29
6620 -29 -54 -10 -19 15 -25 32 -3 -2 -76 -34 -2 90 -4 37 35 52 -131 61 55 -106 -81 -1 -34 -13 -70 -85 -58 74 -160 -25
6650 -25 -48 -30 66 -59 46 -63 12 2 100 71 -35 -88 -50 31 -10 111 -91 -25 -42 49 -43 -12 8 -20 -16 -23 61 45
6678 45 -19 21 -13 13 -38 50 -82 16 -59 -38 81 21 18 -119 53 64 42 37 29 -86 -44 105 -95 -58 11 -119 47
6705 47 -53 88 177 47 -8 143 156 16 18 83 -35 64 -143 -74 15 -8 -98 114 14 42 -26 88 17 3 -14 70
6731 70 82 -16 -71 53 -6 12 5 -13 37 119 11 -24 122 -5 37 -42 -26 75 -33 -81 -34 19 41 20 -5 -4 -39 -59
6759e9k7K22j46m9K10j69R2o8Qk3K5J05n5n3j43J52j1J5j5l9r7J97p2pn2K7nQ
6787b9L4j24J52q7R8p7m5J65j21N0l5Q5k1k7l5lL9k0n6qj4k5P5n6J8N4k1J26n8
6816C4j61J17pN2o7O6k3p0j3J0J65r8Q0n7J5Kn1P2j9l7J02j61K1kjP1p5J4O2l4
6846GK1M4m3j20R0Jn8llK2J76q5Mk7j0q4l8J61mq4NO1l6k7Mk3K4l2J10j24Q4J5
6878B8k7q3OJ7O8l2n1J04l5O7n9m0N8k1l6KR9o5K8m8q6J37j0j1M2k01J22L3Ol3
6908b1O2O5j92J04L4j4j42L5O1J7K3n3R8j63R7k0l7R7K4r8LP7J9r9O6j39L2J15
6936E1L6m2m7J9M6j18QO6J5K7r4k4M4j2mQ7p6N2o4Q3K9j06L5M6kj35P9J03r4R
6966A7P4K1p2k8r9K19j69o3J01k0P5q6n6Q2n4R5J17k07m8M2P5m2m4j3J66j88K2
$$ plain form
6759 -59 -86 136 -10 -59 151 -18 74 6 14 -9 16 121 66 13 -130 22 11 26 11 -28 -125 72 0 -7 -59 -32 -37 -29
6787 -29 5 -119 33 -54 44 -33 -78 87 -34 16 -19 66 45 18 -17 -20 19 -1 -57 -65 -79 -104 -29 -85 -67 -13 -34 92 34
6816 34 -127 -10 -17 35 -32 34 11 -59 -72 -62 103 5 85 28 43 45 -6 66 47 10 112 -49 -28 -30 -31 40 -35 -21 41 7
6846 7 28 72 29 -91 -1 0 -58 -61 -64 -42 134 49 53 26 16 -68 -106 55 51 -33 -28 33 -3 -30 -26 -49 -25 -57 53 -71 13 28
6878 28 1 -82 -76 -59 9 -23 -74 30 -5 62 3 -37 21 0 -36 -34 65 0 28 -20 -106 31 21 10 52 -149 -27 6 12 -21
6908 -21 41 106 -86 18 52 38 -104 -69 -8 9 32 -21 77 -86 11 -9 -46 51 75 -23 -20 57 76 -23 43 -96 -64 51
6936 51 87 45 -2 17 63 -55 -47 19 34 61 -33 -57 -13 -25 -29 58 -18 34 -30 53 82 -24 11 57 55 -80 -1 102 8 17
6966 17 91 112 40 12 -87 132 -37 -100 1 -19 56 -30 -86 -4 -58 37 154 -53 -101 -59 16 -26 -70 -83 83 -105 -83
6993h3K0R7j3J6k8M5j69J30j1%o5J24n2mL0K2n8mP1p8J4N9n0K2r2R7J6q1OJ64
7023A45j83J31n5p0R7j43j1K07o5L9o3l7l4K8m2J25jp3K8o1J13j09R1j27P9QJ0
7050B7J7j02J18r3L9j4M6p8Q1o9J16j48J31Jn1j8o8M6nR6j06j3MJ42j06R6j69
7077h0M7J2mPJJ4n2Q5lK6Qn1M4J8l4j2q4J92K5l7j68pJ20l5q7J02j05P1L8l9J9
7108C1OoK8qj64l5J27P0q1J3PL4j30R1N7n7k6O4Q7j74O3N2o3J30j78Q9km3J44
7137A26j12K0j28R2j19J08J5j01L4J8J08l9j52K92k07J18n1r1l7M3J26j33J61
7160I1j08qj2M6n1oM0%KRj5J09j86p8K39o4Qj12R6P7q5j4O2K5o8j64P8J18q7L
7190e5Q4Rl7l7kk0R6OM4k06J50n4j06J03n5J23k7Jp4R1m8m0qk2Q2K7L9q8L4N7
$$ plain form
6993 -83 -63 34 21 37 9 54 -115 15 4 4 -61 63 11 7 37 59 1 -3 68 -10 4 63 13 35 -57 40 56 -25 -19 145
7023 145 -38 93 38 -32 65 -78 -89 118 53 92 29 -8 -42 -14 -56 69 68 -5 23 -38 75 -34 57 -70 9 17 27
7050 27 44 -58 60 -33 6 -8 38 -40 41 -28 88 -60 71 72 21 3 -65 -19 -24 72 -34 -47 -43 99 -7 89 -80
7077 -80 -33 -21 -25 -18 -17 -3 -55 30 27 53 61 10 54 72 38 26 -58 134 159 122 -46 -53 67 32 -55 47 -58 13 51 12 31
7108 31 37 31 59 51 -113 -148 -21 49 -32 -19 -12 22 -108 -17 40 -17 -43 21 108 -66 -3 49 -14 116 -62 27 25 -18 126
7137 126 14 34 -94 -2 -121 -13 2 -99 -65 -47 61 22 -130 162 -45 73 22 -69 -106 -63 63 -70 91
7160 91 -17 -25 -37 9 -42 -48 -8 -8 -6 3 -12 97 -89 -167 72 8 16 -96 0 77 -8 -22 40 65 -3 -167 -89 29 -58 -55
7190 -55 29 38 1 -36 -38 -58 38 44 88 -118 32 -22 -128 -25 -80 43 16 17 -57 34 -14 -54 -62 -84 -2 25 64 -24 10 67
7220F7J28j89k5L8K2j5j06J08M0n5pj7MjO1m8n9J43q7k6J64j70P6q0M4N9J2p9
7248BK5r4O9o8P4L9l6l7J16j45J09k3j34J7L5N2j3j3J1m3K7n3%O9l9P6o4J29j36
7277d8J3n3J25l5m7O6m9k5J02P5l1j90J32O3p8j3k4%%l3J06k7r1J09m9n1O7L9
7305E3k9M5k0N9q7l5l0M4K9p7r1R9n6qJ81j03j02J00P3Q4j64l0L1N3N2o1oK6n4
7334b4l5J72k40M0J05mQ0p5Nn6J07l9j25J32l9r0K2J26n8l5J0L3qL7j9n6J1Nl0
7363d8N9PN0l1m6J42l4k8j41M6R4r5N9Rj6j36J55p4J34k10R2JO1j34p6K23Mk2
$$ plain form
7220 67 195 6 -19 19 41 26 -80 28 68 13 6 -11 -7 -8 53 5 -54 89 2 -24 140 -30 46 -34 10 69 81 2
7248 2 27 -67 2 -66 8 47 11 -26 90 -55 54 31 -103 -86 -51 1 -12 -25 -14 -57 -30 -83 -83 -14 -53 23 -41 88 -48
7277 -48 -35 -88 37 2 -45 21 -28 -53 49 124 93 -97 35 98 20 7 -17 -17 -17 -50 56 29 -62 47 -2 -53 14 53
7305 53 24 69 49 108 21 -14 -44 0 29 -48 -139 -40 -96 -104 77 -26 -128 -28 45 129 -35 -65 -34 19 71 10 4 30 -24
7334 -24 -59 113 -127 -87 18 14 94 19 24 -32 75 36 -89 43 4 -86 -64 62 4 -31 -21 12 4 41 22 -34 -23 -18 -48
7363 -48 11 18 68 37 -9 133 99 71 -70 -24 70 -25 34 43 27 -109 46 -28 106 -104 -12 -11 50 -84 -160 63 67 45
$$ [...]
8191F5
##END NTUPLES=NMR FID
##END=
