##TITLE=1H_DE-80H_X3
 200.13MHz, d2o
 8 sc
 
 19ns.26.2.2025
##JCAMPDX= 6.0         $$ Bruker NMR JCAMP-DX V2.0
##DATA TYPE= NMR FID
##DATA CLASS= NTUPLES
##ORIGIN= UXNMR, Bruker Analytische Messtechnik GmbH
##OWNER= pz
$$ XWIN-NMR		Version 3.5
$$ Wed Jul 22 16:04:56 2026 Russian Standard Time (UT+4h)  Yarkov@DPX200
##.OBSERVE FREQUENCY= 200.1313
##.OBSERVE NUCLEUS= ^1H
##.DELAY= (6, 6)
##.ACQUISITION MODE= SIMULTANEOUS
##.ACQUISITION SCHEME= undefined
##.AVERAGES= 8
##.DIGITISER RES= 18
##SPECTROMETER/DATA SYSTEM= spect
##.PULSE SEQUENCE= zg30
##.SOLVENT NAME= CDCl3
##.SHIFT REFERENCE= (INTERNAL, CDCl3, 0, 14.3821)
##AUDIT TRAIL= $$ (NUMBER, WHEN, WHO, WHERE, WHAT)
$$ ##TITLE= Audit trail, XWIN-NMR		Version 3.5
$$ ##JCAMPDX= 5.01
$$ ##ORIGIN= Bruker BioSpin GmbH
$$ ##OWNER= Yarkov
$$ C:/Bruker/XWIN-NMR/data/yarkov2/nmr/H-C/1/audita.txt
$$ ##AUDIT TRAIL=  $$ (NUMBER, WHEN, WHO, WHERE, WHAT)
(   1,<2026-07-22 16:03:49.20 +0400>,<Yarkov>,<DPX200>,
      <created by zg, POWCHK disabled, PULCHK disabled
       configuration hash MD5:
       00 E9 B6 7A A2 85 ED C7 34 08 36 98 17 FE 4E 26
       data hash MD5: 16K
       70 36 1C 99 8E 11 E9 3F 5E BD 47 04 FB 86 DA 18>)
$$ ##END=
$$ 
$$ hash MD5
$$ 8D 6B 90 C8 8B DB 16 C8 37 EC 92 C0 BA 06 F9 F0
##$RELAX= 
##$RELAX= 
##$RELAX= 
##$RELAX= 
##$RELAX= 
##$RELAX= 
$$ Bruker specific parameters
$$ --------------------------
##$DU= <C:/Bruker/XWIN-NMR>
##$EXPNO= 1
##$NAME= <H-C>
##$PROCNO= 1
##$TYPE= <nmr>
##$USER= <yarkov2>
##$AMP= (0..31)
100 100 100 100 100 100 100 100 100 100 100 100 100 100 100 100 100 100 
100 100 100 100 100 100 100 100 100 100 100 100 100 100 
##$AQSEQ= 0
##$AQ_mod= 1
##$AUNM= <au_zg>
##$AUTOPOS= <>
##$BF1= 200.13
##$BF2= 200.13
##$BF3= 200.13
##$BF4= 200.13
##$BF5= 200.13
##$BF6= 200.13
##$BF7= 200.13
##$BF8= 200.13
##$BYTORDA= 1
##$CFDGTYP= 0
##$CFRGTYP= 5
##$CHEMSTR= <none>
##$CNST= (0..31)
1 1 145 1 1 1 1 1 1 1 1 1 1 1 1 1 1 1 1 1 1 1 1 1 1 1 1 1 1 1 1 1 
##$CPDPRG= <>
##$CPDPRG1= <>
##$CPDPRG2= <>
##$CPDPRG3= <>
##$CPDPRG4= <mlev>
##$CPDPRG5= <mlev>
##$CPDPRG6= <mlev>
##$CPDPRG7= <mlev>
##$CPDPRG8= <mlev>
##$CPDPRGB= <>
##$CPDPRGT= <>
##$D= (0..31)
0 0.7 0 0 0 0 0 0 0 0 0 0.03 0 0 0 0 0 0 0 0 0 0 0 0 0 0 0 0 0 0 0 0 
##$DATE= 1784721828
##$DBL= (0..7)
120 120 120 120 120 120 120 120 
##$DBP= (0..7)
150 150 150 150 150 150 150 150 
##$DBP07= 0
##$DBPNAM0= <>
##$DBPNAM1= <>
##$DBPNAM2= <>
##$DBPNAM3= <>
##$DBPNAM4= <>
##$DBPNAM5= <>
##$DBPNAM6= <>
##$DBPNAM7= <>
##$DBPOAL= (0..7)
0.5 0.5 0.5 0.5 0.5 0.5 0.5 0.5 
##$DBPOFFS= (0..7)
0 0 0 0 0 0 0 0 
##$DE= 6
##$DECBNUC= <off>
##$DECIM= 32
##$DECNUC= <off>
##$DECSTAT= 4
##$DIGMOD= 1
##$DIGTYP= 9
##$DL= (0..7)
0 120 120 120 120 120 120 120 
##$DP= (0..7)
150 150 150 150 150 150 150 150 
##$DP07= 0
##$DPNAME0= <>
##$DPNAME1= <>
##$DPNAME2= <>
##$DPNAME3= <>
##$DPNAME4= <>
##$DPNAME5= <>
##$DPNAME6= <>
##$DPNAME7= <>
##$DPOAL= (0..7)
0.5 0.5 0.5 0.5 0.5 0.5 0.5 0.5 
##$DPOFFS= (0..7)
0 0 0 0 0 0 0 0 
##$DQDMODE= 0
##$DR= 18
##$DS= 0
$$ [...]
##$SUBNAM2= <"">
##$SUBNAM3= <"">
##$SUBNAM4= <"">
##$SUBNAM5= <"">
##$SUBNAM6= <"">
##$SUBNAM7= <"">
##$SUBNAM8= <"">
##$SUBNAM9= <"">
##$SW= 18.0517328524113
##$SWIBOX= (0..15)
0 0 2 0 0 0 0 0 0 0 0 0 0 0 0 0 
##$SW_h= 3612.71676300578
##$TD= 16384
##$TD0= 1
##$TE= 0
##$TE2= 300
##$TE3= 300
##$TEG= 300
##$TL= (0..7)
0 120 120 120 120 120 120 120 
##$TP= (0..7)
150 150 150 150 150 150 150 150 
##$TP07= 0
##$TPNAME0= <>
##$TPNAME1= <>
##$TPNAME2= <>
##$TPNAME3= <>
##$TPNAME4= <>
##$TPNAME5= <>
##$TPNAME6= <>
##$TPNAME7= <>
##$TPOAL= (0..7)
0.5 0.5 0.5 0.5 0.5 0.5 0.5 0.5 
##$TPOFFS= (0..7)
0 0 0 0 0 0 0 0 
##$TUNHIN= 0
##$TUNHOUT= 0
##$TUNXOUT= 0
##$USERA1= <user>
##$USERA2= <user>
##$USERA3= <user>
##$USERA4= <user>
##$USERA5= <user>
##$V9= 5
##$VALIST= <valist>
##$VCLIST= <CCCCCCCCCCCCCCC>
##$VD= 0
##$VDLIST= <DDDDDDDDDDDDDDD>
##$VPLIST= <PPPPPPPPPPPPPPP>
##$VTLIST= <TTTTTTTTTTTTTTT>
##$WBST= 1024
##$WBSW= 4
##$XGAIN= (0..3)
0 0 0 0 
##$XL= 0
##$YL= 0
##$YMAX_a= 120986
##$YMIN_a= -159857
##$ZGOPTNS= <>
##$ZL1= 120
##$ZL2= 120
##$ZL3= 120
##$ZL4= 120
##$ABSF1= 10
##$ABSF2= 0
##$ABSG= 5
##$ABSL= 3
##$ALPHA= 0
##$AQORDER= 0
##$ASSFAC= 0
##$ASSFACI= 0
##$ASSFACX= 0
##$ASSWID= 0
##$AUNMP= <proc_1d>
##$AZFE= 0.1
##$AZFW= 0.1
##$BCFW= 1
##$BC_mod= 2
##$BYTORDP= 1
##$COROFFS= 0
##$CY= 83.5205535888672
##$DATMOD= 1
##$DC= 2
##$DFILT= <>
##$DTYPP= 0
##$F1P= 10.8118882576601
##$F2P= -7.23987719738617
##$FCOR= 0.5
##$FTSIZE= 0
##$FT_mod= 4
##$GAMMA= 1
##$GB= 0.15
##$INTBC= 1
##$INTSCL= 1
##$ISEN= 128
##$LB= 0.25
##$LEV0= 0
##$LPBIN= 0
##$MAXI= 10000
##$MC2= 0
##$MEAN= 0
##$ME_mod= 0
##$MI= 1.114404
##$NCOEF= 0
##$NC_proc= 0
##$NLEV= 6
##$NOISF1= 3.799351
##$NOISF2= 2.8
##$NSP= 1
##$NTH_PI= 0
##$NZP= 0
##$OFFSET= 14.38212
##$PC= 1
##$PHC0= -7254.183
##$PHC1= 2.82197
##$PH_mod= 1
##$PKNL= yes
##$PPARMOD= 0
##$PSCAL= 0
##$PSIGN= 0
##$REVERSE= no
##$SF= 200.129724274929
##$SI= 16384
##$SIGF1= 3
##$SIGF2= 2
##$SINO= 400
##$SIOLD= 16384
##$SREGLST= <1H.CDCl3>
##$SSB= 0
##$STSI= 0
##$STSR= 0
##$SW_p= 3205.1282051282
##$SYMM= 0
##$S_DEV= 0
##$TDeff= 0
##$TDoff= 0
##$TI= <>
##$TILT= no
##$TM1= 0
##$TM2= 0
##$TOPLEV= 0
##$USERP1= <user>
##$USERP2= <user>
##$USERP3= <user>
##$USERP4= <user>
##$USERP5= <user>
##$WDW= 1
##$XDIM= 8192
##$YMAX_p= 0
##$YMIN_p= 0
$$ End of Bruker specific parameters
$$ ---------------------------------
##NTUPLES= NMR FID
##VAR_NAME=  TIME,          FID/REAL,        FID/IMAG
##SYMBOL=    X,             R,               I
##VAR_TYPE=  INDEPENDENT,   DEPENDENT,       DEPENDENT
##VAR_FORM=  AFFN,          ASDF,            ASDF
##VAR_DIM=   8192,          8192,            8192
##UNITS=     SECONDS,       ARBITRARY UNITS, ARBITRARY UNITS
##FACTOR=    0.0002768,     1,               1
##FIRST=     0,             0,               0
##LAST=      2.2672688,     0,               0
##MIN=       0,             -159857,         0
##MAX=       2.2672688,     120986,          0
$$ Real data points
##PAGE= N=1
##DATA TABLE= (X++(R..R)), XYDATA
$$ [...]
1189b589L94O49J432j14j270n01K5J080K324Q99P9p05j375k48N88P42Q88p96j851
1208c49j260j159M31J747M49k39n19j088L62J202J378J418K7j172p54l38K54J479
1226A869m95o38j061k201O10M9J095P66m22j227J50j10J527J927N28l68n87j319
1244I3Q9R87O11K85j389j977o81p50Q05J500M3l64o40q47Q18J501J313J126k57
1263B266j237k32k50P32R27o18q29j439j504K5O41O02M59q23p26J64N51J506J629
1282A844J24k00o23q80O79Q86L11M3j500j739p24j77Q17R09n91o01n82n45J212
1301a337J431J141Q72p13p90O7K58R85Q32q95j054j366j209L76N00K71l2j075
1319a738q20L90O85J581J268j67j48m42k81J045R03k0k43j364j386l87j02P39
$$ plain form
1189 -2589 -2195 -1546 -114 -228 -1498 -1999 -1974 -894 1430 2329 2408 1703 328 80 668 1410 2298 1502 -349
1208 -349 -1609 -2768 -2337 -590 -141 -380 -899 -1987 -1625 -423 955 2373 2400 1228 474 136 390 1869
1226 1869 1374 736 -325 -2526 -1916 -1867 -772 -6 -428 -1655 -1505 -1615 -88 1839 2367 1999 1412 93
1244 93 182 1169 1780 2065 676 -1301 -1982 -2732 -1927 -427 -384 -748 -1388 -2235 -1417 84 1397 2523 2266
1263 2266 1029 797 547 1279 2206 1588 759 -680 -2184 -2159 -1518 -916 -457 -1280 -2006 -1842 -1291 215 1844
1282 1844 1968 1768 1145 265 944 1830 2141 2184 684 -1055 -1779 -1956 -1139 -230 -821 -1422 -2004 -2549 -1337
1301 -1337 94 1235 2107 1394 604 671 929 1914 2746 1851 797 -569 -1778 -1402 -902 -631 -663 -1738
1319 -1738 -2558 -2168 -1483 98 1366 1199 1051 609 328 1373 2276 2256 2013 649 -737 -1124 -1226 -487
1337d87M26j073n32p84k06J400J385Q11M14o24n59M87M39J192M70r26j047j116
1355c30r88O85L59j31k49j248m98L96O17J320Q14j12k14k22J37J236P92R1o83
1374A772j295r52l4R9M20m3j135o12o22J66J306R33N29J89p78n5P17O93R82J83
1394B463r41r45p37n24P91qk86n26j180m97O54N57J008N83l18j34QL61J288L58
1414A975Q3n08j205n00J83K6K89m51r28p83m22L36J266M69K00qn72J58J070O62
1434A340P94M5r45p94m80o6N88k6m88n49j302o3N34L90R78n7l03j64K05P74J198
1455A609K19r6m97j093n2L13l3K91m43j184o73k98N53J002K78r4k49m97O19R15
1475E90M48P72j79r58l72k86K71N57j56o81q05j002K61N69L64N42j59n28M9L36
$$ plain form
1337 -487 -61 -1134 -1666 -2450 -2656 -1256 129 940 1354 730 171 658 1097 2289 2759 1833 786 -330
1355 -330 -1318 -633 -274 -405 -654 -1902 -2400 -2004 -1387 -67 747 635 421 199 336 1572 2364 2455 1772
1374 1772 477 -475 -509 -410 10 -33 -1168 -1780 -2402 -2236 -930 3 532 721 -57 -112 605 1298 2280 2463
1394 2463 1522 577 -160 -684 107 99 -187 -713 -1893 -2390 -1736 -1179 -171 412 94 -40 -32 329 1617 1975
1414 1975 2058 1550 345 -155 28 54 343 -108 -1036 -1819 -2241 -1905 -639 -170 30 22 -550 -392 678 1340
1434 1340 2134 2179 1234 440 -40 -106 482 456 -32 -581 -1883 -1946 -1412 -1022 -44 -101 -404 -568 -363 411 1609
1455 1609 1828 1732 1235 142 90 403 370 661 218 -966 -1639 -1937 -1384 -382 -104 -198 -447 -944 -325 590
1475 590 1038 1810 1631 673 301 15 286 843 687 6 -799 -1801 -1540 -971 -607 -65 -224 -752 -703 -367
1495c67P40R43J23k1p06o49J55L78J51P9q20j199j95J4L59P83pj45l40j71O43
1516b52Q15O63M85m91p81q8j31K82N29m26o61p70o19J84M73L18M36m21o50M44
1536f61K02O73R01K33m06m38l35L55K58R2J5q75r46j5j10L88O95k93n22k68k3
1557a080P39O20N42L38o51m11J99L4M11N18n37p26m84m67J80N45J45J00q49m50
1577a284L27M27O82O51l61k91N0l84O30M73Q7j98p41n91J90p0L96M35n98n18j15
1598h03j25N36N74J59K60o64k49K71M0P68K05n94n18j57k26M21N48k11k04m91
1618d60l18L63J39O21M61n69l93j66j63O09M92j24k02p38l76M49J7Q10M8p43j83
1639d26j63L23K92R08K48r76k23p52R38n72M35J243k225O47K02l12j0N02l95K81
$$ plain form
1495 -367 373 1316 1439 1418 712 63 218 596 747 826 6 -1193 -1388 -1374 -1015 -232 -239 -384 -724 -895 -252
1516 -252 563 1226 1711 1220 439 351 220 502 1031 605 -56 -826 -1445 -1261 -788 -470 -34 -455 -1105 -661
1536 -661 -459 214 1115 1348 942 504 169 524 782 874 889 14 -932 -947 -1057 -669 26 -267 -789 -1057 -1080
1557 -1080 -341 279 821 1159 508 97 296 330 741 1259 722 -4 -488 -955 -775 -230 -85 15 -834 -1284
1577 -1284 -957 -530 152 803 442 151 201 -183 447 920 1007 809 68 -523 -333 -403 -7 428 -170 -688 -803
1598 -803 -928 -392 182 341 601 -63 -312 -41 -1 767 972 378 -140 -297 -523 -102 446 235 31 -460
1618 -460 -778 -415 -276 345 806 237 -156 -322 -485 124 616 492 290 -448 -824 -375 -358 452 500 -243 -426
1639 -426 -589 -266 26 934 1182 206 -17 -769 169 -403 32 1275 -950 -303 -101 -413 -423 79 -316 -35
1659c5m18j74M85N07M39R2o53r2k62K7L76J49j24l21p31j58J29L45M16R3n34O2
1681c82j25J77Q43J61J02j91m64j02M03J16J94k78n94l11l40J9O55qk06k6n24
1702h81J95N26M18L51L4l75p9q3K01N44m2l12l56o84q0K10K27J05j85m13j59K48
1724e90K68O65J23r6p5k92J13M43K58J81l83o85k34r5J1K79j0k07j80l38J85N32
1746a27K64K92m0m84J04J40J72M41k3k85k80n50O0K89K6R5k62n62j5J99K85O01
1768C40nj41k25j7J83M18J33p2k56n81m9j24J95K06q5k23j79l20L30M99J32J60
1790C19k1l81L19M9K32L89k90m49j99m15M4L12j00P0l83m61J26J90N88M06j14
1811B31M1q0o4M04L67l1j32m10m13n2o8J19J28m93k41j46k36N48L53J70J88j71
$$ plain form
1659 -35 -453 -627 -142 365 804 896 243 151 -111 -84 292 441 317 -4 -735 -893 -764 -419 -3 90 -444 -382
1681 -382 -507 -330 513 674 776 585 121 19 422 538 732 454 -140 -451 -791 -772 -117 -125 -331 -357 -881
1702 -881 -686 -160 258 609 643 268 189 106 307 851 809 497 141 -543 -623 -413 -186 -81 -266 -679 -838 -590
1724 -590 -322 343 466 370 295 3 116 559 817 998 615 -70 -304 -399 -388 -109 -119 -326 -506 -844 -659 -127
1746 -127 137 429 389 -95 9 149 321 762 739 454 174 -376 -316 -27 -1 94 -168 -730 -745 -546 -261 340
1768 340 335 194 -31 -48 135 553 686 614 358 -223 -272 -396 -201 5 -80 -303 -482 -802 -472 27 159 319
1790 319 298 -83 236 285 517 906 616 167 -32 -447 -403 -91 -191 -121 -504 -965 -839 -649 -61 345 231
1811 231 272 192 128 532 899 868 736 326 -87 -139 -207 -88 40 -453 -694 -840 -1076 -528 -175 -5 183 12
1833A2p6K30K51L70J44k34k26l76k99J79J31j62k63l16l21O6K09L80K54Qj32N2
1855a19Q3N90K57N9o4l46j63q8N7k8P6m92l98j52j02J93L62j10K75j97j14M77
1877E6L75J60L45k65j89j28m6Q8N4l43l8n13k81K01k2O0K91k08l6M4J49M67K20
1900D41J46o4k50k50K60M3J25k10k61l41n3j03J51K55j73J16l34J46L11R2L07
1921C54J06k64p1m2J3K74N3j46q2n53p4K14l1J76J28n00L2K00Q4L69O7M5K9m49
1945f8L0L19j19Q4J7m38j29Po2L35P0j45K1k01ML58J81O8K1k01k17P5k3K00N6
1970B43j52k32k00j1J27Q3L17j85l04J60P4O4M38P7j73j34j73j05L08nR6j76m08
1993b71K6pO6J54j19n0J2k19J60K65R2K50j5k26p0r6R6M80k68r4k69j74k1K58
$$ plain form
1833 12 -64 166 417 787 931 697 471 95 -204 -25 106 -56 -319 -635 -956 -890 -681 -301 -47 -39 -171 -119
1855 -119 -36 554 811 870 806 460 297 209 266 238 314 -178 -576 -728 -830 -637 -275 -385 -110 -307 -421 56
1877 56 431 591 936 671 482 354 308 396 450 107 69 -444 -725 -524 -546 -486 -195 -403 -439 -395 -246 221 441
1900 441 587 523 273 23 283 326 451 241 -20 -361 -414 -517 -366 -111 -284 -168 -502 -356 -45 47 354
1921 354 460 196 125 83 96 370 423 277 195 -358 -432 -218 -249 -73 55 -445 -413 -213 -129 240 307 352 381 -68
1945 -68 -38 281 162 246 263 -175 -304 -297 -359 -24 46 -99 -78 -279 -275 83 264 332 353 152 -65 10 -13 187 243
1970 243 91 -141 -341 -352 -225 -142 175 -10 -314 -154 -80 -16 422 499 326 192 19 -86 222 217 313 137 -271
1993 -271 -245 -252 -186 -32 -151 -201 -189 -408 -248 17 109 359 344 118 48 -48 48 528 260 166 -103 -277 -298 -40
2017d0j46K05j11k63K9m1K08L57q7J3Kj53R4L26l6o6j52k64k7N8Q0K39j92k75
2041b42J02k06R1J73L5L20l18j82M8J90jL99j99p2n4j71KJ48J33n0j10k76K2p2
2065b90K77J24k56l5N3n8J28L05j48Q9j50j01m3J2K37K86k76k22J09k84J98N3
2087HQ2j90Kq2q7P6Q2K69j08p2n4j14J63K58k5M2j66k63J37mJ63J27k93M6n0k34
2113b87J49K02M9j48o0j20J50M0J52R3l05PM5J1J35j7J22n1j04j07m8M0J07K01
2137B56l67KJ0j10J60J26j16O7k48R9Q8K3K14R1j30j04j2j15L09M5j00p4p8k72
2161b36J40O1O6L1j93m9o1p9L69L6P9k00ok3J10J74J1M8q7l8k06K5J1O8p0l6j77
2188b32q6J79K7J14J85k31J7k1K2K59N8j29N5l49N0J06j1J62j47j34r0n1O2R7
$$ plain form
2017 -40 -186 19 -92 -355 -326 -367 -159 198 111 124 126 -27 67 393 357 291 139 -125 -152 -94 -14 225 33 -242
2041 -242 -140 -346 -255 -82 -47 273 -45 -227 -179 11 10 409 210 138 84 -87 -85 63 196 146 36 -240 -218 -290
2065 -290 -13 111 -145 -180 -127 -185 -57 248 100 189 39 -62 -105 -93 144 430 154 -68 41 -243 -45 8
2087 8 90 -100 -98 -180 -267 -191 -109 160 52 -20 -74 -188 -25 233 208 250 84 -179 -42 -46 117 244 -49 -3 -53 -287
2113 -287 -138 64 113 -35 -95 -215 -65 -25 127 220 -85 -78 -33 -22 113 96 218 167 63 -44 -92 -52 55 256
2137 256 -111 -109 -99 -209 -49 77 -39 28 -220 -121 -33 -10 204 295 165 61 49 -66 243 288 188 114 36 -236
2161 -236 -96 -35 31 62 -131 -180 -241 -320 49 85 164 -36 -42 -65 45 219 230 278 191 153 -53 -28 -17 51 -19 -55 -232
2188 -232 -318 -139 -112 2 187 -44 -27 -48 -26 233 291 162 217 -132 -82 24 13 175 28 -106 -196 -247 -185 -88
2212h8J13q3J32k04J27J15q7R2Ol3l3m0m7K49j87k39K14l15Q3L93l00K25K4o8
2236D9j43J25k7J44M0o3o2j56qJ58m8J69j60k55Q3P2jJ19J06m3p6m1J9J59q7N0
2262A23pj62k3K8j6K7R1q1j78l6J31O7J24q1J50j72K1J52j4R9K6j02j41o4L5J0
2288Gq4p1M8q6L2n8O4J16R4j59Q2l6L3K35OM3%l56N5Q0j78K10j36m7j8j35n4J22
2316a91P8O6p1O7L5R2J3K27l5j35m8kk7N1r3r3P0j26q7L4n8J70l0j55J59j23J96
2343a6J65p0J47p2o5RlO6m5J23k75J1r9N8J06n2p9m4j13lL33j98K42O5j35j19
2369f3j00L40k22K34j79K39k96M0j7J7J87m46L16k19J67l36L68k20K27j23L2P9
2391B5Q2M5l31k73O01l8J58K59k68k96j69M1J62j68N26l92J68P3n30M44j59M13
$$ plain form
2212 -88 25 -58 74 -130 -3 112 25 117 123 90 57 17 -30 219 32 -207 7 -308 -225 168 -132 93 117 49
2236 49 -94 31 4 148 188 125 63 -93 -101 57 9 178 18 -237 -154 -82 -83 36 142 99 23 -18 1 160 73 123
2262 123 116 -46 -69 -41 -57 -30 61 -20 -198 -234 -103 -36 88 7 157 -15 6 158 144 243 269 167 26 -38 -3 7
2288 7 -77 -148 -100 -186 -154 -212 -148 -32 62 -97 -15 -51 -18 217 223 266 266 -90 -35 45 -133 77 -59 -106 -124 -259 -313 -191
2316 -191 -113 -47 -118 -51 -16 76 89 316 281 146 98 96 69 120 27 -66 4 -122 -209 -175 -233 -63 -93 -248 -89 -212 -16
2343 -16 149 79 226 154 89 98 95 161 116 239 -36 -25 -124 -66 40 -12 -91 -135 -248 -251 82 -116 126 191 56 -63
2369 -63 -163 177 -45 189 10 249 -47 -7 -24 -7 180 -266 50 -169 -2 -338 30 -190 37 -86 -54 25
2391 25 107 152 -179 -452 149 111 269 528 260 -36 -205 -164 -2 -170 356 -36 132 205 -325 119 -40 373
2413C73m40j6J15P8Nlj72J56Q4k73k3J23j06R1J46l3kj56J16jk16L15K5j77j6
2438gP2j37P9lL5j3q1r2J54o8K8R9J4j12lJ5O3J29q5Pj28J4o8LK06Rj98q8J16
2467d0p6q6K14N6q6P0q3J09qR9o5r9m5qJ8j06J68j72N3q2Q2N7K0P3J21j56M2J9
2495H9o8M6L5r4J39j76M3M6o0NK5j60K2j4n8J58L8k2J6k1OO8R4q3k3j06P5n3O0
2524B7N3j9j73K21j45j56K47j20N8J11j42N2m0J05mj9JK4m5j16J48n4J2K8j44
2549i0P1n7N8O5K3oq9M1O8j23mJ26J38k41l6OmQ4N6j39L2Jl6J52j60J61j33n3
2577h9J29M9m1No5j65J35n6K8R9j37R5j03Q1M9M4p4J81M8j41m0l9oL1J4Jq3j15
2605a65R1n9J8R8p9MK1q3J30J97j83Q3J37r9p1J35j02Q4r0o2n0m6n0J36k08J87
$$ plain form
2413 373 -67 -83 32 110 115 112 -60 96 180 -93 -116 7 -99 -8 138 105 103 -53 63 62 -154 161 186 9 -7
2438 -7 65 -72 7 4 39 26 -55 -147 7 -61 -33 66 80 -32 -35 -20 43 172 87 94 -34 -20 -88 -85 121 130 -68 -156 -40
2467 -40 -116 -202 12 68 -18 52 -31 78 70 169 104 5 -40 -48 -30 -136 32 -140 -87 -169 -87 -30 -10 63 184 28 70 89
2495 89 21 67 102 8 147 -29 14 60 0 5 30 -130 -108 -122 -180 -22 16 -6 10 -11 -5 63 157 74 51 -55 20 -33 27
2524 27 80 61 -112 109 -36 -192 55 -65 -7 104 -38 14 -26 79 75 56 57 81 36 -80 68 14 26 54 -90
2549 -90 -19 -76 -18 47 70 64 -25 16 84 -39 -43 83 221 -20 -56 -50 -54 30 86 -53 -21 -20 -56 96 -64 97 -36 -89
2577 -89 40 89 48 53 -12 -177 -42 -98 -70 29 -108 -13 -116 -35 14 58 -16 165 213 72 32 -7 -13 18 32 33 -50 -165
2605 -165 -74 -133 -115 -17 -96 -92 -71 -154 -24 173 -10 73 210 111 40 175 73 157 67 5 -45 -91 -141 -5 -213 -26
2631b6l4j9q2J40Ko8J32j24K16l4M9j00J4N8N6k11N5k9Mqn6p5j4J9J31j5n2O3
2659hj0L6l5J26J7Q0j37K2Oj35m1J01n5q4N1q3jj2J81J12j48L0J51k41J19M4L5
2686A21o6m6lR0r0mJ47j63j50Q5j8R7l0l8K3R3o2L0LlP5k0N0j14q8R5p3M5j46
2715a60J36j7n1P2R0j12O1qkm8qj41L64J4k33o4J24o6J2j8l3P3j4j04J12J15l7
2742E7m2L6jQ8r4L5lkj0R8k04r1J74r4j9lJ1J9N0l8J21p9L1o7R7k1R3n7j78J93
2772A00j38O1kp9M2Nn4m1n2J29l5m8N4O6n3M5J16j14M9O2r8J17j60LQ4n2K2j15
2800h6N6o4P6j4O2M5j9m9O5lmk6N5r8j04N2k7N7M9p6pJ04r4KM0p4L0J39j12q7
2830a12J78J06q9j44J35j2JM6qj02M7l5j4P6n0n2j1J3kpm6k8J21M3j42R5kk8J7
$$ plain form
2631 -26 -60 -79 -161 -21 -19 -87 45 -79 137 103 152 52 66 124 180 -31 24 -5 -1 -9 -65 -140 -154 -135 -4 -19 -71 -8
2659 -8 -18 18 -17 109 126 206 69 91 97 -38 -79 22 -33 -117 -66 -149 -150 -162 19 131 -17 13 164 -77 42 86 121
2686 121 55 9 6 96 6 2 149 -14 -164 -79 -97 0 -30 -68 -45 48 -14 16 19 16 91 71 121 7 -81 14 -59 -14 -160
2715 -160 -24 -41 -92 -20 70 -42 19 11 9 -39 -47 -188 176 190 -43 -107 17 -49 -37 -55 -88 -15 -29 -133 -21 94 57
2742 57 15 51 50 138 44 79 76 74 64 162 -42 -133 41 -53 -72 -75 -64 -45 5 -33 88 9 40 -27 70 49 142 85 -93 100
2772 100 -38 23 21 -58 -16 -11 -65 -106 -158 -29 -64 -112 -58 8 -45 0 116 2 51 113 15 132 -28 -25 59 7 29 -86
2800 -86 -30 -94 -18 -32 30 75 56 7 72 69 65 39 94 -4 -108 -56 -83 -26 23 -53 -60 44 -50 -48 -8 -82 -52 87 -25 -112
2830 -112 66 172 83 -61 74 62 63 109 101 -1 46 11 -3 73 23 -29 -40 -27 -29 -36 -82 -110 11 54 -88 7 5 -23 -6
2859fN0%o2jL6O6l8k8j59K20j45o4K35j14L2K9m9K1j18P0P7qo9n0Q9kqr4K5P0
2889EQj49J61mN5p4l5P0j12J29p5j0Q0j9p7k5J82j82K07j49J33p5l8Q5k0l3J4
2916E2oo9j29J73pj16P6k2N4m2k4K2O5j03J98k2j55J08o2J56j79L0O5q3r0R1m0
2943e9n0M1l5J4P3Pj8J1P4l1p1M8J83j62J8j22O4%J85j37J5oj00Q7r5L2OM0k3
2972a1M1k3ln7L9J5Op1J01k3l0jJ32Lk42J06N5m8nqPj17J16J16o6Q6o9m9j4J7
3002CLm0M2L9o3j18K4R8q9P5l5J21K4j37NJ71q4n3K7n6l4lm2J27l1R7j17M0p2
3031g8J01O1k8N8m6m7lK7O6J1j1j22NN5mn6Jlq2k8K3K7J65q9m4J00r1K9N1k3N1
3062G6r8n5O3l0P9R3j36j19R3q4R6L6k0M9o8n1J3k9J73N7rL8k05m5J24M7q7Jk5
$$ plain form
2859 -6 44 44 -18 -19 17 83 45 17 -142 78 -67 -131 104 -10 22 51 2 23 -95 -25 52 44 -25 -75 14 12 4 -90 -65 5
2889 5 13 -136 25 21 76 2 -33 37 -75 54 -21 -31 49 30 -47 -72 110 -72 135 -14 119 44 6 91 71 38 52
2916 52 46 -23 -152 21 14 -102 -26 -48 6 -36 -60 -38 27 -76 122 100 -55 53 -9 147 -32 -2 63 -20 -110 -19 -59
2943 -59 -109 -68 -103 -89 -16 -9 -27 -16 58 27 -44 4 187 25 43 -79 -15 -15 170 33 48 42 -58 29 -66 -34 -28 12 -11
2972 -11 30 7 4 -53 -14 1 7 -64 37 14 -16 -17 115 118 -124 -18 37 -11 -16 -24 -17 -134 -18 98 32 118 49 0 -14 3
3002 3 6 -34 8 47 -16 -134 -110 -12 -101 -26 -61 60 84 -53 -48 123 39 -14 13 -43 -77 -80 -122 5 -26 71 -46 -6 -78
3031 -78 23 84 56 114 68 21 18 45 111 122 111 -11 -6 49 45 -11 -10 -13 -95 -123 -100 -73 92 3 -41 59 -32 -3 48 25 76
3062 76 -22 -77 -14 -44 35 128 -8 -127 -34 -118 -22 14 -6 43 -25 -76 -63 -92 81 138 129 167 -38 -83 41 88 1 2 -23
3091b3k0j4j4o7R7n0J24ol8L2O3o7J28%j81K7qN9L0j32K8O8j61J80l9p4N0o7J07
3120C2r2J47rr3R6l4j10R5Q3L0q8Q2k32L5N0O8n1M1m4j26L7J5J3p7K16r2O0j15
3148f3L8RM6mj4J12j86l5J26q8J37R6p2o5L8j63K17J8k47M6K7P8Ll9L0R7o3j20
3176d1J4o3R8k3l8J0j27J04J87j61O1n8j61K45j21r5Q4J28J1mo2r1K48k07O8M9
3202E5p5K4m7J10m0qp2K1Q3n1P6j13j2J8J4o7K35j32oP4n5n1q7J11R1j79Q4K1
3230B2nj8m5R2mR1j78j1J32q7JJ2l9O3j02MN5n6NR0j34J38j35J86Rj58P5J31j58
3259b4rJ5J20l6K1j94P8k7j05R3J0O7j1j43Q4M2J0m4N3j13J67m2O2n4k5J36o8
3286F3j65L6l2Q1K0k1o9n0N5O7J25p7%o6J10j31O2k5J30j67M2J4J1M0P4j78P0
$$ plain form
3091 -23 -43 -57 -71 -138 -41 -91 33 27 -11 21 84 17 145 145 -36 -9 -17 42 72 -60 -32 36 -125 55 16 -58 -8 -75 32
3120 32 -60 87 78 -15 81 47 -63 32 115 145 57 139 -93 -58 -8 60 9 50 6 -120 -83 -68 -55 -132 84 -8 52 -63
3148 -63 -25 -16 30 26 12 124 -62 -97 29 -59 78 174 102 37 75 -88 129 147 -100 -54 -27 51 54 15 45 142 79 -41
3176 -41 -27 -90 8 -15 -53 -43 -170 -66 121 -40 21 -37 -198 47 -74 -169 -85 43 54 50 -12 -103 145 -62 6 55
3202 55 -20 4 -43 67 27 19 -53 -32 51 0 76 -37 -49 -31 -17 -84 151 19 13 87 32 -19 -106 5 96 -83 1 22
3230 22 17 -1 -46 46 42 133 -45 -56 76 -11 -10 2 -37 26 -76 -72 -17 -73 -68 22 -112 26 -109 77 86 -72 3 134 -24
3259 -24 -33 -18 102 66 87 -107 -29 -56 -161 -68 -58 9 -2 -145 -61 -19 -9 -53 0 -113 54 12 74 20 -5 131 63
3286 63 -102 -66 -98 -17 3 -18 -87 -137 -82 -15 110 33 33 -33 77 -54 8 -17 113 -54 -12 2 13 53 127 -51 19
3313A9k6j71%J67N3L9j29L9rJ27j84J17q8jQ3j09N9j8n6R6K6k2o5Q3n6J51j85
3340f0O3Or4nJ1N4J58k68J26o6L3J39l0L9j7j94O6N5q7J55o5K3p8J11j54J64r8
3367a3o2O8L6o4J6K3n7j0R4p4O5k8K16j85MP8l24K23j01J93k21K57j79M2k3j7
3393d3NK7l8M1j1n9L9M0k13L20P3j80j7j69K22m5j50J08mj0MJ6R0op4J22m5k3
3421B0O4p0N7k1q9M0M3o5j4lr1k7J80J7j56Q0J01m2j42O8J49j39N6P5p0L0n9j64
3449a72K23m3j03J31%j16J32j44M8P1r6J77j06M3K9j7k1O0j8j01k1J41j65O8n
3474eM8M7l0Nr6n2L9j7R3kK6K9J03j79J02o6k1L1j5j50Q5J2%N3j22J37j16Q0j16
3503i7J26L8q4J21j13P5Lp2P3j81K53k05q6L1J76j10N4J1q6J1j4Q4M4j25N1J70
$$ plain form
3313 19 -7 -178 -178 -11 42 81 -48 -9 -18 109 -75 42 -46 -47 36 -73 -14 -32 -88 8 34 12 -53 30 -26 125 -60
3340 -60 3 9 -85 -90 -79 -25 133 -135 -9 -75 -42 97 67 106 89 -105 -39 16 -71 84 19 42 -36 75 -79 85 -13
3367 -13 -75 -7 29 -35 -19 4 -53 -63 31 -43 22 -6 210 25 29 107 -217 6 -95 98 -123 134 -45 -3 -26 -43
3393 -43 -38 -11 -49 -8 -19 -78 -39 1 -212 108 181 1 -16 -185 37 -8 -158 -50 -54 -64 -60 -44 46 40 -34 88 43 20
3421 20 84 14 71 50 -39 1 44 -21 -35 -38 -129 -156 24 41 -115 -35 66 24 -118 -50 99 -40 16 91 21 51 -8 -172
3449 -172 51 8 -95 36 36 -80 52 -92 -44 27 -69 108 2 45 74 57 36 96 78 -23 -44 97 -68 0 -5
3474 -5 43 90 60 65 -31 -83 -44 -61 32 30 56 85 188 9 111 45 24 55 40 -110 -25 -13 -13 40 -82 55 -61 19 -97
3503 -97 29 67 -17 104 -9 66 69 -3 70 -111 142 -63 -149 -118 58 -52 2 13 -73 -62 -76 8 52 -73 -22 148
3529A48j71K4j0M8p9M5K2j18om8J18j02J51P0j47l4o1J55J01Q3j63P1Mr7q8O8
3555a6O1o1n2l8rRK03j16m6lQ5k8N2j6p7J45q2J15j20O2j2j27k1m6J14M3k9QJ3
3584A1J4n9KO1m5K9J17j50J04o0j06J24n4J31l1k07Q2M0Jk6mj2J36q7J37k33m20
3611e05M43j46J73m2o7R8p8P3J14J14j24m4o2l0R5k7q6J55k5k5L7o5R0P7j35n3
3637d5J12m9N8k2j17M6j9j17K09m0N5r8L4Q0n5j8l0m2m3J32p6QO2r4M7J05n2m5
3665a4L3r7J74ko0jO1m6j54m4O2R7l5m2Q8o0l1L3mN3k5q9R9r4J11R1j62J32j17
3694d3N5j2J13q7p6J78k13J19L5j22J60k16J31j5r1J59q4On9J19m7QL9j41J62
3719G8k0o8m1J23l5j08R3M9r4j04J37r7R4p8L6m7P0p3R2kj05J01J25j25J4M3l7
$$ plain form
3529 148 -23 1 -9 39 -40 5 27 -91 -97 -145 -27 -129 22 92 -55 -89 -150 5 106 189 26 97 101 4 -84 -16
3555 -16 45 -16 -68 -106 -115 -106 97 -19 -65 -68 17 -11 41 25 -52 93 11 126 6 68 56 -71 -92 -138 -24 19 -10 -2 11
3584 11 25 -34 -32 29 -16 13 130 -20 84 24 -82 42 -12 119 88 -119 -37 3 4 -22 -26 -38 98 11 148 -85 -505
3611 -505 -62 -208 -35 -77 -144 -46 -124 -51 63 177 53 9 -53 -83 12 -15 -101 54 29 4 41 -24 66 143 8 -45
3637 -45 67 18 76 54 -63 -17 -36 -153 56 16 71 -27 7 87 32 14 -16 -58 -101 31 -45 -37 25 -69 -22 83 31 -14
3665 -14 19 -78 96 94 34 33 94 48 -106 -150 -88 9 -26 -68 20 -40 -71 -38 -42 11 -14 -103 -4 -98 13 104 -58 74 -43
3694 -43 12 0 113 26 -50 128 -85 34 69 -53 107 -109 22 7 -84 75 -9 -3 -62 57 10 18 57 -84 78
3719 78 58 -10 -51 72 37 -71 22 71 -23 -127 10 -87 7 -71 -35 -82 -12 -85 7 5 -100 1 126 1 15 58 21
3746B1n2n9O0PM3o4J2Q5q6M5R6N0j63M0J4q0N9Q6j59l5Q3L5q2N1M7n0r3J03j9
3775ej09J39K1L1j93O1Q8m1N0q3M7k3o4J10r2J26Jj90J25J3l9L7L9l1p4L5j6J5
3803b2Q5j44P8J7L5j23N4J4m9M7N1j12o0K12K7j03Pq7M8k1K6P4N8o3M4j71O4j
3831a5R1n0%j1j0L3j3%rr3J8J4p9J29Qj3j8R6j48K2l6k70K14j87N48l27Q0o8J16
3860B2j09J12rk5m2K5j19J82N9nq1j49J16J8P1n3M0Qrq0N1j1k2M7J3o3P1r6P2
3889C4j17O1j9o1J16j5N6j00K8n2J28m8j00Q2Q7j67J44k7Pon5O0k5l1oj1M6o9
3917f0K07j52J7l3k2Q3L4j11rJK8J00k7o2J15j19L1Kp6N5m7L4l9M4P8j03K1o4
3945g4J51j71O8L8n9J36o4o3k4O3J4K2p8n4J68l1P8k02o6J88j08L0N7L7N4l4m4
$$ plain form
3746 21 -31 -90 -30 -23 20 -44 -32 53 -33 12 108 158 -5 35 49 -31 28 114 -45 -80 3 38 -44 7 54 4 -89 14 -5
3775 -5 -114 25 46 77 -116 -55 33 -8 42 -41 6 -17 -81 29 -63 63 64 -126 -1 12 -27 10 49 18 -56 -21 -37 -22
3803 -22 63 -81 -3 14 49 -74 -20 -6 -55 -8 43 -69 -129 83 110 7 14 -73 -25 -46 -20 54 112 49 93 -78 -14 -15
3831 -15 76 26 26 15 5 38 25 25 16 -77 -59 -45 -124 5 13 0 -18 78 -70 -48 -84 -354 -140 -327 221 -106 -26 -94 22
3860 22 -87 25 16 -9 -51 -26 -145 37 96 91 10 -139 -23 -5 66 13 53 61 52 -28 23 12 -10 37 50 -13 58 -38 34
3889 34 -83 -22 -41 -102 14 -1 55 -45 -17 -69 59 11 -89 -7 80 -87 57 30 37 31 -24 36 11 -20 -26 -37 9 -60
3917 -60 147 -5 12 -21 -43 40 74 -37 -46 -45 -17 83 56 -6 109 -10 21 23 -53 2 -45 -11 -50 -6 72 -31 -10 -74
3945 -74 77 -94 -26 12 -47 89 25 -38 -62 1 15 37 -41 -95 73 42 120 -82 -148 40 -68 -38 19 56 110 76 32
3972C2j2o2J16o4r6M3k6J33j6M2k47K67j62L6P1q1o3J35j00k5mP2J42j27nJ19
3998A18o0r4P7j47K06q7o6nO6K3p6j3LJ10rm0O3p6nJ46j03qj7m6N4L5m1q9J38
4027E7j40J17m5r6K7Q5p1P1j25J31p1jP2j2OQ6j6j05J12j8M1j10o2N2Q5j06j8
4054e4M6Rm8J01m4l2L6P2M4%r2K2j41J06l1R4j37P7L1l0p8l3O3%l6L1M3n0J09
4083G8q2K2l1J10q0P1l3j14J40m3m0N2P1k03Q0l41K13J4L47l83J48l9K83o25K54
4108a31n14O62K99m26K47j60P5n%J5j5n0M6r5m0Q9M0j1no8q4J14J36j9l0j12O6
4135B4L1o1j9R1j63N3QR4j0L1k3j18M5P8o8J31j53l9O7k8N3l5J46k53K9R7k9L8
4163A7j08P7j11J37q7J10l7L2J4j5J55m6q5n3p5J09Ol1M5j03J03o3jm2M9Np1N7
$$ plain form
3972 32 20 -42 74 10 -86 -43 -69 64 48 90 -157 110 -52 -16 55 -26 -89 46 -54 -79 -83 -11 131 4 -1 118
3998 118 58 -36 41 -106 100 13 -53 -58 8 31 -45 -58 -55 55 46 6 69 -7 -12 134 31 23 6 -40 14 49 8 -81 57
4027 57 -83 34 -11 -107 -80 5 -66 5 -120 11 -60 -61 11 -1 5 91 75 -30 82 64 105 -5 -67 -15 70 -36 -54
4054 -54 -8 1 -47 54 10 -22 14 86 130 130 38 60 -81 25 -6 88 -49 28 59 29 -49 -82 -19 -19 -55 -24 19 -31 78
4083 78 -4 18 -13 97 17 88 55 -59 81 38 -2 50 121 -82 -2 -343 -130 -116 231 -152 -4 -43 240 -385 -131
4108 -131 -645 17 316 -110 137 -23 52 47 47 62 47 -3 43 -52 -92 -3 37 26 21 -47 -131 -17 119 100 70 -42 24
4135 24 55 -6 -25 66 -97 -44 -36 58 48 79 56 -62 -17 61 -7 124 -29 -68 -1 -29 24 -11 135 -118 -89 8 -21 17
4163 17 -91 -14 -125 12 -75 35 -2 30 44 29 184 138 53 0 -75 34 40 9 54 -49 54 -9 -10 -52 -3 2 -69 -12
4191a2PO9o5lLL2m0J49j32m5N1q3Q8r3J44j3K5r6n9K1mJ47j15m0J36q6k1P4M4
4220H3q9N4N0j29J18k44J69J0n5J8M1j0K9O6j09J14n5r0O2r6K5j4M8k7l2K22l1
4247A28r6L1j9Nk0N4j46N1J7K0M2j73J57o9l4O6j0O6l8j39Q5R9p1n6J83r7O6q1
4275B1J38j59K9J9j35J84j88J82j38J34j45K8K2Q5j04Ll1m6Q5o0nQK4n4P0J65
4301A32j03K9r0L5K2nP6j01L0r5R4RK4r5r1L7K13m5l6n8J0m7P6J33k90J16J01
4328H1n5K5pj9p5J18q8J8O6r2j3L4k8J0M2Rpq8K4J33j23J19n3L7n0O3j02O2np9
4358d3J85k48N9J23j01n3O6n4J04j00R4n0p1m4L3K25o07L38l6m55Q91q13Q85j382
4382a054J138k99P11J10m8n38l88Q48n09K6j00J34j53K27l6n2r5J79o2L3o8m0
$$ plain form
4191 -12 -5 64 -1 -4 -1 31 -9 140 8 -37 14 -69 19 -74 70 57 82 -14 -73 -52 -56 91 -24 -64 72 -14 -35 39 83
4220 83 -6 48 98 -31 87 -157 12 22 -33 -15 26 16 45 111 2 116 61 -29 33 -63 -38 -52 -4 -31 -63 159 128
4247 128 32 63 44 49 29 83 -63 -12 5 25 67 -106 51 -18 -52 14 4 70 32 -107 -22 77 6 -50 133 36 102 21
4275 21 159 0 29 48 -87 97 -91 91 -47 87 -58 -30 -8 77 -27 -24 -55 -101 -16 -76 -81 -73 -49 -103 -33 132
4301 132 29 58 -32 3 25 20 96 -5 25 -70 24 33 57 -38 -129 -92 121 76 40 -18 -8 -55 21 154 -136 -20 81
4328 81 26 51 44 25 -50 68 -20 -2 64 -28 -41 -7 -35 -25 17 26 19 -69 -45 88 -35 84 31 68 18 81 -21 41 36 -43
4358 -43 142 -106 -47 76 -25 -78 -12 -66 38 -62 32 -18 -89 -133 -100 125 -482 -144 -180 -635 256 -557 328 -1054
4382 -1054 84 -215 496 606 558 20 -368 480 -29 -3 -103 31 -122 105 69 17 -78 101 39 72 4 -36
4404c6M3J11q3j0Pp5n9J69k9n6j0J2K4p3M0M5m9J10j85J56j9J20k54J27j63J14
4430b3k74q8M83j62J13j80J17j9j08M8Q2M9J0n8P7n1Q7j53rL9J7o8P2J6K1po6
4457c5O1r0j34K01O8q5k5O4n6M1L4m0q1M4n4Q3Q2j46J65k01J36q2O5p7j5J36k7
4484C2Ml8l9O5n7J26J80k56q6J8k6J27k3p5R4p6p2j9Q7m4klJ05J0P16j311J83
4511c80M72m1j01J6Jk8J78j66J2K5p3J74l8p1K5Q3ol9Q4q8l9L4L3q8M5N2n2J4
4539C8m9Pn1J8K9k6j07J81J7J8j12J00j0j00K08j65j31J38jk0p3N3Q8n5J00q7
4565HlL7Ql0j26J5R5o9R7l2q8J13j13R0K3K8k8k1j77K80p0J6N3j77M0J28q4K9
4593D2j27Ok58L41R1j21P9l0P8j27j3J40l6j94K19j01%p0R2Ol5j7n9P6O8J1q3
$$ plain form
4404 -36 7 118 35 25 32 -43 -102 67 38 -18 -28 -16 8 -65 -25 20 -29 81 -104 52 33 153 -101 26 -137 -23
4430 -23 -297 -385 98 -64 49 -131 -14 -33 -141 -93 -11 38 48 -10 67 16 103 -50 -59 -20 -3 -71 1 17 38 31 -35
4457 -35 26 -64 -198 3 71 -14 -39 25 -31 10 44 4 -77 -33 -87 -4 78 -68 97 -104 32 -50 15 -62 -77 59 32
4484 32 36 -2 -41 24 -33 93 273 17 -69 -51 -77 50 27 -48 46 -30 -102 -121 -34 -78 -80 -83 22 32 748 -563 -380
4511 -380 92 51 -50 -34 -33 -61 117 -49 -37 -12 -85 89 51 -20 5 88 82 43 127 39 0 34 67 -21 24 76 24 38
4539 38 -11 -4 -55 -37 -8 -34 -141 40 57 75 -37 63 53 -47 161 -4 -135 3 2 -18 -91 -38 50 -5 95 8
4565 8 5 42 50 20 -106 -91 4 -65 32 0 -88 25 -88 2 25 53 25 4 -173 107 37 53 106 -71 -31 97 13 42
4593 42 -85 -79 -337 4 95 -26 53 23 101 -26 -39 101 65 -129 90 -11 -11 -81 11 17 -18 -35 -94 -18 50 61 -22
4620b2pO4PK7q9P9Op7Q2j04Q2m9j5j9R3j21n7J13q3O4O5Kq3l2J77j11K9j47Q9
4649c7j5P0K8j06P2N0m7k5P9j44L6L9n4M5J07j73J18j7j55J59J3k3j35P3n5Q6
4675a1J5m3lJ18p2j6J95r4j67K55j84J7N0k8k7m6P2j75J58L6J1j08N3OJ41j37
4701A6Mr7L1N0n5J07m7O2q2J1j0K1Q5j65J20o5Pmk6k1k5J38j17R5qm1M7j6J5N
4731C5l9kR6j27J88k35O3M7L3o5N2o0M2q7J39m3r3O6m1L1j7o2L6J5k3O4J48j55
4759FK9kk6nn3P7J1K8M3j16k1L5J6J0k7j9J8j9%J2j2l5k0J37o0L8n9Q8j30R7R
4790E0k6N9p1o4L6Rj16J38l0L6K7j33L7j15J02O1J8j00J17%q2K8P6j0K7m1j31
4817i8J05m6J10k5J5Mj23N7K4K5l5R3j62R9q7jqJ39j06N3k0j6k5L7J2J5L4N1n6
$$ plain form
4620 -22 -29 35 42 69 -20 59 65 -12 70 -34 48 -1 -16 -35 58 -63 -120 -7 -90 -26 39 41 -42 -74 103 -8 21 -126 -37
4649 -37 -52 18 46 -60 12 62 15 -10 69 -75 -39 0 -54 -9 98 -75 43 26 -129 30 43 20 -115 -42 -97 -11
4675 -11 4 -39 -42 76 4 -12 183 89 -78 177 -7 10 60 32 5 -41 31 -144 14 50 61 -47 6 12 153 16
4701 16 20 -77 -46 4 -51 56 9 71 -11 0 -10 11 96 -69 51 -14 -7 -11 -37 -58 -83 55 -62 33 25 -16 31 15 30 35
4731 35 -4 -6 90 -37 151 -84 -21 26 59 -6 46 -14 28 -59 80 37 -56 10 -31 0 -17 -79 -43 -28 -51 13 161 6
4759 6 35 33 7 2 -51 26 37 65 108 -8 -29 6 22 32 5 -14 4 -15 -15 -3 -15 -50 -70 67 7 45 -14 74 -56 41 50
4790 50 24 83 12 -52 -16 -7 -123 15 -15 21 48 -85 -48 -163 -61 0 18 -82 35 35 -47 -19 57 47 74 33 -98
4817 -98 7 -39 71 46 61 65 -58 -1 23 48 13 106 -56 43 -44 -45 -53 86 -20 33 13 -3 -28 9 21 36 70 121 65
4846F5p8M2M1K4r2l4Q3l7n9J09r9j6K9L3m5J23j8n9Lj15J88p2R0o7K9n4l1j57
4874a74J84n3r6J91jj95M1J37j38J90P0j83P8K3n4O2j77J52mrk5j0p9J16L7p4
4900Ij48J41o2Q2o6MN9O3j39J02j37J50ok8k5j20M0M4K2j4L0p8M4lm7J62l3q9
4928d3N2J4J0q5M7L2K1r8N0J5R4Nj36K9K8O1o1J18j45j18J41K0j64J14J06j16
4954ij0O6ll7N5r8J5J6o3o6J64j15J0L9n3R6o6J34n9nk7rN5j6jkK5J8o2O5j49
4985i2Q8O0q8L8Rq0J19p7l9R9Qj59K53j11L7p1K2J37k00M4l5m0N8Ol8O9n0K2n3
5014f4M8J2nn3J17r5l2Q2n7J34K3k4r7L9r2P1K9M3j8O0k20J05m0P3N4o6Qq7J33
5043H1j41J70j41M7j38J08l9M4J5N8r7M2m8Q8l7L5k8j21p2J85R1n6J2Np7K8p8
$$ plain form
4846 65 -13 29 70 94 2 -32 51 14 -45 64 -35 -51 -22 11 -34 89 71 12 15 -100 88 16 106 39 68 14 -17 -174
4874 -174 10 -43 -139 52 51 -144 -103 34 -104 86 156 -27 51 74 20 82 -95 57 53 44 19 9 -70 46 83 9
4900 9 -139 2 -60 22 -44 -40 19 82 -57 45 -92 58 52 24 -1 -121 -81 -37 -15 -29 1 -77 -33 -36 -83 79 46 -43
4928 -43 9 23 33 -52 -5 27 48 -50 0 15 109 114 -22 7 35 96 35 153 8 -110 31 51 -113 1 107 -9
4954 -9 -19 47 44 7 62 -36 -21 -5 -68 -134 30 -85 -75 -36 -89 7 -59 75 16 11 -16 -25 30 14 13 11 36 54 -8 57 -92
4985 -92 -4 56 -32 6 15 -65 54 -23 -62 37 45 -114 139 28 65 -6 16 153 -47 -3 -38 -78 -20 -14 -52 17 -33 -11 -64
5014 -64 -16 -4 -9 -62 55 -40 -72 10 -47 87 110 86 -11 28 -64 7 36 79 61 121 -99 6 -34 39 93 27 35 -52 81
5043 81 -60 110 -31 16 -122 -14 -53 -9 6 64 -33 9 -39 49 12 47 19 -102 -174 11 102 46 58 63 -14 14 -64
5070f4o9L0J82j96O3J21j20N0j4J91j43MO0o6l3J2K18k48K06j59L9jr6rP4j40
5096a08P1J5P3Po5M9q3k3R7L6r1O5r9Q1q5k6J83j48P9nMl6K7l2o2O8m9Q9j4o0
5126d2k8OM0J00q6l6J8n8kN9j05P7Q1q6OJ58j96Q1Mn4M8p1n8J84rp2%J01j7k1
5156B2NO5r5n7Q6n6j8N2O5k10K69k06J44o5O3K2j60Q6p0o1O2J18r1Q1k6QQ5j5
5184A03j58J5J06P0j11n5J0M7%p6O6j11M5R3k02J25N2j25J45J4p3L4p4p3J83o0
5210a0Pp9J27o1M7o2O6k09J27j09J84K1j04J63p9M1j90J15n5R4J8q7M9K0pN8j8
5237F7j7p8m1K6O9j3r9J28r4M1P3n1k5J1J0j07J82n3j42R9j42J52Jn2L6J8R8q3
5265A4k2k4Q2l4K8l9Q8Mj45J77j09kJ2r3N8m9J85j80N8m4K0P8j29L4p2N0N6m0
$$ plain form
5070 -64 -133 -103 79 -117 -54 67 -53 -3 -17 174 31 35 95 29 -4 8 226 -22 184 25 64 63 -33 -42 32 -108
5096 -108 -37 -22 51 58 -7 42 -41 -64 33 69 -22 43 -56 25 -60 -86 97 -51 28 23 27 -9 18 -14 -76 -8 -57 32 18 -42
5126 -42 -70 -64 -24 76 -10 -46 -28 -86 -88 -29 -134 -57 24 -62 -56 102 -94 -13 -9 -63 -15 -86 -144 40 31 -41 -41 60 43 22
5156 22 27 92 -3 -60 26 -30 -48 4 69 -141 128 -78 66 1 64 86 -74 12 -58 -119 -57 61 -30 51 25 33 118 103
5184 103 -55 -40 66 136 25 -30 -20 27 27 -49 17 -94 -49 44 -158 -33 19 -106 39 53 -20 14 -60 -133 50 -10
5210 -10 -3 -82 45 -16 31 -31 35 -174 -47 -156 28 49 -55 108 29 70 -120 -5 -60 34 52 -35 14 34 27 85 67
5237 67 50 -28 -69 -43 26 13 -86 42 -52 -11 62 11 -14 -3 7 -100 82 29 -113 -14 -156 -4 -3 -55 -19 -1 97 14
5265 14 -8 -32 50 16 44 5 93 97 -48 129 20 18 30 -63 -5 -54 131 -49 9 -35 -15 63 -66 -32 -104 -54 2 -38
5293c8P0j0j7n3Q4m2j12J21P6o4M3n1%kNJ4m3P4j46Q6j4m1J6O5P7j16K0Q3p8J87
5323A94j71n6M2J0p1kJ16l6m3K1J9k8J04j36N8K6o6N2L2j66P5K7n8J90k74J65
5349B4J7m5J22k12J99j89J22o1rM7L1Kr1M9NK4r2QJ9L3o8O0p4R6j10N9R2r5r0
5378a27J53K7j90J87l3L9J4m8j80J83q5Pp6J3J27n8O6j0p3J91j27l9P5m0M4m1
5404ar0K1M7L8k7L4P4oR8k40R5L0j33QO1p7R3M6N1j67Q8Mq2Q3n3o8J66j03q4M3
5434e1J7Q8l0M0j34N1J16j05O5O3k43J03J3N9m6m3j24J03P2m5J05j14qR4K5j02
5460c1J29j43K8J4l4l9J09P3j84LP0Q1j14j2P5o9K3q1J57n4l7n8K4M5k8O6O9m0
5488D2l6Q9m7N5p2n0Q1r2J59j44j7l8J44l1j65J15K4r1j4J42p8J47j24j3J03j24
$$ plain form
5293 -38 32 22 5 -48 36 -6 -118 3 79 15 58 7 7 5 10 24 -19 55 -91 -5 -19 -60 -44 21 98 -18 2 85 7 194
5323 194 23 -33 9 19 -52 -54 62 26 -17 4 23 -5 99 -37 21 47 -19 33 65 -101 -26 1 -57 133 -141 24
5349 24 41 -4 118 -94 105 -84 38 -23 -32 15 46 48 -43 6 11 35 -57 -49 -30 3 -65 -5 -79 17 -93 -34 58 -37 -127
5378 -127 26 53 -137 50 17 56 70 22 -158 25 -60 -53 -129 -116 11 -47 19 9 -64 127 0 -39 36 -4 40 -1
5404 -1 -91 -70 -23 15 -12 22 96 90 188 -52 43 73 -60 -52 9 -68 25 71 122 -45 43 47 -35 48 -5 -73 93 -10 -94 -51
5434 -51 -34 54 24 64 -70 -19 97 -8 57 120 -123 -20 -7 52 6 -37 -161 -58 14 -31 74 -40 -48 46 71 -31
5460 -31 98 -45 -17 -3 -37 -76 33 106 -78 -75 -5 76 -38 -50 25 -44 -21 -102 55 1 -36 -94 -70 -25 -53 13 82 42
5488 42 6 95 48 103 31 -19 62 -30 129 -15 -32 -70 74 43 -122 -7 17 -74 -88 54 -24 123 -1 -14 89 -35
5514c5o1O6P1q6l8P8n2J3j0O8n6J27lj78K23j10q0K3Q5L7m9qq5o4J10q0R3OK2
5543B7l5n6Q6p9L1J5Q8K2Rj07p1J26p4o3R7j01K2J4O2j09K19k18J62l14Q1n82
5569g48L07M87j56K03j48J29j53Q4mO5j31Q3J0J2n0J15j65k4M2o4O8R4j03q3J34
5594Dl2P3m0m6m4n1K15j31l7k4J18P2j20k2q7K84l4j93J80j02K2oj89J53J00o6
5620cJ00j81J09K2j6k4K6N2j12M3N4m6joN3p3j5l5l7P2m1Q1q6Q8L2l0n8Q3j61
5649a10K60p1j36J68j32pJ02j59K6k6J27O5j31j7L2Qp9O0j4N2q2l6K5J84j12K
5675aR4j5m0j11KJ12P8j77k7M6K3q0R4nm3PJ03m2n4R8m0qn1J14j39Q9j6R4q7K0
5705C8k6j7jO8j32M9J36j39L8N8k9M1j41kL1M0m1OP0j43J2P5kp1m5J27o3N6Q6
$$ plain form
5514 -35 -96 -30 41 -45 -83 -5 -57 -44 -54 14 -42 85 82 -96 127 17 -63 -40 45 82 33 25 -60 -124 -14 -94 -1 5 27
5543 27 -8 -64 22 -57 -26 -11 77 99 108 1 -70 56 -18 -81 16 -85 -63 -49 13 -96 123 -95 67 -247 -166 -748
5569 -748 -441 46 -110 93 -55 74 -79 5 1 66 -65 18 28 40 -10 105 -60 -84 -42 -106 -38 56 -47 -130 4
5594 4 -28 45 5 -41 -85 -136 79 -52 -89 -113 5 77 -43 -65 -152 132 98 -95 85 -17 5 -1 -190 -37 63 -3
5620 -3 97 -84 25 47 31 7 33 85 -27 16 70 24 23 17 70 -3 -18 -53 -90 -18 -59 22 -64 24 56 26 -32 51 -110
5649 -110 150 79 -57 111 -21 -28 74 -85 -59 -85 42 107 -24 -41 -9 -1 -80 -20 -34 18 -64 -100 -75 109 -3 -1
5675 -1 93 78 38 -73 -71 41 119 -58 -85 -39 -16 -96 -2 -7 -50 -43 60 18 -36 62 22 14 -37 77 -62 27 11 105 18 38
5705 38 12 -5 -6 62 -70 -21 115 -24 14 72 43 84 -57 -59 -28 12 -29 -23 47 -96 -84 -9 -11 -82 -127 0 -63 -7 79
5734G9r4N1k5L2k9p6P0N3j85Q3QkN9On7O6j08O3p9J92p3n9m0R7r6J36j7j13j8
5763g6J86o5opo2J7rj1k3m7N4j7J50r1m1O2m6l4jO0jL0M1m4J2L3j10J51j10j3
5793a8LJ41nj76m9J17pJ7O0j21J05m8r8P4M8p5J2N5j17J90q6j1O2j44L2n9J09
5820A1L0j6l7LMO9k7j31J35p6J24k04R9J07j47Q4j6n6K2J6o5N3j1K5M0j25O5J68
5848A44k68J19J9J7l0J33n2j12o1J09lk08J06M4P5J0m2J6J59j57j04J15j6L6J5
5873F4k4j65O9p8K18k38J62j1L1l6q0J51j28M8J01m9j42Q6K3j27P1J25K4o5j52
5898a22J22rK1j3kl3J11p2j0Op2J09j4P0j24n2J58j28J19j83J30j10J61q3j2M5
5924A3p3J32Pq3K0n2j7Q4q5O2j9O6L3j47M3N0J16j74J03l5j28P8k3M8k01K51j3
$$ plain form
5734 79 -15 36 11 43 14 -62 8 61 -124 -41 -33 -35 24 30 -27 39 -69 -6 -85 107 34 -25 -65 32 -64 72 55 -58 -76
5763 -76 110 45 39 32 -30 -13 -22 -33 -56 -103 -49 -66 84 -7 -48 14 -32 -66 -67 -7 -8 22 63 19 31 64 -46 105 -5 -18
5793 -18 -15 126 121 -55 -104 13 6 23 83 -38 67 19 -79 -5 43 -32 -20 35 -82 108 22 11 73 -71 -39 -98 11
5820 11 41 25 -12 -9 -5 64 37 -94 41 -35 89 -115 -16 91 -56 28 12 -44 -22 -6 -71 -18 -29 -4 36 -89 -24 144
5848 144 -124 -5 14 31 1 134 82 -30 -91 18 15 -193 -87 -43 32 42 0 16 175 18 -86 29 13 49 64
5873 64 40 -125 -56 -134 84 -154 8 -3 28 -8 -88 63 -65 -17 84 35 -107 -21 2 -125 -54 71 95 30 -122
5898 -122 0 -9 12 -1 -3 -36 75 3 -7 -1 -73 36 22 92 -32 -84 74 -54 65 -118 12 -98 63 -20 -32 13
5924 13 -60 72 79 -4 16 -36 -53 31 -54 8 -11 55 88 -59 -16 34 150 -24 79 44 -84 -6 -29 19 -182 69 56
5951E6r8m2J04M2k0p4k1O5Q6p4Rkj11J36o2Qn4O0k0mM4Np2J02j08R1n4m7K2N6
5981B3j08O5j4O4Qk7l8N9l2MJ5P2o4j8j3l6N7Pm2M4Oo9l2K9J14l5O0j76J02o1
6011c6K0O5j41Q3Oj04R9j08J37q3P0L0j1oo9R7k6pN4r6K4Q6j36Q1r5R3j26J02
6039CP1j78P3M0rQ4n2j46J53L5r2j50K22R2j23n7N9k9J14Mj21q9N7J15K9j62N7
6066@n4n4Q3k8k5J58j53M0R7j25N8l0O5K2M5q7P0p0j4L6l2J28kp3o5J8j0Q7m5
6095D0m3l5J28o9Rp5J11j21K7pQ7L4j51LJ86j89QN8n3k4J77j94O7J02l2o0j25
6122a41J05k6j6J91p0P0j58r9J89lk8p6O9q7oJ29K3j11J46j72K60m10n7j30K87
6147a21K03j95K16j65K0n2P1L0j32J76j26j8J68J2n2K2n1l9k8M5q2J11l4j0J05
$$ plain form
5951 56 -42 -84 20 62 42 -32 -53 12 98 24 33 31 -80 56 -6 2 -52 8 -12 -16 28 33 -39 63 -45 46 -8 -55 -33 23
5981 23 -85 -20 -34 30 38 11 -27 32 0 4 19 91 27 9 -4 -40 17 24 -18 26 32 -37 -69 -40 74 39 99 -77 25 -36
6011 -36 -16 49 -92 -9 -3 -107 -8 -116 21 -62 8 38 27 21 -48 49 23 16 70 -26 -2 84 -52 29 -66 27 -99 3
6039 3 74 -104 -31 9 0 84 32 -114 39 74 -18 -168 54 146 23 -34 25 -4 110 114 -7 -96 -39 76 105 -57 0
6066 0 -54 -108 -25 -53 -78 80 -73 -33 64 -61 -3 -33 32 54 99 12 82 12 -2 34 2 130 128 55 -10 8 -2 85 40
6095 40 -3 -38 90 21 30 -45 66 -55 -28 -35 52 86 -65 -62 124 -65 -57 1 -52 -76 101 -93 -26 76 44 -16 -141
6122 -141 -36 -62 -78 113 43 113 -45 -144 45 42 14 -62 7 -80 -86 43 66 -45 101 -71 189 -221 -278 -408 -121
6147 -121 82 -113 103 -62 -42 -94 -23 7 -125 51 -75 -93 75 87 35 57 6 -33 -61 -16 -98 13 -21 -31 74
6172G4n7n7J76q7o8K0Kj18J24J5M1k6j80J20O4p6Q9j8p9O7k7k0j6m3N6k5k2N5
6200a6p8K7J25j06J4N9n7K22N5K17n72K1L9j58K19OJ9k7k2o6%nJ55l1m0k8R3J3
6228G8j6k06J21Q3Jj00k1j1L2l9K13j50J04J28j79L14j68m2l31J53N72q6l98j46
6252i4J16M0q9MK9p3j1J59m3J1j25J40%n4N6L8n3Lp8N7j5k9j8P3k0j01J05k1k8
6281b1P2l4R0j99J02P3q8J84j86nj65K60j36r3J76p7M6Jp1m0J07j4J15l10J23
6306i0K01n9M7q8l7l5J0M9J2r2l7J49j03O6J5P8o8j6j04J37Qj88J27L6m1M9op5
6334e5J49j38M3k4O0K4r9j4R9O7j41k7m2J23K8j84J09K0N1o7j6Q6J06j08Q6k49
6360a13Q6k8J6J12j34J8R6j34J75lq9l7L1J56k20Q5O1k2p5N3J11j49R2j13j3M6
$$ plain form
6172 74 17 -40 136 49 -19 1 3 -115 9 24 65 39 -141 -21 43 -33 56 38 -41 26 -1 -21 -37 -80 -24 -49 -71 -16
6200 -16 -94 -67 58 -48 -34 25 -32 190 245 462 -110 -89 -50 -208 11 17 36 9 -13 -79 -79 -84 71 40 0 -28 65 78
6228 78 62 -144 -23 60 61 -39 -60 -71 -39 -78 135 -15 89 217 38 352 184 142 -189 -36 536 450 52 -94
6252 -94 22 62 -27 -23 6 -67 -78 81 38 49 -76 64 64 10 66 104 51 54 -24 33 18 -11 -29 44 24 -77 28 7 -21
6281 -21 51 17 107 -92 10 83 -5 179 -7 -12 -177 83 -53 -146 30 -47 -1 0 -71 -111 -4 -18 97 -213 -90
6306 -90 111 52 99 11 -26 -61 -51 -2 10 -82 -119 30 -73 -7 8 86 18 2 -102 35 43 -145 -18 18 -23 26 20 -55
6334 -55 94 -44 -1 -25 35 59 -40 -54 45 112 -29 -56 -98 25 53 -131 -22 -2 49 -18 -34 52 158 50 136 -113
6360 -113 -27 -55 -39 73 -61 -43 53 -81 94 91 2 -35 -4 152 -68 17 78 56 -19 34 145 -4 88 -25 -38 8
6386Hn5l1K0k0J0K7L3J7j53J37o9J9R5pj6m5J15j18P7p1R0L9j48ML3M1j26J52
6414E8oo6N2O4j52J17o9o5MQ5oj5P0m3K1O2j10J2K0r1P9j8K6k3j1l1j18N9J33
6443C8M2n5j4j17nJ90p5o4N5j04J80j1j36R8n8nJ49j30L4N7q3M5o7j15J97J6j20
6470e8l2Q9O9o3l8P6K4n1N3r5J11j71J49m36L79p3N8O7n9n1L3N5n9m2K07k70K9
6497i9K01j19L4m7J35k74K86o8n1pR5k06J91k57K63j39J16l7m3K5j40J02J61m2
6521H0m5j60J65P2k0j12K1Jk0K7L5j34J07l4k8m3J1K9n7L1J69j44J40KK1q2J1
6548D3J04k44N3M8k9l1J17mM8r1M1Nj8k5l0k0l9J41nj50Q4j60K44j6p5n6NK5j
6577c6K7KJ02j91P9L3M1L2k7o0N3m9N1l3O8mm6o1M7P3j30mO3Rk6P1n0p6L8k4l1
$$ plain form
6386 8 -47 -78 -58 -78 -68 -41 -8 9 -144 -7 -76 -57 38 31 15 -30 85 -33 44 -27 63 102 -46 -42 -9 32 -94 58
6414 58 52 -14 38 102 -50 67 -2 -67 -63 22 16 1 71 28 49 111 1 13 33 -58 21 3 29 6 -5 -36 -154 -95 38
6443 38 80 25 11 -106 -111 79 4 -60 -5 -109 71 60 -76 22 -36 -41 108 -22 12 69 -14 31 -36 -151 46 62 -58
6470 -58 -90 -1 68 5 -33 43 67 16 69 -26 85 -86 63 -373 6 -67 -9 58 -1 -52 -19 36 -23 -65 142 -128 -99
6497 -99 102 -17 17 -30 105 -169 117 49 -2 -9 86 -120 71 -186 77 -62 54 17 -26 -1 -141 -39 122 80
6521 80 35 -125 40 112 92 -20 1 2 -18 9 44 -90 17 -17 -45 -88 -77 -48 -105 -74 95 -49 91 93 114 32 43
6548 43 147 -97 -44 4 -25 -56 61 57 105 14 55 60 42 17 -13 -33 -72 69 64 -86 -2 -162 82 66 -9 -65 -60 -35 -36
6577 -36 -9 -7 95 -96 -17 16 57 89 62 2 55 6 57 24 92 88 42 -19 28 101 -29 -33 30 39 13 84 34 -42 -4 -28 -59
6608e9P8m6j4n0J10j21K22o7j08R8n1k8J19q3l4P5p5M9j8J7l7L6M5j16R6K4m3
6635A9n2p1L1M4l3M6j4K9L7N4j34M0K8m9m4P7qO4q7r0J79j54N6M2J04j30MM1J22
6664A51j95J39l0k3k1n2J24o6m3K8L8L5o7L1M4J6k7j24mK9k3N2p1J4J46j41J02
6691F2o5J08r3J1J3j29J28q6J48j41J8j21Q9m2J70j53K68n97P17J5m51L33k58
6714e6N9r8J32n4oJ00N1q1m2K7J6PM4o4M2j22J9N9p1J28P3j60J8l6J13K2j79M6
6742a3m1M3j6P6L1o1m6j6O8j11L4Q3r6J17jLr9J17M3j31Kn9J16q5J26k05J36l
6770A2k8Q9N6k28L4R8n6OJ17j46M3M1j09R8J1j3n2M0Lj25J86J9j27O6o4Ko2R3
6798Dp7J37L6j37j6J18k6L2m5j72R4J4J33j04mj65J83o4J1O9l1KK7j14L8M6L2
$$ plain form
6608 -59 19 -27 -41 -91 19 -102 120 53 -55 43 -8 -36 83 0 -34 41 -34 15 -3 14 -23 13 58 -58 38 62 19
6635 19 -33 -104 -73 -29 -62 -16 -30 -1 36 90 -44 -4 24 -25 -69 8 0 64 -23 -113 66 -88 -32 10 114 -16 -12 29 151
6664 151 -44 95 65 42 21 -31 93 27 -16 12 50 85 18 49 93 109 82 -42 -46 -17 -40 12 -59 -45 101 -40 62
6691 62 -3 105 12 23 36 -93 35 -51 97 -44 -26 -147 -58 -100 70 -83 185 -412 305 320 -131 202 -56
6714 -56 3 -95 37 -17 -23 77 128 47 5 32 48 55 99 35 77 -45 -26 33 -38 90 163 3 21 -15 98 120 -59 -13
6742 -13 -54 -11 -27 49 80 19 -27 -43 25 -86 -52 31 -65 52 51 54 -45 72 115 -16 -14 -73 43 -42 84 -121 15 12
6770 12 -16 73 129 -99 -65 33 -23 -17 100 -46 -3 38 -71 27 38 25 -27 13 16 -109 77 96 -31 35 -29 -27 -89 4
6798 4 -73 64 100 -37 -53 65 39 71 26 -146 -52 -38 95 -9 -13 -178 5 -59 -48 21 -10 -8 19 -95 -57 -11 21
6825B1r8L0PQ2l8Nl4J7k7J44j07Jo9O8K9k6K4j22J65LJ3j68K23r7n7Q3k05K18
6853H5n3J07p7q8R8p8L7l7k6M3R1j08o9R0Nk3R1j02N1o0P1j8p7N8lLL4l0P2J1
6883I8j29M2Qp5l9M8P6l5n2J39n1l3j64M6J57n2q3J10l3q0K0OR6k3qJ6p9J50q5
6912iM5q4m0J07O5o5p3n2M8K6M4K9p5O7k8j44J25o7M5N1m5J8J75j71M5j2o3J43
6940A05k96J03L5M0J1o1K9O5K5J2J6r2R6j03o6J27j07m3l0J83K4p7o1J28k01K21
6966H3l9N8k7j06P0M6m7p0J0N6N7j29J08p0q1O9j0J13j7j9j04J25K1j70m8N3M9
6993a9l7PK6P3p4j3RJ43j97M4m2O6k75k96O54p7J02r5J6N1n5M8l9kQ6j54J05r2
7021c7N0j03J67j85J35N1Rp4n7L0N8q6l1M3P0N9j02j6l8Q2m0no0R7o4N7M1j7j38
$$ plain form
6825 21 -77 -47 -40 42 4 9 -25 -8 -35 109 2 3 -66 2 31 5 29 -93 72 75 88 -80 143 46 -11 72 -133 85
6853 85 32 139 62 -26 72 -6 31 -6 -32 11 102 -6 -75 15 20 -3 88 -14 37 -23 48 30 -47 11 8 11 45 15 87 98
6883 98 -31 11 19 -56 -95 -47 29 -6 -58 81 30 -3 -167 -121 36 -16 -99 11 -22 -102 -82 -76 20 -3 -11 5 -74 76 -9
6912 -9 36 -48 -88 19 84 19 -54 -106 -58 -32 12 41 -34 33 5 -139 -14 -81 -36 15 -30 -12 163 -8 37 25 -38 105
6940 105 -191 -88 -53 -13 -2 -63 -34 31 56 68 84 -8 88 -15 -81 46 -61 -104 -134 49 73 -4 -65 63 -138 83
6966 83 44 102 75 -31 39 85 38 -32 -22 34 91 -38 70 0 -81 -12 -22 91 74 55 -49 76 97 -73 -121 -68 -19
6993 -19 -56 -49 -23 50 -24 -37 -28 115 -82 -38 -80 -14 -289 -585 69 -8 94 -1 15 66 11 59 20 18 104 -50 55 -37
7021 -37 13 -90 77 -108 27 78 87 13 -44 -14 44 -42 -73 -30 40 99 -3 -19 -57 25 -15 -20 -80 17 -47 10 51 34 -104
7050a04J62j31O5L5p2n7J51j42J36n1k6l1J06r7J33j35K4K0N0j7k7m1J6k6m5J42
7076C8l5k0k2Mj6N8l1P1j26P3L4R1j97L2m1JR7o4J80n5L1j50J4N2j9Q3q4L0K2
7105E1j14P9M3pJ6n8Jl2R0q5j5N6q2N9l2O0lj0N1j91J33j13L1NJ11r2L6J2j13
7134a13K20nq7n9J05l8o8%K5L8rK7m7K9k8o2l3K24j03n6K0N4j52J00o0k3J77k15
7162a39K22Q4r4q5L3k3QK0j1n4o8J65q2J44o2m6Q4j24K7j66J99O0L4mj39J0KJ15
7190A10o1qN1k37M1J24o9l4M1N5p7M8M5r8J43j9j14MjP4L5k0q5J54j32J20j97
7217a07J17j7L4j71J88oj14J33q8k8R3m2M9J40j51q4J22j47L6J23j21O4p5M0l5
7242d7N7o6J49k03J76m8m5K9o9n2J50o1j9Q1l1n1j19J78j1N2J2M2N0k72Q3OJ11
$$ plain form
7050 -104 58 -73 -8 27 -45 -102 49 -93 43 -8 -34 -65 41 -56 77 -58 -34 -14 36 19 -8 -49 -33 -59 -104 38
7076 38 3 -17 -39 -35 -51 7 -24 47 -79 -6 28 119 -78 -46 -87 -86 11 -53 127 72 103 -47 -33 19 0 83 -1 29 51
7105 51 -63 16 59 52 68 10 11 -21 69 -16 -31 25 -57 2 -30 30 27 17 68 -123 10 -103 -72 -67 44 -48 -12 0 -113
7134 -113 107 102 15 -44 61 23 -45 -45 -20 18 9 36 -11 18 -10 -72 -105 119 16 -40 -20 34 -118 -18 -78 -101 76 -139
7162 -139 83 167 73 -12 21 -2 6 26 15 -39 -107 58 -24 120 58 12 96 -28 -1 -167 32 92 126 122 -17 -7 -5 110
7190 110 49 41 92 -145 -104 20 -49 -83 -42 13 -64 -16 29 -69 74 55 -59 -55 -56 18 53 33 -52 102 -30 90 -107
7217 -107 10 -7 27 -144 44 38 -76 57 -31 -59 34 -8 41 181 30 -54 68 -79 -43 80 -41 23 -52 -12 -47
7242 -47 10 -56 93 -110 66 18 -27 2 -67 -119 31 -30 -49 32 1 -50 -169 9 -2 50 62 104 154 -118 -35 -29 82
7269H2j16j5J48j27M9kJ7m4M7q5N6m3R7j52O3j2Q2q5P3K2q7J3M3j7l2J50j93N6
7297a2J5J10m5k5j0j5O4j00k7L8J17Mq8r3J23m7k4o4R3m3L9l9m4J50o3l8Q0j27
7325g1K14j52K75m4l76J47m6J56M45n75J76m43R9L82J82k64m00O84K79l09n18
7346a59J07k02N39n0k07K6K21m28l17P40N7m63L25J70l86M98K51n03P6r4J35N89
7368I25o60Q0q51N69Qn89Q05J80j78M54o29q5N69m23m86P33j216Q10O06l98n63
7389c39Q29l80n32J404p17R6j388J43P01O54k74r82J031N86r41q1J149o53k90
7408A6L70j81N24J5m51j07n65K28O41m61J04J55l58K25J8L92n25J13P6m37K46
7429C8l80n2L76j94P21l5l18R4q16N86o80K54K36N68r32J64J123m01j09k80o57
$$ plain form
7269 82 -34 -49 99 -28 21 19 36 -8 39 -46 10 -33 64 -88 -25 -37 45 -40 33 55 -32 -19 24 7 -25 125 -68 -12
7297 -12 3 113 68 43 33 18 82 -18 -45 -7 110 114 26 -67 56 9 -15 -79 14 -29 10 -29 -73 77 14 -24 56 -71
7325 -71 143 -9 266 222 -154 -7 -53 103 548 -27 149 -294 -195 187 369 105 -295 389 668 359 -159
7346 -159 -52 -254 285 235 28 54 275 -153 -470 270 327 -136 189 359 -27 471 722 219 295 201 336 925
7368 925 265 345 -506 63 71 -518 287 467 289 743 114 29 598 175 -311 422 -794 16 622 224 -339
7389 -339 490 110 -422 982 265 361 -1027 -884 -183 471 197 -785 246 832 -109 -190 959 306 16
7408 16 386 205 729 744 293 186 -379 -151 490 29 133 288 -70 155 173 565 40 153 229 -208 38
7429 38 -342 -394 -18 -212 509 474 156 250 -566 20 -660 -406 -170 398 -534 -370 753 352 243 -37 -694
7450f94P57K05l8O2n25O44j99M10m98ok40K95l83K10N3r4M63p53m2K85R0j54O83
7473E31o1n84M2k84L08K15k84J32j76R6J05j36K1N82m50j26k4N1O1j85N71N8m71
7496hR2k51M54m29M77k27k74R9l40j32K53k05P18l1m53J41J13K1m3O5m1P2l2j81
7520a42J07n4J39rq7N8k02K36m2K1k3m1K0n4K1J23n0L4m4j11K9N1O2P3j90J50
7546G5J8j9n2m4K8M6J3q0n3o6%P6M5K8q6K0L3o2%J24q6K2n1Q9o8N6n5N0Q5p3N8
7577G1j15LL4j3mqO0o2ml1pn7K11l03K50N3p1n1K8o2O1J5n2L0l9Q0n1N6k0j21
7607a19J30r8K9N3M6L8L9j21O7j03J0o6J40rJ3o5R5j65N8J8R6j00q8J73k16J18
7633b7k7O3M8J23j11K5q5m9J04l0P8q4j6J15r3jl5p4N0J34j27L5q4jQ4j4N9p9
$$ plain form
7450 -694 63 268 230 292 -233 411 212 622 124 118 -122 173 -210 0 53 -41 422 -331 -373 -88 2 -152 531
7473 531 470 -114 -72 -356 -48 167 -117 15 -161 -65 40 -96 -75 507 57 -69 -93 -42 19 -166 405 463 -8
7496 -8 84 -167 287 -142 335 108 -166 -67 -407 -539 -286 -491 227 196 -257 -116 -3 18 -25 40 -1 71 39 -142
7520 -142 -35 -89 50 41 -46 12 -190 46 4 25 2 -39 -19 -73 -52 71 21 55 11 -100 -71 -20 42 115 -75 75
7546 75 93 74 22 -22 6 52 65 -15 -68 -134 -134 -58 -13 15 -71 -51 -18 -80 -80 44 -42 -20 -71 18 -50 6 -49 1 86 13 71
7577 71 -44 -41 -7 -20 -24 -32 28 -34 -38 -69 -76 -133 78 -225 25 78 7 -44 -16 -78 -17 -2 -54 -24 -63 17 -34 22 2 -119
7607 -119 11 -87 -58 -5 41 79 118 -3 64 -39 -29 -95 45 36 49 -16 79 -86 -28 -10 86 -14 -102 71 -145 -27
7633 -27 -54 9 57 180 69 94 9 -40 64 34 112 28 12 127 34 33 -2 -76 -26 108 -19 16 -68 -69 15 1 60 -19
7661a9k9k5J27j30N7M8k4N2q1o1J42J9n6K9mJ14k73Q8oO5K2n5j50J90L2k7l8q
7689aj4j4lJ05K1L7l8l2j41K08j05L2r6K3m2R6nr4J02l5M9q0p8J3P3K9p3j2O7
7718ho2J14m8L4%o8J73j20o6l7J06k3nK5l9k0J10k3m7j8pL2J0j8J0o5K4J29n9
7747C4n3kn3L0J5m3K5M2k5j4J7R9m9P1j61O5M8l9l1l2M6K2Jm3J29m4p9O2J4p7
7777b5Q5N8k14J06q1N3O6o9M5O2p5n7Q1o6P3j5j06lJ08l0O1K0o5L8k9J8oJ2o2
7806a7m4R5p5L7O7m9Q1j81J04K8j10P9k9M2Jj37J01L1p4j1L8j3J25Nq5MM9J1l5
7835C8p7J2o3K7K06r3q6N9j2O2n0j48J65j3j39Q7P3L6m2rj14P2P0l3j59N7J28
7862E4n5L3rJ22k72J49j22M4J0M2m5j8R3j1m1M6l7l3K1O2o6N7j06nQ3m3O6r2J03
$$ plain form
7661 -19 -48 -73 54 -76 -19 29 5 57 -24 -85 57 76 20 49 45 159 -114 -26 -32 33 55 0 -150 40 72 45 7 -1
7689 -1 -15 -29 -32 73 94 131 93 61 -80 128 23 55 -41 -18 -60 36 31 -63 39 4 53 -27 -105 -92 -19 10 -63 -75 -8
7718 -8 -70 44 -4 30 30 -38 135 15 -51 -88 18 -5 -10 15 -24 -44 66 43 -4 -22 -29 3 13 -5 5 -60 -36 93 34
7747 34 -19 -21 -74 -44 -29 -72 -47 -5 -30 -44 -27 72 23 94 -67 -2 46 7 -24 -56 -10 12 13 -30 99 55 -24 38 52 -25
7777 -25 60 118 -96 10 -71 -18 48 -21 24 86 11 -46 35 -31 42 27 -79 -82 26 -4 57 77 12 50 21 39 33 45 -17
7806 -17 -61 34 -41 -4 63 14 95 -86 18 46 -64 15 -14 28 29 -108 -7 24 -50 -61 -23 -36 89 94 9 13 62 73 38
7835 38 -39 -27 -90 -63 143 50 -36 23 11 73 23 -125 40 27 -112 -25 48 84 42 33 -81 -9 61 28 -131 -74 54
7862 54 -1 32 23 145 -127 22 -100 -56 -46 -4 -49 -67 26 15 -26 20 -17 -50 -29 33 -33 24 -82 -87 -4 -47 19 -73 30
7891C0k9k3J20j38J44j87J9J29k8L4n6m4O9m1j31R2R3r5J08j57l9J32PL8j53J37
7917C1j51J40NR5l9p4N1Qp6P3n8l7L0K8qj7K2n5j09J08Qm4K21j68M5o7J78j80
7945d0N2lo7Q4o0K02k06J66j88R8l4o1J05n1N1k3n1R9q9k4R9j10J3nP8j43J47
7972C9O9q5l3m0O9j30J57Pk8rm6R9R7k69K11p4n5L9p3j1J16l4k0P5j8l3j31JJ99
8001H9q6L0P1n2q9lL8M7j5p1N4j1k0j06K56j73J1Jp7J26J53j86jq2P9O2o0J19
8029A04p2MQq0Q1qj29J50m4J9o2L1%R1k51J92j9K9J1n3R0n1K1j50L3M1n9J38j45
8058h0J76q4Q8Oj10qk8J18q5r4M7J51j42L7l2J27rj06K7R7j32J10j20J05q1j8
8084d0L3O8m1k8P6j22R0j11J9M3m1P3M3j31L9K26j45L2j29kP6n1O5J6k40K12J1
$$ plain form
7891 30 1 -22 98 -40 104 -83 -64 65 37 71 15 -29 40 -1 -132 -40 53 -42 66 -91 -130 2 9 47 -106 31
7917 31 -120 20 25 120 81 7 58 66 -10 63 5 -32 -2 26 18 1 23 -32 -141 -33 -25 -69 152 -16 29 -38 140 -40
7945 -40 12 9 -58 26 -34 168 -38 128 -60 38 4 -57 48 -3 48 25 -26 73 -16 -40 59 -51 -38 -43 35 -108 39
7972 39 108 23 -10 -50 19 -111 46 53 25 16 -30 69 166 -103 108 34 -21 18 -55 -66 50 16 -4 71 53 20 -111 -110 89
8001 89 3 33 104 52 -37 -40 -2 45 30 -41 13 2 -18 -124 132 -41 -30 -29 -106 20 173 -13 -14 -96 -17 45 -15 104
8029 104 32 36 44 -36 45 37 -92 58 14 33 -29 2 2 93 -158 34 15 44 55 2 92 41 62 -88 -55 -14 -73 65 -80
8058 -80 96 12 100 106 -4 -12 -40 78 -7 -101 -54 97 -45 -8 -40 87 78 -28 -1 96 -36 74 -46 59 -22 -40
8084 -40 -7 61 20 -8 68 -54 36 -75 -56 -13 -54 19 62 -69 -30 196 51 83 -46 -48 28 -23 42 58 -182 30 41
8111D1J4p4J2J5J8q2RL4m1J08q4O4m7R3m0j8qJ38j07o3n5J21j32P8RLJ02q5K2
8140D5m9P2j57M2J28j36o4K26j65O7j09J03q5J16m1K7lq0j8l8R1rR2j1J8j25O3
8167@k3O0j35O8L2K5n2M7J67j83l7r0J85j18J9j8J6l5k3M0R3J8q0N1
$$ plain form
8111 41 55 -19 -7 8 26 -56 -47 -13 -54 54 -30 34 -13 80 40 22 14 152 45 -18 -73 48 -84 -6 3 6 108 23 45
8140 45 -4 68 -89 -47 81 -55 -119 107 -58 9 -100 3 -82 34 -7 20 17 -63 -81 -119 -28 -37 55 44 62 -63 0
8167 0 -23 37 -98 -30 2 27 -25 22 189 6 -31 -121 64 -54 -35 -53 -37 -72 -95 -55 38 56 -24 27
8191B7
$$ Imaginary data points
##PAGE= N=2
##DATA TABLE= (X++(I..I)), XYDATA
0@%%%%%%%%%%%%%%Qj6J6j6J6k4L2l2M0m8N6o5P3q8J04j20J36j52J73j97K24k54
36a34K84l19L56l96M42m92N45o03O67p38Q16q99R90j089J201j326J459j607J775
55I32j966K183k430K717l054L457l949M567n368O451q013J0463j4893K5417r8067
70h1553p8304J84896N8558o2254m5512N8942L4921j2208k0915m146j2543K6614
82D6496K5615m8322q6225j200O4916J7533o5297l7502L4008L4381m963l359Q067
95a5852J4476J9686J9270j006j2462J4205L4182j2857n0591j8722J4259O725k981
108H332p724k1649k7858K820K6204k058j2652L1870L1919k4699l3686J5986L9419
121B6224J1710p364R92j0138k3356J042J3011j1036j4379R317R599k2674k8642
$$ plain form
0 0 0 0 0 0 0 0 0 0 0 0 0 0 0 0 8 -8 8 -8 8 -16 16 -16 24 -24 32 -33 40 -48 56 -64 72 -80 93 -104 120 -134
36 -134 150 -169 187 -209 233 -259 286 -317 350 -388 428 -471 519 -570 631 -695 764 -843 932
55 932 -1034 1149 -1281 1436 -1618 1839 -2110 2457 -2911 3540 -4473 5990 -8903 16514 -81553
70 -81553 -159857 25039 83597 21343 -24169 34773 69694 57486 36571 32425 19882 46496
82 46496 72111 23789 -62436 -63636 1280 18813 -46484 -83986 -49978 -15597 -20560 -23919 -15852
95 -15852 -1376 18310 37580 36574 24112 38317 72499 59642 9051 -9671 4588 11313 8332
108 8332 608 -21041 -48899 -46079 -19875 -21933 -34585 -2715 29204 4505 -29181 -13195 26224
121 26224 37934 30570 31562 21424 -1932 -890 12121 1085 -13294 -3977 5622 -17052 -45694
134d5694J7898L8124l540k5826J424K0801P388o545K071P872q372j0915J595m65
148d184R45J1515K399j7941j9255L053J9512J0392K319M923p305j3389Q57P838
162A679P604P046L077o424j9767j6975M685J3821P524j803j1173o536N608O407
176e227M843O149P453P126m393j1334K946J3976N749j0883j8499o459M716j12
190c949k548k222o230n254l160n59R586J5684J2976R6j3782m723J2792J2821O233
205B7761K58n516q509j4573j2116K716Q931K457q434j6536q018M815O818Q754
219a1192P976L590K122j741k38R861J1745M629m736j1653n376J830m97r80m176
234A164j0122r257n867J023R846O938Q84k271m965J042Q588J1301J2925L844r331
$$ plain form
134 -45694 -27796 10328 6788 -19038 -17614 3187 10575 4030 6101 13973 5601 -5314 -3719 -4184
148 -4184 -3239 8276 10675 -7266 -26521 -23468 -3956 6436 8755 13678 6373 -7016 -6159 1679
162 1679 9283 16329 19406 12982 -6785 -23760 -19075 -5254 2270 467 -10706 -17242 -11634 -5227
176 -5227 -384 5765 13218 20344 15951 4617 7563 21539 27288 16405 -2094 -8553 -3837 -3949
190 -3949 -6497 -8719 -14949 -20203 -23363 -23922 -14336 1348 14324 14420 638 -4085 8707 21528 27761
205 27761 28019 22503 13994 -579 -12695 -9979 -1048 1409 -7025 -23561 -31579 -26764 -19946 -11192
219 -11192 -3216 374 2496 755 517 10378 22123 26752 22016 10363 4987 6817 6320 5340 1164
234 1164 -8958 -18215 -24082 -23059 -13213 -6275 -5391 -7662 -12627 -11585 -2997 8304 21229 25073 15742
249A5742r586l896L199P518J124m030o988j2056q506n00N572J0368L510p595o632
264a2756o04P243J1051M862J066o88n722k736K253L291M996j501r784q500l304
279a0833M239Q551J022m491m450m667J087O604P130P021j544r534n815r33N332
294a281R137K429m705p910q857m03O358O272O338j194q030m052P19N363Q344K836
310A1364j713o117r255r48N322L805J518m701q297l698N31N361P927K472j377
325B194l239m318L939R265O801K327n630q868l680m48L325M924k413p268q450
340a1539p007K169P414O237M096l290n961P75N161Q954R108J468l860n713n633
355B379J516M007J023j311p895j1137m695O21N865O191k212l572k567k57P267
$$ plain form
249 15742 6156 2260 5459 12977 14101 10071 3083 -8973 -17479 -17979 -12407 -2039 1471 -6124 -12756
264 -12756 -13360 -6117 4934 9796 10862 10174 4452 1716 3969 7260 12256 10755 971 -7529 -10833
279 -10833 -6594 1957 2979 -1512 -5962 -10629 -9542 -2938 4192 11213 9669 135 -5680 -6613 -1281
294 -1281 7856 10285 5580 -2330 -11187 -11590 -5232 1040 7378 6184 -1846 -5898 -5179 184 8528 11364
310 11364 9651 3534 -5721 -6669 -1347 2458 3976 -725 -9022 -12720 -12189 -6828 1099 3571 2194
325 2194 -1045 -5363 -1424 7841 14642 16969 11339 2471 -1209 -1657 1668 6592 4179 -3089 -11539
340 -11539 -18546 -16377 -8963 -2726 1370 -1920 -7881 -7106 -1945 7009 16117 17585 13725 8012 2379
355 2379 3895 7902 8925 7614 -281 -11418 -16113 -15492 -9627 -3436 -5648 -9220 -11787 -12044 -4777
370d777R643O367L591l161n950j252K260N889L848n808r515q137n105K549L898
385e660J073n83n305n262J402N202R622Q450j72l830l466J83O997O329K34l309
401A1905p902p627k195P30M058K797m716o842n182m33P882Q335L322j6m450k936
417c270L159M978O084K887m147n982n942k842M735M351n30l306p047m533J960
432i445M914O318L043l873l394j946J304P199M729l70k922p099m554K130M267
447C01M328J38n530n295l397J840Q999N582o85l158n135k071K706M094N472P25
463H914o523o681m067N40N694L337j35l038o489j332O351N505L523J063j519k087
479C056l003J301P463K696l661o266p481k447L473K609J113k609n789k765N69
$$ plain form
370 -4777 4866 11233 14824 11663 5713 4461 6721 12610 16458 10650 1135 -7002 -12107 -9558 -5660
385 -5660 -4587 -5170 -10475 -15737 -14335 -9133 489 8939 8767 4937 1471 1654 8651 14980 15214 11905
401 11905 4003 -3624 -5819 -5089 -1031 1766 -2950 -9792 -14974 -15407 -7525 810 4132 4116 -334 -3270
417 -3270 -111 4867 10951 13838 9691 3709 -2233 -5075 -340 4011 3481 175 -6872 -11405 -9445
432 -9445 -4531 1787 4830 957 -2437 -4383 -3079 4120 8849 8479 5557 -1542 -6096 -3966 301
447 301 4629 4767 -763 -6058 -9455 -7615 1384 6966 6281 3123 -2012 -4083 -1377 2717 8189 8914
463 8914 2391 -4290 -8357 -7817 -2123 1214 1079 -1959 -8448 -9780 -3429 2076 5599 6662 5143 3056
479 3056 53 1354 8817 11513 7852 1586 -5895 -8342 -4869 -2260 -1147 -3756 -9545 -12310 -11741
494a1741N084Q075M384J235j311n546k77P469O904K672m604q338n344k989L45
509c982L351p93l520m104n597j017M297O179P628K018n074j613M813P606M769
524A4961j433j691k247n859k598J284k77o27m100q943o002N68P374P192j100l317
540f815l30J666N404N868M204N448L33p813o364k79N611M217m440q204o961m591
556a3046J359K688J203K816N69l049r83K268O574Q823K569l256m479j363M581
571G274K799k006j772m682o509j633K64J191K371L71k482n130j948P944R113K347
587G512q70l352l151J398K316K688K812j700m908o558m976K309N347L357o16o222
603d614m495L429M339L234K457P59j395k808k586J962L179J966n18p901n123K750
$$ plain form
494 -11741 -6657 1418 5802 7037 5726 180 -97 7372 14276 16948 12344 4006 -1338 -4327 -3982
509 -3982 -631 -1424 -4944 -9048 -14645 -15662 -11365 -5186 2442 4460 -614 -2227 2586 10192 14961
524 14961 13528 11837 9590 3731 1133 2417 2140 1513 -2587 -11530 -17532 -16964 -9590 -2398 -3498 -6815
540 -6815 -7145 -5479 -75 5793 9997 15445 15778 7965 1601 1322 6933 11150 6710 -1494 -8455 -13046
556 -13046 -11687 -8999 -7796 -4980 -4411 -7460 -8443 -6175 399 9222 11791 8535 4056 2693 7274
571 7274 10073 8067 6295 1613 -4896 -6529 -6265 -5074 -2703 -2332 -4814 -9944 -11892 -3948 5165 7512
587 7512 6642 3290 139 1537 3853 6541 9353 7653 2745 -3813 -8789 -6480 -1133 2224 1608 -4614
603 -4614 -9109 -5680 -1341 1893 4350 5109 3714 906 -1680 282 3461 5427 4909 -2992 -8115 -5365
619e365K880J326R03j482l479J8R85N259M084K371N75n707m958K130M007K840
635F387p5n620n927l490m53L556L448J176k46l430k326K230M560O840M831l276
651H185m757j184J343K370K22j206k490n620m286l6Q65K701J592l638k995O66
667h268M144O543L953O84j128k218o9K714J924K241p41o852o536l160J84L462
683c123J469k087l317l866l2M168M687N501K948k309j815J64J958M478K087j651
699I260m120n725k478N15J71O67j440m477k430K16K566N100L232m2r91j640K036
716D20M907L442J651k506n145k591j161K15K843M00l553m629m316O21M384L759
732a259K679l72l167k79J411K721M763J966j542l539m350k43K515J009K21k450
$$ plain form
619 -5365 -2485 -1159 -256 -1738 -5217 -5199 -4214 1045 5129 7500 8075 2368 -2590 -460 3547 6387
635 6387 6312 692 -5235 -8725 -9178 -5622 -2174 -998 -1244 -4674 -7000 -4770 -210 6630 11461 8185
651 8185 3428 2244 3587 5957 6179 4973 2483 -3137 -7423 -7459 -6594 -3893 -2301 -5939 -8934 -8268
667 -8268 -4124 2419 6372 7056 5928 3710 3641 6355 8279 10520 9779 2927 -3609 -6769 -6585 -3123
683 -3123 -1654 -3741 -7058 -10924 -10956 -6788 -2101 3400 6348 4039 2224 2388 4346 8824 10911 9260
699 9260 5140 -585 -3063 -2548 -2377 -1710 -3150 -7627 -10057 -9841 -7275 -2175 1057 1015 24 -1616 420
716 420 5327 8769 10420 7914 2769 178 -983 -768 2075 2475 -1078 -5707 -10023 -9402 -5018 -1259
732 -1259 1420 1048 -2119 -2398 -987 1734 6497 8463 6921 3382 -968 -1211 1304 2313 2534 84
748H4m617j252K98K255L560R09j120j448j723K039M295K464M43k907m298r47O01
765a364J938K348j097l431k881k260J985M225K796J425k152l415k5J947L194L365
781F598q01l020l504k906N73K420P53J3k700l287n17J573L573L924K7j643n86
798D90k12K614L060P07k29l453m336r15L55J496J365k955l833k010n15L392M256
815g23J915Q87j455j772J757L010L673K588k123l726l048k322J286J738j459j887
831a661l962l618J077J654L082L041k16j004p4J231L986L877Q53p09k938k803
847A816K87M38N43n02l838l861k299p76K612K950N82n15j858k96L245L690L491
864E709J883j910k056j315n00K120J303j231k952m498l017Q29J722J698O74k028
$$ plain form
748 84 -4533 -5785 -5487 -3232 328 1237 117 -1331 -3054 -1015 3280 5744 6187 3280 -1018 -1965 -1364
765 -1364 574 2922 1825 -1606 -4487 -6747 -4762 -537 2259 3684 1532 -1883 -1908 39 3233 6598
781 6598 5797 2777 -727 -3633 -3060 -640 113 126 -2574 -5861 -6378 -4805 -1232 2692 2719 1076 490
798 490 278 2892 5952 6659 6430 2977 -1359 -2274 -1919 -423 942 -2013 -5846 -7856 -8371 -4979 -723
815 -723 1192 2079 624 -1148 609 3619 7292 9880 7757 4031 983 -1339 -53 1685 226 -1661
831 -1661 -5623 -9241 -8164 -6510 -3428 -387 -603 -1607 -1681 -450 3536 7413 8266 7557 4619 1816
847 1816 2103 2541 3084 2582 -1256 -5117 -7416 -8192 -5580 -2630 -2048 -2563 -4421 -4717 -1472 2218 5709
864 5709 7592 5682 3626 2311 1811 3931 5234 4003 1051 -3447 -6464 -5635 -3913 -2215 -1541 -3569
880c569j362L36J613L859L133N32l76k170j191J688J623J040q22l831k964j276
896c737J87K208J008j102j039k077n01K796L039K637M33k407j538r6J205K937
912C953O98j783k322k953j328J551J435J498k70k610j613L14J956L676J491r88
928B705j123k208j43K202J242N81j376l079j926n36R41K776N79j173j500j589
944c627Q10L319K264J165m29k251j113K12J144K126l52k242k203k863m78K318
960b200J329L83q97k326k06J473K351L270Q30p75q45j758O60K383O26j20k091
977B087l791j981J08J306J503q14j500r03j419J744L772J679J358l21j667p3J138
994B226J877J813r40k666k610k096L53J418m35m70j553k369q8J661K197K519P81
$$ plain form
880 -3569 -4931 -4595 -2982 877 4010 4542 4166 1996 805 2493 4116 5156 4334 503 -2461 -3737
896 -3737 -3550 -1342 -334 -1436 -2475 -4552 -5053 -2257 782 3419 3852 1445 -93 -189 1016 3953
912 3953 4651 2868 546 -2407 -3735 -2184 -749 749 479 -2131 -3744 -3430 -1474 2202 3693 2705
928 2705 1582 -626 -769 1433 2675 3256 1880 -1199 -3125 -3661 -2720 56 635 -538 -2038 -3627
944 -3627 -2817 502 2766 3931 3502 1251 138 350 1494 3620 3268 1026 -1177 -4040 -4518 -2200
960 -2200 -871 -488 -1385 -3711 -3917 -2444 -93 3177 4007 3232 2387 629 1289 3672 4298 4178 2087
977 2087 -1704 -3685 -3577 -2271 -768 -1582 -3082 -3985 -5404 -3660 112 1791 3149 2828 1161 1088 2226
994 2226 4103 5916 4976 2310 -300 -2396 -2043 -625 -1060 -1530 -3083 -5452 -5540 -3879 -1682 837 1618
1011A618o54o22o90K447L064M07n35k183k881n15K95L26M96j316k292j846j075
1028e956K005K723J059P64r52j604J538K393J943J119r21j539j527j637J010J135
1044A553m12q54k571k659N49J524J702J483p70j170nO74K508J708K79K91j928
1061A902k404M21J045P76L49k077k554j181k8K070J673L7J3j248q87J702J540
1078A149J597J484j323k331j123P9J439P78q89j145k195j497J298J208J188J203
1094I20r15j311O5P82K585J344k39q19k311j061J292N94K2r3k149j892m63M57
1112c192K030J450L6m67j299j27K260J688J284L50k077j413m81mP77P14j092j763
1130a326k163n87J471R53J333M96j381o19J020J259K133J178m62j154j616k49
$$ plain form
1011 1618 964 342 -348 2099 5163 5570 5035 2852 -29 -544 -249 77 573 -743 -3035 -4881 -5956
1028 -5956 -3951 -1228 -169 595 -357 -1961 -423 1970 3913 5032 4111 2572 1045 -592 418 1553
1044 1553 1141 287 -2284 -4943 -4394 -2870 -1168 315 -455 -1625 -1630 -956 1552 3260 3539 3830 1902
1061 1902 -502 -81 964 1740 2089 12 -2542 -3723 -3751 -1681 -8 29 42 -1206 -2093 -391 1149
1078 1149 2746 4230 2907 576 -547 -468 971 1749 860 -285 -2480 -3977 -2679 -1471 -283 920
1094 920 5 -1306 -1241 -459 2126 3470 3231 2412 101 -960 332 926 948 855 -1294 -3186 -3649 -3192
1112 -3192 -1162 288 324 -143 -1442 -1569 691 2379 3663 4013 1936 523 42 38 815 1529 437 -1326
1130 -1326 -3489 -4076 -2605 -1652 -319 177 -1204 -1823 -803 456 2589 3767 3305 2151 535 286
1146B86J192J60m5p92k702j445LN99J640Q20m15p26q92Q77K276J342J227m7k004
1165A354p92Q1K54J121K17j587j777j782k34J275P91P68k29j578j40J175J158
1182G5K036P25q85o86q98J61J076L61o0j318k381p01K26O14J371R1j084n75l77
1201b229J005K007J162O02l68j741n00M76O56J051m35j787j312r91J28J427L12
1218e37N28p26j209M51P15J635J528M72j448p52m56P62K15O46o57j280j850k99
1236b262L40O74J265m04r84l66k3J210K048Q29O4r62j259K15N92P26L91j008j752
1255f66j136p80M12J502J89n2q54r26Q72J218J279J375l48q37l34m12O71Q40k07
1274A806p63j473j593J23L35N87N21o26r14k6J58J640J738K77N7o41r22N78Q01
$$ plain form
1146 286 1478 1638 1593 801 -1901 -3346 -3343 -2744 -1104 -284 -699 -1425 -2317 -1440 836 2178 3405 3358 1354
1165 1354 562 643 897 2018 2235 648 -1129 -2911 -3145 -1870 -1079 -311 -540 -2118 -2258 -1083 75
1182 75 2111 2836 1951 1265 367 528 1604 1965 1905 587 -1794 -2495 -2269 -1655 -284 -193 -1277 -1852 -2229
1201 -2229 -1224 783 1945 2547 2179 438 -62 414 1070 2121 1686 -101 -1413 -2404 -2276 -849 -537
1218 -537 -9 -735 -1944 -1493 -778 857 2385 2857 1409 657 201 963 1178 1824 1167 -113 -1963 -2262
1236 -2262 -1922 -1248 17 -387 -1371 -1737 -1760 -550 1498 2327 2391 1429 170 385 977 1703 2094 1086 -666
1255 -666 -1802 -2582 -2170 -668 -479 -531 -1385 -2311 -1439 -221 1058 2433 2085 1248 914 502 1173 2013 1806
1274 1806 1043 -430 -2023 -1900 -1565 -978 -457 -1083 -1997 -2023 -1865 -225 1513 1790 1847 1206 284 862 1663
1293A663N10L62j674j514q92m62M02J117j19n04j001n40J117J264J177J083p01
1310A288m71j21R6R58P13n27p24j459j301K60M12K47J03j006q86K00M33J594J310
1329A119L3r5m73l11Q98Q68M08J7j588j333o60l05Q53N06q24o79q36j95J086J174
1349c37R62O71p32l53K53N13J171M81o44r24j272p74L36K85P5k52j116p40J97
1368b200O26J293Q80q5pl42L7J054R26J93l52j263r42l82l1P44p4r33p73o79j19
1389b429J354Q05P93J49p05m8M66O60J118L48p35q72r54m78N94J18j63n85j163
1408a727n74K93O14J234N15l76rl22M48J251N38J67l70j145o04p9K98L33j99j180
1428h94o64o85Q9J273O06K43J05o57N8Q51O82R73P9p13n94q41J7O41j07l54o25
$$ plain form
1293 1663 2173 2535 861 -653 -1545 -2007 -1605 -488 -607 -1111 -2112 -2652 -1535 -271 906 1989 1288
1310 1288 817 696 792 1750 2463 1936 1212 -247 -1548 -1288 -876 -629 -526 -1532 -2418 -2218 -1785 -191 1119
1329 1119 1152 1057 584 273 1171 2039 2447 2464 876 -457 -1117 -1422 -569 -63 -887 -1566 -2402 -2597 -1511 -337
1349 -337 625 1296 564 211 464 977 2148 2629 1985 1061 -211 -985 -649 -364 -289 -541 -1657 -2397 -2200
1368 -2200 -1574 -281 599 514 507 165 202 1256 2182 2375 2023 760 -182 -564 -595 149 75 -858 -1631 -2310 -2429
1389 -2429 -1075 -270 523 672 -33 -81 385 1045 2163 2511 1776 904 -50 -528 66 184 21 -564 -1727
1408 -1727 -2301 -2008 -1394 -160 355 -21 -30 -352 96 1347 1885 2052 1682 537 -67 -146 152 485 286 -894
1428 -894 -1558 -2243 -2154 -881 -275 -32 73 -584 -526 325 1007 1980 2059 1346 752 -89 -72 569 462 108 -517
1449e17j241j48K33O15R08l2k92k9j13O28J236L63R3m41q75m54L86J81K25m32
1469B94j060o81n17M61J048J00P4jo60L66P56Q11P75p0q02k96o68L42N80l14l61
1490A77n57j190q6O91L11M07J51m88m8o8R22J002P5P5m92q32R7O37j67J32o31
1511A18r84m54k49M79P85O0l0l98m34O76Q08N75O16l14o68k20j76M37M39m55l69
1532B42p45r16K21L24K49N10l41m78o7L98Q94P58J31r9n00n72M97L26R3M1o02
1553C64r98l54q8L99N88j66j97n27k74P79O09L66O32m12m32j02J28M44L27j72
1573I14n23p42n29M37K42J72J1n28n54J70L81N27O62o5k19m81k40O34N21M1J74
1594A005p80p05L9L7L14L92l21k61q98P9R78K16L04K15o25m43K11K34M92K90k66
$$ plain form
1449 -517 -1758 -1906 -1673 -1058 -150 -182 -474 -503 -616 12 1248 1611 1704 1263 388 -66 320 501 726 294
1469 294 -766 -1447 -1964 -1503 -455 -355 -281 -282 -942 -576 180 991 1766 1696 894 598 -70 272 852 538 177
1490 177 -380 -1570 -1656 -965 -654 -247 -96 -584 -632 -700 222 1224 1299 1374 882 50 147 784 617 749 118
1511 118 -866 -1320 -1569 -1090 -305 -245 -275 -673 -1107 -431 377 952 1568 1254 586 366 190 627 1066 611 242
1532 242 -503 -1419 -1198 -874 -625 -115 -456 -934 -1001 -603 291 1049 1180 1081 581 9 506 832 925 966 364
1553 364 -634 -988 -1076 -677 -89 -255 -452 -979 -1253 -474 135 501 1133 721 289 187 315 759 1086 914
1573 914 391 -351 -880 -443 -201 -29 -18 -546 -1100 -930 -549 -22 640 575 356 -125 -365 269 790 831 1005
1594 1005 225 -480 -441 -404 -90 302 -19 -280 -1178 -1099 -121 95 399 614 -11 -454 -243 -9 483 773 507
1615E07m80m60k13N00L00K61L6o35o03M57J3O94L38m76k32l35j16M02N16k39j00
1636A35l82l73j63O95J87O44o6r22m57l35J334N01l61L42q44k18P03l62m4j48
1656a34m68M13o09M9N28K14J95j43o70Q9O26J18M50K49m79k42k00J8M00J07M5
1677E56m28o84l22K07J08N69N0m17k00j33K37P76K60K59j84m61n0J70J61J66Q5
1698G25p76k09l53j69N00J88j66l1n54J32M37K60N33J36l59j12p3J61N54Nk04
1719F25l59o81l3M8J79K92k67l30r4j47K79P37J15P1k02k40L7L22J87N20n03n57
1741aj15l42N8M33J6k98k26m01K32M37J44O02k63k92n0P2K92M11p3j76k98n89
1763d27mM63j31O7m8n44J18m1K30O00l5R9j08l41J96L49R3K36m28n58K6j34NM18
$$ plain form
1615 507 27 -433 -646 -146 154 415 451 -184 -787 -330 -317 377 715 239 7 -328 -444 -42 474 235 135
1636 135 -247 -620 -783 -88 99 743 677 -245 -702 -1037 297 798 437 779 -65 -283 420 58 14 -134
1656 -134 -602 -189 -798 -749 -221 -7 188 45 -625 -536 90 208 658 907 428 186 -14 4 404 511 556
1677 556 128 -556 -878 -671 -563 6 56 -361 -561 -694 -457 319 579 838 654 193 143 313 474 640 725
1698 725 -51 -260 -613 -782 -282 -94 -260 -291 -845 -713 -276 -16 517 653 294 182 109 270 824 829 625
1719 625 266 -415 -448 -400 -221 71 -196 -526 -620 -767 -488 249 364 435 233 -7 30 352 539 1059 556 -1
1741 -1 -116 -458 -400 33 49 -249 -475 -876 -644 -207 -63 539 276 -16 -66 6 298 709 636 460 162 -427
1763 -427 -431 32 -99 -32 -80 -624 -506 -547 -317 283 248 347 239 -102 94 443 536 772 344 -214 -188 -322 -317 101
1787A01k20j55k82l42L33M12K23M49k70l18K82j20M49K81j63k22l72n15J16J18
1807b15J35p4k81m02J18m3M16N62L6j37R0j85M86K74L0K15m94m24j93k10Q2J71
1829d3k57j96l33k77L98K26L45K79j22n6J66J56M09L35k46k13l62l19J88J15k30
1850c7o7n24k54j1J11K85M05j06Q1P0r5L89M78N8J38l31l26q6N5K20j83k99l82
1873d11k98k02K43K32R1J15j43o9M35J97L90K27k36j03j21k67L13K6j47j44n40
1894d12j83j2Q9L68pj91M7q8N8M56K52J37J8k19k93J94M7J88l1l83k85k58j11
1917f19L60K40j67k2k11KK03L02J95K08j42j10j70j2L43j02oj44l41j87M5O8J63
1940a04L3j32k0j65K17L46J3J51K5k81k35M06j16K91j16m50j47j76J36L12k6q5
$$ plain form
1787 101 -119 -274 -556 -898 -565 -153 70 519 249 -69 213 93 542 823 660 438 66 -449 -333 -215
1807 -215 -80 -154 -435 -837 -719 -762 -346 216 252 115 205 20 506 780 810 1025 531 107 -86 -296 -214 -43
1829 -43 -300 -496 -829 -1106 -708 -482 -137 142 20 -36 130 286 695 1030 784 571 209 -110 78 193 -37
1850 -37 -104 -628 -882 -893 -782 -497 -92 -198 -117 -47 -142 247 725 783 921 590 264 178 233 453 270 -29 -411
1873 -411 -709 -911 -668 -436 -345 -230 -373 -442 -7 190 580 807 571 468 347 80 393 419 272 128 -412
1894 -412 -595 -607 -518 -150 -157 -348 -301 -389 -331 125 377 514 532 313 20 214 261 449 418 35 -250 -508 -619
1917 -619 -259 -19 -186 -208 -419 -417 -214 88 283 491 349 239 69 57 400 298 292 148 -193 -380 -335 -267 -104
1940 -104 -71 -203 -223 -388 -171 175 188 339 364 83 -152 254 138 429 313 -137 -284 -460 -324 -12 -38 -123
1962a23J46k74pK98J64J53n5j89J09j76j3L30k00M3k06l85l2K15J9K64q2p9k01
1985b81l8K40K75J36J4n9l38J72J26n5m5L8l85l2L0p8L00l4l1j94r3J18J73J36
2009I5K15K2k16K9j15J22R6j2j08j37l15J54k3O1J31L7m32m7J12J72L95j70Q8
2032A54k6k86K23K49q6J40j43l43R1m8o3K13o0j30j16j77K58J50P5N2k54l0L2
2055a25Q9K4K53M5j61m1k99J83J28L0k5j1k85J04q8L8L12k10M7j34j92J24J84
2078a0O0P5q1k18Q6J47P0R9kk35J02j66qJ75l4J15j72l40O2MK39J94o9j59l1n
2104a02O9K45n1N4k96j08P2J95L0J66n6k07n2q9J08J16k8L0k06j46J19j3J40J39
2128A29k11L5Q6k51K44K10o6R2j64j19K7nK1J06n8k1k30n5k7J83J13l2j68p3K8
$$ plain form
1962 -123 23 -251 -258 40 204 357 302 113 222 46 33 363 163 206 0 -385 -417 -202 -183 81 -1 -80 -281
1985 -281 -319 -79 196 332 346 287 -51 121 247 192 147 185 -200 -232 -202 -280 20 -14 -45 -239 -332 -214 -41 95
2009 95 310 332 116 145 30 152 248 236 128 -9 -324 -170 -193 -132 -1 36 -396 -443 -331 -159 236 66 154
2032 154 128 -158 65 314 228 368 225 -118 -27 -75 -138 75 15 -115 -231 -408 -150 0 75 127 -127 -157 -125
2055 -125 -36 -12 241 286 125 84 -215 -32 96 126 101 90 -195 -91 -179 -141 171 -39 8 -126 -318 -194 -10
2078 -10 50 125 44 -174 -88 59 129 228 226 -9 93 -73 -81 94 60 175 3 -337 -275 -271 -32 162 93 -66 -97 -102
2104 -102 -33 212 161 215 -81 -189 -117 78 108 274 218 11 -41 -130 -22 94 66 96 -110 -256 -137 -150 -10 129
2128 129 -82 -47 39 -212 32 242 176 268 104 -15 12 7 28 134 76 55 -175 -230 -257 -74 39 7 -161 -234 -206
2153b06K32M6J13j07p6L6P1KJ20Pn9k43l1n0o2K83o2j35o7j0j38J92J72j02J63
2178H9J2k92L00J00M9J34k52m9p7j50K15L1n4j52k27N1Q7M9J48L6j39J34q9q0
2202a26L17j09J72j2j79j12O5L6M2j7j93mo1r3J92J03r9P5p1q0J94R2P3o4j74
2227c3L7j90o7L64N1j62q1q6J0J89l9J10k3j55J4P5o2K01R0j41L2l16R2J19o1
2252c2J07k3k50O6r6Q7J95l7M1K0n9J3R8j09K11o1j93l2m5J6NN2j10L4k01R5J52
2279e6o5J94J15j23M2q0O1K41r3p2q6j91QJ37r3Q1r9r4L5J8k08L16r9O4k4N4q1
2306i8L15m5K68l12L5M4j60J4R8j61j36j79o3J06K08p0J41k3k05K08L2K7L05j12
2330B37q4n7m2MO2N5k0j25l21K33p4l6L2o7l0N9l4J19J78q0J19K9j18n3O0o0K40
$$ plain form
2153 -206 26 72 185 78 2 38 109 111 231 238 179 -64 -95 -145 -207 76 14 -121 -188 -198 -336 -144 28 -74 89
2178 89 101 -191 109 209 258 392 140 91 14 -136 79 110 56 -96 -323 -272 -185 -136 12 48 -91 43 -46 -126
2202 -126 191 82 254 242 63 -49 16 52 94 77 -116 -120 -181 -274 -82 21 -78 -3 -74 -154 40 132 205 141 -33
2227 -33 4 -186 -253 111 162 0 -81 -167 -157 32 -7 103 80 -75 -61 14 -48 153 243 102 134 -182 -90 29 -32
2252 -32 75 52 -198 -132 -228 -141 54 17 58 78 19 32 130 21 232 171 -22 -54 -99 -83 -78 -26 -136 -102 -303 -208 -56
2279 -56 -121 73 188 65 107 27 88 329 236 164 78 -113 -105 32 -61 20 -79 -173 -138 -120 -328 -12 -111 -47 -71 -17 -98
2306 -98 217 172 440 128 163 207 47 61 159 -2 -138 -317 -380 -274 -66 -136 5 -18 -223 -15 17 44 349 237
2330 237 153 96 54 58 120 175 155 30 -291 -58 -132 -168 -136 -203 -233 -174 -208 -89 89 9 128 157 39 -14 46 -14 226
2357B26j74p9Q5j88O6q3O9o2J77k19j42R26q01L65j6j6j34K87l73L60l00K18k79
2380h7p3K34Oj41J35J62m36J39l65O06l0k37J84J44k31k52k93M07M00o77K11M58
2402B64o5j76K48n06O93n35N69l53l63O41K5o52N2o1M6M31m41M29j85Ok53K88
2424A02j36J01M0o9k18J6J81j8k9N2J31j15j99J72K0O2J19j91J29k24L5J18n5
2447B4j23oqRJ56j59J75NJ2o8p0J74m2J2m3K8o2j09J15j81L5K9n5J23j1o2O4N3
2475A5J4N3j21N4Q4o6J91n1j07nn5r9J41o5l0k0j05O0M0R9K7p8L6K1j4j17N7K00
2503A59j61Nk6pN2o0j18K98l60R4kQJ24M2j26J55q4o7J10KJ05Q6k96J28K7r1j2
2530a5M0k6k0m3o7J73j02J96n2o1o2K7j26K40o2J6r0Kj18J59j13Q0L7p3k5pqJ46
$$ plain form
2357 226 52 -27 58 -130 -64 -147 -78 -140 37 -182 -324 602 -199 166 150 134 0 287 -86 274 -26 192 -87
2380 -87 -160 74 80 -61 74 236 -200 -61 -426 180 150 -87 97 241 10 -242 -535 -128 272 -405 -194 264
2402 264 199 23 271 -235 458 -77 492 139 -224 417 442 -210 -158 -219 -173 258 -183 246 61 67 -186 102
2424 102 -34 67 107 38 -180 -164 17 -1 -30 22 153 38 -161 11 31 93 212 21 150 -74 -39 79 24
2447 24 -99 -105 -113 -104 52 -107 68 73 85 17 -53 121 79 91 48 76 14 -95 20 -161 -126 -97 -152 -29 -40 -102 -38 15
2475 15 29 82 -39 15 99 33 224 173 66 61 6 -93 48 -17 -47 -67 -172 -112 -72 27 54 -24 12 33 19 -98 -41 159
2503 159 -2 3 -23 -30 22 -38 -156 142 -218 -124 -126 -118 6 48 -78 77 -7 -74 36 38 143 229 -67 61 88 -3 -15
2530 -15 25 -1 -21 -64 -131 42 -60 136 84 23 -39 -12 -138 102 40 56 -34 -32 -150 9 -104 -24 13 -60 -85 -92 -100 46
2558D6J08j78P8ml4K6k13K21j7j98J53Kq9K05n7m9l5J07k4k7O1RL3j36P9l5k2
2585A0mQp2J7q5O5Q0j63Q0N8j24L5Q6kJ96l0q0J88j20K5n1rp6o2J18k45m9R4R9
2614a3j67J62p4k7P5nJ40p4p2J15K4N0m1J15r5oj2j20m3k4j16J19m0m5L5%J03
2641c6Q2j4k0oM2rJ17n3q7N5p9m2Q3q3J1R0q2J2j89R8kK13m4j36K8J93r6J19l
2670A62J05k34M9q3m6K20k28P4j62pO2qk0R5kL2n2o8J20J23j16R8j52J68j94K0
2696d4J38r1l6J0r2R5Kn4K6n5J67p5l1O5jP0l8%Q2j70l5K59k72k4K6j2q3K71q3
2725A5l4q9K16j07l4J00n1J52j75RL9n2pK6kJ0rq9O4P7n9L6kn3R0Qo9o4N9M4j36
2756h7Q3o5P6J0Jjk42O3J81J7r7J29K1k06J56K4N4m4p2k3N9l5J02k33J33j2N3
$$ plain form
2558 46 154 -24 54 50 16 42 -171 50 33 -165 -12 -10 -99 106 49 0 -35 72 48 21 82 91 124 -12 67 32 10
2585 10 6 14 -58 -41 -126 -61 19 -144 -64 -6 -130 -95 -9 -11 185 155 75 263 143 168 117 108 32 -30 88 -157 -206 -112 -13
2614 -13 -180 -18 -92 -119 -44 -49 91 17 -55 60 84 134 93 208 113 107 95 -25 -68 -92 -208 -89 -129 -174 -139 -139 -36
2641 -36 46 32 12 6 48 39 156 103 16 71 -8 -50 33 -50 -39 51 -31 -19 -208 -110 -112 101 57 -79 -51 142 46 165 162
2670 162 267 33 82 -1 -47 173 -55 19 -143 -150 -88 -96 -116 -21 -23 9 -43 -111 9 132 16 114 -38 130 -64 -44
2696 -44 94 3 -33 -23 -115 -20 -18 -72 -46 -101 66 -9 -40 25 24 94 56 56 138 -32 -67 192 -80 -104 -78 -90 -173 98 15
2725 15 -19 -108 108 1 -33 67 16 168 -7 2 41 -11 -18 8 6 16 7 -82 -18 59 0 36 34 -19 71 79 10 -54 5 49 -87
2756 -87 -4 -69 7 17 18 17 -225 -162 19 36 -61 68 89 -117 39 63 117 73 1 -22 37 2 104 -129 4 -8 45
2783D5j62J34j12R0k7R7j50J20r3R3J26q3K7mn6o1k2j17K26J5k26M3jL9O0q5J38
2810E4p9M1j27Q5Q8k0L2J1k7j09O8N4k8m7j63J91K0j09LJ47r2m0K0r3J31K0k3
2837Hk9R9pK3m6O4k1j16L8k8l4K26r4j39J07n0N1q4r3J03L6n2M6j15R7J29q3M2
2865G8k0q1K6O4Q1j91J19j22N4m9K7J5k0P8q9O2P6j43r0J25J01j54J12l7%J20
2891A42j59L4Q7q9n7q5J70p2J7J26j9j61P1O6j20J6J2o0N2%m4J44m1k7k5M2K3
2918D3q7P2k4K3M7l7l4%O2j08Q8q4M8O1p2lN1p2j2rP0m2k9P2L5r8O1p1O8J5j06
2949g2N6o5Q6m6J61q3P9n8l8L3k5j4M8j55J15o1J32o0%K1k0Kj45P7l2j4M2q8J38
2978A4k7M9j14J36k7P7J30m92K36k4J33q9K0o9l4J4J25j87K41N0j55M0O5j54K19
$$ plain form
2783 45 -117 17 -95 -5 -32 65 -85 35 -58 35 161 78 105 101 45 -16 -38 -155 71 86 -140 -97 -98 -59 1 -84 54
2810 54 -25 16 -111 -26 62 42 74 85 58 -51 17 71 43 -4 -167 24 44 -65 -62 85 -7 -47 -27 -120 11 31 8
2837 8 -21 78 71 94 48 112 91 -25 13 -15 -49 177 83 -56 51 1 52 -32 -125 -22 14 -38 8 -107 -10 119 36 78
2865 78 58 -23 3 67 148 -43 76 -46 8 -41 -14 1 -19 59 -30 32 108 -35 -125 0 101 -53 59 22 22 142
2891 142 -17 17 104 15 -42 -127 43 -29 -12 114 95 -66 5 71 -49 -33 -21 -81 -29 -29 -73 71 30 3 -22 20 43
2918 43 -44 28 4 27 74 37 3 3 65 -43 45 -39 9 70 -2 -5 46 -26 -38 -47 23 -19 -48 24 59 -39 22 -49 19 34 -72
2949 -72 -16 -81 5 -41 120 37 116 58 20 53 28 14 62 -93 22 -39 93 33 33 54 34 36 -109 -32 -64 -78 -36 -124 14
2978 14 -13 36 -78 58 31 108 238 -254 -18 -42 91 2 22 -47 -81 -67 58 -129 112 162 7 47 112 -42 177
3003A77j48R1l7o9J0j30J12R5k66J32L5K8q4J71q5L0r1R0j0k3l8J21O1j02r2m8
3029g0L0J41j24j63L06k00K6n5J76j24J69K1o5n9R7J35k02Ml3m2J11j04n2J30
3053E3pk1j72J15R9m8P7j35K8K3J8R5PO%j70j06K4J10N3l2n9L9o1m7J46j8Lk4
3082dq1R2j32J87r1L0PJ51j99K9N1o7Q6j24r6P9n6N9R4L6j68M7r4J06J40o9O5
3109G8j70J78p2J09j51RO4q7J10q2M8n2J2k8j81K45l2n6Q6O4n0MJ10j83J21n5
3135C9l4J21j00j26J7J06mn6J0l0J0L7k0l8K2J30q7j9J77j28K0O8o3Q8o1j0j09
3162d0LQ3K8r8q9J99j3k6p6P1q4oJ22m7qJ9k6j0qm4O1J12o4r3k4M9j53J31J5%
3192a6J37m3m9m3N2j1Q7N5n2j54k1J43n2j0P9j94P6k8r5R0P3K7K6j24N9j6oP7
$$ plain form
3003 177 29 120 83 14 24 -106 6 101 -165 -33 2 30 -54 117 32 62 -29 61 51 28 -10 111 172 70 -22 -70
3029 -70 -40 101 -23 -186 120 -80 -54 -109 67 -57 112 133 68 9 106 241 39 43 10 -32 79 -25 -77 53
3053 53 46 25 -147 -32 67 19 96 -39 -11 12 30 125 132 138 138 -32 -138 -114 -4 49 17 -42 -3 -64 -111 35 17 20 -4
3082 -4 -85 7 -125 62 -29 1 8 159 -40 -11 40 -27 59 -65 -161 -82 -138 -79 15 51 -117 -70 -164 -58 82 13 78
3109 78 -92 86 14 123 -28 -19 45 -42 68 -14 34 -18 -6 -34 -215 30 -2 -58 28 92 42 46 156 -27 94 39
3135 39 5 126 26 -100 -83 23 19 -37 -27 -57 -47 -10 -30 -68 -46 84 -3 -22 155 27 47 115 52 140 79 69 -40
3162 -40 -37 46 74 -24 -113 86 73 47 -29 42 -42 -48 74 27 19 38 12 2 -6 -50 11 123 59 -34 -58 -9 -162 -31 -16 -16
3192 -16 121 78 29 -14 38 27 114 169 117 -37 -58 85 33 23 102 -92 -16 -44 -139 -49 24 51 77 -47 12 -4 -10 67
3220F7k7k2l6M2j1J8K0l6K2j56R8M1q3Q2M0j68J36q5J08l1O6l9k0o0j1n2J60j20
3248e7J46j24q9J53j77R2J08k00Q4J16j11J21m7j8K5Q5K7m8j12J21q8m3M3n1L1
3273a3K1m7j9O2j09jP9R6q4Ml8l0J7R3L7k7O0l6j33K2j9J9J5m0R3n5K5l3M8K3
3303C0J23j13r7N2j5J9qk1P6k9J7j40K9Q2L0j29Q6j50P1K4R8o5j10K24j28l2J00
3330B4J3o2J11j90J81j40J29m3K2k9O4m4K6j7J7Oj8k2J8n5q6qR8R6j62l0J28O9
3358I6j82J39j56J48l1qM1J8J1k14J21L7r2J19j39Q0pr2J33p3k54N12K02l86m5
3383b2J3N5O4j37q6J46j14O8k1L7r4N6qM7j1M7K1q6k4j3KK20o6j08O0n4j7O3q8
3412e0k0R2q0L9Kj6K0N9n2J68j08O3j6o1J13j97J3J49r6N1o0j07O3P7j16J08p0
$$ plain form
3220 67 40 18 -18 24 13 31 51 15 37 -119 -21 20 -63 19 59 -109 27 -58 50 19 85 46 26 -34 -45 -97 63 -57
3248 -57 89 -35 -124 29 -148 -56 52 -148 -64 52 -59 62 15 -3 22 107 134 86 -26 95 7 -36 7 -44 -13
3273 -13 8 -39 -58 4 -105 -106 -27 69 -15 -11 -49 -79 -62 31 68 41 101 65 -68 -46 -65 -46 -31 -71 22 -33 -8 -41 7 30
3303 30 153 40 -57 -5 -20 -1 -9 -30 46 17 34 -106 -77 5 35 -94 -8 -158 -87 -63 35 -30 -140 84 -44 -76 24
3330 24 37 -25 86 -104 77 -63 66 23 45 16 80 36 62 45 62 68 50 28 46 -9 -95 -103 -5 91 -71 -101 27 96
3358 96 -86 53 -103 45 14 6 47 65 76 -138 -17 20 -72 47 -92 -12 -19 -111 22 -51 -305 207 409 23 -22
3383 -22 -9 46 110 -27 -113 33 -81 -13 -34 3 -91 -35 -43 4 -7 40 61 -25 -49 -62 -60 160 94 -14 46 -8 -25 38 -50
3412 -50 -70 22 -58 -19 -17 -33 -13 46 -6 162 54 117 101 40 153 -44 -31 118 22 73 13 -94 -31 46 -70 38 -32
3439c2O1R0j27O9j31J3LNJ6R5M2o4J2L5j33n4J04j4j07L0J26l4j06m2J23M6mk0
3467BN2J1O0j52R0M1j23N4j05J18Rj47J9J03j72J54j47N1N3k3P7o1K5O4k1n3O2
3494D1j23R5Jn2K3n9R1%l7m1l4Q0J38j26M3j66J91O4j75J2L0k0L7q8O3M5K1j43
3522h9l1N3mR6j06J75o8jM2p0P2o3J4k2N4L6j52J94j83O3q1N2k1J10r2k1K6nP7
3551E5r0M8L6j5l8N4j11J85r8L0j9q2R1q3J9p2Q7k2l0P6m4K4q1R4Ll6R4qr7P6
3581D6j01O1K7j91R6J06m3j83K12p9J33q7k6Q8j07P7K3nR1o6j8j74J62j22L4k7
3607g3J2Lj70K95J103j119o08R20n17J70j55J49j0K3J7Ol6K9R0j44J4k4K9k0j4
3632c0K0K1O1j23O5o9ppJ14m1K6k0j33K42j31ON1j44K4M4N0o0m2R0Jn6J10oo6
$$ plain form
3439 -32 29 119 -8 61 -70 -57 -54 -49 -33 62 104 40 52 87 -46 -100 4 -10 -117 -87 39 5 -101 -143 -20 26 22 2
3467 2 54 65 125 -27 63 104 -19 35 -70 48 57 -90 -71 32 -140 14 -133 -82 -29 -52 25 -36 -11 53 32 -21 41
3494 41 -82 13 14 -38 -15 -74 17 17 -20 -61 -95 -15 123 -3 40 -126 65 129 -46 -34 -4 -24 13 -75 -12 33 54 -89
3522 -89 -120 -67 -71 25 -81 94 26 25 67 -3 69 6 20 -2 52 88 -64 130 -53 10 -71 -19 -40 70 -22 -43 -17 -22 55
3551 55 -35 13 49 34 -4 50 -61 124 26 56 37 -45 46 -37 -18 -90 -3 -25 -55 21 -23 1 -80 14 17 -19 75 67 -30 46
3581 46 -55 6 33 -158 -62 44 1 -182 30 -49 84 -3 -29 59 -48 29 52 47 138 72 54 -120 42 -80 -46 -73
3607 -73 -61 -58 -228 67 1170 51 -557 363 -154 16 -139 10 0 23 40 46 10 39 129 -15 -1 -25 4 -16 -30
3632 -30 -10 11 72 -51 14 -55 -62 -69 45 4 30 10 -123 119 -12 -6 45 -99 -75 -31 19 -41 -83 7 8 -48 62 56 -10
3661a0l0o5K63l3p9O9j79J02j35J69j13Q5m1L4j2n0r8L9R5q8K04j22J1K4j00O1
3687Al0P7r4PM5m7L1j6M7n8k4J18qM4q7l5J12j90J59Q1j9j76n3J92j08P8r0j2
3715e5M7p5L2N2o8J98j29j8J4L3n1P6j93m6L8K3J51O1o4k2MO4K8k9j02R0k6L8
3743G1o6j16J18r7Q7n6O7On3NJ11j33K7K1M2%j0N3l2j23N0Q5m7j00Q1p4k4J58
3771E1m3RNL2l7n4O9N3K9j07P1j35N9l1L7J7k0p1j7KJ09j06K15r6Kj9N4q7J31
3800A22k10P0L3j2O8j6l1j14P8k3J9l5K3N8k1K6q4P9j9n7p9J05P3o3L6j5Jj0k4
3829b2O6rn3n6L7N6l6l4L7o4l5J68j96J53n7j6J9M0j9L2n7K9J79J36j09o47N00
3856D2j56J18Rnj5j3P5m6L5l8n4J60j63M6l2J33o2j2Q7j44kN6l2j5M9l4p0j0J22
$$ plain form
3661 -10 -40 -105 158 125 46 115 -64 38 -97 72 -41 44 3 37 25 -25 -123 -84 11 -77 127 5 16 40 -60 1
3687 1 -29 48 -46 -39 6 -41 -10 -26 21 -37 -61 57 49 93 6 -29 83 -107 52 133 114 -62 -115 77 -31 47 -43 -55
3715 -55 -8 -83 -51 1 -67 131 2 -16 -2 31 -20 56 -137 -183 -145 -122 29 90 26 4 8 72 100 71 -31 59 33 71
3743 71 5 -111 7 -90 -3 -59 8 14 -39 -34 77 -56 -29 -8 34 34 24 77 45 -78 -28 57 10 -90 -9 -83 -107 51
3771 51 8 17 22 54 17 -37 32 85 114 7 78 -57 2 -29 8 25 5 -66 -83 -81 28 -78 137 41 43 24 78 -9 122
3800 122 -88 -18 15 3 71 55 24 -90 -12 -35 -16 -51 -28 30 9 35 -49 30 11 -46 -125 -20 53 -10 26 11 12 2 -22
3829 -22 44 35 -18 -74 -37 19 -17 -51 -14 -78 -113 55 -141 12 -45 -61 -42 -2 -21 11 -46 -17 162 298 189 -458 42
3856 42 -114 4 13 8 -7 -20 55 9 44 6 -48 112 -51 -5 -37 96 34 22 109 -35 -37 19 -13 -28 21 -13 -83 -93 29
3885B9k9K2O4j36O9l7m2K8K6M6k1o0J03j52N8K5J0M6n4K4o1J39p6N5j3K7k45J12
3913d3l9J26q3M5j8M8q3K0M8J04k2j57lJ42p3j81l8L02k49J68p4O4R3n2q1k1J3
3940d4J21j29O3l1M3l3L1L0p9P2j63O7M0j9o2P3M3l6J0n1m5K69j93n9J46k29J69
3967DP8J1j57n7N0J01p5j1L5n9mJ54p6j33J39J32r2j80J70L5n9j63J55n5L4J4
3993io5L6k0PM5l7J51n9n9m7J61j01J03j21J0M8j38N6K02k48J6J16j33J20l2m1
4019c9J42n2k4L8j2o6k7J73j62l8J07j41J46o3N8k04J74L5k44J16P8K1p4K8M1
4044A1k6j6o7P2J90j05q3q2O7M1J3j15J14n9J18n9q0J64p1kk9j8m1J16p4M1j70
4071a50J19n9N4k0o6rJ25l9M5p3J54j30p2O5n2K49k91J99jJ4r7J5j5J26j23J75
$$ plain form
3885 29 0 22 86 -50 19 -18 -60 -32 -6 40 19 -41 62 -90 -32 -7 3 49 -5 19 -42 97 21 76 63 90 -155 -43
3913 -43 -82 44 -39 6 -12 36 -47 -27 21 125 103 -54 -57 85 12 -169 -207 95 -154 14 -60 4 97 45 -36 -57 -44
3940 -44 77 -52 11 -20 23 -10 21 51 -28 44 -119 -52 -12 -31 -93 -20 23 -13 -3 -54 -99 170 -23 -82 64 -165 4
3967 4 82 93 -64 -121 -71 30 -45 -56 -21 -80 -84 70 -6 -139 0 132 40 -140 30 65 6 -157 -2 -57 -23 -9
3993 -9 -74 -38 -58 -51 -6 -43 108 49 -10 -57 104 3 106 -15 -5 43 -95 -39 163 -85 -69 47 -86 34 2 -39
4019 -39 103 51 27 65 53 -13 -40 133 -29 -67 40 -101 45 -18 40 -164 10 45 -199 -83 -5 16 -58 -30 11
4044 11 -15 -31 -98 -26 164 59 -24 -106 -39 2 15 -100 14 -45 73 14 -66 98 27 25 -4 -22 -63 53 -21 20 -150
4071 -150 -31 -90 -36 -56 -122 -131 -6 -45 0 -73 81 -49 -121 -56 -108 141 -150 49 48 62 -35 -20 -35 91 -32 143
4097A43p8j45O5p6m13K23N10q52k8P72J4k29m7K47km7Ok5l0L5o1J8n5j6L5N4m9
4124c1K2M8l5l6p4R1N6M7M3j73L8M8N2p6j02J14j27Q6NPo6J72j30N2j48K6J3J56
4152G8o8ko2P8q4J43n1o1J28j61mL7J8P9j16J18m6J4k8O9j72J60p5K1J2k4M1l
4180C9K9Lj52K1J09m5P4n4k9O6o5q5J3ML9NN1N4j44jj1L0M0k5j6K7J7l5r2O5J
4211f7J35m2m8L7J36j57m5N3j3O4J22j59M6m9Q3q6k1J3j06L5J9L9L9n8LJ9KL4
4239B8q2O4m9P9l4n4N1L5j40J06j82J27k3O1J12j3k6r0J3j1k0M5mJ0N0l9J4KM
4268C4o7M2K3k6n8M3l0lJ0J51l2k6r8m5J26j31J34J1p3k5k1l4K18n2j61J8J8J28
4296G4q8K0K3r8O8R2j73L4M4L7j34J16m0j34J14M0J39o7j56Q6L0n0o3K08j53L5
$$ plain form
4097 143 65 -80 -15 -91 -504 -281 229 -623 -651 121 135 -94 -141 106 104 57 63 38 8 43 -18 0 -55 -71 -36 18 -31
4124 -31 -9 39 4 -32 -106 -15 41 88 131 -42 -4 44 96 20 -82 32 -95 -9 -4 3 -63 109 -21 31 -117 -91 -78 78
4152 78 10 8 -54 24 -60 83 32 -29 99 -62 -66 -29 -11 68 -48 70 24 38 10 79 -93 67 -8 13 25 1 42 39
4180 39 68 71 -81 -60 49 4 78 24 -5 61 -4 -89 -76 -72 -33 -28 23 77 -67 -68 -79 -49 -9 -34 -50 -23 -6 -41 -133 -68 -67
4211 -67 68 26 -22 15 151 -6 -51 2 -11 53 175 16 62 13 96 10 -11 2 -104 -69 -50 -11 28 -30 -27 -8 -6 28
4239 28 -54 10 -39 40 6 -48 3 38 -102 4 -178 -51 -74 -13 99 86 60 -30 -17 -28 -48 -3 -7 3 53 14 28 30 34
4268 34 -33 9 32 6 -52 -9 -39 -42 -32 119 87 61 -37 -82 44 -87 47 58 -15 -40 -61 -95 123 71 -90 -72 -54 74
4296 74 -14 6 29 -69 -1 91 -82 -48 -4 33 -101 15 -25 -159 -45 -5 134 67 -89 -3 27 -23 -86 122 -31 4
4322DJ26o0q6r3Q4M0r1N5j4Np9N1J10l2j5p0N8j15J33LR4q9R0r3j30J27Q3j70
4350g4QJ24j26J00p2J05j10J83j88O4N1j36O8P9j27J12j16J81o2q9J17k05j65
4373b78Q4o4N73j09k08M85n33n64K96Q12r31J48J298j058J209r11l29J93k6j97
4393a10R4K9p7L0rJ5l%J4M8p8P4L4k7n4R1jL7l0q1K8%M0l9o4p5P4m7M4m7N7J22
4425H9k75J65L7o7k5K78l4j59J0j46K58j49j12J18Q1j28K0l7KO7L5P3K0k57J84
4450D8r6l8J08o6K4o5M5p5m5N4O7Q3j10O3Q6o9l0j2O0o2Q8P1j39M6m2ok9J23q6
4479dp6P7O5k09J63o3J39j79J57k47M74p04k2N13j48J14j20N8j04J30Q7j25J8
4502fK5mM9j95J48p1m55O62M74o57J67k69L29k27J85p8n3N3n8m3J3L5Q4Mj14N
$$ plain form
4322 4 130 70 -16 -109 -25 15 -76 -21 -35 -30 -109 -58 52 20 5 -65 -7 -122 11 14 108 19 109 16 -114 13 96 -74
4350 -74 -66 58 -68 32 -40 65 -45 138 -50 14 65 -71 -3 76 -51 61 -55 126 64 -25 92 -113 -278
4373 -278 -194 -258 315 206 -2 483 -50 -614 -318 494 -437 -289 1009 -49 1160 249 -80 113 87 -110
4393 -110 -16 13 -64 -34 -43 -28 -31 -31 -17 31 -47 27 61 34 -20 71 70 107 77 -4 24 24 64 25 -39 -114 -40 -87 -43 -90 -33 89
4425 89 -186 -21 16 -51 -76 202 168 9 19 -127 131 -18 -130 -12 69 -59 -39 -76 -74 -7 28 101 121 -136 48
4450 48 -48 -86 22 -44 -20 -85 -40 -115 -160 -106 -39 44 -66 -3 83 14 -16 -28 32 -30 58 129 -10 36 -6 -12 -41 82 -4
4479 -4 -80 -3 62 -147 16 -47 92 -87 70 -177 297 -407 -429 84 -64 50 -70 -12 -116 14 101 -24 -6
4502 -6 19 15 64 -131 17 -54 -509 153 627 -30 137 -132 197 -30 155 77 24 77 19 -24 -11 24 108 112 -2 3
4528Ck2m5J7J8J57j39lj15R2K6o2J42m5mj07K46o5j17P6j1j11J03K2j10m3Q5m5
4555e7j7J43j71O3J19k6k3j1k2P4j05k9P2J59j45J7o2J23rj36j9Q3O4p2j13O3
4581c7O6kJ03j74K7JM0J08j70q1J01l4Q9J0jq9R6j71Q4M8r6J30L5J4p0l1L0o2
4609c6k2n5J29q9M7o5Q2J31j57l0M9p1QK13j80R9p8L1l3O4qm4K39j98r0K02j69
4636c1k4M5L0NM1o5J46m4m8j36M9J25j18n3N1Q3j40O7p7oJ40Po6l5J0K1L3k9L8
4665A9L3j67J87J0n7N6l6q1M8L3J21j28M1K9o7N6J0j11K7P5j89O0P8j59J86j65
4691i1R5q8j5kN4j5L2r9J02O6r1p1J05O4P2j16mo4Q8L3k1j08l7J49k6m2j8J29
4719H1j64J74o3p7J13qo4r7P0M9n1Q9q8O3L7K9j7k3p4M5P4k04J65K2q8J4pm5K5
$$ plain form
4528 3 -19 -64 -47 -29 128 -11 -14 -129 -37 -11 -73 69 24 20 -87 159 94 -23 53 42 -69 34 56 -54 -97 -12 -57
4555 -57 -74 69 -102 -39 80 54 31 20 -2 72 -33 -62 10 169 24 41 -21 102 93 -43 -62 21 85 13 -100 -37
4581 -37 29 27 130 -44 -17 -16 24 132 -38 -119 -18 -52 37 47 46 -43 53 -118 -34 14 -82 48 83 97 27 -4 26 -36
4609 -36 -58 -113 16 -73 -26 -91 -9 122 -35 -65 -16 -87 -79 134 -46 53 -25 6 -27 37 29 -15 224 26 -64 138 -31
4636 -31 -55 -10 20 25 66 1 147 103 55 -81 -32 93 -25 -78 -27 56 -84 -17 -94 -100 40 47 -19 -54 -44 -23 10 -19 19
4665 19 52 -115 72 82 25 81 45 -36 12 45 166 38 79 108 41 97 107 -4 23 98 -91 -31 47 -112 74 -91
4691 -91 4 -84 -99 -101 -47 -62 -30 -129 -27 39 -52 -123 -18 46 118 2 -2 -66 22 55 34 -74 -111 38 12 -30 -48 81
4719 81 -83 91 28 -49 64 56 -8 -105 -35 14 -37 52 -36 27 64 93 76 53 -21 24 98 -106 59 81 -7 7 0 -45 -20
4748b0K0m0J46p0l6j45J10QJ5M5k48R6R2K1K8j00J66k1K7k08P4M6M3L1p4j00M7
4775d7J02p9R7n6L4m4l1OM9p8N6K7K9J26j40p7O3q2O7QJ26k54J39o3N7Kn4nM4
4804B2k4R2n9K1K8j46J67k02R3N8j01k9K2OO4O2q1K6rr3J24p8O9M7j30K10k60
4831a01N1L4j0n7J09k2kM9j53P1L0j7Ml6k8J39p4Q5j02jm6J26j17O3J19j62J03
4858E5j29J67j25J3j1L3j37J46L5K7r3K25k25O2L2j29Q3JrOq6J15j9j22N3J1N4
4885C3q4J64j30m1M9L1k5R9p6J60j08J8m8J8Lj33K8N8pJ16j29p2J17j00P4k5K
4912hK0L4L2j88J89N6j10J4kj04M7Q7r7L5m2l3J11q9J1m2J00L3l9l1L0o8R6q4
4940d2M6O3p3O9r0J8j10J60l9Ll9J25j72K36j89k4n7J0R5J5J3M6m1m5M5k6K5L2
$$ plain form
4748 -20 0 -40 106 36 0 -145 -35 -27 -12 33 -215 -119 -27 -6 22 -78 88 67 94 -114 -40 6 49 80 6 -94 -47
4775 -47 55 -24 73 17 51 7 -24 -18 31 -47 9 36 65 191 51 -26 37 -45 22 30 156 -98 41 -22 35 37 -17 -22 22
4804 22 -2 90 31 52 80 -66 101 -101 -8 50 -51 -80 -58 -52 12 74 -7 19 10 -83 41 -37 32 79 -51 159 -101
4831 -101 -50 -16 -26 -83 26 4 2 51 -102 -31 -1 -18 -14 -50 -78 61 -13 72 -30 -31 -77 49 -68 -5 114 -48 55
4858 55 -74 93 -32 -19 -30 3 -134 12 47 74 -19 206 -19 43 75 -54 29 30 21 27 -59 56 37 -85 -32 -21 33
4885 33 -51 113 -17 -58 -9 22 -3 96 20 180 72 90 42 60 63 -70 -42 16 9 125 -4 -76 41 -59 15 -10 -8
4912 -8 12 46 78 -110 79 135 25 39 37 -67 -20 67 -30 5 -37 -70 41 -48 -37 -79 21 54 15 -16 14 -54 42 -42
4940 -42 4 67 -6 63 -27 -9 -119 41 2 5 -34 91 -81 155 -34 -58 -115 -105 -10 5 18 64 23 -22 23 -3 22 54
4968E4p0m5l7J44J3k9j15M4J40o4k3J1l7K7l8l5Q9J5o7NO8j25j8O6O0m2nJ35q
4997A13m9r9j7j6J01o8P4m3J4or1J44k3q5N9o3O2O0q1o9L4O3p1J46n2m0K7Lj39
5026a12Q6lL0R7p7p8P8j49J37Jl7q2K4%J7K02j62KJ10n4q9k3J38j21KL1P4Q0o4
5055E8J7p5j44J35Q4lj13J3m2P9J9j4l3L4N6p5oM3l1o0R4j8j13Q6R0j15J21o2
5083B5p4%Q8M2j73P9L30m15K97n9j11j02J04q6J6M7p5L8N5L2n9R6j25j6J17j67
5109i6P0m7m8M7M2J01r8O7l4R3j03N0j09K6N2L7m8O9K9q3K2p1K3j4o0J51j62j5
5137a09R5j1qO3o4N9J9k48J85M3L9M2o3n3J6K1n1J16j91M6J86k03K10j51J18j4
5163I2p8J0K1J8o0jmO2n4k7l1R7j71J19p6Q0nL1J8n0j2p7P3KP9l2j5m1m6O6l6
$$ plain form
4968 54 -16 -61 -98 46 59 30 -85 -41 99 35 12 23 -14 13 -25 -60 29 44 -23 -18 50 -75 -93 -27 33 -9 -14 121 113
4997 113 64 -35 -52 -68 33 -35 39 -4 10 4 -87 57 34 -51 8 -55 7 67 -14 -83 -49 14 -57 89 37 -3 24 27 -112
5026 -112 -26 -29 1 98 21 -57 21 -128 9 10 -27 -109 -85 -85 -68 134 -28 -26 84 30 -59 -82 56 -65 -63 -32 42 122 58
5055 58 75 0 -144 -9 75 72 -41 -28 -70 9 28 14 -19 15 71 -4 -10 33 2 -58 36 18 -95 -9 81 -34 87 25
5083 25 -49 -49 39 81 -92 -13 317 -98 199 140 29 -73 31 -55 -39 8 -67 -29 26 58 -1 95 -30 -46 71 -96
5109 -96 -26 -73 -121 -74 -32 69 -29 38 4 97 -6 44 -65 -39 13 50 2 71 100 17 39 -32 -9 -23 -83 68 -94 -109
5137 -109 -14 -25 -33 30 -34 25 44 -204 -19 24 63 105 42 -11 5 26 -25 91 -100 -54 132 -71 139 -12 106 92
5163 92 14 24 45 63 3 2 -2 60 6 -21 -52 45 -126 -7 -83 -3 -8 23 41 -9 -21 -98 -25 -23 56 24 9 -32 -78 -12 -48
5194d8N6K4o5q4J72j19O8k9n5R5j56J06m1J06j01J47r7M9q3J62j12r0l2R6O6j2
5220B3N5j26p4J24jJ3O7j8j7k2j18J14nj03K86j16j25N7J3o0n4J24n2M2J1k1m9
5247c2l4O2or2K65m5q4o9n6J13j9K8L9q1LN0j00r1K30j10j1J86m7q7J13r6L2q0
5275a9JJ64j12j8N1k6m6P5o4j51Q5N9n0LQ1r9J27m5Q1m1J7j15J20p8n2J33n9m2
5303b0J9N9m7k2nQ2q3MQqL9O6j50k7L4M2J0k8K6Jk6M5P2J8O0j34p4RJ46j43l7
5334f4J02j13J39k8j5l7qJ21j18J38k04Q0R6n0jj5o9j3R4j57J02l9j5Q6nm3J37
5361A01q3P2k3j10L6O2r6NR3j7n5nl4NJ6qk2Q6m2N2o6M4p6M4J40j03r7J40K6M7
5391A32j72O9n2k6J5Q6m0n9J11j21J29q9J09q1J4rj00J44m1j80K02N9j08J26k57
$$ plain form
5194 -48 8 32 -33 -117 55 -64 4 -25 -80 15 -141 -35 -76 30 -71 76 -21 28 -55 107 -5 -95 -127 -31 35 23
5220 23 78 -48 -122 2 1 14 81 63 46 24 -94 20 15 -88 198 82 -43 14 27 -33 -87 37 -15 27 38 17 -32
5247 -32 -66 -4 -10 -102 163 118 34 -35 -91 22 3 31 70 -11 -8 42 -58 -149 81 -29 -40 146 99 12 125 29 61 -19
5275 -19 -18 146 34 16 67 41 -5 70 6 -145 -60 -1 -51 -48 33 -66 61 16 97 56 73 -42 78 0 -52 81 22 -20
5303 -20 -1 58 11 -11 -16 66 -17 -13 -5 -13 26 92 -58 -85 -51 -9 1 -27 -1 0 -26 19 91 109 169 35 -39 -30 116 -27 -64
5334 -64 38 -75 64 36 21 -16 -24 97 -21 117 -87 -7 89 39 38 23 -46 -59 35 -122 -20 -59 -74 12 7 -36 101
5361 101 18 90 67 -43 -7 55 -41 -36 57 40 -15 -20 -54 -49 -33 -41 -63 23 -19 33 -33 11 -65 -21 119 16 -81 59 85 132
5391 132 -40 29 -23 -49 -34 52 12 -47 64 -57 72 -17 92 11 25 16 -84 60 19 -161 41 100 -8 118 -139
5416a39J48l2o4J47k1j14Q6o1K2n9R0k1J1J8R7j13pq6K7l5J74j10OP7j05K3k7
5443f8J08m2N0q0P7o8M9o6R2j21rk1Q7m4O5O3j49oP0j7P9K7j38J25j83J33l8L
5471b2p0P6l5o1O9j9K3%n3L9K1m9m5O9N1Qk1K5M9n2q5K2O0k6N5R4j17PM2O1j94
5502g8K08j17N7q1J01j48%J34o5J6%j3m4lp9J51j8n6J52j39m9J73j13Q3m6p0R4
5529E0l3q3J03K6j05PR2j65J79j49Q9M9r8j8J65j35k5J27j50N9K1Rl7o6J11M2
5555F5j5m6k4p2M3N0Jk6j0Q9j22J05K1L71l23j58J43k9j0P7m3j54J12p7k8P6j1
5582EK1j6J4l9rj7K2J01j4j46k0J06jK7R5r3N8j18l6O5n1Q3J6j58O4r0J25J3o5
5611e8O7K8j0Q3j36K5J3q2J30k3j52p2O3K25j30N4J21q2j46N6j9L7Q1l1m9n6M8
$$ plain form
5416 -139 9 -23 -87 60 39 -75 11 -50 -28 -87 3 -18 -7 11 108 -5 -12 -98 -71 -106 68 -42 -36 41 -64 -41 -68
5443 -68 40 -2 48 -32 45 -23 26 -40 52 -69 -78 -99 -12 -56 9 72 -77 -83 -13 -30 49 76 -62 63 -120 13 -25 -22
5471 -22 -92 -16 -51 -112 -43 -62 -39 -39 -92 -53 -32 -81 -126 -57 -6 2 -19 6 55 3 -82 -60 0 -26 29 123 6 13 55 116 -78
5502 -78 130 13 70 -11 90 -58 -58 76 11 27 27 14 -30 -33 -112 39 21 -35 117 -22 -71 102 -11 72 26 -44 50
5529 50 17 -66 37 63 -42 -35 57 -108 71 -78 11 60 -38 -56 109 -26 -51 76 -74 -15 6 15 -22 -88 23 65
5555 65 50 4 -20 -92 -49 1 2 -24 -34 55 -67 38 59 430 107 -51 92 63 53 130 87 -67 45 -32 -60 16 5
5582 5 26 10 24 -15 -24 -41 -19 82 68 -78 -98 8 7 34 129 36 94 -24 -60 5 -46 37 53 -105 -41 -131 -6 7 -58
5611 -58 9 37 27 110 -26 -1 12 -70 60 37 -115 -187 -124 101 -29 25 146 64 -82 -26 -45 -8 73 42 -7 -63 -15
5638a5L9n0K4q3J33M2j50J33n4o9OR6n5p5L6O2M9l8R7j18n2M7m9j7K1j50J49R2
5666E1n4R5j51K4K9R2p4Pn8R9r8NPKj19J59o1K41k12pk4J8N0p6J01o7j8j5M3J2
5696Ak8o9J46L8l7k4p4R3L8j48L6N9K8j54K13k11R3r9m8K10j41K8KQ0j06R9j52
5723a27J06N0m8j4j2lk1N0M2m2N4m3j5j8R2o3N2j58K08j20K6j8K6J0R3p7J0j14
5751g4L5O8k8k5J8L3k5l6O8j31J83l7j83J59p6k9K12rj31lK5N5q0K5O7q7PM2r9
5780e6JqR0J6L8j04j9L3O5R5o2o7N1r8O5n6k1J2N7l1N8k8l8nJ6L9q0QJ7l8Q6n3
5812a7L6m9L3o3M2J2Q0rj61L5N9l4k1j0L6P4m7o9J17L6K6j12Q9n9M6j7o0q7R5
5841Aj8N0q8m1O3L4P9p8j17Q3K23k72K6P0l9p6O5O2N5p5j4M6P3j38Q3p5Qo0K9
$$ plain form
5638 -15 24 -26 -2 -85 48 90 -60 73 19 -50 -44 52 -3 -78 -42 20 69 31 128 10 -42 5 -44 -61 -40 -190 -41 51
5666 51 -3 92 -59 -35 -6 86 12 19 -39 60 -38 -33 -26 -24 -143 16 -45 196 -16 -23 -47 -29 21 -55 46 -21 -39 -54 -11 1
5696 1 -27 -96 50 88 51 27 -47 46 84 -64 -28 31 59 -95 118 -93 0 -99 -147 63 -78 -50 -48 32 -74 25 -127
5723 -127 -21 29 -19 -33 -45 -48 -69 -19 23 -19 35 -8 -23 -41 51 -12 40 -118 90 -30 -4 -22 4 14 107 30 40 -74
5751 -74 -39 29 1 -24 -6 27 2 -34 34 -97 86 49 -134 25 -51 -80 132 123 -8 -11 14 69 -11 14 81 -6 1 43 -56
5780 -56 -55 -63 27 43 81 -23 -42 -9 56 151 89 22 73 -25 40 -16 -37 -25 32 1 59 31 -7 -12 4 43 -37 -29 -12 -50 36 -17
5812 -17 19 -30 3 -60 -18 -6 74 65 -96 -61 -2 -36 -57 -67 -31 43 -4 -73 44 80 106 -6 83 24 70 53 -7 -94 1
5841 1 -17 33 -55 -96 -33 1 80 2 -115 -32 191 -81 -55 15 -24 -100 -35 27 82 7 -7 39 112 -26 57 -18 -10 -70 -41
5870d1J9j15K54j59R7l7N1q1M5p8O3P7j89J07J0L1K5j34J09j2j19J59L9m1j4n8
5896Ho7N1Qp7J18N9o3l5j0M3o3M6k2j1p1J60j28J10m6Pj5j7L4p9J95j71J09j34
5924f1M5l6m5P2l7M1p7J27l5%Nl6O3k6Q0j19R1q7J6K3n2J11k0j91J31K7O4lKr5
5954b2J05j37OJ10m7O2j23q7J26Q8o5j25O1J72j73n4J11J4rl1Q3r9J2l7N8l3N1
5981A7Om1J3l6J47o1rj69J55r7O3O8p6O6L3n1j30K36J8j06o7lP9Q3m4l6l7N1N9
6010A31j38L0o9O3r6J17m2j3k6QJ97j32p8M1o0J51j20K7o8rJ00J07m1o6J3%Kk5
6038Dk7M4j24K14j38Mn4M7k4M1J36j40M3j2P9j15L5l1O0o9N7n4k7P9J14j48Q3
6065G7j18Oo0J34K3n4qRj9m4K01j98Q0M6p6no4J56o2m3m0P3o9J7j0L2J02j01M7
$$ plain form
5870 -41 -22 -137 117 -42 55 18 69 -12 33 -45 18 95 -94 13 23 54 79 -55 54 42 -77 82 121 80 66 8
5896 8 -59 -8 0 -77 41 100 37 2 -8 35 -28 18 -4 -15 -86 74 -54 56 10 17 2 -15 19 -60 135 -36 73 -61
5924 -61 -16 -52 -97 -25 -62 -21 -98 29 -6 -6 -1 -37 26 0 80 -39 52 -35 -19 4 -48 63 43 -148 -17 10 74 71 73 -22
5954 -22 83 -54 -48 62 15 77 -46 -133 -7 81 16 -109 -48 124 -49 -103 8 22 13 -18 65 -34 -22 -59 -1 -34 17
5981 17 23 -18 -5 -41 106 45 36 -133 22 -75 -12 56 -20 46 79 28 -102 134 152 46 -21 -24 55 138 94 58 21 72 131
6010 131 -7 23 -46 17 -79 38 -4 -17 -43 -35 162 30 -48 -7 -67 84 -36 -9 -77 -86 14 121 80 14 27 27 29 4
6038 4 -23 21 -103 111 -27 -23 -77 -30 -54 -13 123 -17 26 14 93 -22 13 -18 42 -27 30 -24 -51 28 142 -6 77
6065 77 -41 -35 -95 39 62 8 0 9 -10 -54 147 -51 29 75 -1 -6 -70 86 24 -19 -59 14 -55 -38 -48 -16 86 -15 32
6094C2J0j63R2l0KM0M6PJ3N7r6n3km2R1N9q5L3m6L3n0k2j3O2LL5J13j48k2O6j21
6125i9K13q1m6Q4j01P3p4L4k9M4j7l0j10J00J63k33Q8l0N50K42j203L18k3J98
6149C1j97K21j6On6Jj19K4k5J59p9j3J10q3Q4p2O1J4P2o6l6L3K6r5P2r2Q0ok5
6178A4j15K7K1L5l3N3m4k0L7l4k8L2R9J04j73J45o8l0m5n5J82r6Rl6M4k2j55K30
6206G8L2m58k30j73K91K26K64j57K04m8Mm7P4j78J26q9J74m1J0j11N7l3J19k5
6230F9k5j03J16l4m4N8L0m0L8j04M02k81k40M13m31J47j05K6J59q6l5j15L36j74
6254b3K6J1J01r1J05j00J7j06J02j05M0R0r2l1M2M7j00O9P3N0j42K6r2P7L3k3
6280DQ5p8q3J19r0J60j69r0K07o8N0j24N9N4k6O3j28P3n8l8K7j3j8K0P5k5MnP
$$ plain form
6094 32 42 -121 -29 -59 -57 -17 29 36 49 106 10 -43 -45 -87 4 63 -22 11 -35 -2 -52 -74 -87 -25 -22 13 126 -22 -44 22 -99
6125 -99 114 33 -13 71 -30 43 -31 3 -26 18 1 -29 -139 -39 124 -109 -21 -51 499 741 -462 -144 -167 31
6149 31 -166 55 39 45 -11 -10 -129 -105 -130 29 -50 -63 47 -36 48 -24 37 51 123 57 21 54 80 -15 57 -35 45 39 14
6178 14 -101 -74 -53 -18 -51 2 -42 -62 -25 -59 -87 -55 44 148 -25 120 52 22 -23 -78 104 8 17 -19 25 3 -152 78
6206 78 110 -348 -578 -751 -460 -234 30 -127 77 29 33 -14 60 -118 8 -81 93 52 62 -49 8 -25 94 69
6230 69 44 -59 57 23 -21 37 67 27 65 -39 363 82 -158 255 -176 -29 -134 -108 51 -35 -70 -185 151 -23
6254 -23 3 14 115 24 129 29 46 -60 42 -63 -23 67 -25 -56 -14 33 -67 2 75 125 -17 9 -83 -6 27 4
6280 4 89 11 -72 47 -43 117 -52 -142 65 -3 47 -77 -18 36 10 73 -55 18 -40 -78 -51 -64 -82 -62 13 -12 -8 -13 -6
6309fL1l4L7o3K7k3N7J2JJ2j24pP3M1l8J5j6R3m1l6o0O5J7j8J8p1J09q2m4J00
6339D5k9j2M3j74kN2Q6M5J6j23Q1n2J78k07L0k1L28J45n58K05l8l2K1k8%OL4J9
6367E8q2l3L5Q2Q2j89J04r1kK4j17J23N0m3PL6L6j8o2j9L9r3J38p6OO0k9rp7J36
6397G6j14P2j22Q1K6j9P0n7k6P0j39N6Q4j10J31j4o7Ko1J00m4n0L0q3P0J49j00
6424A1J17j06J4o9N4j00P1K3n8J43n5%%l6O5j04k0P6k2q8P1J95j71L4q6pL2l3
6452d9l6M0p6K24p3p8J24r1j5k4J08p0R0j28PJO7JM5n9m1M1Lj26J01Mq1J50j91
6481a32J30p2l19K90N3k0L9J00q3m0J35p5j8pK50l30J45j81Q6l2R3P5j29j4P7
$$ plain form
6309 -6 25 -9 28 -35 -8 -31 26 38 39 51 -73 -80 -7 34 -4 11 -5 88 47 11 -49 16 33 15 33 -38 71 -11 -55 45
6339 45 16 4 47 -127 -129 -77 9 54 70 -53 28 -24 154 -53 -23 -44 284 429 -129 76 38 6 27 -1 -1 5 39 58
6367 58 -24 -57 -22 60 142 -47 57 -34 -36 -12 -129 -6 44 1 8 44 80 62 0 -19 20 -73 65 -11 -5 55 26 17 -60 76
6397 76 -38 34 -88 -7 19 0 70 13 -13 57 -82 -26 58 -52 79 65 -2 0 -61 39 -5 -55 -25 -108 -38 111 11
6424 11 128 22 36 -33 21 -79 -8 15 -43 100 45 45 45 9 74 -30 -50 26 4 -84 -13 182 11 45 -41 -48 -16 -49
6452 -49 -85 -45 -121 103 30 -48 76 -15 -30 -54 54 -16 74 -54 -47 -46 21 22 67 8 -33 8 11 -115 -14 -10 -91 59 -132
6481 -132 -2 -74 -393 -103 -50 -70 -31 69 -14 -54 81 6 -12 -19 231 -99 46 -135 -49 -81 12 87 -42 -56 21
$$ [...]
8191g2
##END NTUPLES=NMR FID
##END=
