##TITLE=1H_DE-80H_X3
 200.13MHz, d2o
 8 sc
 
 19ns.26.2.2025
##JCAMPDX= 6.0         $$ Bruker NMR JCAMP-DX V2.0
##DATA TYPE= NMR FID
##DATA CLASS= NTUPLES
##ORIGIN= UXNMR, Bruker Analytische Messtechnik GmbH
##OWNER= pz
$$ XWIN-NMR		Version 3.5
$$ Wed Jul 22 15:18:50 2026 Russian Standard Time (UT+4h)  Yarkov@DPX200
##.OBSERVE FREQUENCY= 200.1313
##.OBSERVE NUCLEUS= ^1H
##.DELAY= (6, 6)
##.ACQUISITION MODE= SIMULTANEOUS
##.ACQUISITION SCHEME= undefined
##.AVERAGES= 8
##.DIGITISER RES= 18
##SPECTROMETER/DATA SYSTEM= spect
##.PULSE SEQUENCE= zg30
##.SOLVENT NAME= CDCl3
##.SHIFT REFERENCE= (INTERNAL, CDCl3, 0, 14.3821)
##AUDIT TRAIL= $$ (NUMBER, WHEN, WHO, WHERE, WHAT)
$$ ##TITLE= Audit trail, XWIN-NMR		Version 3.5
$$ ##JCAMPDX= 5.01
$$ ##ORIGIN= Bruker BioSpin GmbH
$$ ##OWNER= Yarkov
$$ C:/Bruker/XWIN-NMR/data/yarkov2/nmr/H-C/1/audita.txt
$$ ##AUDIT TRAIL=  $$ (NUMBER, WHEN, WHO, WHERE, WHAT)
(   1,<2026-07-22 15:17:59.18 +0400>,<Yarkov>,<DPX200>,
      <created by zg, POWCHK disabled, PULCHK disabled
       configuration hash MD5:
       00 E9 B6 7A A2 85 ED C7 34 08 36 98 17 FE 4E 26
       data hash MD5: 16K
       6C E4 4F 0E 81 E5 DE 17 9F AA 2B 10 37 2E 63 1C>)
$$ ##END=
$$ 
$$ hash MD5
$$ 92 EA 9E 94 06 A3 1A E3 3E 80 F8 99 87 28 7F 24
##$RELAX= 
##$RELAX= 
##$RELAX= 
##$RELAX= 
##$RELAX= 
##$RELAX= 
$$ Bruker specific parameters
$$ --------------------------
##$DU= <C:/Bruker/XWIN-NMR>
##$EXPNO= 1
##$NAME= <H-C>
##$PROCNO= 1
##$TYPE= <nmr>
##$USER= <yarkov2>
##$AMP= (0..31)
100 100 100 100 100 100 100 100 100 100 100 100 100 100 100 100 100 100 
100 100 100 100 100 100 100 100 100 100 100 100 100 100 
##$AQSEQ= 0
##$AQ_mod= 1
##$AUNM= <au_zg>
##$AUTOPOS= <>
##$BF1= 200.13
##$BF2= 200.13
##$BF3= 200.13
##$BF4= 200.13
##$BF5= 200.13
##$BF6= 200.13
##$BF7= 200.13
##$BF8= 200.13
##$BYTORDA= 1
##$CFDGTYP= 0
##$CFRGTYP= 5
##$CHEMSTR= <none>
##$CNST= (0..31)
1 1 145 1 1 1 1 1 1 1 1 1 1 1 1 1 1 1 1 1 1 1 1 1 1 1 1 1 1 1 1 1 
##$CPDPRG= <>
##$CPDPRG1= <>
##$CPDPRG2= <>
##$CPDPRG3= <>
##$CPDPRG4= <mlev>
##$CPDPRG5= <mlev>
##$CPDPRG6= <mlev>
##$CPDPRG7= <mlev>
##$CPDPRG8= <mlev>
##$CPDPRGB= <>
##$CPDPRGT= <>
##$D= (0..31)
0 0.7 0 0 0 0 0 0 0 0 0 0.03 0 0 0 0 0 0 0 0 0 0 0 0 0 0 0 0 0 0 0 0 
##$DATE= 1784719078
##$DBL= (0..7)
120 120 120 120 120 120 120 120 
##$DBP= (0..7)
150 150 150 150 150 150 150 150 
##$DBP07= 0
##$DBPNAM0= <>
##$DBPNAM1= <>
##$DBPNAM2= <>
##$DBPNAM3= <>
##$DBPNAM4= <>
##$DBPNAM5= <>
##$DBPNAM6= <>
##$DBPNAM7= <>
##$DBPOAL= (0..7)
0.5 0.5 0.5 0.5 0.5 0.5 0.5 0.5 
##$DBPOFFS= (0..7)
0 0 0 0 0 0 0 0 
##$DE= 6
##$DECBNUC= <off>
##$DECIM= 32
##$DECNUC= <off>
##$DECSTAT= 4
##$DIGMOD= 1
##$DIGTYP= 9
##$DL= (0..7)
0 120 120 120 120 120 120 120 
##$DP= (0..7)
150 150 150 150 150 150 150 150 
##$DP07= 0
##$DPNAME0= <>
##$DPNAME1= <>
##$DPNAME2= <>
##$DPNAME3= <>
##$DPNAME4= <>
##$DPNAME5= <>
##$DPNAME6= <>
##$DPNAME7= <>
##$DPOAL= (0..7)
0.5 0.5 0.5 0.5 0.5 0.5 0.5 0.5 
##$DPOFFS= (0..7)
0 0 0 0 0 0 0 0 
##$DQDMODE= 0
##$DR= 18
##$DS= 0
$$ [...]
##$SUBNAM2= <"">
##$SUBNAM3= <"">
##$SUBNAM4= <"">
##$SUBNAM5= <"">
##$SUBNAM6= <"">
##$SUBNAM7= <"">
##$SUBNAM8= <"">
##$SUBNAM9= <"">
##$SW= 18.0517328524113
##$SWIBOX= (0..15)
0 0 2 0 0 0 0 0 0 0 0 0 0 0 0 0 
##$SW_h= 3612.71676300578
##$TD= 16384
##$TD0= 1
##$TE= 0
##$TE2= 300
##$TE3= 300
##$TEG= 300
##$TL= (0..7)
0 120 120 120 120 120 120 120 
##$TP= (0..7)
150 150 150 150 150 150 150 150 
##$TP07= 0
##$TPNAME0= <>
##$TPNAME1= <>
##$TPNAME2= <>
##$TPNAME3= <>
##$TPNAME4= <>
##$TPNAME5= <>
##$TPNAME6= <>
##$TPNAME7= <>
##$TPOAL= (0..7)
0.5 0.5 0.5 0.5 0.5 0.5 0.5 0.5 
##$TPOFFS= (0..7)
0 0 0 0 0 0 0 0 
##$TUNHIN= 0
##$TUNHOUT= 0
##$TUNXOUT= 0
##$USERA1= <user>
##$USERA2= <user>
##$USERA3= <user>
##$USERA4= <user>
##$USERA5= <user>
##$V9= 5
##$VALIST= <valist>
##$VCLIST= <CCCCCCCCCCCCCCC>
##$VD= 0
##$VDLIST= <DDDDDDDDDDDDDDD>
##$VPLIST= <PPPPPPPPPPPPPPP>
##$VTLIST= <TTTTTTTTTTTTTTT>
##$WBST= 1024
##$WBSW= 4
##$XGAIN= (0..3)
0 0 0 0 
##$XL= 0
##$YL= 0
##$YMAX_a= 70470
##$YMIN_a= -82546
##$ZGOPTNS= <>
##$ZL1= 120
##$ZL2= 120
##$ZL3= 120
##$ZL4= 120
##$ABSF1= 10
##$ABSF2= 0
##$ABSG= 5
##$ABSL= 3
##$ALPHA= 0
##$AQORDER= 0
##$ASSFAC= 0
##$ASSFACI= 0
##$ASSFACX= 0
##$ASSWID= 0
##$AUNMP= <proc_1d>
##$AZFE= 0.1
##$AZFW= 0.1
##$BCFW= 1
##$BC_mod= 2
##$BYTORDP= 1
##$COROFFS= 0
##$CY= 83.5205535888672
##$DATMOD= 1
##$DC= 2
##$DFILT= <>
##$DTYPP= 0
##$F1P= 10.8118882576601
##$F2P= -7.23987719738617
##$FCOR= 0.5
##$FTSIZE= 0
##$FT_mod= 4
##$GAMMA= 1
##$GB= 0.15
##$INTBC= 1
##$INTSCL= 1
##$ISEN= 128
##$LB= 0.25
##$LEV0= 0
##$LPBIN= 0
##$MAXI= 10000
##$MC2= 0
##$MEAN= 0
##$ME_mod= 0
##$MI= 1.114404
##$NCOEF= 0
##$NC_proc= 0
##$NLEV= 6
##$NOISF1= 3.799351
##$NOISF2= 2.8
##$NSP= 1
##$NTH_PI= 0
##$NZP= 0
##$OFFSET= 14.38212
##$PC= 1
##$PHC0= -7264.547
##$PHC1= 21.42198
##$PH_mod= 1
##$PKNL= yes
##$PPARMOD= 0
##$PSCAL= 0
##$PSIGN= 0
##$REVERSE= no
##$SF= 200.129724274929
##$SI= 16384
##$SIGF1= 3
##$SIGF2= 2
##$SINO= 400
##$SIOLD= 16384
##$SREGLST= <1H.CDCl3>
##$SSB= 0
##$STSI= 0
##$STSR= 0
##$SW_p= 3205.1282051282
##$SYMM= 0
##$S_DEV= 0
##$TDeff= 0
##$TDoff= 0
##$TI= <>
##$TILT= no
##$TM1= 0
##$TM2= 0
##$TOPLEV= 0
##$USERP1= <user>
##$USERP2= <user>
##$USERP3= <user>
##$USERP4= <user>
##$USERP5= <user>
##$WDW= 1
##$XDIM= 8192
##$YMAX_p= 0
##$YMIN_p= 0
$$ End of Bruker specific parameters
$$ ---------------------------------
##NTUPLES= NMR FID
##VAR_NAME=  TIME,          FID/REAL,        FID/IMAG
##SYMBOL=    X,             R,               I
##VAR_TYPE=  INDEPENDENT,   DEPENDENT,       DEPENDENT
##VAR_FORM=  AFFN,          ASDF,            ASDF
##VAR_DIM=   8192,          8192,            8192
##UNITS=     SECONDS,       ARBITRARY UNITS, ARBITRARY UNITS
##FACTOR=    0.0002768,     1,               1
##FIRST=     0,             0,               0
##LAST=      2.2672688,     0,               0
##MIN=       0,             -82546,          0
##MAX=       2.2672688,     70470,           0
$$ Real data points
##PAGE= N=1
##DATA TABLE= (X++(R..R)), XYDATA
$$ [...]
1060g20J194N51j583o67R93J055j001j662J464J262j270k50N92K73J00k33K68
1077C66L98j003K53Q74q07j64J22j46J17l51j34O38o51j88Q40m4l61m1K68Q15
1097H01o16q21J332K98j065j17N03N50q65j045J255M65j485K1J030N5p41m27J105
1116B33O20j462MJ374m86n39L67J28L42p75j25J100o58p60O25K99k45m08l26Q23
1136A31n3p51O43L07m38l4K18O62l10r55J025M85j061k11P43R4o13n52P01N24
1156E55j293jJ071m36m49O5O71J94p34K4J026k85p05N33L66j50o02j97R37j73
1176D17j112N19M16n18k22L5N07L7p19N07Q50q38j37N83L91l95n36L77P03q95
1196c0l03P44l00m84q1L38K3n94o1R67r5o51M62M30K3m94K1Q00j22q42N13L32
$$ y = [-720, 474, 1025, -558, -1225, -232, 823, -178, -1840, -376, 886, -384, -634, -42, 231, 331, 98, 366, 764, -239, 14, 888, 81, -83, 39, -107, 10, -341, -475, 163, -488, -676, 164, 120, -241, -282, -14, 801, 185, -636, 696, 994, -71, -188, 315, 865, 0, -1045, 210, 675, -810, -789, 241, 296, -445, -872, 233, 853, -609, -605, 769, 283, -256, 111, 239, 581, -194, -319, 781, 123, -637, -12, 287, 42, -366, -692, 131, 78, -673, -30, 277, -161, -195, 23, 685, 375, -580, 445, 930, -131, -342, 401, 495, -118, -670, 31, 555, -738, -739, 332, -104, -553, -488, 183, 377, -357, -333, 693, 408, -297, 236, 602, 452, -150, -347, 590, 417, -695, -176, 240, -278, -500, -465, 42, 79, -640, -133, 717, -121, -258, 325, 716, 321, -215, 162, 865, -30, -333, 411, 111, -373, -454, -116, -93, -687, -748, 219, 124, -527, -65, 365, 388, -106, -85, 715, 593, -249, 264, 596]
1218E96n95j20j19M32j44q12K68N80n54j01M19K05J04l71L14P71q54j66Q42j00
1238E95m92j43N6L87o14m23O30p1o15L48J60K91n20l4Q65q0n58N65K85l16j53
1259A63n1K80Jp76L53M10p15j60K43J98l6n44K68O31n56l7P00j30p5p0K17M35
1281G49o58l66P34j90n69Q8J22J49l42l16M96P4m69M13K02j35k9l4M12J66n22
1302b5J88K85l17k23K54j81J01m84J50L36m68n9M11n2o9J23QK90l32j03N88p2
1324C49m45K27M4R4j87l98L86J21n93K06J27p1q1o8J00L87m51J86M08k15j70N6
1346A2R2K00j67k26L81l19k13L84k30L9j17k17M96j84l75N25Qk37K46%J06m5j59
1369@K94N2m01R3J97j57k2k69N8K38l39p8L95k79qJ57J4J71k57o2N95k39k14L56
$$ y = [596, 1, -119, -238, 194, 50, -762, -494, 86, -468, -569, -150, 55, 159, -212, 102, 873, 19, -147, 695, 595, 103, -40, 16, 403, -211, -634, -4, -75, -690, -342, -182, 109, -411, -445, 420, 340, -218, 347, 632, 316, 163, 112, 392, 393, -383, -30, 380, -335, -495, -252, -54, -90, -634, -366, 265, -291, -328, 372, 242, 167, 97, 314, 749, 91, -275, 459, 269, -300, -212, -90, 59, -283, -599, -103, -29, -498, -85, 117, -18, -47, -81, 331, 497, -25, 163, 448, 131, -92, 162, -19, 82, -402, -252, 84, -384, -443, -32, -84, -153, -30, -22, 268, -64, -167, 421, 349, -96, 131, 175, 269, 82, -316, 70, 191, -402, -196, -69, -140, -221, -289, -189, 198, -253, -67, 341, 126, -44, 12, 104, 304, 137, -89, 292, -27, -240, 144, -86, -47, -164, -381, 115, -69, -444, 81, 89, -148, 98, 98, 204, 159, 0, 294, 346, -55, 38, 235, 78, 56, -213, -155, 83, -256, -334, 61, -218, -226, -69, -55, 116, -141, -203, 392, 153, -61, 295]
1393B95j43J11q2j14J85k48l69N02o7k59p6J32L16k57m28P44j85l25L95j39K15
1414B03J53j79L41r5k43K61j2l55m34l9J99L42k49L3k25M73n98N45k12N36l58
1435H7m0M70l5j026R37m4j148R94p67M44p21j68N96N77o75M35L33l50p9M1K00
1456F1M00m94J30K67j03r7n4o2K31l70j96K52j50oj19j30L58M5k59K54K24k27
1478d5K70J6j93J48k8O1k3l94L08k8m42K05K17k64j50J49P0K32m53K13N13l69
1500A3P2O9K3J67j59l82M33l7k22l5r5P2q6l27M77N1l60J61J19K50q6k38J85K83
1524C48m22J89J45l88K51Ml25J39j13pP8k49J60K80l04l3M07j80R2j06R7M09l28
1547A44j25K30j11l6j15j95K71n8l63J65J97o0o9r3K44Q6k66J16K44q2q7L7J09
$$ y = [295, 152, 263, 181, 67, 252, 4, -365, 137, 70, -189, -265, -133, 183, -74, -502, 242, 57, -268, 127, -12, 203, 356, 177, 518, 423, 180, 441, 429, 74, -360, -399, -200, 142, -107, -74, -299, 174, -424, 121, -91, 445, 87, 47, 517, 482, -544, 393, 349, -799, 195, -572, -128, -849, -1017, -421, 156, -519, -84, 249, -101, -180, -139, 61, 461, -33, 97, 364, 261, 164, 110, 48, 279, -91, -287, -35, -185, -191, -310, -440, -82, -37, -296, -42, 182, -45, 225, 241, 48, 196, 168, 229, 206, -188, 120, 92, -350, -145, 72, -192, -342, -193, -123, 109, -344, -131, 382, 13, 85, 154, 177, 344, 185, -197, 236, 199, -23, -58, -153, -81, -167, -494, -17, 34, -326, -165, -46, 204, 118, -120, 65, 348, -74, 115, 260, -128, 123, 127, -198, -59, -172, -179, -101, -350, -190, 90, -214, -247, 160, -20, 72, -34, 63, 472, 144, 19, 249, 138, 102, -13, -208, 63, 5, -358, -193, 4, -56, -125, -218, 26, 112, -154, -38, 206, 124, 37, 74, 183]
1570A83L4j62QJ94k49j17J52j40j26J55r3K4l1j3K05Oj01K48j72R4M1j29K10j18
1594A03k02K40L5k11Lo6N9J74l96J26J88j54n8P6O1J13j31K6K66j46k40K53nN0
1618A64j64m5K17l56j8J27Jo2O4L2o5J32k53K36J91j83j5O3K0J54k41J37O7k63
1642f0Q0J41k35j0l1P7k1k25J17K64j90j33J57J95j44L0J3J96j64k24L26p6j42
1665e9K5q5J66j25k17J17K51k60J27J03p0J00j32M5K43j17j6J10m3j05Q8k27L23
1688B42l80n3K96j68j86M6J04m9L0r7M82j99k00K74O5r7oo2J79j09k57K23j0k88
1712b20K22n7j75P8j06J30J59j62O4K19n9L3k5JJ14j19j66L16j80j77J43j34k3
1735a24j6o5J96j83j21M69j48o6K9O7J95J8k56K12%k33K07p5j02R3l54J76O5p4
$$ y = [183, 217, 55, 63, 257, 8, -109, 43, -97, -223, -68, -161, -137, -168, -181, 24, 30, -71, 177, 5, 99, 140, 11, 221, 103, -99, 141, 176, -35, -32, -98, -39, 135, -261, -135, 53, -101, -159, -83, -22, 91, -40, -14, 252, 106, -134, 119, 114, 164, 0, -45, 172, -184, -202, -75, -74, -136, -72, -40, -105, 27, -226, 10, 201, 18, 3, 66, 86, 240, -1, 136, 203, -60, 20, 161, -74, -84, -115, -38, -59, -284, -167, 97, -93, -226, -69, 126, -18, 12, 25, 221, 57, -167, 159, 83, -59, -34, -119, 47, -78, -295, -178, 73, -187, -60, 43, -27, 73, -59, -14, 229, 112, 96, 206, 163, 58, 146, -81, 242, -138, -191, 105, -63, -249, -203, -99, -148, -118, -215, 267, 68, -132, 142, 207, 110, 104, 42, 221, 112, -145, 78, 68, -220, 2, -55, -230, -152, -258, -128, 31, -131, -67, 152, 93, 126, 101, 102, 216, 97, -69, 247, 67, -110, 33, -101, -124, -140, -205, -9, -192, -313, 156, 8, -58, -29, 38, 233, 251, -5, 207, 207, -26, 181, 106, 4, 97, -257, -81, -16, -90]
1759i0o8J02R6k63L63R6O3j3n47N00k1j81M9k8R5j44j02J77j45j38J49m9L1n1
1783a19N4j7J33j65J38J51j23P5r5L5J35k59N2J74k35Q1R9j65M1l0j33J60p4n6
1807a43J63n1j01J75M3L5m0q7R5J5j98J56k1Mj01o7N8M9j27J03Q7k37J56L8oJ84
1833A82j56r9K13j12k7N7JL0Nl63L29K2r7m5L6n2L9Ml6P8j15J36Pj42K16q3K1
1860D9Qk1J32Q9m07J30M2r6k6K1k1N6k07R3R9K1J13J24j13p5Lo1J57N0k12J74
1886A22m36J22L03k14N8O2j58J81q0j70K48j49m6J93n8O9j7m1K2N9Q0k4j18R1
1910I9m8j64n0J45r2KO0Nr3J11p6P2m3K3J18o6L2J52j76K4L1n6Q8j31nk7m3q9
1938a97J54j10k1J77q8P8J06j12M2R8n3J17j20JJ90k34o3M5r4N2k0j82K68j33
$$ y = [-90, -158, -56, 40, -223, 140, 236, 299, 286, -261, 239, 218, 37, 86, 58, 153, 9, -93, 84, -61, -199, -50, -99, -68, -119, -65, -82, 51, -114, 24, 175, 52, 127, 32, 67, 202, -57, -5, 169, -66, 15, 114, -51, -10, -40, -173, -13, -87, -143, 20, -31, -132, 43, 86, 121, 81, -6, 89, 104, -94, 62, 41, 45, -56, -123, -65, -16, -143, -40, 47, -190, -34, 4, -2, 182, 26, -73, 140, 28, 1, 58, 59, 89, 94, -269, 60, 82, -15, -60, -24, -76, -37, -33, -69, 9, -106, 30, 37, -105, 111, 28, 49, 57, 36, 168, 257, -150, -20, 22, -74, -100, -79, -100, -44, -251, -158, -59, -38, 75, 199, 86, 11, 14, -47, 110, 160, -52, 122, -314, -192, 111, -103, -45, 17, -141, 40, -40, -210, 38, -111, -157, 36, -22, 47, 30, -11, 11, 70, 150, 126, 8, 99, 51, -113, -163, -18, -110, -108, -48, -43, -136, -25, -101, -29, -72, -49, 69, 3, 35, 187, 11, 35, 66, 10, 98, -33, -38, -65, -108, -197, -43, -153, -174, 3, -85, -7, 99, -13, 29, 127, 74, 191, 71, 72, 262, 28, -35, 10, -84, -32, -52, -234, 34, -99]
1962i9j90L65j75K41k2j09o7K86k98J75O0k41R0K4n4J33k42rJ72j49O3k2j14J09
1986g3N8RJ34l6q0K10k28M6K22k23r1J33j38L8J8k01J23j1J0L0n3J31m7j41J79
2011A9J47k4nj58O7J08j72k5J54j37j60R6J54k00P2j08K16n9o6J37k58J54K3M2
2035A7N5l8k9K25k11p9J58j32n6R9q2Ln3N3L7k7p5O0J26j78K00p8k2J73j07n3
2061a4J61j31P1q2k9J16j31j80L13q9j16J12l8M1L9M1k39R9J80M6p6q6J22p9j3
2086C8m5pJ11j69nJ17j32M2m6J4n0K43j92M4N7q7J68k75J18K19L58n09P4j8q5
2111a7p3Q0K8P7k61K98k31l0M1l9K54j19Q3o7L29o21L11J1r74O65L66q0R0j59
2135c8M2K0r7j29J61j33J47j41J31J14n0j5O6J53j11q2m9K04j86m6O2K9j19k8
$$ y = [-99, -289, 76, -99, 142, 120, 11, -56, 230, -68, 107, 167, -74, 16, 40, -14, 119, -123, -132, 40, -109, -46, -68, -182, -73, -15, -6, 128, 92, 12, 222, -6, 40, 262, 39, -52, 81, -57, -19, -1, -202, -79, -90, -80, -50, -103, 28, -19, -160, 19, 166, 142, 137, -21, 46, 154, -18, -43, 111, -26, -186, -90, 64, -136, -64, -172, 44, -15, -81, 56, -202, -48, -25, 17, 72, 34, 5, 230, 19, -60, 98, -34, -90, 9, -73, -70, -123, -70, -33, -60, -135, -75, 51, -127, 73, -5, -27, 146, 39, -14, 147, 16, 87, 5, -24, 92, -39, -219, 94, 5, -111, 1, -37, 4, 43, 84, -155, -56, 124, 170, 94, 8, 130, 51, 38, -7, -14, 97, -72, -77, 40, -92, -50, -96, -82, -132, 111, -81, -37, 20, -67, 101, -174, -56, 163, 521, 12, 86, 68, -17, -90, -10, 18, 95, -166, 132, -99, -129, -88, -127, 127, 8, 91, 24, 353, -268, 43, 54, -920, -255, 111, 31, 121, -38, 4, 24, -73, -202, -41, -174, -27, -168, -37, 77, 27, 12, 78, 231, 120, 38, -11, 193, 7, -39, 23, 52, -67, -95]
2159i5J09k52J99J0r4J79k66K20J13j39J03jp8K03j85q0J56j11j03P1Jn7l4n8
2183a89J79J1j59K48j00L5j6Q2J9m9q0K59o9k59O6M4K9r0j36QJ67j90R9J59p5
2208gN6q9K2J8J27j22J46q7J1R0j92J38j22r7Q8J0r0n3J60q1m7K0J26o7N0K1J14
2235A43j17N4Q0q4O2j95J08Q0j92L5R1M9n22N01k01O5j09nL70j79j28J81n9l0
2259bP1j32K88j27k38K11q1kMmr2J00j25J12m6m7M8K7J5J62k85J86J25j07p6K09
2285A94j67m1n8K0P5j84J01NK7j01J25j06M3K8j18K52Kj29J35o5R2j13N3k0O5
2310A15k35O8J37j58j0N2kk3m8K8K58j81j4J33o9P6j31K8O8K43m54J48l72R05
2334E62o38J9L57n56L46L5p9j83N15m29l9j16j21j94O17L48K95j72l51r08Q85
$$ y = [-95, 14, -238, -39, -29, -123, 56, -210, 10, 123, -16, 87, 86, 8, 211, 26, -54, 102, -9, -112, -41, -40, -97, -131, -189, -10, 1, -158, 90, -10, 25, 9, 91, 110, 61, -19, 240, 171, -88, -22, 22, 51, -39, -175, -167, 0, -190, -91, 68, -7, 49, -40, -18, 0, 127, 5, 151, 64, 75, 165, -27, 111, -11, -108, -20, -10, -100, -153, 7, -74, -121, -101, 25, -42, 8, 29, 143, 26, 80, 160, 76, 138, -57, 51, 131, -61, -26, 65, 114, -408, 93, -108, -43, -152, -157, 213, 34, -94, 87, 28, -2, 69, -63, 225, 98, -140, 71, -10, -12, -8, -12, -104, -4, -129, -17, -63, -110, -62, -35, -20, 142, -143, 43, 168, 61, -15, 194, 27, -14, -72, -52, 23, -161, -60, -55, -28, -129, -4, -110, -67, -39, -157, 95, 97, -32, 103, 38, 130, 17, 70, 50, 115, -120, -52, 85, -73, -83, -31, -33, -56, -104, -76, 182, 1, -13, 120, 51, 127, -4, 24, 92, 335, -119, 29, -343, 562, -76, -57, 300, -256, 90, 125, 46, -137, 378, -51, -90, -206, -327, -521, 96, 444, 739, 567, 216, -692, 193]
2355A93n91K82Q70j196J483j145k72J111j246M27O1P81j118J78L38j75N14n10
2373a5J44L61o82j54R51n52k5r61K69J095j669J950j119M15M2O63j262N97j15
2392f7j75qO8o98L35m82J556L0k75m77K43m00L18N7M20k88p48Q10n10j10Q86O8
2414E53j85J34k81j27K88m74J73K53n79M9mL42k38k28Q2L42J62m75KL29j05K4
2436C7l50N23k50k30K85m1j41k82L42q0p5K06K13j74q5Q1J80k02j4O8R0j03K7
2459B5J61j32j15J23M9o3o3m4p8O1k6N6K7j52K13j14K0O4Nj18J78q4L4L5j07K37
2485A92k60j0J68k08R3Kq7M9P2l8o2R0j06J51j08J90Jl8j01M6kjJ0j01K30j40
2511C2m5qr2k6J84j6j5J2l7K2l9lJ19O0j93J97m8n7J5Q3p8n2n5rN2n5m1J13q3
$$ y = [193, -398, -116, 754, -442, 1041, -104, -376, 735, -511, -84, -23, 758, -360, -182, 156, -19, 495, -15, 129, 490, -192, -346, 605, 53, 28, -933, -664, 431, -1238, 712, -407, 8, 50, 713, -549, 48, -67, -242, -250, -182, -880, -545, -1027, 529, 559, 284, -193, 50, -350, -32, 25, 445, 157, -591, 219, -291, -401, 485, 553, 368, 502, 221, 94, 382, -92, 81, 334, -245, -196, -200, 142, -96, -324, -242, 100, 262, -213, -211, 118, 13, 37, -313, 210, -40, -270, 15, -26, -167, -449, -107, -187, -262, -56, 157, -17, -102, -21, 159, -43, -57, 11, 101, -2, 25, 186, 54, -61, 62, 111, 48, -15, -59, -137, -76, -102, -46, -19, -171, 42, -72, -52, 12, 17, -101, 77, -7, 27, 62, -45, 192, -68, -78, 90, -118, -25, -23, -110, -61, 11, -27, -89, 1, -105, 46, -62, 128, 129, 91, -10, 36, 34, 33, 43, -58, 172, 32, -13, -21, -113, -139, 45, 29, 14, 26, -11, 11, -28, -31, 88, 148, -45, 152, 104, 47, 62, 145, 67, 15, -40, -49, 3, -52, -93, 20, -63]
2540f3L6q2J21N6J5j99J98p7O5r2O2m5N8j14K2M0j03O3k9Q4p6P1jn3n7J80p4j6
2568a0qK2o1J06K5P%k10J94lj4mj52J11K5r1K6Q3j03R4n2l1J35r9n9M9N9o4Q5
2597F0o7J27k3j41J19oj96O4J7p6L7R9PK1Kk6N2q7J18j19J39j7m4j10J19j61J68
2624G6j05O6l24J25R98n37j16n70M89j45O7K8r4J49lk02K26k3j04N0Kr2j2m7Q0
2649a8J29j66m2K6rK1M2M7L7L6nJ3j00L6Q6n5l4Np0J22k13KN7l4k0R6L3P9j59
2678e8K8J21o8N5n3J00k17K33j36J09j53pRO2q3q5Q1K2L8l8j06K42j51J02K93
2703C40M21o30j63J57l8j51N0N4o8Rr8m2J62l9K6m9n9M4J12N8n2O9j11Rl3O5o1
2730a8R0j86O1K4o0P8k4J03m9l3j32J27N2n4l4J15K6r8J5J48n0j38J18lj7J7j86
$$ y = [-63, -27, -109, 12, 68, 83, -116, 82, 5, 70, -22, 40, -5, 53, -61, -39, 1, -102, -39, -68, 16, -60, 11, 10, -43, -100, 80, 6, -10, -18, 4, -57, 49, 74, 81, 81, -129, 65, 62, 48, 44, -108, 3, 28, -63, -37, 46, -57, 37, -15, -46, 89, -10, -69, -20, 39, -25, 60, -7, 120, 97, -44, 75, 69, -127, -63, -46, -122, -85, 14, 21, 42, 44, 18, 70, -17, 101, -18, 121, 104, 60, -50, 69, -92, 76, -29, 37, -287, -162, 836, 299, 183, -387, 102, -43, 24, 52, -42, 107, 104, -98, 128, 105, 1, 51, 53, -39, -51, -98, -18, 111, -55, -97, -71, -80, -59, -17, 30, 67, 103, 98, 111, 11, 47, 133, 78, 44, 49, -21, 101, -112, -110, -53, -87, -107, -11, 22, 101, -58, -30, 91, 23, 78, 25, 125, -92, 141, 5, 114, -39, -46, -37, 25, -58, -143, -62, -40, -2, -40, -146, 96, -55, 47, 340, 761, 131, -32, 125, 87, -64, -14, 40, -28, -19, -117, -159, 3, -36, -10, -59, -118, -74, 38, 96, 44, 113, 2, 11, -22, 43, -18, 72, -114, -53, -29, -89, -11, -35, 68, 19, -14, -146, -19, 33, -21, -55, 60, 86, -12, 3, 151, 101, -37, 81, 78, 61, 78, -108]
2757a08J05q7N7o3J6J9k2n3K0J72o3nQN7l8L7K3NK9j49Q0Nl9N3o2qJ4j5P3j05
2787d4J0P5q7Q3L1k7P4l0j37J88o3j20L7P3k9J30k92J35O1j76J54j08j28J05j7
2812a02J23O0l6o5J39j23OK5p7N5n8M9M4n1P5j57R4l0l6j4J12K6j38K10o0k3l0
2839A8k1K0r3J40k1l6O1k03J88%m3j1j19J49J6r9O7q6J10PrM7o9K3K0L5j50J26
2867F7k6J4j47j4N6P0L3j41L4o1J79n0n3m3O2M1M8j34P6jO3j05J14k0K16K46p74
2894b50L60k75PJ53m3rK3J2O4J7m8J50j73J02J06n9l5j40L8j50K29k00K79j72
2918a4m6o5J82j17J54q5l0j5RJ15j12NJ43m6Rp7k13K78n8p4n7J86p6n6P3L3j0
2945C6j4O6k5j30Q3qN9L9M8q6r8M4k1j33J60rN9r8P6j34j4J13J3j31J31O9j18
$$ y = [-108, -3, -90, -33, -96, -80, -61, -83, -136, -116, 56, -7, -12, -4, 53, 15, 52, 75, 80, 109, -40, 40, 45, 6, 59, -3, -11, 3, -12, 61, -44, -34, 41, -46, 37, 68, 41, 115, 85, -52, 136, 73, -47, -10, 63, 34, 164, -128, 7, 68, -108, 46, -62, -190, -85, -102, 21, 81, 45, -20, 119, -4, 2, 27, -50, 5, -53, -4, 40, -11, 64, -93, 1, -29, -65, -79, 33, 59, -79, 131, 71, 48, 18, -3, 17, -76, 64, 43, 7, 68, -135, 53, 53, 10, -1, -120, 29, 45, -54, 13, -73, 37, 44, 35, 82, 13, 36, 56, 91, -59, 67, 41, 55, -92, -106, -50, 20, 53, -88, -54, -115, 64, 14, -39, -82, -20, 21, 69, -65, 11, 10, 73, -32, 82, 62, 278, 524, -250, 110, -165, -158, -5, -48, -57, -34, -22, 42, 59, 11, 161, -12, 90, 196, 137, 102, -38, 0, -150, 79, -121, 158, -14, -60, -125, 57, -60, 94, 9, -21, -36, -27, 88, -24, -19, 124, 78, 87, 10, -203, 75, 17, -57, -114, 72, -4, -60, 13, 46, 36, 22, 88, 63, -67, 16, 8, 67, 106, 154, 68, -30, 14, -7, -140, 20, 11, 70, -28, 48, -86, -100, 13, 26, -105, 26, 95, -23]
2972b3J5M1J9O3j47R8k1j31J13j07M6ML0o8O6L6j58J86j06L6N8jL5j38L6J7R3
2999I2o0j4j25J85j33r1J10J58k22O4R6q4N8j35P2J12j2q8L2M4n9L7j17J10n6
3024b6n7J37j23K1p3R6M8k9l5l4J3m4K00p4L8p7L0J8R0n1J7k7k03J81r8kQ3l8
3052a9m4N1L8J15j79k1J11M9q1j5QP6J2j48P3r3M4N8o7K3j26R2K3N5p8N1P5j48
3080f5J0O5L1j8R2%p3p1k5J17J9k40K40j29J3p0M1P5n7n0J27j77K25q1P5Or1r9
3108a10J84N7j47Q1p8n1Q3k3M1l3j57N6LR3P0p8O6m2p2K7N4K3k5Q7j46Q2j04l8
3136i7O3kj01J15J11j61J15j52J28%K0j6n2J7J61k42Ln36j77R46k74P3O0j0r5
3161a03O9q1K8J6J15j02J29j27M5K5j02J62J9m5N6j15jl2m1q8K46o3j07j2R1n
$$ y = [-23, -8, 33, 52, 115, -32, 66, 45, -86, 27, -80, -34, -30, 0, -68, -2, 34, -124, 62, -44, -8, 50, 49, 84, -54, -18, -1, 92, 32, 18, -107, 78, -55, -146, -36, 122, -100, -36, 60, -24, 34, -101, -29, 83, 71, -17, 15, 59, 0, 37, -80, 30, -26, -83, 54, -69, -48, -121, -25, 23, -6, -41, -75, -62, -106, 94, 20, 58, -19, 11, 29, 119, 68, 85, 58, -145, 36, -62, -64, 19, -19, -63, -12, 26, 141, -38, -59, 52, 101, 20, 5, 13, 89, 101, -47, 26, -67, -23, 35, -32, -9, -135, -43, -20, 35, -43, 8, 83, -65, -55, 10, 41, 23, 115, 115, 42, -29, -54, 63, 82, -158, 82, -47, -34, -104, -63, 12, -45, -95, 32, -145, 80, -1, 74, 80, -11, -110, 74, 131, -16, 65, -13, -64, 19, -4, 37, 4, -153, -97, -94, -1, 69, -9, 57, 15, -57, -30, 24, 47, 22, 109, -37, 45, -59, -97, -34, -36, -137, -22, 89, -72, 43, -109, 19, 19, 39, 23, -29, -12, 149, -93, -90, -626, -803, 143, -131, -58, 2, -8, -103, -34, -115, -87, -71, 44, -58, 71, -56, -11, 14, -88, 74, 93, 48, 104, -11, -12, -44, -85, -173, 73, 10, -97, -109, -18, -23]
3187b3%K2L5j30K05m9j01pN0rl0NP3o4J15j11M6j0p1k9RJ12o0mN8J4j1Q5j48j2
3217d0J10j10M7j40N7R5j7l2lK8N8n1j35P2L9J48k35K73k71J31J44k35Q1L4p8
3242c0L8m8Q6l3o2J5N9m0k8Q9k9Q9j85M9J48j53m2R6M4l%Nk99L19r6m1K1o8k5
3271a24P5k7J02j03M9K2n1J56j75J08p9J11p2R5q5J06k0j35P3%k7M5j5j42O7n7
3297a03N4O3j9j1L8l8N0kJ4n9k9m0K11o0j40M6m7K5Rj32J70ol9J22o8M5qQp6P2
3327E0j57J77j07J09j41l8J05J02r4j2l4R1p1o6O5n6Q5j13L7Q8q2R9o1M5P0j60
3353f9MJ18r7J49J0q7J6m3kqp6J9J45k00J16n0J22o2q9N6o9Q1l8J91k41R3J07
3380I6jr2jp4O7N2j43Q9j06J26l6j6JL9j34J91r3MJ04n1q9J80j00n1N0j43K22
$$ y = [-23, -23, -1, 34, -96, 109, 60, -41, -48, 2, -7, -37, -32, 41, -23, 92, -19, 27, 17, -54, -83, -74, 38, -22, -26, 32, 46, 35, 120, -28, -40, 70, -40, 7, -133, -76, 19, 2, -30, -33, -5, 53, 2, -133, -61, -22, 126, -109, 164, -107, 24, 168, -67, 14, 48, -30, 8, -40, 46, 13, -49, -34, 25, -15, -43, 46, 17, 106, -79, -30, 118, -35, -77, 19, 63, 60, 60, 65, -234, 85, -11, -52, -31, -99, -124, -49, -76, 26, -77, -28, -6, -57, 99, -76, 32, -47, 64, -8, 87, 2, 108, 88, -47, 26, 26, -1, 44, 29, -113, -46, -103, -49, 14, -5, -16, 22, -16, 34, 32, 46, -13, -42, -82, 129, 69, -71, -25, -72, -47, -38, -170, 0, -6, -45, 77, 9, 54, 46, 54, -22, 50, -107, 70, -37, 72, -69, -107, -2, 100, 6, -6, -40, 51, -20, -86, -21, -77, 8, -105, -68, 20, -62, 37, -24, 21, 91, -69, -65, 53, -44, 105, 115, 28, 44, 1, -1, -9, -85, -66, 79, -121, -5, -55, 67, 5, -84, -28, -97, -16, -54, 137, -104, -11, 96, 95, 3, 2, -72, -5, 47, -96, -7, -113, 13, -23, -39, -38, 1, -133, 58, -35, -31, 73, 22, -67, 113, 13, -38, 12, -131, 91]
3407I1qj51N1p2J43P1j92l4J17J6L0j44KJ73j01k3oJ05j32Q3j16J00J6k7O3j25
3433g0J45rj08L1M8N1j07M0J8N2j04J8N4j0j9k2P5j07N0j66R4K4R6J4Lq8m0J00
3461F3q0lQ0J0k3l4j22L9Q5n6R0p6O5K3j65K19j76J62J23M87p16j49J54o0P9%
3487A9j14L8N5K2j41O3P0J3r1P9l5q0J33j08M8P6m7o9Jk1K37o4o3J09r2Oj5k8
3515AL0m2j05J43r5j6p4J69j09J66k3LRj53J92j11J7N3j85P4J47j09K5n2M9Q8
3541I2j40k4J20j0j12J06n6N5j17k7K10n0J6l0J8l3o8J8N8j43O9K9K4q9J03j08
3567h9k6L4J37j19K7O7J2L1m9p7kP9n0Pj7j7J24j8J1j14M7N9L4pj56R0N8j20N8
3596A4N9j21Q1j18L7j4M3m4M5M3o8p7M9JP4p1M9P3Mp8M3m2R5l3P5j43J91j62m0
$$ y = [91, 83, -68, -17, -89, 54, 125, -67, -101, 16, 32, 62, -82, -80, 93, -8, -31, -37, 68, -64, 19, -97, 3, 19, -8, 55, -70, 75, 66, -42, -11, 37, 88, -19, 21, 39, 91, -13, 5, 59, 49, 30, 8, 83, -24, 26, -140, -46, -22, 74, 88, 91, 3, -37, 63, -17, -20, 60, 70, 47, 13, -109, -70, 15, -41, 49, -27, 38, 61, -104, 115, -61, 101, 224, 711, -5, -154, 0, -60, 19, 19, -95, -57, -2, 20, -121, -58, 12, 25, -66, 13, -22, -102, 31, -77, -29, 47, 0, -69, -68, -89, 148, 84, 21, 130, 38, 44, 29, 1, 31, -11, -116, 27, -68, -84, -158, 11, -98, 68, 45, 48, 57, -96, 96, -15, 2, 55, -130, -56, 91, -18, 7, -45, 4, 92, -48, -72, 48, 38, -74, 32, -24, 31, -86, -113, 97, 47, 63, 33, 51, 18, -50, -32, 26, -117, -48, -19, 5, -84, 19, -89, -115, -81, 56, -63, -36, 31, 43, 74, 25, -52, -54, 25, -25, -18, -35, -52, 72, 54, 65, -49, -2, 57, 91, 84, -72, 18, 76, -44, 14, 73, -48, 33, -85, -48, -62, -19, -63, -18, 25, -43, -120, -71, -70, 4, -67, -18, 55, 59, -19, 24, -18, 77, 44, 119, -24, 167, 5, -35]
3625c5J61j73m9l2J04J04j34PJ2N3p7m4J14q5J5K4J39j27k1K85k79L4ro0J11j30
3651i2J92p7L8k9q3P2m4J7rpJ16p4o1pJ07k0l1o9J26nq6Q3p3Jo9K8J37m76O46
3680B51K86n17K4j11N4QJ37k43J79k5J6r8M2qR9L0j09K8j23Q9j53J68m4J29j24
3705a5J01k13J01J09l4o3j1j12K38j52k7PL9O9M1j0p9o1N8j1Nj8K4J24r8P7j54
3732f5l1J00o8J54j65N1Q3m4l0KJ12j36J6mk6j8N1j24J33LlLn9P9k4J3K1LK8p7
3762b2n5O9L5j92N6J56qK2Nn8m0M3L7q1J01j2K3l5J1j08O9J1j9M3n3Q5j02j8M8
3791A1n2l1J0P8L5j25J24N9n2q4jj1N9j3o5j3L6%l6Q9m7Mm5L7rRL1j4R1n5L5J5
3823G0n8j1j7o9R2j2n8l6J42n7k5R9n3M0j3n1k4O9k8M1k2p1P1p2M9q6N9O6p8J
$$ y = [-35, 126, -47, -96, -128, -24, 80, -54, -47, -35, 18, -59, -103, 11, -74, -59, -35, 104, -23, -44, 241, -38, -4, -13, -73, 38, -92, 100, 23, 61, 32, -51, 21, -23, -6, -15, -22, 94, 20, -41, -48, 59, 39, 8, -61, 65, 60, -26, 57, -16, -15, -84, -56, 81, -395, 251, 537, 20, 44, -67, -13, -5, 132, -111, 68, 43, 59, -39, 3, -5, 94, 124, 15, 43, -80, 9, -144, 24, -20, 109, -15, 86, -127, -26, 83, 49, -14, -25, -137, 101, -51, -78, -71, -32, 37, 78, 68, -11, -72, -14, -25, -20, -38, -14, 110, 12, 89, -65, -96, 4, -64, 90, -75, -24, 59, 15, -15, -13, 99, -37, -21, -25, -51, -69, -18, -142, -9, -6, -9, -6, -65, 14, -10, 3, 24, 27, 55, -22, -77, -8, 27, -165, -109, 47, 39, 61, 66, 8, -32, 11, 48, -33, 68, 56, 79, 44, 55, -53, 16, 27, 8, 51, -2, 83, -19, -37, 11, -41, -72, -62, 16, 51, -74, 50, 109, 57, -27, -28, -39, 20, 7, -58, -71, -35, -35, -71, 18, -29, -25, -70, -33, -42, -33, -2, -16, 75, 20, 55, 70, 12, 1, -16, -85, 7, -5, -63, -99, 43, -14, -39, 60, 7, 47, 34, -17, -41, 28, 0, 41, 19, -52, 19, -53, -4, -90, -31, 35, -43, -42]
3853d2O1n1J13k0r5J4N4j7j5L22l12Kj8K4m1K75k74n0oJ40j59J97K67n71L55k49
3879i6L9L4Q0o0l7J12n0n3OL1J08j72lJ57r3O9j13M1jN7o4n3Q8M0j47P9Q6n2r7
3908f4K4J6jj11O5J26rp1R2M2j49P5K3r5R5p3K1mj10J89j05J34j78P2N9pQJ7j8
3937F3Km9j23J20k6M3m7J0P8q8m0R6j40J10pO9n1m2j25J62j41J29N3o6N8o0m7
3964e9J01R3j75P8j10M4J08j27J13P8qp2r9K2O6K2p0o3LR7n2j49R4O8j10nN1p6
3992a37J12J7q9P1M0j34R9J2n4J15p4JK4PPj00Q5Ol9J7NJJ04q6p7J40j75P3n5
4021h4N8JLJ2R0l7o8J2r8N6J31n7j9n5O1p9J80l8K1o2J7q9J50p4p0M0K3j4n0J5
4051b4j5j2nl1L7O9j62J10Qq2J21n2R4m9%N2l5j2P5j31j8Q6p5l2k3J44j49L9J29
$$ y = [-42, 19, -32, 81, 61, -34, -20, 34, 17, 2, 324, 12, 14, -4, 20, -21, 254, -20, -70, -76, 64, -95, 102, 369, -202, 153, -96, -57, -23, 57, -3, -40, 72, 22, -31, -25, 6, 114, -58, -61, 96, 3, 72, -41, 0, -1, 56, -8, -61, 27, 67, -80, -1, 85, 33, -64, -40, -24, -25, -136, -71, 55, 46, -25, 67, 109, -40, 35, 58, -37, 58, -15, 6, 2, -108, 81, -24, 110, -68, 4, 63, 56, 64, 81, 63, 65, 16, -107, 13, -13, 30, -17, -7, 71, -17, -57, 39, -101, 9, 2, 71, 20, -22, -147, 15, -126, 3, 56, -10, 48, -12, -59, 42, 135, -40, 38, -72, -28, 80, -47, 66, 144, 136, 64, -35, -13, 53, 75, 5, -58, -55, 42, -10, -159, -65, 3, -107, -112, -61, -137, -25, -8, -97, -26, 14, -120, -21, -9, -63, 52, -22, -21, 3, 10, 17, -83, 2, 8, -31, -14, -9, -8, 96, 10, -67, 73, -102, -29, -84, -26, -25, -22, -10, 80, 43, -25, -13, -111, -55, 76, 19, 0, -55, 6, -73, 107, 69, 90, 28, 45, -44, 106, 32, -38, 2, 25, 11, -39, -24, -39, -51, -56, -87, -50, 19, -143, -33, -25, -107, 14, -38, 56, 7, 7, 59, 24, 12, 87, -44, -62, 24, -51, -83, -106, 38, -111, -72, 57]
4080E7j1O9m5j78O0L3l8JL5Q2n4m2lJP9j21M7P6p4K3K1M6L8j23Q5k8n4J29r9L2
4110D4j14n3K74j71Q1q7N4jm9JJ9o2M7L9j25J0K27p1j45PJ23J9N0p7l6NN0q6O8
4139D1r2P6L1j1j1j14N0j4J14l6M5j53J58r1p8J08j27J10rJ4r3J40j05J22j21
4164d6N2p9j6J98j00J5j40J5R3N9j36J6J53j09J1o0jJ16m7L1k6J1n8P3JJ4l9%
4192Aj23P5N8M4k1rjr3K9Q9m8OL1j55P6N4q2J49m0j47Q2N8%j21N7Q1j00J16q0
4221a4k8Q8m0J2p3RO9l7L3lp2%J16q2Q9J1K8o0q7L2K3o3J00Ql7L4J1n2k8%LJ6
4253Foq9M2K7K7j57R1N4n4O3pp8J01K6K3%K0J9j31N7J4L4j20N0q9R4j3Oj9M5n1
4284a5O6j70J44M8p2L0J5k9K6o1L2n4P6l8n5K2l4L1J32k04J78j39J43m3l5O6l0
$$ y = [57, 46, 115, 70, -108, -48, -15, -53, -52, -17, 65, 11, -31, -34, -33, 46, -75, -28, 48, -26, -3, 18, 64, 102, -21, 64, 36, -18, 111, 12, 44, -70, -123, 151, -20, 61, -26, 28, 27, -22, -21, -2, -64, -17, 22, -103, -93, 134, 63, -82, -75, 48, 67, 117, 40, 4, 9, 59, -27, 41, -51, 25, 56, 45, 34, -80, -30, -44, 70, 34, 79, -74, 84, -7, -85, 23, -104, 6, -3, 11, -82, 58, -47, 75, -46, 6, -73, -89, 109, 9, 24, -116, -101, -8, 51, -85, -69, 84, -25, -14, -74, -75, 41, -6, 25, -1, 10, -48, 25, 26, 40, 1, 1, -122, -47, 11, 55, 34, 25, 24, -69, -40, 49, 1, 7, 38, -117, -41, 13, -69, 80, 40, -107, -25, 33, 33, -88, -31, 50, -50, 66, -14, -42, 46, 6, 18, -55, -46, 23, -14, 19, 16, -56, -56, 60, -22, 67, 78, 106, 46, -41, -9, 14, -49, 51, 59, 22, 56, 67, 15, -13, -13, -10, 6, 0, -89, -47, -20, 7, -150, -59, -5, -59, 4, -3, -81, 20, 46, 69, 69, 89, 108, -23, 34, 48, 82, -38, 12, -77, 17, 4, 10, -9, 36, -15, 51, -119, 25, 73, 1, 31, 46, 17, 43, -18, 14, -40, 36, -2, -57, -35, -69, -38, 94, -110, 68, -71, 72, 29, -6, 60, 30]
4311C0q5K0L6m5lkJ68j57K8R6r5qk4N3j8QM3o3Nj1M1L7j91Q2J6k1J8k1K4N7l0
4342a2l5J01k8L4j53J03j59J53P5n7o3N7n3l7Q4k7J41j58L7k5J5j04P8J%OO7J2
4370E3n7qP5j66O6P9nm1R4l6n3P1j26J04m4n5l2k4P3m4R0q2P6m1j8p7K25q2R1
4399A06q7k7j6NP8P5k16jJ49N0m8j19j4P2o1m4J07j2L5q5O1L2j6q4J46p5p9J27
4427E9k3j36Q6K1K6p3R3m3J55j24n1P5j69J96m4n2M9j16N9P3P7j04q7P1q5K05
4453A38j06o3K0mJ8L3k00J09N7j6R6p9K3j9N7j19l4J84m5j71kJ19q9j6N1lO6l8
4481c3Q6j45J14l6P0J4j19J02N1j89R0r1j6J36Mj0l8j34J63m8O8m9k8nlOP0N1
4509H1n3M9j51J12p8L3j11J46j09J48N6j71R2j03jP3l4p1K7N4O1l8P0o0j1L0J7
$$ y = [30, -55, -35, 1, -44, -47, -49, 119, -38, -10, 86, -9, -17, -41, 12, -6, 2, 45, -18, -13, -24, 17, 54, -137, -55, -39, -60, -42, -63, -39, 18, -12, -47, 54, 26, 60, -93, 10, -149, 4, 79, 22, -41, 16, -37, -74, 10, -17, 124, -34, 3, -22, -7, -111, -33, -32, -32, -26, 41, 53, -4, -12, 63, -103, -37, 42, 37, -4, 90, 54, 1, 72, -54, 50, 6, -49, -81, -105, -32, -76, 14, -68, 8, -33, -51, -128, 97, 15, 106, 19, -8, -24, -19, 59, 134, -82, -83, 66, 116, 68, -51, -65, 7, -54, -98, 9, -3, 32, -53, 8, 40, 24, -60, 86, 11, -68, 59, 36, -100, -14, 7, 33, -40, 53, 10, 165, 41, -10, 65, -104, 92, 48, -4, 45, -71, -12, 61, 138, 34, -53, 18, -67, 138, 32, -31, -11, -15, 3, 36, -164, -55, 2, -14, 82, 3, 26, 7, 64, -55, -89, 95, 50, -121, -123, -4, -93, -109, -58, -61, 5, -33, 53, -92, 22, -14, 56, 70, -49, 53, 104, -85, 5, -86, -102, 34, 38, 28, -10, -144, 19, -29, 39, -10, -38, -43, -46, -40, 30, 81, 28, 77, -74, 38, -40, -7, -118, 28, -81, 67, 123, -48, 44, -59, -60, 13, -21, -92, -65, -11, 50, 12, 82, 22, 11, 41, 58]
4536E8n6ljQn1L8R4j04M6n8o1N7O9k0N1K9j40J97j30no1J85r7p6L6OK7L4r6J40
4566A16j16j5m7K8N9O1o6o1j7KJ0m0J01qj1q1J51j61P7k8N6q3J01o2J25j66N7
4593a8k5n0O9n3j7K1l5J33M1r1o5J66p7n3p3J92L7p0j05R6p2LJ18J67k31j13K6
4620g9J40j88K32r5J64j93l8J24l4o5R4r1Q5l3J34j51J5Lj24N9mJ01k2j07J37
4645F4L5j83J00J3R1j73J12o9o0k7J60j27P3J02j25P0Rn9j54K71k03O5n0O7J04
4670A06k30J88n7n0N0M8o7L9K9o5J8M4j5J2j9J7n8q9J38O6j90K9J32m2n7p6R7
4697bJ18j88R7k0L5Nj19j53K75o8K8l2j6j1j1O6k7L9%M4M5k00J32m9R9l5q0N4
4725B6N7o3o9J33k18J18m1K1m9J48j77K2K27q1n3P6j83J96j0J7j82PJ9O4nJ84
$$ y = [58, 2, -1, -2, 6, -45, -7, 87, -17, 29, -29, -90, -33, 36, 16, 67, 96, -44, 153, 23, 18, -43, 142, 45, -31, 5, 11, 38, 72, -24, 116, 0, -15, -62, -34, 25, 86, 20, -41, -58, -56, -46, -86, 15, 7, -4, -85, 66, -95, -18, -46, 10, -73, 28, -34, 91, -75, -18, -43, -93, -24, -77, -94, -73, -108, 25, 66, -25, -90, 76, -1, -54, -127, 65, 102, 32, -73, 23, -49, -46, 72, 239, 8, -105, -79, 61, -127, 105, 10, 174, -19, -57, 67, 33, -32, 62, -29, 56, 23, 157, 6, 21, 24, -100, -41, -45, 56, 34, -73, 64, 99, -84, 16, 29, 120, -53, 59, -10, -70, -97, 63, -64, 9, 111, -14, 56, 65, 6, -148, 123, -80, -15, -65, 2, 106, -124, 64, 7, -43, 7, 55, -12, 27, 56, -9, 9, 53, 38, 50, 31, 48, -10, -99, 39, 105, -85, -56, 76, 34, -23, -99, -2, 116, -72, 25, 5, 40, 45, -74, -227, 48, -20, 8, -24, -40, -51, -62, 4, -23, 16, 16, 60, 105, -95, 37, -12, 87, 52, -28, 26, 83, 20, -49, 84, -134, -16, -57, -36, -85, 63, -114, -92, 135, 54, 1, 77, -106, 90, 80, 97, -85, -78, -59, 5, 0, 184]
4751A84l25K64k82J33j98J79Q1n9j70k00K19N91k25R58j885J14N99k53O03l89
4771f1j23R9k4o3J95j16R3O5M5k03J46o0J49j10q7%J70j30J35j33Q2j08p5K29
4795A15j88J17j14P7n3pJ68n2L4nj02jL0M4j4k8k5Mo0R3oj41J02J8n3J4pJ23j48
4824f5J58l5j09k6J73lj13l4P9j05Q7O7p3K1m2M0n5N4j40J47j6j16J52r1M8M9
4850E2mqK3K1j14O5j20J48j55J68j5j34Q9j27J62r7R4l7j5N4j19n6K96j51k5m0
4876d5J29j25L2J7p7P2m6J21q1%j2J38p5l5L8j21O2j9P5m5m3L5l3N9m3l5Q1mL3
4905E3j49N3k5R4m6j0L4r8J88n9qk5L2j40J36j05O4n4O9L4NK7q9O5q7o0J4O3R8
4934G4j40L6J06j00O2N6k3p1J9mL5q7J4J13j11j6J51n2l2J2k8O2K3j18k8J87r7
$$ y = [184, -141, 123, -159, -26, -224, -45, 36, -23, -193, -393, -174, 417, 192, 1150, -735, -621, -22, -275, 328, -61, -184, -85, -109, -172, 23, -93, 0, 65, 110, -93, 53, -7, 142, 32, -55, -55, 115, -15, 120, -13, 69, -39, -114, 115, -73, 44, -70, 7, -46, -53, 115, 63, 97, 92, -10, -11, 19, 63, 49, 21, -4, 0, -60, 33, 27, -114, -12, 6, -47, -33, -40, 83, -65, 93, 58, -51, -77, 96, 93, -20, -54, 25, -80, 7, 74, 1, 22, -20, 20, -35, 19, -121, 26, 10, -106, 46, -45, 3, 52, 48, 40, 63, 84, -30, 35, -85, 63, -92, 76, 61, -73, 16, -111, 51, -46, 48, 11, -4, 50, -69, -125, 171, 20, -5, -45, 84, -41, -9, 8, -69, 3, -43, 78, -3, -3, -15, 123, 48, 13, 51, -70, -8, -27, 48, 3, -40, -5, -38, 21, -22, -57, 24, 20, 53, -96, -43, -68, 26, -20, -30, 4, -94, 94, 35, 27, 2, 34, -106, 30, -75, -11, -65, 4, 38, 43, 70, -19, 46, -41, -101, -87, -24, 74, -66, -30, 76, -24, 38, 94, 71, 0, 19, 15, 50, -37, -23, 90, -21, -37, 114, 62, 30, 42, 14, 76, 99, -19, -47, 140, 43]
4961D3P2r4n4j7J04j07j22K13K2K5j10Q2p5R4k9q3k7j1J05P8j07l4N0n8J15j41
4987f6P2k7P8Pq2o5O2m8L6o3K5J3K0J1J01J2r0Ll9K20j48K1L2j34lO0k2J02m2
5016D6j91J40p6N1M3Qm4L4q2J46M4j11j2J6r4K0J34j76K21j84J37l0Nrq3kJ29
5043H0n4p9k0k1N6P4l4l4l8R2n3r9J70l3J6o3J27lj02Jm8M3oMj2M4r8Q7O7o4j2
5074a2L9K7n2p1Q6M5k7JRj47J21k9Q1m3J3r1O6P5r3pO5k1M5j05J48r7j06L4Q1
5103C5N5o6p6J13j43j53K67j44J45kN61j876J256K70k95R7j14J59j61J19l8K1
5125C0q3JO5j12J48j82J19J6Q2j1m6k7m2k8k7R7Q4j6j18o0P8K0J07j6n3p1M0O6
5153F1j00M6O4j30J66j04M6J4j37J3rON7J46k21O3L0k9O8j2N0nj01M5M6l8J9j44
$$ y = [43, 115, 21, -33, -50, 54, -53, -175, 38, 60, 85, -25, 57, -18, 76, 47, -36, -63, -74, 31, 109, 2, -32, 18, -40, 75, -66, 6, -21, 57, 64, -18, -83, -21, -69, -33, -96, -71, -58, -38, -27, 74, 86, -4, -1, -40, 180, 32, 53, 85, -49, -52, 8, -14, 88, 46, -145, -5, -81, -30, 13, 21, -23, 11, -71, 75, 119, 8, -4, 12, -82, -62, 72, -104, 117, -67, 70, 40, 45, 36, -47, -49, 80, 26, -53, -73, -94, -38, 36, 2, -32, -70, 22, -31, -130, 40, 7, 23, -40, 87, 84, -18, -17, -65, -22, -28, -24, -36, 8, -90, -3, 64, 0, -12, 27, 54, 2, -69, 17, 62, 35, 36, 45, -102, 19, -10, 71, 28, 41, -50, 16, 91, -2, -9, 56, 35, 80, -25, 123, 26, -80, -46, 35, 90, 24, -52, 61, -82, -235, 32, -112, 33, 31, 592, -1284, -28, 242, -53, 44, -70, 89, -72, 47, 9, 30, -53, -52, 13, -99, 49, -133, -14, 2, 84, 73, 27, 0, -42, -70, -97, 0, 84, 68, -50, -110, -32, -12, 95, 79, 26, -45, -5, 61, -39, 7, 71, -59, 107, 3, 49, 63, -74, -61, -70, -64, -7, 139, -82, -19, 11, -18, 50, 38, 88, 83, -18, 27, 73, 35, 54, -90]
5181i0J11j6Ql4Q9m1n3J34j44Q2m8l5J58j04r9j4Q1J03j35nR2q5K6P7p2J20j57
5208e1R1j46R0K9j2K4j42J24J0Q4q1M5m8o3k7n5J27rK4r2K00q6j65K11j75K3J61
5235I1r0K9j7l8M2J39j30j5R7q5r0J9N3M3r4j0L3K4j8K7o9qJ96k51O3J66j93J
5263h5k6j3N5R2k7J43p27Q26k68l61K9M75M7k88k5J77k3L4m4n9J40j76nJ46J5
5288E2j22J36l3J5n7K2O2j46J10n0LJ38j85J27j49M0J2k8P6J5p9J6J8N3j13L0
5314c7l0M7P6o1J00r0j0pq9O0Q6j5jr6N8J73j03o3j13O5K5N2j1m7O9l8n7L1J22
5343I6j09%L7m6J11j32qj4J00o4rN4j3kmM8j16J00OK4l8J05j59k3l2K1R2K13j82
5372E6m4l4O0K8j03m6L5K2pJ26j10n4N5p1J62j19kk9K1J9O7l6O6l8j5k1LP3l4
$$ y = [-90, 21, 5, 13, -21, 68, 27, -26, 108, -36, 46, -2, -37, 121, 17, -82, -96, -15, 88, -47, -52, 40, -45, -19, 58, -14, 106, -51, 40, -106, -16, 13, 1, 25, -117, 7, 17, 101, 20, 65, 17, -46, -73, -128, -1, -10, 14, -78, 122, 36, -129, 82, -93, -70, 91, 1, 30, 13, -25, 17, 156, 26, 11, 108, 23, -67, -48, 5, 48, -46, -56, -23, 1, -17, 10, -59, -67, 129, -122, -59, 107, -86, -85, -111, -124, -69, 23, -4, 139, -588, 238, -30, -391, -362, 113, 160, -128, -153, 24, 1, 35, -9, -68, 72, -104, -109, 37, 52, -70, 66, 33, 48, -9, 13, 75, -71, 39, -11, -8, 130, -55, 72, -77, -37, -25, -53, 23, 38, -41, -25, -7, 46, -67, -37, -67, -20, 56, -5, 95, 5, -5, -12, -101, -41, 45, 30, 29, -67, -9, 164, 61, -2, -115, -50, -25, 27, 16, -31, 38, 0, -57, -26, 96, -13, -13, 24, -22, 89, -43, -51, -65, 35, -29, -38, 16, 3, 1, -3, 45, -71, 29, 35, 59, 21, 126, -33, -56, -88, -67, 25, 238, 56, 12, -22, 38, 66, -37, -83, -48, -26, -33, 93, -17, -71, -16, -87, 75, -44, -46, -75, -54, -35, 32, -4, 62, 24, 9, -12, -9, 64, 30]
5401C0j6Q3j63O5j3L2K2jn2L4q6l2J31K0q4m3J46oj27K31k47J1mQ4n6J5R1q1k1
5430c7O0nn5j1QJ56j73J9J17j19P8j7N5p0L8n2J05p8%L2p%p5L5k6J48j21n4O1
5459A2j3M3kj26J81j76J13l6k9J20l5j46R3J9l7k9J50j15J31%j58M1Pr5lJ30j21
5486h1K25j73O2o6L3q5Q7p8M4Q0l6J2N6p0rN5j4j9Pmj85K12J36j16N3k07K2P2
5514A3m0O4j13L1J92j20p5K4L9j1k0P8p7k07J80O0n6N9j88R3J1J21nq6J55j6j57
5541e1J46p0p5P5q5J52j30q0J67j3j8Mk29J63J01q8k0KJ34j04P9q4P7j61K13n2
5567E3n3R7n9on0k3N9J4p8J26k6j77J04n2J0R9m8N1l3J5L2m3p4J06qp6J37r2j8
5596a3O2n0q8K9J32q6J46k24P0P0Km3JP6r7N7M7q6j8k0Q1j70J75j34J22N8j04
$$ y = [30, 14, 97, -66, -1, -14, 18, 40, 39, -13, 21, -65, -97, 34, 54, -30, -73, 73, 67, -60, 171, -76, -65, -69, 15, -41, -26, 65, -16, -37, 23, 18, -37, -48, -40, 116, -57, -38, 79, -40, 38, 21, 76, 6, 44, -8, 97, 19, 19, 51, 44, 44, -31, 4, -22, 126, 5, -49, 12, -1, 42, 40, -86, 95, -81, 32, -4, -33, 87, 52, -94, -1, 18, -19, -48, 102, -13, 118, 118, -40, 1, 8, -87, -90, 40, -81, 144, -29, 33, -33, 0, -85, 2, -76, -32, 48, 12, 24, 80, 10, 1, 56, 42, 23, 30, 26, -159, 53, 189, 73, 126, -81, -59, 13, -27, 37, -76, -45, 147, 27, -48, -24, 15, 4, -16, 62, -15, -222, -42, 18, -38, 21, -167, -74, -63, 58, 53, -33, 122, 106, -51, 95, 25, -50, 25, -60, 92, -38, -118, 49, 36, 18, 22, -207, -44, 57, -31, -51, -49, 85, -19, 60, -24, 53, -108, 105, 53, 0, 97, 38, 32, -18, -41, 18, 32, -46, 80, 54, -123, -19, -71, -61, 38, -10, 41, 8, 23, 55, 12, -62, 44, 36, -40, 97, 5, -13, 49, -1, -89, -60, 72, -14, 132, -92, -22, 48, 50, 7, 8, 84, -13, 44, 91, 5, -13, -33, 48, -122, 53, -81, 41, 99, -5]
5623eP5r5R0q6P1n0o8J14q9rR7r9RJ20j23K1J0%O1l7qkJ02j54P1m4N7K0j25O6
5653a0PJ6j00Q7j1j6K7OKJJ06o0k4L7j08J5R2j8k3nq9J01l4K9O2m1j90J36J7L8
5683E0j6n0R0j08J06l2n3L3j2k1m2R1l9Kjj19J29O4j5J0l3J7j07J14n5l0K4j00
5711a03J32l5J5k0J01j11k8K6L7m2Q0K0j49R8r3P1jk4RJ07j30M4j4J2K1J2j75
5738a40J28m9J63m8m5qJ6o6J02j5n5M9k0L2n2R6j13P5k7n3pk1N2N7k6jj10M3L3
5767a0J04r5q4J46k6M2j90J07rj25K17q5p2Q6K9LpL8l6J4J5r0O4j08J97j84Q7
5794B8N1j8j14L7k9M0j07J49O6n4m8O4l9Ok3P7j19M7J89j86pK0o6N3nP6j14k1
5822d7J10j19n6J98j0q0L0M1J9K9j66K5K9l5Jk1N5J0l8Q9j37Q6l0ljn6J53j01
$$ y = [-5, 70, -25, 65, -21, 50, 0, -68, 46, -43, -52, 45, -54, -45, 75, -48, -27, -17, -17, 44, 7, -1, -3, 99, -55, 16, -28, 29, 49, -76, -10, -3, 13, -87, 0, -11, -27, 0, 6, 8, 9, 115, 55, 31, 68, -40, -25, 67, 49, 26, 21, -68, 33, -1, 28, 90, 49, -141, -5, 12, 50, 34, -16, 74, -34, 72, 40, -13, 20, 8, -13, -55, 36, -3, -1, -2, -121, 8, 72, 57, 67, 34, 51, -56, 58, 3, -27, -3, -103, 29, -6, 9, -11, 90, -21, -49, -23, 14, -28, 52, 72, -77, 21, -72, -1, -2, -26, -17, 90, -40, 4, -10, 2, 23, 35, -140, -12, -61, 102, 54, 9, 1, 17, -49, 53, 38, -17, 32, 12, 44, -8, 88, -25, 50, 23, -30, -37, -58, -6, 51, 25, 24, -86, -43, -10, 94, -1, -85, 61, 35, 77, -113, -6, -15, -140, 77, -8, -80, 6, 35, 38, 31, 69, 33, 47, 62, -28, 36, -72, 125, -59, 28, 79, 61, -53, -16, -45, -5, -112, 37, 103, 49, 1, 65, 26, 32, 9, 86, -33, 14, 203, 17, 10, 30, -36, 17, 12, 88, -26, -47, 63, -56, -112, 86, 76, -4, 26, 67, 86, 115, -51, -26, 3, -32, -31, -52, 3, 13, -25, 64, -73, 13, -17, -20, -21, -77, 76, -25]
5850b5O6L1p7J04n8q6N0j37J25PM5r8J32o4Q0k10J05L1Mpr4J82o1j6o0N5j8lO2
5879F5j00R4n4l5J07j07K7N8M7j27q7J40L6o2k1L2n9OO2n2J08n5j20J24n6J20
5905I1lj54J12j03M8n1M7j7p3J08M1o5l9J46j65J36m5J2lj1j29K17n6k2J8j72
5931a32J33M6M6j08J0kJ16p6K5m5M6Lj62P4L3J03p3q5P5K1j0R6r3r1j07J72j39
5958a24J10j32O5O0O1pj56J41n4N9j9o7P2m0J06m3j35K05j01j40K28j36j0J87
5982A30j29J52j84q1K02p3J8O5J5j16k1J9J14k42K11l5j0%L0r8j1Q4l6J2O8l2
6008E2Ko8N5l6K6J77j96M0j43J79j06K8o4M9KK7nn7jJ02N1j31Q4lr0P6L5q8k1
6037b4J51r9M9l9j17mJ15k1ol9L7n7l0J09m4o9Q1N5n2j1kJ05r3N8j5l9m9n6J80
$$ y = [-25, 41, 72, -5, 99, 41, -45, 5, -132, -7, 0, 45, -53, 79, 15, 95, -115, -10, 21, 25, 18, -76, 106, 45, 29, -31, 24, 6, 3, 65, -35, 59, 5, -30, 77, -30, -3, 55, 102, -25, -112, 28, 64, 2, -19, 13, -46, -40, 22, -30, 78, 23, -97, 27, -29, 91, 88, -66, 46, -57, -9, -60, -13, -30, -103, 5, 46, -19, -58, 88, -77, 59, 14, 26, 23, 12, -117, 100, 44, 22, 40, -132, 1, 47, 93, -15, -5, -7, 109, 33, 58, 13, 59, 62, -100, -26, 7, 110, 37, -48, 27, 48, 38, 134, 41, -50, -157, 15, -124, -14, -146, -81, -21, 40, 33, -123, 18, -36, 23, 4, -63, 9, -31, 75, 32, -103, 102, 1, -139, 89, -47, -57, 130, 1, 153, -31, -112, 90, 17, 35, 100, 115, -1, -22, -3, 111, -131, 80, 45, 35, 35, 65, -33, -44, 40, 4, 16, 84, 52, 54, -14, 41, 5, 31, 208, 12, 52, -91, 88, -18, 10, -54, -5, -3, 24, 19, -38, -39, 63, 114, -17, 67, 64, -26, 50, 85, -3, -24, 127, 28, 77, 38, -79, -83, 32, 11, 5, -34, 3, -54, -84, 25, -19, -88, -7, 48, -4, -15, -17, 88, -5, 53, 38, -1, -50, -106, 74]
6066G4j14J39j71L8J07q9l1K7L2L5J0j18M4j2KP1Lj3nm5n3J75j73P5M5p6J25n9
6094D3j31P0JJ09j09N9Kr5P4j5R8n9p4K5k6L0N8o9q0q5J73n3n2J23j14Q2J31j71
6122e5J54j03n7J61j55Q4Q9q8p6j5P6M6k3r8P6m9l9J5J02L3q9R7j58j2P1K1n7
6149d9L8pR4l9o5L3n2mj4O2J1p4j1J82p5p8l9N5N1L3m3o1J20n7jN9l7m9K5l5Q
6180a9k1n9J12l9m0J82p5m1K2O1n2m7MQ2n2K3j5K9l8m3qN7M1j32O2J8j17J01J1
6209GN1p0k6m8K3J32o2m4O0j14J42L3p9p6J02q4R4q1Q2r6J85j31L5Q3r0p2j2Q5
6237B9K8j15J05K5o8m6O6J9j33j9m8J22J0R9j32L7J10q8O4q7M6Jl9J1J12j70o6
6264a27O1JL8M9ll5J9l0M6Mo5J3m6M9Oj3J56j52L7oM3nk9qj5J8l1N2p0O4j18O1
$$ y = [74, -40, 99, -72, -34, 73, -16, -47, -20, 12, 47, 57, -61, -17, -29, -27, 44, 47, 34, 29, -16, -69, 106, -67, 8, 53, -23, 102, 43, -88, -18, -17, 92, -17, 42, 44, -51, 23, 8, 106, 47, -27, -2, -28, 2, 60, -9, -89, -174, -1, -54, -106, 17, -97, -15, 116, -55, 99, -4, -61, 100, -55, 29, 118, 30, -46, -61, 15, 61, 38, -60, 16, -33, -72, -57, 45, 78, -11, 86, -72, -84, -13, 8, -49, -11, -18, 76, 37, -28, 5, -47, -51, -65, -3, 8, -66, -77, 105, 30, -48, -87, -32, 19, 52, 9, -52, 68, 11, 10, 69, 32, -17, 8, -27, -19, -40, -99, 13, -26, -66, 116, 41, 0, 22, 83, 31, -16, -12, 70, 18, 41, 26, 55, 17, -26, -34, 23, 64, -68, -6, 12, -105, -4, 7, 58, -12, -38, -86, -63, 69, 7, -37, 23, -91, 51, 84, 5, -71, 31, -53, 41, -40, 42, -54, 131, 0, 35, 118, 28, -44, -56, 29, 57, -58, 47, 72, 4, -42, 24, 43, -90, -109, -157, -35, -25, 74, -58, -21, 89, 1, 65, -22, 24, 25, -14, -3, 109, -61, -127, -66, -65, -27, 22, 19, -16, 3, -27, 19, 23, -42, -29, -75, -26, -20, -33, 123, -29, 8, 2, 45, 40, 11, 3, -12, 6, -25, 27, -43, 21, -97, -36]
6296c6Q4q3M5O2q6m4m7J04LO4j23J16K6l1r7J40k9j36M6k7m7J12n6N6J16m5n0
6323C7Mn1m4K1l3k7J17R1k12R5n3P0k1l0J27j78OJ61l5o9M7k4N4R7j10R6j27J38
6351A47K78j80K08m89M2k4R8r9l1j0N3J12J6k19P1L3J7q9J02o0Q4oLl1Oj07Q9
6378A4o9J10j53J33j9j21L0Q4m6J18j27Q5p6M2r2J51P3j22%K4p1MQ5q5K0MJl2
6406c5Q2Kj80J72j01n5J01Q1l5l9OL5j04J78o5O4r6n6J08qn1j1M8j42j4L3J06
6433B4Kl9k6J2J02m8n8mLJ9K6nj9O3j13K4J49j44L1M5j9N5n1n1O8J9nj9mj20J46
6464F3p1Q6p6j15K26j76J16J40k00l3J17m9r8R5R7j24n9N0J4o0P4m3nJ80m9J4
6490A14n2k08R8KQ2p2j41J97k9q7R7%Q0Ol0p4M0J2j34P4J41r0m9mj4M5M7q5O2
$$ y = [-36, 48, -35, 10, 72, -14, -58, -105, -1, 2, 66, -57, 59, 85, 54, -43, 97, 68, -68, -22, -49, -96, 16, -40, 16, 132, 87, 37, 41, -10, -54, -33, -66, -93, 24, 115, -97, -2, -55, 15, -6, -36, 91, -87, -81, 80, 45, -24, 23, -1, 53, 150, 40, 136, 9, 147, 425, 245, 453, -36, 6, -18, 80, -19, -50, -60, -7, 105, 121, -98, -27, 6, 23, -66, 36, -24, 60, 54, 57, 26, 32, -75, 14, -55, 55, -98, 35, 16, -105, -75, 9, -37, 81, -46, 39, -37, 5, -87, 64, 137, 15, 15, 39, -32, -28, 57, -28, -8, -4, -3, -35, 47, 49, -131, 41, -60, -115, -14, 67, 32, -7, -1, 34, -70, 108, 43, 107, 11, -45, 63, 55, 4, -7, 41, -101, -115, -82, 24, 26, -13, -39, -27, 75, 27, -31, -35, -32, -13, 13, 8, -11, 52, -61, -37, 112, -32, -1, 44, 25, 80, 29, -22, 46, 65, 60, 41, 37, -83, 63, -8, 78, 2, -113, 113, -63, 53, 193, -7, -40, 77, 28, -70, 25, 122, -2, -61, -11, 3, -57, 17, -26, -31, 149, 100, 114, 62, -146, -48, -46, 36, -36, -177, 20, -9, -96, 1, 1, 81, 87, 57, -17, 23, 35, -99, -25, 116, 26, -23, -27, -41, 4, 51, -34, 28]
6519B8J7M1r4rO4J2oMk0q2KJ16jl2p5L7j9N8m2q8N0L0r9p8K07J5n5j4O3j09m7
6550a26P5J22o9o5J37r6KK0lj18J55K4p5K6K3n2K9M6n9j24K00n0m5k5M4Ql2Q3
6578E5j8N1j86J57o5o0k4J49Plj14P0q1P2n1j4K3r0J95j49O5L9%r5O0kJ1o0L7
6607b1K6L7L4m6j18J87j74k5lQ5J69j49n9J16j4n7Q7j5r9Mj11Q1J10l0Lo5J5K7
6635eJ18j48M9J6n6j6J1p0K1J07l2j3n6k2J00oj07N0M4N4r6J20p0P2o5M6K2q3
6663a5K7N1n7Q4l9n2o2K1O5L7j10RQ7o8R6j01m5R0k0J03l2%j41J02k5m4P5P4j40
6692c0k4P7j16J70o0k8j29J89Pj16oPj7O2n9J25RM6p7J6N5l8j52J07J5j5j5p2
6720f9R7j1j19Q2qL3J00j01p2J35p5%Q2j2JLp9J1K0j00j3N9N2M9q4nk9O6L2K8
$$ y = [28, 45, 86, -8, -17, 47, 59, 53, 57, 37, -45, -43, 73, 72, 40, -35, 2, -17, 41, -1, -89, -39, -9, -108, -186, 21, 36, -19, -33, 30, -79, -126, -51, 71, 2, -63, 74, -22, -20, 0, -3, -121, 34, 58, -17, 9, 32, -20, 9, 55, -4, -128, 72, 22, -23, -48, -4, 4, -28, 55, 37, 88, -98, 59, -6, -66, -90, 59, 66, 63, -51, 19, -62, 10, -41, -55, -32, -122, 73, -76, -11, 28, 28, -67, -7, -9, 2, -58, -21, 5, 42, 76, 30, -88, 99, -75, -100, -103, -18, 151, 2, -57, 59, 45, -12, 75, 60, -39, -35, -146, -65, 45, 15, 18, -47, -32, -5, 113, -35, 14, 30, -26, -42, -31, -101, -80, 27, -5, -18, -74, -96, 4, -2, -109, -59, -15, 39, -57, 63, -7, 65, 0, 46, 68, -15, 12, 63, 6, 90, 51, -1, -63, -42, 23, 60, -50, -41, 46, -22, 74, -27, -72, 18, -2, 101, 69, 69, -72, 30, 5, -39, 36, 110, -30, -54, 23, -93, 77, 17, -11, -140, 49, 56, -60, -66, -59, -76, -14, -73, 52, 61, 107, 30, 46, 101, 63, -89, 18, 33, 18, 3, -69, 28, 17, -102, -20, -28, 5, 105, 4, -68, 67, -8, -8, 74, 62, 63, 66, -13, -2, 18, -82, -95, -36, 16, 65, -19, -24, -53, 13, 45, 73]
6750G3N3j02M2n8J3r7lO3N7j04n3M6o4R6J16m2r7rJ32q4oj3N2M5l2l1o5qO1KP8
6781F1K0n5J11k23J6J30Qo3P4r4Ro2P9Rq7N7n8j2M7J70j96Q5J7j04Nk2K5Q2j5
6810A4j06k5N1l0P6p0Q0J17j12J13n9J26r2q6J36j90L2m9l4R3JJ31j45K5l9J27
6836H5j33N7m0J12m5L9j27Q9k5j11O1J5J4N0o1M4p9N8r1J49j28oL8j09J07K16
6862A79j98K0MP1O3j59j2Q4q0K1K8l8J6j33J74l2L0j5p5K9r2O0N5l4K8m8J23j6
6890E3j45J69k1q1MJ0pM9j24K13j76jJ8OJ60j58M7p5R7o3PR8j44J49j18R5l4l8
6918a0K1r5J73j72J30j7J3JQ3j65J41n2m4l3L3N1r1jP7J6m8M9j1L6j05o4J22j4
6946B4n1L1l5k4J24j5l6o2nN5P2m1p0M6m9JR4o1n6J01K4j52J72j17J2P9j49J44
$$ y = [73, 126, 24, 66, 8, 21, -76, -79, -16, 41, -63, -116, -70, -134, -38, 78, 36, -61, -70, 62, -22, -28, -41, 11, 56, 24, -7, -72, -80, -19, -17, 61, 81, 26, 137, -86, -70, 60, 68, 5, 79, -15, -6, -68, 11, 20, -67, -10, -68, -80, -33, 137, -59, 26, 43, -61, -56, -78, -53, 29, 14, -92, -117, -66, -96, -20, -90, -10, 107, -5, 108, 49, 175, 83, -3, 133, -57, -25, -74, -108, -15, -14, 117, -28, -3, -42, 85, -48, 9, -31, 81, 36, 75, -52, 37, 12, -99, -38, -23, -9, 41, -20, 24, -55, 3, -88, 61, -67, -73, -35, -144, -37, 179, -19, 1, 5, 76, 139, -20, -32, 52, -28, -7, 21, -17, -1, -134, 40, 8, 38, 23, -52, -23, -115, -55, 0, -34, -6, -54, 69, 53, -92, 77, 56, -25, -21, -11, -18, 31, -93, 120, -56, -57, -39, -33, 127, -31, 16, -59, 38, -25, -18, 80, -64, 85, -33, 62, 28, -10, 11, -84, 89, -83, 47, 30, 43, 44, 127, -38, 103, 51, 7, -26, 7, 58, -33, -34, 43, 59, 11, 60, 49, 85, -20, -84, 38, 24, -27, 4, -31, -55, 69, 54, 18, -44, -49, 6, 78, 37, -33, 13, -36, -35, 59, -2, -58, 43, 67, -85, 87, -30, -18, 61, -88, 56]
6974E6l4o1J67p9k3rM1l0r9O2q6P4j20O7K6Q3m1MO9r2R3o4l8J04j25N6l8O3o1
7003c5N6K4j72J83j60J07m4rM7J14j02K9j1L8n9J23k17J50j32N3P8j71R6l8K9
7028b3n4R1j14J58j09K3R3l4P0j48M2Lj8O4L3r6k4mL5O0m1mK8j36J83k4P6j07
7056B3L5r0L6J07Lp5N2j59J3K11j46Q5j25P9j4O5j99J45o8kL6M2p0l1L6j30R3
7083d8J20J4j41K8l5L2P4L3p8Lp0M1R9j27J08j28Q5J1l2N2p7j33J32oK7O3r9M0
7111a2K6m0Q9r5J5L7Kq5J02j20O3K0j30P0Q8Om2m8J56j53J82j26j11P1R6j91N2
7138g8P1K2J6j19M3J31j34P6l2L6K7r1M7N5j41M0J25n3r7P9pP3oj29l4J48L7j33
7166b8n3R0r7J82l0n3P0p1M6k9k3p7J9N4p5J23r7j1L7J7K2P0j37n7K34k05M7o5
$$ y = [56, 22, -39, 128, 49, 26, 17, 58, 28, -71, -9, -95, -21, -141, -74, -48, 35, -6, -2, 67, -25, 68, 4, -34, 70, -55, 1, -37, 26, -35, 21, 45, -127, 56, -104, 3, -41, -50, -3, 111, 9, 38, 27, 65, 6, 129, -88, 62, -70, -17, 61, -110, -14, -52, -23, -77, 14, -100, 58, -51, -28, 65, 31, 101, -47, -5, -2, -20, 44, 77, -19, -43, -47, -12, 48, 7, 3, 31, -105, 78, 54, 130, 23, 58, -32, 4, 111, 114, 39, 91, -68, -55, 156, 10, 95, -30, 49, 35, 100, -99, 46, -22, -24, 12, 54, -16, -47, -11, -141, -48, 72, 86, -55, -27, -62, -30, 44, 77, -1, 2, -68, -27, 72, -55, 53, -75, 10, 21, -11, 41, -36, -169, -37, -43, -16, 47, -52, -12, 14, -26, 63, -32, -17, 20, 22, -63, 39, -81, -18, 2, -128, -58, 30, 36, -6, -54, 102, -51, 131, 5, -106, -35, 61, -130, -78, -7, 15, 31, -88, -45, 86, -48, 28, -4, 32, 59, -32, 15, 70, -71, -31, 94, 41, -56, 23, 16, 89, 83, -46, -80, 68, 105, -28, -81, 9, -88, 94, 64, 11, 81, 10, 56, 27, 4, -73, -54, 0, -75, 48, -49, -60, -23, -6, 16, 86, -51, -108, 126, -79, -32, -97]
7194i7j3N8P9m1K0Qo5M1k3oJ6n5J25%j20J26q6nK6K7j3P7q3M3j28Q4P6jo7M7J6
7225F6o6j7k4n7l7K4J91j1K1o7r7K2R8Jj86J51k3rl5M0j58J57j5R4r2M8r3J10
7253C6n8R4q2RK5q2Rm4K4Q5mL7p5O6n6K7j30q7J28M9oL1PP9r8K2N2N3j0n0OK6
7285H3M7j2k01J88j38j08K83n1m2n4M2j19P5L9N0j07J21o0m4n7J16Oj23nR8N3
7311H0q6M7N4j03l6J08q2Q7j41Q5oo6N6J39j47q9K58j48J4m5J00k8j17J10K7l1
7337D0j46K9R7j0K3p7M4N4Kj9OK2j44Q3j10J58J4j45J68k05J05O4o7L7j44O5J3
7364d3M6n7P6P4n0r2m3J19q5M1j07J85l7j7L3m8Q7j90K4O4J07k08J90K5j26m8
7390h0rJ13j60J64q3QK2P8j21pJ95l3j9Oj49J32l3R3j22L8m9p2N1R7m1%j9J28
$$ y = [-97, -110, -52, 27, -14, 6, 14, -51, -10, -33, -39, -23, -78, 47, 47, -73, 53, -33, -38, -12, 15, 2, 79, -4, 39, -89, -5, 71, 70, 3, 50, 66, 0, -17, -41, -98, -135, -111, 80, 69, 90, 23, -74, -52, 46, 47, -139, 12, -11, -20, -55, -15, -173, -16, -31, 63, -29, 19, -74, 36, -22, 72, -10, -1, 24, -58, -49, -93, -69, 16, 12, 49, -26, 40, -16, 11, -119, -206, -78, -29, -35, -4, 3, 82, -16, 6, 58, 111, 101, 51, 57, 83, 130, 118, -83, 105, -33, -141, 142, 91, 49, -5, 37, -82, -7, 32, 82, -25, 96, 36, -8, -65, 51, 57, -66, -71, 27, 80, -6, 41, 95, -8, -44, 64, -18, 69, -72, 13, 7, -59, -3, 136, -11, -100, 158, 10, 24, -21, 79, 51, -66, 44, 71, 40, -106, -77, 20, 10, 33, -44, 0, 54, 56, 37, 43, 65, -79, 4, -106, 52, 66, -79, 89, -116, -11, 53, -14, 23, -121, -56, -43, 3, -54, 22, 96, 46, -46, -89, 30, -55, -14, -121, 64, 27, 10, 43, -5, 82, -108, -84, -20, 87, -121, 69, 94, -32, -80, -89, 24, -136, 28, -55, -47, -25, 53, -68, -75, 120, 87, 68, 74, -75, 57, 24, 117, -5, 33, -16, -88, -37, 60, 19, 19, 0, 128]
7418A28j30L4k5j5J04j76J2n0Q6J05j47J6J72j10Pj18J17O3j18k3R9k8k5K2N3
7443E3q6q4J52r7N1k6K5j12L44k46N5M8j04J00m8M6l2K6k2j4n5rM1n8O9K8m2P8
7471H1n1L0j10PP8j17Q5r8O7R9q4j1P7K0k3p7K7N2K0j13J3j7jK8R6r7Rn8N1r6
7501a13Q6j02R0Q8O4J1j77m5M39n05j06L89k39J32j12N1Q5j22P5pR7r4M8jKJ28
7527A62k22K6L6%K5j5rO7j69J14Nq4N5r0P2J14j6r2j2%m1M8J41j30J4P7j05k2
7555e1J21r8O3p9J04M8j52J54j02K2P4r9l2l9M8N9pp5j4J15n7j7Q3p0J01q0K0
7582D0J8j42R5p9J9J13m6N1K2o6pM9or9o3P4O2rk5J07o7l1l4J7L5L0n7l1M2oJ9
7613B5q3J01j09P5J01k1j26j8J08j51K07l9k16J01J01mj00J20J4n0n4r6J09J5
$$ y = [128, -2, 32, 7, -8, 96, -80, -68, -118, -32, 73, -74, -58, 114, 4, 11, -107, 10, 73, -45, -68, 31, 3, -22, 0, 53, -33, -117, 35, -62, -11, -37, -12, -124, 220, -26, 29, 77, -27, 73, 25, 71, 39, 65, 43, 29, -26, -35, 6, -52, 17, 45, 3, 81, 30, 60, -50, -43, 35, -82, 3, -95, -28, 71, -13, -24, 53, 73, 50, -27, 0, 52, 72, -41, -28, -45, -46, -18, 78, -19, -10, -68, -17, -113, -27, -129, -39, 49, 113, 124, -53, -98, 341, -164, -270, 119, -120, 12, -100, -49, 36, -86, -11, -18, 79, -15, 33, 32, 34, 162, -60, -34, 2, 2, 27, 12, 3, 70, -99, 15, 20, -64, -9, -99, -27, 87, 71, -21, -33, -33, -74, -26, 115, -15, -1, 76, -29, -51, 70, -28, 35, -44, 60, 108, -44, 110, 8, 30, 104, 5, -27, -66, -18, 41, 34, -41, -55, 60, 3, -14, 69, -1, 100, 20, 40, 58, -84, 11, -68, -49, 64, 18, 69, 91, 25, 18, 67, 61, -38, -101, -27, 35, 26, 1, 108, 41, 10, -24, -7, 28, 58, 1, -30, 12, 6, 25, -58, 43, -66, 9, 110, 89, -37, -55, 53, -98, 109, 70, -146, -45, 56, 52, -48, 72, 86, 36, -18, -114, -5, 10]
7637A0l8N2m2r2J40L1n8N%m4J45l7j00P9j30J58lp8K5k2m3R3j76J26K1m2ql8J45
7666G9j24J43j86J06L2q4P0j13Q4j0j44K00j35J73j80Q5j38K37k78k5K6L83j87
7689A4K2L00j46K89o54p0L73O8l09L83m19M5k05M57pJ4p6j31O8n6R4q5Q0j78K95
7714A66k16J29m5Qj68J97j59J34l07O22n35J06J43l9K33m51K02m2J20j96J23j87
7736a62J45Q6m1K9q6M7N2j46J92k16j6J21NK0k2M1j45O3P6L0j01l1J23j00J08
7761G2n5M3j15J46j37o5K50q4o2O5r8R5nQ1j25K5j41P7n4k4J02pm5J2J36j30J12
7788F9j9mm5o4K1R0r1L2r4J70j4j59J98j74mj2J27R9j41L2lo1PN4j5p9O1L2Ql9
7818a8J7o9J14k7J04j81J07o7P0nj1n9N9J8M7j25J07p5L5j01N4Mj1l1J49j43m8
$$ y = [10, -28, 24, -18, -110, 30, 61, 3, 8, 8, -36, 109, 72, -28, 51, -79, 79, 76, -2, 23, 1, -42, 51, -125, 1, 22, -20, -28, -66, 79, -45, 98, -88, 18, 50, -34, 36, -77, 7, -3, -147, 53, -82, 91, -89, -4, -142, 95, -183, -208, -182, 201, 14, 36, 336, 190, 479, -175, -245, 128, 196, -113, 270, -149, -104, -309, 148, 141, 155, 79, -52, 16, -40, 54, -31, 49, -129, 166, -50, 79, 34, 42, -126, 71, -88, 46, -261, 361, -174, -68, 75, 36, 269, -182, 20, -22, 98, -98, 25, -162, -17, 69, 28, 57, -29, 18, 70, -76, 116, -100, -116, 5, 10, 30, 8, 49, -96, -33, 43, 73, -28, -59, 64, -36, 72, 17, 60, -55, 91, -46, -111, 139, 55, -7, 58, -40, 55, 50, 131, 6, 31, -110, -33, -87, -111, -9, -16, -61, -49, 87, -43, 69, 50, 46, 1, -63, -42, 48, -43, -11, -105, 65, 51, -108, 90, -84, -88, -100, 27, 126, -15, 17, 14, -47, -40, 14, -1, -80, -19, 13, 21, -18, -1, -70, 44, 17, 121, -60, 47, -20, 50, 45, 34, -25, 34, 52, 99, -26, 81, 6, 41, -60, -6, -2, -13, -44, 105, -38, -86]
7845h6J06Mo9Jj3n5M0Q5M9j34Q5j21J46J37m01K78p8K1r7K78n7k63J23J66j81
7870c6L8K07k37p2J36K6k03K36L84p36M67q5J50q1j29J09l64O14l24Rj67L18j08
7893A52r1k57k21J222r69k66P56n28M26K6J38k35m64M6O11k52J17K7N91j005P84
7914F08n86k00N60m40J46J72o08J72L29m73K20n5L24k19J42k23J0J67mj65K57
7935A34k49K19n7j21N8P4j55J74j42M7O5r3JJ54j22QJ7k8NR0j2j3L5m1o2m5O4
7962EN6J7l4M6j7q3m7P6p6J06j5o3O2p8L4Ko0J03r1J53p7jJ1j72J48j0k4N3J0
7991C4o9R7n7J7J1k9K4N2j27J19j14%O9LJ32j13lj35Q3k9k2JN9j42J68J9o8p6
8019i6J56j90J36rKM4p5o8J61j45J5K2K0j2R4k0l4K17k11l4j9J9l6O3l0o0M0J7
$$ y = [-86, 20, 24, -45, -44, -57, -112, -72, 13, 62, -72, 13, -108, 38, 175, -226, 52, -26, -5, -102, 176, 119, -144, -21, 145, -36, 2, 209, -28, -100, 36, 62, -141, 95, 479, -257, 210, 125, 275, 194, 65, 174, -190, 424, 100, 109, -58, 260, 152, 61, -196, -417, 805, -164, -430, 326, -202, 224, 250, 388, 153, -311, -265, 346, 94, 211, 238, 829, -176, 608, 22, -178, 382, -58, 88, 260, -348, -176, 153, -320, -100, -155, 169, -50, 92, -131, -121, 46, 42, -123, 134, -115, 104, 47, -74, -16, 58, -97, 77, -65, -18, 47, -46, -45, 109, -13, -5, 12, -16, -11, 79, 67, 54, 89, 48, -14, -59, 5, 61, 78, 44, 90, 73, -10, -57, 19, -57, 49, 34, -29, 33, -45, -11, -9, -69, 34, -57, 96, 19, 18, 29, -143, 5, -5, -29, 24, 34, -35, 62, 5, 22, 33, 4, 28, 80, -47, 72, -42, -42, 27, 30, 162, 49, 46, -89, -6, -35, -57, -56, 3, -139, 29, 48, -20, -96, 60, -130, 6, -3, -1, 43, -32, -100, 61, -84, -69, -47, -27, -39, 55, 35, 1, 218, 7, -27, -46, -27, -63, 0, -30, -90, -50, -33]
8047c3n2J07n9N6q4O2L4j44j6J27j2q4K3K4N2O3KJ5p7M4nj00K0lN1q0KJ38Mn5
8077B0Mj8K8j41M5O3k0P2l9k4L2J8k5Qj37J08Q5k6r6K5Km5P7j7o5J15j03m8Q5
8106a7J8k7nQ8j41J39j32N9M2k1J6r8R4K6on8J44j02m9o0L4pO3P1j37M6O1o6k3
8135d8R5n0R3j34R0j12L5N0Ko8N8N1n9R3p4q3J59K0k13K24q2m3nk8R6r9L9p6M2
8164b7N1O5q3Kl9Kj36l9K58q2M4o7R0J9m2q2O1j0Rn5J39r3J4j2j6L8R4
$$ y = [-33, -85, 22, -37, 19, -65, -3, 31, -113, -129, -2, -14, -98, -75, -51, 1, 64, 66, 81, 4, 48, 43, -57, -37, -40, 11, -69, -67, 71, 75, 20, 24, 6, 34, -107, -62, 1, -19, 53, 14, -10, 22, 40, 15, 23, -114, -6, 79, 53, -43, -18, -16, -61, 16, -1, -66, 49, -54, -102, -17, 1, -26, -31, 57, -84, 55, -77, -18, 24, 3, 19, -79, 15, 41, 35, -23, 121, 19, -30, -90, -56, -63, 0, 71, -66, -20, 41, -25, -48, 47, -3, 90, -44, 46, -66, -31, 19, 21, -47, 11, 62, 3, 96, 22, -61, 98, 118, -95, 129, 47, 4, -1, -29, 67, -32, 7, -69, -27, 24, 89, 6, 8, -31, -29, -165, -204, 54, -28, 16, -51, 39, 58, 16, -66, -5, -15, -6, -61, 78, -15, -1, -13, -29, 9, 103]
8191A03
$$ Imaginary data points
##PAGE= N=2
##DATA TABLE= (X++(I..I)), XYDATA
0@%%%%%%%%%%%%%%%%%qJ6j6J6j6J6k4L2l2M0m8N4o2P2q0Q8j04J18j32J48j65J83
39I6k02K25k50K76l06L39l75M13m54N01n51O06o68P36q13Q98r94J104j229J375
59G27j548J755k008K328k747L315m138N447p832J3538n3045l8338J19541L3475
73G0470p1643n0144L4605L4143l936n346M248l0163j3222L8529L3460k9626m9049
86c7674J0179M7763N322l3583p367J2761J704K603R171J249k3156n951L0092J1954
100B5067k7741j1632J9608M381j3600L88J6594j1409k6776J9618L1807k0514l7520
113c1729J5950M0242p624m1021L671M0303l672l0584L300K3352l582j9663Q123
126b934J8081j5511k0003K2292J9882k2407k3564J6322L0129j0492k9753M818
$$ y = [0, 0, 0, 0, 0, 0, 0, 0, 0, 0, 0, 0, 0, 0, 0, 0, 0, 0, -8, 8, -8, 8, -8, 8, -16, 16, -16, 24, -24, 30, -32, 40, -40, 48, -56, 62, -70, 78, -87, 96, -106, 119, -131, 145, -161, 178, -197, 216, -238, 263, -288, 318, -350, 386, -427, 471, -523, 581, -648, 727, -821, 934, -1074, 1254, -1493, 1822, -2316, 3131, -4701, 8837, -44208, -82546, 36995, 70470, -1173, -51317, -16712, 17431, 13495, 8149, 12397, -17766, -30988, 7541, 41001, 11375, -37674, -27495, 20268, 25590, -7993, -15360, -2599, -895, 1708, 10879, 12128, -11028, -16979, 13113, 25067, -2674, -14306, 5302, 9683, -3917, -3529, 13065, 1656, -25120, -5502, 26305, 5791, -31729, -15779, 24463, 16839, -24182, -20511, 19792, 16120, -14464, -11164, 12188, 8606, -11057, -2934, 15147, -364, -20367, 1925, 21807, -600, -24164, -7842, 22287, 11795, -17958, -13140]
138a3140K3389J231j0580k998j07O91M693J0424p587k1684O861K4258l062k3219
152a0830j897J7635K327j5805L028J5809j1967j5512J5199J9062j1505k2448O819
165a0085K2914l133j6789M117P123o834k339J1597N773j8944j3198K1958J8935
178B1095j7867k1082Q750J9559r6j4975L47P005m427J350R296l581j2385K90J3738
193G017L282j4537l792J2240p56q890K494P179k913r446K518J1569k665r994L804
208b890N494k986j597M464L505r159n271J3686P113j4071r240J0019J0953n567
222D453j2195L365Q623l547k895L535j033l419J816O540n0j0033M25J2170j452
237F303j0131j68P782J571q364k346Q256n15p925K735M561j852m428J455O049
$$ y = [-13140, 10249, 11480, 900, -2098, -2205, -1514, 3179, 13603, 6016, -15668, -8807, 15451, 12389, -10830, -12727, 4908, 7235, -8570, -5542, 10267, -1700, -17212, -2013, 17049, 5544, -16904, -10085, 12829, 9696, -7093, -2976, 4147, -2687, -5026, 6571, 12344, -6600, -19798, 2160, 21095, 3228, -17854, -9104, 10455, 10359, -4616, -4269, 2736, -1691, -341, 8955, 5374, -7011, -6721, 7017, 10299, -4238, -8030, 4210, 3454, -5436, -2942, 4237, 1324, -8122, -5604, 5965, 3300, -6694, -2890, 2604, -382, -1979, 2485, 5990, -3169, -8440, 5246, 12359, -1712, -10952, -933, 10020, 4453, -7742, -4377, 4246, 699, -2196, 1339, 306, -3113, -1297, 5243, 5193, -4840, -4415, 7755, 6303, -3828, -3996, 3786, 5357, -3007, -5353, 2903, 2388, -5537, -2802, 1759, -93, -4521, -3066, 2983]
252B983j474n509M437M160m681j937M054K210l622m785N399M829p327l797M763
267b97L158k901l926J634M321k845j214M497j496k966K519L880m29n808m23P161
283D865o81o734L89K712J20j907j700K038j69k782L429K237m444l32L521K564
299C126j728l986L264M416m417k172K977O35j520k689J337K431l206k059L895
314C04l12k141J060J402Q36j585o45M465q83m143K151K415l98k494k027K782P86
331A573l387o42J955j384p76J219K63Q19j977J904K929k693n10K237J18j77j124
348C47j97K224k078j700K045n68q75L9o56J255m49j157K286j82j580J918N26l99
366G99k4p50J581L61k595J328P72k321J52J28P7N29k146J45J910j000M77N48j175
$$ y = [2983, 1509, -4000, 437, 4597, -84, -2021, 2033, 4243, 621, -4164, 1235, 6064, -1263, -5060, -297, 2861, -40, -3966, -2332, 1989, -856, -2070, 2427, 931, -2035, 484, 4364, 3935, -1873, -2296, 4865, 4184, -2550, -2161, 551, 671, -1236, -2936, -898, -1067, -3849, -420, 1817, -2627, -2959, 562, 3126, 1398, -2588, 676, 5092, 675, -1497, 1480, 2115, 595, -2094, -757, 1674, -1532, -3591, 304, -8, -2149, -1089, 313, 1149, -436, -1081, 3384, 2501, -1642, 509, 2924, 2526, 32, -1995, 787, 1573, -1814, -2456, -501, -1885, -2661, -1442, -1179, -360, -2337, -433, 2496, -197, -707, 1530, 1648, 1471, 347, 150, 2374, 296, -1404, 641, 73, -802, -763, -1419, -164, -613, -1770, 516, 334, -1246, 672, 1198, 799, 775, 25, 1606, 1967, -628, 700, 1472, -849, -697, -569, -492, 37, -2109, -1964, -54, -1054, -577, -29, -1204]
385a204R45M83L21J404k066j269K952N62j071j268j392K247R33j872p7j053o26
402b051K966K52k053p96Q9K817J028k729n5Q77L2J443n62j382K26p55R97J455
420A799k186j182L69L89J771j314k025J707N16l78Q32n63N58K38j331J797J141
437B138j843j68M4K13J168j726o74J298q75n50M01N1J641j663k616K646K911r73
455A423k373j348L036K672k261j314p8o07J837R16j221j285k272O95M004K13l292
472a255l324J008O540J261o236j905L489L605L31l664j069J447L10J645m9l031
488h97j105N89J662K425k724m278J495M103K050l582m263L558M661j927j999j61
504c93R56J430j180m46P39j818n74J069M06k9k075j391L339J702l502j177K165
$$ y = [-1204, -259, 224, 545, 1949, -117, -1386, 1566, 2128, 1057, -211, -1603, 644, 1577, -295, -372, -1425, -2051, 915, 1167, -886, -1682, -1593, 1224, 2252, -477, -532, 345, 377, 1820, 1258, -124, 102, -653, 344, 1799, -387, -1569, -1200, -811, 960, -354, -2379, -672, -156, -534, 298, -265, 293, 531, -800, 997, 2138, 295, 127, 171, 384, 1552, -174, -848, 450, -425, -975, -574, -523, 1118, -545, -3161, -515, 2396, 1423, -950, -2298, 738, 3410, 1149, -165, -243, -850, 987, 1903, 682, -603, -2875, -2180, 1824, 2037, -1255, -4579, -3571, 2969, 4230, -2006, -3911, -422, 3183, 3514, -150, -1219, 228, 538, 2183, 2134, -897, -2002, -1413, 249, 2674, -50, -4328, -2833, 1270, 3320, -262, -4525, -967, 3694, 1767, -232, -393, 563, 1993, 813, 367, 1106, -712, -1286, -217, 189, 160, -1915, -3306, 33, 1735, -1767, -2944, -779]
521g79L290k4n195J969M344j233k797j286K228K271k037k716J127J46N84Q0j360
538a388M28k78j082L341J840l078k691J391N456J415o513k878M531L480p76m710
554a512k642L568K343j540j253j158M11Q88L33K638n16n006Q09N777J559l782
570I17m363K562M880j405l275o06P6J517L31j370J18q20j066K272J552l56k256
587a292j479L679L228l239k687J152K389J004k568k158J978P36n15j004j134J687
603b23N51k074Q16J497r85l06N87J521L6k914J136L621j735k834K77K125J483
620B579k798k422K248J244o25p91j283J000J395q07K64K67j044P07P91M16j00
637A041j825J98J899m27j151m0j142J427J138j434q6r09Q09J845j627q49J252
$$ y = [-779, 2511, 2487, -2708, -739, 3605, 2372, -425, -1711, 517, 2788, 751, -1965, -838, -692, -108, -28, -1388, -960, -1238, -2320, 1021, 2861, -217, -2908, -1517, 3939, 5354, -1159, -4037, 494, 3974, 3198, -1512, -4154, -586, 1757, 217, -1036, -2194, -1783, -895, -562, 2076, 1560, -3446, -2637, 3140, 4699, 917, -3446, -884, 3996, 2591, -684, -1290, -1214, 303, 634, -736, -618, -1438, -2504, -232, 1320, 964, -1292, -2771, 908, 4136, 897, -1790, -638, 1751, 2755, 187, -1971, 7, 743, 228, -776, -1910, -223, 328, -1746, -930, 567, -418, -724, -137, 1384, 1420, -1494, -358, 3263, 1528, -1306, -1029, 1096, 2579, -219, -2641, -393, 851, 226, -565, -1848, -848, 547, -260, 4, 271, -773, -66, 725, 1141, 1041, -784, -586, 1313, 886, -265, -305, -1447, -20, 1118, -316, -402, -1311, -502, 1343, -284, -1133, 119]
654A19o17N99J050n62m82p87R33K330j859k176J036R44M18q66j578Q79Q98q74
672e95L86l92j15O44j89L05P84j240L84J224q99r8J45QL96j008j22J064j030l25
692f73P19o39j28N01k31K80p64K46J816p49j041R44M49K25l50q28Q79L02j297
711c39N20k15m33L13o41L36K64r65O72Q08r13K46O43P6M63q24K46J282j089m45
731EO85m43k21j56o48Q01n05p83J048l95l57Q94k23J12L83k96J141j8j150Q91
751G65K73m46P4p52L7M21r55N4L20r61N14L92m18L46n27O68J308j087q9R85j89
772G33K07l48n98Q43n38p04O78n99q26O83j07J26k13n10J160M04r61O54N29k03
792D10M66o37M27L96r04J62M00r89J87k60l31M54n36j48R94p56j22J034l13L56
$$ y = [119, -498, 101, 1151, 589, 107, -680, 253, 2583, 724, -1452, -416, 528, 946, 80, -1498, -619, 279, -595, -209, -601, -716, -72, -261, 44, 828, -412, -28, 1196, 297, 199, 344, 352, 748, -260, -382, 682, -348, -673, 46, -593, -721, -220, -451, -171, -935, -689, 1127, 378, -663, 281, 730, 955, 605, -223, 656, 958, -339, 181, -34, -467, -154, -795, -459, -195, -1160, -488, 320, -593, -347, 296, 372, 835, 11, 257, 1539, 450, 5, 690, 247, 26, -130, -778, 23, -482, -1265, -217, -612, -969, -75, -298, -186, 197, -99, 1042, 1024, -126, 765, 1038, 592, 666, -86, -49, 372, -583, -529, -209, -1170, -656, -264, -682, -336, -863, -195, 1113, 26, -63, 922, 733, 940, 592, -6, 837, 299, -405, 273, -326, -1152, -469, -576, -450, -663, -1173, -13, 391, -570, 84, 613, 410, 876, 239, 666, 1062, 158, 320, 720, -269, -82, -342, -673, -219, -755, -903, 91, -665, -787, 247, -66, 290]
812B90R7k44R00k56o39P64l44o04N67o82k4O3p54N56J40r84Q20N5l61N86j14L73
834B05N53q77L80Q37p78Q3J5l93N14o27l77O80p55j93P17m13R0J7l16R52j91n71
856d48J088r8m81N05k87J80J87r08O33J02r22M41Kn67K79k47L02K90r50N12P97
877D10m32J16p0j02Q15k08m48L76n08O1P07o30k76o3l26Q64k14r40P29k04k89
898f32Q70j89j26k52o5J349J9j509N05P32k99Nm61J50J11p47M95O07j134k42M34
919c79K75O04r47m16J342p2l17K20l90N59K6n74O35j55p07N73k20n15L26j05j70
940d07j4l82Q17P9r23Q86L13o09L20L32M76m18j167J183J134j464j009N20P20
959C87K24j355l78J199l88l89O45P7M9n94P3J733k00j705M70Q96L82n00j206M30
$$ y = [290, 387, 143, 1043, 787, 148, 912, 568, -36, 531, -151, -175, -112, -866, -310, -170, -1154, -334, -279, -640, -54, -168, 205, 758, -119, 261, 1098, 320, 403, 418, 25, 539, -88, -465, 215, -540, -733, -16, -429, -339, -322, -638, 314, 123, -448, 640, 542, 61, 566, 279, 459, 646, -262, 371, 473, -449, -8, -6, -573, -294, -541, -239, 51, -899, -387, 410, -22, 94, 24, -78, 737, 529, 81, 457, -51, 10, 717, 87, -189, -252, -578, 286, 72, -868, -139, -343, -632, 238, 49, -77, -329, -394, 955, 974, -535, -30, 702, 403, 408, -53, 97, 208, -539, -44, 563, -571, -813, -379, -104, 500, -447, -863, 479, 407, 90, 310, -80, 479, 505, -69, 566, 411, -296, 277, 57, -458, -132, -237, -407, -421, -803, 14, 93, -830, 56, 369, -240, 80, 412, 888, 470, -697, 486, 1620, 156, -853, -333, 387, 611, -744, -1122, 77, -311, -700, -55, 22, 71, -523, -450, 1283, 1083, -622, -152, 744, 1126, 626, -580, -150]
979a50N95o30K61j80j034O75M76l08J50m06M73K72n20J005L49j571L87J393L5
998A272j066j086R35J308j518j118R83L46l20o83J00J438o13j079J163R35p10
1015B87n45J79J599k69k121Q51J262r53q48k2N75K22j040L3P25o03K70P93q15
1034d20J01O36K04P9n62L30O75j081k6J205p95r50m9O04P44j168j173J558O74
1053E86p51n45K03J176k15j174J104J012j596l52J293N38r82j583J162J369j559
1070c14q34J006o4j87q3K65L61n91J16J096m09o13O67L2K6k55l39N88m09o39Q79
1091B99q9p05p8J82O41m57q85J131P90j276j08Q85M16m34q40Q15R58j387m30J301
1111G29j00r30l88Q26L90j080m99J486j84q82L67M29R0m33J6Q89k25r12P38L27
$$ y = [-150, 445, -185, 76, -104, -1138, -463, 13, -295, -145, -551, -78, 194, -326, 679, 1028, -543, -156, 1237, 1272, 206, -880, 55, 1363, -155, -1273, -290, 56, -264, -947, -847, 591, -22, -1101, 62, 997, 287, -258, -79, 1520, 1251, -870, -19, 1243, 290, -558, -580, -5, 217, -823, -790, -65, -668, -398, 395, -420, -319, 317, 521, 600, 38, 368, 1043, -38, -64, 1141, 346, -604, -653, -49, 695, -473, -1646, -88, 586, -165, -710, -507, 669, 454, -720, 384, 1396, -200, -552, 741, 1279, 297, -1286, -124, 1245, -314, -1148, -142, -206, -393, -476, -211, 150, -441, -325, 771, 362, -251, 416, 448, 474, 219, -120, 468, 59, -580, 299, 210, -495, -573, -391, 250, -207, -1092, 39, 829, -447, -555, 330, 746, 312, -528, 287, 1245, -142, -572, 729, 629, -301, -689, 137, 527, -553, -1052, 434, 250, -632, -265, 164, 254, -179, -163, 726, 501, -411, 327, 654]
1131F54m80j14k35N03J01j053M39N19p65j15M31K69j76p50O77R73j084k88R09
1150D15K78n86l08M96M26r98k15J138j73j090L63M49l0o75k41J039j53r66P43
1169h8M82k11k53M0P07j04r13M07P72p67k68J30L09n5r46L14R30r69k49P67J33
1190A68k34l06K42Q67o16m09R48m7o40K52J51Q3m93m58Q61k49j017N89L37j58
1210a29k95j54Q33L1q32O06O40m98j73K38L65j6p53J01N94p25l53M72l8k34l58
1231f78J22Q32n90m20J076J12m71J39R9M39l88l51O60p7p27K57K08j76m90j85
1251f09N58J24p98L61N75l27k4K24J86K04m78m5Q99n71l82M64o1l46k58l7O54
1272C13m36o81P29Mk38J41o3M71j98m26Q19K45p93K35K10Rk79k26J13L43p48J37
$$ y = [654, 174, 60, -175, 328, 429, -624, -185, 334, -431, -546, -115, 154, -22, -772, -95, 878, -206, -494, 415, 693, 107, -201, 295, 721, -277, -492, 646, 473, -617, -254, 195, 165, -510, -751, 288, 135, -831, -88, 394, 183, -70, -30, 677, 573, -340, 67, 839, 72, -196, -66, 243, 188, -758, -444, 486, -483, -732, 35, 168, -66, -372, -130, 737, 121, -288, 660, 613, -27, 225, 376, 459, -34, -492, 369, 120, -897, -308, 29, -129, -424, -578, 255, 286, -546, 60, 700, 202, 29, 267, 632, 616, -137, -36, 558, -167, -520, -48, -86, -320, -678, -556, 276, -314, -734, 342, 454, -17, 122, 221, 660, 272, -79, 581, 504, -223, 34, 242, 66, -424, -609, -51, 73, -725, -364, 211, -116, -140, 84, 270, 474, -4, -49, 850, 279, -103, 361, 300, -46, -304, -341, 313, -123, -804, -75, -71, -309, -168, -231, 240, 42, -384, 435, 680, -113, 122, 332, 341, 62, -164, -51, 292, -456, -319]
1294c19M43l72k01J91J11L03n34K01P14m51p8L77k8j38o4j06M68m84m55N62j35
1315El06L8O9K22k88l25O76J29o48M74J27K8m9k22L27L08o50J82K62l96q3R4j00
1338a26K55m87J52K53j13k10L05o3J30j15o8M98j10l64L44ok93K15l40K20O4m96
1360c55L47L8l97J79J05n4rm3K16J67l62J04L24j30k3J34j20K30k65j07K28j86
1382B1k04O8J0L2q2j68L57o5l24M01J0j01J20q9K50M1l73M49n5m46O2J67j13J37
1406A05l42K23L41o37J09R4n02N51Q3n41P89j21K8j0J131j068Lr36P55o9J25p6
1428C5M80r39J76o2r1n5M06J14J54l40K3J03K92Q6m62O57j16J0m93J10R4n06O38
1451C14l70j93r2J46J86l41Q5M70j42j17J93J6K90j16l91L14Lk68m3jP1j3l30
$$ y = [-319, 124, -248, -449, -258, -147, 156, -378, -177, 537, 86, 8, 385, 357, 219, 155, 49, 517, 33, -422, 140, 5, -301, -263, -194, 28, -260, -585, 91, 220, -428, 46, 173, 201, 152, -70, 257, 565, -85, 97, 359, -37, -120, -26, -126, 129, -358, -206, 47, -66, -276, 29, -34, 96, -19, -87, 411, 301, -63, 281, 275, -18, 197, -143, 77, 141, -355, -8, 30, -367, -188, -83, -137, -146, -189, 27, 194, -168, -64, 260, 130, 107, 241, 121, 351, 86, -21, 207, 21, -183, -115, -105, -73, -155, -323, 34, -31, -355, 46, 56, -45, 75, -14, 236, 277, -96, 353, 298, -148, -86, 81, -32, 105, -237, -14, 327, -310, -201, -107, -609, -58, 25, -516, 273, 152, 180, 170, 1301, 233, 236, -700, 55, -14, 111, 35, 515, -424, -248, -310, -401, -456, -50, 64, 218, -122, -99, 4, 296, 382, -80, 577, 461, 471, -22, 88, 182, -324, 314, -56, -249, -341, -195, -9, -350, -265, 205, 63, -54, 139, 155, 445, 329, -62, 252, 255, -13, -56, -57, 14, 1, -329]
1474c29J9L05k88Q8N4j9J54J45p3J55j72J29K16l83M3L66l71r3Q7o9J09m06K5
1497c08L71k40k23J97J57P1o5o9L71J01l60K04n0Q7M5m26K14J94m88j72K90M0
1519e9j6k12J6L80k40p1K88l7j9K51k46J04N9q4J44k11j29K85l95m8K24j14p8
1542b08J12n4K34m6k71L26Q8o2J25k14J07J96l21J8K71k44j00k57K51K92n21j76
1564d54N78k39k1L1J23J26j98m5L21r8o9K91k61j82J52n3Ml4j10K59j02k67K42
1587fk6j11J26j74J68J42k12J96J34j58J9j01P0N5j98o1M15k49j85J52J0P5k92
1610b11J67J92j44j93M01j9k36mQ2J97j06k03K19Mk03M4LN8J6l15K05M9p9j18
1634a94J28kJ26r0j5J74k25N0L34j25k32J97j4L4p6j51K78l03k39L41k5j64NK8
$$ y = [-329, -310, -5, -293, -205, -151, -170, -16, 129, 56, 211, 39, 168, 384, 1, 44, 410, 39, -54, 33, -36, 73, -333, -308, 63, -177, -400, -203, -46, 25, -40, -109, 262, 363, 3, 207, 157, 244, 289, -137, 77, 271, -217, -389, -99, -59, -75, -287, -271, 109, -131, -202, 86, 49, 30, 281, 35, 139, 198, 114, 258, 47, -82, 203, -192, -240, -16, -130, -208, -96, -150, 84, 38, -233, 93, 181, 119, 244, 30, 137, 333, 12, 30, 301, 57, -43, -300, -49, 243, -278, -454, 124, -115, -136, -105, 18, 144, -54, -99, 222, 124, 55, 346, 85, -97, 55, 2, 6, -28, -138, 121, 19, -248, -6, -32, -143, -17, -191, -23, 119, -93, 103, 237, 79, 98, -3, 67, 122, -76, -137, 278, 29, -156, -4, 6, 81, -211, -44, 148, 4, -189, 212, 193, -43, -47, 35, 232, 126, -77, 142, 146, -57, -13, -10, 48, 64, -251, -46, 3, -76, -194, -66, -68, 58, -32, -47, 127, -98, -48, 286, 161, -71, 126, 112, 146, 70, -81, 197, -106, -345, -4, -29, -193, -188, -160]
1658a60K83j07l21M41j4j26J84o7O5rj01k6K28l85n8J44po8p1M2K36k05j06K65
1682E7j04M6J13o2K01k07r0L84k21k08K10p3q5Lj43J36o2k70K82J22j54N3J17
1705D5O3J00k47J75J83k02J4J8o3R2k79n1K49r3k60J91l7n1N1M1J32j0j37L15
1729B39Lk42K83k11J52j27k42K89j32k61K52jj62M8JLJ09j06O3J67j64J21RN5
1753A46m3n8nQ4p0j03N5j6j17k89O5O41r5J29o33L66o1J41k2p5J50j61K02L0k91
1778c0J44Q5k21j00Q4O3l8k52J93N5j60R0J44j27Q5J4lK04j07o8J48k09k4J39
1802A09j78O2M1j37J93j56q1J59j19j9J29L7PRj00KJ87q4jj01R8Kj00j71L64k33
1828h1J7j6r1J43O0j88J68L9j33K32j37o6N6K5O2l1j16J74O1k23R4l6NM8k51J61
$$ y = [-160, 123, 16, -305, 136, 122, -4, 180, 113, 178, 169, 68, 42, 270, -115, -173, -29, -36, -104, -175, -133, 103, -102, -208, 57, -47, -1, 112, 50, 251, 44, -46, 338, 117, -91, 119, 46, -39, -36, -179, -43, -105, -375, -93, 29, -125, -72, 45, 108, 208, -39, 136, 319, 117, 131, 149, 86, 178, -101, -152, 97, 4, -256, -65, -102, -153, -102, -61, 71, 61, -76, 239, 242, 0, 283, 72, 224, 97, -145, 144, 12, -249, 3, 2, -160, -112, -111, -108, 1, -105, -42, 125, -39, 82, 91, 146, 103, 45, 40, 124, 54, -49, 6, -10, -127, -416, -351, 290, 195, 324, -309, 57, -4, 137, 115, 40, 190, 29, 231, 261, -30, 114, 199, -22, -122, -38, 25, -13, -265, -72, -17, -177, -87, 57, -70, 15, 29, 26, 230, 123, 55, 203, -6, -30, 109, -69, -7, 34, -103, 90, -66, -147, 12, -107, -126, 3, 40, 47, 56, -44, -42, 145, 61, 60, -41, 57, 59, -41, -212, 152, -81, -64, -80, -171, -28, 32, -156, 12, 51, -82, 150, 13, -53, 3, 28, 90, 59, -57, 117, 178, -45, 49, 13, 18, 66, -185, -24]
1854b4N4k06J21Q9m3K1k4Q3m0j14J11J58j33J2Q5j48K0N1k27L20j92k82J83O4
1878f1k4P5r3L5J27o1P7J24j22Q5q4j34J41j5j28K12j25j28R6Kp9m9NlK0N9K51
1905B03k40m1J87k4K3qn7Q1j24l2J62j21p4J04k44N1J51j29O2q0oK09o0r2L29
1930B30j87J21L3k24K17q7j50K4J8j36J61j48q2J97o1j19L8J24R4l3j26K17l4
1953H7j00J96Q2k41J5p4jP2o9Q7o4k02J93m6lO7j18J5J27nJ81p7j35J03m5j25
1979h0K70j65j25J26q2o7R9o1K2k3MQ5jj11J91P9k48J78j0J7L5k09J05J64j89
2004Dm4j9q2J14j98J15P9r3J02rJO7j13J2L01k23N1R8j30p7R5k0l8M3j40M1Rj15
2032a69R2N3o5J23n0O3K9r8J17m0k2P1M1j57J62k45N6J94j89m5M2m3J21p3r1K07
$$ y = [-24, 30, -176, -55, 34, -9, 12, -12, 71, 31, -83, 28, 186, 53, 65, 150, 2, 22, 73, -154, 166, -26, -308, -125, -61, -85, -10, -103, -68, 59, -2, 75, 199, 77, 162, 78, -56, 85, 70, -58, 154, 29, -99, -3, -1, -80, -129, -124, -127, -107, -48, 203, -37, -78, 109, 85, 108, 100, 43, 124, 0, -32, 130, 9, -65, 39, -205, -154, -3, -132, -70, -150, -156, 53, -7, -99, 230, 43, 164, 197, -27, 190, 103, -47, -23, -5, -141, 20, -128, -210, -13, -74, -193, -155, -31, 63, 30, -96, 121, 87, -13, 183, 265, 24, 39, -35, -36, 36, -33, 54, -10, -212, -19, -65, -68, -1, -119, -104, 23, 18, 199, 122, -13, 90, 45, -80, 190, 25, -100, 26, -56, -123, -24, -85, -63, -86, -82, 3, 2, -109, 82, 161, -87, 91, 81, 98, 133, -76, 29, 193, 4, -40, -59, -141, -27, -225, -110, -31, -124, -22, -31, -30, 37, -76, -64, 237, 14, 65, 163, 33, -44, 51, 31, -7, 36, -104, -63, -54, -169, -77, -24, -89, 34, -16, 47, 76, -22, 95, 55, 33, 104, 145, -12, 150, -95, -39, 155, -34, -79, -37, -80, 41, -32, -123, 84]
2058H4q8j03J21M9k3o8J00J11j75r8J14J08k71K55k25L9j6O6k56N7k80M50J86
2081A37l16K06P5p5L4o3l7K17j78q7K61k62L7%RJ55k31j10K65j66L8J24p9K45
2105A99k43j18J73J44k33J73K9jk4j24J35l3j79o5L71l52K42l69L5l22N48l95
2127d09R75n68l88J186r47M10l10R5j7J30l25K66j50J46k03K2J35j17j52K84K5
2148H8j97J8R7N6Q1n2p5J45j00m9K63l26O5j38N6R7K6k30J63j41P5J19m8R6j89
2173a00J19R3m7q6J42K6q8M9j11J7Jj49Q0O3k08R3J20pk1j03J93Lp7M5J55j27
2199G5J58j93R2K7k93Q3J06q5l2O9j28J58k19J8K21p8j52K32kQ8P2j93J61l3j53
2224al5J15j81NO3M2j27r9J12J78k65J23KJ13l1K2J23p7p6NJ59m2k66L12k19j3
$$ y = [84, -4, -107, 14, 63, 40, -28, 72, 183, 8, -90, 24, 132, -139, 116, -109, -70, -86, -20, -276, -219, -499, -49, 137, -179, 27, 102, 27, 61, -2, -39, 178, 0, -87, 174, -88, -51, -51, -42, 113, -118, -228, 37, -129, -91, 33, -46, 199, -44, -162, 11, 155, -78, 95, 124, 123, 99, -25, 110, 77, -102, -167, 204, -148, 94, -275, -240, -562, -14, -409, 566, -2, -390, 796, -151, 259, -51, 44, 27, 157, -168, 98, -52, 94, -109, -87, 48, -69, -221, 63, 88, -109, -91, 6, 62, 143, 91, 16, 161, 61, 12, 275, -51, 14, -124, -68, 29, 55, -175, -12, -153, -78, 41, -7, 89, -100, 19, 112, 65, -21, 121, 147, 59, 108, -3, 14, 15, -134, -54, 9, -199, -106, 14, 7, -14, -117, 76, 79, 2, 47, 202, 75, 233, 40, 132, 159, -134, -51, 55, -30, -62, 7, -121, 37, -182, -164, 57, -21, -173, 59, 57, 145, 217, 24, 185, 152, -1, -36, 79, -102, -97, -34, 8, -119, -218, -106, 72, -193, -70, -68, 45, 14, 36, 159, 82, 6, 11, 170, 128, -138, 174, -45, -58]
2250e8O0j31R9J5m0qP1j24O9l4J01L1r3J79O6j72J39j68J35K3j90j8J17k30J41
2275b0n5qP2r1n3K11j48JK28j75P0Q5p0O9n6p4L9n5O9m3M6j24N7o4J13nj71R7
2303e5P7j42K25p2l1Q6j26j6K33k25M0J1J7K0j10M8N6p4n5rl7j9K26m2K74m57
2329a57K49J80l68J9L63k73K6L57l71K05k50q7J05L75l01L02r06n29R40q13J239
2350C05n61K98L93L25q79k30k25P59l91L04j90Q3P36m44j89l6m57qQ2L49J4o65
2372f27O67O76p35j37K65l14L5m74J452k58m27N57q53j19k27O29k78J58K43q36
2392f03J318o43q51J542l94K00qr24J12L70m4l08K82n74K17M14m81M51M95m34
2412A37o13m71J288l72mL98m28J86R0k05m10R68L9j82k57j17j36r3J80k84L31
$$ y = [-58, 2, -129, -30, -15, -55, -63, 8, -116, -47, -81, 20, 51, -42, 137, 203, 31, 170, 2, 137, 160, -30, -48, 69, -161, -20, -75, -83, -11, -102, -155, 56, -92, -91, 137, -38, 32, 117, 47, 116, 60, -14, 25, -30, 39, -4, 42, -82, -25, -89, 24, 19, -152, -55, 22, -120, 105, 33, 2, 88, -38, -54, 179, -46, -6, 5, 22, 42, -68, -20, 36, -38, -93, -102, -139, -158, 68, 26, 300, -157, 92, 272, -96, -77, 286, 13, 39, 396, 25, 230, -20, -107, -2, 373, 72, 374, -532, -1061, -121, -934, 305, -256, 42, 435, 760, -119, -349, -574, 185, -206, 98, -92, -9, 727, 283, 94, 58, -399, -407, -325, 24, 38, -627, 40, 716, -19, -156, 109, -205, -170, -644, 808, 550, 123, 680, -173, -292, -519, 110, -168, -10, 233, -603, 715, 72, -779, 763, 369, 569, 561, -363, -251, 119, 75, -233, 49, -525, -308, 106, -375, 76, 571, 137, -476, -947, 341, -31, -35, 363, -65, 121, 211, 6, -404, 564, 603, 421, 164, 47, -89, -182, -2, -286, 45]
2433D5j92N4K6O1j7L21R0j31j1k01K04m52j05N90j28p2j20l8j06K49j63J11j94
2456a79J10r3P3J29k6J17j58M1R8o2m6J27p9M9n4j47J93q6l9mK5j25J84p8Ll0
2482e7J2J01J30k14J37q3k9K01k63L3P8k0N2o9r9Q3prP1p5K0J07j70O8O7m0L6
2509F1j1q0J08k9q8J64m9q2j5j8Q0j15k1M2M7J0l6o8nJ45M7q6PM2O7o6n0O8j61
2538i2J98Q8j38j21J80j57p4J57k5q7J35j65K34n1l4N0q2Nj9Q2k8Kr5L3J15k00
2564h9J75j33j04J92J5j96J81j13J20R7n1l8K3J5L5j02m7L1l8k7J06j21j5M4j16
2589a56J08Q0l7J5O0j44Mo5K41l8r7L8Q5p7P6m7j53J5k9J65j2l8p1K5m3l8J59
2616B6l3O8l9J15L2j92JJ35q3K1Q9l95K57m00K70k01PJ32R0J20j20J22j51J60
$$ y = [45, -147, -93, -67, -6, -23, 298, 388, 257, 246, 45, 249, -203, -308, 282, 154, 82, -38, -76, -182, 67, -96, 15, -179, -69, -162, -89, 40, 14, 131, -27, 14, 112, 50, 4, 131, 52, 101, 47, -100, 93, 7, -32, -36, -11, -136, 48, -30, -27, -57, -45, 56, 186, -28, 109, 26, -3, 198, -65, -32, 46, 26, 78, 9, -90, -7, -14, -23, 48, -27, -7, 100, -70, -2, 65, 25, 61, 50, -30, 78, 49, -39, 125, 76, -6, -21, -39, 41, -74, -95, -53, -6, 4, -32, -100, -105, 40, 87, 1, 8, 50, 117, 51, 1, 69, -92, 106, 194, 56, -65, 115, -42, -116, 41, 16, -71, 64, -101, 133, 82, 48, 98, 16, 21, 2, 84, 56, 58, -37, -4, 111, -89, 86, -47, -151, 41, 56, -140, 41, -72, 48, 145, 94, 56, 79, 94, 129, 27, -20, 11, -27, -54, 52, -69, -84, -40, -156, -48, 32, -5, 10, 70, -74, -70, -135, 106, 68, -29, 9, 94, 17, 93, 46, -107, -92, -121, 44, 32, -6, -77, -52, -95, -133, 26, -7, 61, 22, 137, 169, -23, -22, 113, 30, 51, 140, -255, 2, -398, -128, -329, -322, -190, -100, 20, -100, 22, -129, 31]
2640C1O4k22J57J28j16m4J13k7o7r2K4J52k04J00M4L8j12jM0L6j01j07J93M1P3
2665A41K5j69M9Q1j07L8n9K9O7k03N4J6j10J56lj64K3J62q2N9J20p7L3j13J42
2690A08L6j35R4j2j77K1o8R8n8lN9J28j14J70k82M4j21J71l2J83l7k6%l4m0NK7
2717Ej1M3j66J29l3k7opL9P6j20J64Mp1j13J85j2qj19L5N9m0kK3k9k4J46k08L
2746h5J20j64J28K6oQ1j51J49n4N7O7j25j00J40Kj12j9r6J51l5n6L5K9K4Po9j3
2773f9K0nJ26k4k2q8J03l9j9j1r1J73j3l0R1o1q9L9J5j34J60n1P0j35J25m7J25
2800A19j8j00Qr7J05m2L2N6Kj78P5J3R2j36j0K27k11j5K47k23O4P6m0J02n5j63
2826g0J6P8k3M5j28m7J15j35J35j4k3m4R1j6n3M8O3L6l3oN1l7J7r8j0M7j5p6Q5
$$ y = [31, 95, -127, 30, 158, 42, -2, 111, 84, 17, -75, -51, 101, -103, -3, 41, 79, -33, -34, 6, 42, -59, -166, 27, 68, 141, 166, -3, 46, 127, 20, 58, -1, 28, 95, -108, -54, -38, -148, 8, 5, -159, -136, 26, -56, 3, 123, 46, 79, -34, 108, 144, 9, 103, 91, -86, -65, -133, -35, -93, -96, -37, 91, -23, 147, -135, -91, -212, -41, -73, 110, 73, 47, 47, 13, -27, -22, 5, -6, 37, -129, 0, -33, -60, -66, -73, -34, 42, -78, 86, 90, 19, -94, 91, 79, 71, -48, -13, 46, 6, 4, 27, -2, -26, 120, -88, -85, 35, -129, -1, 25, 19, 100, -51, 98, 44, 101, 168, 43, -57, 83, 85, -27, -46, -142, 9, -26, -82, -47, -18, 6, 13, -56, -69, -49, -54, 72, 48, 26, -62, 41, 2, -17, -28, -119, 54, 41, 11, 102, 41, -48, -9, 6, -128, 32, -19, 51, -84, 41, -6, 119, 101, 1, 9, -88, 17, -25, 7, 63, 65, -113, -38, -25, 67, -69, -79, 148, -63, -78, 169, -54, 10, 86, 46, 148, 93, -70, -54, 24, 1, 46, -82, -129, -14, -149, -14, -28, -51, -95, -4, -20, -73, -25, 38, 74, 41, 35, 86, 49, 66, -32, -42, 5, -10, -86, -1]
2855an9j30J51r5J19R7j19Q4O7j71M7N3kN5j1o0Q6k20J44O4j51O0k4po6M3M9J33
2883A36j29O4r5kM6N2r6Jn3K44N4k94L6M9P1j25M2q4J15j00K3l7M9O9k8L8O7m5
2911F8k0K3Q0j34j3J9r7J11p4JM3p5K5J2M8r8N7l5J16j7o5l1R6J4K3K2p0k4j38
2940a33L49k55j57J18J6kk2N5M2Jl1O3l0Km9J40j17K2j0j0J9mJ28m1j39j62J71
2967c6m5P0K9j61J46kJ0P8%KM1j32J39r7m9L6o0Q6o7l9R4L5j09L7K9r7j9P8J9
2996A6MJ3j02N6JN5p9Q0O5q4o2j02J22m7L9R8j04j8l8J00j6l9J37j8j06J54p4
3023E1o4Q8p8K4Qj14J84m7j41J45r2j15J17rl3J32q6r5J52j1o5j5N5p2J80j12
3049a3k2qk4mP9O2j23j1J38k40R5l5L6K5M6nQ0no1m8Lm3Q9Q8j02K5p7p0K28j39
$$ y = [-1, -60, -190, -39, -134, -15, 82, -37, 47, 114, -57, -10, 43, 41, 96, 85, 25, 111, -109, 35, 99, -52, 8, -16, -23, -89, -46, 3, 136, 7, 71, -24, -26, 20, 72, -24, -23, -76, 168, 222, -72, -36, 13, 84, -41, 1, -83, 32, -68, -45, -82, -33, 36, 8, 46, 113, 68, 48, 71, 151, 17, 4, 23, -74, 37, -37, -36, 7, -68, -43, -31, 17, -81, -24, -59, 57, 40, -25, -56, 40, 54, 77, 99, 29, 5, -133, 216, -39, -196, -78, -62, -64, -86, -31, 11, 12, -19, 44, 14, 16, -33, 107, -10, 12, 2, -8, 11, 7, 135, 94, -45, -207, -36, -81, -11, 18, -143, 3, 1, 11, 89, 89, 91, 132, 0, 139, 42, -7, 29, -31, 55, -12, -51, 43, 78, -31, 6, 35, -62, -81, -3, 16, 20, 33, -69, -13, -12, 43, -36, 44, 109, 25, -37, -139, -17, -64, -25, 73, -31, -49, -87, 13, -3, -42, 95, 77, -29, 125, 51, -13, 75, -3, 21, 29, -85, 99, 52, -89, 56, -36, -151, -34, -43, -76, 56, -30, -125, 27, 16, -49, -64, -9, -81, 99, -13, -35, -43, -67, -71, 8, 70, -53, -64, 74, -166, -71, -106, -70, -45, 1, -4, 76, 71, 10, -38, -35, -78, 11, 99, -3, 22, -55, -125, 103, -36]
3079c6J15j3j18J33j37j61K83l5j06J35n0K0O6l1j02L6p8P6j7n0NO6j33J13J04
3104H5j24N6K5m6R0K1j55o7R1NK8P8j31J19j51J17M4j73P3k8oQ3q5p7J32k2K5
3131GJ7K4O8j50L9%j8P0k0n2l1M1n3P6j14J41q9J56k85J06L62l58N24Kn42M25
3157C46k44r1J34j27N6j84K37j67p4J63l8Mj08JR4nn9o6J50j25J00j1JN9O2j58
3183e0J01O7o5j15R7n6m6M4n4OJ13m2J6j38J13K6N0o8J05J8q7p4J2Mj10J07M1
3210A5m0kn4J39q3n4O8m1koQ0N3l5n1J6R9m1L6p5K1Rj3Qk7O8p9k0j06O8M0k7J10
3242G4j26m7J02j2N5M8r6M6M2r6m0K9l8r5K64r1o4K6k7J51j39L5j14K05l91K10
3268h9J67o7N9p3K1j27L5k5J26P1k6n1r5L3O4NQ1j99Q8k9Q8k5o1R0j22j6J05J9
$$ y = [-36, 79, 66, -52, 81, -56, -217, 66, 31, -75, 60, 10, 30, 96, 65, -37, -1, -79, -3, -20, -70, -65, 1, -132, -19, 85, -39, 17, 42, -4, 86, 107, -48, -115, -24, -19, 9, 87, -44, 75, -76, 41, 85, -88, -15, -43, -49, 34, -51, -128, 4, -18, 7, 24, 48, 116, -34, 5, 5, -13, 57, 37, -15, -46, -5, -58, 18, -96, 45, -44, 112, -173, -67, 295, -63, 461, 463, -79, 346, 102, 11, 145, 18, 74, -110, 127, -40, -114, 49, 11, 15, -93, -92, 2, -3, -62, -128, 22, -103, -3, -14, -13, 46, 108, -50, 51, 118, 53, -62, 35, -21, -67, -23, -77, -71, 42, 0, 16, -122, -9, 17, 67, -1, 104, 122, 35, -39, -27, -23, -133, -26, 15, -25, -27, -81, 58, -25, -79, -11, -52, -54, -60, 20, 73, 38, -13, 3, 102, 61, 97, 22, 43, 52, 39, 47, 20, 88, 9, -11, -117, -49, -9, -36, 74, -52, -99, 3, -9, 46, 94, -2, 44, 86, -10, -50, -21, -59, -154, 110, 19, -45, -19, -46, 105, -34, 1, -113, 92, -299, -89, 78, 11, 70, -3, 18, -109, -74, -99, 27, 98, 72, 21, -74, -41, 23, 28, 109, -90, -2, -31, 57, 32, -29, 61, -61, -77, 28, 47]
3296D7o8j9J7Q8k1j6j24L2K0J26k0l6q3J30j34K8Lp5K70p1q5K2j73K17q8oQrp3
3325i3J26j05L7J59j47lJ00L8j45Q7k6K3o0Q6r0N8n3j0K1M7J3j13N2q5k7M3P7
3352A0j00R6M8l4pQP3j8j09P9k5j0m0l4J34j1j88J05Ml0M7k8pnJ7K8K5m7Q0pk8
3383B6n8j1R8m2j13P7l8O7P9q5L2K2o0n5M9J52j27M5j35J57k4q9J0K4n2J03o8
3410a6P2Jj0j8Kr7r5K13j23J02o2ON4p8OQ0L9j15J17qr4L3k2K5o7J7m6L3O2J67
3440A78j80J1Pj11J69o1j3J03j60L0J15k18J21j36K23j46J44k10L6O9m8R4J22
3463A39o8l1M5j00N3j0n1Kj9J95j99Lq2L12k96K48k31k64K64k09J1K72m4J50K8
3488A18r6Pp5j0J05n3oJ5j18P4N3O9n5k8qrO3m7pm6N6m5L5J07k2Nj31J41J48j77
$$ y = [47, -21, -40, -23, 65, 44, 28, -96, -64, -44, 82, 62, 26, -57, 73, -61, -33, -30, -105, 165, 94, 9, 31, -142, 75, -13, -19, -11, -20, -93, 33, -72, -35, 124, -23, -26, 74, 112, -33, 54, 28, 51, -9, 77, -13, 45, -8, -18, 3, 50, 63, -50, 2, -83, -110, -67, 10, -90, 6, 54, 20, 13, 21, 94, 76, -33, 46, 21, 11, -29, -63, 71, 60, -128, -23, -19, -49, -2, -30, -37, -42, -25, 3, 28, -19, 61, 54, 26, -32, -43, 55, 13, -100, -23, -61, 6, 85, 0, 32, 54, -6, -61, -12, 140, 13, 58, -77, 80, 56, -33, -23, 1, -51, 52, -16, 56, 57, 47, 29, 31, -66, -161, 52, -71, 31, -31, -25, 29, -49, -43, 37, 76, -39, 78, 70, -24, 9, -13, 12, -55, -38, -84, -51, 11, 178, -2, 9, 16, -95, 74, 13, 0, 103, -57, -27, 88, -130, -9, -145, 78, -68, 76, -134, -98, -29, -77, 17, 139, 71, 40, 85, -15, 38, 28, -23, -21, -40, 155, -44, -41, -123, 189, -107, 141, -90, -354, -90, -299, -288, -16, -60, 90, 118, 22, 29, -46, -56, 49, -4, -10, 5, -113, -39, 14, 83, 28, 0, -8, -17, 46, -1, -8, -54, 2, -43, -8, 99, 77, 82, -49, 92, 240, 63]
3518F3r0P0p2J4k2J04j89J26O8jj28J33j88J59n4K9j08R0k9R9j31L1P5n0J27p0
3544E6j78J03Q8j90P7rJ2j56K06L4j5j86K37Mj96K29j97J29o5J7k5k2l2R2p9J08
3570D2m6k1lk1P0p2K0%l8J15n5J5l1m0P5m5m5Q3OKj3K6n6k3L2j0O6l5M7j14J01
3601C2N7o5r6J73r7M1O8l9n7r2K3k0Jo1R6M1K8j6j7m5l0J00m4P1L1m8qO6j4j62
3631h3O6L3j9orO6n2N6PK2j50J00j31J44O2o9p8J1J35k4j00P5k9N3r7pj9R1l2
3660A6r3K5J0L4rP8r0J77j78j7J24pp2l1N7l0J77J5m41O75l05k99L68k69J38j23
3686g0J08n5P3n2j5J01q6l6qM5k9k4O9P3j50J09N1j80Q4j33K08m3p6L1k3J01m0
3713C3Q0j83R5R3j28R2j67j3J08j3K3n1l0J15k8j22J17rp6J92j76O4J4lk7N1p2
$$ y = [63, -27, 43, -29, -15, -37, 67, -122, 4, 72, 71, -57, 76, -112, 47, -7, 22, -86, 4, -25, 74, -57, -26, 49, -1, 126, 56, -122, -19, 69, -121, -44, -53, -41, -197, 9, 43, 28, -158, 79, 83, -113, 116, -81, 48, -17, 0, -25, -47, -79, 13, -66, 42, -4, -25, -28, -49, 21, -51, -31, -31, -69, 46, -9, 6, -25, -65, 10, -35, -80, 3, 9, 11, -2, 24, -32, -55, -23, -33, 33, -2, 45, -69, 32, 89, 24, -72, 101, 4, 45, 113, 74, 17, -75, -52, -72, -71, -132, -36, 5, 33, 17, 0, -45, -75, 25, -19, 52, 83, 35, 27, 93, 79, -83, -17, 16, -3, -9, -18, 48, -4, 52, 59, 81, -69, 31, -100, 44, 106, 37, -41, -30, 105, 81, -19, 56, 27, 80, -17, -24, -43, 48, 16, -77, -52, -42, -8, -17, 61, -29, 148, -30, -47, 77, 70, -2, -33, 24, -6, 171, 186, -255, 420, 115, -184, 184, -85, 53, -70, 38, -17, 56, 4, -11, 90, 4, -32, -40, 5, -24, -48, 21, 94, -56, 53, 104, -76, 8, -125, 83, 40, -36, -5, -28, 73, 33, 113, -70, 25, 118, -10, 82, -85, -98, 10, -3, 20, -31, -61, 54, 26, -96, 21, 12, -64, 128, -48, 16, 30, 27, 0, 51, -21]
3740b1M3Qp2J12r1J17Pj31L0j21J30J05mj99P3P0l0k0j2K2kM2r0P0k8P7r5MJ9
3769A3l1m6O1QK2n5L6kn3qN3R5m0k1L8n3o5J06r8P6k0J09n5j12LR8o5n3L1r4K46
3800A24k02J15j2p0J6N2o1mK9P6q1m09M95j27o9J36J09o4r9jK5j0P0r5Q6O1n0
3827D0O2p3n5M6N1n2l8Lj01J76o0m7J10j93J34o0j4J9R4o5J78j80N5k1p2J75j71
3854e9K4j2P4j14J16p8K8J2J40n0j29R8KM1q2r3O4R4k4k13J57M13k84j0j25K3
3880A3j00P4j1j00N5m2J9R8M3j21J86o1k9R2m0j50J19m6l0j8M6p5O7O4k5j39M4
3907f7j3R6r9jQ2P2J4j17O8P1m5j8Kj43J44q6O7j4j73K66k45O1o7J22K8l7J37
3934A05r7J06j09N0N0j64K3N6n0L1l1Q8p2nLJ4l1J28r4P1k3L5l8q2J2pJ1O6q5
$$ y = [-21, 22, 30, -42, 70, -21, 96, 103, -28, 2, -119, 11, 116, 112, -87, -14, 56, 26, 6, -6, 16, 14, 56, -34, 36, 8, 85, -10, -6, 13, -18, -64, -3, 5, 27, -28, 8, 6, -47, -55, -2, 93, 53, 32, 70, 17, -48, 58, -40, 36, 16, 125, 70, -42, -39, 59, -6, -59, -28, -122, 124, -78, 37, 25, -45, -29, 23, -38, -42, -13, 63, -18, -427, 68, -59, -128, 8, 117, 53, -46, -47, -22, -32, 38, -57, 29, 90, 40, 102, 29, -26, 20, 71, 19, -19, -16, -117, 59, -1, -48, 62, -131, 3, -57, -71, -52, 42, -23, 155, -25, 30, 9, -63, 112, -59, -35, -47, 27, -87, 29, -49, -21, -9, 131, 81, -48, 50, 52, 93, 11, -82, -18, 76, 52, -161, -4, 409, 125, 115, -10, 13, -87, -13, -24, -124, -69, -111, -92, 6, 49, -72, 114, 53, 24, 116, 76, -74, 45, -1, -31, -49, -3, -78, -11, 53, 28, -111, -67, -80, 16, -83, -84, -2, 70, 84, -33, 35, 106, 61, 43, 45, -98, 46, -40, 27, 13, -160, 106, -139, -78, -145, -23, 5, -32, 105, 8, 114, 5, 55, 105, -59, -36, 20, -30, 1, -30, 58, -14, -19, -16, -2, -33, 95, 1, 72, 49, 84, 46, -36, -24, -31, -20, 46, -39]
3963c9L6J1QK7j31J21l7P3q8o2J66j19O0Po8J05o5QL3j7L4R0j80Qo6L6Q6j09P2
3992@k3J16j31K9J8N5k3P5M1j53n2P9J02j34j04j5J40K0j7r2Q1l0o3q1R5R1mr3
4020g3R9M3q6Q7j61J73o5K8Km4k9R7r3J04k3j16O8J11j32k5j9J5P3m5J4k3J8K1
4048A9k0K6J9Kl8pj32R1q8O8N7n6jJ24jn9N3j55J54O9j18oR4j75J23j3q1J55m8
4077E6m8m5J0L0Jk9K9P6j13J4q2J45l5lK2p5l4R0M7n9O3p4N8M4j51m8J38q0M2
4106a1P4j68R1Kj00J46P3r1L9j08L7K1k5M4m3n2J75j67K7R0p0nO0j19k0N8P4O4
4134I6j41O7j1o2L5P1j6j3q1L3P0q6O0m8L8L3p1K5n6R9p5Q0Qq9K4P5q1N4K5j20
4164e7R7o1J21j20k0M6j16K21p9J6j56P5O2j4J6Kj40J72j15P9q1k2P7o5j2j1J14
$$ y = [-39, -3, 8, 16, 43, -88, 33, -4, 69, -19, -81, 85, -34, 26, 33, -35, 70, 5, 13, 46, 29, 63, 153, -27, -19, -85, -49, 37, -72, 0, -23, 93, -38, -9, 9, 64, 41, 116, 157, 4, -48, 31, 133, -1, -105, -120, 20, 40, 23, -69, 12, -18, -81, -162, -67, 24, 20, -73, 26, 69, -17, 70, -91, 82, 17, 45, 47, 3, -26, 71, -22, 82, 59, -57, 11, 122, -10, -35, -54, -39, 34, -11, 3, -20, -2, 19, -1, 25, 44, 46, 8, 1, -131, -40, -128, -60, -3, -59, -60, 64, 63, 4, 57, -98, 56, 125, 7, 1, 95, -80, 43, 30, -51, 104, 56, 8, -37, -27, 3, 4, -25, 4, 80, -33, -19, -101, 44, 9, 6, 28, -47, -81, 9, 56, -3, 60, -14, 44, 88, -63, -111, 27, -53, -11, 63, -105, -14, -12, -112, 34, 107, 16, 55, -53, -16, 5, -20, 24, -19, -71, 104, -63, -36, 54, -16, -21, 39, -80, -100, -42, 32, 96, -45, 22, 11, -51, -16, 55, 39, 26, -55, -22, 48, -38, 22, -26, 12, 45, -26, -1, -57, 42, -33, 47, 55, -34, -10, 65, -16, 38, 63, -57, 40, -21, 100, -20, -40, 6, -110, 111, 32, 48, -108, -33, 29, 15, 31, 33, -107, 65, -50, 29, -52, -74, 3, -62, -74, -85, 29]
4191B9p1L5M1j6p6J44j5n9k7R7O1j70j7J19k3jo1J35k51J32O3p4q6K06j02o8K6
4218b9k9J17r8j03J10nN2P7j48J52n2Rq4N8J5o6l4O9o2m0N4N7J0r8M4L9n1J30
4246I4j00L4j3N1K5p6LRk8l3J0k2J04o4op2N9M0K5k4j19J03JoJ05j42J5J1j4N
4276b5M6l3L0L4p7J0j5M3Kk5j3J00o5%r9Q4L9L5j58N7J14k4j4q5O3n8J0L1j5j11
4306a19Q7%l6O6j8N9qo9O7K9Km%n1N9n4M8o7O2j11R1l4k7q2J14pM0r6Q2J15o6
4337G2j5k7RK8k5k9j2j42N6J5L1Q4j03N3j6N4j04qN2R7r0N4J05j63o4J14j2o4
4365e0K20k81J35JJ8m1L1j13J14m0P6j12Q3nj14pP9op3J74j09R7L0j48Q9k3l2
4392gn4J46p6o5O7r2M7M9j4L2j06R3R1j41RL5l7J38p4n3r1R0p7J25l6J67p4j53
$$ y = [29, -42, -7, 34, 18, -58, 86, 71, 12, -15, 82, 143, -27, -44, 75, 52, 51, -10, 125, -126, 6, 69, -5, -91, 115, 13, -55, -29, -58, 59, -39, -142, -32, -37, 15, 92, -56, 96, 44, 53, -31, 27, 42, -24, -58, 11, -51, -91, -37, 20, 30, -68, -24, 15, -36, 94, -6, 28, 15, 66, 91, 15, 18, 27, -1, -34, -24, -46, 58, -6, -12, -84, -25, 15, 40, 16, -103, 0, 1, -5, 100, -42, -27, -16, -30, -25, 21, -12, 18, 52, -25, -15, -30, 13, 15, -10, -23, 77, 12, 12, -87, -3, 36, 71, -87, -30, 84, 60, 46, -39, 24, -34, -24, 7, -8, -119, -32, -32, -68, -2, -20, 39, 31, -38, 29, 58, 60, 56, 56, 5, 64, 10, 58, -9, 53, -58, 33, -1, -28, -110, 4, -3, 37, -59, 23, 138, 72, 57, 30, 39, 67, 42, 13, 1, -141, -85, -70, -39, 45, -58, -5, -21, 33, -71, -79, -27, 70, -20, 34, 139, -24, -88, 26, 14, -50, 170, -111, 24, 25, 43, 2, 33, -80, 34, -6, 70, -42, 41, 36, -78, -85, -6, -12, -85, 89, -20, 77, 107, -41, 48, 25, -7, -61, 85, 9, -56, 11, -81, -34, 15, 1, 33, -73, 20, 111, -30, -21, 14, -23, 115, 41, -12, -103, -13, -90, 35, -1, 166, 92, -61]
4420f1j8J12M1j49N5L1M0k1p4pj4P2J9Jnn9j05J42k9j4J23n3L5j84O2N4O6o8P4
4449F6r2j0j6N1L6Rqj6J1q4JL8n1K76j60j13N2n6J12p8k4NorOJ42k09J62K9o2
4479BQ9Rj32Q4K6q0o7l0M1J00o7R2m6l4J6Q6j27J73k70P3M5JJ06j91R2o6M9L7
4507A1K0m0O9m2j03M0J06o0m4L2PK5k9K0j81J24J86j05p0l3N9r4J35m8j6Q5j19
4534f5M3j01J15m3J45j67kJ26n2Q5n5p5N2M0j09K9k1N4J7K9m5o9J35m7l0J29q
4561A10ro9n3K6L3j16K7N5p2K0Q7J1j00J78k03m4M6J1J2J27j8N6j75K4l1K9J31
4588I3j32K3n6j9P0nL9l0pR5p1n4R9r0Q6lj84K91j58N3l8o1l0R1j3L4K1k12K19
4617E1n5rj1mm3K6M6k7N5P3Qj50LN5j4J03j07Nl4K7O7N8o9jm6o0J9lLQ2r5mN5
$$ y = [-61, -79, 33, 74, -75, -20, 11, 51, 30, -44, -51, -65, 7, 26, 27, 22, -37, -142, 0, -29, -43, 80, 27, 62, -122, -60, -6, 60, -8, 66, -26, -36, -52, -1, 35, 44, 36, 20, 31, -53, -52, -14, -65, 211, 51, -62, -10, -66, 46, -32, -56, -51, -57, -66, -60, 82, -127, 35, 64, 2, 91, 100, -32, 52, 78, -2, -69, -99, -58, 42, -25, 67, 21, -13, 3, 89, -38, 135, -135, -62, -17, -16, 90, -101, -9, -75, -26, 11, 31, -9, 60, 18, -85, -45, 61, 1, -43, -11, -4, 21, -8, 12, -169, -45, 141, 36, -34, -67, -8, -102, 33, -15, -31, 54, -65, -22, -123, -8, -51, 94, -73, -75, 51, -1, 84, 29, -46, 6, 46, -63, -34, -55, -1, 16, 45, 0, -69, 66, 19, -11, 118, 110, 101, 32, -21, 5, 38, -78, -51, 4, -68, -48, 39, 50, -50, 128, -75, -119, -73, -62, -50, 77, 59, 115, -60, -36, -67, -38, 93, -39, -16, -72, -91, -21, -26, 13, -17, -24, 71, 0, -54, 45, -45, 41, 38, -146, 145, -13, 40, 2, -59, -89, 2, -11, 23, 44, -168, 51, -4, -13, -24, -28, -71, -45, 1, -26, 29, 102, 110, -40, -37, 18, 4, 107, 0, 5, -29, -2, 65, 123, 54, 53, 7, -53, -34, -37, -34, 48, -47, -51, 4]
4650DNJ8j3OJ0M0k3R9k31O9Mm0q1J28j9nR4Qj68P3J2J05K1p6L5l1K5q7o6PR9q1
4682e9L0O8K2j04K9O2l3j6j5K8k7M9r4R2L8p1J25j43K1k8O2j50J14P3Mj28J00
4709D9m9l6J24m7L7n8l8Q4M7o4K5j30Q1o0L2N0M2o3L3n8mj10P9P1r1RP0m32M26
4738A9J1j0R8k00J81p4J8n9J0q9LJ29n9M0o8J09j62K36k22o4j12M49k80Q3r4M59
4764C52m56O09l37l83O81n16L37p27M20R1J2j70J66j10P0j10R5q4M7k0Q5L7j42
4787e3O7O9q7K0J3j9l3r4J14PN9j49J62r2K7p0J27l0j07Q5M5L6j43o1R5J77k05
4814d0L5Oj8l1L7j1pL4MJ2N2j79K21p3m1l4O2K1J4j4j31K46j93M2r0P4k2l4J66
4843A08j47o3J22l7Q6p7R0r5l1K4K1Q6p8L2p6N2J6Q2j03l4p0M2j8R6J9n1NJ01
$$ y = [4, 9, 27, 14, 20, 30, 70, 47, 146, -85, -16, -12, -52, -133, -5, -24, -29, 65, 73, -95, -22, -10, 95, 116, 40, 75, 44, 69, -18, -84, -77, 22, -59, -29, 39, 61, -43, -14, 48, 15, -1, -16, 12, -15, 34, -60, 32, 70, -1, 124, -19, 2, -26, 36, -114, 0, 73, 77, -51, 49, 0, -36, 88, 41, 78, 20, -18, 66, 113, 49, 74, -56, 25, -35, -3, 47, 89, 26, 59, 1, -3, -113, -34, 37, -54, -45, 25, -407, 19, 30, 20, 118, -82, 99, 25, 43, -16, -6, -95, -92, 37, -22, 18, -50, 59, -103, 133, -89, -153, -265, 184, -96, -13, -107, 352, -104, 505, 168, -215, 466, -50, 287, -440, -20, 71, 83, -87, 79, -31, 39, -71, 24, -60, -13, -33, 52, 89, -53, 14, 83, -4, 16, 29, 10, -23, -117, -3, 4, 63, -86, 76, -16, 11, -59, 68, 38, -69, 16, 61, 97, -46, -107, -12, 165, -40, -5, 1, -17, -48, -11, -22, -29, 5, 9, 21, 73, -106, 115, 42, 1, -33, 29, 50, 64, 50, -81, 165, -28, 14, -76, -2, -24, -58, 108, -39, -102, 20, -17, 69, -8, 82, -13, -44, -20, 1, 87, 9, 41, -35, 17, 33, 115, 12, -22, -92, -50, -68, 28, 47, -4, 1, 102]
4871A02o5P0j17J25p4j30N4O3rK7K1j00L4j39J37n3m0R7o2j5K1j4M5j8N6j04O6
4898b2J01r2K5j16J59j50O1J42q7J0j05R1j3p8J5N9oO5l9j36J26n2l8J46j11O1
4924A6o3O0n2OP7q4Q4q2P9j2J7m6M6Q7l7j87K1Q9k5rJ04j35M1O7J03n6p0L7m3
4953C3k5%N4j29QKJ99j90Q2r1N7K4MQk10K47q9J13l9k7j09N5l8j06J64o6j2N7
4981b4l0N6L1P7j59k3J50o7m2N6PP6j32M8m9j2M1J1L4j52qQ5n6JJ16j09Q0J7o1
5010c8Q1M5n6N6n0kk9K5l3m2N5J00j29k1pJ93j66l5Q9M0q7L3k7M3JJ9l8p1J62
5039A11q6Q7p7k8p8J60j39PR8m2L6r2J16j96J34KLj07J28N5l9p9N9m9o3J08L5
5066F4j20L1P0p1J3j0l1O4k0Q1l6qM6j48J26m1N3j10M9M0o0M6J9J2l8K8j8n9O5
$$ y = [102, 37, 107, -10, 115, 41, -89, -35, 28, 19, 46, 67, -33, 1, -138, -1, -54, -94, 3, -59, -74, -53, -67, -22, -40, 16, -88, -22, 79, -13, 12, -104, 55, -95, -34, 108, 21, 31, -74, 17, 4, -74, -59, 0, -6, 59, 20, -116, 10, -42, -80, 66, -45, 16, -47, 13, -39, -33, 44, -40, 44, -38, 41, 29, 46, 0, 46, 133, 96, -91, -70, 19, -6, -15, 89, -46, -5, 62, 165, 109, 39, 76, 33, 8, 8, 62, -67, -59, -57, 142, -48, 34, -57, 0, 24, 28, 36, -174, 73, -16, 97, 58, 31, -78, -23, -61, -167, -3, -69, -81, -24, -54, 2, 33, 110, -49, -72, 78, 11, -31, 25, 32, 108, -24, 24, -25, -37, 4, 15, 49, -103, -111, -26, -82, -81, 35, -74, 6, 23, -38, 43, 88, 32, 88, 38, 36, 7, 32, -1, -43, 12, 112, -17, -38, -45, 148, -18, -53, 36, 76, -11, 22, -5, 38, 39, 58, 20, -51, 111, 25, 112, 35, 7, -71, 89, -50, -43, 55, 13, 49, -43, 73, -123, 11, 13, 16, -91, 37, 92, 53, -26, 33, -16, -79, 29, 64, -56, -25, 45, -26, -13, -23, -54, 10, -10, 71, 35, 27, 73, -75, 51, 10, 63, -47, 2, 42, -18, 28, 47, 59, 21, 49, 31, -28, 37]
5095C7l6j06J71l60K47N9J6Q8j65J11NJ13j69N7J67n25O73j64k00n60Q89j16l60
5118a28J92k22Q8n9J72J0J4k7J4j28J17n9N3N0j85Q9k8q2J8J08L9o6p6J15j03
5143h4J73j33q7N0J18k2lRp2L4J05j38o0J57q9p0K09q0m9M2k6N8j04J27p7N4m2
5170@L0j07J44j8n8R3j27l1M6R6n9j3m6K6k7O2N1o8%m5N0RN2qj04J30j01O3J3
5199E3oo2lK1l7n6P6J3N1j04J02J8k18J60L0q8N0j8J2Mk6l9Q5O4j88k9K05j26
5227e6QP4r6O0L3R8j52J18j10K9k1j6L0o7J07Nj03j3L0O7m1J04j86J88j55mP8
5254IP7k1p2M7j39K20j25N0k55J44L5O7k31K24o02N87l8L19K03p60P12p63M02
5277I0k01J07P5Q0p1M2k54K19j38o5M2J35p7K5M9j33P7m6J7J8N5p6N1L5r5JR2
$$ y = [37, 1, -105, 66, -294, -47, 12, 28, 116, -49, 62, 67, 180, 11, 68, 235, -290, 383, 219, 19, -541, 348, 232, -128, 64, -158, -70, -129, 43, 53, 67, 40, 54, -74, 43, -16, 37, 87, -98, -9, -37, -119, -101, 7, 46, -20, -96, 19, -84, 89, -44, -131, -81, 37, 15, 12, 21, -51, -17, 88, -50, -110, 47, -42, -112, 97, 17, -32, 10, -16, 42, -62, 65, -12, 42, 0, 30, -77, 67, 49, -9, 84, -43, -74, -28, 68, 9, -4, -50, -24, -51, 11, 62, -6, -6, -51, -1, 8, 60, 52, -52, 78, -23, 40, 53, 47, -15, -18, 3, -34, -90, -14, -1, 50, -54, 48, 66, -152, 8, 38, -50, 0, -18, -6, -2, -28, -67, 18, 82, -106, -135, 70, -56, -48, 26, -70, -10, 23, 121, -31, 87, -23, 6, -15, -31, -1, -68, 39, 44, -59, -72, -42, 25, -16, 88, -98, 90, -65, -69, 9, 86, 65, -7, 40, -99, 121, -4, 46, -209, -65, -30, 37, -194, 30, -572, 15, -23, 296, 499, -261, 451, -312, 90, -111, -4, 71, 151, 80, 122, -132, 87, -51, -116, -74, 61, -16, 9, 58, -75, 2, -44, -27, -9, 46, -30, 21, 56, -39, -38, 54]
5304E4o9p8K9J21j30J16n8p0J44p2K8n0p7P0N6N5K4j06N9Qj8o1J33j60P4m7Q7
5331F2j29O9m7P1m9m3R7j56K8J4J42p2N7l6L5N6p9n9M8j49K04j22J19m7l5KK2
5358Cj2J3M2j35M8P0rq3L2R1m5j12K20j78J3qJ84k15O0J12j52J20j48O6L0jL0
5385C6O1j35%m0nR5j18J29K9p2J32m9k4l1p1Q6n1j2M6p9O3k7K2r0J29lk7K8k5
5414cj5r5K16j11K4k2lo1J22j0q8l7J28k8r4j2n5J09M1n4N8j1k5rR3k7l1J45j70
5443b5M8rn0l2J02k3K9k8j7n0R2j8Q9n1k6j0j50K28q4j05J0O6J15j41J15q6J10
5470I9k2o6Q1n8q0J4Q9o8k4M7m2OL0R5n1J17k03n6J68n9K2m8J19j30o6R1Rk4j29
5499a39J69n4N8j3j42M5J7J8O1r3L3L5o3L7kJ17k42J73j05M9Q0J9m2O8qj46R1
$$ y = [54, -15, -93, -64, 57, -73, 43, -15, -85, 59, -13, 15, -35, -112, -42, 14, 69, 93, -13, 46, 54, 36, -25, 108, -52, 22, -25, 62, -67, 2, -45, 26, -23, -66, 31, -125, -97, -83, 59, -13, 44, 8, 43, 99, 20, -39, 9, -140, 64, -58, 61, 14, -21, -19, 3, -9, 4, 46, -89, -41, 29, 20, -63, -31, 60, 15, -97, 123, -55, -42, -50, 134, -81, -21, 91, -61, 59, -89, -23, 7, 6, 36, 97, -38, -38, -78, -83, 12, -106, 23, 52, -20, 112, 63, 39, 8, -63, 23, -28, -40, 6, -73, -10, -37, -15, -105, 24, 21, -6, 22, -3, -18, -113, 103, -8, 16, -6, -9, -70, 52, 42, -46, -83, 45, 17, -77, -89, -144, -35, 6, -48, 10, -1, -26, -35, 58, 31, 0, 145, -25, 23, 14, -36, -68, 34, 11, 40, 12, -5, -55, 37, 19, 108, 57, 31, 21, -129, 99, 15, -90, -80, -14, 101, -40, 75, -11, 99, 77, 11, 92, 34, -46, -32, 57, -11, -35, 12, -30, -24, 6, 101, 50, 167, -36, -92, 76, 17, 39, -9, 110, -20, -86, 5, 14, -10, -139, 30, -24, 34, 21, -121, -76, -59, -41, 20, -73, -40, -5, -68, -31, -33, 84, -158, 15, -90, -41, 39, 58, 16, 84, 76, -70, 21]
5526B1l5L7jl9K6o3J11n0j0m1J3n5J07j2RNj49K52j86K8O2JK3p0j4l6K0K4O5Q
5556E1j34R7m8O1j59J29MK2j9j53J23J2L9Oo2P4j2P9p9m3M1r8J11n1L6r2N1K5
5584A1j12J62n9oM0o5k6l9j1J18l1N0L1j62J49O0j00m0j7J10P4j77Q7rK4P5j64
5611b7m1K6r2J05J11J7j57N9m2J23l0k6lr0m2J06M1k1p0P8j18R0ML2j00k1J66
5638G8j11l6J00J14r1j14l9J43r1mK5Pj4j8J17p5M8j13L0Q7L6k6m1O3n7N6p0p7
5666g3J01r5O3kj7J07j65O5j29O1K00n9l1q4J3O9l8J48r7l3k0m2l8J21j3M2p5
5693b1l6N2M3N0j02Ln0M9j9j6P8k9J3P2j12K5k5PJ1l3P4j7L5p9M8O7j63J23q4
5722c6lM6j41J32l0M9L1k1p7J7J06m8j34J13m1n7L3j6KN3R6q7J4kj6N3j46J64
$$ y = [21, -14, 23, 22, -17, 9, -54, 57, 7, -3, -44, -31, -86, 21, 9, 18, 23, -126, 126, -60, -32, 30, 31, 54, -16, -30, -66, -46, -22, 43, 51, -83, 14, -34, 27, -132, -3, 1, 23, 4, -149, -26, -14, 25, 31, -31, 43, 31, 110, 31, -12, 29, -69, 42, -9, 27, -65, -14, 11, -101, 61, 2, -4, 36, -29, -55, -94, -105, 13, -18, 32, 63, -99, 50, 110, 10, -30, -47, 63, 137, -40, 47, 38, 62, 137, -27, -68, -42, -134, -29, 82, 99, -58, 1, -41, 82, 52, 26, 23, -67, -109, -3, 38, 17, -53, 25, -93, -3, 1, 33, -67, -88, 78, -33, -69, 31, 145, 54, -60, -99, 44, -47, -51, -26, -19, -33, -51, 66, -9, 39, -74, -44, 43, 79, 53, 12, 75, 18, 74, 4, -73, 28, -67, -4, -6, -23, 84, -81, -16, -145, -84, 116, 57, 26, -58, -45, 24, -14, 134, 37, 4, -16, -58, -96, 25, 12, 54, -21, -57, -5, 38, 88, -14, -11, -61, -12, -31, -47, 31, 2, 15, 87, -25, 0, -25, -18, -7, -40, 34, 17, 52, -27, 21, 88, -75, 48, -36, -39, 7, -134, -2, -32, 17, 48, 27, -50, -33, 73, 25, -109, 4, -37, -94, -61, -77, -75, -22, 74, -13, 1, -1, -17, 36, -110, 54]
5750E4l%n5M8k9j2rr1Q2m6K8R5L9m0m8p1P3J3L1m1p9J27m9m0J5L3q5m8J16n6J5
5781c3P8m3M4p5J08j59J3J14r1m6J23O1j83J08n4N7r0N8J70j72l0j2J07j38Q9
5806DQ4j51Q1Q6p4r2Q4K1j7j9J2m5J18o4K5M6j03q8J72j27jJ26o3J8k1l0j6P8
5834D4p5J3J99j74m4J6qQ9j03OK7j33O7P0n1Q8j75O8J18M1q3r2R1J7o2L0Q6m7
5862B3j0j15JJ38j7n2L7j20P1p6J29J8j19J03P5j51M1Q0j20M0p1K23r2o8L1J63
5888A62j00L4l8Pq6P1p8jK8n0J6K7O8m4k8N6j38J03N1m0q5%J18j43J19j24J15
5915B0n1k7R9J5r0K6j8JN1m8M0j09R6%L1m7k1k7J33p0M9j15J26j24J60j06q0J29
5943D3K0k5o1R9p3J2N0l4m0n1l4O2Q0m6R2r7o4J35q9K8J0O3j41OR0j3L9o0k9J86
$$ y = [54, 51, 51, -4, 44, 15, 3, -6, -97, -15, -61, -33, 62, 101, 61, 13, -58, 15, 28, 59, 18, -61, 66, 17, -23, -8, 25, -60, -108, 8, -48, -33, 45, 2, 46, -29, 79, -80, -67, 47, -44, -90, 33, 94, -89, 19, -35, 22, -68, -10, 160, -12, -42, -54, 53, -85, 4, 88, -63, 18, 104, 30, -62, 22, 43, 26, 7, 19, -26, 92, 28, 53, 99, -4, -92, 80, -47, -48, 78, 15, 33, 12, -18, -34, 44, -31, -18, 181, 7, -37, -21, -29, 60, -43, -37, -10, -143, -76, -6, -57, 31, -144, -76, 42, 83, 0, -92, -1, 16, -46, -16, 70, 23, 13, -102, -101, 37, 20, -32, 5, -115, -44, -120, 9, 27, -92, 11, 86, -65, -24, 56, -64, -24, -95, 128, 36, -32, -1, 162, 62, 96, 58, 65, -21, 50, -28, -29, -1, -51, -35, -8, 60, 16, -12, 44, -94, 9, 60, 20, -65, -65, 53, -90, 29, -95, 20, -31, -58, 41, 56, -34, -8, -26, -25, 26, -22, 18, -91, 5, 5, 36, -11, -32, -59, 74, 4, 53, -62, 64, -60, 100, -6, -86, 43, 63, 38, -23, 76, 3, 15, 65, 31, -9, -60, -94, -32, 48, 2, 94, -3, -67, 68, -21, 7, 17, 80, -61, -55, 35, 22, 61, 1, -28, 158]
5973A58j19k3j7l9L9Q1r7L1k5J2M7m4L2N6j9j04k5M7K2J6r0J68j95J47K4n3K2
6000E2j6jq6L1J32j65qJ6J20k6j14O4O7j7L1oj09OQ9M1j02n0Q6jp5J18j9o3j2
6029a7k3J44j23J9j13J75m7j46J05P3o7J79p2j02jN9q4K2J24p7K2m0O3r8O7l3
6055Im0O2n8L9K4n0r1R0P5j05jJ29o7j6p1Q8n4J10j94K3O8N8%J2o4R4n5j06P8
6084a3M4j36L5Q2N7j08J0J42j9j24P6k6k3q6J82r5K6KM0l1j5p2RK05j38N9J2o8
6112B7q8j9K5RRM1m6L3n0J0J9J5p6J98j29P7m5m4P7K7j29J46j00m3O3M7KO7p4
6141D9j03K1K6J5N4j27J7Q9J7j26J00K5j29k8l3J97n6N6l8l8j4J26o4j38O6m0
6167g6N4J8jK1j1P7r9K7N9o3j1L1l3J6O8p0o2R3m3k9O3K7j53M9%J7M4j2mj09K06
$$ y = [158, 39, 16, -1, -40, -1, 80, -17, 14, -11, 1, 48, 4, 36, 92, 73, -31, -56, -9, 13, 29, -61, 107, -88, 59, 83, 30, 52, 36, 35, -51, -20, 112, -53, -61, -45, 75, 49, -65, -1, 66, 49, 80, 74, -35, -29, 60, 101, -1, -51, 35, 34, -41, 77, 58, -5, -17, -40, 104, -19, 0, -113, 62, 15, -131, -26, 47, -20, 159, 87, -15, -16, 43, -41, -19, 105, 28, 50, 10, 73, -25, 42, 9, -31, 31, -27, 12, 36, -14, -105, -15, 60, -45, -46, 83, 16, 0, -71, 17, -37, 73, -121, -98, -30, 28, 28, 40, -24, 70, 15, -91, -13, 31, -105, -70, 12, 69, -39, -29, 113, 94, -30, 46, 20, -3, -89, 93, -2, 24, 26, 66, 35, 20, -52, -43, 162, 24, 83, 95, 27, -61, -80, -55, -46, -37, 4, -42, -9, -59, -49, -30, -15, -91, 107, -22, 55, 10, -34, 43, 70, -59, 87, -13, -56, 7, 54, 56, 123, 49, -54, -33, -7, 8, 62, -65, -48, 41, 58, -68, 32, 57, -72, -100, -133, 64, 8, 64, 26, -12, -26, 100, 36, -102, -36, -76, -22, -4, -5, 16, 5, 82, -17, 10, 69, 6, -5, 26, -7, 9, 77, 7, -55, 38, -5, -34, 29, 56, -97, -48, -48, -31, 13, 1, -3, -112, 94]
6198I4j38N1o2o4N5J25j06J09p1l5J01J1j07k8J24l1K4Km1o3M3N8o4J49j13J6
6224C9n1K9m1J4O4Ko5j10J37p9M1k2J11p2J03j35o6J11n4J5q6J26k1N9qm5M2l9
6252an0N9n1l8K1J52o0q2J3M1Q8p7m3N1p9Q6ON5p4k7r9J39R0k8l9j15R1p1L6J42
6282A36q6Lq7O7Q0j18Om7J5j6k1N3lM6J6j69J42j04J63k05J69p5M2L2R5j99J9
6309d6K2J6k3m7J60l5p4K6M1mk4Mk3J04j98J43Qj02O4j13K29k5n2N7n3j3q4N2
6337A0j4Q1j8L5m2l5k2qM5j67K02o4J1l2M85j28j40j91k7J3o0K9L5L6K0m9k5l2
6365e2j1J9O1j14pP3Q7l2p4J50n1j49R6n4k9M2J58Nq6q0J14m0op4JL3J33p5j5
6394B3J9M1l9q4L4JJ2P7n2rp6J54j22J8J07q9N4Rj00j1J09m7j9p5J42l4p9J14
$$ y = [94, -44, 7, -55, -119, -64, 61, -45, 64, -7, -42, 59, 70, -37, -65, 59, 28, 52, 54, 13, -50, -7, 51, -13, 136, 23, 39, -12, 17, -24, -10, 54, 56, -9, -119, 18, -61, -20, -42, 69, -3, 100, -35, -101, 10, -44, -29, -115, 11, -10, 49, 41, -4, 38, -1, -51, 8, -43, -81, -60, 92, 32, -50, -37, 4, 92, 15, -28, 23, -56, 30, 36, 91, 17, -10, -109, 30, 120, 92, 53, -62, 29, -42, -6, 136, 50, 53, -34, 33, 113, -5, 1, -46, -31, -47, -68, -15, -18, 28, 44, -125, 17, -87, 76, -129, 40, -35, 7, 39, 134, -65, -46, -24, -8, -31, -78, 82, 47, -27, -1, 40, 36, 12, 16, -7, 97, -101, 42, 50, -52, 12, -101, 128, 103, 51, 108, 55, 42, -42, 10, -4, 77, 59, 94, 52, 17, -5, -13, 32, -135, 67, 3, 14, -18, 467, 339, 199, 8, -19, -6, -66, -37, -2, 34, 54, 5, -20, -52, -63, -44, 17, -97, -104, -31, 56, 24, -50, 100, 49, -100, -4, -58, -87, -45, 113, 118, 32, -48, 66, 26, 20, -54, -53, -20, 113, 38, 23, 42, 83, 44, -40, -6, -5, 7, 84, 32, 23, -53, 101, -21, -3, 104, 15, 69, 78, -22, -33, 76, 29, 10, -65, 77, 43, -36, 78]
6422G8o8R8l1j7j10J1O2l9L7Oj7j0k8o0J22q0qo9O4K7L2Np7O7M8j2j7j15R1L8
6452B8j6j17J51q5N7O8q2J2L5m0L3o9j22Q2L5Q0k5N7k16J24M1kJ2J5qr5J35j34
6480d6J05p5k0M0o5Q7J9o0p9J18P9q8n9M2l4N9j2j9Q1p3l8R1o8O1j6p6P6L9rj89
6510a29J33oK1%j8j3k3m4J36j53K42j23r5K9R6j00J68j03j22J95k22O6Q5m4l2
6535e6L2k3O1Mr1J33r1Rm4J29j9N6j31KQ8o8J01j30o9J9J47j64O8Q6q6k7J12l3
6563A5k4m4M4p1j7J72j40L2K4l1K5J0MM7q7P8J1n9L7Q8q4q9J38j33J25j79J06
6590bm0m5J64j68M8LJ23p4j57J46k9K6R0j21L3k6oL4rK0Rk6M6j7j26J24j15Q8
6618gK8j28J01L1J1qPj17N1M7m3K9%k9k1J9Q3o1L2q5O4m6N5k6n5J01j23J25L7
$$ y = [78, 10, 108, 77, 60, -50, -39, 23, -16, 21, 27, 10, 0, -28, -88, 34, -46, -54, -123, -59, -32, 0, 5, -72, -5, 43, 31, 14, -101, -10, 28, 12, -105, 46, -39, 18, 86, 4, 16, 51, 11, 44, -25, -147, -65, -30, 50, 25, 82, -134, -10, 31, 29, 41, 56, 48, -47, 88, -46, 59, -16, -36, 4, -61, 26, 45, -15, -94, 24, 103, 15, -44, -2, -36, 23, 11, -8, 73, 0, -38, 53, -15, 46, 30, -46, 30, 69, 60, -129, 4, -2, 19, 19, 1, -12, -35, -79, 57, -96, 146, 23, -72, -43, 53, -47, 121, 18, -104, 91, -131, -65, 20, -24, -56, -24, -47, 14, 18, -73, 60, -31, -22, -66, 63, 44, 100, -31, -29, 59, -9, 92, -38, -107, -88, 59, -105, -37, 49, -37, -64, 48, 15, -9, -53, -9, -80, -97, 75, -65, -33, -9, -40, -15, -5, -1, 46, -41, 37, 48, -11, 26, 114, 30, -59, 79, -54, 71, -108, -2, -42, -87, 77, -91, -43, -40, 83, 9, -148, -2, -31, -5, 85, -36, -3, -29, -35, -1, -10, 10, 19, -7, 39, 22, -104, 20, -95, -7, 21, -107, -6, 25, 36, 28, 35, -82, -31, 16, -27, 2, 2, -27, -48, -29, 54, -7, 25, -60, 4, -42, 13, -13, -68, 33, -90, 35, 72]
6647G2j55J13J8k4j06N5N6j0Jo4J8Jn5J00j28Q0J25j8n2o0J5q3L8P9l3m1N2r1
6675i7J15o1oj4RKP2l7J05p8L6K7m4oN7l2j13J23j12J00LJ7m9m1l0J2K6k8J05
6704F1j26J61r0l1R2j6q4j9R2L3J2j07N1j8n7lN6Nj3QOj8n8j6N8pJ1K39k19n5
6734e2R9j7j29K18n9K5m0n4l5O3n6JK4O3j27K03j24JJ1L3K2j37J07J9j7mmj2j05
6763h3J58q3p0mM8mP5O1j58P0q1jJ24Ro7P6n0J13j99R6p6ok9J67n0k3j54J74o1
6792b8m4L1K5L0m6k0R1pj9p8Q3q2J00Q1n4j1nk3%Lo4N2k1m9K2M0K4K9k2q5J5j9
6824e1J15l6m6k9J7O7m5rk2P1j03J8L5O4r9K7LM5j5M4o6n0L4kM3m9O4l1qJ24m7
6855F3M0j51J36p8N9m4L6J7j00Q3mo7N5J9jJ0q0L2q0J6Lm1j1J16m7K2Mo4L7LK1
$$ y = [72, -83, 30, 48, 24, -82, -27, 29, 19, 20, -44, -26, -25, -80, 20, -108, -28, 97, 79, 27, -33, -18, -101, -63, 16, -17, -58, -6, -97, 18, -43, -49, -63, -54, -52, 20, -17, 88, 10, 46, 73, 29, 23, 80, 48, -65, 58, -54, 46, 49, 66, 17, -24, -54, -42, -16, -44, 61, -65, 96, 6, -25, 67, 51, -33, -52, 40, 73, 85, -22, 29, 11, -46, -49, 7, 12, -1, 7, 13, -5, -63, -79, -21, -28, -17, 222, 3, -52, 47, 30, -99, 119, 60, 85, 45, -9, -44, 19, -37, -36, -12, 51, -76, 127, 3, 4, 15, 48, 70, -67, 40, 59, 42, 38, 34, 22, -83, 75, -8, -78, -82, -34, -38, 37, 98, -60, 10, -71, -72, 52, 61, -6, 70, 20, 133, -66, 30, -46, -52, -81, 86, 36, 13, -141, 33, -28, -72, -41, -16, 14, -32, -52, 39, 32, 13, -65, 18, -64, 36, 117, 63, 52, 47, 24, 24, 27, -37, 15, -6, -55, -33, 7, 31, 60, 38, -47, -32, -51, 64, 28, -18, -47, -30, 37, -8, -17, -39, 32, -71, -53, -18, 46, -53, -26, -23, 22, 7, 51, -15, -65, -31, -33, 10, -39, 25, -6, -14, 110, 63, 103, -48, 88, 10, 69, 25, 61, 78, -22, 61, 57, -10, 45, 64, 63, 73, -7, 25, -55, -39, -36, -77, -88, 28, -19, 3, 7, -57, -20, -17, 4]
6886Dk3j70J40Q3j03N0N6p4K0l7L8Mq6L5k2N9Q1j15k5J49j78Q1J2l7J1k5J10n3
$$ y = [4, -19, -189, -49, 34, -69, -19, 37, -37, -17, -54, -16, -12, -98, -63, -85, -26, 55, -60, -85, 64, -114, -33, -21, -58, -47, -72, 38, -15]
$$ [...]
8191A00
##END NTUPLES=NMR FID
##END=
