##TITLE=1H_DE-80H_X3
 200.13MHz, d2o
 8 sc
 
 19ns.26.2.2025
##JCAMPDX= 6.0         $$ Bruker NMR JCAMP-DX V2.0
##DATA TYPE= NMR FID
##DATA CLASS= NTUPLES
##ORIGIN= UXNMR, Bruker Analytische Messtechnik GmbH
##OWNER= pz
$$ XWIN-NMR		Version 3.5
$$ Wed Jul  8 11:34:05 2026 Russian Standard Time (UT+4h)  Yarkov@DPX200
##.OBSERVE FREQUENCY= 200.1313
##.OBSERVE NUCLEUS= ^1H
##.DELAY= (6, 6)
##.ACQUISITION MODE= SIMULTANEOUS
##.ACQUISITION SCHEME= undefined
##.AVERAGES= 8
##.DIGITISER RES= 18
##SPECTROMETER/DATA SYSTEM= spect
##.PULSE SEQUENCE= zg30
##.SOLVENT NAME= DMSO
##.SHIFT REFERENCE= (INTERNAL, DMSO, 0, 14.3821)
##AUDIT TRAIL= $$ (NUMBER, WHEN, WHO, WHERE, WHAT)
$$ ##TITLE= Audit trail, XWIN-NMR		Version 3.5
$$ ##JCAMPDX= 5.01
$$ ##ORIGIN= Bruker BioSpin GmbH
$$ ##OWNER= Yarkov
$$ C:/Bruker/XWIN-NMR/data/yarkov2/nmr/H-C/1/audita.txt
$$ ##AUDIT TRAIL=  $$ (NUMBER, WHEN, WHO, WHERE, WHAT)
(   1,<2026-07-08 11:32:08.92 +0400>,<Yarkov>,<DPX200>,
      <created by zg, POWCHK disabled, PULCHK disabled
       configuration hash MD5:
       00 E9 B6 7A A2 85 ED C7 34 08 36 98 17 FE 4E 26
       data hash MD5: 16K
       E9 47 CB 52 0B 49 10 48 9C E7 FA 8A 69 73 D5 5C>)
$$ ##END=
$$ 
$$ hash MD5
$$ A7 30 7F 01 AA 8E 1E C1 5B 37 26 1E 9F 01 F7 F9
##$RELAX= 
##$RELAX= 
##$RELAX= 
##$RELAX= 
##$RELAX= 
##$RELAX= 
$$ Bruker specific parameters
$$ --------------------------
##$DU= <C:/Bruker/XWIN-NMR>
##$EXPNO= 1
##$NAME= <H-C>
##$PROCNO= 1
##$TYPE= <nmr>
##$USER= <yarkov2>
##$AMP= (0..31)
100 100 100 100 100 100 100 100 100 100 100 100 100 100 100 100 100 100 
100 100 100 100 100 100 100 100 100 100 100 100 100 100 
##$AQSEQ= 0
##$AQ_mod= 1
##$AUNM= <au_zg>
##$AUTOPOS= <>
##$BF1= 200.13
##$BF2= 200.13
##$BF3= 200.13
##$BF4= 200.13
##$BF5= 200.13
##$BF6= 200.13
##$BF7= 200.13
##$BF8= 200.13
##$BYTORDA= 1
##$CFDGTYP= 0
##$CFRGTYP= 5
##$CHEMSTR= <none>
##$CNST= (0..31)
1 1 145 1 1 1 1 1 1 1 1 1 1 1 1 1 1 1 1 1 1 1 1 1 1 1 1 1 1 1 1 1 
##$CPDPRG= <>
##$CPDPRG1= <>
##$CPDPRG2= <>
##$CPDPRG3= <>
##$CPDPRG4= <mlev>
##$CPDPRG5= <mlev>
##$CPDPRG6= <mlev>
##$CPDPRG7= <mlev>
##$CPDPRG8= <mlev>
##$CPDPRGB= <>
##$CPDPRGT= <>
##$D= (0..31)
0 0.7 0 0 0 0 0 0 0 0 0 0.03 0 0 0 0 0 0 0 0 0 0 0 0 0 0 0 0 0 0 0 0 
##$DATE= 1783495928
##$DBL= (0..7)
120 120 120 120 120 120 120 120 
##$DBP= (0..7)
150 150 150 150 150 150 150 150 
##$DBP07= 0
##$DBPNAM0= <>
##$DBPNAM1= <>
##$DBPNAM2= <>
##$DBPNAM3= <>
##$DBPNAM4= <>
##$DBPNAM5= <>
##$DBPNAM6= <>
##$DBPNAM7= <>
##$DBPOAL= (0..7)
0.5 0.5 0.5 0.5 0.5 0.5 0.5 0.5 
##$DBPOFFS= (0..7)
0 0 0 0 0 0 0 0 
##$DE= 6
##$DECBNUC= <off>
##$DECIM= 32
##$DECNUC= <off>
##$DECSTAT= 4
##$DIGMOD= 1
##$DIGTYP= 9
##$DL= (0..7)
0 120 120 120 120 120 120 120 
##$DP= (0..7)
150 150 150 150 150 150 150 150 
##$DP07= 0
##$DPNAME0= <>
##$DPNAME1= <>
##$DPNAME2= <>
##$DPNAME3= <>
##$DPNAME4= <>
##$DPNAME5= <>
##$DPNAME6= <>
##$DPNAME7= <>
##$DPOAL= (0..7)
0.5 0.5 0.5 0.5 0.5 0.5 0.5 0.5 
##$DPOFFS= (0..7)
0 0 0 0 0 0 0 0 
##$DQDMODE= 0
##$DR= 18
##$DS= 0
$$ [...]
##$SUBNAM2= <"">
##$SUBNAM3= <"">
##$SUBNAM4= <"">
##$SUBNAM5= <"">
##$SUBNAM6= <"">
##$SUBNAM7= <"">
##$SUBNAM8= <"">
##$SUBNAM9= <"">
##$SW= 18.0517328524113
##$SWIBOX= (0..15)
0 0 2 0 0 0 0 0 0 0 0 0 0 0 0 0 
##$SW_h= 3612.71676300578
##$TD= 16384
##$TD0= 1
##$TE= 0
##$TE2= 300
##$TE3= 300
##$TEG= 300
##$TL= (0..7)
0 120 120 120 120 120 120 120 
##$TP= (0..7)
150 150 150 150 150 150 150 150 
##$TP07= 0
##$TPNAME0= <>
##$TPNAME1= <>
##$TPNAME2= <>
##$TPNAME3= <>
##$TPNAME4= <>
##$TPNAME5= <>
##$TPNAME6= <>
##$TPNAME7= <>
##$TPOAL= (0..7)
0.5 0.5 0.5 0.5 0.5 0.5 0.5 0.5 
##$TPOFFS= (0..7)
0 0 0 0 0 0 0 0 
##$TUNHIN= 0
##$TUNHOUT= 0
##$TUNXOUT= 0
##$USERA1= <user>
##$USERA2= <user>
##$USERA3= <user>
##$USERA4= <user>
##$USERA5= <user>
##$V9= 5
##$VALIST= <valist>
##$VCLIST= <CCCCCCCCCCCCCCC>
##$VD= 0
##$VDLIST= <DDDDDDDDDDDDDDD>
##$VPLIST= <PPPPPPPPPPPPPPP>
##$VTLIST= <TTTTTTTTTTTTTTT>
##$WBST= 1024
##$WBSW= 4
##$XGAIN= (0..3)
0 0 0 0 
##$XL= 0
##$YL= 0
##$YMAX_a= 234516
##$YMIN_a= -281351
##$ZGOPTNS= <>
##$ZL1= 120
##$ZL2= 120
##$ZL3= 120
##$ZL4= 120
##$ABSF1= 10
##$ABSF2= 0
##$ABSG= 5
##$ABSL= 3
##$ALPHA= 0
##$AQORDER= 0
##$ASSFAC= 0
##$ASSFACI= 0
##$ASSFACX= 0
##$ASSWID= 0
##$AUNMP= <proc_1d>
##$AZFE= 0.1
##$AZFW= 0.1
##$BCFW= 1
##$BC_mod= 2
##$BYTORDP= 1
##$COROFFS= 0
##$CY= 83.5205535888672
##$DATMOD= 1
##$DC= 2
##$DFILT= <>
##$DTYPP= 0
##$F1P= 10.8118882576601
##$F2P= -7.23987719738617
##$FCOR= 0.5
##$FTSIZE= 0
##$FT_mod= 4
##$GAMMA= 1
##$GB= 0.15
##$INTBC= 1
##$INTSCL= 1
##$ISEN= 128
##$LB= 0.25
##$LEV0= 0
##$LPBIN= 0
##$MAXI= 10000
##$MC2= 0
##$MEAN= 0
##$ME_mod= 0
##$MI= 1.114404
##$NCOEF= 0
##$NC_proc= 0
##$NLEV= 6
##$NOISF1= 3.799351
##$NOISF2= 2.8
##$NSP= 1
##$NTH_PI= 0
##$NZP= 0
##$OFFSET= 14.38212
##$PC= 1
##$PHC0= -7176.948
##$PHC1= 6.42196
##$PH_mod= 1
##$PKNL= yes
##$PPARMOD= 0
##$PSCAL= 0
##$PSIGN= 0
##$REVERSE= no
##$SF= 200.129724274929
##$SI= 16384
##$SIGF1= 3
##$SIGF2= 2
##$SINO= 400
##$SIOLD= 16384
##$SREGLST= <1H.CDCl3>
##$SSB= 0
##$STSI= 0
##$STSR= 0
##$SW_p= 3205.1282051282
##$SYMM= 0
##$S_DEV= 0
##$TDeff= 0
##$TDoff= 0
##$TI= <>
##$TILT= no
##$TM1= 0
##$TM2= 0
##$TOPLEV= 0
##$USERP1= <user>
##$USERP2= <user>
##$USERP3= <user>
##$USERP4= <user>
##$USERP5= <user>
##$WDW= 1
##$XDIM= 8192
##$YMAX_p= 0
##$YMIN_p= 0
$$ End of Bruker specific parameters
$$ ---------------------------------
##NTUPLES= NMR FID
##VAR_NAME=  TIME,          FID/REAL,        FID/IMAG
##SYMBOL=    X,             R,               I
##VAR_TYPE=  INDEPENDENT,   DEPENDENT,       DEPENDENT
##VAR_FORM=  AFFN,          ASDF,            ASDF
##VAR_DIM=   8192,          8192,            8192
##UNITS=     SECONDS,       ARBITRARY UNITS, ARBITRARY UNITS
##FACTOR=    0.0002768,     1,               1
##FIRST=     0,             0,               0
##LAST=      2.2672688,     0,               0
##MIN=       0,             -281351,         0
##MAX=       2.2672688,     234516,          0
$$ Real data points
##PAGE= N=1
##DATA TABLE= (X++(R..R)), XYDATA
0 0 0 0 0 0 0 0 0 0 0 8 -8 8 -9 16 -16 24 -32 32 -41 56 -64 75 -88 104 -122 144 -167 192 -223 255 -290 330
32 330 -376 424 -478 537 -603 675 -754 840 -935 1039 -1151 1272 -1405 1552 -1709 1884
48 1884 -2075 2285 -2515 2771 -3055 3368 -3723 4121 -4574 5095 -5701 6417 -7273 8325
62 8325 -9645 11361 -13683 17016 -22201 31429 -52748 195366 73064 -183221 42833 -107571
74 -107571 193684 -165365 98116 128896 -267670 86995 -11784 128532 -51266 -138256 234516
85 234516 -218376 19031 102289 36007 21181 -281351 206945 35524 -84129 106449 -114456
96 -114456 72689 -151109 115398 167278 -238348 63331 -33807 78112 -26720 -80423 223972
107 223972 -200907 -29413 74289 30416 75912 -202221 135442 -37037 -85400 165128
117 165128 -55937 32232 -167504 70326 164756 -172256 78861 -42660 20034 -24046 -54407
128 -54407 207743 -151985 -27381 40953 -20417 80522 -109768 125934 -64410 -118792 142221
139 142221 -12666 53922 -129501 11243 106144 -122497 101771 -20543 -13412 -28491 -50955
150 -50955 163101 -99965 -2461 35519 -56117 44322 -63409 124804 -34399 -116507 83200
161 83200 -21040 66226 -58884 -2542 48406 -113302 96043 8892 -11252 -21581 -55637
172 -55637 109814 -71435 16624 45708 -57272 17455 -58332 95710 1048 -73149 50325
183 50325 -50508 42775 -10353 14158 29294 -103939 59413 12781 3530 1955 -48094 59221
195 59221 -55265 17235 45617 -36135 12929 -51609 46684 9335 -28082 44763 -50600 6858
207 6858 -3086 22279 33979 -69045 22290 -2425 4843 19827 -25251 28539 -42471 5662
219 5662 32267 -16629 17946 -32267 12517 -1429 -10541 42309 -26299 -5865 -12927 7909 32837
232 32837 -26855 10201 -15196 -5808 19811 -5946 18167 -25389 -4089 12953 -7884 18688
244 18688 -11107 1056 -7949 -10034 25067 -3225 1374 -12436 -8648 14857 -473 11174 -10344
257 -10344 -11814 5272 1702 12718 -5991 -5611 -1348 -4469 9559 2035 1460 -4858 -8353 3286
271 3286 4511 7568 -2014 -9787 -3541 4105 8672 1661 -5691 -6171 -427 4825 6024 -755 -5922
286 -5922 -2097 -575 4517 2465 627 -1644 -8153 2184 4648 4640 -646 -8888 540 -126 6426 3989
302 3989 -6909 -2089 -3909 7095 3563 -3846 1351 -6136 2344 1141 2001 4368 -8009 318 -1392
317 -1392 2869 5797 -4455 82 -6244 2364 7025 -1788 279 -6777 1688 3417 -464 3572 -4953
332 -4953 -539 -371 572 4674 -2609 34 -2662 -1443 3894 1242 1217 -4085 -2883 2830 2442 1319
348 1319 -1948 -2933 210 1465 1685 1310 -3280 -612 436 -172 3249 -1997 1208 -2376 -2731 5680
364 5680 -1587 2588 -3873 -2498 5212 -4156 6468 -3632 -3013 3210 -4658 9438 -6650 -45
378 -45 3890 -7719 8652 -6786 6063 -132 -9935 11906 -8917 7338 -1790 -5332 9948 -15272
392 -15272 14073 -2349 -5709 7570 -13277 17401 -11781 587 11044 -17070 15016 -12790
404 -12790 9853 2626 -17590 22791 -18429 8861 476 -7364 18394 -28470 21033 -1891 -10196
417 -10196 15514 -21533 24845 -18806 377 20974 -27960 21808 -17325 11988 4533 -26130
429 -26130 36182 -26566 7816 3184 -10704 27067 -39167 27643 -1528 -17922 24687 -26877
441 -26877 30509 -25079 -1187 31322 -38886 28136 -19183 12118 6526 -34814 49088 -33605
453 -33605 6662 7534 -16427 34556 -48203 35489 -1003 -28060 34595 -32217 36266 -30395
465 -30395 -3091 41513 -51511 35688 -19896 10973 8771 -43316 61782 -41452 5456 14417
477 14417 -23074 39651 -55742 43098 717 -38531 43704 -36344 38738 -32053 -4762 49213
489 49213 -62209 40846 -17326 7120 11544 -48306 69151 -46235 2938 22370 -29042
500 -29042 41792 -58739 46079 3187 -46230 51342 -39848 37686 -30215 -6318 54696 -70982
512 -70982 45115 -14484 1975 15366 -51974 74747 -51139 986 30491 -35688 44466
523 44466 -60807 48084 4510 -52871 60258 -43819 35295 -27606 -7472 59086 -77988
534 -77988 48653 -11640 -4243 19693 -53014 76113 -53011 -1234 36945 -40985 44830 -57337
546 -57337 44828 5813 -55565 64500 -43868 29592 -21666 -9926 58738 -77154 47842
557 47842 -8043 -11019 23512 -50519 71721 -50454 -3413 40745 -44591 43650 -50991 39819
569 39819 6583 -56303 66700 -43394 24752 -15639 -12429 56915 -75516 48220 -5730
580 -5730 -16953 27006 -48358 67320 -47950 -3987 42741 -47972 42813 -44699 34250 7360
592 7360 -54653 65512 -42284 20546 -8752 -15114 51946 -68935 44869 -3250 -20565 28672
604 28672 -43803 57444 -40285 -4771 40883 -46580 38278 -35395 25789 8706 -48753 58613
616 58613 -37753 14935 -1846 -16142 44523 -59300 38814 -811 -22007 28730 -38235 46926
628 46926 -33039 -4709 37877 -43956 34102 -28159 18721 9346 -42357 52028 -34504 11373
640 11373 2661 -16691 38427 -50041 32863 -427 -21147 28243 -33276 37028 -25535 -4717
652 -4717 32705 -38373 29326 -21366 11394 9824 -34032 42035 -27971 7354 5426 -15832 30476
665 30476 -37328 24069 546 -18686 24396 -25387 25877 -17231 -5080 25720 -30007 22506
677 22506 -14094 5367 8739 -25367 31551 -20689 4274 6187 -13877 22754 -26213 17150
689 17150 633 -15344 19772 -19132 18049 -10899 -4642 18755 -22566 17337 -9457 1954
701 1954 7447 -18331 21999 -14433 3069 5470 -11436 15777 -16785 10918 790 -10790 13637
714 13637 -12854 10925 -5369 -3637 11539 -14267 10694 -4859 27 5222 -10810 12055 -7846
727 -7846 1491 4010 -7143 8379 -8429 5272 983 -5885 7269 -6788 4930 -1722 -1924 5522
741 5522 -6945 4933 -2019 -308 2871 -4738 4695 -3310 770 1909 -3012 3169 -3058 1562 393
756 393 -1565 2297 -2327 1121 -230 -284 1013 -1154 645 -495 78 318 179 -500 30 191 -427 989
774 989 -1076 1086 -845 -536 1872 -1959 1852 -1502 162 1360 -2629 3364 -2445 570 814 -2334
790 -2334 3780 -3679 2168 28 -2481 3822 -3893 3411 -1614 -1519 3818 -4670 4244 -2414 -174 2543
806 2543 -4777 5425 -3664 959 1638 -4129 5367 -4820 2866 378 -3617 5141 -5219 4086 -1252
821 -1252 -2096 4574 -5760 4979 -2366 -547 3323 -5481 5594 -3719 968 2224 -4754 5418
835 5418 -4613 2471 791 -3652 5065 -5147 3425 -524 -2181 4225 -5186 4136 -1788 -855 3327
850 3327 -4621 4185 -2781 540 2194 -3900 4099 -3202 1308 969 -2645 3672 -3522 1860 182
865 182 -1683 2802 -3018 2158 -767 -905 2248 -2339 1741 -1043 -126 1330 -1756 1520 -805 -170
881 -170 637 -813 960 -585 -235 532 -460 184 272 -533 451 -398 -149 997 -1287 1021 -501 -446 1451
900 1451 -1972 1985 -1160 -371 1754 -2643 3030 -2195 329 1659 -3247 3990 -3347 1650 853 -3527
916 -3527 5010 -4636 3008 -435 -2820 5413 -6338 4999 -1787 -1924 4935 -7019 7108 -4359
930 -4359 -240 4652 -7482 8026 -6437 2751 2666 -7686 9633 -8203 4632 224 -5559 9848
944 9848 -10933 7663 -1628 -4142 8519 -11151 10631 -5830 -1591 8288 -11568 11308 -8483
957 -8483 2873 5042 -11819 13800 -10808 5009 1658 -8492 13930 -14802 9416 -776 -6921
970 -6921 12144 -14824 13527 -6914 -3368 12215 -15762 14473 -10205 2682 7493 -16116 18352
983 18352 -13528 5225 3323 -11571 18157 -18784 11398 197 -10079 15956 -18204 16132
995 16132 -7694 -5283 16116 -19680 16977 -10882 1769 9934 -19758 21691 -14853 4228
1007 4228 5626 -14349 20812 -20672 11565 2099 -13213 18620 -19714 16455 -6765 -7587 19084
1020 19084 -22063 17669 -9919 -45 12144 -22199 23566 -15061 2701 8085 -16631 22577
1032 22577 -21809 11610 3818 -15990 21102 -21043 16762 -6172 -9220 21707 -24582 18724
1044 18724 -9341 -1470 13932 -24242 25309 -15603 1513 10239 -18564 23635 -22203 11127
1056 11127 5319 -18076 22595 -21158 15606 -4576 -10714 22890 -24959 17753 -7229 -3632
1068 -3632 15126 -24106 24220 -13817 -689 12175 -19062 22437 -19983 8909 7012 -19018
1080 -19018 22406 -19435 12994 -2403 -11667 22823 -24114 16122 -5059 -5478 15586 -23272
1092 -23272 22864 -12499 -2139 13355 -19298 21347 -18299 7555 7725 -19342 22199 -18329
1104 -18329 11180 -920 -12009 22122 -22949 14734 -3445 -6730 15555 -21612 20522 -10472
1116 -10472 -3317 13672 -18348 18924 -15053 5122 8281 -18203 19942 -15253 7921 1174
1128 1174 -11734 19535 -19439 11479 -1026 -7719 14241 -18178 16431 -7527 -4418 13058
1140 13058 -16226 15432 -11353 2936 8096 -16196 17178 -12380 5421 2349 -10697 16739
1152 16739 -16350 9303 41 -7604 12735 -15316 13396 -5789 -4279 11673 -14102 12795
1164 12795 -8742 1622 7244 -13638 14208 -9843 3596 2898 -9201 13363 -12627 6715
1176 6715 931 -6896 10359 -11508 9369 -3450 -4121 9447 -10745 8922 -5318 29 6031
1189 6031 -10177 10094 -6371 1427 3159 -7056 9360 -8398 4002 1520 -5613 7560 -7712
1202 -7712 5848 -1687 -3381 6905 -7532 5864 -3064 -581 4432 -6990 6755 -4105 562
1215 562 2541 -4955 6112 -5280 2349 1217 -3881 4964 -4755 3291 -689 -2295 4263 -4464 3228
1230 3228 -1345 -761 2710 -3801 3447 -1822 -157 1720 -2614 2798 -2094 643 971 -1977 2134
1245 2134 -1636 817 196 -1149 1608 -1392 679 63 -623 888 -883 533 -29 -422 547 -418 81
1262 81 153 -300 287 -106 -236 488 -552 302 146 -586 849 -846 552 37 -730 1273 -1352 931
1280 931 -166 -658 1420 -1786 1572 -693 -454 1509 -2065 2044 -1368 155 1254 -2304 2552 -1979
1296 -1979 782 686 -2091 2873 -2714 1539 85 -1719 2809 -3127 2393 -830 -1118 2665 -3337 2942
1312 2942 -1683 -192 2094 -3366 3476 -2445 670 1317 -2929 3671 -3184 1640 466 -2382 3525
1327 3525 -3589 2525 -593 -1566 3207 -3780 3156 -1549 -570 2510 -3684 3629 -2416 408 1656
1342 1656 -3249 3753 -3107 1402 694 -2591 3598 -3488 2220 -324 -1721 3162 -3608 2863 -1223
1357 -1223 -785 2498 -3392 3219 -2016 197 1684 -2972 3263 -2533 1060 744 -2295 3089 -2851
1372 -2851 1697 -91 -1484 2573 -2845 2198 -847 -723 1946 -2547 2331 -1440 80 1239 -2142
1387 -2142 2231 -1696 671 485 -1504 1976 -1811 1049 -73 -851 1439 -1633 1281 -550 -291 938
1403 938 -1228 1191 -809 220 399 -805 920 -801 504 -103 -275 547 -627 552 -425 208 39
1420 39 -279 417 -514 542 -491 242 61 -417 659 -841 797 -504 -45 610 -1039 1203 -1113
1437 -1113 619 185 -1066 1566 -1614 1243 -488 -580 1638 -2188 1964 -1102 -31 1252 -2293 2692
1453 2692 -2087 682 908 -2152 2849 -2840 1822 24 -1973 3114 -3265 2492 -1045 -1020 2967 -3936
1469 -3936 3384 -1784 -234 2168 -3794 4261 -3137 754 1726 -3485 4289 -4056 2387 412 -3211
1484 -3211 4677 -4574 3279 -1103 -1728 4393 -5553 4572 -2147 -634 3217 -5216 5777 -4152 833
1499 833 2560 -4826 5724 -5282 3082 627 -4348 6264 -5966 4089 -1276 -2337 5674 -7115
1513 -7115 5718 -2476 -1133 4212 -6506 6985 -4820 593 3567 -6085 6778 -5854 3054
1526 3054 1345 -5563 7469 -6603 4000 -567 -3327 6803 -7969 5936 -1875 -2193 5331 -7299
1540 -7299 7384 -4654 -170 4708 -7133 7314 -5857 2638 2082 -6547 8365 -7032 3802
1553 3802 -12 -4055 7528 -8673 6274 -1686 -2867 6062 -7924 7786 -4810 -439 5385
1566 5385 -7890 7791 -5937 2416 2541 -7142 8927 -7203 3509 612 -4666 7944 -8738
1579 -8738 5983 -980 -3693 6651 -7944 7273 -3968 -1355 6120 -8149 7360 -4932 1242
1592 1242 3397 -7483 8665 -6419 2307 1761 -5292 7794 -8052 4998 2 -4468 6907
1605 6907 -7506 6367 -3050 -1957 6372 -8033 6857 -4138 549 3689 -7316 8270 -5912
1618 -5912 1793 2174 -5323 7445 -7428 4471 341 -4565 6726 -6969 5592 -2396 -2235 6175
1632 6175 -7504 6055 -3236 -205 3850 -6800 7267 -4811 820 2740 -5239 6515 -6004
1645 -6004 3091 1184 -4720 6149 -5712 3994 -1059 -2723 5748 -6406 4671 -1834 -1098 3877
1659 3877 -5858 5847 -3477 -30 2997 -4748 5379 -4592 2062 1461 -4310 5268 -4614 2933 -441
1674 -441 -2562 4862 -5267 3687 -1222 -1246 3369 -4787 4596 -2607 -310 2681 -3979 4198 -3360
1689 -3360 1252 1479 -3597 4165 -3355 1778 213 -2345 3828 -3826 2336 -271 -1563 2866 -3458
1704 -3458 2949 -1255 -893 2491 -3033 2737 -1767 167 1625 -2819 2842 -1923 572 760 -1992
1719 -1992 2637 -2348 1110 341 -1468 2066 -2156 1564 -406 -949 1812 -1938 1509 -752 -242 1238
1735 1238 -1774 1606 -884 2 754 -1282 1449 -1073 288 551 -1057 1154 -920 413 251 -835
1751 -835 1058 -826 323 203 -631 849 -769 345 193 -656 772 -646 269 176 -625 794 -674
1768 -674 248 225 -646 802 -688 302 206 -682 882 -770 371 165 -671 962 -899 521 65 -655
1786 -655 1028 -1039 705 -90 -548 1060 -1200 938 -321 -414 1020 -1321 1178 -652 -154 923
1802 923 -1404 1386 -960 183 655 -1360 1600 -1298 549 362 -1199 1632 -1591 978 -38 -960
1818 -960 1605 -1762 1339 -490 -547 1443 -1863 1659 -923 -108 1116 -1786 1894 -1350 362 723
1834 723 -1581 1943 -1694 873 235 -1281 1881 -1900 1293 -299 -837 1673 -2008 1626 -795 -342
1850 -342 1329 -1922 1873 -1247 184 900 -1712 1941 -1590 701 378 -1352 1865 -1815 1157 -146
1866 -146 -901 1652 -1873 1516 -660 -414 1313 -1799 1709 -1048 116 855 -1559 1748 -1396 586
1882 586 348 -1202 1625 -1588 982 -139 -787 1358 -1599 1253 -613 -295 1022 -1470 1381 -930
1898 -930 177 589 -1190 1377 -1144 561 155 -805 1216 -1213 862 -247 -409 910 -1131 1016
1914 1016 -600 10 561 -937 1015 -814 370 156 -635 906 -917 651 -228 -279 659 -878 808
1931 808 -575 122 313 -713 856 -799 476 -74 -398 744 -905 767 -441 -18 470 -824 947
1948 947 -802 382 115 -596 918 -1015 810 -312 -276 775 -1052 1051 -778 214 456 -1015 1223
1965 1223 -1097 653 -21 -725 1255 -1430 1053 -450 -332 1016 -1526 1500 -986 89 769 -1423
1981 -1423 1664 -1477 730 342 -1319 1802 -1753 1194 -279 -866 1800 -2110 1677 -739 -360 1408
1997 1408 -2152 2215 -1442 168 1090 -1961 2308 -2052 1016 435 -1794 2423 -2356 1610 -425
2012 -425 -1089 2303 -2763 2182 -1044 -379 1686 -2673 2799 -1925 328 1234 -2348 2809 -2545 1371
2028 1371 403 -2067 2911 -2806 1967 -541 -1218 2731 -3264 2593 -1138 -518 2061 -3133 3232 -2104
2044 -2104 194 1646 -2842 3237 -2755 1304 760 -2622 3416 -3084 1910 -241 -1700 3234 -3660
2059 -3660 2681 -928 -967 2508 -3498 3415 -2084 -72 2051 -3217 3443 -2786 1207 976 -2905 3681
2075 3681 -3198 1889 -129 -1827 3386 -3797 2758 -872 -1063 2631 -3559 3477 -2079 -140 2177
2090 2177 -3316 3464 -2730 1071 1122 -3049 3749 -3123 1653 163 -2083 3501 -3756 2513 -488
2105 -488 -1485 2870 -3560 3206 -1660 -616 2560 -3477 3285 -2275 567 1556 -3230 3699 -2802 1188
2121 1188 628 -2301 3450 -3455 2166 -132 -1713 2906 -3317 2841 -1338 -760 2531 -3292 2977
2136 2977 -1967 370 1500 -3014 3339 -2503 948 679 -2172 3103 -3079 1822 27 -1689 2672
2151 2672 -2930 2378 -988 -899 2413 -2957 2511 -1434 -31 1622 -2776 2894 -1929 431 1032 -2166
2167 -2166 2739 -2436 1211 463 -1840 2477 -2417 1694 -426 -1148 2275 -2547 1913 -878 -397 1588
2183 1588 -2386 2293 -1396 70 1072 -1885 2159 -1842 789 530 -1567 1990 -1819 1185 -164
2198 -164 -984 1806 -1911 1394 -507 -437 1298 -1794 1655 -893 -122 989 -1476 1568 -1180 358
2214 358 616 -1323 1493 -1210 587 178 -977 1394 -1342 744 -21 -670 1121 -1280 965 -324
2230 -324 -438 949 -1121 960 -534 -96 691 -1041 953 -586 97 410 -793 924 -682 242 253
2247 253 -589 748 -664 374 68 -457 647 -596 373 -53 -294 519 -576 369 -85 -244 417 -498
2265 -498 369 -134 -193 414 -484 364 -150 -159 379 -496 397 -177 -138 378 -490 437 -226 -87 377 -532 501
2286 501 -263 -21 343 -536 554 -370 47 299 -549 602 -451 151 220 -529 648 -560 251 123 -493
2305 -493 669 -668 386 -23 -411 662 -738 529 -174 -278 626 -791 662 -345 -131 534 -791
2322 -791 796 -528 80 416 -761 867 -692 305 201 -654 896 -826 504 -14 -488 838 -919
2339 -919 704 -253 -291 721 -941 845 -488 -61 560 -915 941 -699 186 348 -802 963 -841
2356 -841 429 92 -605 910 -939 649 -165 -400 807 -965 807 -416 -125 625 -923 919 -617
2373 -617 125 404 -813 943 -783 366 154 -638 899 -880 580 -110 -409 778 -916 726 -354
2390 -354 -170 590 -855 820 -550 77 366 -733 832 -701 328 126 -552 779 -780 521 -114
2407 -114 -323 665 -771 655 -315 -91 470 -704 713 -499 138 267 -569 683 -603 323 34 -408
2425 -408 605 -633 460 -163 -197 471 -612 544 -342 2 295 -528 555 -462 195 90 -388 518
2443 518 -529 356 -106 -205 418 -521 468 -277 2 260 -450 509 -421 203 72 -327 481 -485 353 -128
2463 -128 -165 375 -507 454 -299 30 221 -458 505 -445 200 33 -319 457 -530 374 -139 -171 379 -523 483
2484 483 -327 44 249 -477 540 -453 231 52 -353 571 -565 388 -125 -189 467 -614 587 -336 -27
2503 -27 365 -597 657 -545 214 199 -563 706 -657 424 -52 -404 711 -797 593 -256 -177 553
2521 553 -827 788 -491 4 412 -720 826 -713 319 207 -636 837 -779 544 -102 -394 794
2538 794 -891 688 -309 -137 576 -866 883 -550 55 404 -740 881 -787 373 188 -685 891
2555 891 -850 567 -136 -454 879 -996 742 -307 -211 654 -1012 972 -589 -24 536 -884 984
2572 984 -816 321 318 -836 1047 -911 556 -27 -569 1015 -1075 764 -222 -306 779 -1048 990
2589 990 -532 -91 622 -913 965 -771 278 347 -847 980 -827 464 12 -566 945 -991 641
2606 641 -150 -358 713 -967 868 -442 -170 659 -886 869 -638 161 449 -883 969 -723 321
2623 321 174 -656 993 -931 539 23 -497 826 -949 769 -289 -332 770 -919 795 -489 -13
2640 -13 540 -909 891 -587 149 285 -689 891 -787 357 142 -529 733 -767 558 -133 -376
2657 -376 704 -741 582 -278 -89 522 -738 694 -372 1 331 -603 703 -552 171 260 -547 642
2675 642 -580 352 33 -449 664 -636 400 -95 -272 558 -710 551 -211 -181 449 -607 600 -389
2693 -389 -1 380 -579 571 -419 150 189 -492 607 -480 205 76 -344 509 -516 337 -2 -286 439
2712 439 -457 362 -136 -155 401 -453 362 -181 -60 266 -431 418 -261 -22 217 -377 390 -328 98 142 -369
2733 -369 408 -342 170 46 -283 416 -408 236 -5 -209 365 -410 329 -99 -154 335 -408 336 -183 -52
2753 -52 284 -397 377 -221 1 201 -368 402 -285 54 156 -332 388 -337 140 78 -301 375 -347 193 3
2774 3 -234 358 -390 250 -51 -178 330 -394 315 -138 -86 292 -401 365 -213 -5 217 -371 398 -287 83
2795 83 135 -332 400 -355 175 48 -275 396 -407 254 -41 -199 371 -430 326 -136 -123 314 -435 374 -227
2816 -227 -26 238 -399 417 -297 77 154 -357 427 -360 164 73 -292 412 -403 259 -33 -202 387 -429 347
2837 347 -137 -100 323 -431 390 -233 -12 228 -404 423 -324 98 146 -342 412 -391 200 14 -269 394 -426
2858 -426 292 -87 -161 345 -436 361 -196 -47 274 -413 413 -285 53 178 -374 439 -355 176 65 -301
2878 -301 419 -410 259 -58 -192 367 -430 345 -159 -79 284 -423 387 -257 33 189 -370 408 -344 131
2898 131 81 -297 399 -400 249 -39 -198 362 -407 340 -154 -87 283 -406 395 -252 47 193 -354 429 -347
2919 -347 160 73 -275 400 -393 275 -60 -181 361 -438 347 -184 -69 269 -416 401 -304 53 165 -373
2939 -373 436 -388 183 30 -290 419 -435 315 -87 -163 366 -457 411 -216 -33 284 -434 464 -335 107
2959 107 162 -382 481 -437 251 2 -274 459 -512 391 -139 -147 397 -529 472 -306 2 272 -513 534
2979 534 -440 167 145 -433 557 -548 323 -29 -306 527 -615 461 -205 -146 452 -621 590 -364 21
2998 21 335 -583 645 -518 201 175 -499 665 -637 386 -23 -374 636 -725 546 -227 -199 535
3016 535 -747 683 -431 -10 393 -715 758 -620 223 207 -618 789 -755 448 -25 -441 779
3033 779 -855 636 -241 -229 649 -876 806 -486 -18 490 -823 901 -691 246 286 -733 932
3050 932 -841 489 28 -554 901 -965 697 -227 -323 774 -1007 883 -493 -96 598 -950 986
3067 986 -736 202 379 -870 1042 -900 477 98 -670 1036 -1050 729 -160 -432 908 -1108 965
3084 965 -464 -160 750 -1076 1080 -752 171 499 -1008 1154 -947 453 193 -789 1162 -1147 723
3101 723 -106 -551 1022 -1200 983 -425 -271 846 -1166 1125 -725 64 619 -1108 1203 -932
3117 -932 367 293 -895 1223 -1132 671 23 -650 1110 -1213 947 -337 -387 969 -1220 1086 -638
3134 -638 -41 712 -1175 1220 -883 274 402 -985 1245 -1109 569 109 -767 1149 -1215 870
3150 870 -232 -495 1038 -1239 1042 -551 -145 793 -1201 1185 -792 153 511 -1029 1236 -1013
3166 -1013 471 229 -825 1165 -1117 753 -111 -567 1052 -1175 929 -407 -265 838 -1158 1084
3182 1084 -659 23 587 -1021 1137 -893 316 320 -868 1098 -1018 588 13 -626 1022 -1077 789
3199 789 -264 -357 847 -1073 947 -509 -73 628 -970 1021 -730 205 402 -837 1007 -863 453
3216 453 111 -639 942 -938 624 -134 -398 796 -949 762 -358 -176 608 -872 842 -554 58
3233 58 425 -763 844 -669 271 202 -618 826 -750 433 -3 -426 712 -768 594 -194 -237 589
3251 589 -734 652 -362 -29 443 -655 687 -485 130 253 -560 664 -572 267 77 -430 592
3268 592 -607 378 -71 -279 501 -577 458 -207 -120 397 -545 484 -301 6 276 -468 488 -364 119
3287 119 154 -369 454 -406 214 36 -270 408 -401 269 -48 -166 340 -376 302 -132 -90 255 -357 314 -190
3308 -190 -16 181 -307 302 -230 52 109 -259 292 -245 110 43 -202 266 -254 146 -6 -140 242 -236 171
3329 171 -51 -98 197 -232 185 -81 -49 162 -193 194 -110 -14 118 -196 190 -125 18 80 -178 184 -150
3350 -150 40 52 -156 179 -168 70 17 -123 164 -171 90 -12 -105 151 -181 122 -41 -67 149 -170 145
3371 145 -73 -28 127 -166 166 -103 7 89 -142 162 -130 49 43 -124 168 -164 82 -3 -103 155 -176 121
3393 121 -52 -59 124 -170 144 -96 1 81 -158 150 -123 45 36 -135 157 -164 92 -13 -74 150 -160 132
3415 132 -73 -25 121 -159 150 -112 32 63 -129 166 -154 97 -13 -92 158 -172 135 -67 -28 105 -186
3436 -186 180 -147 37 46 -169 186 -190 103 -23 -107 185 -225 174 -99 -39 150 -227 247 -172 55 77 -202
3458 -202 261 -237 147 -7 -147 266 -287 243 -92 -74 224 -312 300 -202 30 155 -312 359 -310 133
3478 133 47 -267 369 -387 252 -65 -179 357 -436 368 -200 -57 297 -452 461 -330 83 192 -422 517
3498 517 -454 243 65 -340 542 -559 391 -94 -234 499 -610 526 -282 -75 404 -621 630 -451
3516 -451 117 263 -580 696 -601 305 80 -470 694 -719 501 -120 -304 638 -778 670 -346
3533 -346 -108 536 -784 784 -542 119 359 -720 869 -722 363 143 -581 874 -873 589 -102
3550 -102 -419 803 -960 790 -372 -187 686 -960 941 -619 101 466 -889 1026 -832 353
3566 353 204 -738 1037 -1002 636 -60 -528 955 -1091 863 -367 -255 811 -1097 1024 -638
3582 -638 43 573 -1020 1133 -873 350 301 -848 1158 -1072 638 1 -634 1065 -1172 904 -333
3599 -333 -357 926 -1210 1085 -626 -48 684 -1165 1213 -901 273 408 -994 1253 -1121 598
3615 598 108 -767 1183 -1218 873 -245 -476 1051 -1275 1089 -564 -141 805 -1212 1235 -841
3631 -841 196 520 -1057 1273 -1076 529 185 -833 1210 -1203 816 -162 -550 1067 -1272 1020
3647 1020 -484 -231 848 -1229 1173 -765 84 587 -1090 1248 -990 433 287 -898 1203 -1148
3663 -1148 714 -56 -638 1106 -1225 941 -350 -330 912 -1194 1108 -638 -21 666 -1090 1180
3679 1180 -884 299 377 -917 1153 -1028 588 48 -671 1056 -1105 789 -235 -385 878 -1089
3695 -1089 947 -511 -103 653 -1022 1021 -715 191 415 -857 1024 -859 430 148 -665 960
3711 960 -934 641 -105 -425 831 -955 791 -353 -192 661 -911 858 -552 54 437 -801 874
3728 874 -681 266 214 -638 833 -781 455 -6 -450 729 -801 597 -198 -243 578 -756 666 -368
3746 -368 -48 429 -674 688 -488 141 245 -522 653 -573 269 82 -428 597 -589 379 -74 -254
3764 -254 499 -602 519 -256 -90 343 -581 478 -315 20 242 -438 473 -366 123 128 -354 449 -403 213
3784 213 22 -253 389 -394 278 -63 -152 309 -369 299 -130 -59 231 -318 306 -177 15 164 -265 276 -216
3805 -216 74 80 -202 246 -213 100 32 -161 205 -200 112 -5 -116 173 -192 120 -40 -76 136 -170 113
3826 113 -50 -54 117 -149 119 -41 -35 108 -132 123 -59 -8 89 -127 121 -77 -13 85 -129 129 -78 3 77
3849 77 -135 130 -95 7 60 -134 138 -117 22 39 -120 143 -129 50 23 -113 156 -149 84 -4 -97 152
3871 152 -172 124 -34 -71 148 -183 160 -64 -29 128 -187 189 -107 17 98 -174 195 -158 51 37 -147
3892 -147 191 -185 100 1 -112 182 -205 132 -67 -73 151 -205 171 -105 -14 99 -189 191 -144 38 64 -151
3914 -151 179 -172 98 2 -102 168 -172 132 -48 -56 144 -176 164 -80 -2 98 -161 165 -126 42 32 -125
3936 -125 150 -152 92 -14 -79 123 -151 114 -69 -23 82 -145 133 -109 43 37 -103 124 -124 81 -24
3957 -24 -52 107 -130 112 -89 -2 67 -112 131 -105 74 4 -83 113 -142 105 -57 -21 81 -139 149 -125
3979 -125 48 35 -126 163 -176 106 -38 -77 136 -200 163 -109 -22 112 -199 205 -170 68 47 -179 227
4000 227 -236 148 -18 -121 235 -277 236 -104 -47 209 -289 306 -208 43 130 -284 344 -291 143 36 -242
4021 -242 353 -362 253 -62 -162 330 -415 359 -187 -61 265 -418 420 -316 78 170 -386 457 -411 222
4041 222 48 -306 475 -480 352 -101 -190 428 -527 466 -238 -65 344 -536 546 -385 102 232 -501 586
4061 586 -512 264 79 -401 593 -619 406 -96 -277 544 -666 550 -275 -113 457 -662 656 -449
4079 -449 75 315 -610 709 -583 271 136 -511 722 -690 457 -61 -351 656 -754 596 -271
4096 -271 -161 539 -759 711 -460 42 372 -694 766 -616 256 187 -589 783 -736 445 -28
4113 -28 -435 720 -822 613 -239 -237 616 -831 754 -439 -23 482 -787 836 -624 203 293 -672
4131 -672 862 -749 420 58 -523 812 -850 606 -177 -315 703 -875 758 -403 -101 542 -827
4148 -827 832 -586 140 336 -735 849 -725 345 115 -570 816 -830 543 -94 -371 710 -833
4165 -833 694 -308 -165 586 -814 778 -507 62 403 -733 841 -650 272 199 -598 822 -764
4182 -764 469 -15 -447 748 -824 621 -236 -245 620 -805 715 -423 -33 452 -740 759 -574
4199 -574 177 262 -621 756 -681 365 61 -458 701 -719 519 -141 -270 598 -708 609 -293 -75
4217 -75 458 -652 651 -439 90 286 -567 663 -542 242 113 -453 610 -600 364 -43 -308 545
4235 545 -613 469 -194 -148 439 -595 534 -325 -3 324 -523 557 -411 144 184 -422 524 -475 262
4254 262 43 -309 490 -493 336 -87 -186 394 -478 387 -189 -71 307 -416 418 -270 37 186 -353 382
4274 382 -310 120 78 -282 356 -354 188 -6 -196 305 -334 235 -78 -121 256 -302 259 -131 -33 191 -281
4295 -281 281 -176 18 144 -224 281 -193 75 91 -204 247 -221 114 8 -136 202 -210 133 -21 -92 168
4316 168 -215 145 -61 -62 131 -175 133 -73 -35 99 -150 143 -69 -4 84 -131 128 -86 6 73 -128 128
4338 128 -86 17 63 -105 132 -91 23 46 -100 130 -103 40 27 -91 127 -119 70 -1 -98 129 -148 75
4360 75 -23 -80 122 -147 100 -39 -49 123 -158 125 -70 -25 102 -155 151 -100 1 83 -157 178 -122 41
4382 41 52 -150 172 -159 86 19 -122 168 -171 116 -23 -57 148 -203 149 -81 -43 121 -197 170 -114 -4
4404 -4 94 -183 191 -158 50 45 -139 190 -183 111 8 -113 172 -196 149 -52 -64 142 -194 172 -99 -10
4426 -10 106 -185 177 -147 54 65 -144 179 -169 91 -12 -104 152 -180 123 -60 -67 124 -181 143 -101 -2
4448 -2 88 -165 156 -132 53 27 -110 147 -151 95 -16 -60 122 -152 131 -66 1 85 -131 146 -99 44
4470 44 31 -92 138 -130 88 -31 -47 105 -140 121 -75 -1 72 -132 134 -121 50 23 -82 134 -148 99
4492 99 -46 -42 92 -145 144 -96 23 58 -132 158 -139 91 3 -91 149 -170 130 -61 -33 127 -174 177
4514 177 -118 22 83 -173 201 -183 90 3 -137 209 -241 176 -65 -78 204 -258 242 -150 1 152 -258
4535 -258 278 -225 87 76 -218 297 -286 187 -5 -161 296 -321 274 -114 -71 250 -349 319 -218 24 186
4556 186 -327 376 -297 128 82 -285 381 -369 222 -39 -206 363 -425 331 -154 -97 310 -432 402 -279 24
4577 24 205 -416 459 -373 158 111 -351 483 -464 303 -27 -250 455 -508 411 -176 -130 385 -525 493 -302
4598 -302 16 290 -504 555 -435 172 143 -431 558 -537 309 2 -325 511 -580 432 -166 -173 442 -592
4618 -592 526 -313 -12 331 -548 586 -449 138 198 -474 598 -539 303 44 -363 584 -605 441
4636 441 -146 -219 502 -639 556 -297 -64 391 -616 618 -447 113 240 -547 655 -572 284 81
4654 81 -428 623 -645 420 -99 -284 557 -663 545 -273 -116 438 -640 610 -413 63 298 -562
4672 -562 640 -528 234 118 -440 604 -588 380 -35 -307 558 -630 483 -192 -156 449 -618 572
4690 572 -350 6 320 -558 603 -473 168 168 -469 600 -560 318 15 -353 560 -598 445 -142 -199
4709 -199 489 -598 531 -290 -42 357 -543 574 -397 109 218 -465 565 -479 246 55 -348 515
4727 515 -514 359 -76 -217 436 -520 431 -205 -85 332 -491 449 -304 36 220 -414 480 -371 157 113
4747 113 -334 455 -424 267 -7 -235 396 -430 328 -125 -123 331 -419 386 -215 -7 237 -377 396 -287 78
4768 78 136 -315 384 -325 163 40 -223 341 -349 229 -47 -153 281 -327 252 -129 -67 213 -292 280 -174
4789 -174 7 141 -247 262 -202 78 77 -190 245 -227 116 13 -138 225 -219 147 -27 -89 176 -228 158
4810 158 -77 -43 137 -192 172 -99 -8 94 -161 178 -123 31 50 -142 155 -139 58 21 -113 144 -135
4831 -135 72 -2 -72 111 -122 89 -32 -55 102 -117 86 -20 -43 88 -112 80 -36 -32 81 -95 82 -39
4853 -39 -18 60 -108 83 -54 -16 57 -106 87 -76 -3 49 -104 102 -86 20 45 -102 112 -99 49 30 -81
4876 -81 110 -93 75 42 -56 44 -102 118 -11 -48 96 -134 111 -54 -25 91 -129 116 -76 1 70 -140
4898 -140 137 -103 28 36 -120 145 -124 47 4 -98 131 -145 90 -26 -64 131 -148 123 -58 -27 103 -160
4920 -160 147 -100 16 76 -143 146 -122 57 30 -107 150 -148 91 -15 -90 125 -151 119 -58 -51 95 -148
4942 -148 133 -91 1 69 -131 139 -116 46 26 -98 125 -140 84 -11 -75 111 -135 99 -53 -12 73 -117
4964 -117 117 -86 13 47 -100 116 -101 48 12 -79 106 -116 78 -30 -32 84 -104 100 -65 -1 44 -94 93
4987 93 -91 44 6 -66 90 -110 68 -35 -24 57 -103 88 -77 22 17 -80 98 -103 62 -9 -41 87 -108 88
5011 88 -46 -10 60 -101 99 -87 38 18 -75 114 -123 71 -31 -59 94 -136 109 -78 -3 63 -142 121 -128
5034 -128 50 37 -97 153 -145 88 -16 -81 138 -174 143 -81 -23 124 -189 180 -131 38 78 -168 215
5055 215 -190 102 11 -141 225 -227 163 -58 -74 189 -247 212 -136 -20 144 -242 251 -197 55 80 -211
5076 -211 269 -256 141 3 -167 257 -285 208 -76 -91 237 -300 278 -156 -15 183 -287 315 -235 87
5096 87 116 -258 325 -300 166 2 -205 331 -357 264 -93 -127 281 -376 335 -195 -24 207 -361 380 -285
5117 -285 76 124 -313 382 -349 193 23 -241 377 -396 277 -83 -144 326 -411 348 -186 -39 261 -380 390
5138 390 -276 64 167 -342 420 -349 175 49 -297 396 -407 269 -59 -181 348 -425 356 -185 -72 285
5158 285 -421 409 -276 58 185 -385 426 -362 172 85 -301 426 -430 266 -44 -198 383 -454 362 -164
5178 -164 -92 320 -427 415 -259 30 208 -395 424 -347 135 102 -313 407 -387 230 -7 -235 367 -429 308
5199 308 -118 -120 304 -408 358 -219 -13 232 -366 388 -295 99 135 -312 395 -353 198 19 -237 366 -377
5220 -377 271 -92 -141 302 -397 331 -192 -34 229 -362 367 -274 67 144 -307 364 -313 149 44 -237 330
5241 330 -340 216 -49 -146 278 -327 264 -128 -59 213 -308 285 -186 21 143 -260 301 -236 93 70 -204
5262 -204 273 -257 148 4 -138 242 -258 198 -74 -77 194 -262 221 -138 -15 139 -220 232 -176 51 75
5283 75 -175 222 -203 93 8 -145 200 -207 145 -33 -90 173 -203 152 -76 -22 122 -172 172 -106 12
5304 12 79 -135 166 -126 58 41 -117 139 -121 64 11 -85 117 -123 74 -21 -58 94 -110 89 -44 -21 61
5327 61 -101 81 -67 -14 42 -68 74 -58 23 29 -64 75 -64 27 16 -49 73 -52 26 10 -34 48 -42 31 -1 -37
5353 -37 52 -61 30 -9 -35 34 -47 24 -9 -37 54 -57 35 1 -31 44 -59 39 -23 -32 57 -70 42 -26 -27 59 -64 61
5381 61 -32 -8 49 -61 70 -44 3 28 -68 77 -54 17 16 -56 83 -62 42 6 -47 79 -93 49 -9 -42 82
5406 82 -83 68 -35 -17 68 -90 84 -57 -6 39 -84 90 -75 40 28 -74 103 -99 37 12 -68 109 -99
5429 -99 58 10 -41 49 -102 95 -52 -3 74 -93 102 -66 16 47 -83 111 -83 29 11 -74 87 -92 62
5452 62 -15 -44 77 -103 84 -52 -19 51 -86 91 -66 5 33 -72 96 -81 42 12 -51 89 -72 60 -19
5475 -19 -37 68 -78 69 -25 -9 49 -83 74 -60 8 28 -48 77 -70 31 -4 -40 61 -68 56 -15 -23 40 -72
5500 -72 50 -29 2 16 -46 51 -45 27 9 -32 42 -53 32 -22 -12 20 -44 34 -31 6 7 -26 32 -35 22 -11 -27 22 -45 46
5530 46 -34 -1 1 -36 37 -50 16 -10 -15 26 -51 30 -27 -12 14 -42 39 -45 16 14 -29 55 -71 38 -19 -18 57 -61 63 -42
5560 -42 1 33 -70 67 -69 20 16 -63 78 -98 49 -20 -37 67 -107 70 -57 -24 61 -114 101 -78 8 38
5584 38 -100 105 -107 54 7 -80 113 -126 83 -20 -41 106 -131 110 -59 -12 77 -117 125 -96 20 48
5606 48 -105 131 -129 62 14 -95 137 -143 91 -33 -56 120 -164 128 -69 -19 87 -154 158 -119 20
5627 20 55 -147 153 -155 81 8 -110 160 -172 122 -35 -68 145 -179 146 -72 -8 115 -175 171 -120 21
5649 21 75 -155 184 -159 68 19 -126 165 -173 113 -26 -73 147 -188 145 -73 -39 112 -179 171 -107 16
5671 16 74 -157 184 -151 67 27 -127 180 -176 123 -25 -89 156 -192 163 -71 -28 113 -194 177 -126 7
5693 7 79 -176 192 -152 64 24 -141 182 -184 107 -21 -97 148 -178 135 -67 -50 111 -174 145 -100 6
5715 6 79 -160 149 -135 46 39 -118 148 -143 82 -11 -89 134 -148 111 -47 -41 101 -151 136 -89 -7 82 -145
5739 -145 144 -115 29 33 -113 129 -135 69 -10 -86 126 -149 111 -40 -45 105 -146 116 -74 5 71 -120 118
5762 118 -101 35 37 -94 114 -105 61 -3 -63 97 -105 65 -32 -41 63 -96 76 -56 -16 47 -92 78 -61
5785 -61 16 30 -74 79 -70 36 1 -59 56 -83 47 -22 -29 56 -73 55 -41 -5 40 -68 64 -53 16 16 -53
5810 -53 55 -59 25 -6 -32 43 -58 43 -14 -20 28 -48 18 -30 1 14 -35 32 -16 9 -1 -26 27 -22 10 -16 -19 10 -25
5839 -25 4 -5 -5 10 -6 0 -16 8 5 -9 13 -9 12 -7 -3 -1 2 12 -13 7 -9 -8 -7 -5 5 -21 6 -10 -19 4 -26 20 -7 -3 11 -18
5875 -18 23 -31 16 0 -19 18 -32 13 -9 -14 13 -32 33 -13 -4 13 -38 27 -29 3 4 -31 39 -39 23 3 -24 35 -49 34 -23 -16
5907 -16 28 -52 30 -30 -13 15 -49 47 -34 6 15 -36 44 -51 13 -7 -30 46 -61 28 -14 -29 40 -54 43 -21 -7 29 -29 49
5937 49 -33 10 16 -36 63 -42 32 -3 -29 57 -63 30 -3 -26 41 -60 39 -33 -12 33 -55 49 -46 3 16 -46 50 -48 10
5966 10 6 -42 45 -18 96 -16 -42 24 -58 46 -15 -10 29 -55 44 -28 -2 21 -41 49 -35 10 18 -38 40 -37 6 -2 -34 30 -56
5997 -56 29 -15 -23 25 -41 41 -15 -10 32 -40 36 -16 0 10 -48 37 -33 -1 17 -28 34 -31 16 1 -33 30 -39 10 -2 -16 26
6028 26 -36 22 -12 -18 28 -45 27 -20 -19 17 -42 13 -20 -4 23 -30 18 -21 1 13 -32 38 -34 13 5 -13 33 -42 18 4 -15 25
6060 25 -42 18 -3 -20 31 -42 29 -21 -12 16 -58 25 -27 -15 17 -43 42 -43 5 2 -45 39 -50 11 10 -37 47 -46 16 2 -30 45
6092 45 -59 38 -14 -21 46 -60 50 -12 -8 35 -53 56 -43 6 23 -51 49 -49 20 7 -49 53 -60 21 2 -33 58 -60
6120 -60 44 -33 -22 38 -76 64 -35 -2 26 -59 62 -51 17 17 -65 70 -63 31 9 -48 63 -74 42 -14 -34 65
6146 65 -76 74 -38 -16 47 -84 81 -65 4 26 -76 77 -79 32 4 -68 64 -85 62 -16 -48 71 -87
6169 -87 65 -37 -24 46 -82 87 -63 11 28 -83 81 -71 23 3 -65 79 -86 50 -17 -52 76 -94 72
6192 72 -38 -27 50 -99 76 -75 2 31 -91 79 -88 21 6 -70 86 -89 40 -10 -55 82 -101 70 -31
6215 -31 -32 61 -103 99 -62 3 38 -94 103 -80 33 27 -75 83 -85 52 1 -47 73 -96 65 -33 -25 54 -102
6240 -102 85 -49 5 38 -84 89 -72 24 12 -66 96 -83 57 -12 -55 85 -102 66 -30 -22 67 -99 86 -47
6264 -47 5 48 -82 87 -75 30 25 -70 88 -81 50 0 -60 78 -90 62 -27 -32 50 -87 80 -57 -16 41 -86
6289 -86 79 -58 27 31 -63 85 -72 51 -9 -39 63 -80 61 -36 -30 54 -75 67 -43 -5 38 -69 78 -70
6313 -70 16 16 -62 68 -62 40 0 -44 72 -84 60 -24 -36 53 -71 59 -43 -4 40 -63 74 -49 26 21 -47
6338 -47 59 -65 40 3 -40 48 -67 53 -22 -13 49 -62 60 -36 -2 30 -46 47 -40 19 21 -42 60 -54 35 4 -23
6365 -23 50 -53 26 -8 -14 26 -47 32 -33 -6 29 -47 43 -32 14 8 -40 30 -38 20 3 -24 42 -39 28 -7 -11 29 -44 23 -23
6396 -23 -10 25 -50 35 -34 11 -4 -31 24 -37 17 -10 -25 27 -30 20 -17 -20 25 -33 22 -18 2 16 -30 26 -25 8 3 -26 26
6427 26 -30 13 -8 -14 16 -21 10 -12 3 15 -35 20 -15 -2 7 -35 19 -22 4 7 -19 23 -23 8 4 -20 12 -36 9 -4 -14 14
6459 14 -30 16 -20 -10 3 -24 19 -19 -1 4 -31 15 -35 7 -5 -18 20 -32 16 -9 -11 15 -29 28 -24 -6 16 -34 21 -31 0
6490 0 5 -37 23 -33 11 3 -29 20 -28 9 -14 -24 23 -44 14 -28 -8 30 -41 32 -19 -6 12 -34 32 -32 8 -5 -31 34 -37 7
6522 7 -12 -15 30 -55 18 -15 -19 34 -40 25 -25 -23 21 -53 36 -27 -1 16 -45 47 -48 11 -2 -45 43 -60 37 -15 -28 30 -53 37
6554 37 -22 -26 35 -65 49 -45 6 20 -52 54 -51 22 10 -38 62 -74 32 -14 -43 53 -75 47 -29 -28 49 -73
6580 -73 57 -50 9 28 -74 75 -67 15 14 -59 77 -71 48 -11 -52 85 -81 53 -28 -26 64 -101 82 -57
6604 -57 -7 49 -93 83 -68 26 23 -71 90 -85 34 -2 -74 93 -108 66 -31 -44 84 -114 87 -59 -20 59
6628 59 -115 95 -86 9 32 -93 94 -96 37 10 -79 104 -108 83 -24 -59 94 -122 101 -60 -18 75 -119
6651 -119 111 -89 13 47 -124 122 -115 49 10 -108 112 -135 67 -22 -73 117 -143 102 -51 -33 93 -140
6673 -140 128 -92 -8 55 -134 126 -106 36 33 -102 128 -134 82 -10 -83 125 -142 104 -34 -48 103 -137
6695 -137 125 -74 -7 80 -141 125 -109 30 41 -112 146 -122 65 5 -68 138 -141 107 -33 -52 112 -146
6717 -146 118 -68 -16 82 -138 147 -98 29 55 -111 135 -126 65 15 -96 132 -148 92 -28 -65 124 -152
6739 -152 113 -61 -17 89 -138 140 -90 29 73 -131 135 -114 53 15 -90 138 -125 84 -14 -56 123 -148
6761 -148 110 -52 -13 95 -128 119 -73 7 65 -115 130 -100 40 28 -88 125 -120 59 -2 -63 124 -127
6783 -127 87 -38 -33 88 -122 115 -74 -11 68 -102 121 -90 33 50 -89 119 -112 62 15 -60 99 -118
6805 -118 66 -28 -50 104 -105 100 -44 -9 66 -109 98 -69 18 42 -84 97 -76 43 27 -59 91 -87 68
6828 68 -4 -42 73 -89 76 -34 -27 67 -84 78 -56 5 45 -79 85 -56 26 21 -70 76 -86 41 -5 -48 77
6853 77 -74 44 -22 -24 59 -72 57 -37 -2 41 -71 65 -40 4 22 -53 66 -55 21 11 -45 46 -58 41 -9 -28
6879 -28 48 -52 42 -11 -13 30 -52 50 -30 -3 30 -34 43 -32 2 6 -37 51 -37 28 2 -27 42 -40 23 -6 -23 29 -36 29
6909 29 -15 -14 21 -31 32 -14 4 10 -28 23 -19 2 11 -25 34 -32 16 1 -17 31 -30 21 -9 -16 21 -33 24 -3 0 24 -24 19 -6
6942 -6 7 14 -21 16 -14 0 12 -29 25 -18 -1 13 -16 19 -18 20 -4 -20 14 -18 20 -7 -8 23 -24 21 -5 -5 4 -24 19 -20 4
6975 4 5 -18 28 -18 9 -1 -22 22 -19 9 3 -9 29 -22 18 -9 -2 12 -16 11 -8 -6 0 -16 13 -24 12 -13 -17 13 -29 8 -8 -2
7009 -2 19 -23 12 -13 -6 18 -28 22 -26 12 -1 -20 23 -24 14 -9 -10 18 -49 16 -13 -5 6 -37 17 -25 6 -1 -31 36 -33 19 -5
7042 -5 -23 26 -33 22 -24 -9 16 -44 30 -30 -2 19 -46 32 -31 12 -1 -33 36 -55 17 -18 -22 33 -52 26 -26 -14 23 -55 44
7073 44 -33 -3 20 -52 35 -56 25 -3 -41 57 -57 46 -19 -30 39 -60 44 -30 -6 37 -65 53 -49 9 29 -63 67
7100 67 -48 26 22 -57 69 -60 38 -21 -30 67 -70 69 -34 -10 54 -79 79 -49 5 35 -81 74 -67 30 1
7125 1 -65 75 -91 49 -24 -48 85 -94 62 -56 -10 61 -97 97 -63 3 33 -88 98 -85 40 15 -64 102
7149 102 -92 62 -7 -54 86 -106 84 -33 -32 71 -107 93 -75 9 60 -101 111 -91 23 23 -79 108 -112
7172 -112 65 -4 -60 90 -112 80 -33 -28 85 -122 104 -53 6 63 -110 116 -86 32 36 -87 126 -112 49
7195 49 -4 -76 113 -115 85 -41 -45 97 -119 110 -62 -17 67 -133 103 -88 25 37 -101 117 -118 54 9
7218 9 -81 113 -112 78 -23 -56 101 -137 101 -45 -29 88 -120 123 -80 16 55 -103 128 -107 44 17 -82
7241 -82 117 -123 69 -15 -57 108 -119 96 -47 -30 77 -121 108 -71 8 58 -101 113 -96 34 20 -98
7263 -98 112 -114 58 -4 -71 103 -118 87 -33 -32 85 -110 91 -49 -14 58 -109 100 -88 17 39 -84 99
7286 99 -94 35 10 -65 99 -93 70 -21 -34 77 -106 90 -47 -12 57 -98 94 -52 13 47 -83 84 -80
7309 -80 41 3 -65 90 -82 52 -11 -36 80 -74 69 -30 -11 58 -81 72 -53 -3 39 -70 82 -65 11 20
7333 20 -69 75 -72 34 2 -48 63 -65 55 -15 -28 59 -67 61 -20 -10 30 -71 53 -47 3 30 -54 60
7357 60 -51 20 5 -45 48 -50 46 -10 -31 44 -42 46 -6 -22 43 -48 45 -31 -3 30 -55 51 -26 5 20 -34 36 -32 16
7386 16 8 -17 47 -29 14 0 -10 26 -33 26 0 -12 28 -38 16 -15 -6 14 -27 16 -10 -1 14 -30 10 -29 0 10 -21 18 -23 11
7418 11 -9 -22 23 -25 11 -6 -13 23 -29 20 -11 -12 15 -21 23 -2 -4 9 -18 14 -7 1 0 -25 19 -10 0 7 -26 18 -19 4 8 -10
7452 -10 27 -18 4 -7 -21 15 -25 10 3 -11 15 -19 14 -18 -3 16 -18 11 -13 -9 14 -19 15 -24 -4 2 -23 15 -15 2 -7 -16 12
7485 12 -20 5 -9 -17 17 -28 16 -15 -7 14 -29 13 -7 -7 12 -20 27 -19 2 -3 -15 23 -18 9 3 -7 11 -18 14 -11 -8 12 -23
7518 -23 16 -14 -5 11 -18 1 -5 8 6 -19 17 -18 9 -3 -7 11 -27 18 -1 -3 9 -11 19 -22 3 -6 -15 14 -38 7 -11 -16 19 -19
7552 -19 18 -18 -4 4 -19 18 -15 13 4 -18 12 -18 25 -3 -11 18 -29 18 -16 3 11 -25 24 -21 6 -1 -25 33 -19 11 -1 -17 22
7585 22 -31 19 -26 -13 7 -40 30 -36 18 16 -19 38 -27 22 -3 -26 38 -32 20 -11 -23 38 -44 43 -29 -4 11 -37 40 -27 6
7616 6 22 -36 38 -42 17 3 -33 44 -52 33 -25 -21 31 -60 41 -40 -3 37 -59 52 -39 15 15 -43 59 -59 34 6 -33 51
7646 51 -56 40 -18 -9 40 -55 60 -27 -3 46 -72 63 -50 21 16 -47 70 -72 34 9 -39 61 -68 46 -19 -21
7672 -21 49 -76 57 -25 -12 36 -72 77 -58 12 31 -72 70 -69 37 3 -47 61 -73 51 -16 -29 68 -87
7696 -87 70 -37 -7 57 -81 73 -61 15 27 -77 86 -61 37 11 -58 85 -80 53 -14 -39 72 -89 68
7719 68 -34 -24 51 -72 74 -60 7 40 -81 85 -63 33 19 -63 85 -81 49 -2 -47 82 -81 60 -18 -26
7743 -26 73 -82 65 -41 5 46 -70 86 -55 26 23 -63 89 -74 39 4 -48 77 -78 67 -19 -28 73 -82
7767 -82 86 -42 -2 54 -89 82 -58 9 31 -64 84 -73 36 17 -48 80 -79 45 -18 -30 61 -81 74 -31
7791 -31 -25 49 -75 67 -47 3 41 -67 78 -49 17 18 -54 67 -68 26 11 -37 73 -59 44 -18 -21 49 -68 51
7817 51 -38 -8 29 -65 60 -43 7 29 -47 62 -52 21 7 -46 59 -52 43 -6 -23 52 -61 39 -22 -11 51 -56
7843 -56 47 -39 -7 25 -40 62 -43 15 21 -41 60 -45 14 15 -20 58 -38 43 4 -13 49 -42 40 -7 -1 30 -35 44 -17
7872 -17 -9 24 -31 43 -21 10 18 -30 48 -32 15 1 -27 30 -32 23 -7 -6 25 -32 34 -12 -8 16 -21 25 -10 -11 23 -31 32 -18 -6
7905 -6 20 -32 28 -19 10 13 -27 21 -30 6 13 -21 15 -35 12 3 -17 22 -16 16 -2 -7 12 -29 24 -12 1 12 -20 9 -14 -9 4
7938 4 -21 30 -19 1 10 -16 28 -19 7 9 -12 23 -29 13 -2 -6 13 -17 20 2 -22 4 -33 15 -11 -11 14 -21 27 -7 3 4 -22
7971 -22 29 -28 8 4 -21 27 -33 2 4 -26 17 -14 15 -6 -4 26 -37 10 -27 -15 5 -28 24 -16 4 8 -20 22 -13 13 -2 -12
8003 -12 21 -20 25 8 -21 22 -24 27 -6 -4 10 -33 21 -15 10 17 -23 27 -28 6 6 -21 20 -20 5 -7 -16 26 -19 9 -19 1
8035 1 15 -25 28 -19 6 19 -20 27 -21 15 4 -10 16 -20 15 -10 -6 20 -22 12 -13 7 9 -16 29 -22 10 6 -12 22 -28 13
8067 13 -6 -6 15 -28 21 -11 -1 13 -22 28 -13 6 8 -18 25 -32 15 -3 -22 13 -31 21 -11 -6 19 -30 31 -11 0 1 -18 41
8099 41 -23 20 -2 -27 23 -28 13 -10 -23 15 -38 34 -18 -3 9 -36 24 -29 11 -1 -24 24 -42 24 -11 -5 31 -36 38 -22 -4
8130 -4 31 -43 34 -41 9 23 -41 37 -33 23 8 -24 43 -48 39 -4 -28 37 -56 41 -19 0 35 -55 40 -35 0 24 -32 48 -37
8161 -37 31 -3 -22 53 -60 36 -3 -21 47 -50 57 -37 -7 28 -52 50 -51 14 16 -47 53 -56 30 0 -36 53 -59
8188 -59 35 -15 -28
8191b8
$$ Imaginary data points
##PAGE= N=2
##DATA TABLE= (X++(I..I)), XYDATA
0 0 0 0 0 0 0 0 0 0 0 0 0 0 0 8 -8 8 -8 12 -16 16 -24 29 -32 40 -48 57 -68 78 -92 108 -124 143 -164 186 -214
35 -214 242 -274 307 -347 389 -433 484 -539 601 -666 739 -817 904 -997 1098 -1211 1331
52 1331 -1465 1613 -1774 1955 -2155 2379 -2630 2914 -3240 3615 -4051 4567 -5179 5908 -6760
67 -6760 7637 -7755 4787 -280669 39379 -10581 91084 9095 -114621 228032 -265533
78 -265533 22254 133355 -14986 47982 -211459 191829 -55009 -131229 227295 -67596
88 -67596 19453 -200308 91547 207687 -209913 101321 -68560 -6858 10950 -29963 231156
99 231156 -241274 -26498 109555 -30607 70173 -142660 166355 -74941 -154036 196625
109 196625 -29762 53428 -147881 18168 125076 -166262 163217 -25849 -63968 -32692
119 -32692 -28771 230618 -169445 -23422 71780 -69438 66713 -86930 152063 -57683 -146920
130 -146920 144189 -46716 65536 -64133 9274 55995 -172339 154780 26397 -42784
140 -42784 -38817 -65505 167691 -101303 14435 60454 -94114 38863 -57452 124324 -25561
151 -25561 -107828 103743 -68680 38166 -13035 29742 41857 -162961 95203 30266 -6991
162 -6991 702 -71191 88697 -81760 36029 73839 -82804 16527 -53751 85047 -4484
173 -4484 -65425 87823 -71089 8160 -5834 31196 54153 -117171 49244 -2478 -3910 38982
185 38982 -41076 44656 -79968 21467 70463 -48103 18759 -49364 39222 -204 -33954
196 -33954 73398 -50113 -3214 -11817 10072 49572 -57972 33522 -21285 -21655 37761 -8459
208 -8459 35608 -59249 -4566 41280 -21304 28276 -28980 9028 -6940 -20666 53111 -24212
220 -24212 533 -10569 -9052 27597 -22913 32313 -13472 -27830 14682 -2678 34273 -24107
232 -24107 -11765 9708 -16249 28244 -6578 1710 -9101 -17669 27774 -8105 7750 -2622
244 -2622 -13361 7153 -11276 22535 1677 -14095 -1613 -10189 19176 2253 -1709 -3750 -15909
257 -15909 11871 4899 5379 -3452 -12209 4569 -1455 7677 3564 -5532 -2624 -6884 5818 6730 2134
272 2134 -3125 -10346 -127 7186 6941 -1186 -8022 -4361 2687 6325 3468 -2632 -7117 -653 2840
287 2840 3698 2480 -3205 -1728 -5262 2301 7661 249 -1730 -8501 988 5200 2309 3713 -8781
302 -8781 -2481 1514 4176 5763 -7529 -59 -2078 205 5540 -1877 3284 -6611 -2165 4590 -72
317 -72 5725 -5461 -2668 -489 40 8919 -3733 -2739 -2831 -188 7027 -2452 1173 -2976 -2739 3540
333 3540 -491 3906 -2344 -2703 457 -1581 4517 869 -1409 -2697 -2687 4206 2603 -655 -2332 -2540
349 -2540 1156 2556 731 80 -2717 -1500 2605 -318 2139 -1090 -1813 858 -3339 5496 156 -2170
365 -2170 129 -4720 6815 -1914 630 1619 -7564 6395 -2996 4099 83 -7782 8954 -7296
379 -7296 4543 828 -3983 7505 -12822 9576 -384 -4194 7937 -12130 10900 -7627 1556
392 1556 10551 -16294 11384 -8480 6260 3776 -14757 19122 -15670 5439 3402 -8083 16142
405 16142 -22495 16042 -1604 -10977 17861 -18174 17397 -14780 -385 20800 -26320 19287
417 19287 -12931 5921 6751 -22622 32200 -24385 4926 7871 -13851 23824 -31722 23977 -1226
430 -1226 -20934 27367 -23389 23394 -19322 -3152 29813 -37678 27338 -13395 3463 8982
442 8982 -30270 44591 -31597 3295 14324 -20656 29933 -39460 31042 534 -31126 37246
454 37246 -29664 27580 -21179 -5131 38437 -51198 35578 -12366 362 12140 -38575 56526
466 56526 -39548 2189 22587 -29044 35718 -46558 37679 2021 -41343 48779 -36211 28853
478 28853 -21510 -6047 46695 -64132 41941 -9858 -4279 16314 -44124 64030 -45398
489 -45398 338 31587 -36628 38579 -48796 39975 3802 -48948 57977 -39946 26366 -18907
501 -18907 -7877 52222 -71820 45572 -7302 -10536 21714 -46969 67558 -49406 -1554
512 -1554 39867 -44162 41409 -49230 40396 5062 -55471 67322 -44172 23960 -15452 -10532
524 -10532 56727 -78456 50500 -5546 -18032 27532 -48603 69899 -52473 -3203 46874
535 46874 -51147 43603 -46844 37976 6245 -59042 72756 -45888 20025 -9527 -13995 56627
547 56627 -78178 51042 -2618 -24770 31574 -46990 65712 -49049 -5324 49547 -54484
558 -54484 42895 -40433 31801 7925 -58707 73013 -45214 15607 -2599 -17174 54017 -75175
570 -75175 50248 -127 -29851 35119 -45591 60683 -45330 -5728 50936 -57948 42844
581 42844 -34990 26360 9274 -57245 72274 -45467 12682 3618 -20141 50771 -70269 47498
593 47498 1169 -32127 37637 -43405 52498 -38580 -6104 48733 -56525 39836 -28169 18611
605 18611 11295 -51314 64759 -41152 8619 8911 -21422 44337 -59616 40010 2612 -31665
617 -31665 37137 -37916 41690 -30433 -6531 44297 -51681 35284 -21583 11376 12239 -44241
629 -44241 56718 -36811 5684 12017 -21982 38720 -49895 33733 2354 -29925 36042 -33662
641 -33662 33535 -23572 -6922 38549 -45649 31830 -16978 5427 12853 -36887 47061 -30762
653 -30762 3855 12761 -21404 32211 -38153 25464 2630 -25844 31083 -27050 24322 -15249
665 -15249 -7384 30239 -35982 25071 -10875 525 11732 -28027 34944 -22428 1694 12052
677 12052 -18535 23918 -26429 17620 2821 -20675 24573 -20607 16652 -8736 -6664 22305
689 22305 -27290 19129 -7039 -1550 10259 -20928 24745 -16018 1386 10003 -15314 17680
701 17680 -18079 11551 2668 -14734 17888 -15297 10761 -4140 -5284 14938 -18335 12659
713 12659 -4190 -2059 7971 -13470 14576 -9526 609 7056 -10101 10525 -9997 5636
725 5636 2197 -8438 10440 -8734 5040 -1186 -3234 8082 -9493 6253 -1944 -1725 4811 -6541
739 -6541 6548 -4432 78 3667 -4847 4962 -4248 1838 1037 -3323 4521 -3687 1770 -285 -1391
754 -1391 2933 -2906 2023 -960 -639 1563 -1420 1338 -980 34 329 -432 636 -162 -209 -351 656
771 656 -538 667 -395 -208 652 -1568 2162 -1210 20 754 -1861 2647 -2409 1499 377 -2440
787 -2440 3113 -2935 2528 -851 -1616 3414 -4169 3460 -1426 -582 2519 -4477 4707 -2871 405 2128
803 2128 -4187 4728 -4160 2298 1040 -3937 4972 -4828 3344 -509 -2447 4792 -5780 4397 -1644
818 -1644 -1086 3823 -5633 5306 -3328 347 3016 -5076 5418 -4499 1960 1541 -4189 5490 -5228
833 -5228 3032 24 -2786 4956 -5556 4007 -1461 -1485 4122 -5178 4488 -2780 -62 2954 -4554
848 -4554 4723 -3521 986 1571 -3417 4513 -4014 1931 434 -2473 3802 -3720 2591 -820 -1470 3136
864 3136 -3288 2613 -1341 -453 1952 -2715 2690 -1475 -88 1066 -1743 2089 -1493 395 592 -1297
880 -1297 1283 -782 386 119 -810 780 -263 -137 438 -456 57 231 -604 1013 -731 -139 844 -1394
898 -1394 1665 -1167 208 997 -2181 2596 -1975 882 767 -2576 3496 -3172 1926 196 -2418 4007
914 4007 -4581 3493 -846 -1999 4194 -5477 5100 -2826 -691 4253 -6401 6297 -4560 1424
928 1424 2877 -6720 8088 -6619 3063 1297 -5416 8500 -9126 6013 -537 -4639 8170 -9662
942 -9662 8491 -4246 -2227 8231 -10805 9747 -6414 1201 5449 -10967 12498 -9205 3102
955 3102 3156 -8588 12569 -12742 7544 632 -7869 11998 -12998 10842 -4786 -4373 12276 -14927
969 -14927 12551 -7403 302 8130 -15194 16725 -11467 2732 5401 -12020 16604 -16296 9201
982 9201 1949 -11496 16136 -16436 13226 -5251 -6515 16499 -19374 15393 -8011 -836 10866
995 10866 -19231 20644 -13283 1889 8066 -15289 19680 -18641 9771 3828 -14993 19336
1007 19336 -18356 13703 -4327 -8883 19690 -22099 16207 -6887 -2951 13283 -21661 22279
1019 22279 -13265 23 10892 -17701 21131 -19184 9171 5922 -17879 21747 -19328 13302
1031 13302 -3058 -10806 22314 -24396 16964 -5871 -4864 15391 -23700 24008 -13802 -1275
1043 -1275 13396 -20022 22580 -19875 8944 7375 -20297 23923 -20154 12681 -1782 -12351
1055 -12351 23960 -25593 16855 -4406 -6898 16848 -24145 23588 -12667 -3126 15270 -20868
1067 -20868 21846 -17997 6892 8985 -21179 23782 -18532 10100 553 -13399 23665 -24332
1079 -24332 14937 -2015 -8863 17315 -22946 21649 -10781 -4757 16403 -20929 20459 -15839
1091 -15839 5146 9778 -21413 23442 -17347 8222 2111 -13851 23041 -23376 13843 -716
1103 -716 -10035 17491 -21823 19907 -9347 -5541 16676 -20445 18866 -13512 3356 10167 -20409
1116 -20409 21695 -15137 5890 3745 -13594 20795 -20230 11078 1143 -10634 16228 -18634
1128 -18634 15959 -6439 -6408 15693 -18052 15305 -9734 1007 9912 -18005 18370 -11901 3209
1141 3209 4918 -12439 17590 -16610 8490 2253 -10333 14472 -15513 12656 -4569 -6201 14070
1154 14070 -15773 12759 -7372 -108 8982 -15422 15557 -9777 2001 5070 -10947 14593
1166 14593 -13346 6492 2471 -9201 12239 -12348 9368 -2784 -5604 11564 -12516 9489
1178 9489 -4676 -1223 7530 -11829 11426 -6611 350 4873 -8607 10447 -8989 3772 2774
1191 2774 -7452 9059 -8321 5673 -987 -4660 8536 -8779 6157 -2347 -1728 5687 -8215
1204 -8215 7661 -4127 -365 3967 -6212 7021 -5724 2173 2205 -5343 6259 -5454 3388 -247
1218 -247 -3297 5628 -5687 3806 -1167 -1487 3753 -5006 4459 -2222 -533 2636 -3733 3822 -2807
1233 -2807 787 1522 -3021 3261 -2462 1188 374 -1825 2644 -2360 1279 34 -1036 1660 -1771
1248 -1771 1325 -356 -595 1156 -1179 837 -348 -190 632 -760 534 -102 -250 374 -300 79 164
1265 164 -361 380 -164 -246 596 -736 548 -122 -387 859 -1127 995 -422 -395 1143 -1484 1432 -874
1283 -874 -22 1091 -1849 1996 -1417 406 781 -1819 2398 -2159 1105 346 -1689 2523 -2627 1895
1299 1895 -452 -1261 2575 -3015 2493 -1231 -499 2166 -3223 3141 -2028 244 1568 -2952 3457
1314 3457 -2841 1219 834 -2594 3489 -3312 2121 -174 -1891 3355 -3674 2837 -1106 -961 2793
1329 2793 -3736 3475 -2034 -28 2074 -3444 3734 -2847 1012 1158 -2951 3751 -3381 1925 116
1344 116 -2156 3484 -3691 2680 -852 -1250 2904 -3636 3208 -1762 -243 2151 -3338 3440 -2439
1359 -2439 714 1232 -2766 3401 -2917 1529 337 -1997 3027 -3102 2190 -554 -1184 2500 -2962
1374 -2962 2498 -1292 -288 1772 -2640 2605 -1767 432 964 -2047 2461 -2073 997 283 -1402
1389 -1402 2015 -2042 1420 -384 -764 1538 -1782 1487 -811 -97 940 -1407 1401 -986 340
1404 340 331 -859 1131 -1005 607 -100 -329 662 -775 694 -415 113 176 -362 508 -546 434 -299
1422 -299 103 121 -391 604 -688 577 -365 5 426 -885 1068 -934 511 56 -709 1288 -1538 1214
1440 1214 -468 -409 1210 -1786 1911 -1342 206 1058 -1925 2273 -2026 1144 346 -1856 2743 -2641
1456 -2641 1800 -463 -1159 2679 -3376 2782 -1210 -623 2220 -3360 3569 -2494 319 1912 -3387
1471 -3387 3786 -3262 1660 758 -3164 4364 -3975 2424 -349 -2038 4136 -4929 3828 -1355 -1306 3438
1487 3438 -4791 4921 -3229 132 3005 -4855 5182 -4244 2071 1239 -4460 6013 -5313 3103
1501 3103 -265 -2814 5526 -6557 5014 -1653 -1902 4590 -6188 6224 -4038 3 4025 -6288
1515 -6288 6423 -5033 2194 1813 -5712 7401 -6235 3225 289 -3807 6690 -7574 5420
1528 5420 -1187 -2974 5762 -7054 6629 -3844 -821 5259 -7376 6953 -4853 1543 2785
1541 2785 -6762 8265 -6478 2759 1203 -4752 7485 -8097 5492 -684 -3914 6690 -7680
1554 -7680 6873 -3783 -1278 6062 -8273 7473 -4936 1265 3268 -7438 8948 -6894 2641
1567 2641 1706 -5357 8016 -8419 5556 -310 -4557 7325 -7916 6721 -3298 -1895 6691
1580 6691 -8609 7334 -4243 357 4022 -7773 8798 -6213 1607 2772 -5994 7894 -7703
1593 -7703 4487 748 -5406 7561 -7427 5625 -2142 -2745 7029 -8432 6627 -3202 -638 4507
1607 4507 -7645 8256 -5515 872 3361 -6147 7531 -7018 3879 1125 -5519 7457 -6981
1620 -6981 4999 -1600 -2911 6815 -8008 6103 -2617 -1069 4540 -7176 7476 -4762 302
1633 302 3612 -5973 6779 -5923 2847 1660 -5483 6831 -5916 3655 -498 -3294 6293 -6887
1647 -6887 4730 -1319 -1924 4550 -6210 5963 -3288 -654 3904 -5450 5557 -4317 1583 2126
1661 2126 -5077 5888 -4643 2414 295 -3205 5427 -5634 3644 -629 -2082 4057 -5127 4719
1675 4719 -2434 -843 3459 -4625 4462 -3274 973 1940 -4244 4748 -3592 1593 604 -2800 4316
1690 4316 -4278 2531 -47 -2049 3376 -3855 3215 -1313 -1159 3024 -3574 3047 -1790 27 1980
1705 1980 -3321 3337 -2105 422 1164 -2409 3059 -2642 1189 630 -1975 2530 -2448 1704 -321
1720 -321 -1274 2307 -2395 1724 -715 -456 1564 -2227 1980 -1043 -109 1047 -1662 1812 -1377 393
1736 393 686 -1360 1524 -1237 651 175 -976 1383 -1194 633 45 -624 1035 -1075 708 -50
1752 -50 -549 872 -852 589 -112 -423 784 -838 504 -38 -429 711 -754 505 -35 -460 749
1769 749 -762 492 -28 -447 788 -835 571 -61 -463 844 -906 680 -167 -403 872 -1020 842
1786 842 -310 -314 868 -1113 1026 -542 -136 817 -1215 1212 -790 114 651 -1222 1407 -1104 406
1803 406 422 -1136 1498 -1399 793 76 -960 1524 -1590 1150 -336 -643 1427 -1760 1483 -729
1819 -729 -259 1175 -1744 1765 -1183 196 876 -1620 1884 -1525 696 426 -1379 1898 -1792 1120
1835 1120 -68 -979 1771 -1967 1525 -562 -549 1494 -1959 1802 -1067 -32 1105 -1825 1952 -1463
1851 -1463 501 614 -1546 1962 -1747 982 100 -1134 1818 -1902 1392 -427 -647 1538 -1886 1685
1867 1685 -908 -124 1127 -1744 1823 -1294 392 634 -1469 1798 -1557 851 138 -1046 1612 -1666
1883 -1666 1197 -373 -585 1305 -1637 1411 -795 -86 896 -1441 1505 -1107 355 464 -1116 1408
1899 1408 -1282 745 -6 -728 1198 -1297 1003 -402 -289 897 -1175 1118 -705 124 491 -922
1915 -922 1104 -902 481 88 -585 917 -964 732 -292 -221 643 -888 860 -613 166 293 -678
1932 -678 850 -808 514 -94 -362 705 -861 779 -476 12 442 -777 887 -778 439 54
1948 54 -552 896 -945 764 -358 -140 683 -1010 1055 -745 252 317 -832 1187 -1137 706 -62
1965 -62 -577 1061 -1311 1159 -610 -202 923 -1343 1392 -1084 367 531 -1324 1623 -1434 808
1981 808 19 -972 1676 -1839 1328 -402 -591 1444 -1937 1866 -1073 -128 1267 -1917 2063 -1613
1997 -1613 637 714 -1843 2329 -2011 1156 19 -1295 2287 -2527 1829 -566 -777 1878 -2535 2442
2013 2442 -1488 -93 1555 -2433 2603 -2115 908 752 -2239 2875 -2544 1502 -113 -1446 2710
2028 2710 -3081 2287 -753 -884 2192 -2977 2935 -1765 -100 1878 -2896 3038 -2372 953 1005 -2705
2044 -2705 3396 -2839 1518 160 -1906 3217 -3474 2399 -525 -1359 2713 -3391 3089 -1695 -483
2059 -483 2405 -3372 3288 -2355 686 1365 -3138 3723 -2970 1389 440 -2210 3497 -3665 2453 -389
2075 -389 -1584 2949 -3534 3187 -1687 -538 2571 -3513 3363 -2349 659 1452 -3230 3816 -2976
2090 -2976 1290 583 -2328 3543 -3650 2334 -194 -1836 3096 -3534 2985 -1392 -899 2830 -3643
2105 -3643 3204 -1969 186 1835 -3416 3755 -2673 804 1090 -2636 3547 -3359 1910 277 -2193
2120 -2193 3228 -3339 2578 -954 -1176 2935 -3526 2918 -1581 -138 1917 -3261 3461 -2368 562
2135 562 1177 -2528 3229 -3019 1631 351 -2109 2954 -2999 2225 -755 -1173 2694 -3181 2534 -1248
2151 -1248 -307 1853 -2948 3009 -1910 225 1342 -2404 2844 -2442 1124 690 -2137 2731 -2475
2166 -2475 1589 -194 -1385 2564 -2749 1944 -639 -725 1905 -2588 2396 -1310 -205 1471 -2193
2181 -2193 2317 -1806 611 831 -1961 2270 -1912 1049 69 -1277 2101 -2152 1409 -349 -722 1554
2197 1554 -1994 1784 -884 -289 1235 -1699 1708 -1223 319 771 -1531 1709 -1310 584 281 -1103
2213 -1103 1604 -1494 830 24 -804 1293 -1424 1091 -351 -540 1135 -1309 1071 -577 -147 826
2229 826 -1253 1144 -685 56 522 -973 1105 -844 293 333 -762 921 -826 467 68 -570 824
2246 824 -787 487 -84 -315 639 -718 538 -169 -206 480 -598 519 -252 -103 399 -542 441 -262
2264 -262 -43 312 -495 455 -264 -51 291 -459 439 -296 3 279 -469 472 -313 42 242 -460 513 -374
2284 -374 104 239 -457 545 -440 183 165 -449 594 -517 277 86 -419 613 -587 371 -15 -371 608
2303 608 -660 471 -149 -269 579 -723 595 -289 -150 515 -747 704 -445 23 411 -729 784
2320 784 -607 209 259 -647 851 -750 413 66 -518 828 -864 632 -151 -345 759 -911 780
2337 780 -390 -141 627 -916 894 -594 94 416 -828 959 -790 336 193 -693 934 -924 559
2354 559 -55 -503 864 -974 754 -299 -260 724 -964 887 -539 14 500 -884 974 -717 263
2371 263 289 -719 954 -848 500 22 -518 875 -930 685 -231 -294 715 -902 817 -469 -35
2388 -35 500 -829 866 -666 213 257 -683 852 -774 431 3 -484 759 -827 601 -220 -239 612
2406 612 -787 710 -424 4 422 -683 743 -567 239 186 -506 714 -646 393 -35 -333 594
2423 594 -680 539 -246 -130 428 -619 592 -401 66 234 -514 580 -511 249 44 -346 521 -545
2441 -545 405 -154 -160 395 -526 484 -320 57 235 -449 507 -431 240 34 -297 472 -493 393 -149 -103 358
2462 358 -491 493 -337 75 205 -408 486 -447 263 -2 -293 459 -511 397 -191 -98 344 -525 487 -340
2482 -340 90 173 -429 544 -483 268 19 -286 489 -565 467 -183 -143 424 -551 559 -394 75 305
2501 305 -565 652 -511 275 78 -435 681 -694 460 -99 -282 596 -761 673 -354 -125 494
2518 494 -743 764 -591 170 304 -716 832 -706 399 42 -492 828 -872 622 -154 -272 669
2535 669 -865 817 -439 -65 539 -778 849 -650 255 303 -736 893 -759 451 -9 -488 872
2552 872 -934 653 -186 -306 699 -952 886 -491 -121 605 -903 910 -709 235 390 -875 1026
2569 1026 -832 420 51 -647 1049 -1051 679 -96 -448 857 -1040 936 -437 -211 764 -988
2585 -988 961 -675 161 466 -947 1052 -810 345 154 -655 1005 -1007 596 -33 -475 801 -974
2602 -974 822 -373 -254 726 -924 836 -565 84 475 -915 975 -686 233 241 -689 973 -908
2619 -908 495 98 -572 855 -903 726 -220 -390 858 -961 779 -404 -91 627 -970 948 -578
2636 -578 50 405 -779 931 -797 316 219 -668 817 -808 529 -79 -472 797 -840 579 -239
2653 -239 -182 584 -828 732 -367 -58 414 -643 734 -556 164 303 -602 678 -565 332 77 -465
2671 -465 724 -642 406 -45 -282 578 -710 554 -194 -219 495 -639 588 -368 -22 410 -646 604
2689 604 -430 121 214 -544 663 -530 213 120 -397 570 -578 374 -8 -321 517 -511 405 -147 -158
2708 -158 432 -519 428 -182 -55 297 -460 463 -268 5 254 -383 410 -339 115 141 -380 411 -350 156
2728 156 40 -284 402 -414 235 -4 -219 362 -417 317 -109 -156 352 -407 351 -175 -44 277 -418 395
2748 395 -224 25 216 -359 412 -297 96 159 -322 393 -336 163 63 -291 388 -372 197 -2 -225 355
2768 355 -397 263 -59 -172 321 -393 300 -140 -111 281 -393 344 -199 -20 228 -364 382 -264 70 159 -315
2789 -315 414 -329 173 80 -274 394 -377 244 -15 -220 374 -412 308 -118 -139 318 -417 362 -210 -33 248
2810 248 -403 392 -291 51 170 -372 422 -345 145 84 -314 418 -400 243 -3 -231 400 -416 330 -88
2830 -88 -134 357 -418 379 -196 -39 275 -402 426 -286 77 192 -360 421 -355 174 64 -287 421 -421 261
2851 261 -54 -215 365 -450 332 -154 -106 306 -424 405 -243 15 228 -392 432 -335 134 128 -323 420 -377
2872 -377 234 3 -239 400 -407 322 -92 -133 327 -413 375 -209 -14 247 -386 410 -291 100 132 -343 409
2893 409 -384 193 18 -251 383 -414 296 -91 -150 336 -416 372 -209 -23 234 -383 415 -296 91 136 -331
2914 -331 418 -367 218 27 -236 391 -408 313 -106 -117 325 -417 396 -227 5 230 -393 414 -335 122
2934 122 107 -337 415 -410 234 -21 -234 395 -449 336 -150 -106 316 -444 427 -272 25 222 -397 474 -376
2955 -376 168 103 -326 476 -452 318 -39 -214 430 -494 425 -194 -81 347 -496 498 -343 70 213 -455
2975 -455 540 -459 234 58 -361 529 -557 374 -100 -236 470 -602 508 -271 -70 380 -574 597 -425
2994 -425 121 239 -522 647 -552 294 69 -408 639 -653 450 -114 -271 575 -702 601 -321 -99
3012 -99 449 -692 695 -501 123 297 -632 751 -662 329 84 -516 753 -793 527 -134 -330 665
3030 665 -843 721 -367 -127 569 -824 830 -581 148 379 -759 911 -743 366 135 -597 913
3047 913 -892 596 -103 -423 816 -964 794 -370 -201 689 -964 908 -623 76 466 -910 993
3064 993 -803 327 212 -744 1029 -989 598 -41 -544 939 -1062 842 -339 -280 817 -1065 1011
3081 1011 -616 39 600 -1023 1123 -834 327 313 -860 1151 -1063 605 36 -654 1053 -1161
3097 -1161 872 -310 -412 931 -1183 1031 -610 -62 700 -1161 1170 -849 233 418 -978 1219
3113 1219 -1071 537 141 -780 1140 -1170 836 -201 -501 1051 -1217 1019 -494 -168 823 -1203
3129 -1203 1203 -768 133 542 -1053 1251 -1035 449 253 -878 1196 -1176 757 -106 -620 1110
3145 1110 -1235 970 -423 -289 883 -1245 1150 -706 17 621 -1112 1233 -972 351 351 -935
3161 -935 1196 -1096 662 21 -682 1141 -1182 872 -279 -377 948 -1202 1063 -563 -97 704 -1096
3178 -1096 1138 -849 211 450 -972 1143 -986 496 129 -748 1080 -1090 722 -154 -463 935
3194 935 -1132 923 -426 -201 749 -1050 1007 -714 92 516 -938 1061 -835 371 216 -738 1030
3211 1030 -941 584 -25 -506 901 -998 763 -284 -288 734 -963 862 -494 -22 521 -866 892
3228 892 -664 195 287 -722 872 -777 390 63 -530 781 -821 562 -146 -335 674 -792 664
3245 664 -333 -98 524 -742 730 -458 79 330 -622 735 -573 252 162 -485 664 -629 386 -22
3263 -22 -333 592 -634 481 -187 -181 459 -608 528 -304 -43 317 -533 547 -399 91 201 -447 522
3282 522 -432 215 86 -336 470 -438 291 -26 -211 399 -436 341 -122 -107 307 -402 367 -204 -10 224
3302 224 -353 351 -239 50 138 -289 331 -289 116 42 -237 296 -287 171 -11 -172 264 -284 189 -59 -101
3323 -101 224 -266 205 -101 -57 175 -231 221 -114 12 148 -191 221 -149 38 85 -163 216 -170 68 55
3344 55 -144 193 -170 94 11 -130 177 -179 106 -9 -106 145 -189 123 -50 -71 133 -179 148 -80 -33 116
3366 116 -171 167 -104 6 95 -156 182 -123 59 63 -124 180 -134 85 21 -106 173 -148 119 -23 -56 146
3388 146 -170 133 -67 -30 103 -164 158 -105 22 61 -144 158 -141 73 17 -117 163 -160 117 -15 -54
3409 -54 142 -159 148 -85 -9 97 -144 172 -114 56 44 -107 179 -154 113 -6 -72 144 -161 155 -80
3430 -80 -3 107 -165 171 -134 52 35 -143 191 -180 126 -42 -87 161 -216 175 -105 -15 118 -205 217 -184
3452 -184 66 61 -178 252 -233 172 -30 -99 231 -272 247 -117 -30 206 -273 308 -216 73 114 -267 343 -317
3474 -317 173 5 -199 330 -375 276 -109 -111 302 -425 375 -247 1 220 -418 446 -371 140 133 -361 493
3495 493 -456 298 -5 -275 494 -533 442 -168 -138 429 -561 558 -335 24 322 -559 631 -486 207
3514 207 160 -483 656 -628 380 -23 -360 642 -714 554 -233 -202 550 -747 691 -439 18 417
3532 417 -711 788 -618 236 227 -610 835 -764 470 14 -473 816 -865 684 -224 -263 713 -915
3550 -915 834 -472 -30 540 -887 960 -708 238 326 -797 995 -919 494 54 -624 958 -1027
3567 -1027 739 -238 -388 855 -1071 936 -508 -98 662 -1032 1076 -759 208 428 -905 1132
3583 1132 -958 516 142 -717 1095 -1105 786 -183 -473 987 -1168 995 -479 -177 780 -1157
3599 -1157 1149 -778 137 532 -1040 1202 -1018 464 226 -874 1202 -1179 758 -107 -604 1103
3615 1103 -1261 991 -423 -267 914 -1252 1189 -724 58 662 -1113 1269 -972 398 337 -934
3631 -934 1253 -1143 696 -11 -667 1158 -1251 953 -338 -370 950 -1257 1129 -657 -50 704 -1157
3648 -1157 1232 -921 307 408 -998 1234 -1095 600 94 -742 1205 -1198 862 -230 -460 1008
3664 1008 -1229 1074 -526 -138 793 -1153 1191 -787 187 514 -1011 1211 -989 482 201 -788
3680 -788 1137 -1119 723 -117 -528 990 -1148 921 -422 -241 785 -1086 1020 -667 63 524
3696 524 -973 1067 -833 337 251 -766 1040 -959 570 -10 -534 926 -978 780 -261 -279 770
3713 770 -943 875 -484 -25 566 -881 926 -670 200 324 -729 918 -787 410 92 -557 828
3730 828 -840 569 -152 -358 695 -822 677 -341 -138 519 -771 738 -475 82 334 -630 725
3747 725 -581 252 150 -492 672 -628 398 -10 -336 602 -625 470 -173 -214 458 -559 522 -321
3765 -321 -12 263 -514 560 -423 80 183 -421 497 -434 222 44 -325 447 -450 277 -65 -201 374 -432
3785 -432 338 -148 -79 290 -387 349 -205 7 203 -310 359 -232 82 122 -247 314 -254 129 46 -184 268
3806 268 -252 150 -12 -127 216 -231 163 -47 -87 161 -210 155 -71 -43 129 -170 156 -84 -15 100 -137
3827 -137 144 -77 13 80 -127 143 -86 28 80 -112 144 -91 24 62 -104 132 -101 49 47 -106 142 -103
3849 -103 51 33 -105 139 -132 62 8 -94 151 -144 99 3 -88 142 -155 100 -24 -63 139 -156 145 -62
3871 -62 -30 128 -153 180 -89 13 118 -160 189 -113 59 79 -134 204 -162 97 25 -115 192 -192 145
3892 145 -29 -83 167 -202 166 -88 -34 129 -197 190 -124 16 78 -179 203 -165 82 32 -139 199 -183
3913 -183 134 -18 -84 172 -182 165 -55 -25 142 -171 175 -108 17 83 -148 170 -137 67 13 -99 153
3934 153 -152 109 -37 -63 120 -160 134 -92 -16 67 -140 140 -114 33 17 -97 123 -143 95 -28 -37 109
3956 109 -121 116 -72 19 67 -96 135 -108 83 3 -48 131 -135 120 -61 2 81 -125 137 -123 55 23
3978 23 -108 137 -160 102 -43 -68 122 -191 159 -112 4 86 -173 192 -161 82 27 -138 205 -220 164
3999 164 -49 -73 205 -238 246 -115 2 177 -256 296 -219 94 98 -243 317 -303 175 -4 -180 326 -357
4020 -357 273 -128 -108 277 -392 361 -238 2 206 -375 420 -353 144 109 -324 443 -411 268 -11 -219 432
4041 432 -479 398 -149 -116 373 -486 490 -295 25 274 -478 540 -427 178 143 -422 561 -534 318 -26
4061 -26 -318 543 -608 470 -192 -178 471 -645 593 -358 -17 375 -618 673 -508 167 214 -536 695
4080 695 -626 368 37 -409 680 -695 534 -159 -242 604 -724 662 -361 -53 459 -704 740
4097 740 -532 158 287 -622 770 -675 349 74 -484 735 -777 541 -138 -318 658 -800 674
4114 674 -354 -111 535 -780 784 -544 98 361 -722 857 -686 338 167 -579 842 -795 543
4131 543 -45 -398 762 -846 703 -289 -182 636 -847 815 -505 34 449 -791 868 -669 265
4148 265 216 -641 843 -803 473 -22 -466 771 -851 634 -235 -258 649 -837 761 -434 -12 481
4166 481 -775 831 -594 203 294 -658 842 -725 416 84 -497 794 -797 578 -149 -313 683
4183 683 -821 701 -355 -106 537 -788 772 -525 89 334 -693 796 -664 301 145 -547 754
4200 754 -731 471 -59 -371 670 -747 589 -245 -165 537 -725 675 -393 37 380 -629 695
4217 695 -529 207 201 -519 664 -605 345 27 -372 592 -633 445 -152 -211 496 -632 531 -296 -65
4236 -65 373 -572 570 -415 78 229 -497 574 -481 232 90 -385 541 -515 346 -44 -242 474 -512
4255 -512 415 -161 -112 369 -478 450 -255 5 253 -413 455 -329 112 139 -332 408 -367 195 26 -244 347
4276 347 -371 253 -76 -149 296 -359 283 -140 -53 215 -315 309 -180 17 165 -268 305 -221 80 94 -211
4297 -211 276 -211 133 46 -205 190 -233 129 -19 -112 213 -219 174 -63 -57 145 -217 173 -98 -20 118 -181
4319 -181 161 -112 1 81 -138 143 -107 31 58 -128 154 -108 44 44 -105 141 -97 49 33 -103 137 -100
4341 -100 63 21 -76 129 -116 77 5 -60 126 -127 90 -7 -53 129 -135 98 -39 -39 112 -153 110 -79 -31
4364 -31 95 -153 128 -82 0 63 -154 147 -123 37 70 -132 174 -130 79 44 -108 174 -154 109 -13 -80
4386 -80 174 -166 151 -45 -48 144 -177 195 -100 -9 104 -190 184 -143 40 75 -164 181 -170 87 18 -136
4408 -136 178 -187 119 -23 -89 171 -187 161 -70 -17 141 -179 191 -109 34 88 -152 188 -153 84 34
4429 34 -118 190 -174 122 -17 -85 152 -176 146 -81 -31 111 -178 166 -112 19 75 -137 158 -145 72
4450 72 5 -98 159 -155 115 -36 -53 126 -149 146 -78 16 85 -118 155 -112 51 36 -81 146 -123 110
4472 110 -29 -29 101 -138 128 -75 15 52 -120 126 -126 58 9 -82 117 -146 99 -50 -23 90 -135 139
4494 139 -90 25 48 -115 148 -145 98 -9 -69 150 -158 138 -57 -8 129 -148 181 -126 55 55 -143 203
4516 203 -170 115 -8 -109 193 -223 164 -82 -53 157 -244 227 -162 31 111 -234 268 -235 115 32 -186
4537 -186 274 -301 211 -49 -115 271 -315 289 -141 -24 216 -311 344 -236 75 135 -278 375 -316 176 37
4558 37 -228 349 -381 264 -79 -148 317 -402 352 -204 -40 247 -412 404 -312 84 156 -367 439 -403 216
4579 216 31 -285 452 -461 342 -78 -187 417 -497 445 -233 -41 340 -487 526 -359 110 213 -436 553
4599 553 -468 252 71 -357 547 -533 368 -92 -241 477 -587 477 -249 -85 384 -567 557 -376
4617 -376 65 256 -493 587 -482 239 112 -416 581 -558 376 -39 -264 553 -599 512 -207 -118 446
4636 446 -604 602 -358 45 310 -576 651 -519 218 154 -488 625 -608 367 -36 -355 578 -664
4654 -664 497 -187 -192 509 -659 587 -366 -7 365 -603 661 -483 174 216 -502 652 -564 328 43
4673 43 -372 604 -603 474 -115 -194 529 -614 560 -288 -46 393 -586 604 -425 116 246 -522 610
4692 610 -524 251 72 -404 587 -611 384 -88 -277 518 -607 508 -229 -114 426 -584 573 -375
4710 -375 70 287 -512 597 -466 213 141 -406 576 -530 345 -20 -284 507 -547 424 -152 -149 399 -528
4730 -528 461 -285 -15 288 -469 485 -377 108 160 -383 472 -423 224 35 -285 438 -448 318 -77 -173 377
4751 377 -435 377 -179 -54 301 -407 419 -262 58 196 -346 418 -324 148 86 -271 389 -364 235 -18
4771 -18 -193 327 -368 277 -117 -101 241 -348 304 -186 -15 189 -303 304 -229 64 106 -235 292 -238 119
4792 119 47 -162 269 -234 172 -20 -111 222 -227 209 -65 -46 174 -206 213 -116 5 125 -198 200 -145
4813 -145 36 71 -161 189 -161 65 17 -134 154 -163 93 -18 -94 144 -150 102 -33 -53 120 -131 108
4834 108 -45 -35 102 -106 116 -40 -2 88 -107 113 -49 10 72 -94 101 -67 11 50 -83 107 -65 18 41
4857 41 -95 100 -85 22 39 -84 91 -103 36 18 -87 104 -118 61 -8 -65 99 -119 83 -21 -48 119
4879 119 -80 131 -5 2 141 -107 128 -65 5 66 -134 127 -87 20 50 -121 133 -122 47 13 -107 124
4901 124 -146 84 -23 -77 125 -159 105 -67 -47 101 -148 137 -95 -14 87 -136 157 -108 53 44 -115 158
4923 158 -123 84 21 -83 158 -135 114 -34 -52 130 -140 131 -73 -9 91 -133 130 -105 29 34 -115 139
4945 139 -132 63 -2 -94 121 -145 89 -36 -47 98 -137 119 -60 -8 81 -107 131 -85 33 48 -89 123
4967 123 -102 85 11 -58 111 -109 96 -37 -10 85 -94 108 -64 24 29 -86 102 -92 46 -11 -59 85 -100
4990 -100 87 -47 -18 61 -90 87 -84 37 26 -66 90 -92 62 -12 -26 81 -89 103 -52 17 57 -84 118
5013 118 -89 48 21 -64 107 -111 88 -29 -36 78 -125 108 -79 2 57 -132 128 -123 67 -23 -158 142
5035 142 -162 106 -40 -48 120 -157 143 -87 -3 96 -165 194 -135 72 63 -140 206 -182 125 -5 -97 209
5057 209 -216 185 -78 -49 165 -235 223 -152 16 115 -227 251 -212 90 32 -190 244 -273 163 -37 -129
5078 -129 232 -274 224 -110 -58 194 -283 287 -187 37 157 -248 313 -243 124 60 -204 316 -305 212 -36
5099 -36 -150 289 -341 286 -139 -72 228 -360 337 -232 26 147 -329 363 -318 132 61 -283 372 -374 221
5120 221 -34 -198 340 -401 319 -128 -99 292 -391 377 -236 28 202 -366 408 -316 146 108 -284 421 -370
5141 -370 236 -6 -215 371 -415 319 -124 -133 307 -421 373 -229 -17 221 -402 407 -340 107 119 -338 422
5162 422 -403 223 7 -252 405 -436 321 -113 -143 345 -435 394 -219 -12 270 -408 433 -314 103 162 -339
5183 -339 444 -386 196 32 -266 393 -429 289 -88 -173 332 -426 332 -179 -59 253 -398 388 -267 52
5203 52 158 -352 400 -325 141 67 -263 368 -382 251 -50 -176 346 -386 321 -138 -80 281 -381 372 -221
5224 -221 26 189 -332 383 -302 117 77 -289 355 -347 199 -19 -196 323 -362 257 -114 -116 255 -344 288
5245 288 -180 -18 173 -309 309 -234 67 106 -236 306 -253 148 24 -180 272 -271 196 -44 -104 232 -270
5266 -270 230 -106 -35 172 -243 243 -168 20 112 -226 239 -205 91 40 -178 225 -226 127 -27 -123 189
5287 189 -224 169 -73 -51 137 -202 192 -110 11 109 -170 185 -120 47 65 -127 168 -129 83 21 -90
5308 -90 147 -132 101 -12 -48 115 -136 101 -48 -44 83 -123 86 -76 -25 55 -113 100 -88 25 32 -87 86
5331 86 -86 27 15 -61 82 -82 46 8 -36 74 -54 63 -6 -32 63 -55 50 -8 -12 55 -57 46 -16 -12 33
5356 33 -57 47 -28 -20 36 -64 33 -25 -19 27 -73 36 -29 -16 28 -56 44 -33 -10 40 -65 67 -31 2 30 -59 79
5383 79 -44 26 37 -33 83 -60 43 11 -41 79 -72 50 -3 -38 68 -93 71 -35 -29 60 -92 68 -68 -15
5407 -15 33 -103 69 -72 17 36 -91 91 -82 36 17 -61 98 -88 61 -13 -37 75 -87 67 -58 -11 86
5430 86 -83 108 -122 33 91 -87 106 -82 36 20 -81 100 -95 45 -7 -67 85 -111 65 -33 -41 57 -111
5453 -111 81 -64 -9 53 -100 95 -76 21 17 -73 107 -82 54 4 -50 77 -82 76 -15 -16 75 -76 87 -37
5477 -37 -3 46 -72 79 -69 21 22 -64 60 -79 31 -8 -42 53 -67 39 -41 -25 26 -79 45 -50 12 18 -56 64
5503 64 -44 23 2 -28 43 -40 36 -13 -2 34 -39 41 -32 11 6 -23 46 -47 26 -10 -10 28 -40 35 -25 -3 15 -31 28 -51 22
5534 22 -26 -24 35 -49 34 -27 0 14 -30 46 -35 24 9 -30 53 -46 45 -13 -7 42 -48 73 -37 15 23 -61 70 -54 36 5
5564 5 -42 68 -85 50 -32 -31 73 -102 78 -54 -9 43 -102 87 -87 26 20 -89 104 -110 63 -7 -58 93
5588 93 -115 98 -37 -23 91 -115 115 -61 10 65 -109 123 -104 44 24 -91 131 -135 72 -15 -79 118
5610 118 -152 104 -64 -49 94 -152 139 -98 3 75 -147 149 -126 46 25 -124 159 -155 93 -21 -83
5631 -83 164 -166 140 -58 -39 146 -160 170 -98 21 98 -156 180 -136 60 48 -136 183 -165 91 -8 -104
5653 -104 155 -190 114 -71 -65 129 -193 148 -100 -12 94 -163 183 -135 42 53 -130 178 -168 102 7 -89
5675 -89 165 -183 144 -45 -47 149 -181 180 -95 -5 106 -187 194 -140 48 60 -159 183 -184 90 -3 -118
5697 -118 166 -195 128 -55 -62 147 -183 153 -102 -17 108 -166 167 -133 36 65 -134 173 -140 80 26 -94
5719 -94 161 -148 116 -16 -52 128 -162 136 -61 -19 102 -145 144 -101 22 63 -135 146 -133 57 5 -110
5741 -110 137 -159 95 -28 -65 122 -164 123 -73 -19 86 -127 132 -90 11 58 -101 140 -95 66 21
5762 21 -73 126 -119 83 -15 -45 97 -97 91 -51 -24 63 -104 84 -69 3 41 -85 86 -82 24 1 -71
5785 -71 75 -96 50 -15 -54 64 -94 52 -25 -13 52 -87 74 -50 13 34 -57 79 -59 32 21 -36 65 -62
5809 -62 40 -9 -29 44 -46 36 -24 -10 32 -50 41 -46 -4 9 -50 27 -38 7 -4 -32 30 -41 11 -13 -7 21 -17 14 -14 1
5839 1 12 -6 18 1 6 11 -3 23 3 21 0 -2 13 -4 4 -10 -5 -5 7 -9 -22 2 -30 -5 -12 -14 -4 -26 -2 -24 -20 -3 -16 8 -27
5874 -27 8 2 -17 20 -26 26 -7 -5 30 -13 35 -10 17 16 -28 39 -18 16 7 -21 29 -43 26 -8 -23 25 -45 25 -33 -20 19 -52
5906 -52 29 -41 -7 1 -50 41 -51 -3 -9 -45 31 -46 24 -18 -19 29 -43 36 -23 -8 35 -52 50 -27 5 23 -42 55 -43 23 20 -33
5938 -33 44 -43 32 -12 -36 37 -43 37 -23 -21 25 -61 36 -40 -12 21 -55 43 -43 19 15 -54 53 -55 27 10 -16 44 -50 34
5968 34 5 -33 61 -43 72 -13 0 51 -45 57 -33 22 29 -35 37 -37 9 6 -41 46 -48 20 -9 -16 32 -61 26 -19 -26 20 -49
5999 -49 33 -24 5 23 -37 54 -26 11 25 -27 53 -26 27 11 -19 41 -31 25 4 -14 34 -32 35 -16 -21 29 -36 21 -11 -14 17
6030 17 -34 28 -21 -11 15 -54 22 -31 -5 7 -36 29 -18 8 3 -20 33 -24 19 8 -8 40 -25 26 0 -4 31 -27 28 -12 9
6061 9 26 -29 27 -23 -3 16 -50 20 -33 -5 7 -50 18 -48 5 -1 -33 28 -48 6 -2 -39 32 -51 24 -23 -21 46 -48 46 -17 -7
6093 -7 49 -40 52 -20 2 31 -42 60 -42 13 22 -47 55 -50 30 0 -39 59 -70 37 -21 -45 39 -71 37 -34 -15
6120 -15 26 -66 52 -56 3 12 -52 62 -56 33 9 -47 67 -57 47 2 -23 72 -63 72 -22 -8 59 -76 72
6145 72 -42 -2 42 -71 72 -60 27 11 -60 82 -84 44 -11 -58 67 -95 53 -35 -41 66 -90 61 -56 -5
6169 -5 43 -79 83 -63 37 36 -63 93 -73 47 8 -41 74 -80 71 -27 -15 75 -83 88 -46 -13 45 -86
6193 -86 81 -78 6 13 -91 83 -102 32 -10 -73 79 -97 64 -33 -45 71 -115 78 -56 -6 69 -91 104
6216 104 -65 28 39 -78 107 -75 56 15 -70 102 -93 76 -12 -30 75 -100 89 -44 -16 47 -102 77 -72
6239 -72 10 27 -85 78 -92 30 11 -72 76 -100 48 -19 -38 73 -88 70 -37 -10 51 -84 89 -58 17
6262 17 45 -76 95 -66 53 18 -61 91 -84 55 -13 -39 63 -112 72 -42 -12 48 -95 69 -68 -1 21
6285 21 -85 82 -93 28 -4 -68 68 -91 51 -21 -33 57 -71 66 -28 0 60 -65 78 -47 17 33 -57 74
6309 74 -63 43 8 -46 81 -65 43 -12 -31 56 -83 42 -37 -29 47 -75 57 -51 0 29 -66 53 -48 19 5
6334 5 -39 59 -72 35 -6 -24 66 -56 52 -13 7 45 -53 76 -34 20 33 -44 65 -44 21 14 -34 58 -54 40 -10
6361 -10 -25 40 -59 37 -33 -12 28 -49 37 -38 6 14 -54 38 -45 19 -7 -31 33 -43 25 -4 -30 45 -39 37 -16 -11 30 -38 39
6392 39 -30 10 22 -36 47 -43 11 -7 -29 38 -43 21 -13 -16 14 -46 17 -28 -23 12 -40 15 -25 -10 -6 -37 18 -33 7 3 -22 26
6424 26 -21 20 0 -8 34 -22 25 -10 1 12 -21 31 -14 4 18 -24 18 -25 -7 2 -30 16 -30 3 -14 -19 -1 -40 10 -17 -11 11
6456 11 -27 7 -21 -3 5 -25 15 -20 7 7 -32 28 -19 12 -7 -15 30 -20 22 -7 -5 29 -15 22 -14 1 15 -26 23 -21 8 5 -22
6489 -22 14 -23 4 -11 -23 22 -33 18 -7 -21 21 -40 26 -21 0 13 -33 28 -16 8 22 -28 32 -23 13 5 -9 45 -11 31 0
6520 0 -5 35 -29 32 -21 -8 16 -37 33 -28 -3 17 -40 30 -45 11 -5 -39 45 -56 21 -1 -33 36 -50 40 -14 -15 48 -53 49
6551 49 -27 2 31 -51 61 -31 17 24 -39 62 -51 34 11 -31 53 -65 41 -29 -23 46 -80 53 -52 -26 30 -72 59
6578 59 -57 9 18 -67 60 -67 15 2 -52 77 -74 54 -14 -29 68 -78 73 -23 -3 60 -72 93 -49 16 37
6603 37 -80 101 -69 40 9 -72 85 -100 51 -19 -56 77 -123 68 -55 -33 59 -109 98 -75 -3 42 -102
6626 -102 94 -95 34 20 -89 106 -93 62 -7 -49 109 -105 94 -23 -18 95 -108 114 -60 7 66 -105
6648 -105 119 -96 28 35 -99 116 -119 56 -2 -85 107 -135 83 -48 -61 94 -137 113 -66 -15 76 -128
6670 -128 133 -101 23 57 -109 138 -122 66 16 -68 143 -122 103 -15 -45 130 -131 112 -58 -21 84 -134
6692 -134 127 -90 24 48 -120 131 -133 49 11 -106 131 -139 93 -19 -73 106 -156 110 -60 -31 111
6713 111 -138 146 -88 16 69 -128 147 -115 57 48 -92 148 -113 85 1 -67 128 -147 113 -44 -36 103
6735 103 -146 128 -81 -7 69 -142 133 -121 32 36 -123 131 -138 60 -1 -92 125 -139 94 -34 -50 110
6757 110 -143 114 -72 -10 76 -128 134 -95 33 56 -107 134 -109 70 27 -78 127 -122 84 -11 -59 104
6779 104 -117 107 -61 -32 81 -125 110 -86 9 43 -113 120 -104 49 29 -84 115 -112 66 -8 -38 113
6801 113 -120 100 -37 -13 96 -92 107 -56 15 60 -79 107 -73 40 28 -69 101 -91 41 6 -62 84
6823 84 -108 63 -35 -53 60 -98 74 -48 -12 41 -90 78 -79 20 33 -72 77 -74 41 14 -52 81 -67
6846 -67 61 10 -17 69 -72 75 -20 -9 68 -66 76 -41 16 34 -67 62 -69 23 12 -51 47 -71 22 -13 -43
6871 -43 50 -65 32 -16 -27 39 -59 54 -13 -1 21 -45 51 -38 14 31 -45 51 -36 23 15 -29 45 -37 26 4 -22 42 -36 35
6901 35 -18 -11 28 -34 27 -31 -11 22 -31 36 -35 5 3 -43 24 -23 -1 -4 -23 20 -31 20 5 -8 26 -20 40 7 1 25 -17 33
6933 33 -11 -5 26 -15 31 -11 2 12 -18 22 -24 6 9 -16 21 -20 10 -7 -21 19 -29 3 -7 -11 4 -36 8 -16 -9 17 -21 13
6965 13 -14 11 9 -5 29 -12 14 22 -6 29 -6 25 7 -7 19 -21 18 -2 -10 18 -17 15 -6 -4 5 -21 15 -28 -2 -1 -15 13 -29
6998 -29 0 -1 -17 16 -34 11 -17 -11 8 -24 32 -15 9 22 -10 15 -12 18 -2 4 24 -15 22 5 -5 26 -21 27 -20 -7 16 -29
7030 -29 20 -22 7 4 -29 18 -32 6 -14 -22 16 -34 22 -17 -12 24 -39 30 -13 16 18 -26 51 -31 21 13 -18 57 -32 35 4 -6 45
7063 45 -40 50 -28 -1 23 -39 47 -46 16 7 -40 41 -51 23 -13 -35 42 -59 40 -24 -18 36 -64 51 -36 4 29 -52 70
7092 70 -38 24 28 -34 77 -47 44 12 -33 66 -59 55 -10 -14 53 -66 76 -41 0 40 -63 95 -60 24 21 -65
7118 -65 79 -77 46 3 -50 73 -83 53 -26 -22 66 -82 73 -51 2 59 -80 95 -69 40 46 -65 110 -68
7142 -68 59 24 -48 107 -84 68 -15 -24 84 -96 97 -45 -2 49 -106 100 -80 11 31 -110 97 -110 48
7165 48 13 -73 104 -107 69 -20 -34 95 -116 95 -40 -15 81 -98 118 -64 15 58 -94 123 -85 59 24
7188 24 -74 119 -111 88 -9 -48 111 -128 99 -48 -30 84 -118 107 -82 8 26 -117 114 -100 41 17 -80
7211 -80 110 -114 80 -6 -65 114 -114 107 -44 -43 99 -122 103 -54 13 67 -107 127 -91 32 31 -86 113
7234 113 -121 72 2 -64 117 -130 86 -37 -54 87 -135 95 -73 -15 63 -133 107 -94 17 30 -108 121
7256 121 -106 58 10 -66 119 -114 88 -8 -34 100 -111 112 -38 -1 76 -107 116 -71 19 47 -85 124 -87
7279 -87 38 24 -77 110 -99 70 -4 -58 85 -112 69 -38 -32 63 -109 86 -61 -4 46 -82 100 -77 32
7302 32 32 -58 102 -74 50 10 -45 89 -77 84 -10 -21 80 -83 91 -26 6 55 -81 85 -54 12 31 -86
7326 -86 73 -72 36 14 -57 73 -67 47 -14 -36 67 -74 53 -19 -17 60 -62 69 -40 7 31 -55 74 -41
7350 -41 23 25 -49 63 -45 48 10 -26 45 -68 45 -9 -20 36 -54 46 -34 -9 29 -56 42 -46 -6 19 -50 51 -46 3
7378 3 4 -41 31 -43 23 2 -24 40 -38 34 -4 -11 40 -25 37 0 -3 42 -33 45 -13 9 13 -29 29 -21 2 5 -29 23 -34 12 -6
7411 -6 -30 11 -37 14 -9 -22 19 -31 6 -11 -15 10 -17 20 -3 5 15 -20 23 -8 15 21 -18 27 -12 8 12 -16 26 -2 15 7 -12
7444 -12 11 -25 3 -3 -14 27 -25 -4 -5 -15 12 -28 20 -15 -7 5 -23 8 -14 -6 10 -24 22 -3 2 13 -9 15 -9 12 14 3 26
7477 26 -11 13 5 -13 29 -15 15 -8 -2 16 -12 11 -2 -2 5 -19 20 -28 4 9 -27 3 -24 -2 -5 -20 11 -23 9 -4 -7 10 -20 11
7511 11 -9 -1 22 -16 21 -6 10 14 -8 26 -4 11 -2 0 28 -15 21 6 -1 10 -15 19 -15 1 0 -16 9 -20 2 -5 -18 12 -27
7544 -27 6 -10 2 17 -14 7 -11 0 13 -15 33 -12 13 16 12 31 -18 13 6 6 21 -22 26 -8 5 9 -24 18 -23 9 -3 -16 21
7577 21 -28 22 -15 -18 10 -22 15 -21 -9 9 -23 27 -25 13 -3 -24 31 -30 28 1 -21 36 -26 43 3 0 28 -31 44 -16 11
7608 11 30 -30 44 -29 7 8 -27 36 -46 19 -2 -20 29 -49 35 -19 -14 34 -52 43 -37 12 21 -41 54 -44 19 9 -43 59 -48
7639 -48 40 -4 -20 52 -50 57 -15 1 41 -49 68 -41 12 35 -54 70 -60 31 3 -42 53 -83 36 -17 -39 52
7665 52 -78 45 -29 -16 30 -72 71 -36 4 47 -65 73 -56 17 21 -51 89 -63 48 7 -31 83 -75 68
7689 68 -18 -18 66 -80 80 -49 -2 39 -72 86 -62 22 14 -60 82 -83 35 -8 -53 62 -92 55 -21 -23 67 -83
7715 -83 76 -49 -2 56 -83 92 -53 30 35 -62 85 -55 49 18 -41 88 -69 59 -12 -36 78 -76 73 -40
7739 -40 -19 51 -94 63 -50 12 38 -84 81 -81 23 -1 -70 63 -91 48 -20 -41 72 -85 54 -39 -17 52
7763 52 -87 73 -48 11 47 -72 77 -55 49 27 -51 83 -77 39 6 -40 63 -85 41 -37 -34 51 -77 58
7787 58 -47 -23 37 -78 75 -56 1 23 -72 66 -66 23 6 -45 65 -61 47 -6 -30 69 -70 51 -10 -13 52
7812 52 -58 68 -45 1 28 -52 65 -47 20 12 -62 67 -57 31 -15 -48 49 -75 35 -21 -30 31 -64 52 -28 -11
7838 -11 34 -63 43 -30 9 30 -43 55 -35 23 23 -22 57 -45 35 3 -26 48 -48 41 -12 -20 29 -46 32 -21 -8 26 -45 36
7868 36 -32 15 6 -32 35 -41 16 -2 -42 27 -41 -4 -2 -16 27 -30 17 -18 -10 23 -30 32 -22 2 28 -23 24 -15 2 16 -21 39
7900 39 -29 9 0 -24 17 -22 13 -1 -18 25 -20 3 -10 -16 13 -26 15 -13 -16 12 -33 9 -3 -8 6 -37 17 -16 -4 11 -21 27
7932 27 -14 8 16 -10 29 -5 20 6 -2 43 -8 15 8 2 29 -21 25 4 -22 17 -28 24 -13 -16 12 -27 10 -17 -10 7 -23 16 -24
7965 -24 -5 11 -32 18 -30 8 0 -16 27 -22 19 -7 -8 19 -18 28 -11 3 19 -16 21 -14 9 -3 -33 22 -22 6 -3 -17 14 -36
7997 -36 5 -8 -18 11 -30 8 -21 -7 12 -29 14 -14 -9 11 -15 16 -13 8 11 -17 25 -18 6 7 -1 19 -21 21 4 -1 21 -20 13
8030 13 -16 2 16 -17 19 -13 -8 -4 -24 25 -34 12 -3 -24 15 -22 13 -14 -2 0 -17 16 -22 1 2 -22 33 -24 21 15 -7 24 -17
8063 -17 21 2 -5 24 -22 16 -13 0 15 -24 21 -24 13 0 -16 14 -27 13 -17 -20 15 -34 11 -23 -10 2 -30 27 -20 9 13 -20
8095 -20 20 -24 10 6 -8 35 -26 25 -8 4 25 -38 46 -13 12 17 -24 43 -21 11 -4 -26 30 -36 21 -9 -14 32 -42 26 -27 -1
8127 -1 24 -47 29 -28 10 9 -27 45 -35 16 1 -15 42 -45 42 -3 -13 34 -34 64 -18 17 30 -36 56 -30 7 24 -30 48 -42
8158 -42 30 2 -37 43 -56 43 -27 -17 36 -61 43 -36 -7 27 -51 62 -49 13 10 -37 49 -45 42 3 -27 57 -57 55
8186 55 -9 -16 61 -56 65
8191F5
##END NTUPLES=NMR FID
##END=
