##TITLE=1H_DE-80H_X3
 200.13MHz, d2o
 8 sc
 
 19ns.26.2.2025
##JCAMPDX= 6.0         $$ Bruker NMR JCAMP-DX V2.0
##DATA TYPE= NMR FID
##DATA CLASS= NTUPLES
##ORIGIN= UXNMR, Bruker Analytische Messtechnik GmbH
##OWNER= pz
$$ XWIN-NMR		Version 3.5
$$ Wed Jul 22 15:25:19 2026 Russian Standard Time (UT+4h)  Yarkov@DPX200
##.OBSERVE FREQUENCY= 200.1313
##.OBSERVE NUCLEUS= ^1H
##.DELAY= (6, 6)
##.ACQUISITION MODE= SIMULTANEOUS
##.ACQUISITION SCHEME= undefined
##.AVERAGES= 8
##.DIGITISER RES= 18
##SPECTROMETER/DATA SYSTEM= spect
##.PULSE SEQUENCE= zg30
##.SOLVENT NAME= CDCl3
##.SHIFT REFERENCE= (INTERNAL, CDCl3, 0, 14.3821)
##AUDIT TRAIL= $$ (NUMBER, WHEN, WHO, WHERE, WHAT)
$$ ##TITLE= Audit trail, XWIN-NMR		Version 3.5
$$ ##JCAMPDX= 5.01
$$ ##ORIGIN= Bruker BioSpin GmbH
$$ ##OWNER= Yarkov
$$ C:/Bruker/XWIN-NMR/data/yarkov2/nmr/H-C/1/audita.txt
$$ ##AUDIT TRAIL=  $$ (NUMBER, WHEN, WHO, WHERE, WHAT)
(   1,<2026-07-22 15:23:35.92 +0400>,<Yarkov>,<DPX200>,
      <created by zg, POWCHK disabled, PULCHK disabled
       configuration hash MD5:
       00 E9 B6 7A A2 85 ED C7 34 08 36 98 17 FE 4E 26
       data hash MD5: 16K
       E2 20 81 ED DB 0E 2C E9 05 09 8A A1 97 E0 1B 64>)
$$ ##END=
$$ 
$$ hash MD5
$$ D1 C8 82 24 30 BD F2 D9 60 38 10 AE D1 10 96 6B
##$RELAX= 
##$RELAX= 
##$RELAX= 
##$RELAX= 
##$RELAX= 
##$RELAX= 
$$ Bruker specific parameters
$$ --------------------------
##$DU= <C:/Bruker/XWIN-NMR>
##$EXPNO= 1
##$NAME= <H-C>
##$PROCNO= 1
##$TYPE= <nmr>
##$USER= <yarkov2>
##$AMP= (0..31)
100 100 100 100 100 100 100 100 100 100 100 100 100 100 100 100 100 100 
100 100 100 100 100 100 100 100 100 100 100 100 100 100 
##$AQSEQ= 0
##$AQ_mod= 1
##$AUNM= <au_zg>
##$AUTOPOS= <>
##$BF1= 200.13
##$BF2= 200.13
##$BF3= 200.13
##$BF4= 200.13
##$BF5= 200.13
##$BF6= 200.13
##$BF7= 200.13
##$BF8= 200.13
##$BYTORDA= 1
##$CFDGTYP= 0
##$CFRGTYP= 5
##$CHEMSTR= <none>
##$CNST= (0..31)
1 1 145 1 1 1 1 1 1 1 1 1 1 1 1 1 1 1 1 1 1 1 1 1 1 1 1 1 1 1 1 1 
##$CPDPRG= <>
##$CPDPRG1= <>
##$CPDPRG2= <>
##$CPDPRG3= <>
##$CPDPRG4= <mlev>
##$CPDPRG5= <mlev>
##$CPDPRG6= <mlev>
##$CPDPRG7= <mlev>
##$CPDPRG8= <mlev>
##$CPDPRGB= <>
##$CPDPRGT= <>
##$D= (0..31)
0 0.7 0 0 0 0 0 0 0 0 0 0.03 0 0 0 0 0 0 0 0 0 0 0 0 0 0 0 0 0 0 0 0 
##$DATE= 1784719415
##$DBL= (0..7)
120 120 120 120 120 120 120 120 
##$DBP= (0..7)
150 150 150 150 150 150 150 150 
##$DBP07= 0
##$DBPNAM0= <>
##$DBPNAM1= <>
##$DBPNAM2= <>
##$DBPNAM3= <>
##$DBPNAM4= <>
##$DBPNAM5= <>
##$DBPNAM6= <>
##$DBPNAM7= <>
##$DBPOAL= (0..7)
0.5 0.5 0.5 0.5 0.5 0.5 0.5 0.5 
##$DBPOFFS= (0..7)
0 0 0 0 0 0 0 0 
##$DE= 6
##$DECBNUC= <off>
##$DECIM= 32
##$DECNUC= <off>
##$DECSTAT= 4
##$DIGMOD= 1
##$DIGTYP= 9
##$DL= (0..7)
0 120 120 120 120 120 120 120 
##$DP= (0..7)
150 150 150 150 150 150 150 150 
##$DP07= 0
##$DPNAME0= <>
##$DPNAME1= <>
##$DPNAME2= <>
##$DPNAME3= <>
##$DPNAME4= <>
##$DPNAME5= <>
##$DPNAME6= <>
##$DPNAME7= <>
##$DPOAL= (0..7)
0.5 0.5 0.5 0.5 0.5 0.5 0.5 0.5 
##$DPOFFS= (0..7)
0 0 0 0 0 0 0 0 
##$DQDMODE= 0
##$DR= 18
##$DS= 0
$$ [...]
##$SUBNAM2= <"">
##$SUBNAM3= <"">
##$SUBNAM4= <"">
##$SUBNAM5= <"">
##$SUBNAM6= <"">
##$SUBNAM7= <"">
##$SUBNAM8= <"">
##$SUBNAM9= <"">
##$SW= 18.0517328524113
##$SWIBOX= (0..15)
0 0 2 0 0 0 0 0 0 0 0 0 0 0 0 0 
##$SW_h= 3612.71676300578
##$TD= 16384
##$TD0= 1
##$TE= 0
##$TE2= 300
##$TE3= 300
##$TEG= 300
##$TL= (0..7)
0 120 120 120 120 120 120 120 
##$TP= (0..7)
150 150 150 150 150 150 150 150 
##$TP07= 0
##$TPNAME0= <>
##$TPNAME1= <>
##$TPNAME2= <>
##$TPNAME3= <>
##$TPNAME4= <>
##$TPNAME5= <>
##$TPNAME6= <>
##$TPNAME7= <>
##$TPOAL= (0..7)
0.5 0.5 0.5 0.5 0.5 0.5 0.5 0.5 
##$TPOFFS= (0..7)
0 0 0 0 0 0 0 0 
##$TUNHIN= 0
##$TUNHOUT= 0
##$TUNXOUT= 0
##$USERA1= <user>
##$USERA2= <user>
##$USERA3= <user>
##$USERA4= <user>
##$USERA5= <user>
##$V9= 5
##$VALIST= <valist>
##$VCLIST= <CCCCCCCCCCCCCCC>
##$VD= 0
##$VDLIST= <DDDDDDDDDDDDDDD>
##$VPLIST= <PPPPPPPPPPPPPPP>
##$VTLIST= <TTTTTTTTTTTTTTT>
##$WBST= 1024
##$WBSW= 4
##$XGAIN= (0..3)
0 0 0 0 
##$XL= 0
##$YL= 0
##$YMAX_a= 207740
##$YMIN_a= -245994
##$ZGOPTNS= <>
##$ZL1= 120
##$ZL2= 120
##$ZL3= 120
##$ZL4= 120
##$ABSF1= 10
##$ABSF2= 0
##$ABSG= 5
##$ABSL= 3
##$ALPHA= 0
##$AQORDER= 0
##$ASSFAC= 0
##$ASSFACI= 0
##$ASSFACX= 0
##$ASSWID= 0
##$AUNMP= <proc_1d>
##$AZFE= 0.1
##$AZFW= 0.1
##$BCFW= 1
##$BC_mod= 2
##$BYTORDP= 1
##$COROFFS= 0
##$CY= 83.5205535888672
##$DATMOD= 1
##$DC= 2
##$DFILT= <>
##$DTYPP= 0
##$F1P= 10.8118882576601
##$F2P= -7.23987719738617
##$FCOR= 0.5
##$FTSIZE= 0
##$FT_mod= 4
##$GAMMA= 1
##$GB= 0.15
##$INTBC= 1
##$INTSCL= 1
##$ISEN= 128
##$LB= 0.25
##$LEV0= 0
##$LPBIN= 0
##$MAXI= 10000
##$MC2= 0
##$MEAN= 0
##$ME_mod= 0
##$MI= 1.114404
##$NCOEF= 0
##$NC_proc= 0
##$NLEV= 6
##$NOISF1= 3.799351
##$NOISF2= 2.8
##$NSP= 1
##$NTH_PI= 0
##$NZP= 0
##$OFFSET= 14.38212
##$PC= 1
##$PHC0= -7173.783
##$PHC1= 2.82197
##$PH_mod= 1
##$PKNL= yes
##$PPARMOD= 0
##$PSCAL= 0
##$PSIGN= 0
##$REVERSE= no
##$SF= 200.129724274929
##$SI= 16384
##$SIGF1= 3
##$SIGF2= 2
##$SINO= 400
##$SIOLD= 16384
##$SREGLST= <1H.CDCl3>
##$SSB= 0
##$STSI= 0
##$STSR= 0
##$SW_p= 3205.1282051282
##$SYMM= 0
##$S_DEV= 0
##$TDeff= 0
##$TDoff= 0
##$TI= <>
##$TILT= no
##$TM1= 0
##$TM2= 0
##$TOPLEV= 0
##$USERP1= <user>
##$USERP2= <user>
##$USERP3= <user>
##$USERP4= <user>
##$USERP5= <user>
##$WDW= 1
##$XDIM= 8192
##$YMAX_p= 0
##$YMIN_p= 0
$$ End of Bruker specific parameters
$$ ---------------------------------
##NTUPLES= NMR FID
##VAR_NAME=  TIME,          FID/REAL,        FID/IMAG
##SYMBOL=    X,             R,               I
##VAR_TYPE=  INDEPENDENT,   DEPENDENT,       DEPENDENT
##VAR_FORM=  AFFN,          ASDF,            ASDF
##VAR_DIM=   8192,          8192,            8192
##UNITS=     SECONDS,       ARBITRARY UNITS, ARBITRARY UNITS
##FACTOR=    0.0002768,     1,               1
##FIRST=     0,             0,               0
##LAST=      2.2672688,     0,               0
##MIN=       0,             -245994,         0
##MAX=       2.2672688,     207740,          0
$$ Real data points
##PAGE= N=1
##DATA TABLE= (X++(R..R)), XYDATA
0 0 0 0 0 0 0 0 0 0 0 8 -8 8 -8 8 -16 16 -24 25 -32 40 -48 56 -67 80 -92 107 -128 145 -169 193 -220 250
32 250 -284 320 -360 406 -455 510 -570 635 -707 782 -869 960 -1063 1170 -1291 1423 -1567
49 -1567 1728 -1902 2095 -2308 2544 -2811 3116 -3460 3857 -4318 4863 -5518 6323 -7338 8658
64 8658 -10454 13045 -17102 24349 -41086 150410 18340 -181640 158853 -121597 109976
75 109976 12332 -167978 131094 30896 -56538 -34886 29224 48722 -37370 7198 -90148
86 -90148 142770 4234 -186601 177693 -61816 -272 73735 -204302 207740 -5503 -167038
97 -167038 142203 -63152 47768 6897 -116193 107470 24632 -60372 -41061 75343 11276
108 11276 -58367 40802 -78714 117512 -1178 -178121 190602 -55322 -40506 84582 -155295
119 -155295 160256 -4485 -154096 134905 -30486 -135 5353 -59965 68401 17825 -51172
130 -51172 -38868 94245 -17265 -67960 73363 -74894 84134 3719 -152961 178015 -50532
141 -50532 -64313 95654 -112644 103191 3621 -124900 111838 -7312 -34571 10655 -14244
152 -14244 25119 13909 -32274 -38042 95988 -35160 -66570 94125 -72703 50246 18026
163 18026 -126628 149474 -40011 -75515 100136 -79539 51669 17469 -95566 82530
173 82530 8334 -52607 17266 14552 -12540 16583 -10919 -44411 90092 -40354 -61272 104433
185 104433 -74345 23956 38263 -107040 113521 -23427 -77256 96345 -53497 7412 35059
196 35059 -66648 44411 23564 -55355 15997 32870 -38922 18918 9350 -51176 75092 -31460
208 -31460 -54099 96695 -65742 4076 51559 -87256 74306 -1667 -73163 80927 -29037
219 -29037 -24075 48349 -44050 9119 39223 -52013 8749 44590 -54721 21511 24612 -60353
231 -60353 63298 -16911 -52711 85544 -53783 -10834 61232 -72785 40359 20796 -67607
242 -67607 60194 -7294 -42736 53910 -26393 -18377 50957 -43949 -2598 50549 -57656 19343
254 19343 32952 -62749 50396 -1270 -52207 68897 -34623 -23342 61520 -55234 11520
265 11520 38995 -60456 36468 14617 -52843 49682 -9317 -37379 56161 -32810 -16008 53801
277 53801 -51695 10939 38414 -59884 37456 12634 -53406 54822 -16060 -34315 59374 -40333
289 -40333 -8969 51499 -55159 17748 32349 -58397 41661 5863 -49315 56003 -20988
300 -20988 -28723 56005 -41938 -2168 44126 -53140 22159 25362 -53007 40320 2156 -42704
312 -42704 51854 -22708 -24131 53769 -43440 858 42043 -54089 27132 19364 -51817 46130
324 46130 -6294 -37623 52699 -28546 -16117 48338 -44504 7223 35775 -51791 28665 15818
336 15818 -48341 45171 -8783 -34361 52330 -31394 -12906 47161 -46137 11275 31562 -51238
348 -51238 33046 10165 -46180 47678 -13779 -29885 51680 -36367 -5286 43485 -49747 19143
360 19143 24506 -48240 36154 1162 -36553 44379 -17923 -22924 45166 -31162 -6706 39268
372 39268 -43680 16097 26141 -52025 39295 3347 -42596 51018 -26095 -15037 46727 -46041
384 -46041 11248 29744 -43646 24096 8634 -31681 31468 -5528 -29011 40225 -14231 -25491
396 -25491 44939 -33000 -641 39263 -57825 34510 18279 -56455 51930 -17376 -21248 47032
408 47032 -44750 9057 32203 -39398 11792 15489 -21959 13324 6164 -30287 32269 3778
420 3778 -45496 48984 -16437 -20668 47629 -56768 28940 29245 -66688 49731 -6337 -24204
432 -24204 38637 -38804 11710 27426 -33206 760 21370 -9404 -8966 16897 -25300 21853
444 21853 17304 -62092 54753 -1021 -41891 54196 -51910 25196 34230 -76201 51917 3618
456 3618 -28891 28044 -29660 17777 16799 -27778 -6014 27529 1449 -34184 29885 -15783 7323
469 7323 26672 -72732 61510 10467 -62799 59613 -41619 20202 30960 -77938 55741
480 55741 8865 -33066 16065 -15081 23074 -1108 -18416 -7401 29533 8629 -56186 44142
492 44142 -4218 -12438 32817 -72180 64021 16309 -79257 64258 -26922 10716 22455 -70645
504 -70645 59873 8443 -38183 8268 1727 24326 -21348 -6765 -3842 27965 9787 -71880
516 -71880 61387 2614 -34001 40177 -66373 64144 15195 -90179 72563 -15529 -2349
527 -2349 14429 -55485 60461 529 -37706 4488 16003 21231 -41440 10986 1241 16602
539 16602 11469 -75788 71763 6080 -53378 46787 -51427 53822 9872 -87862 76211
550 76211 -6868 -17130 8545 -34055 54278 -10019 -33748 5598 26417 11848 -54464 30158
562 30158 3927 2320 12796 -71785 78256 3311 -67932 56915 -38157 38394 5117 -77762
574 -77762 77503 -6070 -28050 8276 -14331 42523 -21628 -21089 6972 26811 4164 -59184
586 -59184 47585 1232 -13781 19687 -61899 73686 -1235 -72007 64097 -26758 18820
597 18820 3210 -58985 69076 -7464 -32979 9264 3490 25616 -29334 -4962 6666 21870
609 21870 -1913 -55663 58030 -3448 -26695 27084 -48651 61021 -5105 -67196 66945
620 66945 -20169 870 6541 -40452 54557 -9323 -31164 11778 12849 8458 -29210 11268 278
633 278 14784 -1467 -49035 61127 -10734 -33047 36823 -39913 43758 -3986 -56390 62010
645 62010 -15963 -11631 10562 -22463 35103 -9806 -22390 10152 16750 -3693 -25888 23294
657 23294 -6486 6858 2472 -39618 54423 -13740 -33363 40895 -31086 24929 1204 -43400
669 -43400 49757 -10683 -19248 15272 -9963 14621 -4323 -13586 4865 18021 -11310 -19021 29288
682 29288 -15161 3273 8840 -33477 43975 -13397 -29383 40909 -26216 10464 8411 -32204
694 -32204 34384 -5070 -20611 16316 -1814 -1152 1641 -5061 -2743 17669 -12371 -14247 29667
707 29667 -19193 678 14183 -28115 30641 -7426 -25010 34547 -18248 -1614 14700 -22278
719 -22278 17105 3413 -19553 13374 4023 -11833 7922 -183 -9962 17825 -10733 -10867 26077
732 26077 -19997 716 16709 -25146 20138 -210 -22032 27036 -11385 -9014 19306 -16603
744 -16603 3916 11875 -18518 8588 9014 -17678 11171 3230 -15476 17792 -6964 -10938 21802
757 21802 -16112 -1301 16911 -20476 10317 6896 -19338 17455 -2549 -13676 19050 -10227
769 -10227 -5893 17536 -16082 2498 13040 -18915 10810 5296 -17512 16638 -3464 -11878 18033
782 18033 -10882 -4187 16245 -16032 3226 12339 -18393 10514 5169 -17434 17620 -4889 -12144
795 -12144 20665 -14067 -2325 16354 -18658 8280 7621 -17687 14258 -192 -13007 15254
807 15254 -5802 -7716 15334 -11041 -2561 15112 -16213 4693 10692 -18721 13804 940 -15484
820 -15484 19336 -9502 -6662 17275 -15304 3016 10448 -15567 8951 4105 -13327 11668 -691
833 -691 -10887 14136 -6320 -7000 15873 -13317 576 13280 -18097 10072 5193 -16758 16479
846 16479 -4718 -9948 17105 -11686 -2001 13547 -14407 4403 8568 -14754 9586 3080 -13622
859 -13622 13832 -3446 -9678 15688 -10217 -2747 13731 -14619 4814 8349 -15129 10726 1514
872 1514 -12599 14248 -5128 -7777 14871 -11144 -626 12213 -15154 6940 6306 -14436 11810
885 11810 -1285 -9447 13201 -7182 -4522 12387 -9601 -967 10173 -11527 4537 6869 -14998
898 -14998 12057 1309 -14224 16508 -8094 -4593 14985 -16742 6593 8609 -15749 10312
910 10312 33 -7273 9383 -5262 -4129 10134 -4494 -7131 11640 -5971 -3043 11219 -15777
923 -15777 9805 7205 -20696 17708 -3853 -8259 15317 -16669 7356 8883 -16031 8008 1889
936 1889 -3502 2331 -2306 -1487 5712 605 -12864 12941 853 -12075 14266 -13638 7259 10673
950 10673 -25953 19618 392 -12376 14355 -15198 9540 7057 -17289 8133 3819 -1358 -4524
963 -4524 929 2421 721 3511 -16580 15529 5635 -21404 18149 -10505 4179 12073 -29391
976 -29391 22603 2978 -16522 12889 -11625 11644 1630 -15782 9373 3777 1147 -12297
988 -12297 5764 7541 -7728 6638 -16761 16349 8805 -29608 21745 -5168 -892 10966 -28495
1001 -28495 25182 3493 -20807 12387 -6101 11381 -4633 -12959 12160 2776 576 -16740
1013 -16740 11500 10305 -16077 9560 -14311 15973 8826 -34648 26324 -1708 -6722 10194
1025 10194 -25074 26639 917 -22664 13498 -2128 9891 -11080 -7190 14570 -1624 1294
1037 1294 -18909 16593 11306 -24814 14315 -10218 12429 7555 -35660 29988 579 -13129
1049 -13129 9295 -17720 24908 -3816 -21157 14880 1018 6265 -15810 296 15521 -7363
1061 -7363 1804 -16851 19029 9319 -29615 18547 -6061 6990 5810 -32155 31215 161 -17603
1074 -17603 10532 -11227 20239 -7302 -17226 15916 1430 2382 -16860 7358 13427 -12900 4616
1087 4616 -13888 18665 6324 -31310 23029 -3570 371 4992 -25465 29400 -2158 -18719
1099 -18719 11396 -5012 14086 -10972 -9918 15194 -624 260 -15846 12514 9996 -17169 8118
1112 8118 -9853 14704 3777 -28582 24319 -2180 -5562 5890 -17964 23526 -3255 -17317
1124 -17317 12109 -1384 6873 -10127 -3688 11993 -2377 -682 -12370 14057 5342 -17698 11272
1137 11272 -7288 9656 2391 -23491 23309 -2532 -9083 7300 -11359 16500 -4265 -13153
1149 -13153 11227 270 1831 -9042 2397 7623 -4723 1235 -9680 12961 2300 -16775
1161 -16775 13442 -5422 3773 3161 -17335 18514 -1992 -10053 7989 -6205 8692 -2878 -8484
1174 -8484 8312 937 -1355 -5903 4927 2912 -4455 2652 -7179 10011 257 -13248 13123 -4791
1188 -4791 -94 4505 -12232 12921 -1170 -9359 7970 -3006 2448 -814 -4302 4434 1377 -2193
1202 -2193 -4032 6141 -591 -3998 4614 -6083 6422 594 -10009 10778 -3519 -2621 5475 -7744
1216 -7744 6504 764 -7109 5618 -411 -1564 1088 -1272 276 2301 -1742 -2954 5601 -2431
1230 -2431 -2450 4928 -5303 3574 1547 -7095 7325 -1908 -3675 5737 -4757 1527 3033 -5499 3168
1245 3168 1569 -3921 2645 228 -2697 3435 -1354 -2541 4701 -2869 -1247 4328 -4401 1536 2608
1260 2608 -5038 3741 373 -4047 4663 -1930 -2188 4693 -3661 -71 3585 -4445 2254 1515 -4204
1275 -4204 3704 -434 -2788 3573 -1803 -1057 3128 -2737 -177 3208 -3465 794 2543 -4222 3257
1290 3257 228 -4185 5512 -2770 -1849 4914 -4776 1935 2035 -4624 3820 -312 -2721 2987 -1002
1305 -1002 -1243 2262 -1183 -1437 3312 -2276 -1131 4048 -4263 1687 2220 -5154 4944 -1357 -3069
1320 -3069 5198 -3915 544 2645 -3803 2327 495 -2272 1677 350 -1824 1427 637 -2755 3090
1335 3090 -931 -2420 4615 -3892 509 3428 -5256 3791 -90 -3417 4590 -2876 -478 3013 -2975
1350 -2975 856 1338 -1950 784 1161 -2305 1337 1304 -3402 2991 -320 -2725 4240 -3196 -72 3522
1366 3522 -4507 2342 1088 -3290 3143 -1033 -1597 2843 -1570 -1029 2509 -1643 -594 2456 -2645
1381 -2645 854 1943 -3580 2584 343 -2877 3352 -1647 -1034 2931 -2667 413 2047 -2755 1222
1396 1222 1253 -2750 2169 85 -2471 3319 -1813 -1158 3463 -3270 884 1783 -3037 2445 -332 -1967
1412 -1967 2548 -759 -1445 1844 -422 -1208 2194 -1890 -288 3326 -4123 1488 2086 -3845 3623 -1933
1428 -1933 -1254 4249 -3989 726 1807 -1805 1216 -921 -110 976 378 -2088 614 2760 -3725 1950
1444 1950 -79 -1927 4899 -5509 1062 4338 -5358 3394 -1739 -635 4381 -5162 1279 1907 -942
1459 -942 -25 -1716 2356 -432 250 -1899 -39 5025 -5870 1457 1988 -2991 5297 -6466 1415
1474 1415 5941 -7008 3199 -1274 340 3563 -6206 2547 1806 -374 -1626 -1756 5277 -2954 153
1489 153 -1003 -619 6940 -8582 1572 4771 -4858 4941 -6477 2189 6649 -8627 2876 93
1503 93 1144 1620 -6444 4545 1046 -476 -2554 -1445 7499 -5425 -250 753 -1040 7090 -9964
1518 -9964 1989 6743 -6449 4063 -5568 3048 6261 -10008 3429 1323 1000 -173 -6082 6555
1532 6555 -161 -1250 -2505 -557 8681 -8120 -68 3145 -2088 6381 -10402 3025 8001 -8493
1546 -8493 3311 -3479 3499 4392 -10096 4420 1930 622 -2205 -4461 8229 -2462 -1353 -1705
1560 -1705 -19 8834 -10106 627 5189 -3500 5223 -9379 3732 7961 -9782 3016 -1334
1573 -1334 3012 2522 -9351 5546 1955 -685 -2654 -2700 8602 -4334 -1660 189 74 7425 -10531
1588 -10531 1643 6546 -5206 3921 -7102 4028 6694 -10266 3272 594 1923 383 -7214
1601 -7214 6264 775 -1163 -2841 -911 8304 -6550 -571 1675 -856 6327 -10038 2512 6856
1615 6856 -6615 3258 -4569 3389 4970 -9299 3495 1507 689 -773 -4842 6114 -514 -1486
1629 -1486 -1822 68 6760 -7024 254 2879 -1807 4583 -7991 2873 6047 -7182 2863 -2066
1643 -2066 2095 3131 -7429 3551 1713 -526 -1355 -2326 5171 -1940 -781 -1011 282 5328 -6973
1658 -6973 1363 3182 -3012 3789 -5748 2317 4878 -6550 2466 -338 729 1724 -4811 2760 1305
1673 1305 -753 -1530 -490 3722 -2678 168 -388 4 3805 -5685 1760 2867 -3483 2918 -3335 1270
1689 1270 3510 -5177 1995 740 -600 997 -2531 1658 883 -807 -1132 466 2151 -2516 852
1704 852 -118 -500 2813 -4065 1412 2395 -3360 2348 -1447 -161 2751 -3315 837 1416 -1202 369
1720 369 -344 178 527 20 -1294 876 1165 -2193 1351 -129 -974 2227 -2490 581 1955 -2685 1583
1737 1583 -85 -1235 2115 -1623 -244 1663 -1402 219 646 -939 667 287 -1166 863 407 -1305
1753 -1305 1121 -173 -976 1694 -1185 -383 1761 -1809 640 901 -1930 1726 -226 -1451 1942 -1072
1769 -1072 -314 1381 -1537 597 794 -1370 692 379 -928 707 78 -1048 1295 -259 -1241 1808
1785 1808 -1047 -340 1621 -2129 1272 659 -2146 2069 -751 -671 1606 -1629 638 735 -1223 599
1801 599 255 -461 158 350 -794 656 409 -1575 1665 -482 -1022 2023 -1983 769 1122 -2345 1980
1818 1980 -457 -1029 1665 -1332 308 729 -909 242 421 -353 -289 920 -948 180 1089 -1913 1564
1835 1564 -71 -1585 2342 -1735 113 1511 -2173 1519 -108 -1121 1471 -845 -101 607 -398
1850 -398 -112 379 -167 -486 1106 -962 -80 1314 -1801 1217 83 -1448 2092 -1410 -81 1476
1866 1476 -1656 935 116 -895 1024 -328 -489 546 132 -680 599 -18 -762 1344 -1082 -163 1505
1883 1505 -1802 894 395 -1343 1619 -888 -462 1352 -1036 83 602 -676 287 386 -828 488
1899 488 514 -1220 955 20 -927 1349 -1011 1 1125 -1444 755 329 -913 818 -281 -349 682
1916 682 -330 -419 849 -384 -484 1045 -930 287 698 -1442 1332 -189 -1044 1397 -864 108 570
1933 570 -937 646 209 -614 89 597 -500 -89 576 -965 1133 -326 -1257 2029 -1220 -121 957
1950 957 -1482 1635 -603 -1024 1523 -664 70 -168 -75 605 -351 -136 -425 1281 -579 -985 1518 -1082
1968 -1082 917 -324 -1484 2716 -1542 -497 1178 -1204 1683 -1300 -611 1782 -849 20 -677 879
1984 879 440 -1159 519 -642 1671 -902 -1667 2688 -1425 474 -131 -1497 3250 -2071 -789 1669
2000 1669 -936 1319 -1794 91 1788 -1079 -90 -935 1892 -116 -1822 1384 -784 1752 -1248
2015 -1248 -1895 3592 -1772 -89 127 -1070 3198 -2658 -608 2059 -839 833 -2128 1073 1622 -1795
2031 -1795 218 -851 2282 -586 -2415 2405 -827 1138 -1208 -1709 4083 -2248 -626 782 -721
2046 -721 2687 -2973 -214 2345 -955 234 -1950 1909 987 -2126 599 -722 2523 -1307 -2422
2061 -2422 3273 -1180 629 -1060 -1248 4063 -2692 -733 1269 -368 1793 -3011 588 2105 -1260
2076 -1260 -4 -1588 2449 229 -2439 1363 -523 1931 -1464 -2062 3656 -1419 -126 -427 -689 3342
2092 3342 -2811 -594 1726 -361 891 -2524 1163 1651 -1495 -29 -1036 2489 -506 -2296 1910
2107 1910 -595 1387 -1435 -1551 3607 -1743 -460 183 -353 2413 -2566 -230 1712 -403 161 -1796
2123 -1796 1601 808 -1478 243 -651 2139 -968 -1837 2260 -742 610 -900 -964 2914 -1689 -617
2139 -617 722 -169 1294 -1937 159 1371 -523 -137 -1124 1563 219 -1353 604 -464 1498 -891
2155 -891 -1436 2201 -812 90 -261 -736 2140 -1366 -640 1020 -183 481 -1097 268 853 -380 -266
2172 -266 -542 1339 -359 -876 814 -533 960 -638 -967 1805 -812 -224 304 -514 1140 -747 -520
2189 -520 831 -86 -83 -439 354 239 -191 -120 -380 972 -402 -645 884 -550 428 -65 -849 1261 -466
2208 -466 -485 664 -475 417 -36 -571 597 60 -386 86 210 -169 139 -66 -332 683 -341 -373 748
2227 748 -554 163 349 -767 709 -41 -630 720 -338 -146 547 -576 168 397 -529 244 182 -387
2245 -387 324 37 -430 446 -15 -446 564 -289 -195 692 -738 197 562 -852 615 -53 -541 885 -605
2264 -605 -127 654 -595 203 177 -413 363 72 -451 300 235 -559 422 -26 -459 856 -690 -122 946
2283 946 -1045 490 234 -816 1041 -547 -339 858 -597 65 281 -342 187 180 -397 77 521 -709
2301 -709 301 378 -846 949 -457 -485 1224 -1113 271 590 -1018 893 -269 -501 813 -451 -126
2318 -126 376 -210 -102 380 -330 -207 737 -800 199 597 -1197 1000 -230 -743 1314 -1047 125 784
2336 784 -1104 746 7 -607 684 -232 -277 417 -80 -401 570 -198 -476 957 -800 63 854 -1316
2354 -1316 942 96 -1041 1292 -758 -157 905 -1009 421 375 -686 387 157 -440 314 173 -678
2371 -678 719 -46 -808 1157 -697 -181 1022 -1321 806 333 -1224 1183 -412 -417 895 -811 171
2388 171 579 -700 134 500 -573 183 412 -838 749 73 -1053 1287 -561 -464 1160 -1221 550
2405 550 576 -1301 1017 -41 -712 823 -453 -186 710 -573 -208 832 -628 -102 763 -977 612
2422 612 357 -1269 1321 -326 -791 1291 -1021 224 793 -1257 762 285 -899 695 -76 -487 715
2439 715 -346 -486 1007 -602 -371 1048 -1034 366 625 -1358 1204 -106 -1045 1355 -796 -147
2455 -147 958 -1136 480 527 -971 532 263 -713 620 -5 -763 1056 -394 -699 1316 -974 26
2472 26 987 -1464 987 243 -1292 1352 -509 -493 1070 -928 137 724 -895 248 571 -813 391
2489 391 387 -1015 977 -72 -1041 1467 -841 -335 1290 -1468 741 542 -1419 1266 -260 -706 1073
2506 1073 -695 -116 785 -724 -55 787 -718 78 760 -1144 760 334 -1387 1527 -540 -775 1561
2523 1561 -1405 420 861 -1550 1101 41 -902 955 -381 -330 735 -447 -408 958 -585 -392 1155
2540 1155 -1178 457 756 -1705 1533 -226 -1187 1746 -1242 141 1032 -1527 922 279 -955 730
2556 730 -59 -440 536 -86 -686 1027 -315 -875 1491 -1088 45 1138 -1883 1446 113 -1573 1830
2573 1830 -974 -183 1118 -1407 729 453 -962 446 324 -496 202 316 -903 983 -10 -1351 1807
2590 1807 -902 -440 1522 -1908 1258 403 -1827 1828 -649 -507 1085 -1091 501 506 -850 135 670
2607 670 -518 -206 785 -1026 797 295 -1702 1988 -696 -928 1795 -1765 941 619 -1929 1751
2623 1751 -325 -795 983 -682 219 445 -623 -147 931 -511 -613 1259 -1077 465 659 -1914
2639 -1914 2022 -446 -1376 2039 -1524 511 812 -1839 1534 -51 -1024 844 -219 -116 310 -262
2655 -262 -418 1055 -444 -957 1660 -1111 73 1017 -1945 1863 -220 -1658 2099 -1170 40 930
2671 930 -1538 1152 170 -1080 658 232 -425 138 209 -647 1049 -278 -1170 1944 -1071 -299 1377
2688 1377 -1845 1520 55 -1758 2046 -828 -442 1053 -1071 754 301 -983 424 564 -700 -29
2704 -29 573 -904 907 -71 -1348 1935 -950 -615 1674 -1699 1069 367 -1735 1786 -470 -817 1121
2721 1121 -728 128 557 -794 111 880 -887 -103 1003 -1153 722 252 -1456 1862 -783 -906 1785
2738 1785 -1471 508 699 -1580 1380 -88 -1064 1073 -310 -404 710 -520 -257 1050 -897 -239
2754 -239 1258 -1286 524 577 -1500 1604 -480 -1065 1761 -1187 11 987 -1375 855 324 -1178
2770 -1178 909 77 -811 800 -222 -612 1141 -764 -411 1375 -1278 279 859 -1502 1230 -64
2786 -64 -1211 1607 -795 -447 1208 -1109 313 698 -1170 630 438 -1074 797 91 -924 1164
2802 1164 -528 -629 1411 -1146 30 1094 -1445 853 322 -1292 1340 -398 -757 1284 -826 -149
2818 -149 985 -1054 296 726 -1175 671 385 -1153 1085 -213 -880 1386 -878 -283 1235 -1326
2834 -1326 471 681 -1333 1027 14 -991 1208 -494 -538 1148 -852 -93 968 -1103 389 678
2850 678 -1263 921 130 -1111 1319 -567 -569 1323 -1134 158 948 -1305 721 346 -1090 1005 -188
2867 -188 -767 1136 -575 -461 1115 -900 28 936 -1283 681 486 -1328 1207 -232 -847 1351 -938
2884 -938 -127 1104 -1203 412 607 -1046 701 142 -877 960 -192 -805 1182 -593 -436 1194
2900 1194 -1187 362 841 -1521 1083 95 -1091 1309 -715 -293 1107 -1048 169 745 -879 303
2916 303 425 -827 637 204 -1108 1163 -206 -906 1388 -1051 57 1111 -1657 996 371 -1263
2932 -1263 1209 -521 -333 978 -868 -7 769 -606 -163 673 -655 194 626 -1335 1065 245 -1443
2949 -1443 1567 -799 -296 1341 -1733 920 584 -1393 1060 -295 -316 683 -613 -100 677 -257 -644
2966 -644 917 -351 -358 1020 -1428 927 636 -1892 1716 -533 -604 1400 -1707 923 634 -1445 924
2983 924 -96 -180 265 -328 -41 442 76 -1078 1119 -18 -981 1350 -1402 731 932 -2283 1855
3000 1855 -228 -954 1408 -1536 910 557 -1427 811 104 -52 -234 44 90 89 412 -1405 1291 300
3018 300 -1636 1704 -1220 446 1097 -2497 2004 -51 -1253 1348 -1267 910 287 -1274 762 180
3034 180 46 -729 469 234 -409 716 -1553 1410 503 -2161 2027 -989 107 1165 -2485 2076
3050 2076 57 -1493 1299 -885 816 -67 -976 756 149 127 -1129 897 348 -981 1097 -1538
3066 -1538 1326 654 -2565 2302 -720 -355 1213 -2240 1996 23 -1587 1250 -520 635 -432
3081 -432 -525 738 -24 244 -1331 1292 402 -1477 1429 -1376 1140 611 -2610 2421 -525 -739 1163
3098 1163 -1831 1794 -128 -1463 1190 -256 383 -724 18 612 -328 352 -1413 1465 293 -1824
3114 -1824 1825 -1205 732 707 -2557 2422 -394 -1087 1202 -1365 1369 -314 -1282 1099 -85 152
3130 152 -909 556 414 -558 630 -1332 1515 225 -2034 1975 -1030 289 762 -2192 2238 -327
3146 -327 -1200 1188 -881 883 -300 -790 893 3 7 -918 865 203 -750 855 -1237 1261 200
3163 200 -1990 2080 -837 -155 895 -1765 1772 -235 -1224 1172 -475 382 -274 -363 565 12 -13 -846
3181 -846 1079 -47 -924 1096 -1106 940 245 -1789 1946 -673 -498 969 -1318 1235 -116 -1055
3197 -1055 991 -198 -14 -194 9 205 4 51 -771 1081 -219 -889 1213 -990 588 344 -1489
3214 -1489 1623 -495 -672 1003 -908 652 90 -822 687 49 -268 -104 303 -137 26 192 -731 966
3232 966 -235 -843 1231 -857 237 533 -1238 1182 -214 -780 935 -549 113 298 -577 338 239
3249 239 -400 -54 443 -399 78 309 -710 775 -187 -719 1072 -687 -18 623 -945 709 46 -752
3267 -752 761 -239 -257 447 -352 -7 411 -419 -61 538 -524 93 398 -683 568 -5 -655 881
3285 881 -439 -258 713 -700 272 333 -731 531 87 -552 585 -202 -279 558 -364 -129 548 -513 75
3304 75 441 -614 389 142 -596 638 -190 -389 687 -467 -45 533 -633 285 283 -622 501 -3 -449
3323 -449 580 -264 -228 528 -427 -13 445 -520 194 300 -572 416 67 -526 625 -257 -301 659 -540 47
3343 47 464 -644 370 152 -534 515 -108 -343 497 -276 -164 484 -405 -3 418 -534 250 251 -575 519
3363 519 -82 -408 626 -401 -110 499 -531 186 274 -525 350 59 -411 426 -117 -307 476 -305 -124
3382 -124 494 -510 130 340 -564 391 50 -456 541 -222 -255 496 -346 -52 390 -435 155 283 -524 356
3402 356 109 -486 527 -215 -246 561 -490 53 377 -496 250 111 -363 345 -42 -306 389 -90 -279 432
3422 432 -295 -76 464 -600 265 274 -611 530 -158 -257 544 -486 54 333 -346 109 107 -165 99 117 -334
3443 -334 229 215 -555 482 -92 -325 641 -677 222 472 -772 529 -93 -253 492 -482 110 255 -227
3462 -227 -44 84 84 -205 234 -287 54 484 -824 481 139 -571 730 -703 208 568 -898 536 -60
3481 -60 -176 336 -504 277 97 -105 -166 49 381 -537 320 -147 -115 682 -1043 528 363 -804 793 -666
3501 -666 242 583 -1017 584 -17 -110 157 -452 477 -115 4 -235 38 636 -893 422 50 -333 837
3520 837 -1182 571 556 -1049 814 -552 254 505 -1066 682 -10 -76 -10 -379 708 -400 67 -183
3538 -183 -12 796 -1174 503 256 -544 840 -1158 630 620 -1197 810 -413 256 324 -998 782
3555 782 -63 -54 -164 -234 839 -700 171 -79 -88 894 -1364 630 458 -800 855 -1036 619 627 -1332
3574 -1332 843 -236 174 160 -866 904 -198 -72 -195 -129 941 -967 262 106 -220 855 -1394
3591 -1394 688 568 -999 810 -836 559 477 -1285 864 -149 101 -2 -637 923 -374 -18 -180
3608 -180 -39 898 -1142 407 235 -379 823 -1286 713 599 -1146 797 -572 427 366 -1140 857
3625 857 -89 -32 -107 -387 882 -548 43 -88 -36 837 -1224 506 369 -600 745 -1071 643 545 -1154
3644 -1154 760 -350 261 207 -885 806 -134 -60 -133 -189 781 -665 152 8 -83 699 -1137 550 372
3663 372 -679 675 -799 500 424 -1038 686 -161 74 98 -577 655 -157 -56 -141 -28 601 -718
3681 -718 273 50 -196 611 -967 523 359 -759 627 -511 295 347 -837 573 -55 -51 59 -314 468
3700 468 -229 7 -93 24 434 -663 327 81 -257 498 -710 392 310 -671 508 -266 97 268 -552
3719 -552 383 33 -122 3 -70 247 -192 83 -114 53 304 -563 350 76 -305 430 -482 234 228 -557 383
3740 383 -92 -119 243 -324 172 87 -143 -15 56 86 -162 139 -93 7 226 -409 250 77 -302 352 -255
3761 -255 32 272 -393 219 62 -205 189 -108 -14 126 -110 -54 128 -28 -105 161 -113 3 176 -274 158
3782 158 92 -292 260 -96 -114 264 -263 55 188 -266 144 49 -165 190 -61 -96 171 -89 -62 146 -92 -45
3804 -45 158 -168 31 140 -236 165 31 -234 273 -126 -89 257 -252 85 121 -221 181 -17 -127 153 -69
3825 -69 -47 107 -64 -63 127 -79 -62 172 -192 69 141 -277 241 -36 -196 299 -228 15 181 -269 163 29
3847 29 -149 148 -38 -67 88 -3 -79 126 -32 -122 231 -177 -7 201 -294 203 31 -228 297 -174 -36 197
3869 197 -214 98 44 -123 77 13 -78 50 58 -134 108 16 -157 225 -134 -45 223 -268 138 62 -214 232 -98
3892 -98 -72 172 -144 4 92 -100 -4 96 -119 33 116 -189 144 15 -188 232 -147 -49 197 -213 93 76
3914 76 -176 134 -17 -88 106 -60 -114 129 -57 -76 187 -149 12 152 -219 160 2 -161 220 -111 -19 132
3936 132 -114 56 36 -74 21 81 -111 31 110 -169 162 -24 -152 291 -211 13 181 -241 210 -55 -117 220
3958 220 -125 0 57 -12 17 -10 27 -83 190 -137 -75 280 -266 166 3 -219 394 -294 5 226 -253 230
3980 230 -137 -16 201 -158 66 -68 140 -46 -109 180 -182 245 -146 -161 429 -370 152 51 -226 449 -382
4001 -382 38 255 -255 221 -215 88 157 -205 100 -133 260 -132 -179 315 -275 278 -179 -198 566 -488 130
4022 130 99 -245 484 -470 85 294 -296 214 -271 227 94 -294 206 -206 343 -192 -248 490 -386 271 -159
4043 -159 -209 643 -584 140 174 -233 447 -549 191 277 -325 204 -292 346 -13 -315 300 -231 368 -277 -242
4064 -242 614 -467 224 -126 -180 664 -687 170 228 -271 368 -539 288 230 -367 209 -261 416 -119 -354
4084 -354 433 -289 347 -289 -212 700 -574 210 -48 -165 600 -709 234 256 -289 308 -502 386 119 -387
4104 -387 270 -257 423 -209 -305 510 -340 278 -277 -147 670 -628 192 24 -150 480 -660 282 241 -312
4124 -312 230 -395 400 23 -367 282 -212 377 -288 -220 542 -399 239 -220 -108 596 -641 196 114 -150
4144 -150 370 -592 321 191 -314 215 -314 380 -73 -319 342 -239 306 -260 -169 520 -426 184 -114 -76 462
4165 462 -577 220 127 -176 265 -427 301 111 -295 194 -201 300 -123 -223 318 -204 206 -210 -66 430
4185 430 -398 171 -50 -58 349 -469 208 111 -194 209 -298 254 52 -248 194 -146 226 -122 -140 300 -216
4206 -216 155 -134 -51 328 -335 136 20 -80 228 -320 182 83 -181 140 -180 182 -2 -162 173 -90 126
4227 126 -101 -58 212 -172 108 -68 -22 205 -244 114 33 -84 150 -198 118 64 -136 111 -93 91 -9
4248 -9 -89 96 -73 54 -60 -19 134 -114 71 -8 -40 112 -153 64 31 -66 94 -80 63 26 -90 74 -47
4271 -47 29 7 -40 66 -34 14 -3 -17 51 -41 17 19 -10 35 -44 21 34 -36 42 -5 -11 33 -31 25 22 -45 44 -10 41 60 9
4302 9 58 -43 10 72 -38 63 -14 50 44 27 69 -13 19 10 -56 -78 -24 -18 144 -109 93 -24 27 3 -16 106 5 -6
4330 -6 127 -63 71 -5 -55 95 -46 43 5 -27 44 -64 70 -18 -16 90 -94 81 -26 -43 101 -88 62 -5
4354 -5 -46 87 -82 37 11 -62 79 -67 51 -6 -16 75 -70 73 -32 22 70 -75 68 13 -73 82 -105 115
4378 115 32 -58 125 -77 4 67 -38 19 -29 1 21 18 37 -16 54 -28 8 68 -103 98 -62 -15 120 -91 28 28
4404 28 -65 26 -38 16 17 -40 -18 -70 58 -75 -20 1 -22 153 -56 99 138 -116 50 -20 -59 139 -94 63 54 -70
4430 -70 44 -38 -91 57 31 -27 58 -31 -49 127 -38 30 148 -10 34 5 -28 47 -48 39 -26 -31 16 111 -19 -127 71
4457 71 -21 66 35 -81 75 -19 -54 83 -72 23 36 -75 37 11 -22 13 7 -14 26 12 -73 86 -13 -67 121 -100
4483 -100 40 71 -145 129 -39 -68 96 -107 65 22 -79 47 0 -4 -38 46 -10 3 54 -143 126 6 -132 163
4507 163 -119 49 80 -181 174 -31 -79 97 -88 73 -14 -60 46 18 26 -100 93 -17 -47 103 -169 155 23
4530 23 -192 212 -131 37 84 -209 204 -30 -92 97 -65 74 -47 -15 27 30 36 -160 149 -29 -92 135 -209
4553 -209 189 34 -246 260 -109 12 97 -195 200 -37 -100 76 -15 60 -89 20 -1 30 40 -194 209 -43
4575 -43 -137 172 -196 160 7 -239 271 -112 -28 76 -148 168 -48 -88 54 18 23 -100 90 -33 20 53 -212
4598 -212 255 -67 -162 229 -183 142 -54 -264 306 -107 -66 84 -102 126 -49 -58 49 60 -18 -120 171 -76
4620 -76 -3 74 -204 262 -81 -163 261 -176 95 25 -204 246 -80 -74 81 -36 42 -44 -2 2 95 -56 -134 206 -119
4645 -119 -14 104 -209 250 -78 -160 264 -182 43 48 -161 192 -69 -88 90 8 -31 -29 43 -60 96 -46 -125
4668 -125 247 -161 -25 140 -216 207 -80 -158 235 -149 -14 74 -110 92 -4 -74 39 63 -101 2 83 -125
4690 -125 127 -45 -122 241 -184 -8 161 -196 140 -46 -132 188 -107 -47 90 -65 -8 45 -73 -10 108 -152
4712 -152 32 111 -196 129 -21 -136 229 -190 -15 168 -198 94 14 -122 135 -54 -90 109 -20 -88 105
4733 105 -52 -70 144 -153 35 128 -223 142 11 -144 194 -128 -30 153 -160 24 73 -111 50 25 -106 88
4755 88 24 -152 151 -37 -108 187 -159 16 144 -235 136 25 -161 167 -73 -57 138 -114 -10 117 -107
4776 -107 2 95 -126 67 53 -188 166 -19 -134 201 -150 -14 154 -201 107 54 -165 123 -22 -95 120
4797 120 -57 -65 127 -78 -60 155 -151 38 109 -189 157 2 -173 199 -115 -56 162 -166 58 80 -161 93
4819 93 47 -126 101 2 -125 163 -61 -95 195 -161 3 149 -210 140 39 -184 205 -60 -86 157 -124 -7
4841 -7 105 -132 39 97 -140 72 65 -154 146 -15 -143 220 -127 -40 188 -212 101 80 -185 168 -26 -121 139
4864 139 -74 -55 132 -104 -20 124 -142 39 110 -185 130 30 -175 208 -93 -84 208 -193 48 117 -188 122
4886 122 25 -128 143 -39 -89 137 -69 -68 154 -108 -4 157 -195 90 91 -214 183 -44 -126 217 -153 -7
4908 -7 151 -190 79 65 -138 107 1 -117 124 -18 -116 153 -86 -54 173 -179 38 143 -229 162 23 -159
4930 -159 220 -127 -45 189 -179 47 94 -131 79 31 -122 94 19 -145 143 -20 -122 197 -151 -15 183
4951 183 -249 117 77 -206 202 -88 -86 192 -156 -2 113 -124 32 64 -101 49 79 -166 109 53 -185 203
4973 203 -105 -84 237 -243 75 126 -230 196 -63 -123 189 -132 -4 113 -81 -7 76 -71 -8 123 -161 75
4995 75 122 -245 197 -39 -137 271 -249 42 202 -258 161 -24 -117 173 -114 -33 99 -36 -68 69 -9 -76 165
5018 165 -155 15 204 -289 172 16 -202 293 -233 -4 208 -267 133 -1 -117 140 -81 -21 71 8 -110
5039 -110 58 52 -153 193 -139 -32 267 -330 152 83 -250 294 -220 -4 232 -263 104 15 -84 75 -64 -2
5061 -2 9 69 -139 49 122 -222 201 -107 -92 314 -355 138 135 -283 273 -178 -22 220 -249 80 28 -43 13 -29
5085 -29 33 -39 118 -165 33 189 -301 226 -51 -144 332 -358 130 188 -317 240 -126 -16 192 -215 69 38
5107 38 -2 -49 -10 76 -111 147 -177 6 245 -360 223 -11 -202 341 -336 97 206 -313 217 -77 -30 136
5129 136 -175 72 23 48 -97 27 101 -189 196 -160 -20 276 -401 217 47 -236 310 -286 69 199 -298
5150 -298 179 -46 -29 69 -87 53 2 84 -154 59 127 -234 215 -126 -54 285 -382 199 82 -261 287 -216
5172 -216 45 171 -266 139 2 -33 23 -43 53 -41 100 -150 62 136 -286 230 -87 -99 281 -356 169 110 -288
5195 -288 241 -146 8 151 -194 95 22 -29 -38 30 29 -88 141 -160 55 159 -287 230 -37 -135 272 -285 124
5218 124 131 -262 199 -81 -40 116 -124 49 24 -13 -83 68 33 -119 158 -155 43 175 -295 206 -7 -174
5240 -174 248 -219 64 133 -229 152 -17 -58 75 -51 -2 32 7 -94 106 13 -138 188 -134 20 149 -253
5262 -253 172 36 -194 196 -104 -41 129 -159 101 80 -32 41 57 -65 49 69 -149 73 -2 -145 184 -108
5284 -108 -27 146 -222 137 48 -179 169 -71 -44 125 -124 31 79 -88 8 62 -73 17 65 -132 111 9 -153
5307 -153 176 -82 -60 168 -160 80 87 -161 120 -14 -96 108 -51 -36 97 -70 -24 101 -100 6 93 -134
5329 -134 80 30 -129 148 -46 -83 150 -116 19 103 -140 91 40 -109 95 -12 -84 106 -39 -53 122 -99
5351 -99 -6 110 -136 55 63 -142 117 -14 -108 137 -86 -42 124 -113 20 71 -132 67 29 -109 101 -18 -91
5374 -91 117 -60 -45 119 -101 23 80 -142 94 22 -127 124 -47 -65 126 -83 1 91 -104 33 62 -119 74
5397 74 29 -103 105 -33 -74 130 -94 -26 107 -144 45 58 -127 95 -23 -89 113 -57 -34 89 -73 7 76
5420 76 -90 35 71 -116 95 26 -109 144 -63 -47 144 -126 32 77 -126 102 -10 -69 92 -32 -44 81
5442 81 -20 -41 76 -64 -27 108 -122 55 80 -149 124 -47 -83 158 -133 22 99 -118 71 -8 -56 67 -23
5465 -23 -49 38 18 -84 82 -14 -79 145 -140 13 144 -193 128 -18 -109 183 -143 22 88 -107 48 -14 -23 16
5489 16 9 -37 -15 98 -135 51 45 -140 190 -128 -23 191 -224 124 -3 -117 177 -152 43 81 -87 51 -51
5512 -51 45 -22 19 -4 -63 158 -164 46 113 -194 212 -124 -56 240 -246 132 14 -126 172 -152 45 57 -59
5535 -59 44 -66 101 -70 20 32 -104 209 -195 13 168 -246 218 -119 -56 259 -276 130 30 -98 161
5556 161 -161 85 15 -47 37 -96 157 -127 16 85 -176 241 -204 -10 221 -290 214 -102 -84 256 -291 133
5578 133 34 -102 125 -174 116 -8 -36 33 -113 215 -178 20 122 -209 260 -203 -16 258 -311 223 -70
5599 -70 -81 245 -278 133 47 -95 106 -162 147 -62 -23 58 -126 243 -195 15 177 -251 264 -201 -39 272
5621 272 -343 191 -30 -90 212 -266 144 20 -70 76 -146 189 -105 -19 87 -158 265 -229 14 215 -288
5642 -288 259 -157 -41 265 -322 176 2 -87 178 -219 146 2 -68 56 -123 190 -142 -11 104 -191 244
5663 244 -213 0 227 -298 213 -115 -59 255 -292 159 12 -86 134 -172 153 -30 -39 64 -113 197 -161
5684 -161 21 128 -204 250 -197 -6 229 -294 213 -68 -78 217 -254 139 27 -78 90 -135 122 -60
5704 -60 -20 42 -108 174 -186 25 138 -206 202 -147 -26 204 -267 152 -23 -94 153 -176 87 20 -61 54
5726 54 -79 107 -79 16 43 -96 172 -163 30 124 -203 177 -101 -30 182 -212 126 8 -85 107 -119 54
5748 54 10 -41 15 -44 74 -92 35 32 -97 152 -132 17 110 -187 149 -54 -63 135 -156 56 40 -85 73 -48
5772 -48 25 16 -14 -9 -6 57 -96 40 23 -104 117 -102 1 106 -153 104 12 -77 103 -90 8 51 -72 37 -1
5797 -1 -8 10 19 -24 9 37 -80 46 25 -86 94 -67 -13 99 -116 65 38 -84 92 -31 -17 58 -52 -2 34 -37
5823 -37 -4 19 -32 5 33 -62 29 29 -82 67 -27 -47 81 -64 8 66 -85 48 4 -61 64 -29 -20 57 -36 -8 42 -34
5851 -34 -6 45 -56 19 31 -71 43 11 -61 78 -47 -20 70 -73 32 33 -73 53 -4 -48 60 -44 -31 45 -25
5876 -25 -21 36 -37 -4 45 -61 33 33 -76 74 -19 -44 95 -56 7 52 -76 51 21 -43 45 -13 -42 38 -1 -31 63 -33
5904 -33 -20 63 -62 17 45 -73 59 -12 -59 73 -45 -4 53 -53 13 23 -41 20 27 -42 32 10 -52 69 -23 -34 80
5931 80 -60 13 37 -78 68 -4 -37 50 -23 -12 29 -8 -6 43 -24 -16 67 -61 15 39 -87 80 -21 -59 97 -80 17
5958 17 33 -65 59 -27 -30 30 10 -6 -5 26 -41 53 2 -54 116 -75 17 68 -111 102 -39 -57 112 -96 33 14 -51
5985 -51 47 -36 16 -4 18 -15 -42 83 -81 34 20 -116 152 -99 -19 99 -132 116 -41 -62 125 -101 52 -31
6009 -31 8 35 -42 57 -44 42 13 -103 124 -109 38 46 -140 200 -115 -16 127 -162 143 -65 -49 131 -130 69
6033 69 -46 -6 60 -100 94 -86 63 12 -141 197 -137 27 78 -174 241 -132 -36 153 -204 164 -80 -34
6055 -34 133 -129 91 -81 47 51 -117 163 -122 83 23 -180 237 -170 17 96 -202 225 -153 -30 159 -180
6077 -180 150 -105 5 123 -158 131 -110 65 33 -166 201 -146 75 41 -195 278 -183 9 124 -207 239
6098 239 -165 -22 171 -192 157 -105 28 107 -168 144 -120 79 31 -186 244 -168 56 50 -208 284 -194
6119 -194 2 141 -213 219 -165 -11 154 -197 143 -121 47 72 -173 180 -133 92 21 -187 268 -189 57
6140 57 81 -194 289 -201 13 149 -201 204 -159 17 146 -177 150 -118 66 46 -184 186 -138 81 16
6161 16 -172 272 -191 33 88 -177 247 -185 4 148 -180 165 -121 33 113 -161 129 -105 73 28 -145
6182 -145 203 -141 71 27 -163 247 -183 27 116 -176 219 -142 8 141 -157 143 -105 23 81 -141 132
6203 132 -94 67 5 -126 188 -157 68 38 -147 210 -170 23 97 -160 172 -107 -1 110 -140 102 -66
6224 -66 32 43 -104 114 -79 67 10 -105 169 -130 40 47 -131 169 -128 0 98 -137 112 -80 4 82 -114
6247 -114 67 -46 27 20 -81 88 -73 49 8 -79 133 -126 31 42 -107 131 -80 13 93 -111 79 -39 -10
6270 -10 58 -75 38 -38 27 1 -45 78 -64 43 16 -59 103 -80 3 45 -87 73 -56 -32 57 -88 32 -12
6294 -12 -29 24 -34 12 -17 2 -14 -21 39 -39 30 9 -47 73 -59 -3 46 -72 51 -26 -40 47 -45 0 20 -25 11 -9 -5
6323 -5 -2 4 -10 -2 9 -35 18 16 -39 34 -18 -20 54 -56 14 34 -59 30 -13 -22 44 -23 -1 10 -7 7 1 0 -5 8 -4 2 18 -32 23
6358 23 16 -38 46 -37 -18 47 -37 35 0 -42 34 -39 -16 4 -28 13 -6 -9 -12 0 -13 -24 26 -37 4 30 -56 38 -12 -24 37 -46
6390 -46 14 14 -37 42 -16 -4 16 -7 12 -7 3 -12 9 5 -27 29 -31 -3 22 -45 39 -14 -39 34 -32 18 5 -32 15 -15 -3
6421 -3 1 -3 -1 3 13 -20 15 -11 -31 38 -45 7 20 -39 46 -15 -18 39 -29 6 -4 -11 -3 2 3 -6 13 -22 -6 14 -49 32 -13 -24 42 -35
6457 -35 7 7 -27 32 -25 3 10 3 2 -9 17 -25 13 5 -33 48 -37 1 18 -67 59 -31 -28 36 -42 60 38 31 37 17 104 -21 24
6490 24 7 -25 46 -59 35 11 -64 53 -69 13 18 -80 61 -46 3 29 -60 55 -46 10 19 -32 54 -64 42 9 -41
6517 -41 71 -93 42 19 -72 95 -81 38 33 -85 83 -64 13 23 -62 68 -73 33 -4 -51 84 -94 63
6540 63 -4 -77 83 -102 64 1 -91 120 -93 33 19 -85 105 -78 22 15 -60 93 -111 53 1 -64 106 -104
6564 -104 82 4 -88 135 -105 71 10 -112 126 -112 40 14 -89 126 -106 31 13 -65 99 -136 58 -10
6586 -10 -82 107 -135 83 -5 -118 139 -131 77 -11 -106 176 -126 60 7 -76 122 -118 56 4 -62 115 -137
6609 -137 105 2 -79 129 -134 97 3 -114 141 -135 73 7 -106 131 -108 32 8 -76 116 -134 65 7
6631 7 -84 110 -152 88 9 -104 140 -129 90 11 -109 155 -121 52 11 -86 150 -120 48 11 -61 114 -139
6654 -139 75 4 -67 112 -151 104 -7 -95 126 -138 71 -8 -120 144 -112 39 5 -86 116 -111 40 -7
6676 -7 -61 95 -138 78 4 -79 116 -130 101 12 -107 141 -108 59 15 -100 131 -94 23 3 -55 91 -106
6699 -106 55 17 -55 85 -121 65 -2 -69 94 -113 66 10 -89 120 -93 36 17 -66 96 -76 25 10 -52
6722 -52 71 -86 46 -4 -42 73 -102 62 -2 -76 101 -84 47 20 -73 93 -65 10 21 -66 67 -60 12 3
6746 3 -40 41 -65 29 -9 -40 53 -74 36 8 -67 72 -63 26 25 -68 64 -53 0 30 -45 33 -20 22 12 -18 33 -40
6774 -40 25 12 -35 54 -51 24 15 -54 65 -31 14 27 -55 41 -12 -20 21 -30 17 -7 -2 12 -10 15 -26 -5 3 -34 38 -39 0
6805 0 28 -54 41 0 -24 35 -29 18 17 -24 33 -9 10 9 -1 8 1 21 -19 14 5 -27 25 -28 -8 39 -42 23 14 -27 41 -26 -8 24
6839 24 -17 24 7 -16 10 -16 6 -8 1 -3 2 13 -30 21 -7 -24 40 -26 8 24 -44 36 -14 -21 35 -22 15 10 -20 16 -15 -6 -8 12
6873 12 0 -2 32 -27 12 -1 -38 35 -41 -10 35 -60 37 -4 -6 13 1 22 41 -73 92 67 59 5 8 5 -14 113 -19 14 -40
6904 -40 -8 34 -32 -7 42 -41 31 10 -36 34 -22 5 11 -12 -5 -4 3 -19 10 0 -17 28 -48 8 22 -42 39 -21 -19 47 -18 26 -11
6937 -11 6 12 16 36 -21 5 -6 9 15 -23 39 -12 -22 44 -42 29 18 -52 39 -14 -17 31 -28 5 -8 -15 -7 -3 -2 -11 13 -28 1 24 -35
6972 -35 44 -18 -29 45 -58 30 14 -33 46 -16 1 10 -10 8 -11 10 -10 8 2 -25 34 -36 11 25 -47 52 -22 -10 47 -52 32
7003 32 -5 -24 33 -31 6 -5 -1 -9 -8 17 -38 37 8 -39 55 -56 -3 45 -49 54 -39 -16 44 -52 34 -2 -9 29 -34 31 -34
7034 -34 14 -5 -37 62 -57 30 6 -58 83 -62 27 37 -77 70 -63 -10 52 -56 44 -19 25 14 -36 52 -46 35
7060 35 -10 -2 76 -80 35 30 -65 105 -73 21 39 -85 83 -47 -2 39 -73 57 -30 16 7 -40 69 -62 39 1
7086 1 -64 102 -99 39 26 -83 107 -79 9 42 -95 80 -51 16 31 -65 69 -42 29 -1 -39 88 -64 43
7110 43 25 -51 136 -66 61 19 -80 156 -87 97 46 -79 102 -80 -29 -15 -119 92 -119 -110 57 -95 -6 -61
7134 -61 2 30 -73 144 -153 77 -24 17 50 -45 98 17 -172 120 -54 5 49 -1 123 -44 69 -73 -104 81
7158 81 -82 29 50 -111 155 -75 -4 54 -100 95 -82 -10 39 -89 67 -59 18 8 -54 68 -78 42 0
7181 0 -63 104 -104 37 23 -87 121 -91 28 64 -104 94 -62 16 42 -75 74 -45 20 11 -54 75 -73 44
7205 44 6 -59 92 -101 24 26 -83 101 -81 4 48 -90 79 -44 -6 32 -72 53 -40 16 15 -41 64 -69 24
7230 24 6 -64 91 -91 35 33 -82 101 -63 12 49 -77 68 -24 0 19 -51 47 -36 9 4 -41 53 -75 1 28 -58
7257 -58 77 -75 10 43 -82 67 -52 -13 50 -64 40 -15 -16 20 -37 32 -28 22 0 -40 60 -53 28 19 -53 68
7283 68 -39 21 38 -78 51 -18 -21 28 -55 17 -2 -21 10 -26 18 -32 6 7 -36 38 -39 18 14 -57 53 -32 -7 52 -61
7312 -61 30 1 -34 35 -24 9 11 -23 29 -8 14 -5 0 1 -21 27 -27 1 34 -52 37 -20 -25 34 -43 -5 26 -68 69 9 -38 -4
7344 -4 -76 8 -15 70 -3 17 5 -6 65 -2 50 12 -43 44 18 -68 69 -6 -32 66 -48 34 -11 -4 16 -8 6 1 1 7 -15 24
7376 24 -25 7 -14 -14 29 -47 6 11 -53 33 -25 -10 33 -31 26 7 -12 28 -9 18 9 -6 3 -8 20 -26 25 5 -34 39 -33 6
7408 6 26 -39 38 -20 -12 27 -34 16 4 -21 13 -20 -5 -4 3 -15 -26 11 -35 18 -10 -32 33 -44 7 24 -50 36 -15 -6 18 -28 15
7441 15 -1 1 12 4 8 -11 26 -18 -6 14 -31 30 7 -22 41 -39 5 10 -30 32 -20 -2 14 -11 6 0 8 0 5 -3 -40 26 -27 5 29
7476 29 -36 40 -11 -18 47 -34 25 -4 -18 29 -16 23 0 5 16 -11 27 -28 9 9 -39 44 -46 0 24 -51 58 -21 -8 36 -38
7507 -38 34 -11 -10 19 -20 16 -18 13 8 -17 46 -41 29 15 -39 54 -39 12 36 -53 62 -34 1 33 -27 44 -31 19 13 -21 44
7538 44 -36 41 17 -31 62 -60 40 5 -63 70 -64 15 24 -57 60 -69 11 18 -46 43 -48 29 6 -41 59 -60 41
7565 41 -1 -49 74 -80 52 16 -61 90 -68 40 24 -48 82 -73 30 23 -51 63 -62 46 -4 -51 82 -67
7589 -67 55 -14 -67 96 -88 50 16 -55 104 -92 40 24 -73 80 -70 38 20 -49 67 -71 67 8 -42 89
7613 89 -82 78 -19 -60 107 -96 53 17 -67 98 -103 71 5 -46 42 -39 91 -1 -55 66 -80 64 -13 -50
7637 -50 91 -98 68 -12 -60 101 -105 50 3 -60 84 -84 62 37 -79 148 -51 129 -37 -90 82 -61
7659 -61 78 -14 -30 98 -96 68 -2 -57 113 -103 56 6 -56 96 -91 46 2 -47 70 -80 58 -17 -39 77
7683 77 -96 70 -18 -37 87 -97 82 -7 -54 98 -95 60 12 -46 84 -81 59 11 -32 78 -61 63 1
7706 1 -30 83 -73 51 -22 -49 90 -96 49 -2 -52 79 -82 49 10 -48 69 -68 43 -1 -38 58 -65 46
7730 46 -32 -32 66 -75 62 -11 -11 86 -81 58 0 -35 75 -64 36 8 -43 46 -49 32 -2 -32 45 -55 29 -15 -30
7757 -30 50 -67 35 -19 -35 58 -72 33 -1 -47 57 -50 24 5 -34 45 -40 11 -2 -17 22 -28 29 -1 -12 44 -44
7784 -44 38 4 -32 43 -46 20 10 -34 41 -30 4 21 -28 28 -20 7 4 -24 14 -34 6 -3 -19 30 -42 18 9 -36 31 -21 18 19
7816 19 -33 29 -3 -1 29 -20 20 2 3 11 -15 17 -15 12 4 -24 30 -17 14 5 -28 24 -14 -5 21 -30 8 -17 -13 13 -24 0 -3 -12 3
7851 3 -12 10 -12 5 10 -8 23 -9 5 27 -22 27 -3 -7 32 -22 19 7 -19 20 -3 10 8 -16 4 -12 8 4 -17 5 -17 4 -10
7884 -10 -15 20 -17 7 -9 -16 22 -33 5 -2 -15 21 -16 3 15 -8 18 -4 1 7 -5 21 -16 22 -1 0 29 -9 3 4 -29 24 -25 7
7918 7 7 -32 15 -12 -8 -4 -19 10 -14 -7 -6 -12 2 -18 5 -16 -18 12 -23 10 1 -22 30 -15 8 15 -13 16 -11 7 4 0 5 2 10 -8 5 12
7956 12 -26 21 16 31 -42 -14 -26 18 9 41 -10 -40 24 -9 -30 4 -24 -7 29 -7 -36 6 -31 -8 -10 -25 25 -25 12 5 -19 16
7988 16 -4 -2 10 -4 12 -6 14 -1 2 10 -6 14 -7 -15 13 -31 5 -6 -23 32 -28 3 11 -25 24 -20 -10 -1 -18 15 -16 13 -15
8021 -15 -10 14 -24 25 -4 -13 37 -27 22 -1 -13 27 -35 20 1 -22 40 -23 30 -8 -2 22 -34 36 -15 -6 27 -36 23 -22 -10 46
8053 46 -49 30 -13 -25 34 -52 31 3 -18 47 -38 30 -1 -4 31 -42 37 -10 -2 30 -46 42 -23 -17 51 -50 40 -16 -16 45 -44 34
8085 34 -16 -19 41 -41 46 -23 -5 27 -41 36 -31 -5 30 -62 50 -38 -20 50 -59 40 -16 -13 47 -50 28 -11 -20 42 -46 44 -24
8116 -24 -14 37 -54 53 -30 -6 42 -56 57 -26 -15 49 -52 45 -12 -20 43 -57 36 -14 -11 25 -49 48 -35 -14 27 -50 58
8145 58 -42 -8 32 -62 51 -46 -9 61 -55 48 -21 -8 54 -40 51 -10 -7 27 -31 54 -13 0 38 -50 52 -26 0 45
8173 45 -65 51 -25 -7 39 -63 46 -27 -14 34 -47 42 -13 -14 14 -35 36 -32
8191c2
$$ Imaginary data points
##PAGE= N=2
##DATA TABLE= (X++(I..I)), XYDATA
0 0 0 0 0 0 0 0 0 0 0 0 0 0 0 0 -8 8 -8 8 -16 16 -20 24 -32 36 -41 48 -57 67 -78 91 -105 121 -139 158 -180
35 -180 205 -230 258 -291 325 -364 406 -452 504 -557 616 -681 751 -828 915 -1009 1109 -1222
53 -1222 1344 -1479 1630 -1797 1986 -2201 2443 -2721 3045 -3424 3878 -4423 5083 -5871 6717
68 6717 -6931 3260 -234756 114747 16419 -51483 120793 -193928 94105 91560 -105256
79 -105256 -14348 24683 58625 -49395 -9130 -24669 44691 89750 -210887 113048 73038
90 73038 -135162 127868 -145216 70443 137214 -245994 123191 33969 -63869 71991 -118501
101 -118501 71562 66887 -91608 -21136 53979 44323 -88927 33481 -13493 17745 79693
112 79693 -191230 118343 74763 -160556 124484 -93471 37575 109874 -205806 107225
122 107225 51129 -82952 46063 -55350 45749 34901 -60727 -25189 64643 27648 -105147
133 -105147 66567 -8320 -14250 78100 -158216 105872 65143 -161456 118546 -51128 -267
144 -267 88025 -151478 79607 54566 -86173 27492 -3937 14344 10207 -24306 -29406 60852
156 60852 16589 -105271 86082 -7882 -40413 80396 -122103 79112 58242 -147594 105836
167 105836 -19620 -31980 74039 -100853 47393 53180 -78412 15086 28412 -13169 -2827
178 -2827 9130 -38899 50332 16100 -99587 93266 -10615 -58015 87700 -93189 45786
189 45786 57516 -125099 86173 2871 -54897 64824 -54175 10025 50367 -57766 -571
200 -571 46321 -29526 -11186 35118 -46023 34341 22460 -86128 81882 -8010 -62539 84324
212 84324 -65656 13903 58380 -96923 57656 21088 -64784 53960 -17884 -22373 49764
223 49764 -35480 -18233 56096 -36254 -16489 52683 -53325 21253 33726 -77516 65850
234 65850 -377 -63518 78377 -44185 -12743 62060 -71316 27798 35299 -64349 40931
245 40931 7638 -44495 48038 -14810 -34203 58280 -32944 -21170 58825 -53038 10099 41733
257 41733 -67578 45482 11392 -59877 63331 -22319 -31421 61070 -47181 -624 47168
268 47168 -56801 22833 27161 -55262 41591 3313 -46471 55342 -22403 -28053 58257 -45576
280 -45576 -811 46974 -58753 27377 23958 -57435 48639 -3964 -43787 58862 -29685 -21570
292 -21570 56219 -49064 5974 41476 -58653 32398 17971 -54422 49894 -9119 -37100
303 -37100 55378 -33007 -13740 49947 -48046 9768 35152 -53190 31792 13134 -49096 49056
315 49056 -12143 -34292 55306 -35674 -9580 47614 -51212 17505 29064 -53799 38206 5340
327 5340 -43889 49346 -18308 -26270 51287 -37636 -4619 43355 -49466 18820 25590 -51320 39348
340 39348 1890 -41932 50566 -21589 -22903 49957 -40237 859 39503 -50815 23963 20961
352 20961 -50129 42391 -4120 -37104 51875 -28962 -15332 47717 -43963 8530 31069 -46634
364 -46634 28011 11347 -42082 39512 -5173 -32728 44589 -22910 -16110 45611 -43285 7279
376 7279 36648 -53792 31823 10611 -44199 48872 -21132 -22145 48544 -36713 -888 31655
388 31655 -35662 15079 15938 -36465 26374 10523 -41016 36408 -2999 -32229 48815 -35900
400 -35900 -6139 51417 -60426 24016 24488 -50240 45889 -17474 -23449 48739 -32956 -7841
412 -7841 30802 -21242 -117 16847 -24525 11139 24505 -47675 25903 20965 -48932 45887
424 45887 -22881 -17347 59788 -63893 16499 36730 -51687 36498 -13398 -16770 41599 -30088
436 -30088 -10056 27433 -5266 -16950 15326 -6795 -4937 32741 -50975 18384 42383 -66630
448 -66630 42474 -7596 -26226 62956 -67997 14643 47534 -55920 26755 -7405 -6646 29629
460 29629 -29453 -6692 24002 8005 -35313 15430 14901 -24190 36336 -49094 13751 58082
472 58082 -83825 40247 9626 -33883 57969 -67052 18327 50696 -59262 17911 813
483 813 4676 10385 -25963 2979 16417 16649 -49551 17815 35605 -45539 35939 -38092 8907
496 8907 63936 -94977 39096 26784 -42256 46600 -58191 24443 46080 -62583 13433
507 13433 10970 11561 -10957 -19396 16051 6410 19151 -58618 24915 50163 -68681 38251 -23937
520 -23937 2975 62946 -101739 43569 38836 -53387 36545 -43558 29149 32935 -60550 14482
532 14482 16812 14792 -31184 -7615 29909 -11100 20276 -55857 28058 56130 -85185 39790
544 39790 -5389 -6895 52951 -94126 46295 42775 -61617 26973 -23405 28580 15306 -52865
556 -52865 18374 20085 11332 -45302 8039 38197 -29600 21326 -47191 29713 54233 -96513
568 -96513 45747 9870 -20660 43661 -79885 47820 38472 -66405 24257 -6458 23024
579 23024 -2312 -38127 23358 13484 8667 -49986 21622 39667 -47620 27030 -34122 23250
591 23250 47337 -95523 49968 18970 -33875 34861 -57619 42319 28219 -62061 21818 7558
603 7558 13736 -17074 -18694 24895 3561 6607 -46923 30665 35296 -59034 32361 -19959 12614
616 12614 38110 -84657 50685 21533 -43768 30604 -35880 30975 18066 -51533 20593 13918
628 13918 3431 -23301 503 19650 -7457 10595 -41009 32657 27968 -63259 39881 -11346
640 -11346 -1190 33014 -67943 44860 19469 -46211 27017 -16766 17082 8101 -34372 16367
652 16367 13929 -2159 -25009 14741 12854 -16404 15453 -32034 27432 20868 -58023 40894 -4679
665 -4679 -12854 28969 -48083 32328 17278 -42443 22823 -2322 1803 4396 -17045 7372 12889
678 12889 -4201 -23082 23271 3347 -19920 22079 -26628 18998 17028 -48905 38158 -2407
690 -2407 -20066 27859 -31601 17838 15549 -33743 16943 6072 -8475 2751 -2479 -2211 10373
703 10373 -1485 -20974 24905 -2091 -20203 25265 -21173 9020 16300 -37287 28549 1768
715 1768 -22802 24213 -16329 2522 15848 -22730 7617 11919 -14156 2571 7194 -11215 9682
728 9682 2120 -19274 22638 -4918 -17165 25309 -18131 1815 17597 -28191 18278 5780
740 5780 -22757 20892 -6510 -9113 18040 -14172 -1689 16370 -15799 1295 13170 -16979
752 -16979 8816 6361 -18981 18311 -3008 -15135 21724 -12893 -4115 17926 -19472 7067
764 7067 10524 -19873 13994 1941 -15826 17745 -6500 -9682 18680 -13728 -1487 15640 -18286
777 -18286 7397 8912 -18308 13963 441 -14138 17297 -7478 -8304 17955 -13591 -1351 15275
790 15275 -18013 7779 8543 -19522 16558 -1214 -15012 20068 -11086 -4976 17052 -17057 4733
803 4733 10674 -17173 10074 4101 -14229 13127 -1850 -11448 16325 -8164 -7138 17519 -15088
816 -15088 1693 13248 -19423 12144 3843 -17038 17818 -6242 -8768 16628 -12383 -368
828 -368 12065 -13954 4898 7737 -13948 9015 3278 -13626 13970 -3520 -10401 17435 -12026
841 -12026 -2392 15445 -17766 7569 7700 -17255 14450 -1546 -12002 16160 -8228 -5488 14409
854 14409 -12143 635 11307 -14651 6660 6658 -15121 12268 -272 -11982 15550 -7754 -5673
867 -5673 14802 -12931 1673 10610 -14949 8153 4787 -14116 12835 -2096 -10159 15198 -9379
880 -9379 -3449 13923 -14015 3906 8252 -13827 9618 1131 -10995 12205 -3346 -8064 12180
893 12180 -6459 -3973 11984 -12085 2433 11088 -17085 9871 4187 -14555 15960 -8161 -5684
906 -5684 16692 -15108 2427 9248 -11685 6993 526 -7748 8734 -39 -9810 8906 1498
919 1498 -10120 11667 -7434 -2958 16241 -19899 6886 10941 -18376 14762 -6375 -5772 17110
932 17110 -16001 1674 9458 -7772 2195 -542 -1308 3183 2243 -10053 5224 10020 -16820 9818
946 9818 -458 -7734 18459 -21674 5473 16919 -22483 12773 -3682 -4355 15755 -18129 3285
959 3285 10256 -6047 -2348 -752 5558 -2510 2580 -8964 3457 16249 -24161 9406 6944 -12953
973 -12953 18972 -22360 5872 20749 -26869 11338 -254 -2216 11052 -18701 7559 8106 -4235
986 -4235 -6453 -527 13845 -10914 2323 -4143 633 19687 -29571 9355 14868 -18512 16458
999 16458 -19367 7275 21021 -30521 10871 4540 -1785 4805 -17102 12566 5271 -5059 -8440
1012 -8440 1988 18675 -19140 2839 1763 -2232 19654 -32490 11374 19914 -24564 14811 -14771
1025 -14771 8204 18159 -32235 12890 7034 -2424 -916 -13493 17775 -1015 -4875 -7538 3434
1038 3434 21598 -27216 5103 8742 -7382 17782 -31401 13499 22031 -29745 12953 -7558
1050 -7558 7778 11640 -29951 15517 7628 -4181 -5727 -7531 20862 -8363 -4417 -3897 4122 20094
1064 20094 -31175 8118 13572 -12524 14801 -26523 14498 20269 -32293 13151 -1487 4708
1076 4708 6197 -24872 17220 5909 -6079 -7180 -1563 20413 -15184 -1402 92 2387 17398
1089 17398 -31988 11783 15859 -18068 12741 -19297 13691 15426 -31080 13734 2682 1527
1101 1527 190 -16960 18018 1086 -6034 -6550 2668 18064 -20072 2272 4115 -1169 13758
1114 13758 -28048 13141 15346 -21128 11376 -11327 9638 10845 -26215 13141 4871 -2564 -1938
1127 -1938 -8984 14879 -2470 -4805 -4543 4652 13386 -20733 6048 5559 -4900 11059 -22174 12728
1141 12728 12583 -21641 11013 -5173 5022 6417 -19364 11873 4330 -4415 -3228 -2256 11366
1154 11366 -6446 -1258 -2561 3633 10081 -19292 8302 6135 -8482 9552 -14928 9119 9741
1167 9741 -18646 9459 -665 270 3909 -11649 8157 3308 -4599 -2746 1734 6387 -6929 1659
1181 1659 -1789 2113 6935 -15227 8578 4708 -9652 8747 -9229 4892 7464 -14502 7587
1194 7587 1780 -3237 2733 -5200 3953 2104 -3001 -2703 3601 3030 -6921 4292 -1584 -280 5906
1209 5906 -10986 6591 3854 -9090 7377 -4437 509 5857 -8955 3919 3026 -4220 1636
1222 1636 -461 -170 1599 -620 -3163 3785 907 -5391 5059 -1980 -1462 5221 -7182 3674 3317
1237 3317 -7282 5560 -1257 -2703 5275 -4695 371 4089 -4365 955 2302 -3253 1892 1006 -3782
1252 -3782 3619 -12 -3864 4640 -2038 -1896 4645 -4288 728 3476 -5026 2802 1308 -4401 4260
1267 4260 -963 -3050 4693 -2894 -844 3886 -4235 1499 2303 -4136 2705 437 -2865 3099 -1037
1282 -1037 -2023 3554 -1867 -1619 3843 -3134 219 3196 -4966 3337 1109 -4957 5269 -2138 -1934
1297 -1934 4660 -4534 1435 2534 -4162 2384 656 -2382 1917 41 -2135 2451 -137 -3024 3993
1312 3993 -1807 -1877 4588 -4656 1714 2697 -5507 4607 -834 -2955 4495 -3221 198 2503 -2902
1327 -2902 1020 1237 -1812 442 1602 -2433 1166 1599 -3827 3601 -712 -3031 5116 -3974 285
1342 285 3547 -5033 3417 98 -3235 3956 -1986 -989 2520 -1793 -169 1702 -1633 -183 2345
1357 2345 -2857 787 2267 -3934 3038 -156 -3065 4584 -3038 -652 3644 -3857 1635 1242 -2980
1372 -2980 2535 -129 -2188 2379 -328 -1904 2502 -1141 -1212 3061 -2815 308 2613 -3638 2070
1387 2070 728 -2877 3057 -1175 -1512 2936 -2022 -465 2449 -2443 494 1900 -3027 2003 601
1402 601 -3062 3497 -1401 -1672 3411 -2778 607 1720 -2857 1956 510 -2220 1526 559 -1785 1479
1418 1479 -92 -1904 3343 -2150 -1450 4228 -3766 1197 1486 -3659 4311 -1958 -2027 3733 -2194 282
1434 282 318 -852 1203 -49 -1144 -453 3053 -2506 -759 2894 -3334 3475 -1778 -3042 6671 -4715
1450 -4715 10 2566 -3555 4638 -3133 -1621 4362 -2209 -8 -979 1396 827 -1637 232 -1316
1465 -1316 4411 -3150 -2607 5630 -4114 2777 -1511 -3419 8414 -6059 -805 3709 -3106 4238 -4535
1480 -4535 -282 4676 -2716 -310 -1830 4129 -665 -3371 2547 -2300 5369 -4165 -3994 9045 -5587
1495 -5587 1382 -366 -3318 9139 -7445 -1210 5207 -2710 2806 -5290 2004 4237 -3733 -178
1509 -178 -2125 6132 -2140 -4957 5130 -2698 4745 -4540 -4203 11052 -6806 -73 1026 -2662 8625
1524 8625 -8636 -725 6510 -3134 1374 -5201 4114 3320 -5192 733 -1659 6984 -3942 -5692 8069
1539 8069 -3637 3312 -4068 -3590 12157 -8441 -1108 3163 -2099 6631 -8917 816 6672 -3624
1553 -3624 10 -4384 6275 1045 -6009 2466 -1640 6903 -5282 -5551 10282 -4838 1686 -2720
1567 -2720 -2775 11614 -9316 -1394 4966 -2113 4449 -8126 2240 6262 -4689 -319 -2814 6715
1581 6715 -774 -6356 4367 -1403 5197 -5415 -4450 11197 -6072 153 -569 -1986 9679 -9457
1595 -9457 -810 6146 -2591 2141 -6341 3700 4351 -4989 -9 -1749 6849 -3017 -5558 6240 -2519
1610 -2519 3942 -4707 -3474 11058 -7045 -518 1459 -1851 7236 -8288 -36 6046 -3016 715
1624 715 -4236 4151 2394 -4828 909 -872 5469 -3740 -4260 6880 -3149 2230 -3063 -2335 9320
1639 9320 -7114 -667 3093 -2076 4611 -6293 689 5138 -3310 -114 -2120 3908 236 -3730
1653 -3730 1784 -985 4329 -3892 -2863 6828 -4061 1491 -1280 -2071 7262 -6087 -559 3631 -2199
1668 -2199 2523 -3812 841 3414 -2551 -471 -748 3232 -1248 -2224 2136 -1331 3098 -3099 -1729
1683 -1729 5670 -4085 867 259 -1957 4865 -4329 -482 3480 -2299 1082 -1554 397 1984 -1703
1698 -1703 -486 89 2083 -1671 -892 1901 -1603 2226 -1945 -1280 4311 -3421 449 1276 -2144 3063
1714 3063 -2145 -985 2859 -1611 -101 242 -104 574 -156 -779 142 1605 -1814 38 1466 -1835
1730 -1835 1709 -822 -1292 2960 -2238 -65 1689 -2070 1609 -299 -1475 2093 -889 -714 1233
1745 1233 -808 80 739 -1037 292 970 -1281 400 788 -1397 1160 -26 -1399 1913 -905 -762
1761 -762 1822 -1722 521 1137 -2098 1454 165 -1462 1671 -882 -458 1461 -1272 34 987 -972
1777 -972 197 609 -1031 613 599 -1585 1216 217 -1510 1851 -1158 -354 1955 -2314 1021 873 -1898
1794 -1898 1749 -773 -554 1531 -1295 121 720 -589 10 399 -439 -29 888 -1390 628 875 -1921
1811 -1921 1745 -594 -995 2222 -2181 639 1212 -2079 1606 -410 -789 1341 -913 -64 602 -270
1827 -270 -405 655 -182 -696 1424 -1318 137 1416 -2216 1683 -70 -1581 2330 -1677 127 1342
1843 1342 -1856 1260 -47 -888 963 -365 -237 305 77 -580 676 -87 -972 1575 -1108 -177 1416
1860 1416 -1939 1412 27 -1570 2023 -1193 -204 1146 -1292 747 206 -819 533 277 -595 157
1876 157 544 -927 805 -32 -1131 1745 -1049 -403 1490 -1606 925 277 -1371 1501 -526 -666
1892 -666 988 -560 -130 579 -610 -30 854 -1012 177 867 -1286 909 -28 -978 1486 -1002 -187
1909 -187 1150 -1143 450 316 -710 625 -22 -590 629 106 -848 887 -206 -615 1192 -1161 361
1926 361 903 -1621 1158 -11 -832 1043 -807 160 598 -736 20 562 -219 -510 736 -563 175
1943 175 666 -1669 1503 44 -1478 1665 -1155 453 688 -1831 1528 -70 -763 483 -361 647
1959 647 -330 -248 -57 586 233 -1559 1426 -177 -555 940 -1847 1918 22 -2103 2060 -952 459
1976 459 174 -1678 2104 -525 -756 213 92 976 -1463 359 153 339 399 -2349 2320 -13 -1496
1993 -1496 1414 -1789 2195 -228 -2604 2702 -768 124 -267 -1121 2425 -1122 -628 60 707 957 -2506
2010 -2506 1270 320 -82 450 -2692 3068 -96 -2307 1808 -1397 2079 -766 -2477 3196 -881 -235
2026 -235 -577 -368 2561 -2102 -261 398 709 790 -3136 2117 597 -1007 627 -2371 3324 -359 -2888
2043 -2888 2446 -969 1495 -1071 -2024 3493 -1133 -618 -506 447 2125 -2760 370 497 697 399 -3361
2060 -3361 3021 355 -1686 898 -1922 3262 -862 -2896 2853 -714 810 -1345 -1069 3308 -1669
2075 -1669 -554 -281 908 1547 -3213 1188 742 18 232 -2872 3249 123 -2264 1322 -1179 2491
2091 2491 -1112 -2427 3046 -662 62 -1119 -236 2717 -2009 -351 76 1026 835 -3125 1819 595
2107 595 -513 236 -2314 3167 -279 -2405 1682 -748 1632 -1163 -1694 2765 -697 -370 -787 503
2123 503 1800 -2092 202 207 808 321 -2637 2174 335 -1051 490 -1470 2407 -465 -2080 1785
2139 1785 -359 646 -917 -843 2106 -801 -450 -399 677 1027 -1921 589 256 309 214 -2008 1984 167
2157 167 -1289 787 -945 1532 -322 -1674 1627 -158 -61 -432 -296 1259 -595 -338 -176 752 323
2174 323 -1455 919 13 -9 269 -1396 1545 1 -1229 928 -500 592 -60 -1039 1044 19 -390
2191 -390 -174 129 461 -443 -34 -190 518 146 -1076 871 -40 -350 512 -920 833 247 -1105 831
2209 831 -155 -120 353 -658 427 298 -514 51 284 -118 -64 128 -320 403 85 -694 694 -131 -403 643
2229 643 -648 209 481 -865 516 132 -565 595 -304 -221 593 -460 -58 418 -395 101 266 -439 234
2248 234 263 -544 342 139 -523 642 -289 -369 869 -683 57 559 -810 649 -33 -654 847 -371
2266 -371 -225 483 -435 141 240 -449 102 423 -487 62 392 -621 551 -49 -729 1091 -623 -309 902
2285 902 -963 533 188 -897 936 -270 -410 566 -308 8 266 -278 -100 535 -403 -234 768 -771
2303 -771 320 367 -1046 1134 -402 -646 1175 -951 271 477 -950 755 -93 -532 515 -134 -254
2320 -254 283 -34 -405 613 -286 -429 1003 -929 228 675 -1240 1074 -196 -808 1264 -896 63
2337 63 698 -905 526 132 -514 395 78 -417 294 208 -708 697 -107 -698 1142 -910 0 979 -1383
2356 -1383 846 150 -991 1148 -656 -230 837 -754 112 423 -459 70 372 -569 241 483 -1003
2373 -1003 733 141 -961 1209 -765 -189 1164 -1385 633 466 -1061 941 -352 -415 839 -572
2389 -572 -212 645 -393 -234 616 -613 103 674 -1187 720 355 -1206 1184 -537 -444 1222 -1261
2406 -1261 345 745 -1134 634 64 -610 707 -249 -528 792 -209 -614 894 -523 -193 953 -1217
2423 -1217 584 655 -1413 1131 -192 -737 1238 -1001 38 932 -1070 342 431 -729 492 108 -732
2440 -732 758 -14 -906 1042 -406 -514 1141 -1162 340 863 -1507 1009 102 -983 1207 -695
2456 -695 -250 1014 -931 65 698 -743 211 459 -829 582 329 -1122 1066 -140 -910 1350 -983
2473 -983 -39 1155 -1528 779 442 -1209 1097 -355 -556 1014 -674 -250 839 -634 -143 762 -865
2490 -865 263 684 -1321 962 190 -1239 1450 -768 -385 1374 -1464 547 700 -1301 956 -66
2506 -66 -697 911 -394 -455 846 -376 -456 939 -700 -105 1055 -1414 719 612 -1585 1439 -456
2523 -456 -790 1550 -1380 245 967 -1328 689 198 -766 693 -89 -647 736 -18 -897 1076 -417
2540 -417 -594 1384 -1420 428 1047 -1859 1389 -101 -1085 1592 -1188 23 1101 -1231 432 431 -664
2557 -664 346 215 -673 527 365 -1250 1102 -57 -1081 1584 -1296 101 1398 -2060 1220 288
2573 288 -1361 1516 -950 -168 1114 -1112 143 611 -493 -96 497 -608 213 736 -1533 1076 401
2590 401 -1594 1748 -1019 -268 1653 -2114 1051 652 -1540 1323 -570 -285 972 -858 -97 727
2606 727 -282 -579 800 -442 -219 1073 -1650 962 772 -2017 1790 -650 -646 1730 -2005 842 921
2623 921 -1659 1051 -162 -383 686 -522 -233 742 -47 -998 1075 -214 -707 1362 -1589 750 1088
2640 1088 -2320 1775 -223 -1043 1736 -1684 559 1056 -1629 759 247 -493 320 -108 -385 585 177
2657 177 -1307 1263 -21 -1187 1603 -1407 414 1282 -2386 1649 173 -1371 1610 -1212 262
2672 262 1072 -1445 472 594 -515 -55 422 -416 354 470 -1522 1360 180 -1576 1809 -1118 13
2689 13 1450 -2259 1409 461 -1616 1424 -738 -182 909 -1088 158 867 -598 -356 805 -498
2705 -498 88 805 -1490 1323 400 -1744 1858 -857 -384 1485 -1910 996 725 -1658 1169 -151
2721 -151 -527 801 -582 -225 891 -473 -641 1149 -620 -285 1076 -1492 960 540 -1877 1754
2737 1754 -484 -846 1521 -1464 499 894 -1548 835 300 -840 646 -89 -586 876 -274 -867
2753 -867 1341 -618 -543 1333 -1375 624 768 -1785 1520 -135 -1123 1490 -1004 -31 1061 -1290
2769 -1290 433 677 -1030 452 349 -889 788 -1 -1045 1331 -519 -768 1449 -1208 205 987
2785 987 -1636 1114 229 -1293 1344 -514 -520 1149 -929 5 957 -1025 228 741 -1063 656 323
2802 323 -1173 1240 -291 -928 1476 -968 -151 1175 -1424 695 553 -1360 1102 -107 -889 1154
2818 1154 -594 -427 1096 -903 -69 968 -1139 423 622 -1289 1014 22 -1095 1404 -685 -502
2834 -502 1311 -1188 246 855 -1299 793 286 -1066 1055 -205 -773 1149 -622 -372 1144 -1036
2850 -1036 132 918 -1325 758 372 -1249 1248 -378 -776 1344 -983 -111 1040 -1179 448 540
2866 540 -1117 817 114 -997 1046 -279 -720 1199 -810 -203 1155 -1305 456 731 -1371 1060
2882 1060 -68 -962 1335 -731 -378 1133 -950 96 721 -982 489 456 -1092 826 187 -1064
2898 -1064 1152 -459 -606 1365 -1243 135 1057 -1477 852 195 -1056 1216 -553 -545 1089 -679
2914 -679 -208 764 -699 87 695 -1056 503 644 -1358 1057 -46 -950 1498 -1143 -93 1337 -1532
2931 -1532 671 401 -1028 1037 -398 -535 940 -370 -487 712 -231 -391 858 -916 112 1113
2947 1113 -1651 865 432 -1353 1536 -1001 -309 1523 -1590 481 569 -913 742 -296 -380 674
2963 674 -82 -706 588 297 -902 954 -606 -262 1507 -1873 727 905 -1673 1508 -825 -361 1557
2980 1557 -1633 412 663 -722 396 -237 -61 295 149 -829 416 836 -1462 994 -200 -694 1746
2997 1746 -2017 601 1333 -2003 1394 -557 -387 1458 -1616 417 712 -544 10 -120 366 -202 361
3014 361 -783 235 1311 -1982 1023 281 -1121 1850 -2019 559 1592 -2259 1285 -286 -351 1163
3030 1163 -1542 560 589 -385 -337 -7 792 -786 499 -615 38 1608 -2390 1085 747 -1539 1816
3047 1816 -1834 528 1676 -2431 1219 35 -336 760 -1303 753 355 -238 -560 145 1149 -1402
3063 -1402 694 -290 -294 1775 -2596 1115 1142 -1997 1728 -1468 424 1540 -2440 1170 258 -367 323
3080 323 -945 938 -23 -95 -643 254 1316 -1922 918 90 -554 1714 -2568 1191 1292 -2284 1624
3097 1624 -967 348 1223 -2222 1149 372 -429 -31 -525 1045 -519 123 -589 277 1364 -2265 1096
3114 1096 334 -1027 1728 -2275 1097 1333 -2451 1502 -523 39 941 -1810 1078 341 -450 -207 -91
3131 -91 1095 -899 375 -436 141 1278 -2341 1292 577 -1370 1601 -1792 889 1226 -2282 1361
3147 1361 -112 -133 587 -1270 930 154 -399 -384 200 811 -1246 693 -266 -66 1246 -2213 1277 638
3165 638 -1612 1507 -1294 558 1066 -2009 1173 130 -414 326 -649 669 -1 -163 -433 412 719
3182 719 -1387 897 -150 -337 1196 -1884 1123 691 -1672 1364 -778 165 863 -1535 876 274
3198 274 -513 136 -164 356 -181 69 -463 429 533 -1355 1009 -86 -538 1112 -1470 836 654 -1530
3216 -1530 1173 -363 -194 724 -995 506 360 -516 -4 225 64 -283 335 -482 327 479 -1226 987
3234 987 -37 -739 1064 -1065 424 668 -1310 868 -19 -495 608 -522 88 401 -397 -140 433
3251 433 -152 -310 506 -505 218 458 -1020 840 17 -745 964 -676 68 669 -971 526 245 -614
3269 -614 483 -119 -252 439 -213 -287 546 -242 -314 610 -511 76 495 -834 580 142 -751 777 -334
3288 -334 -275 700 -669 139 444 -651 336 208 -479 469 -29 -430 566 -238 -304 611 -441 -36 518 -628
3308 -628 316 275 -654 566 -55 -478 664 -386 -163 589 -599 149 375 -601 395 97 -504 508 -151
3327 -151 -347 536 -316 -174 514 -482 63 410 -607 338 192 -611 599 -151 -389 673 -463 -48 507
3346 507 -586 250 253 -532 409 38 -413 467 -128 -284 522 -342 -122 505 -530 161 343 -620 466 15
3366 15 -483 585 -297 -204 523 -474 69 351 -484 235 179 -469 356 26 -396 509 -224 -243 558 -448 42
3387 42 405 -549 334 145 -485 467 -73 -329 479 -233 -158 455 -406 21 416 -548 262 182 -524 509 -154
3408 -154 -339 563 -391 -46 379 -409 166 169 -387 238 144 -406 321 27 -363 500 -314 -154 598 -598 195
3429 195 306 -533 507 -167 -285 514 -309 -69 258 -170 6 165 -209 -5 381 -481 130 349 -592 515
3449 515 -203 -353 787 -693 85 435 -585 463 -201 -226 459 -273 -73 104 104 -157 61 52 -234 551
3469 551 -521 -64 697 -774 484 -65 -456 911 -782 66 513 -552 403 -292 4 348 -302 -2
3487 -2 -57 381 -342 -75 349 -462 623 -554 -203 983 -982 408 83 -510 941 -889 94 589 -548
3506 -548 316 -330 236 183 -328 114 -192 626 -530 -189 724 -701 654 -478 -313 1219 -1172 336
3524 336 286 -548 876 -957 210 596 -587 258 -381 490 -36 -430 323 -326 727 -668 -280 1022
3542 1022 -902 565 -371 -318 1263 -1294 306 430 -525 723 -910 379 514 -597 223 -345 689
3559 689 -278 -446 583 -469 772 -729 -285 1279 -1130 492 -151 -378 1252 -1363 304 595 -597
3576 -597 546 -809 515 361 -668 262 -324 770 -483 -467 840 -616 682 -673 -267 1369 -1258
3593 -1258 398 65 -361 1060 -1291 383 608 -607 394 -644 651 129 -618 366 -307 786 -641
3610 -641 -367 1010 -784 585 -518 -243 1329 -1336 353 300 -442 831 -1112 413 558 -643 282
3627 282 -458 668 -98 -551 493 -354 706 -681 -296 1119 -915 477 -298 -248 1179 -1268 339
3644 339 430 -469 608 -859 451 408 -595 253 -314 629 -299 -413 558 -423 582 -605 -199 1036
3662 1036 -961 392 -89 -278 923 -1077 289 457 -508 388 -559 387 222 -470 198 -184 536 -419
3680 -419 -234 596 -484 508 -460 -158 943 -934 316 109 -340 694 -795 219 430 -466 252 -301
3698 -301 290 52 -330 194 -166 404 -412 -125 528 -524 383 -279 -156 718 -764 245 213 -344 464
3717 464 -481 129 312 -344 108 -74 202 -54 -122 132 -137 332 -362 -12 453 -492 312 -96 -208 527
3737 527 -522 163 275 -305 338 -219 -19 236 -227 4 56 72 -126 17 73 -137 252 -248 -16 346 -398
3758 -398 217 37 -237 382 -299 0 290 -285 134 26 -120 154 -65 -75 117 24 -133 102 21 -120 203
3779 203 -150 -28 247 -294 114 116 -280 254 -93 -156 295 -225 -8 183 -217 101 67 -181 133 3 -142
3800 -142 146 -23 -121 172 -75 -82 200 -160 12 189 -243 153 68 -236 259 -115 -75 250 -226 71 129 -196
3822 -196 133 0 -111 111 -17 -87 97 -3 -139 155 -66 -105 228 -226 63 177 -307 235 -25 -186 292
3843 292 -212 5 185 -207 102 45 -110 86 40 -82 85 76 -161 163 -3 -164 268 -184 -16 239 -302
3864 -302 198 35 -215 260 -150 -43 158 -155 40 56 -79 3 67 -88 4 105 -192 115 31 -203 251 -133
3886 -133 -50 240 -251 126 79 -189 206 -55 -81 137 -63 -31 116 -60 -51 151 -123 8 147 -220 145 37
3908 37 -208 235 -133 -60 186 -188 45 85 -158 83 -30 -167 81 16 -131 121 -29 -128 206 -160 5 159
3930 159 -217 163 22 -144 181 -74 -33 101 -71 -3 87 -53 -55 151 -102 7 134 -234 211 -35 -205 284
3952 284 -198 30 124 -242 199 -42 -124 114 -33 8 -33 36 -50 74 16 -210 269 -143 -77 244 -297 279 -35
3975 -35 -277 375 -230 41 89 -197 262 -145 -39 53 -1 70 -210 181 -65 5 103 -317 389 -156 -203 321 -342
3998 -342 298 -92 -294 447 -279 48 22 -148 288 -252 34 17 47 83 -338 340 -97 -49 179 -397 513 -184
4020 -184 -275 459 -391 318 -124 -289 548 -339 56 -8 -64 315 -407 159 1 13 119 -465 487 -140 -171 261
4042 261 -438 558 -257 -328 543 -392 288 -176 -207 555 -430 84 -8 7 277 -497 307 -8 10 125 -486 631
4064 631 -197 -228 336 -419 572 -303 -324 634 -429 208 -164 -126 544 -522 127 -2 42 215 -558 434 -59
4085 -59 -96 135 -492 669 -271 -294 436 -409 514 -342 -253 652 -467 192 -150 -27 466 -570 224 14
4105 14 41 156 -548 549 -106 -137 173 -424 666 -333 -283 492 -395 392 -337 -173 616 -493 137 -97
4125 -97 25 333 -561 263 5 9 87 -482 566 -172 -171 234 -367 584 -348 -237 525 -382 318 -273 -84 527
4147 527 -500 172 -48 32 247 -514 346 -15 -46 94 -405 547 -207 -194 264 -299 456 -335 -171 478 -371
4168 -371 204 -192 -27 385 -447 157 -5 31 127 -388 339 -59 -52 79 -277 466 -236 -139 287 -250 328 -246
4190 -246 -101 393 -343 149 -91 -12 271 -363 176 5 -11 82 -292 311 -86 -88 110 -227 310 -208 -111 252
4212 252 -230 206 -167 -51 282 -269 110 -39 -5 151 -250 148 -1 -23 52 -159 227 -90 -57 106 -142
4233 -142 215 -142 -47 204 -177 134 -84 -37 180 -189 61 8 -36 81 -136 103 -14 -45 26 -103 127 -72
4255 -72 -39 76 -106 105 -75 -30 117 -115 48 -32 -26 88 -101 44 12 -24 55 -56 44 9 -22 46 -29 35 -21
4280 -21 -23 53 -38 27 -3 -15 56 -42 8 16 -46 41 -23 -13 38 -42 3 -3 -48 19 26 15 33 -61 13 12 -66 -49 -108 -44 -32 3 66
4313 66 -68 11 -24 -44 44 51 17 19 8 101 -107 102 -47 49 -1 -149 76 -35 -45 85 -93 39 -33 -9 10 -45
4339 -45 34 -40 1 21 -48 47 -51 -4 62 -95 81 -35 -10 69 -98 75 -22 -42 82 -71 43 -3 -45 58 -50
4364 -50 61 -35 44 28 -63 81 -66 -11 83 -95 107 -60 -2 115 -132 74 -10 -75 64 -108 -1 44 50 -24 -68
4389 -68 21 -4 -6 6 -57 97 -27 52 51 -72 98 -20 -2 75 -43 36 -40 -41 31 -8 7 11 2 11 -11 50 -5 24 18 -18 56
4420 56 -122 -29 65 -53 20 -103 -18 139 -88 -54 63 -48 29 -27 -24 114 21 -87 69 -1 -40 91 -12 12 31
4445 31 -61 45 -29 -111 -14 -15 14 91 -15 -5 38 -43 18 113 -146 -8 59 -110 74 -24 -48 72 -69 9 49 -36 2
4472 2 7 -23 3 30 -62 43 50 -105 104 -16 -44 129 -138 48 89 -135 118 -34 -30 78 -101 27 19 -24 -22 9 19
4499 19 -52 51 -88 20 95 -196 110 -3 -103 155 -169 65 98 -171 106 -36 -11 48 -95 59 20 18 -68
4522 -68 31 93 -96 105 -77 8 165 -240 143 46 -129 174 -188 78 113 -191 114 -21 -5 20 -85 58 -16
4545 -16 28 -113 52 106 -184 137 -83 -13 178 -291 176 57 -171 202 -167 89 97 -196 127 -1 3 -30 -17
4568 -17 81 -41 65 -136 80 115 -244 190 -60 -34 176 -292 193 67 -202 173 -118 71 59 -176 93 8
4590 8 2 -74 27 62 -105 104 -157 106 124 -289 222 -41 -87 203 -271 187 80 -224 180 -72 52 38 -109
4613 -109 80 17 1 -113 100 53 -138 144 -145 103 115 -310 242 -49 -111 176 -229 150 49 -213 120 -13
4635 -13 -15 -25 -40 28 26 21 -152 146 7 -170 188 -137 79 114 -292 247 -38 -134 188 -155 117 55 -166 105
4659 105 22 -45 -17 40 -24 6 50 -162 168 -20 -187 220 -162 29 101 -259 212 -39 -160 160 -114 27 43
4682 43 -109 38 50 -60 -46 119 -82 0 89 -172 182 -34 -170 249 -155 13 116 -200 164 0 -139 129
4704 129 -35 -47 42 -45 -48 75 -75 -76 154 -151 -14 106 -215 165 -32 -170 226 -145 -33 127 -148 67
4726 67 33 -122 88 28 -109 63 30 -106 139 -45 -85 196 -176 10 139 -202 128 6 -153 189 -87 -58
4748 -58 126 -107 -15 72 -98 17 78 -147 66 69 -182 128 -45 -129 200 -169 -11 169 -203 100 43 -135 142
4771 142 -43 -89 139 -49 -64 135 -79 -26 133 -154 63 121 -215 157 7 -145 204 -125 -29 163 -176 56
4793 56 75 -133 86 15 -116 107 -11 -137 146 -66 -95 179 -157 20 144 -219 149 34 -160 196 -79
4814 -79 -61 161 -141 7 122 -123 38 76 -132 82 50 -157 163 -22 -131 203 -152 -14 172 -221 103
4835 103 51 -188 155 -35 -95 135 -96 -44 114 -115 -25 138 -141 40 94 -191 140 16 -172 214 -102 -54
4857 -54 202 -190 71 106 -183 122 25 -109 133 -25 -91 134 -69 -68 167 -129 3 153 -209 118 49 -202
4879 -202 217 -81 -104 189 -175 16 116 -173 78 49 -125 97 17 -120 127 -18 -116 181 -106 -39 186 -203
4901 -203 69 122 -213 190 -26 -143 216 -131 -37 155 -138 39 80 -141 69 57 -141 91 24 -154 159 -71
4923 -71 -114 210 -192 1 166 -233 139 20 -165 196 -96 -85 164 -111 -1 98 -119 31 88 -136 65 92
4945 92 -169 133 4 -156 220 -146 -48 216 -232 96 76 -196 197 -67 -115 176 -82 -40 93 -84 -28 91
4967 91 -132 -5 151 -196 96 62 -206 220 -97 -114 260 -219 49 123 -208 170 -29 -114 162 -43 -60 82
4989 82 -24 -54 106 -90 -57 200 -194 35 142 -249 213 -60 -159 298 -244 17 149 -199 140 -23 -122 123
5011 123 -29 -72 38 36 -97 77 -23 -132 246 -186 -28 230 -286 194 -7 -207 317 -202 -20 165 -173
5032 -173 109 -19 -85 83 7 -85 -17 106 -143 64 39 -194 274 -180 -88 296 -313 158 24 -230 307 -192
5054 -192 -45 173 -148 75 -29 -34 38 17 -61 -56 187 -174 39 119 -247 294 -156 -127 350 -314 134 79 -225
5077 -225 284 -167 -51 162 -110 40 -30 26 -21 32 -34 -110 254 -224 -7 180 -299 279 -125 -171 363 -326
5099 -326 91 105 -205 247 -157 -33 136 -81 14 -43 100 -72 41 28 -150 300 -227 -20 266 -325 263
5120 263 -91 -183 384 -305 59 126 -197 188 -128 -13 96 -43 -26 -55 157 -158 56 66 -197 313 -236 -55
5142 -55 304 -349 224 -31 -190 354 -277 31 150 -160 124 -87 19 76 -12 -47 -54 200 -190 51 114 -234
5164 -234 312 -208 -78 333 -348 184 10 -182 289 -229 9 134 -131 64 -53 43 -32 19 -26 -87 238 -228
5186 -228 45 159 -251 289 -157 -84 335 -316 137 61 -181 231 -151 3 125 -81 -6 -18 73 -71 61 -18
5208 -18 -100 227 -231 37 173 -288 242 -108 -119 284 -285 69 101 -162 143 -92 -12 88 -38 -33 7 97 -129
5231 -129 81 10 -115 235 -211 34 192 -275 215 -40 -123 258 -212 35 130 -147 89 -12 -24 40 10 -76
5253 -76 30 78 -180 92 15 -141 220 -207 24 184 -274 131 42 -150 153 -115 -35 120 -169 22 9 27
5275 27 -20 30 -104 -6 129 -180 99 57 -153 211 -123 -20 190 -207 101 62 -144 139 -68 -56 113 -72
5297 -72 -36 70 -53 -51 84 -91 8 109 -164 89 34 -178 170 -82 -73 169 -156 43 100 -144 93 23 -83
5320 -83 112 -12 -76 104 -33 -55 122 -82 -6 124 -143 77 56 -150 140 -29 -86 144 -105 -21 110 -138
5342 -138 37 65 -107 71 18 -120 107 -23 -89 126 -72 -42 128 -123 33 81 -147 92 16 -105 144 -54
5364 -54 -50 120 -94 5 99 -113 48 69 -118 90 12 -110 121 -48 -59 130 -107 -13 99 -137 69 37 -127
5387 -127 111 -18 -84 105 -69 -29 96 -84 11 83 -97 47 47 -113 100 -7 -87 140 -72 -35 132 -126 45
5410 45 76 -118 88 0 -97 99 -27 -59 91 -53 -35 94 -99 2 89 -136 71 32 -131 137 -68 -78 125
5433 125 -121 3 75 -107 65 10 -91 70 17 -66 69 4 -73 109 -60 -47 151 -136 38 65 -150 149 -44
5456 -44 -86 153 -98 3 61 -87 49 6 -60 7 55 -70 6 61 -122 102 -36 -123 188 -147 -3 127 -193
5479 -193 143 -32 -111 153 -89 6 38 -48 33 2 -12 -28 86 -63 -36 129 -149 99 24 -159 231 -140 -24
5502 -24 144 -187 140 -45 -98 164 -101 11 2 -24 17 -49 49 -84 106 -38 -113 192 -170 66 64 -211 261 -145
5526 -145 -62 192 -198 144 -37 -82 166 -102 35 -4 33 23 -80 110 -121 128 -10 -148 260 -197 41 117
5548 117 -227 267 -156 -81 204 -199 136 -70 -52 129 -137 56 -57 84 -2 -127 183 -154 108 18 -212
5569 -212 321 -220 6 152 -244 290 -157 -72 227 -194 124 -73 -3 119 -129 96 -91 101 -10 -160 235
5590 235 -204 87 47 -236 339 -236 -23 188 -250 242 -152 -69 215 -201 101 -81 31 82 -153 136 -121
5611 -121 124 -8 -183 293 -223 75 74 -240 355 -228 -47 221 -252 212 -143 -61 202 -193 107 -93 60
5632 60 50 -178 173 -144 108 -15 -206 319 -243 45 118 -263 319 -219 -50 232 -235 176 -110 -16 157
5653 157 -176 105 -85 78 12 -163 216 -164 107 14 -208 334 -233 18 153 -238 272 -184 -55 210 -211
5674 -211 131 -86 11 102 -164 93 -101 82 -15 -163 220 -190 75 28 -214 313 -234 -4 175 -238 225
5695 225 -138 -43 183 -176 102 -56 26 73 -119 123 -93 110 -20 -129 246 -195 81 57 -186 269 -189
5716 -189 -12 176 -192 151 -86 -44 125 -145 64 -41 31 7 -90 108 -100 92 -24 -115 221 -170 46 82
5738 82 -167 218 -132 -27 171 -165 98 -30 -30 89 -84 33 -18 42 -18 -55 108 -107 74 -3 -100 179 -164
5761 -164 28 93 -159 145 -79 -49 125 -124 36 7 -44 40 -49 7 -8 34 -33 -25 101 -106 61 18 -91 146
5785 146 -100 -2 94 -123 109 -16 -66 107 -62 3 31 -45 0 -4 0 -21 38 -45 -8 68 -95 34 18 -85 108 -69
5811 -69 -26 99 -100 32 27 -69 77 -19 -31 64 -14 -11 33 -12 -20 43 -27 -11 67 -61 34 38 -87 68 -11 -55 90 -62
5839 -62 -2 49 -81 38 14 -70 55 -9 -41 40 -30 -26 44 -28 -18 54 -59 6 49 -79 46 17 -81 79 -42 -30 89
5866 89 -72 23 48 -47 57 12 -48 50 -2 -33 45 -8 -25 54 -44 -21 58 -74 30 31 -88 68 -20 -50 65 -60 -10
5893 -10 46 -64 17 24 -53 31 -5 -39 41 1 -55 58 -30 -42 62 -59 22 55 -84 68 6 -60 69 -24 -7 47 -36
5920 -36 3 43 -36 -2 45 -61 25 28 -80 60 -22 -55 77 -70 5 40 -75 31 2 -48 27 -6 -24 30 -2 -42 71
5947 71 -15 -35 87 -62 13 57 -95 84 -8 -40 78 -59 12 30 -42 37 8 -13 -21 19 -22 3 44 -86 58 -4 -83
5974 -83 101 -103 13 45 -127 101 -39 -41 82 -71 36 -13 -29 30 -16 28 -51 52 -17 -41 87 -118 85 25
5998 25 -113 152 -94 18 75 -142 122 -40 -38 57 -59 44 -76 11 69 12 106 -105 94 -11 -89 137 -156
6021 -156 85 40 -171 196 -122 24 70 -146 153 -77 -29 43 -98 109 -85 52 7 -53 113 -150 121 11
6043 11 -144 136 -142 118 42 -216 231 -127 12 53 -143 173 -106 -8 46 -77 118 -135 60 5 -85 138
6065 138 -199 140 13 -178 223 -189 121 48 -198 246 -140 27 62 -134 197 -128 27 49 -66 148 -182
6086 -182 130 12 -113 176 -223 175 16 -200 249 -201 96 40 -209 255 -172 22 53 -136 173 -168 54
6107 54 33 -89 156 -221 150 16 -153 213 -227 175 22 -206 270 -186 83 37 -181 252 -158 29 55
6128 55 -102 175 -187 91 33 -92 160 -226 179 1 -166 221 -235 149 8 -219 274 -200 56 38 -167
6149 -167 226 -177 33 55 -92 160 -194 114 21 -100 170 -216 185 4 -177 229 -203 138 18 -184 252
6170 252 -163 48 45 -129 190 -168 46 38 -77 134 -181 130 8 -114 158 -194 157 -7 -175 232 -176
6191 -176 90 14 -162 231 -157 32 58 -93 161 -140 53 25 -77 124 -161 137 -11 -99 163 -168 145
6212 145 2 -140 217 -153 58 33 -134 179 -115 14 39 -73 111 -118 57 8 -58 103 -132 115 -14
6233 -14 -94 136 -137 97 8 -125 169 -118 38 27 -104 131 -84 21 43 -38 80 -79 66 7 -34 85 -95
6256 -95 110 -17 -81 125 -115 66 16 -109 132 -92 8 44 -85 77 -61 11 22 -35 41 -62 46 -20 -37
6279 -37 69 -79 67 6 -75 109 -69 33 33 -72 89 -44 -1 56 -40 32 -17 6 19 -14 20 -30 36 -17 -29 41
6305 41 -57 42 -6 -51 65 -58 -5 35 -66 28 -20 -36 45 -38 -2 9 -18 -4 -5 -4 -9 16 -1 -3 43 -34 19 17 -45 44 -11
6336 -11 -23 53 -31 14 29 -35 41 -8 -20 31 -27 0 6 -3 0 4 -5 -12 26 -18 -5 30 -38 21 7 -49 45 -34 -4 41 -37 28 -1
6369 -1 -22 31 -14 -1 14 -10 17 -4 10 -7 16 1 -18 44 -42 21 28 -50 52 -20 -22 39 -49 10 5 -36 22 -17 2 -1 3 -6 -13 21
6403 21 -39 19 -14 -31 40 -38 12 38 -50 43 -7 -12 36 -29 16 6 -18 15 2 2 -4 16 -3 12 18 -42 30 -8 -29 32 -48 4
6435 4 20 -44 28 -12 -6 4 -13 -4 -2 -4 -30 9 8 -24 34 -32 20 27 -47 48 -5 -11 35 -27 25 10 -8 22 -22 16 -10 8 -1 -12 28
6470 28 -47 14 -1 -33 48 -67 10 12 -67 38 -23 -20 22 -36 9 -23 10 42 6 45 -53 28 -24 -24 55 -68 53 5 -40 70
6500 70 -63 44 22 -46 67 -55 17 2 -29 43 -43 30 -23 -7 63 -83 59 -20 -33 67 -99 53 -12 -64 73
6525 73 -108 49 3 -70 65 -74 38 -13 -32 74 -70 55 -34 -23 85 -103 78 -22 -36 104 -123 88 -7
6548 -7 -63 102 -96 81 -11 -63 90 -83 63 -32 -36 78 -109 76 -47 -44 102 -155 96 -32 -46 105 -141 91
6572 91 -8 -72 100 -110 86 -22 -59 109 -99 80 -45 -36 104 -128 96 -38 -28 111 -158 116 -20 -42 126
6595 126 -132 130 -6 -88 119 -114 84 -59 -68 101 -113 85 -60 -32 115 -163 99 -53 -39 123 -169 108
6617 108 -14 -75 117 -142 104 -24 -74 116 -112 93 -44 -44 103 -116 106 -53 -33 119 -166 102 -35 -46
6639 -46 116 -173 108 -16 -74 107 -141 99 -39 -83 102 -115 87 -60 -42 108 -137 95 -52 -19 119 -162
6661 -162 115 -30 -51 121 -144 112 -18 -77 108 -113 106 -31 -53 101 -107 88 -58 -26 98 -133 104
6682 104 -50 -40 115 -148 100 -26 -48 107 -138 91 -12 -70 75 -98 81 -31 -43 74 -91 77 -52
6703 -52 -27 89 -117 93 -34 -36 104 -129 83 -10 -53 79 -110 64 -7 -55 68 -72 57 -38 -29 66 -83 62
6727 62 -46 -31 67 -114 59 -30 -45 73 -115 55 -9 -68 67 -63 32 -2 -46 57 -55 29 -24 -22 54 -55 59
6752 59 -25 -28 59 -75 61 -3 -29 72 -60 42 13 -47 45 -45 19 4 -31 30 -37 15 -16 -20 29 -61 31 -14 -28 35 -65
6781 -65 21 6 -49 60 -49 3 20 -51 40 -16 0 23 -14 22 -14 16 -3 -6 29 -26 20 4 -33 48 -46 23 22 -60 35 -15
6811 -15 -20 34 -39 8 4 -26 9 -24 2 -16 -2 -13 -14 16 -33 -1 0 -37 41 -19 -8 36 -43 33 7 -30 48 -10 0 25 -21 21
6843 21 -6 -5 6 -7 2 -10 26 -15 -2 27 -42 20 -2 -39 42 -49 6 15 -50 32 -19 -18 23 -36 7 -6 -17 6 -16 5 -5 9
6875 9 -4 -9 28 -38 21 16 -36 54 -39 5 13 -36 20 6 -19 -14 7 63 -89 -2 -15 -36 -41 -31 25 -10 -71 4 -42 -47 -5 -50 58
6908 58 -25 1 32 -42 23 5 -15 13 -13 2 12 6 1 -1 18 -18 22 -8 -24 42 -33 10 14 -42 29 -22 -6 19 -40 31 -3 3 -8
6941 -8 6 13 -19 11 -25 -1 13 -32 28 -11 -29 33 -47 23 3 -37 38 -23 -7 21 -18 0 -4 -7 -6 20 -3 -15 36 -33 11 25 -40
6974 -40 48 -26 -23 40 -47 18 1 -39 8 -23 -2 -6 -6 -12 -20 12 -41 13 -17 -40 46 -54 8 23 -46 55 -28 -10 33 -41 32 -7
7006 -7 -4 32 -8 23 -21 14 -9 -10 42 -48 39 -11 -37 74 -45 24 31 -60 59 -46 5 22 -47 32 -29 7 5 -19 37 -55 38
7037 38 -28 -21 54 -80 54 -5 -44 82 -68 39 28 -71 85 -44 15 31 -40 45 -40 44 -4 -27 49 -70 50 -19
7063 -19 -48 78 -89 55 -2 -67 101 -92 33 34 -75 63 -62 16 30 -31 53 -44 41 -9 -23 69 -71 92 -20
7088 -20 -28 100 -97 73 17 -71 111 -87 28 25 -52 71 -68 42 -3 -42 57 -70 64 -11 -52 68 -128 81
7112 81 -37 -74 129 -124 34 -9 -133 85 -171 15 74 -53 21 -115 103 4 -14 80 -83 11 -31 -2 -37 -66
7136 -66 46 -65 -10 22 -137 84 -20 -115 134 -68 -17 3 -111 18 -17 93 29 -42 52 -79 56 -23 -61 107
7160 107 -133 102 -41 -76 112 -103 49 45 -86 128 -69 25 31 -35 71 -67 58 -3 -28 80 -78 79 -30
7183 -30 -45 106 -107 66 -16 -69 117 -104 31 25 -77 77 -78 17 14 -44 49 -65 46 1 -42 70 -80 68
7207 68 -24 -53 106 -93 53 21 -59 109 -88 36 42 -47 69 -54 33 25 -34 54 -53 51 -25 -31 70 -83 71
7232 71 -15 -53 89 -95 34 19 -65 88 -73 18 19 -45 56 -47 13 19 -31 47 -48 57 -17 -33 40 -62 55 -4
7258 -4 -39 85 -64 20 39 -51 74 -44 8 38 -43 37 -23 12 11 -19 22 -42 22 -10 -33 46 -62 41 1 -58 59 -60
7286 -60 -3 29 -46 44 -33 -13 33 -33 26 -5 26 6 -9 22 -37 27 0 -16 49 -42 22 25 -56 61 -28 -12 40 -51 19 3
7316 3 -19 32 -28 1 0 -3 -4 -7 6 -21 12 1 -28 39 -39 7 11 -36 29 -6 -20 50 -46 38 -32 -1 11 -13 -7 -12 30 -21 20 -72
7350 -72 -46 52 46 7 49 42 32 9 -59 0 11 -20 34 -59 5 27 -28 8 -6 -14 19 -16 -5 -12 17 -17 9 18 -23 35 1 -9 46
7383 46 -46 31 24 -22 51 -28 8 26 -15 22 -2 -2 9 -17 2 -11 7 -21 -4 15 -31 15 -14 -32 46 -48 23 21 -39 34 -21 -13
7415 -13 25 -28 20 4 -3 1 -2 15 -18 25 5 0 40 -31 41 -1 -17 50 -26 18 27 -34 33 -15 5 13 -5 8 -7 -8 -7 -4 2 -29 17
7450 17 -20 0 29 -38 35 -19 -10 37 -33 23 11 -20 24 -5 4 8 -2 18 -6 23 -16 9 15 -13 40 -37 4 25 -50 42 -26 -8
7482 -8 26 -38 13 -17 -11 10 -24 9 -22 -1 -13 -19 31 -53 21 -1 -40 49 -38 6 29 -48 38 -27 1 22 -33 32 -14 6 0 -10
7514 -10 40 -38 38 -16 -21 41 -68 43 -5 -47 55 -58 30 11 -43 47 -57 0 12 -34 23 -45 22 -11 -25 37 -54 50
7542 50 -24 -31 69 -70 58 -3 -37 77 -64 48 4 -35 70 -42 25 -1 -16 45 -58 55 -26 -19 58 -69 60
7567 60 -26 -33 67 -89 61 -23 -48 69 -94 35 -1 -24 64 -80 29 -16 -21 52 -70 60 -31 -15 57 -85 83
7592 83 -37 -33 86 -89 70 -18 -49 90 -83 51 -18 -45 80 -80 57 -26 -19 56 -88 71 -30 -28 69 -107 82
7617 82 -36 -39 87 -99 65 -17 -43 91 -102 27 -20 -8 67 -91 75 -25 -12 60 -83 77 -36 -24 87 -108
7641 -108 99 -33 -18 94 -90 63 -3 -28 89 -110 68 -90 -17 73 -93 75 -50 -6 46 -66 85 -33
7663 -33 -43 85 -107 102 -41 -33 95 -98 65 -15 -36 80 -87 72 -23 -21 61 -77 76 -26 -9 64 -88 92
7687 92 -40 -24 79 -93 72 -36 -39 90 -101 54 -14 -28 70 -80 52 -29 -20 44 -83 61 -48 -17 56 -86
7711 -86 79 -53 -29 74 -86 75 -18 -29 81 -72 54 -14 -14 63 -70 44 -16 -9 43 -70 57 -37 -20 48 -75
7736 -75 70 -51 -22 60 -83 55 -23 -39 55 -67 38 -1 -14 44 -57 47 -8 1 30 -52 54 -28 -13 57 -63 44
7762 44 -17 -12 56 -57 47 -4 -26 43 -44 28 6 -16 27 -36 32 -17 -21 18 -56 27 -24 -14 26 -61 29 -24 -28 38 -55 13 -5
7793 -5 -30 37 -32 13 8 -14 18 -20 22 -9 1 32 -23 25 -5 -10 25 -26 31 0 -25 30 -33 3 -1 -29 29 -14 -4 6 -27 16
7825 16 -21 7 -1 -11 -3 -35 0 -7 -22 28 -27 21 3 -31 27 -17 7 20 -14 14 -4 7 16 -10 4 4 10 -4 -6 24 -2 0 -2 -23 13
7860 13 -18 -3 17 -26 15 -17 -6 16 -25 15 -4 -23 12 -17 8 1 0 8 -12 -1 -9 -3 12 -11 15 -13 7 30 -19 32 -8 -10 22
7893 22 -18 7 3 -19 18 -8 2 3 -4 1 -12 8 -14 1 14 -22 15 -17 -6 10 -22 7 -2 -19 21 -18 3 4 -10 14 -1 7 0 2 16
7928 16 0 11 4 2 16 -10 27 -4 -2 19 -16 9 1 -9 22 -19 5 5 -17 8 -11 4 -1 6 -3 -7 5 -19 -7 7 -53 17 -23 -27 40
7963 40 -39 40 -7 1 -9 -37 -20 5 -9 -6 -19 35 -12 45 39 -7 21 -20 29 10 7 28 -15 9 3 -8 21 -16 -6 2 -15 2 -4 2
7997 2 -6 -6 2 -15 16 -10 -5 16 -22 25 -10 -13 30 -25 18 2 -4 23 -16 16 2 5 22 -19 32 -11 -1 10 -25 22 -20 -3 23 -40
8031 -40 25 -13 -25 19 -38 24 -9 -24 25 -41 19 -17 9 22 -21 37 -26 2 21 -31 45 -24 2 24 -43 43 -25 -20 43 -37 36
8062 36 -16 -5 24 -39 41 -19 -1 25 -39 36 -35 5 14 -54 53 -45 -14 18 -60 45 -35 -14 26 -43 39 -28 -4 31 -31 40
8092 40 -31 17 28 -40 51 -35 13 26 -52 62 -22 9 34 -53 60 -32 12 39 -34 44 -32 10 22 -49 43 -34 6 15 -60 50
8122 50 -47 15 24 -60 59 -48 1 39 -57 54 -33 13 37 -40 61 -24 19 18 -29 59 -23 18 25 -46 66 -35 19 29 -49
8151 -49 64 -40 2 30 -50 53 -37 2 24 -49 31 -29 13 23 -44 48 -41 11 15 -40 66 -46 11 35 -50 47 -34 3
8179 3 42 -52 51 -18 -1 27 -37 43 -27 22 24 -41
8191d1
##END NTUPLES=NMR FID
##END=
