##TITLE=1H_DE-80H_X3
 200.13MHz, d2o
 8 sc
 
 19ns.26.2.2025
##JCAMPDX= 6.0         $$ Bruker NMR JCAMP-DX V2.0
##DATA TYPE= NMR FID
##DATA CLASS= NTUPLES
##ORIGIN= UXNMR, Bruker Analytische Messtechnik GmbH
##OWNER= pz
$$ XWIN-NMR		Version 3.5
$$ Tue Mar 10 10:20:12 2026 Russian Standard Time (UT+4h)  Yarkov@DPX200
##.OBSERVE FREQUENCY= 200.1313
##.OBSERVE NUCLEUS= ^1H
##.DELAY= (6, 6)
##.ACQUISITION MODE= SIMULTANEOUS
##.ACQUISITION SCHEME= undefined
##.AVERAGES= 8
##.DIGITISER RES= 18
##SPECTROMETER/DATA SYSTEM= spect
##.PULSE SEQUENCE= zg30
##.SOLVENT NAME= CDCl3
##.SHIFT REFERENCE= (INTERNAL, CDCl3, 0, 14.3821)
##AUDIT TRAIL= $$ (NUMBER, WHEN, WHO, WHERE, WHAT)
$$ ##TITLE= Audit trail, XWIN-NMR		Version 3.5
$$ ##JCAMPDX= 5.01
$$ ##ORIGIN= Bruker BioSpin GmbH
$$ ##OWNER= Yarkov
$$ C:/Bruker/XWIN-NMR/data/yarkov2/nmr/H-C/1/audita.txt
$$ ##AUDIT TRAIL=  $$ (NUMBER, WHEN, WHO, WHERE, WHAT)
(   1,<2026-03-10 10:19:26.17 +0400>,<Yarkov>,<DPX200>,
      <created by zg, POWCHK disabled, PULCHK disabled
       configuration hash MD5:
       00 E9 B6 7A A2 85 ED C7 34 08 36 98 17 FE 4E 26
       data hash MD5: 16K
       E6 DB 84 B8 BE 24 F9 6F 19 42 01 1E AD 62 77 07>)
$$ ##END=
$$ 
$$ hash MD5
$$ E6 A0 82 4C E1 50 25 4D 30 11 58 5D 38 FB 1A C8
##$RELAX= 
##$RELAX= 
##$RELAX= 
##$RELAX= 
##$RELAX= 
##$RELAX= 
$$ Bruker specific parameters
$$ --------------------------
##$DU= <C:/Bruker/XWIN-NMR>
##$EXPNO= 1
##$NAME= <H-C>
##$PROCNO= 1
##$TYPE= <nmr>
##$USER= <yarkov2>
##$AMP= (0..31)
100 100 100 100 100 100 100 100 100 100 100 100 100 100 100 100 100 100 
100 100 100 100 100 100 100 100 100 100 100 100 100 100 
##$AQSEQ= 0
##$AQ_mod= 1
##$AUNM= <au_zg>
##$AUTOPOS= <>
##$BF1= 200.13
##$BF2= 200.13
##$BF3= 200.13
##$BF4= 200.13
##$BF5= 200.13
##$BF6= 200.13
##$BF7= 200.13
##$BF8= 200.13
##$BYTORDA= 1
##$CFDGTYP= 0
##$CFRGTYP= 5
##$CHEMSTR= <none>
##$CNST= (0..31)
1 1 145 1 1 1 1 1 1 1 1 1 1 1 1 1 1 1 1 1 1 1 1 1 1 1 1 1 1 1 1 1 
##$CPDPRG= <>
##$CPDPRG1= <>
##$CPDPRG2= <>
##$CPDPRG3= <>
##$CPDPRG4= <mlev>
##$CPDPRG5= <mlev>
##$CPDPRG6= <mlev>
##$CPDPRG7= <mlev>
##$CPDPRG8= <mlev>
##$CPDPRGB= <>
##$CPDPRGT= <>
##$D= (0..31)
0 0.7 0 0 0 0 0 0 0 0 0 0.03 0 0 0 0 0 0 0 0 0 0 0 0 0 0 0 0 0 0 0 0 
##$DATE= 1773123565
##$DBL= (0..7)
120 120 120 120 120 120 120 120 
##$DBP= (0..7)
150 150 150 150 150 150 150 150 
##$DBP07= 0
##$DBPNAM0= <>
##$DBPNAM1= <>
##$DBPNAM2= <>
##$DBPNAM3= <>
##$DBPNAM4= <>
##$DBPNAM5= <>
##$DBPNAM6= <>
##$DBPNAM7= <>
##$DBPOAL= (0..7)
0.5 0.5 0.5 0.5 0.5 0.5 0.5 0.5 
##$DBPOFFS= (0..7)
0 0 0 0 0 0 0 0 
##$DE= 6
##$DECBNUC= <off>
##$DECIM= 32
##$DECNUC= <off>
##$DECSTAT= 4
##$DIGMOD= 1
##$DIGTYP= 9
##$DL= (0..7)
0 120 120 120 120 120 120 120 
##$DP= (0..7)
150 150 150 150 150 150 150 150 
##$DP07= 0
##$DPNAME0= <>
##$DPNAME1= <>
##$DPNAME2= <>
##$DPNAME3= <>
##$DPNAME4= <>
##$DPNAME5= <>
##$DPNAME6= <>
##$DPNAME7= <>
##$DPOAL= (0..7)
0.5 0.5 0.5 0.5 0.5 0.5 0.5 0.5 
##$DPOFFS= (0..7)
0 0 0 0 0 0 0 0 
##$DQDMODE= 0
##$DR= 18
##$DS= 0
$$ [...]
##$SUBNAM2= <"">
##$SUBNAM3= <"">
##$SUBNAM4= <"">
##$SUBNAM5= <"">
##$SUBNAM6= <"">
##$SUBNAM7= <"">
##$SUBNAM8= <"">
##$SUBNAM9= <"">
##$SW= 18.0517328524113
##$SWIBOX= (0..15)
0 0 2 0 0 0 0 0 0 0 0 0 0 0 0 0 
##$SW_h= 3612.71676300578
##$TD= 16384
##$TD0= 1
##$TE= 0
##$TE2= 300
##$TE3= 300
##$TEG= 300
##$TL= (0..7)
0 120 120 120 120 120 120 120 
##$TP= (0..7)
150 150 150 150 150 150 150 150 
##$TP07= 0
##$TPNAME0= <>
##$TPNAME1= <>
##$TPNAME2= <>
##$TPNAME3= <>
##$TPNAME4= <>
##$TPNAME5= <>
##$TPNAME6= <>
##$TPNAME7= <>
##$TPOAL= (0..7)
0.5 0.5 0.5 0.5 0.5 0.5 0.5 0.5 
##$TPOFFS= (0..7)
0 0 0 0 0 0 0 0 
##$TUNHIN= 0
##$TUNHOUT= 0
##$TUNXOUT= 0
##$USERA1= <user>
##$USERA2= <user>
##$USERA3= <user>
##$USERA4= <user>
##$USERA5= <user>
##$V9= 5
##$VALIST= <valist>
##$VCLIST= <CCCCCCCCCCCCCCC>
##$VD= 0
##$VDLIST= <DDDDDDDDDDDDDDD>
##$VPLIST= <PPPPPPPPPPPPPPP>
##$VTLIST= <TTTTTTTTTTTTTTT>
##$WBST= 1024
##$WBSW= 4
##$XGAIN= (0..3)
0 0 0 0 
##$XL= 0
##$YL= 0
##$YMAX_a= 82699
##$YMIN_a= -69016
##$ZGOPTNS= <>
##$ZL1= 120
##$ZL2= 120
##$ZL3= 120
##$ZL4= 120
##$ABSF1= 10
##$ABSF2= 0
##$ABSG= 5
##$ABSL= 3
##$ALPHA= 0
##$AQORDER= 0
##$ASSFAC= 0
##$ASSFACI= 0
##$ASSFACX= 0
##$ASSWID= 0
##$AUNMP= <proc_1d>
##$AZFE= 0.1
##$AZFW= 0.1
##$BCFW= 1
##$BC_mod= 2
##$BYTORDP= 1
##$COROFFS= 0
##$CY= 83.5205535888672
##$DATMOD= 1
##$DC= 2
##$DFILT= <>
##$DTYPP= 0
##$F1P= 10.8118882576601
##$F2P= -7.23987719738617
##$FCOR= 0.5
##$FTSIZE= 0
##$FT_mod= 4
##$GAMMA= 1
##$GB= 0.15
##$INTBC= 1
##$INTSCL= 1
##$ISEN= 128
##$LB= 0.25
##$LEV0= 0
##$LPBIN= 0
##$MAXI= 10000
##$MC2= 0
##$MEAN= 0
##$ME_mod= 0
##$MI= 1.114404
##$NCOEF= 0
##$NC_proc= 0
##$NLEV= 6
##$NOISF1= 3.799351
##$NOISF2= 2.8
##$NSP= 1
##$NTH_PI= 0
##$NZP= 0
##$OFFSET= 14.38212
##$PC= 1
##$PHC0= -5299.148
##$PHC1= 6.821927
##$PH_mod= 1
##$PKNL= yes
##$PPARMOD= 0
##$PSCAL= 0
##$PSIGN= 0
##$REVERSE= no
##$SF= 200.129724274929
##$SI= 16384
##$SIGF1= 3
##$SIGF2= 2
##$SINO= 400
##$SIOLD= 16384
##$SREGLST= <1H.CDCl3>
##$SSB= 0
##$STSI= 0
##$STSR= 0
##$SW_p= 3205.1282051282
##$SYMM= 0
##$S_DEV= 0
##$TDeff= 0
##$TDoff= 0
##$TI= <>
##$TILT= no
##$TM1= 0
##$TM2= 0
##$TOPLEV= 0
##$USERP1= <user>
##$USERP2= <user>
##$USERP3= <user>
##$USERP4= <user>
##$USERP5= <user>
##$WDW= 1
##$XDIM= 8192
##$YMAX_p= 0
##$YMIN_p= 0
$$ End of Bruker specific parameters
$$ ---------------------------------
##NTUPLES= NMR FID
##VAR_NAME=  TIME,          FID/REAL,        FID/IMAG
##SYMBOL=    X,             R,               I
##VAR_TYPE=  INDEPENDENT,   DEPENDENT,       DEPENDENT
##VAR_FORM=  AFFN,          ASDF,            ASDF
##VAR_DIM=   8192,          8192,            8192
##UNITS=     SECONDS,       ARBITRARY UNITS, ARBITRARY UNITS
##FACTOR=    0.0002768,     1,               1
##FIRST=     0,             0,               0
##LAST=      2.2672688,     0,               0
##MIN=       0,             -69016,          0
##MAX=       2.2672688,     82699,           0
$$ Real data points
##PAGE= N=1
##DATA TABLE= (X++(R..R)), XYDATA
$$ [...]
1214b147J696J112o68r53M03K096r51j811J765J223j374r35N20J361p54k266J394
1231b89J555j897j057J197J118q30j730J672J982k191q86K111N67j055q52Q93
1247C08J457j733j113J896j6j324m76N96J020j116j233J836N53j498K44Q55M48
1264G04n89o51J228O39j784N32Q75n69l77l23L79K69j168J32R18q72r5N04L6K05
1284gm89K82R79o11m81J231k89k30j41O6M80r14n02J000m86q06N47j0J42l80k29
1305h48J091j81r23J212M47p59J37J30O73l31j317J083O69j525j46O54Nm12r90
1324a331Q74J165j471n17J722M1m63m59O91J108j165r17J731Q2j226o4R4P11o85
1343g9j152J176L74j402J40R04J71l97o97J150J040j508J43J163m25k99l52M89
$$ y = [-2147, -451, 661, -7, -960, -557, 1539, 588, -1223, 542, 1765, 391, -544, -24, 1337, 583, -1683, -289, 1266, -631, -1688, -491, 627, -203, -1933, -261, 1721, -470, -1356, 755, 1322, 267, -585, 308, 1765, 32, -1081, 815, 799, -525, -1001, -405, 615, -501, -1734, 102, 655, -843, -599, 256, 704, 115, -536, 692, 1331, -453, 79, 954, 385, 8, -315, 64, 333, -835, -703, 215, -657, -752, -248, -212, -7, -496, -214, 765, 154, -327, 904, 615, 385, 244, 310, 790, -124, -626, 374, -112, -918, -371, -381, -239, -619, -848, 243, 62, -861, 351, 798, 39, 176, 306, 979, 648, -669, 414, 1083, -442, -588, 66, 71, -341, -1331, -457, 708, -763, -1280, 442, 483, 20, -439, 252, 1360, 195, -722, 1009, 1091, -135, -199, -105, 606, -79, -1231, -55, 319, -1083, -943, -39, 132, -265, -962, 188, 1228, -280, -137, 1026, 601, 302, -50, 439]
1361D39N74j531l25J311n34m47r4K0Q14q01m50J255J24p37L89J71M72n7p65Q98
1381G26J00j086M77J60l57K0m56k8L61n05L15K18p56M58J94P0O50n48j60Q60l28
1402C85r0M73n41R0j61m21N79l77n68M52m70K07O33q46K0O47m4L27m22J97R64
1423A034p56m73Q31M2j44o76n02R91J46j497K95P51j36n56o47J324Q65j551M3
1442f16J299j56k54j63N9Q11q12k71Q38n06l45j82m22R30k09j005Q46j16m56O88
1462d2J88o5l19pJ142j45j380J264N80j257j20M46K91l24j362N44R45p11m58J32
1482f58L79P50j139l39K004j17j257Q8P52P07r52n52J178l05q93L58k77j68L66
1501g5n89nN77r2k2l94N7J157k32l62N51l43o4N53p48J64O18n52m51j28L31K89
$$ y = [439, 1013, -518, -843, 468, -66, -513, -607, -587, 227, -574, -1024, 231, 355, -382, 7, 178, 650, 593, -172, 726, 826, -260, 217, 377, 20, 40, -416, -444, -83, -588, -273, -55, -811, -353, -159, -89, 561, 13, -147, 713, 385, 295, 768, 227, 317, 156, -265, 314, -63, -631, -179, -649, -442, 191, -655, -635, 12, -32, 295, -127, 70, 1034, 278, -195, 636, 678, 534, -142, -644, 347, 493, -1004, -709, 42, -94, -650, -1297, 27, 892, -659, -616, 683, 527, 273, 110, 169, 980, 168, -103, 735, 229, -116, -298, -720, 210, 1, -1004, -158, -274, -730, -42, 146, 81, -238, -245, 897, 752, -628, 636, 1216, -41, -161, 285, 576, 252, -1110, -566, 379, -332, -790, -658, -279, 471, -668, -1007, 997, 880, -377, -289, 463, 1170, 218, -334, 844, 539, -354, 4, -273, -441, -75, -664, -669, -92, -184, -206, -600, -543, 614, 382, 20, 571, 228, 164, 717, -31, 133, 751, 199, -252, -380, -49, 240]
1523B40j079J67J045p23l33O49k03P9L74n6L30j65j4J74n53K68O18p16j82K16
1543A36o91M60m6o72M89L26j84n37k3J347j98j295J090J370j187p19N20O60k67
1562E79j080N03P07r69m90K01L31M88q24l66J347k43r49O07P98P4p42j3J069n94
1582D34j231J211M24q01j45N3Nm29n43P73N03p23L04rN7K53p32N66J291j028m46
1603b13Q53J06p25l76N52P84j238n79J168n70n21M20J42K12j27n25P12J05j84
1622dM40j44L01K03r76L36N53r99K21M14m15l28j24K11n1l84O67M61j039L39Q65
1643E47o16O3M11K35%p36K25N39o49o4Q1j99L08o06m39J042j93p00L89M97om76
1665c47p8J171j62r96R67M40r56r2K82K11l78o51O63K25r10j88M29K90jo95M86
$$ y = [240, -839, -672, 373, -350, -683, -34, -237, -158, 216, 160, 490, 325, 311, 485, -68, 200, 818, 102, -80, 136, -555, -95, -141, -813, -324, 2, -182, -719, -742, 605, 407, -888, 202, 1572, 385, -334, 186, 846, 579, -501, 2, 709, -260, -750, -549, -218, 270, -554, -920, 427, 184, -765, -158, 640, 714, -28, -41, 1028, 434, -797, 414, 838, 37, -108, -55, -50, -479, -1022, -249, 254, -469, -165, -174, -117, 136, -596, -30, 1261, 233, -213, 640, 746, 21, -355, 197, 981, -257, -836, 332, -238, -759, -339, -197, 15, -112, -637, 75, 180, -4, 436, 292, 593, 796, -180, 156, 709, -290, -69, 345, -70, -398, -522, -311, -362, -746, -79, 382, -657, -318, 547, -69, -6, 405, 640, 640, -96, 129, 668, 19, -45, 36, -163, 145, -461, -900, 142, -51, -751, -362, 135, 129, -347, -425, 746, 584, -412, 555, 995, 39, -53, 229, 440, 62, -589, 74, 299, -611, -799, -370, -80, -81, -776, -290]
1686b90J104r60n26J170N39q87m61O23R02j291o53J257K4j154P2L77L35p39n29
1705a087J090K58p27K08L84K10j49m88O61P78j183j68P85k15n39k35N99K26j181
1724g73Q6J019p05l91N21L15J36l48j53Q42l36m00P55k69kk2o33P61j95r60O64
1745h8K54n93n7m8L50Q3n76O14M41n94M04K68k76J59j56P3L70q52L08K90o42j07
1767c75K46j61K78n52RQ47o37k26R02p1l84J9K63P09o50n67R37R7r98J13J60L97
1789C56m88o77P44L12j100L19P06p1j77l92P16N56r13l2Q43k36l77j88M23L35
1809F59j008k05R12m69o28L09M05K0o36P5J049k54q16O30M23ol69k33R09J9j096
1830c10L08L90m01m62L3L99K88j020K84P05l29k78M02J22L10l90l6P38m76l27
$$ y = [-290, 814, -146, -672, 498, 1037, 150, -311, 312, 1214, -77, -730, 527, 551, -603, -531, -154, 181, -558, -1087, 3, 261, -466, -258, 126, 336, 187, -301, 360, 1138, -45, -213, 572, 357, -182, -417, 182, 408, -773, -687, 332, -373, -764, -243, 72, 208, -140, -293, 549, 213, -187, 568, 299, 297, 275, -358, 403, 208, -752, -88, 166, -427, -484, -532, -182, -99, -675, -61, 380, -214, 190, 458, 182, 341, 185, 258, 628, -224, 84, 374, -268, -375, -129, -290, -12, -564, -555, 292, -345, -571, 331, 260, -124, -105, 158, 867, 217, -350, 587, 684, -314, -201, -41, 356, -132, -809, -65, 247, -853, -534, 172, 101, -76, -468, 248, 804, -109, -141, 702, 466, 89, -99, 324, 659, -349, -554, 358, -111, -739, -430, -25, -5, -641, -566, 483, 229, -587, 43, 466, 460, 91, -142, 767, 786, -310, -2, 388, -13, -475, -442, -43, 245, -775, -491, 214, -115, -393, 9, 131, 441, 51, 15, 753, 277, -50]
1850e0L81k1j51k29k67M84j99n72M53Q5l71K09M1J43N2l02N87J33m88M08pj93
1872A26K95k99o1K98n96K50k8n06K95J00l43K44j78L02L37o10J94P59l86q3K01
1893C11P4K75p15k72R24n32m04J75r1K32l17k06O77q2o78N63J24lJ40k62L97K91
1915F21o53K50M61o45j18J08J37k7r01L86O81p95q8M08J43J6m17K34R97n59m66
1936b27O68j1rm01j22P12k50j014M82M41m30l47kN50k6o27L33O53n20J72J29r3
1958F1M08k99o1M24l85j32K02k43R9l02j51N35m06l94M15J75k95L13p0L40n4k45
1980f5O49l57k73M76j54o7J87o00pJ98j98O6k13L0L66l67j84O00j27N3L19l13
2002A9K50J54m04O2K59N6o5p19L25M98q70j03P43k65k77q1Q0N30m28L0O30k62
$$ y = [-50, 331, 310, 159, -70, -337, 147, -52, -624, -171, -86, -457, -248, -207, -64, -12, -314, 273, 406, -82, 326, 319, 126, 421, 122, 61, 359, -237, 13, -15, -521, -226, -126, -469, -225, -403, -101, 236, -374, -180, 579, 193, 110, 311, 385, 660, -55, -327, 597, 65, -339, -164, -255, -23, -340, -546, 131, 49, -629, -66, 58, 55, 195, -67, 330, 621, -32, 218, 679, 34, -84, 24, 161, 134, -767, -381, 300, -495, -583, -175, -32, -16, -433, -199, 798, 239, -227, 441, 430, 421, 20, -102, 610, 360, -654, -172, 269, -161, -508, -510, 40, 14, -613, -280, 373, -147, 25, 154, 61, 469, 170, 109, 533, 148, 16, 218, -25, 74, -228, -379, 156, -250, -644, -229, -54, -349, -36, -106, 234, 180, -65, 584, 227, -46, 430, 276, 209, 396, -204, -211, -13, -211, -145, -358, -328, 38, -329, -513, 87, -40, 13, 332, 19, 269, 423, 19, 81, 340, 396, 331, -388, -63, 435, -435, -538, 205, -60, -337, -418, -338, 192, -236, -206, 424, 162]
2024A62J1Q0k83L88J90p29L04L65m99l13j8K54k2o56P29K37r16M46L60j03J44
2045A31K2J54K43n95R1L49k82J02j02l87O75l86p72P69K10n30k30L26L86l81m08
2066f15R33J12n87M31J02k04Q3l61J37L86k41l02r2N7J02l33k02Q76l91n07O51
2087C5k3j39K43Q2K42l63o6M05k78k87N97m00l23M78m12l17K07J82ok26K05J92
2109B8l39J67O12m56K05K87m39L3J80k87K18r5J9m1o78L95L74q29L85L96k29k49
2131c43J21L48J32n47K90O80n33n3R1j34L74k87n89O44L5o69j11L80K59l72l67
2152f51Q77J59q51K59M88j1o3j80L48J44n77M4L26k71m9j72n9L95o34k47Q40j62
2174d7l29J63K88J77m00r1P87j43n43M56q0j67N2k74L27J09n93Q8J43k47K41k77
$$ y = [162, 173, 253, -30, 358, 548, -181, 123, 488, -11, -324, -342, -88, -110, -766, -37, 200, -716, -270, 90, -13, 131, 153, 307, 550, -45, 46, 395, 113, 215, 113, -274, 401, 15, -757, 12, 222, -308, -538, -212, 174, -207, -615, 318, 430, -157, 274, 376, 172, 255, -106, 31, 417, 176, -126, -218, -161, -59, -392, -594, 282, -109, -616, 35, 12, -127, 116, 198, 440, 77, 11, 416, 138, -149, 448, 48, -275, 203, -209, -526, -319, -137, -143, -369, -164, 28, -311, -144, 468, 12, 217, 504, 65, 98, 278, -9, 209, 114, 133, 92, -586, -191, 183, -646, -261, 135, -94, -343, -222, 126, 258, -289, 1, 681, 148, 95, 186, 52, 426, 139, -450, 194, 229, -440, -551, -171, 88, -284, -651, 226, 385, -466, -207, 281, 270, 207, 27, 375, 519, -58, -14, 312, 41, -8, -180, -239, 156, -478, -725, 115, -47, -376, -213, 75, 252, -148, -239, 548, 405, -138, 318, 238, 71, 123, -151, 176, 285, -308, -220, -77, -324, -83, -360]
2196c60K59L50m57j74O91j43j83L18q2K67l48j80L03l02r9L93m71O7J77m05N5
2217c24J36n8J84l4n9M64l62ON92l97K55j27m20N67j70m76K02l0o1k0l91M45J35
2240E7o56M13M33l66J18j15K72K25m11J49M01l84K0j3k36L53m94j83N55j77m46
2261d85J99J95J01l55R8N74m0p14O77J69j73n9j08L85o8p25K97K58l94j62m4K74
2283a00J48o37J62O71k59k32L13P2J98k84k30Q45l11n23M68j98k9j42k50L03K9
2304A4n72L55J36j90J43j74K80K31l83K01L58k84M6j2lJ98m06j15M24m02lJ48
2326a0k88O5J61l34M00r4j46L54j07J56J06k61J41L15l77J44j58j41K98l37k08
2347c21K46Nk02N2j59L51K3m82O93Rk23K21j11K09Q9m85K25K14m40M1M2j46K35
$$ y = [-360, -101, 249, -208, -382, 309, 166, -17, 301, 219, 486, 138, -42, 261, -41, -140, 253, -218, -151, 26, -379, -324, -188, -246, -62, -96, -155, 309, -53, -47, 545, 148, 403, 276, -144, 423, 253, -223, -21, -51, -112, -132, -523, -78, 57, -599, -186, 247, -119, -1, -116, 156, 381, -30, 119, 520, 136, 156, 143, -93, 260, -234, -417, 138, -39, -485, -286, -91, 10, -345, -247, 327, 287, -427, 250, 419, 246, 187, 79, 464, 396, -329, -32, 226, -168, -330, -374, -100, 48, -589, -427, 244, -15, -247, 66, 138, 336, 52, -178, 667, 356, -167, 301, 103, 74, -68, -318, -15, 14, -558, -203, -67, -257, -114, -288, -8, 223, -160, 41, 399, 115, 161, 149, 146, 344, -62, -177, 247, -155, -158, -10, -298, -233, -72, -406, -6, -100, -246, 108, 1, 157, 263, 2, 143, 458, 81, 225, 67, -74, 224, -113, -321, -75, -70, -272, -220, -379, -28, -5, -487, 206, 215, -8, 213, 102, 311, 400, -85, 140, 354, -86, -45, -3, -149, 86]
2370H6m93nN41l37j86M40r0R9k34O9N73j93m09N57j30k20o6j9K53j11n48L37J53
2393F7l28j0O5K07l3m36L15N45m25p2K81J18J05m59J23M56m72l98L62N4p3j50
2415a58j09J70M3m04L49J64j46N9j07K91Q8m19M47J52l27N6k7j13J65m03J95J32
2437I8l44R1ok38M12j73l8L91p7k61L88j25J88n9k74K75P7m98K10j19j52K61k95
2460b68j03L94k93l9J83o5L92k72j17N39m3l82K49O0k5j58j90K37k9l63J75l9
2482a57J51m1m57K67M11l68m7M09j12J36k28K21M07m48j60M51l97j90J19nJ17
2503G9k40j94L65m8l47K48j29L07N1k87K74L47m92O8L35j3k12j78J69J70n51N0
2525b28M08l76N1J4j48J74K6j22K87J61q4Lk98N17j12m51M26J75n41K11p5j05
$$ y = [86, -407, -412, 129, -208, -394, 46, -44, 55, -179, -110, 463, 270, -139, 418, 288, 68, 2, -17, 236, 125, -423, -86, 67, -261, -271, -206, 1, -32, -468, -153, 392, -33, -105, 176, 294, 399, -60, 63, 519, 47, -351, 11, 65, -8, -158, -267, -97, -54, -458, -109, 55, -91, -32, -139, 152, 240, -179, 268, 420, 93, 149, 122, 9, 174, -229, -34, 98, -246, -155, -161, -399, 13, -160, -198, 193, 116, -145, 243, 118, 306, 247, -27, 248, 325, -173, 37, -82, -234, 27, -268, -371, 23, -270, -309, -126, -191, 201, -71, -188, 351, 308, -74, 175, 235, 210, 52, -138, 99, 70, -293, -118, -157, -6, -47, -504, -237, 174, -194, -241, 168, 56, 192, -36, 185, 592, 144, -16, 435, 38, -152, -33, -38, 79, -161, -355, 10, -38, -385, -137, -266, 41, 92, -195, 79, 426, -66, 2, 337, 324, 112, -66, 103, 273, -278, -228, 180, -196, -145, -131, -279, -105, -79, -201, 86, 247, 163, 166, -132, 385, 273, -178, 248, 423, -118, 93, 18, -87]
2547h7p2r7K37lk24J76n7k34M62p3j50L89j69j0p9J75N6k6l02L75k59l61N10m02
2571b25p0L47k15m2L1o6R7Q8J16L23m01K2N80m19k66M34j09j30Kk21K34k59l38
2594d87M18q1m7J91m08L32K52k99O3K82R6j31l36L54K47o47K19M24n09j25K17
2615B5j23j65J23j09J41O6k15K12P2K04n2m23M80J83n32J69K04j39j07q0N9J38
2637A31n74Q8M45l72J24J97j70L02l03k5K30M5k7o2m8L24k12l09L91l9l45J34
2659g5O8j84m9k1J86K1j91K71m5j40L18n7r2K61j34j61K19p6Q1k25l3J54j34k11
2683b49K62k92P3J94m9r5K26k22J49J97k5J24l12L1L28l57k04L74l6p8j27p7J17
2706d8k28J07J51q8P4Ok29L76J08l42K63R1n6o2j66K99p9m15J65K14l37m3J42
$$ y = [-87, -159, -256, -19, -22, -246, -70, -127, -361, 101, 28, -122, 267, 98, 88, 9, 184, 240, 214, -88, 287, 28, -333, 177, -225, -295, 52, -163, -205, -174, -240, -143, -55, 61, 384, -17, 5, 585, 166, -100, 334, 225, 95, 97, -124, 110, -149, -487, -69, -150, -197, -6, -414, -82, 170, -129, -66, 216, 312, 181, -155, 199, 446, -201, 18, 442, -67, -192, 25, -98, -263, -140, -249, -108, -42, -257, -45, 27, 231, 179, -244, 236, 419, -113, 56, 260, 121, 14, -66, -7, 131, -443, -355, 90, -282, -158, 39, -131, 171, -132, -157, 73, 118, 91, 29, -19, 305, 93, -216, 175, 136, -209, -75, -7, -191, -240, -261, -75, -54, -245, 26, -19, -159, 159, 102, 10, 271, 137, -24, 195, 119, 200, -25, -58, 96, -38, -249, 13, -279, -206, -12, -61, -156, 70, -152, -3, 194, 169, 293, -19, 12, 340, -17, -221, 153, 117, 39, -88, -165, -48, -276, -169, -18, -106, -32, -26, -255, 121, 229, -113, 150, 241, 185, 123, -43, 256, 177, -238, -73, 141, -196, -239, -97]
2729i7L4k6j15J57L8N2j23J78K4Q7j00k90N85k30l87L39Q3k23p4r7K82j15m17
2752d35K99J48j70M4j1J62K50l48l9M67l36qJ05j09J68k15j08K72k39j01K07j94
2774a91J0J06j25J91J9k20L05J00r8N9j19R4Q2k39j4K13k30O4j22j24K44j79j11
2797b85J67n5J21L7k16L74j4j5R8l3j96J90j36L3J19k99P5K3l6L2j26o7K33j14
2821i0o1J09k5J45L5o7K49j92j80L72j83mj71k1J54r4l05L39L2l28J72K2j7J10
2845Aj26J41K47k27l7K69j04r2J3pL13l69k56L73m8k28o6p1M08k22k23M17o5j31
2869i0J17M5Q2m3k22L25R4k10k11J41j08O9j84o8L49l24N3J63j85K8J66q0J66
2892G3j62J6K16o6k2J61j90R8l5k28J71J66l94J04L4j00J16k20J56K18j43o7J12
$$ y = [-97, -63, -89, -204, -47, -9, 43, -80, 98, 122, 209, 109, -181, 404, 174, -213, 126, 209, -14, -88, -185, 97, -18, -435, -136, 12, -158, -114, -125, 37, 287, -61, -100, 367, 31, 23, 128, 19, 187, -28, -136, 136, -103, -204, 3, -191, -181, -75, -200, -9, 10, -210, 95, 195, 97, 156, 37, 131, 213, -26, -40, 173, -57, 7, -115, -239, 5, -174, -285, -118, -173, -52, -15, -231, 143, 129, 114, 212, 179, -17, 173, 37, 70, 189, -110, -35, -12, -48, -16, -142, -209, 24, -90, -151, -42, -67, 78, 113, 46, 295, 103, -77, 295, 112, 108, -63, -84, 70, -24, -329, 10, 42, -286, -114, -92, -109, 1, -125, 16, 263, 36, -1, 268, 164, 72, 85, 78, 391, 22, -234, 139, 91, -137, -203, -274, 134, -88, -311, 106, 41, -90, 27, 72, 154, 111, -111, 214, 308, 98, -113, 28, -80, -11, -195, -263, 86, -238, -185, -22, -207, -179, -13, -93, 73, -89, -73, 143, 77, 55, 216, 26, 124, 89, -139, 32, 198, -196, -92, -58, -158, -42, -262, -106, 112, -31, -98, 14]
2915A4n2J97r9q1K37l4j84J26k23J16k1q6L3%j06R6j57J21J19r3N6J13pK9M4j21
2941C7K02j42j50L51l35P4l4j25P6J1k57K71M4k62K10J9m6J74j65J76N9k21J08
2964G5J9o0N3p5j95L41l08j24L34j91j35K39J0N8k60J03K53p2n6J62r9M6q5p8
2988d5J28K5r3m1L0m7K5j73J67J03k91l4K11N0l4o6J01K07j80o5L40l11J14R8
3012B19l36K26r7j23L9OkJ5j94K54n0q2K12rj19J11P3q7l4J68k46J23o2k3Nj59
3038a72L46k27j31J45Q7k58P3N8P9l3m5J69L5j13J37O5j70J35j19j02R9j11km
3062e9M5N4k49m3L42k10j60M94kk17o1R8J4O7r1P0Q5j94M1j86K6K71l37R1K32
3087A21k36q8J03J80m6j99J56K79k82M6R1P2p7N5j79K4N4l30K02k3L3k2j03J78
$$ y = [14, -38, 159, 60, -21, 216, 182, -2, 124, -99, 17, -4, -90, -57, -57, -163, -67, -224, -103, 16, -77, -21, 92, 85, 114, 158, 37, 239, 97, -53, 298, -37, 37, 3, -122, -46, -35, -292, -21, 23, -239, -29, -10, -56, 118, -47, 129, 188, -33, 75, 94, 34, 87, 12, -183, 158, -150, -274, 60, -131, -266, -27, -17, 41, -219, -116, 137, 65, 9, 171, 72, 118, 33, -45, 83, 108, 15, -26, 4, -43, -18, -191, -24, 79, -212, -246, -35, 15, -19, -85, 16, 223, 43, -22, 318, 7, 121, 219, -117, 109, 12, -111, -72, -66, -68, -53, -247, 7, -43, -125, 87, 78, -41, 70, 143, 56, 22, 190, -56, 67, 5, -18, -13, -172, 174, -53, -184, -39, 48, -210, -137, -79, 0, -33, -78, 91, 126, 13, 150, 215, 45, 180, 61, -41, 58, -53, -55, -59, -14, 40, -209, -252, 90, -120, -280, 214, 212, -5, -66, 32, 46, 113, 22, 92, 177, -17, 24, -162, -136, 135, -202, -111, 121, -115, -203, -100, 80, 34, -165, -9, 270, -12, 34, 125, 197, 120, 175, -4, 20, 74, -256, -54, -77, -44, -66, -169, 9]
3111IN5k57K34J36p1j08J82l5K4j98L6J74l16J33N1k21J50M2k19J60L7o8p4J05
3135c9J34r7r9J94J45k63J41j77M9N5k5O2j25j05J34r9j2J00lj14J48L7k55L11
3159I7JLk6OJ86j65k06L09j18rk9j6j30J77k35k9J37R0j22j02J10K51k84mM15
3184C07k45L6K6p7L5q6n2K36r8j34N5j18L4J83l90K91J57k42n8J68k0J56j98Q7
3208E3J48j87j2K18j76j09P1j40L6J7j32P0R5q8J63k25K58l8j09J92J68l08J59
3231A24j9O7ol10K42L3k31J99r2j19O4K2j98K47p7MN2J2K8O9j26J49L8m2n1O3
3257A42m1p0o5JR4k47N2K7j47K58j41N6J26K9j03J11r2J33q1m0P3M7k02J22o1
3282a9q1J14k11K33o9j49J65oj13K44j59J63L7k74R1J46j32O9j3OJ10j45o5J65
$$ y = [9, 64, -193, 41, 177, 106, -2, 180, 145, 169, -29, 7, 181, -135, -2, 49, -172, -22, 20, -199, -39, -2, -70, -144, -39, 95, -2, -101, 93, 238, -25, 116, -61, -12, 43, 18, 80, -45, -150, -16, -115, -127, -27, -30, -144, 4, 41, -214, 97, 98, 101, 75, 81, 267, 102, -104, 205, 87, 78, 49, 33, -97, 80, -155, -184, -47, 43, -79, -181, -71, 180, -104, -108, 307, 62, 98, 124, 47, 82, -4, -56, 180, 82, -52, 3, -115, -81, 102, -288, 3, 160, -82, -140, 28, 8, 164, -34, 53, 201, 14, 2, 220, 44, -65, 6, -134, -98, -81, -213, -143, -48, -136, 27, -198, 60, 22, -87, 105, 273, -35, 124, 105, 172, 166, -144, 98, 131, -100, 99, 7, -112, -48, -26, -224, 23, -54, -50, 2, 14, 42, 111, -15, 134, 172, 130, 79, 142, 101, 31, -34, -33, 61, -186, -134, -107, -254, 4, -137, -81, 45, 74, -29, 82, -10, 123, 42, 2, 75, 122, -80, 42, -19, -100, 14, -197, 36, -33, -182, -17, -23, -136, 108, -51, 112, 149, -125, -34, 112, -20, 49, 36, 42, 152, 7, -58, 107]
3306A07p7j23J40j55N5K3k9J74K8k85J66k7J41Lj43O8J43r3j57J47j77L3o4pJ54
3331D5o4j80J56jl9J45j71J99p2m6K12j50q1o9J56K3J7j82J72jk50L0J17Oj5p4
3357a17j5K37j70M7J36m3lj8J2J60j27k15K70j4j63o7m8qJ14j05N9J2nQ9j26J07
3383aJ39j87J80o1N8j9r1O0J26j57p0J6L4p8j5J5pM2J0j9M0j00K16o2m1J95k23
3410@m2K16k61J40J4r2J40k81M2K58l12J12OJ21n9n8q7J83O7k08K11j2j4j7n7
3435A0P4kk35J79m5l3j5L6j48J15j44J24J76p3qm6J83N9j89M6O2lj78J62j61K9
3461b5L9j45Q4j6j01J51p0o9J89q9O6J8n6L6O6o1Q6j20K8J33j90j54L11j90J04
3486B5L0k30K34r8n6K1O5lJ04l2L0n2K0n2R0r0O7j42L1J92l34K5J24q3l8J82j47
$$ y = [107, 30, -93, 47, -108, -53, -30, -59, 115, 143, -142, 24, -3, 138, 141, -2, 66, 209, 116, -41, 106, -71, -38, -102, -109, 45, -19, -199, -43, -44, -83, 62, -109, 90, 18, -28, 184, 34, -47, -116, 40, 63, 80, -102, 70, 69, -181, -151, -34, -28, -43, -117, -132, 105, -65, -18, 118, 75, 72, 54, 66, 226, 99, -116, 154, 140, -23, -90, -138, -146, -32, -137, -78, -66, -71, 18, -108, -1, 138, -49, 131, 70, 128, 109, 18, 78, 204, 47, -23, -7, 27, -51, -66, -51, -58, -16, -6, -25, 15, -85, 131, 69, 28, 223, 0, -42, 174, -87, 53, 67, -25, 115, -166, -124, 134, -178, -66, -60, 61, 2, -56, -143, 40, 107, -101, 110, 98, 84, 67, 10, 84, 82, -153, 26, -19, -52, -67, -31, -179, -64, -208, -84, 92, 19, 11, -35, 148, 207, 18, 64, 126, 123, -55, 107, -54, -25, 14, -131, -47, -63, -164, -13, -83, -152, 37, -52, 14, 32, -24, 12, 78, 17, 103, -17, 11, 144, -46, -200, 111, -79, 25, 55, -175, 59, -39, -95, -74, -9, -12, 92, 60, 90, 38, 58, 6, 96, 6, 73, -69, -38, 154, -180, -155, -31, -114, -152, 30, -117]
3513a17m4J33pM3m8k7Q2j17K47n9p1J25j2j44J5Q4j54P4q7l0R0r3M1O9j58J63
3539bj2m4K51j50l6R8k0Qj68o4K80j76j95K54o7p1R7q5J20kj81J60J21m6k2N8
3565A06q1N4o2j53K89k04QK3J2L5k6p1P7j79L3J37j23P2J44j14J24N2j77N7PJ5
3591E5M7j71Q5J94k97K1O2qj14P0O5N2n4r9J65K7j30P9j53J94j3j15R9Pk5j54
3617a11L6k7R5j01J51j37o4J82oj58K34j00R1J39k12nK1m2J26p2n3J25n8j24p1
3642a41J41j14R6P7o4O9Mk5m8P5j2o1K1J15p7k9O3j59J91j80q5J96j41n3K11j17
3668d7m8O1MQ7j9m3J20k9k01J55PM8j86n1J30J4n9m2J54j07N4m6P4l9J03j90J87
3695I1j04OO9n8m9J15j29J20J4r3Q2m7k2p5RQ1J4K2l6N0JkJ7j09R7j41J77j40
$$ y = [-117, -161, -28, -35, 8, -40, -67, 15, -102, 145, 86, 15, 140, 128, -16, -1, 83, -71, 3, -84, -114, -24, -117, -76, -7, -165, -2, -14, -58, 193, 43, 7, 105, 85, 93, -75, -139, 141, -35, -230, 24, -43, -114, -17, -102, 18, 16, -165, -5, 116, 70, 48, 106, 25, 79, 17, -136, 153, -51, -43, -20, -8, 27, 1, -70, 7, -172, -139, -2, -125, -53, 91, -23, 101, 153, -24, 33, 40, 55, 102, -69, 16, 210, -87, -66, -4, -12, -126, -56, 9, 61, 7, -92, 73, 100, -30, 49, -104, 90, 77, -38, 61, 68, 43, -111, -75, -102, -7, -108, 43, -94, -158, 24, 18, -140, 94, -6, 85, 224, 12, 7, 28, -14, 112, 40, -13, 112, 54, -70, -141, 0, -114, -18, 59, -5, 64, 68, 43, -5, 70, 58, -3, 18, 133, 56, 27, 90, -69, 122, -58, -143, 53, -88, -141, 70, -47, -95, -34, -30, 57, 38, -5, 115, 86, -115, 40, 47, 95, -91, -142, -12, 2, -57, -99, 55, -52, 2, -44, 30, -9, 94, -96, 91, -13, -7, 62, 4, -45, 70, -59, 61, 75, -18, 64, 17, -5, -80, -71, 10, 24, 46, 10, 60, 61, 59, 76, -33, 64, -77, 100, -40]
3723d0M1K6mj00O5J3j33KR1J8J7j15J42L0j54P3J35r2R0Oq2N4j12nm4nl5J28n1
3752d1L0j2r7N8kJ8L3j3O6j21l2J20Jj4J18j07m5P0k7L5J19j57j8q7LJ20k57J65
3780g4L5O4M2m0J6M1m1k7L7k2m4Q8l3J4j45NO8l2k9J5N8o0J32n3n4M9j13kJ45
3809D0j01R2N8j47O2n3l1J42r9J18j07o8J26m6Nr6J47l2k0q9J14J05j98M5K41
3834B08k54j5K56j77k%j2M5n1L4p2mm1J71j91N0O6j34N2O2J0N0N1k3n2q2O7K8
3862D0o8N7q0L8O9k8k1J1N7j12M4j1O4r4j3R3K9p6J30j19K3p1l7L6L2j18J88n
3890E8j15R5q9O5k3K4q9J17j15M5M5kN2r1n6J79l3p7l9j44K35N3j84R6L4K5o1
3917EML9K2o5M6O0j2j6M9n1l0p9j6R0K2j04J70j12p5N5P0J0j04l7Q1k3J3m0M5
$$ y = [-40, 1, 27, 23, -77, -12, 1, -132, -130, -39, -21, -4, -119, 23, 53, -101, -28, 107, 15, 105, 111, 29, 83, -29, -34, -78, -83, -118, 10, -41, -11, -23, -120, -62, -64, -46, -13, -26, 40, -81, -113, 7, 8, -6, 112, 5, -40, 30, 3, 38, 157, 0, -18, -105, -102, 18, -239, -74, -39, 25, 67, 27, 43, 84, 43, 16, 53, 31, -13, 75, 42, 56, -89, -84, -16, -48, -77, -62, -4, -64, 68, 15, -39, 10, -103, -105, 40, -61, 31, 89, -58, 4, -49, -80, 62, -37, 81, -26, -94, 32, -14, -9, -105, 42, 10, -10, -99, 15, 120, -78, -33, 208, -46, -61, 195, 18, 16, 16, 4, 49, -2, 32, -40, -44, -85, 86, -105, -55, 11, -123, -71, -9, 1, 51, 102, 79, 27, -55, 12, 40, -28, 29, -51, -13, 56, 28, 7, 18, 75, -37, 7, -4, 60, -34, -47, 46, 75, -1, 129, 10, 33, -38, -75, -39, -7, -125, 63, 58, -57, 38, -51, 14, -9, 15, -74, 43, -72, -27, 18, 16, 68, -23, -79, 100, 67, -10, -49, -193, 42, 95, -89, 7, 41, 66, 5, 9, 48, 70, 5, 51, 111, 99, 83, 132, 81, 51, -28, -44, 46, 68, -36, 134, 22, -53, 2, 72, 82, -22, -59, 22, -1, 12, -28, 17]
3946A7O8L8j76k6J03m7N1p7N9O6j9j74J29n6J02j19P1l0J0Qj4qJ9N5l3M4j0K4
3974G5j12J22j27JN3q3M7j21MK28j26j8J74q9J5r0O7o4J15l5M4Ok9k5k01J02k1
4001h8J8M3m0P9n8j4J83o8q8N1LL1Mj1ll9k9K3r1o1K21p4k9rL8%J16o0j32J83
4031I9j01O7k4r1K04q9j66P4N9j3k4M4j46J45j11j5J46Qk6j18M6O6J2o9OO9j9
4058C3M3l4n6O0j11J07l7J42j25j16J07l8O8j1j6l6K3N0j31P8M3K3J2l2M6n2j6
4085B4J0j28J37o2q6O2Q0K0M4m7j44J47J6m5k5LqQ8j46j1P5j27J36o5lJ9m9MJ05
4114B4m6Qj00M5O0M9M5J8j16jO8L7m9n3j6L8K8j57P0JKl0O3p9J80j17J18l8J28
4143A80k59J07n8l5M6Q4l6J4n8m4L6j14J61j36jJ62j19Q2m8Q9j22R4l9M5j18j5
$$ y = [17, 85, 123, -53, -79, 24, -23, 28, -49, 10, 76, 57, -117, 12, -44, 58, -61, 10, -20, -10, -2, -16, -24, -5, 50, 17, 61, 51, 75, -37, 85, -42, -41, 12, -71, -24, -145, -141, 87, -39, -57, 117, 28, 43, -47, 20, -44, 71, 36, 80, 86, 57, 32, -169, -67, -88, -70, -27, -67, 12, -46, -60, 123, 55, -33, 18, 21, 52, 56, 45, 42, 3, -26, -3, -94, -155, 66, -8, -37, -46, -8, -8, 108, 48, -84, 99, -2, 65, 41, -50, 154, 65, -101, -27, 32, 19, -5, 39, -107, 38, -73, -88, 58, 66, 40, -78, -32, 34, 46, -23, -17, 52, 33, 76, 42, -14, 46, -65, 42, 5, 147, 22, -94, 13, -25, 43, 32, 16, -20, 3, 53, -78, 0, 43, 66, 78, 46, 92, 40, 24, 34, -94, 43, -19, -105, -43, 37, 57, 101, 54, -90, 57, 73, 28, 3, 6, -2, 86, -60, -71, 4, -123, 13, -52, -55, -36, -85, -81, 24, -22, -14, -114, -69, -9, 40, 85, 103, -13, -14, 54, 91, 42, -11, -27, 11, 39, -118, -48, -47, -45, -75, -12, -91, 89, -28, 90, 52, 180, -79, 28, -30, -65, -19, 65, 29, 43, -15, -59, -23, -137, 24, -112, -113, 49, -70, 12, -36, 53, -69, 25, -14, 31, -87, -102]
4169a02J25j0K2n1qJ2Ol3M9L5n9J56j14m0M3J3j16R3J2L6m6pL0o1O6kr2N8m3o1
4199h9n0J18NK6L6j07O9m9J01n0r5L3M4Km0N5J19k2p1L3M8j97J17p0K8k1m0P6
4227IJ33j35m7K9K0qk8J08k1r2pQ4j42J45m5J32j59Nk3K9r3J4J01K8q9N2Q9j36
4255d7Q7K7m1l5n7Q1K5k59K77o1k1M6M2j52R8q2Q9%m2K6p5J68r8M5o4J29j09l4
4283c7J68j65N6j11M8KK9k4O3p0R2k2l9J17kj95J70j2r8J9R4q1k8LL2N8j24J28
4311G1oq6J64j26N5j52Q2J3p5O2P3r8k3O0n3J22r1k0l6J42j48M0J07m8o7p6Q7
4338b7J5m9K02j58J8r6O1PR2l6o9R7j18O5J35k10P8j3k5o3J08j24J14L7k13K72
4364A00p0j26J78m4o2j4N1n5K03k07P1q6N0J1O2j25MP3J18M4l09K16n3q3K9R6
$$ y = [-102, 23, 13, 35, -16, -24, -12, -6, -39, 10, 45, -14, 142, 28, -12, 31, 44, -72, 21, 33, 69, 23, 16, 46, -15, 51, 49, -43, 15, -28, -89, -139, -21, -16, 10, 46, -61, 8, -41, 60, 10, -85, -52, -8, -6, -46, 9, 128, 106, 35, 68, 116, -81, 36, -34, -6, -27, -67, 9, 142, 7, -40, -11, 9, 1, -27, 81, 60, -32, -39, 45, -97, 48, 3, 135, -24, -19, -42, -13, -106, -92, 9, 37, -52, 0, 89, -47, 40, 67, 26, -9, -66, 15, 40, -219, 58, -3, -24, 22, 64, -88, 10, -72, 17, 17, -25, 1, -74, 94, -4, 41, -23, 106, -3, -37, 131, -34, 22, -89, -41, -39, -10, -34, 29, -41, 51, 29, -10, 107, 105, -90, 80, 68, -30, -11, 83, 2, -26, -23, 9, 67, -57, 71, 65, -21, 143, 17, 72, -80, 2, 15, -60, 2, 75, -23, -46, 14, -39, 83, -8, -28, -64, 78, -70, -30, 77, 29, -38, -114, -27, -12, -61, 141, -17, 1, -95, -34, -27, 65, 29, -40, 57, -61, 4, 139, -71, 7, -6, -31, -94, 14, -110, 4, 41, -172, 100, 30, -96, 82, 38, -24, -38, 13, -42, 161, -46, 25, -61, -11, 0, 62, -63, -59, 14, 132, 176, -133, 83, 30, -53, -24, 72]
4390G2l2j4k1qJ4K2l7l2J18m4p0J1j6qR6Ro2J0k4n2J55n2r8J14q2P0oo3r0J11
4420io3K1J1K1J62j93kM9n0n9O1M9LL4k4L9n6m9J02l8j1J9J0l8N6n7J2J64j80
4449a6J12p7r1rP5J8O1Kk20K58j69RmJ87j21j01J41j02R4j42lJ52K0j40J10r0
4475d6P5Qj9k2o7O2m2J48q9o3m2J25pm1nJ2P1r7M8K8k1%k3R9k3j11R1Kj07O3K4
4506C1Q1r4l2Ok3J9Q5j6O7j99J90j19R9j16OQ6j03k8Q5j21J15J3p1L3qP8j88J82
4534E8n7pj6m2J29r0M8p3J13P5j63L1j2L3J2l3j3J2LO0r4M3k8Kj4l6J38j11N6
4563B4j6j7o5J08O4j30J16k9Mq6O8N4o0pPkk8roN2j10M5J4J4j57J54m8N4J3P2
4593I3j73J52q3p3K35j84j1P1nPJn3j1K1J42j04j1J3k3J12k3j70J42n9nP3r0L8
$$ y = [72, 40, 26, 5, -3, 11, 33, -4, -36, 82, 38, -32, -21, -37, -45, 51, 60, -2, 8, -16, -68, 87, 35, -63, 51, -31, 39, 33, -30, -120, -9, -72, -51, -40, -19, 143, -50, -52, -3, -53, -112, -51, -2, 1, 35, 11, 50, -6, -55, 47, 9, -2, 17, 27, -11, 45, -12, 0, 164, -16, 96, 19, -72, -81, -6, 12, 73, 75, -145, 113, -56, -47, -51, 136, 15, -86, 55, -47, 47, -95, -98, 54, 74, -66, 44, -46, 29, 37, 18, -4, -71, -9, -51, 97, 8, -55, -97, 28, 21, -20, -25, -13, 58, -39, 9, 37, 16, 16, -7, 92, 69, -42, 49, 51, -56, 7, 31, 112, 18, -14, -8, -31, -12, 73, 57, 124, -75, 115, -4, 95, -21, -15, 71, -32, -60, 25, -96, 19, 32, -39, -6, -14, 64, -124, 58, 1, -6, -22, -64, 65, -25, 23, -50, 63, 138, -25, 6, -6, 27, 39, 6, -7, 5, 8, 68, -26, 17, -11, -9, -23, -59, 79, -32, 24, 8, -9, -74, 34, 98, -32, 84, 55, 59, -27, 41, 95, 35, 28, 35, 33, 5, -4, -10, 42, -68, -23, -9, 5, -152, 2, -46, 8, 21, 93, -80, 72, -11, -84, 151, -33, -44, 27, 22, 29, 30, -23, -34, -13, 129, 25, 14, 27, 4, 116, 93, -77, 65, 6, 1, 74, -16, 22]
4621B2K5o9P4q3J40o4l7Kr2KJ90j19LM3j2j6n3P9p1M4k9R4Qj97J14kj3l3Q9j04
4651f5Q6N7p6N4q8J5l2J48j05l5O1k6O8j36P2p4J40q9N5k7j8k7P2p4L3Op0NO5
4680eO5j20M5NJ21l5j63J72o1p2J9n9R0j1o2P4J0l0n3J17r7J59j34rlo9J50J5
4708E9m5M6p7J55k02O8k3L3J1MK6m2mJ5m1J18p6n5r8J53L2m7Pm8J4L6J2n3J22
4737A00j7j59P9j4NK9k1O9m3J3L0q1m1L5Q4l7pk0P5q4N1q3j8R1k2P3l4r8L0P2
4767E7p5P7o9K9M2p1L2j03J89l7Jk9Nm3j1J2m8Q7l7L1j03N4p8J14j00mM2kK8k3
4797c3m4R4R1p2N1l5L1J3r7o9P6j1j06P3Qk6oP3m0K5N6k3k5M7j6j17P0k3J33l6
4827F2n3J1l7L0j17L8J63k0j62M3K9l0J60k48O0M5j6L7J13p7J9q6K9M8j6L8j09
$$ y = [22, 47, -22, 52, -31, 109, 45, 8, 10, -82, -80, 110, -9, -6, 37, 25, 9, -44, 35, -36, 8, -21, 73, 81, -116, -2, -4, -17, -50, 39, -65, 21, 78, 2, 56, -32, -17, -49, 99, -6, -41, 20, -6, 62, -74, -2, -76, 64, -25, 30, 3, -15, -42, 30, -44, -11, -5, -75, -70, -5, 60, -60, -15, -10, 111, 76, -87, 85, 24, -48, -29, -88, 2, -9, -71, 3, 13, -17, -70, 47, -50, 109, -25, -34, -37, -106, 44, 59, 14, 60, -17, 138, -64, 4, -19, 14, 25, 29, 55, 13, 9, 24, -17, 101, 25, -30, -128, 25, 57, 10, 17, -31, -17, 19, 31, -22, 100, 83, -76, 3, -11, -6, 23, 2, 71, 28, 41, 71, -10, -51, -16, 68, 31, 24, 4, 79, -5, 46, -37, -55, 36, 14, 87, 53, -45, -15, 57, -18, 59, -10, 19, 61, -10, 22, -81, 108, 71, 72, 43, 48, 5, -6, 6, -42, 45, 8, 39, -64, -10, -88, 26, -74, -78, -36, -38, -10, -33, -77, 17, 108, 36, 87, 52, 83, 96, -1, -70, 6, -5, -111, -38, -30, -56, -62, 11, -29, -4, 52, 29, 4, 51, 35, -82, -12, -35, 98, 62, 9, 20, -17, 13, -104, -66, 97, 77, -85, -42, -13, -43, 117, -131, -71, -26, -42, -5, 108, 31, 50, -36, -7, 41, 25, 63, -46]
4854d6N1P1o9qq0J05n0m1J9Q1r1J60n0l6K1l6n2J53m4n3o0J4jR4j62O5N7j7M8
4883D3o3N5o4J02j19K03j93L7q0o2J54j11J65l3l8L5l6J1m1L9r1O9L6m0j5m1J64
4910H6r5JQ0J5Lj49N4m6O1j13P4J08k1j05Q4j42J78j08oJ11mqk2j44J77K6r5k7
4938b7o5J87j80O7p0Q4RJ0M4j09nk2J84j55O1J4l1O5r7N5j00Q6K0l2l1L9Q8r0
4966aK1k8qq4O8LO9j52O7O4Rj11N3nrP2k1M4o5n0M4O5j30KJ19N3r1m7J26K7q7
4997A7K3l7q7P8J0l7J1J2n5N1J32j93J77j31J22p8p5M8k2Q8q9j0K8l3R4r8j4R8
5025C0k2p2J46M1moj98K2J22p1K7j26J82p9o3Q3nm0K3j5J04j21N2J06j42PLj33
5053a49J95j74O9K1lJ22j32K04j56Q0j68J02nL7j4J54j44j6R0n7l9K8m3m8J5N9
$$ y = [-46, 5, 76, 7, -1, -81, 24, -26, -67, -48, 33, -58, 102, 52, 16, 37, 1, -51, 102, 58, 5, -55, -41, -42, 52, -110, -45, 12, -5, 43, -20, 35, -29, 73, -46, 157, -36, 1, -79, -141, 13, -98, 67, 34, -4, 31, -5, 6, -35, 4, -87, -18, 18, -22, -37, -78, 86, -9, -8, 72, 87, 90, -59, -5, -51, 10, -103, -29, 79, 58, -47, 37, -105, 73, -35, -41, 70, 66, 58, 36, -108, 69, 95, 0, -27, -92, 95, -85, -18, -88, -4, 5, 15, 59, -50, -55, -77, 107, -48, 13, 27, -4, 61, -36, 19, -81, 5, 25, -7, -38, 1, 89, -1, 20, -8, -16, -100, -32, -29, 40, -112, -45, 19, 28, -83, -30, -35, -44, 28, 7, 51, -14, -64, -20, 45, -85, -83, 36, 89, -2, -49, 77, 104, 17, 40, 3, -84, -6, 4, -33, -22, -10, -65, -14, 118, -75, 102, -29, 93, 15, -60, -12, -34, 54, -35, -45, -17, -50, 44, -54, -68, 30, 8, -64, 82, 123, 119, 113, -85, -63, 59, -12, 15, -111, 71, -8, -71, 12, 7, -33, -10, -25, 79, -42, 10, 116, -26, -19, -16, -149, 46, -128, -59, -38, -41, 81, -51, 153, -3, 77, -91, 11, 6, 43, 29, 183, 39, 23, 113, 56, 17, 45, 2, -46, -31, 28]
5079B8q3K6l6J15p0O4o2M0r1P6P6r9q7R0p6J3L4q2P6K1P9j48M8J83j15n6lQL4
5108Cm7j7M9J08j10J54o4o2j9o7J53p3J2q5k4J03l6l2N9j35J18J0k4K3r3L9mJ20
5136E9p3jk6k5J22j23R1m0Qp3P3J05j75J26JL7j07J12j02P1J9o7Nj9k4j1P7P3
5164A13n0o7j9Q1Q1j44O9p7J8O2j60J74p7M6p6K9M3k7N4p1k3N5n8K7j75J33M5
5191Fl9j3J6M7kK4O3o6oLlM1M4j57KJ06K5Mp4Q0r5N0k21J27O8L5j14K2l6lJ25
5222E9l8L6n0j27O7P0l1j7k0n9O7L1j8J9M1j19O5J02p6n0J36n1p6J8o1J59m2n8
5250b3O5n2K6m9L9j16N2J3K1qjR3l3O9j21J9N9q2QJ34q8m9m3L6LJ37n9j1j2l8
5280a1p5J3P2j41OP7J5K04j63q1J16m8N4o3Jj18K3P9lR7j46nJ25l1mm5P2m2p5
$$ y = [28, -55, -29, -65, 50, -20, 44, -18, 22, -69, 7, 83, -16, -103, -13, -89, -76, -42, -124, -48, -27, 52, -96, -48, 135, 20, -36, -39, -31, 3, -44, -61, -12, 96, -14, 140, 76, 14, -5, -72, 81, 8, 20, -65, -89, 14, -22, -54, 5, -130, -12, -2, -26, -3, -96, -57, -61, 59, -14, -15, -41, -66, 56, -67, 24, -16, -8, -81, -8, 97, -78, 48, 49, 86, -21, 91, -11, 60, 79, 12, 17, -2, -26, -37, 40, 113, 63, -4, -23, 58, 139, -5, 64, -13, 5, 67, -93, 81, 4, 50, -26, 3, 46, 19, 73, 2, -21, 34, -24, 3, -172, -39, 6, -33, -46, -30, 17, 15, 39, 102, 36, 30, 33, 30, 71, 115, -42, -40, 66, 91, 95, 21, 101, 6, 56, -165, -38, 30, 65, -49, -27, -63, -66, 59, 21, 57, 7, -120, -53, 17, -14, -31, -51, -110, -43, -12, -30, -11, 30, -89, -24, 78, 2, -48, 88, 37, -39, -21, -82, 77, 35, -23, 42, -10, 16, -33, 6, -110, -58, -45, -24, -32, -33, 60, 27, 96, -25, -6, 53, -29, -21, 113, 25, -24, -67, -31, -28, 109, 50, 39, 27, -11, -86, -73, -1, -142, -136, -59, -44, 160, -3, -84, 32, -16, 38, -25, -24, -142, -119, -40, -43, 54, -92, -97, 28, -3, -7, -52, 20, -22, -97]
5309i7M1Q4l7k6mQ2q0K1on5K0j0J17Q2j24P7j09O1j21R1J7k7l6Q4Lq5M5n4P6N
5339C5PRp3K6p1J57j10J9p5K3rJ71p3J6R6j70J32j38J11j43N9RRN4j61Q6J33j51
5367b2J3Pn6l3N2L9R1j12K9L9r3J8J18qj6o3p4J45l0j22N7l3J17r2o7J21L8j95
5395a32J04PL7Lnmj1OK5l7l2Q1n5M4Q2n1p1P2n6k4J0L4o4N7k3J3N5oo5K7M2m1
5427B2j2k8k2m2L9j7J9M1p5J48j26k4P8lN4o7N2m1P6q2O0l3r6J44p4k5P3r7M1
5456a7J3j07O1R3Q8k02L7JN0n7k4J61p9j19J22j9N9k7Lj05J69p6n1J7L0j39J02
5483a6n5M7N2j33P6O0J4j6j36J20Qk8k6R5j03m4J43p4P0r4M2m3n9%K7K3J14j17
5511e3J64O8L0l20J38K2p9P5r0O9m9k5Q2q4J59k6q6JM9j00M9l8L9M0jr7O9l2L2
$$ y = [-97, -56, 28, -9, -35, -39, 43, -37, -16, -22, -77, -57, -67, 50, 132, 8, 85, -24, 37, -84, 7, 24, -3, -39, 45, 48, -37, 8, -46, 30, 35, 42, 51, -22, 4, -67, 90, -20, -1, -76, -53, -62, 109, 36, 52, 148, -22, 110, -28, 83, -60, -1, 8, 17, 71, -90, -4, 129, -22, -9, -2, -58, -91, -39, 0, 91, -21, 8, 47, -46, -28, 90, 82, 66, 3, -71, 74, 44, -78, -21, -54, 63, -29, -96, 25, 63, -132, -28, -21, 16, 19, 14, 10, -1, 5, 30, -7, -39, 42, -13, 31, 113, 62, -9, 63, 7, -17, -7, 27, -37, 20, -3, 10, 65, 59, -6, 21, 63, 22, 10, -18, -40, -82, -43, -60, -41, 0, -75, 73, -53, -77, 1, -2, 52, -15, 37, -4, 72, -10, 50, 17, -79, 65, -9, -34, 39, -58, -17, -4, -111, -50, 43, 131, -71, -34, -33, 17, -40, -64, 97, 18, -101, 21, 2, 61, 34, 37, -68, 101, 25, -26, -9, 21, -118, -16, -71, -24, 28, -105, -29, 31, 45, 29, -107, 13, 21, -7, -33, 62, -41, -85, 58, -16, 54, -40, 2, -41, -100, -100, -73, -50, 64, -53, 111, 179, 209, -111, 27, 49, -30, 45, -45, 24, -25, -50, 32, -52, 107, 81, -5, -4, 45, -55, -6, -44, -5, 35, 34, -63, 6, -26, 6]
5540FM0j16P6J9o8J2L7j4LK1J1lJ4o0J0j2J22qr8q6N8J08l8j07O3m5P4l6rjrJ9
5572a7K8K4J0Lk8k4J9k2k6Q2k0j17J9J79p4k7n6Q2J6k8Kk3J1Q8j42RM3p5N8R8
5602I2k4j45J63j07o2J45j30M9o8K48j21j00Q3p6j0NM9K1%Lp0J23o3O6j02P7J1
5629E7Oj3j11MP2L5J0L5j27j7K6J02j40L4L0O4l8l2N0lq0K2l3m6J76m7l3O0m0
5658B3Qj21J00M0j31P1N1J5n1l1J7j01J22J4q9J34N4j78R2m4K3K0o7L2mj13Q5
5685b9j23K17n4j5L5L1j10K7J19j25O0j8m8L8j01J61Q2k58Q3N4k9N6o8J1R0j89
5711a03M5J17J3j23O8m0J01j22M9k1K1K5j66J50j03J02Qj43R8L7j0j51J47P1j60
5736i0J01k4Ol4P4N6l9j33P8n4ok7J61j20k1P9o6OP5l4m5PR6j31M9L5k0J02o8
$$ y = [6, 46, -70, 6, 25, -43, -31, 6, -8, -5, 16, 27, 24, 38, -22, -12, -24, 98, 90, -8, -94, -36, 72, 34, -73, -10, -55, 19, -17, -26, -27, -36, -17, 11, 35, 45, 48, 20, -4, 15, -7, -33, 49, 29, -88, -69, 110, 36, 9, -47, 35, 51, 23, 25, 2, 13, 101, -41, -32, 11, -64, -6, 92, 68, -77, 86, -21, -83, 62, -68, -19, -87, 161, 40, -60, 23, -53, -63, -58, -9, 12, 12, 15, -55, 68, 5, 71, -31, 46, 57, 63, 50, -61, -57, 15, 50, 60, 95, -32, -49, -23, 79, -61, -27, 3, 67, 29, -3, 47, 44, -36, -14, -47, -93, 83, 36, 3, 63, 23, 31, -90, 10, 50, -81, -10, 41, 56, 5, -26, -9, -110, 12, 26, -63, 71, 125, -53, 39, -5, 18, 38, -29, 3, -1, -114, -29, -152, 65, 11, -4, 31, 62, -48, -21, 98, -27, 33, 15, -33, 5, -96, 65, 147, -111, -28, 26, -3, 53, -15, -4, 86, -103, -58, 59, 72, -51, 17, -23, 78, -44, 5, -16, 5, 30, -136, 14, -89, 13, 21, -122, -24, 13, 3, -148, -1, 70, -90, 11, -13, -7, -41, 33, 89, 50, -83, -5, -59, -65, -92, 69, -51, -72, 7, -59, -53, 22, -12, -57, -50, 46, -85, -36, -1, -21, 81, 13]
5765A3l8J0J08l4j28L5k9J42l8r6J63j80J35r7rl2R3KP3o1p4M8M1j6Qm4j98J96
5793gl0N7Jr6Q8Mp6J24o3O4m8K8k8j3qq3Q6j05J21mj1p0J04n4J08r3o5R9q6J6
5823d0K2p3J53N0kj66J20j16J52j15l8J47l2j3m6j14J23o9P1o5K4j20J47K3j2
5848A1L8K8j34R1j04K1L8M8m5rJ52j71Mm2P2l6J2J18p5k1J63j54L1N5j74R8l2
5875a7L7p0J24l8N2k1K6q7k2k7P2K4N3j66J05ll6o6N0N3N9jn9J33j39L7rj43M8
5904c1k0K7J6J3l4J8j43J31l6M8j1N6J8jJ1r5N5m6m5J31N2r2l2rP1L3o1M2l7q8
5934e9J94n8L9j06n9N3n3J11j66J96j14P1m2n3N7j28N6N7J2j19K57m3j34J17j81
5959i5J03J2r0J22J8j29j9L3J09o8j56P6J61k15N8L2J07q6J04n6L8m6O4N1o5q3
$$ y = [13, -25, -15, 93, 59, -69, -34, -63, 79, 41, -55, 108, -72, 63, -34, -43, -75, 18, 20, 93, 32, -42, 6, 47, 31, 39, -5, -203, -7, -37, 20, 21, -75, 13, 17, -59, 65, 2, 66, 18, 46, 18, 5, -3, -86, 0, -105, 16, 12, 1, -69, 35, -19, 89, -4, -69, 30, -56, -40, -18, -91, 62, 112, 110, -56, 64, -52, 100, -15, -53, 94, 62, 49, 3, -111, 12, -57, 14, -51, -27, -147, 0, 23, 11, 49, 77, -57, 34, -70, -49, -11, 37, -8, -17, 135, -36, -32, -74, -2, -38, -26, 92, 17, -4, 159, 5, 36, 91, -83, 15, -17, 20, -50, 74, 36, 88, 67, 93, 6, -16, -43, 29, 53, 106, -60, 45, 42, 6, -60, -10, 43, 102, 101, 42, 175, 36, 73, 64, -79, -31, -51, -24, -8, 5, -29, -11, -154, -23, -59, -11, -22, 34, 52, 51, 62, -33, 22, -24, -69, 62, 114, 22, -10, -19, 52, 85, 24, 66, 29, -59, 135, 77, 116, 10, -49, 4, -49, 62, -104, 92, -22, 49, 7, -46, 11, -117, -61, -4, 8, -111, 146, 103, -31, 86, -95, 8, 20, -70, 52, 70, -59, -78, -45, 64, -4, -160, -84, 77, -138, -80, -48, 59, -27, 77, 21, 59, 13, 77, 128, 63, -20]
5985b0O7j09jJ15q0O5j05QR5j2J8O8j72J31p7R3j50N8Q1p6l9O1N8n7Rm5N0pn8
6014c1M0j0K2K3k8j10J50q1m3K55j88Q3L6m4J8lj07J6m3j4k3kJ05jq7k5Q8r2M4
6043e2O4rLN4Pn4q4N9J4J4P2j50L7LP0q1K0l1k9R2L7k03J19L6LNL6j02j06J43
6073a3K1p1q1J66J1k3j28Q1J04j5j13J24j21P2O2o8J00j46L6Q4q2l6l3o0Q1J00
6099E2r9j19J52j4P0o1O1jm5k3m2J4r2J09P5kj15N0J24o5J8O0j06J0n5O8r6k4
6127i6JJ73o8n6L1M8n3J6P3j38R6N1Rl6k03K00P0j22o9R5J1p2Kl3m6M2QJ1J6J07
6157F8o1m8j5J7O8m1o3R6q2R2o2P0j43J00j4J62j29pO7p4j2P4J8mj06J34o4L4
6185G5m6l9J25r6M6r6k2N4q0j2j3P3j7L6L1J2j03K2J44L9j05M1k2M4o8RK0p0k7
$$ y = [-20, 47, -62, -63, 52, -28, 37, -68, -60, 35, 23, 41, 109, -63, 68, -9, 84, -66, -8, 73, -3, -42, 19, 77, 20, 29, -16, 34, 27, -31, 9, -1, 21, 44, 16, -94, 56, -25, -68, 187, -1, 82, 118, 74, 92, 89, -18, -2, -45, -59, -82, -84, 21, 20, -67, -92, -4, -96, -52, 12, 3, 6, 60, 67, 13, -71, -12, 2, 16, 88, -62, -25, -22, 48, -33, -13, -44, -73, 19, 56, -147, -28, 8, 11, 16, 52, -50, -156, -13, 8, -63, -144, 22, 33, 10, -118, -37, 67, 52, -61, 63, -58, 14, 76, 8, 108, -38, -2, 82, 0, -36, -69, -129, -48, 52, -47, -166, -14, -28, 42, -19, 42, 41, -4, -27, -69, -55, -147, -38, 37, 35, -80, -30, 94, 29, 47, 107, 1, 11, -44, 24, -72, -96, -95, 78, 10, -46, -15, 33, -20, -4, 69, -69, 27, 78, 87, 51, -152, 48, 118, -4, -73, 22, 33, -39, -37, -70, -116, -74, -66, -55, -39, 68, 7, -41, -56, -39, 29, -12, -75, 21, -61, 31, -31, 39, -104, -4, -18, 144, 15, 8, 75, 1, -11, 63, 81, 77, -29, 105, 41, 75, 29, -10, 115, 19, 65, -31, -53, 1, -79, -91, -104, -31, -48, -12, 19, 31, -72, -50, 94, 133, 28, 69, 47, 91, 23, 32, 52, -18, -45]
6214d5k5J19j08L9L4K5Op5M0j6R3k8p2n9Q1J1k9k1J46j23O4j85J48M3j70P5m8
6241h0J65j09j5M7J8j14M3Q9j22J24r1KM3m0J58j48K7j09N9j5P0L1q1K2L8onL2
6269C3p3J17o5K4L4j34%P6p3L7M3l3N3Kj01RM7Jm2OK9K09j55j59J13O2nJ8q2k8
6299c7jK0L0R0Oj14ML2q4N6jo7J48j60L1N0J1r8K28j40JR7j31l1J22k4p5Q6p9
6328c0O4p6K5p1J4Q3M4Qj33N5M6j11J78k02M3J30l4L8r2k5j6K3jK7O6j22Q2j03
6356i0M2K3m9L7P5J4l3n1L7J1k2%K8Oo7L7Ko1j04N6L1J1R4J4j28R7o8N5M4j6Q3
6387A08p3l6J41q8n5l9n0J65j33J5mJ89k14K4M6r5R4LL0q7P1l5J2m5pK3j6J53
6415I7o9j25J03l4k6N5j1O9j23J17k8M3k1l2P7o5jJ16j84P1K4q2N0rN1q6j8M4
$$ y = [-45, -70, 49, -59, -20, 14, 39, 45, -30, 10, -6, 87, 59, -13, -72, 9, 20, -9, -30, 116, -7, 57, -128, 20, 63, -107, -32, -80, 85, -24, -39, 8, 26, -88, -45, 44, -78, 46, -45, -43, 0, -40, 118, -30, -3, -112, -53, -68, 2, 33, -48, -26, 12, 6, 1, 33, -40, 77, 12, 36, 70, -64, -64, 12, -61, -24, 19, -14, 39, 41, -60, -51, -4, -3, -45, -39, -10, 199, 44, -115, -2, 60, 55, 73, -9, -37, -38, -18, 12, 102, 108, -6, -2, 30, -54, 2, 1, -66, 82, -78, -47, 3, 14, -84, 144, 4, 5, 102, -29, -60, 62, 38, -37, 49, -30, 34, -42, -17, -88, -74, 9, 53, 61, -72, -17, 29, -82, 96, -106, -63, 67, 33, 71, -21, -46, -62, -39, -40, -13, 53, -69, 13, -90, -48, -25, -74, -37, 38, 52, 19, -32, 5, 16, -6, -6, 22, 28, -39, -2, 0, -61, -165, -109, -78, -67, 27, 41, -87, 10, -58, -3, 41, 25, 108, 35, -1, 140, 52, -3, -42, -92, 73, -60, -45, -49, 140, -74, -50, -4, -99, -5, -2, 28, -59, 12, -23, -11, -56, -63, -40, -56, 97, 28, -97, 6, -28, -54, 1, -10, 59, -64, 53, 25, 68, 47, 15, 92, 27, 26, 142, -42, 29, 53, -29, 21, 12, 63, -23, -41, 3]
6443CJ0Q1j67P9o6J18K0j59J55j95J46o9L2Jon0J04n0Q3m5j64J03J4N1plJ6n6
6471b1M5m7M8o3N4R6j48N3o2jK8Q7j00P2j45J31%M1l8j4m5L4Q4r1N0q2j13J76
6499B9j2o6rQ7m9k2O8n1J00o4m9R3o0J3p2K9J15j58J64j98P4P4j00P9J0ol0k0
6527c1pk2p9J16j2j4O2k2k4R2m3o1N7qJ4J8Lq0P9p3N2M4j80J15k9J22k1o8jp8
6557g9Q3pr9J29jKj1PM4r8l1J11M0q4O1j50P0n0KJPJ07p7J6LK8J7l4n8O4l5kk5
6590d9N6n3J13k0j10J43j15R9j8q6N0LO0p2P5j7rq4Q0j12J31j29L6O2%j36J09
6617GL2L7M0j56M8l1n4J4KP9J3j3P9k8q7J25j26J29j01m6J7N4j09O9Mn4M8l1J3
6646b6R2p8k1J47j85J05l3j14J71k51J26L2M6J6o1K3K8K5QK2rl3m7m7O5N7om0
$$ y = [3, 13, 94, -73, 6, -60, 58, 78, -81, 74, -121, 25, -44, -12, -11, -17, -67, 37, -13, 70, 25, -139, -36, -22, 29, 22, 19, 35, -21, 24, -23, 25, -38, 16, 112, -36, 17, -45, -46, -18, 69, -31, 41, -104, 27, 27, 68, 30, 16, -29, 5, 89, -2, 48, -34, -147, 29, 17, -49, -58, 29, -20, -42, 26, -25, 75, 11, -38, 55, -5, 8, -64, -35, 80, -78, 86, -112, -38, 36, -64, 15, 25, 19, -11, -31, -38, -60, -139, -23, -35, -49, 13, -9, -33, 59, 16, -45, 12, 4, 18, 36, 39, -41, 38, -35, 17, 61, -119, -4, -33, 89, 68, 0, -1, -79, 4, -3, -102, 27, 26, 28, 17, 24, 68, -30, -61, 50, 90, 6, 67, -83, -13, -63, -61, -60, -53, 54, -23, -7, -4, 24, 41, 7, -51, 13, -22, -24, -49, 7, -46, 67, 47, -63, 80, -35, 64, 46, -40, 10, 13, 73, 1, 76, 59, 50, -34, 46, -66, 65, -64, -28, 34, 34, -102, 7, 39, 76, 116, -40, 8, -23, -77, -63, -61, 18, 31, 18, 97, 69, -18, 107, -19, 110, 9, -37, -20, 34, -75, -6, -2, -56, -8, -39, -26, 66, -12, -33, 114, -71, 34, 1, -113, 58, -193, -67, -35, 11, 27, -34, -11, 17, 42, 50, 72, 63, 30, -17, -64, 1, 58, 52, 12]
6674A2RPMn3O5l6m4J7k4O9j4Q2o7j18J09P1r8k6j3N9q6Q5Mj4QJ8n8Q6j51J03R1
6705I7k1o0M4o4N4j51J08m4J7j0j2N8j22J85o5R8p0k7Pj18J35j14J38o2j21J57
6731C7n0J85k11M9M4r3M7l7N8J29j30p8RJ12o2n3O9r4J75m3L6oj30p1J36q8K8
6758c2k1K7n8oJ97n3j26J11k7R9j17r3L9LP2J7L6o6L0J9K7Kr9k1R4j21n2L6K9
6787e4m5P0l8Q9K8r9m2K49k15k0J00j09M2Q5r4M5O8m4j21J18L6j6n6J7J28j43
6813b1l5Q8J2j53J55q1P5n4M9KNj6j09J04P7j99J66j7ko1n9m8Q6L6k2O8P8j42
6841a8qM8j36J06n5K6QP9n5j5Q1R9o8q2k9M1o7R4Q2k18L3O1K4p7J61j51%R5p5
6870a6JQ9P2j41K2p1Qm7J81j13J32q3m1P7j27K3M1j7j5P5p4l4J10k2l1j3J28p7
$$ y = [12, 21, 28, 32, -21, 44, 8, -36, -19, -43, 26, 12, 94, 27, -91, 18, 89, -9, -35, -48, 11, -75, 10, 14, 0, 8, 26, -32, 54, -97, 6, 97, 76, 16, 60, -4, 50, -101, 7, -37, -20, -30, -42, 16, -106, 79, 14, 112, 42, 15, 22, -96, 39, -75, 63, 1, -120, 37, -13, 172, -39, 10, 54, -39, 8, -29, 29, 158, 28, -50, -41, 71, 9, -44, 25, -69, 106, 63, 99, 93, -37, -108, 28, -60, -32, -53, -26, -84, -90, 107, 54, -72, 39, 12, 111, -6, -99, -60, -57, 15, 32, 68, 2, 32, 51, 78, 80, -19, -40, 54, -67, -119, -83, -54, -99, -29, -67, 22, 50, -49, -91, 158, -57, -77, 23, -86, -44, 41, -53, -8, 60, 16, -105, 13, 49, 33, -23, -6, 122, -21, -56, 32, 44, -109, 46, -35, 40, -14, 35, 37, 42, 26, -83, 21, 98, -101, 65, 48, 46, -15, -74, -122, -36, 0, -22, 46, 124, -18, -26, 22, -114, -8, -63, -37, -29, 50, -5, -20, 61, 160, 92, 10, -19, 22, -45, 49, 131, -87, -54, 7, 31, -46, 115, -36, -36, 59, -16, -15, 74, 146, 5, 27, -44, -36, -83, 98, -15, 117, 34, -7, 70, -57, -34, 7, -10, -25, 50, -24, -58, 52, 30, -1, -14, 114, 37]
6898C7K7j01M1K0n6N2l0l9j8K7l4J39j24j4R9l4l7L6O0n5KJ36j56O0j1j51J89
6925F5k08k1J93m8j0q5O2O2l0l4k1R7p9Q8ko5j5J51j41J50j54P5l1o3O6j5p6N1
6953c8K1P7j12L6l7M1j00l3J50j3J10r9P1p7J14j96N5J05j32Q8K5j26m4J62r4
6978d6R2j18M4N7j62K42j81J56j15M4L3J3N1j53O7m2n6J45o4j55J51J6p7J40j21
7003c9K3qN4m0qq3O8j30J73K9o7J0Q3n7n6Q9l1j1m7J54p7n3m0mL0j7NQ9k1m4N2
7034B6k8j4Q4j49R0k9%n5m0J61j13l7L3J23q0n9J00k1M5n5j4NL8P0%k2j58K08
7062A09j68K0n5Q7Mm0L7j0J7m0k5M5Q8j05P7m5n4J09j26K8L9O0q8J00j28J96q8
7089D4o2J5m7rO8M5j04Q0k5j02Q8o1J20n1P7p2M9r6O8P5q8J9j61J62pK5k6m3K5
$$ y = [37, 64, -37, 4, 24, -32, 20, -10, -49, -67, -40, -74, 65, -59, -73, 26, -8, -45, -9, 51, -4, -2, 134, -22, 38, 27, -124, 65, -143, -164, 29, -19, -29, -114, -52, 10, -20, -54, -75, 22, -57, 31, 29, -36, -51, 100, -41, 109, -45, 30, -1, -64, 2, -13, -89, -38, -17, 60, -52, -16, -53, -12, -112, -145, 5, -8, 102, 3, 74, -3, 111, -85, -30, 75, -57, 31, 56, -70, -114, 48, -46, 46, -72, -28, 29, -133, 109, -72, 84, -31, 13, 46, 59, 110, -43, 24, -18, -74, 71, 7, -148, 3, 19, -58, 82, -39, -16, -24, 30, -10, -18, -101, -33, -163, 10, 39, -28, -18, 65, 8, -48, 41, 10, -1, -48, 106, 29, -24, -64, -68, -38, -55, -50, 39, 18, -26, 26, -2, -16, 68, -81, 9, -20, -20, -75, -115, 46, -67, -104, -71, 52, -28, -87, 13, -8, 37, -18, -32, -27, 11, 81, 81, 59, -99, 109, -59, -39, -94, -7, -3, -43, -6, -16, 1, -39, -64, -19, 69, -36, 41, -4, -58, 51, -75, -47, -8, 52, -36, 64, -64, 132, 44, -18, -3, -50, -59, 9, 54, -50, 30, 5, -97, -9, -70, 50, -1, 76, 4, 53, -43, 25, 100, 12, 31, -130, 32, 25, 50, 24, -19, 6]
7118Fj77J37J18j01j3R9j04J9L9K3l4OKk9qM6m8O5j28l9K26p0n1L2J68j48Ro4
7146a9j01R9J9o3J71m7Pnnl4j9O9j36J14Mq1P9k0L1j44J27N8k68K81m4j88J92
7173G7j05M4k6QJ5m0N6R7j45k2Q7m8Q1j06QQ9j13R1J4n7P5j83K39j20k2j1j49
7200a66J60N0j70O2M7N0k2L9m4k3M2k5P6j18J41j16K1j2O1n9J8O7r0p5k4O0p1
7227a21R4P3o4J04o7O4k3j02P4PJ9n1P8r9K5ln0P3k9M6j32P2L0p9P8l9P9j09J43
7256I1j39N0K5j3k8p3O4m4O6l6N9j14M4L6j7P3j7Q0p1O5j22J51j01k2M5j3l9J9
7284A9M9j56Q2J9N0q4J3K3o3qQ0Nl1K5k8Q3j23p8R6ml6J85j27L7p1R6o8orK5P7
7315G2m3j19J27p4J72r5L0j1J8m8o8MR1j5R2o8M9r1K4r5j5LK7m5NK5J14Pj26l
$$ y = [6, -171, -34, 84, -17, -30, 69, -35, -16, 23, 46, 12, 18, 20, -9, -17, 29, -19, 46, -82, -121, 105, 35, -16, 16, 184, 36, 45, -19, -120, -21, -2, -65, 106, 59, 66, 61, 56, 22, 3, 72, -64, 50, 54, -27, 52, 32, 63, -81, 46, 104, -164, 117, 73, -115, 77, -28, 16, -10, -2, 13, -27, 29, 126, -19, -41, 46, -2, 79, -27, -19, 70, -43, 48, 62, 5, 80, -103, 136, 16, -6, -17, -166, -6, 44, -126, -64, -17, 33, 11, 50, 6, -17, 25, 0, 76, -42, 99, -17, 4, -8, 53, -6, 12, 79, -11, -86, -110, -50, -121, -27, 46, -18, 86, 19, 83, 60, -42, 32, 39, 58, 7, 85, -14, 11, 8, -42, 31, 2, 48, -84, -12, 18, -61, 17, -22, 57, -52, 91, -48, 2, 27, 14, -14, -87, -23, -67, -1, -37, 22, -92, -48, -12, -29, 44, 27, 107, 36, 101, -21, 130, 29, 7, 52, 39, 0, 19, 68, -88, -6, 13, 63, -21, -8, 15, -48, -56, 24, 29, -2, 23, -5, 78, -45, -123, -27, -31, -67, 118, -9, 28, -43, 53, -15, -21, -30, -5, 72, 29, -90, 37, -37, 135, 40, 70, 59, 77, 29, -39, -35, 56, 41, 133, 65, 114, 23, 47, -48, -63, -60, -33, -78, -73, -48, 66, 73, -53, -56]
7345e6L5M8m0n2k4Q5Q6o4k0J0l4N0l4QP2p2mL8o2l6N8O0O0j83P8J6N6n0o8J5P6
7376E2j6j10M6N7n1N8j46J28k6j2n2J69r9Pk0r4p5J20K48k19Q2q7k4N7K5K7o7
7403b2K7o7R8k3o0R8PK1j56J15N2j21K02j67L0M0p8m1m2R7O9m5Jj1j05qJ3L1O9
7432B4Op8lJ23j8k4K8K6K9j25%M0n6jm6J15k3o6jP2L6o7O8no0j9J18m1k9j48J48
7463B3n9P5m3m3J56j12p2Q5N6j37J8J13j18l4J39lr3O4O8o4j3M0jl4j6o3O6k4
7491b6J6p0J41j26P3j14Q3k2N1J16j48k4K7J9O7lK1j47p3J14M9j41J41k5q5M3
7517d3J65k90R7J7k6Q7L2o1Q7o3l4J56j73M5q3Q8j3K4l4L3j6l6P8j3O6n7j11Q2
7545Dj77J01R9K2j40M6M3n1N7M5j08J43j16j7R6r3L3N6r9K6J8m9J15O8j49L9M1
$$ y = [-56, -21, 27, -13, -65, -89, -4, 82, 18, -2, 8, -26, 24, -10, -2, 70, -2, -6, 32, -30, -66, -8, 52, 112, -71, 7, 23, 79, 29, -39, -24, 52, 36, -74, -28, 29, -22, 36, -110, 18, -8, -20, -72, 97, -2, 5, -15, -109, -184, -64, 184, -35, 47, -40, -64, -7, 18, 45, -22, 5, -62, 36, 13, -47, 51, 58, 79, -77, 38, 90, -31, 171, 4, 34, 74, -4, -45, -87, 10, 79, 34, 35, 24, -81, -89, -76, -45, 24, 30, -48, -51, 72, 54, 30, 58, 84, 113, -12, -12, 28, -28, -29, -75, 40, 17, -49, -50, 22, 58, -9, 59, 54, -6, -25, 93, 52, 23, -125, 23, -36, 39, -4, -47, 109, -3, -75, 10, 66, -71, -53, 60, -58, -92, 47, 44, -49, 15, 83, 19, 6, 46, 45, 11, -5, -68, -2, -26, -10, -80, 61, -65, 8, -106, -23, -45, 6, 122, -26, -50, -23, -4, 63, 60, 81, -66, -139, -25, 24, -117, 24, -1, -86, -43, 122, -168, -71, -54, -80, 7, 39, -22, 65, 2, -32, 124, -49, -4, -87, 1, -12, 12, -22, 11, -5, -41, 37, 24, 90, 33, -78, 4, -173, -72, 27, 49, -91, -45, -2, -53, 4, 49, -59, 84, -32, -49, 47, -46, -13, 43, -56, -30, -12, -61, 54, 122, -27, 12, 53]
7572E3j51J23rqk6MP1j2m6P7m7p5k6j40K42o5M9q2PM4OJ0M5r0K0j2L8j15J15j2
7602a2M1J3O6j02m5m0K8N5M2n5R0pj03J36j87O7j1N5oqKm5L8N8j55P6L8%j60J31
7632@J9Pq5L0O5n2M7LJ7j01L1Op6L0k3J31Q3k08Q6RNj13O7j9j2J26j45J23m0M
7662A5k2mj04KJ18o4K1JM4RN7j76R0j4Jl6J69j81L1n2L5j7L5Q1q2PM8J3j01J36
7692F0j49J57o8m4P4P6j98N2K03j76N7L7j02J19k2r3O0j27J32n3M9q1J53j52J6
7717b0J05n8j48n3K11o9L6O5j0q7J10p1nl9J50k3j11O1j65K04r6M7l6j02l4O0
7743g8J13n8M5p2l1J43q3l0L7P0j76M4R5o3P1l2j50J36Q6j05L0O9j05L2p0PJ24
7770D9p1K2k7N4M2K3Np4j2n8J09m9Jo1M8K0J6j3l8K7N7p3Q9j12K4K6k8j6R8nN
$$ y = [53, -98, 25, 16, 8, -18, -14, 57, 45, -1, 76, 29, -46, -72, -212, 30, -35, 14, -68, -61, -17, -11, -1, 44, -46, -26, -38, 0, -115, 0, -12, 29, 42, 108, 6, -39, -79, -51, 4, 46, -9, 81, 74, -29, 107, -80, -13, -24, 31, 25, 17, 19, -26, 12, 70, -85, -9, 29, 29, -131, 0, 19, 26, -59, -29, 36, -16, 31, 34, 51, -50, -19, -13, -89, -59, -82, 49, 132, -76, 10, 19, 24, -89, -22, -41, -53, 73, -72, 51, 11, 15, -7, -11, -115, -113, 5, -59, -38, -37, 7, 16, 73, -103, -13, -27, -26, -62, 107, -74, -43, -95, -60, -77, -42, 39, -43, -36, 12, 25, -76, 60, -89, 68, 0, -44, 30, 106, -92, -40, 163, -13, 44, 81, -21, 98, 76, -17, 43, -84, 48, -5, 44, -37, 116, -36, -20, 85, 27, -121, -174, 37, -32, 4, 69, 59, -28, 82, 11, 6, -33, 117, 94, -17, 44, -121, 83, -13, 34, -2, -104, -138, -78, 35, -23, 22, -50, -81, 62, -21, -51, -14, 56, -120, -76, 19, -44, 27, -5, -155, -19, 67, -38, -8, 61, -44, -12, -82, -75, 49, -22, 0, -27, 27, 69, 92, 97, 23, 11, -47, 62, 13, 14, -47, 1, 21, 37, 24, -14, 13, 70, -3, 86, -26, -2, 24, -4, -20, 78, 73, 78]
7801G8j42N8o8O1M5k3M1m3n8l6J10L5j05J31m6r3K3j8m2J04n5K5L4Oj7o8P1o1
7829e3L0l1K3Q2k3J7j07M0J4q0J46o9k7j05J65q3J0J72j53pJ5L1N0r1K2k4L7o0
7857e9J56j95J22o9M4o2N6J5l6P9rk0l7m5n8K22j89j7K7j2M1K5R8Jk2m1P9q9N7
7886F2l0L9RR5j03p6Jj8k0k2P7n6Rl9M7J6q1J50M0q3M9n9j0Q3j1p0q3P1J4rK5
7917A7o3J11K3j09m5O7jj12L7J93j11o7Q3P9q7p0R0r3k6J37q2O1k4Q8q5o9O9q8
7945g7J0J07k6M4o0R8j75R5n9jK6L5j04lJ8J02j59J13o1L1N9m0N2L4n4JL0n3j6
7974c3l1L4M5K3j5oM7k10J58J9q9m8m4K08m4%J2K4r3M4mr0N6Q5j07lJ32j53J54
8003G1l3j30J9M6O9L6j67nR1K9r2M7j4J8m4J17p2k7l1N4m7K0J1J2K8o0N3l6J7
$$ y = [78, -64, -6, -74, -13, 32, 9, 50, 7, -51, -87, 23, 58, -47, 84, 38, -55, -32, -50, -92, 12, -43, -18, 16, 22, 5, -63, 8, -53, -23, -54, -31, 51, 28, 45, -62, -22, -8, -88, 58, -11, -38, -143, 22, -61, -51, 121, -32, -39, -24, 7, 57, -34, -12, -36, 1, -59, 97, -98, 24, -45, -1, -63, -7, 8, -28, 51, 42, 22, -15, -60, -118, 104, -85, -102, -75, -87, -46, -21, 77, 78, 56, 15, 94, 5, 62, 32, 71, 80, 175, 72, -4, -3, -21, -41, -63, 14, -42, -33, -72, -25, -9, -90, 60, 100, 17, 66, 7, -3, 80, 69, -1, -84, -13, 1, -8, 17, -46, 65, 88, -21, -66, 1, 0, -112, -75, 118, 7, -60, 23, 102, 15, -55, 35, -58, -84, 53, -29, 32, 8, 96, 11, -58, 11, -77, -67, 40, 14, 58, -2, 96, -79, 16, -43, -44, -18, 17, -87, -90, -72, 30, -129, -16, -77, -46, 13, -27, 25, 59, 5, 6, 36, -17, -33, -64, -30, 15, 38, 23, 17, 64, -146, 12, 31, -58, -106, -150, 58, 14, 14, 26, 50, -43, 1, -3, -93, -37, 48, -59, -62, 70, -83, 71, 38, -92, -73, -27, 42, 78, -89, -94, -3, 26, -66, -19, -33, -15, -59, 58, -14, -41, -72, -18, -65, -45, -34, -22, 6, -54, -1, -37, -20]
8032b0RJ23j75L1O1l2M4k9J8n8P9%j35J08J00j70J53kq8o1oP5K8k8j19O6m2L7
8060c3P0q9P0J14j96J00M0j07jK1q8KR9nl7J02j68J53J9p1NJ02j12J2J08j02q
8087@o2J20j09M1O5n8l4ll3N2J05n0j7j7r5P9K1n9J6P9q5P5j15J80j08O2q3m6
8115g9J1qK13j57K5m9L8o6J07q7J5M0Jn3J72j64J32j0o2Onj06M9J7L8k4o7R1l5
8144a7%k7p8N7M5j2J2k3J25jj13J68j30l4m3O4M5Mk4p9R3%p8R8o4K5k5q5P5J14
8174I2j26J9M6j9RM6j44J93j19m2O4n7N9%j50R0K8
$$ y = [-20, -11, 112, -63, -32, 29, -3, 41, 12, 30, -28, 51, 51, -84, 24, 124, -46, 107, 105, 17, -44, -50, 25, 53, 25, -94, -28, -70, -33, 37, -52, 18, 132, -64, 36, 76, -31, -32, -11, -99, -97, 2, -3, -40, 62, -106, 47, 66, -5, 0, 102, -10, 2, 110, 8, 0, -62, 58, -51, -10, 55, -3, -37, -40, -73, -21, 84, 34, 17, 0, -95, -16, 5, -54, -38, 41, -44, 31, -84, 96, -12, 50, -33, -79, -68, -76, 137, -20, 5, -44, -6, -72, 35, -52, -37, 3, 4, -49, 123, -41, 91, 81, 19, 25, 20, -86, -37, -20, 18, -6, -73, 18, -17, -17, -44, -122, -65, -20, -32, -20, -43, 82, 81, -32, 136, 6, -28, -71, -7, 38, 42, 18, -61, 32, 32, -46, 52, -12, 13, -12, -97, -22, 92, -34, -15, 31, 12, 21, 67, -77, 116, -3, -45, 19, -38, 21, 21, -129, -39, -11]
8191a1
$$ Imaginary data points
##PAGE= N=2
##DATA TABLE= (X++(I..I)), XYDATA
0@%%%%%%%%%%%%%%%Qj6J6j6J6j6K4l2L2m0M8n6O4p2Q8r7J05j20J37j60J83k01
37a05K25k55K86l18L51l90M33m79N30n83O41p08P81q60R48j044J152j274J410
56G41j564J741j944K184k474K825l265L837m607N713p453J0584j7952O9119K0282
71G7767j44370k413Q3872M0219n0387k2009N047n685r031M6062K2045m2393m0641
84d1917K7850M7744r214l5987M146J2999j4807n408K8882M144k8215j2437L0133
97G913Q767k6414O068K5937j8936l6186K1986M2640j9429m9245J5501N5297j3380
110B0519m8867Q562M7996Q49m5860p596L6376Q505k6695k845J1855j0649p973
123a5823K3042K0106l1435l0426L0128L5408j9703l0905J0627K0434o241j3728
$$ y = [0, 0, 0, 0, 0, 0, 0, 0, 0, 0, 0, 0, 0, 0, 0, 0, 8, -8, 8, -8, 8, -8, 16, -16, 16, -24, 24, -32, 32, -40, 48, -49, 56, -64, 73, -87, 96, -105, 120, -135, 151, -167, 184, -206, 227, -252, 278, -305, 336, -372, 409, -451, 497, -547, 605, -669, 741, -823, 918, -1026, 1158, -1316, 1509, -1756, 2081, -2526, 3187, -4266, 6318, -11634, 57485, 77767, -66603, -69016, 14856, 55075, 4688, -17321, -12274, -17959, -26990, 19072, 41117, -1276, -41917, -14067, 33677, 24463, -11524, -7378, 5621, -9186, -14594, 14288, 18432, -9783, -22220, 7913, 16680, -9734, -3666, 22271, 3335, -32851, -10865, 31775, 12346, -36899, -21398, 33899, 20519, -28348, -19786, 28210, 29059, -16801, -24397, 11979, 20484, -6211, -9056, 2799, -7850, -15823, 7219, 27325, -4110, -34536, -4408, 31000, 11297, -19608, -8981, 11453, 5212, -8516]
135h516R563O144j2962M282J3663j0318j9478J3361K9837j1650m3467R70M8919
148B0348J0242l9105k0907K3733K1350j0999m263J0043j2264j9464J8705K9891
160B7310j0919l4078l729K7817N798j5049J858N865j1595r444J6749K0411j1567
173I427k7128K084K0603M429k433j452r489j3212R292L1411J781l9852j5966L3650
187C145K2064j9648k3066Q440J6776p490o817J0733J255j2681k85J4655M237j4799
201c481o149J6495L091j6596j171J4646K801j4666n899J3656N145j2253j434Q663
215B848k441m619L660N396m913q190R282J0828j0875j1284R087J2370m557j4204
229g612N99J3382j757r127K237L343l413j711N393L500p755m280J0773K890r996
$$ y = [-8516, 1047, 7191, -5771, -1489, 12174, 1856, -17622, -4261, 25576, 13926, -29541, -28571, 20348, 30590, -8515, -29422, -5689, 15661, 4662, 399, 10442, -1822, -21286, -2581, 27310, 16391, -17687, -21416, 6401, 12199, -2850, -992, 4873, -6722, -16166, 583, 20994, 9427, -17701, -15617, 4986, 9415, 6982, 5530, -3959, -17171, -7879, 23532, 25313, -14539, -30505, 3145, 25209, 5561, -17505, -9065, 7711, 221, -6596, 4137, 5392, -7289, -7574, 7081, 11318, -3481, -9630, 6865, 9956, -6640, -7811, 6835, 9636, -5030, -10929, 2727, 7872, -4381, -5815, 2848, 407, -4212, -552, 4844, -69, -8259, 1023, 11851, 976, -10308, -1221, 11149, 6592, -7612, -7013, 6369, 4612, -4515, -2278, 1065, -2348, -4059, 1334, 4834, -2921, -7201, 3572, 6462, -3534]
244c534o91R241K364r997n171J0941O404r690n977M297L106l67r14J157l122o617
260h570P261J0702o175j1655K006J1542K928r120k691O691j507l301M618J515
274D244n362m740M865O680n538p115O245M144n471k835N492N328o249o982P850
289E56P367o085n497K796L774j142k833L274j21p564J969Q452j363q343k380Q012
305H72N097p350l692O557J091l498J57L429Q95n287q25O477p31o028J523L150
321A837j336l711M61N935j869o957K879N648q82l430j022L324J649k773J460J674
337B887m149j76L687Q72k792m454K403N062l098l363J739N48L42m3J20J531j846
354g30p59L746k53j948J104k91n78l49k6K693j606m491J482K612R7n14k404k57
$$ y = [-3534, -4225, 5016, 7380, -2617, -7788, 3153, 9557, -133, -6110, -1813, 1293, 926, 12, 1169, -1953, -8570, -1309, 9393, 3218, -8437, -6431, 5111, 8039, -1081, -3772, 2919, 1412, -1889, 2729, 4244, -1118, -5858, -993, 5687, 149, -6966, -721, 3423, -2048, -4883, 609, 5937, -312, -7294, 556, 7923, 1838, -3659, -863, 2911, 1769, -1064, 2210, 2089, -5475, -3506, 4946, 3583, -4760, -7140, 872, 5969, -1381, -5073, 1484, 2575, -923, -766, 2663, 3558, -1729, -2554, 3923, 3192, -2836, -1313, 1837, 501, -3210, -2749, 3186, 1317, -5640, -2761, 2887, 2005, -1425, -2447, 877, 2526, -247, 1213, 2887, -1262, -1438, 2249, 3121, 329, -4125, -1722, 3340, 242, -3121, -1382, -834, -492, -535, -415, 1116, -730, -1489, 2257, 2004, 56, 1160, 869, 291, -58, -84, 2609, 1003, -3488, -2006, 606, 703, 189, -2215, -2472]
372b472J534L46K561K58m455J13L331J905l58l255l83J803j218J102J838k981
388c31k592Q50K041J727k772j294K389r02o10K190R02m16k137o70M098M30l265
405c62L31J307m64j942j082L646J187m509j642J449J677K548q32k954j257J69
421b730M705L564l334l946j376K321N415J23m619l254j125L997N137k264n737
436c123k624L054O047q56m376N99N93j93J963J114P40j918l764J911L566j05k054
453E74k574J669K018m012j440N163J847l854m540J203P053J570m438k413j43K351
469C4L185j8j2k853o413J859R361L641p258j1371P65J2195N010n642p603k814
485g934O843O259j924k792j931j360K269L626K704k669q085p1P172K804k887n257
$$ y = [-2472, -938, -592, 1969, 2227, -2228, -2115, 1216, 3121, 2763, -492, -875, 928, -290, 812, 2650, -331, -2923, -2073, -32, 1695, -1077, -2371, 18, -884, -1494, 696, 1598, 1182, -955, -1625, 2473, 2903, -362, -31, 1276, 812, -1130, -2212, 1434, 2621, -1888, -3530, -2081, -404, 2144, 1312, -1642, -2899, -2730, 1975, 5539, 2205, -1741, -3117, -796, 4619, 4742, 123, -3131, -4256, -259, 4878, 2614, -3123, -5747, -2693, 3354, 2498, -1878, -1279, -686, -879, 1084, 2198, 2938, 1020, -2744, -833, 2733, 2628, 574, -2000, -331, 1687, -2325, -3765, 1398, 3245, -609, -5149, -3946, 3107, 4677, 239, -2174, -2317, 34, 3219, 3201, 3189, 336, -6077, -4218, 5143, 8784, 1526, -9845, -9080, 3115, 8125, 2483, -5120, -7934, -1091, 5168, 3244, 452, -1479, -2839, -570, 3056, 5760, 3091, -4994, -5065, 2107, 4911, 2024, -3233]
501c233j387N408J054m826O7M810K168n294n600N710P438k764m742r83K306K358
517B490j764n22K769k640n430O39P388N277q322j0960M823J1067K064n635o022
532d778M84M504K230J546m13m322l026P59N894M704o445q207K803O752J974m587
548a28n056K387M051k70j980o58L146K425n583l160N922M566j805m810k430K845
564e38J519MJ523j767m008j887K414P594J294r856n187O925Q373l54p812k976
580d739L851K901J425j23k815k086j514O43N993K277o685o187K085Q129J842p097
596b100k541M067K305n8k172o42L118m77k517J461J978q13k864p28L793j168m151
613c509K715L634k148l988j599M186N210j425m647k592K136O390L43n049j155
$$ y = [-3233, -4620, 788, 1842, -2984, -2917, 1893, 4061, -1233, -6833, -1123, 6315, 3551, -1191, -2174, 132, 2490, 726, 204, 2973, 333, -5097, -4458, 2930, 8207, -115, -11075, -6252, 4815, 6879, 1244, -4778, -4294, 210, 2440, 3986, 3573, -749, -3775, -3016, 2878, 7582, 1137, -7070, -4267, 2485, 4459, -128, -5184, -2797, 1254, 984, -996, -1654, 1492, 3917, -1666, -4826, 1096, 5662, 3857, -953, -3383, -538, 981, 985, 2508, 741, -3267, -5154, -2740, 4854, 6148, -3708, -8895, -1970, 6403, 6049, -1763, -4739, -888, 2013, 3438, 3315, 500, -1586, -3100, -2457, 3536, 5813, -872, -7059, -4974, 3155, 4997, -2100, -4641, -574, 1731, 1673, -499, -1141, 1977, 1500, -1017, 444, 2422, 1609, -1255, -1983, 1810, 642, -3509, -794, 2840, 692, -3296, -4895, -709, 4501, 3076, -1571, -4163, -2027, 4363, 4706, -343, -1498]
628a498O48J408K114j314k264m92q95J494K364J68k228m407J319P008r1m816n7
645a539J941Q30r83k42K451p57l132R03J571K33j128k602J242K809k434j477J863
662d51J077p82j579R32K610j005l32Q47k148k54L134Q05j575k841p89L032O29
679A310j338o81j466N38J938l72L97p82j833K242K367r64j333p24J491R61j643
696A08O46O62k276n8J075j80j48j050q9J089n52K49O32p62P30N41k62P77p68o77
716c13J521m6q60J19o92L90r4o78N75r72q15K393j80j995M55J090J061n00j334
735h75J772O28j636O95N77m33k32j028R06N94k383K18J756r15j062L2J303R82
753H99k377j2L031n75j310O37O27M40j182n14K117j031k215J345Q06q78r41p00
$$ y = [-1498, -850, 558, 2672, 1358, -906, -1398, -2293, -799, 1565, 1733, -495, -4902, -3583, 3425, 3334, -1482, -1539, 402, 1232, 249, 7, 2458, 1701, -1431, -528, 1043, 1276, 148, -2454, -1212, 1597, -837, -2314, -451, 626, -156, -1735, -803, 1807, 802, 470, 1317, -831, -1085, 2049, 2854, 1279, -1562, -2351, 681, 1310, -28, -709, -2175, -1637, 301, -71, 326, -456, -2289, -47, 2320, 1356, 23, -701, 790, 1751, 108, 754, 1416, -860, -918, 157, -23, -171, -1221, -1310, -221, -773, -524, 108, -654, 76, 617, 355, 1132, 364, -313, 1208, 1162, 302, 421, -271, 119, 25, -653, -78, -1050, -1865, 528, 348, -1647, -1192, -102, 959, 459, -875, 897, 1525, -111, 584, 1161, 728, 496, -532, 374, 968, -1415, -1197, 559, -356, -1418, -1386, -83, 899, -1478, -1490, 1541, 966, -344, 293, 920, 1360, 178, -336, 1781, 750, -1465, -120, 686, -192, -1133, -1833]
771a833K137K20k595J161J753r17k79J74J133N22k006P32J786j719n99J056J14
788H40n96j595O02K056j957j588J703O79l52o77j30K000l96j425J598M02r42L95
806F17l18O41j84j491R36N29j661K67K17j07L96r61K36J106r02N03Q21o75L91
825C61L59l11N34m22L0N72j365k12J011p33j07k71p77R46k34k07J145j082l84
844a147J677K74R3o14o80J606q5j252J096k18j095n9L8R97m09j901Q47J020j145
863i57K74N05M80j98j322J296J994j319q67O83KM9n71L31R63k120j008J893L64
882D72p69o63n05J274k00m57K161m07k119L45J724J504j274k533J569J615j874
899a37J50N79o08r06q62J613J706k461j164J579O84M09q38k04J945p70j532J508
$$ y = [-1833, 304, 524, -2071, -910, 843, -74, -353, -179, 954, 1476, -530, 202, 1988, 269, -330, 726, 840, 244, -1351, -749, 1307, -650, -2238, -535, 144, -208, -885, -1015, 985, 589, -836, 762, 1164, 222, 617, 299, 940, 756, -735, 201, 730, -931, -664, -447, -554, -158, -1119, -883, 223, -679, -176, 645, -30, 361, 720, 409, 943, 521, 551, 1123, -242, -454, 557, -176, -283, -554, -1331, -385, -619, -826, 319, -763, -1147, 530, 804, 897, 283, -397, 1209, 1124, -128, 968, 750, -345, -404, -366, 631, 222, -1679, -832, 188, -957, -683, -178, 302, 104, -1218, 78, 2072, 753, -114, 569, 571, 620, 49, 380, 1343, -777, -1785, 108, 472, -297, -960, -1465, -191, -391, -848, 1313, 906, -1213, -868, 856, 2360, 1086, -1447, 122, 1737, -137, 13, 592, -16, -922, -1784, -171, 1535, -926, -2090, -511, 173, 582, -256, -460, 1485, 715, -817, 691]
917F91O65k48n08j222M57O03o39P46r92j596J417M60m97Q39m19m10k29L44K556
936B018J70k943k28J334J229N25k409n35J386j003j24R53l77o73j262O48K367
953A076n68j467M05j83J242J232j275n08N42M93p3j626O24K215j615k668N19J707
971G2J347j888k074K114J177j870J57K178Q93k767k302M285L343m187l156J901
987g77K560L1k330l54J051j507j79J828K06o42j454m22K524N84j054M06p59j15
1005d03J676M75j158j640M74K901j657l124K225J793k368j867J651K879j235l256
1021b634J692K680j579j564J082L036O7m695m86M707O22l203j346J116J714j550
1037c41q22J522j192j115J918M72l49M1j396M23J287J083N38k329j332K344O52
$$ y = [691, 1356, 1108, 600, -622, -165, 438, -201, 545, -447, -2043, -626, -166, -663, 176, -243, -653, -882, -538, 2018, 2188, -755, -983, 351, 1580, 2105, -304, -839, 547, -456, -580, 373, -4, -677, -1939, -1291, 1076, 508, -959, -554, -737, 505, 1737, 462, -46, 496, 989, 916, -710, -86, 2129, 514, -2154, -1635, 72, 1419, -469, -2543, -429, 748, -1122, -965, 1213, 2106, -661, -2963, 1322, 4665, 478, -2678, -777, 1783, 1814, -516, -870, 181, -1326, -1505, 323, 529, -113, -1567, -1989, 535, 1119, 65, 471, -288, -403, 1273, 1748, 590, -1050, -576, 2325, 668, -2456, -231, 1562, -806, -2673, -1022, 1857, 622, -2634, -942, 1738, 159, -1405, -323, 2713, 2780, -1915, -2401, 2306, 2928, -275, -1621, -505, 1209, -341, -1163, 359, -833, -1948, -30, 442, 93, 134, -1262, -839, 448, 1531, 2069, -260, -1592, 752, 1404]
1054A404q28p75o65J589j29k693R80K232j330j652N17K590J88l330P55L138j274
1071G17j132J325M21l92j402q2J261o25r1O27j437m51M90L57R86r31j415K041
1089B67N63j441L66J332J6j822l7L590q53m444J225L367q90k458k76J993j9k808
1107b329R15K595p89j524J25J573J032k464k96L288k24k717L10J933j01k604J52
1124a125K783j275k550J819J009j601o31J120J740j047j818J646J144j286QP59
1140F95Q45p38k073J166K129k164j321J411R65j259j548J347J613k327j91K650
1156A200m44j578L61R90P07j211k60J554n43j048L03%K88l86r70J149R3j775R84
1175e86Q70o77k64L38J231n47j526J868J093k159L25J290o81q56m67J219M13k101
$$ y = [1404, 576, -199, -864, 725, 596, -2097, -1117, 1115, -215, -1867, -1350, 1240, 1428, -1902, -1147, 1991, 717, -415, 910, 1331, 939, -463, -545, 716, 91, 0, 627, -810, -1261, -771, -414, 572, -359, -1774, 267, 830, -611, -245, 1087, 1103, -719, -756, 2834, 1981, -2463, -1238, 2129, 1239, -1219, -1495, 498, 479, -2329, -1414, 1181, 392, -1132, -1007, 566, 1598, -866, -1162, 2126, 1902, -815, -505, 1428, 1327, -1277, -1125, 1658, 383, -2167, -348, 661, -940, -1571, -451, 1289, 242, -1576, 70, 1214, -72, -64, 695, 1540, 802, -1271, -105, 2024, -140, -1461, -50, 915, -344, -1892, -545, 1068, -1259, -1450, 1200, 756, -822, -461, 529, 1236, 25, -235, 1319, 776, -272, 31, 31, 319, -67, -1037, 112, 205, -1570, -586, 284, -393, -657, -319, 912, 365, -1161, 707, 1800, -359, -34, 1256, 575, -281, -748, 471, 884, -1217]
1193a217L07J539r48p66K46P42Q59j506l21K490m51j808P96J238J89j739k34K265
1211A681q79k615J526J338j259j081L58J547o62k092J655J771j482o48R77J059
1227A194k72j966J171K021j811j348J437N83j023j366Q67J902k090j398K224P01
1243H26j513m48R39J457j041j291K011M91j549m7P27N93q97j327J120R54j808
1260h03k45J087p6m54p20J033R23j565K03J684o27m02K04M16L57j037lJ050r42
1279H3o17P84k63k63l96j62R35m70p21J211p5m11N19k3M55j86o62J095P2j205
1299c00P19J89p01j79l59O14R5j195O40O30r87O8P07K86K6q23O90J239j232k87
1319a60J070k56m36o15L78J132j405j177J610K77j183j11K77J180p20j119J700
$$ y = [-1217, -910, 629, -319, -1085, -839, -97, 762, -744, -1065, 1425, 974, -834, -38, 1200, 1389, -350, -584, 1681, 802, -1813, -287, 1051, -208, -1289, -931, 616, -46, -2138, -483, 1288, -194, -842, 135, 1194, 922, -1044, 127, 2148, 337, -1011, 426, 1009, -14, -1380, -513, 1389, -701, -2099, 125, 826, -687, -1135, -196, 1261, 220, -1071, 940, 1431, -118, -165, 562, 1155, 258, -1069, 51, 1005, -803, -1048, 39, -37, -491, -1211, -178, 745, -820, -617, 1067, 440, 38, 242, 658, 1015, -22, -25, 1025, 83, -534, 250, -13, -276, -672, -834, 101, -369, -1090, 121, 46, -365, 154, 131, 586, 400, -262, 833, 905, -300, 419, 608, -93, -272, -631, -17, 78, -1117, -477, 153, -834, -766, -59, 227, 253, -570, 120, 1359, 127, -160, 910, 654, 218, -397, -19, 1113, -292, -1469, 141, 418, -765, -876, -599, 581, -139, -1258, 442]
1336D42O73j332O8O58N86n05j088R70P51j683lQ89k67m52p73N15J088j317l79
1355a159J602l98m67K53M87P10r00o27J490m2r76M2J75J63m38r56J112K15j349
1374a063M33L18J58Q0n17N26N78q24N31O37m91M5j41j72N64m70k76L79p42L6K39
1395a72k33Q7j62l78Q84K9m70O35r8KL71k27N00q0o80L88j95k58N48p94m15P11
1417gj25l15r6j12P81l57o26J027M89n55O5l12P45N14j286R7R41m69n98n10P06
1438cP36j612m00J480k38n33m0L79O86m20l36R84n8n37K94k92O12J25j207L66
1458a4K95j045N78L03m88j71k53Q03J35j217R65J105j168j31R65P9l31o69L06
1477D7J164q67p75K98J59K02o90q57J700M8j558K94R00M11o27m49J156M19j237
$$ y = [442, 1115, -217, -149, 509, 1095, 590, -498, 472, 1223, -460, -463, 426, 159, -293, -1066, -551, 537, -780, -1159, 443, 45, -422, -169, 318, 1028, 128, -499, 991, 949, -27, 15, 190, 353, -85, -1041, 71, 286, -1063, -630, -312, -154, -74, -591, -65, 513, -311, 220, 857, 366, 411, 270, 98, 662, 192, -84, 295, -447, -411, -172, -405, -318, -480, -858, 26, 55, -415, 220, 122, 124, 495, 268, 768, 688, 8, 396, 201, -57, 491, -303, -718, -7, -132, -447, -543, -655, 126, -231, -857, 170, 659, 104, 169, -143, 602, 1116, -170, -73, 868, 399, -199, -709, -3, 733, -879, -1279, 201, -37, -570, -610, -231, 455, 35, -301, 683, 625, 88, 382, 90, 702, 827, -380, -14, 281, -764, -186, 117, -371, -542, -795, 8, 143, -1074, -109, 996, -172, -303, 662, 741, 410, -259, 47, 1211, 344, -431, -133, 26, 228, -462, -1319, 381, 429, -1129, -835, 65, 476, -151, -600, 556, 975, -262]
1496b62M92M67l96M07n12m29O52k32o12j05r3P45j03q58N97K7j79N98l51M1Q62
1517G56m17l92L60K17J88r23K7J015q15q31O75j77j53K29j98K38r9K6L44k55J41
1538d4J144p22l10M23l12K82Q8o48J19L64o54m65M9Q11mj509P62J488j122p71
1558a031Q92P43r6o97L88J021j028m90N96J6K92p63o41R61qj393N55Q43j06q15
1578g61J2J096q2j223J227J000j119k3L24M5j88o47N96N16j052q6J28j54J06l04
1598e89M9J156q90q10J189L20m74j42O36O82r14p39J359j73j081N02K75k60l28
1617b32n17M00L96o53L28J49n1L28p39L11J024n76j40Q81n05l79J71n0J8m52K81
1638gN16j014m37J034n55k24N78O0M0l19N9P72k61k50N94k42O6j62n56P54K16
$$ y = [-262, 230, 697, 301, 708, 196, -233, 419, 187, -425, -530, -623, 122, 19, -839, -242, -215, -394, 204, -147, -106, 756, 339, -53, 307, 524, 712, -211, -184, 831, 16, -815, -140, -317, -470, -241, -439, -201, -300, -274, 70, -185, -44, 1100, 378, 68, 491, 179, 461, 549, -99, 20, 384, -270, -735, -686, 125, 121, -1388, -626, 862, -260, -1031, -139, 604, 508, -189, 199, 1220, 192, -298, 298, 314, 606, -157, -798, 163, 155, -1238, -683, 160, 54, -761, -749, 347, 265, -958, 269, 1269, 150, 127, 451, 496, 308, -339, 257, 773, -279, -365, -237, -391, -285, -589, -540, 616, -274, -1084, 105, 425, -49, -191, 445, 1127, 213, -526, 833, 660, -421, 81, 356, 96, -232, -749, -349, 47, -606, -278, -129, -180, 148, -591, -280, 744, 168, 28, 909, 404, 25, 196, 146, 164, -288, -7, 509, -505, -942, 92, -463, -687, -109, -49, -9, -328, -269, 503, 242, -8, 586, 344, 410, 248, -308, 446, 662]
1659F62j268K97N99n90m05n3Q32O4j063Q65P66j033O0O62K33k65m12L60P04j108
1679i3k75O22m6l27m71J27P52o87q50J128M72p49k36P98P43q17p36J438L27j405
1699b85L17M36P2n42n38O12M12j113p8N30m4j2m89N75Q30j003k71J189j30m61
1719GR3K74N62r80k33R73n98o65N84n9j42k67l26Q43j01o43O19K69k07K64l62
1740i5N27K63q47L49O21p42q0J50l5Lp41K57O00q81P0P01l83n9L54r8M06m12J5
1763e7P88n62n1M52k77q5l02k02P02n60o00P63k8o31J48J83N59k61o59R85M16
1784G21q19Q1N37Q0j97p10O38M56j152j75P57l63k67j74J76P03p74j91J083k10
1804B00m01J37M63L11o50k35J008k37r41L57L03j35n97l10Q60J30j231M71O75
$$ y = [662, -606, -309, 290, -300, -705, -758, 74, 138, -925, -60, 706, -327, -267, 395, 628, 363, -49, 311, 1015, -93, -368, 254, 208, -119, -590, -463, 289, -398, -1248, -120, 352, -397, -633, 165, 908, 91, -645, 793, 1120, -285, 32, 468, 540, -2, -540, 72, 484, -629, -707, -177, -221, -233, -722, -147, 683, -320, -591, 598, 468, 7, 100, 374, 936, -44, -277, 696, 98, -567, 17, -42, -184, -451, -777, 66, -35, -678, -59, 210, 3, 267, -95, 432, 695, -152, 197, 818, 76, -4, 146, 111, 114, -627, -370, 230, -651, -581, 120, -263, -322, 32, -66, 340, -72, -57, 731, 169, 118, 570, 293, 208, -94, -296, 406, -154, -754, 9, -19, -650, -502, -319, 240, -21, -680, 305, 721, -98, -17, 520, 600, 403, -307, 331, 787, -365, -540, 217, -146, -413, -587, -411, 292, -482, -673, 410, 200, -201, -64, 399, 710, 60, -175, 833, 596, -345, 12, 315, 180, -417, -727, 133, 263, -968, -497, 178]
1823A78l57j72L7O77L28r60P1J078m29m32J26K18J64o53k10Q09m94o14M73LL6
1844a23l43j6O66j35m38O04J09k27K18k27M35Ko45M51Q0n02J8j13J5J84o35K90
1866c32M26o46K63M20p7J08l6K0M36m13J3L67m90J28Q8l84j1n0k27M95n68j50
1888f20P06m41r0K14J76L32k88k37R32j42p04M08J51j60j80l48L94J33q41K70
1908c35L27l02K8j1K7N68o19L1Q54m45k2J85Q6P6n09J79O84p28p32P74L5m64j95
1931e08j15Q51l04o30N32N42m21m9qP43K2r68M23O67m98l75l5L47j8o73K9P10
1953B64n35k25L04n2K68j76o7M08J34k44K19o8Q8J95m81K99j31o02L48J34m30
1974c50P4J07m1p5l08M00K76m82O23o1j66L66j50j49M81k58j39L0k51K19k95l11
$$ y = [178, -179, -351, -314, 363, 691, -269, -198, 880, 451, 19, 145, 363, 527, -126, -336, 473, -21, -635, -162, -159, -123, -466, -482, 184, 49, -389, 215, 324, 97, 315, 88, 523, 525, -120, 331, 411, -91, -73, -186, -171, 13, -622, -332, 94, -552, -289, 131, 54, 162, 126, 146, 582, 169, 182, 549, 59, 187, 275, -109, -120, -170, -397, 98, -470, -620, 86, -355, -445, -231, -55, 277, -11, -248, 684, 542, -162, 246, 397, 237, 57, -291, 103, 236, -605, -335, -8, -310, -282, -293, -266, 302, -317, -286, 568, 123, 101, 286, 372, 448, -61, 118, 802, 74, -658, 116, 151, -313, -508, -623, 228, -76, -706, -174, 368, -53, -102, -110, 633, 655, -313, 110, 777, 279, -96, -131, 216, 198, -475, -446, 264, -271, -496, -192, -244, 24, -152, -219, 189, 323, 79, 298, 230, 318, 513, 32, 331, 200, -402, -54, 80, -350, -276, -169, -210, -285, -593, -193, 83, -399, 224, 163, -3, 363, 213, 64, 545, 287, 148, 178, -73, 146, -149, -460]
1996d60N35m4n82M89l15O9L68l49J23N08l3ok99J09O52p51k24P75k04o64R2r6
2018c07L55l52k05N40k42k16J97j69L71N56o51J56N51n57r2J73L10j4o04K10M44
2039D54q76k50Q16k85j60NJ49K32k44j53N26k9l8K03l28M20J5p90N75N02p90l45
2061c91L84N2l35m57O88M78r70J52O40m77J52J21j4L92j53l20J89P9K61l06l46
2082a81O17l34o90M37K43n94K51P2J74k67q7M98%j72M50n8l71M47j48k53J92k8
2104A98j71o7l14L41l42k29O22l11j63M75j92j89M86n1J2J87L5m9j79J03L78o87
2126a07j14P57n49m20J21M7K98n09J01O61m72j30K59J60K63K9l75M13L10p92n6
2147a05K70J15j89o17O33K79j165K67P03l16j54J04P4K58m49J71O14j91Jj7k38
$$ y = [-460, 75, 31, -551, -62, -377, -308, 60, -289, -166, 342, 309, 303, 4, 113, 765, 14, -210, 565, 361, -303, -211, -307, 48, -304, -509, 31, -211, -427, -230, -399, -28, 528, -123, 33, 584, 27, -65, 108, 418, 404, -200, 10, 454, -422, -672, 144, -141, -301, -296, -147, 85, -159, -312, 214, 185, 147, 350, 22, 442, 457, -333, 242, 744, -46, -391, -7, 45, -290, -747, -59, 419, -551, -399, 241, -236, -84, 37, 23, 415, 262, -58, 131, 210, 471, 165, -181, 436, 102, -588, -151, 92, -502, -251, -179, -5, -272, -359, 139, 139, -33, 417, 359, -12, 435, 287, 34, 226, 198, 27, -40, -354, -13, -355, -584, 38, -273, -436, 39, -153, -342, 144, 93, 105, 292, 327, 278, 99, 202, 580, -107, -221, 536, -13, -433, -312, -265, 33, -476, -375, 286, -186, -316, -57, 103, 366, 395, 20, 433, 743, -49, -105, 165, 280, 91, -526, 107, 386, -779, -512, 191, -125, -279, -175, -101, 157, -292, -121, 493, 302, 303, 286, 48]
2168D8L49l32m81P70Q3p84K2K10Rk03k77O90J55p97M10M84l68J97j45J67L10m85
2190C2l5L91k60k13Qr6M53n34l40N95j04k82K16J11J66j13k33N19J8j69M38k96
2212B72k23K87l08m1K18k84m6pj74J20p1k84N93j81pL26l07K46J77l49K36K51
2234D44k66o8k49K45J31n38J18L47m70k8O9Q1J07j16n3O36k62k97M70j22J38o4
2256B53k53M77r5o34K83J85k66l01r1M92m7o33L37M45l23qR5L70O5m97R4O47l34
2279B61l47K53J1J10m39k39P08m18m56L74O5l6q8k50O70R2m76K91K80j72N7k32
2301A9K58J24n60J52K64l62J5j43R7J86m00l2M47l64O9L11r7Q6O5k32O37m25k12
2324i7M48j48j39M8l59J15J05m14L65j74n5K24r6j58M93j60pL04j5J07j01l68
$$ y = [48, 397, 65, -416, 354, 437, -347, -325, -115, -106, -309, -586, 104, 259, -538, -128, 356, -12, 185, 40, 207, 517, 32, -3, 388, 128, -85, -77, -173, 280, -254, -594, 1, -103, -385, -169, -58, 108, -5, -238, 281, 299, 130, 568, 272, 49, 336, 28, -13, 205, -79, -125, -132, -306, -186, -257, -541, 52, -129, -136, 190, -117, 129, 306, -43, 193, 444, 178, 110, -139, 106, 237, -301, -183, 164, -306, -334, -265, -184, -77, -193, -246, 390, 128, -169, 301, 179, 317, 253, 0, 477, 382, -252, 31, 216, -50, -351, -442, 50, 3, -630, -293, 152, -171, -179, -84, 286, 351, -146, -52, 595, 261, -86, 167, 178, 288, -151, -390, 318, -100, -556, -182, -117, -153, -241, -491, 179, 271, -205, 86, 366, 194, 251, 19, 277, 401, -159, -7, 257, -105, -90, -233, -136, 50, -350, -382, 65, -299, -230, 81, -16, 70, 135, -97, 540, 115, -97, 351, 203, 64, 112, -247, -132, -27, -441, -76, -250, -305, -81, -177, -335, 158, -2, -9, 295, 280, 387, 286, -82]
2346h2L59k4k78M7n9oN1l93J56L43n47K14K65o1k6k22J87N06l73q9L26r4J31l50
2370a9j31N19l16l42M01o2l47K4r1N09j58m69N04K20l72K40J9J34J5k56J18L75
2392E15n16j30K21Op9m10J00M47l96l13M43P2K6k47J17M60k41l08M86J57k16j32
2414F2j32K92K7m38K01j15o7k9j07J57L09m37L9M47k53N9J72j2K22k13n7L36l71
2437I2j54L72m47P7J66m70L01O5m68K73J7K3J41j99K92K13l75L7L44k29J34j12
2459I3q1K29k04k59O1l5J66k3n40N02K11n40L30L19k13J40r5J21K25m97K74J48
2481C32l12J49k81j61M79k52k62J50K2j30N2m3M07j69k05M04Ol18J73K02K1q1
2503A83k27K35o3l90J45J33r8R9l14q9N25l72r5N12lj69l3J78L11m96o4L24ok11
$$ y = [-82, 277, 253, -25, 22, -37, -43, 8, -385, -229, 114, -433, -219, 46, -15, -41, -263, -76, 430, 57, -32, 294, 200, 331, -19, -150, 369, 53, -289, 112, 50, -297, -273, -364, 145, -13, -482, 22, 242, -130, 110, 129, 263, 278, 22, 140, 515, -1, -131, 90, 96, 17, -393, -293, 154, -242, -555, -112, -40, -14, -261, -144, 316, 75, -233, 253, 410, 194, 62, -70, 222, 249, -189, 12, -103, -170, -199, -306, -149, 160, -277, -238, 209, -44, 15, 187, 175, 397, 184, 127, 463, 92, -62, 310, -137, -60, 106, -364, -63, 2, -466, -193, -176, -153, -12, -211, 81, 294, -81, -44, 300, 71, 205, 93, 12, 241, 37, -222, -161, -196, -30, -53, -593, -91, 120, -420, -90, 229, 16, 156, 61, 182, 407, -90, 184, 332, 20, 169, -112, -273, 206, -46, -308, -158, -136, -266, -214, -257, 150, -19, -224, 180, 186, -132, 41, 243, 264, 183, -44, 191, 128, -262, -117, 16, -82, 17, -297, -386, 139, -233, -328, 184, 181, 12, -21, 157, 468, -28, -92, 232, 226, 15]
2527A5Q8k00M5L2k55J85mj29kN3J05K04m58L26L40k90k1K02r4R1q1k5J94m75n
2552a59J68k11J32K09n40K67J34j84O0P1K45K1j34K51P3n42K47J09k45K24j76
2573B0k0N9k68o0J81j0J21k25k34N10m1l51M57J44l57Q5kJ18ok69L60k3k57J71
2597A03l27p2L27k81j20M63q0k22p7L25L09m71R4N54k82l32K94j11jj34j03K83
2619A39k63k11K55p0K1J48m25K80K89l26J11L45m8j89n0P1J01l31K0M36l54o7
2641a18J86k17P2j03k13M17l8r6P1j06K89K5k56L17K30m91J53O5p5N2j35K9k9
2664B9j86k0J31k94L16mk32K86k9p6J47P3O7k5j57L07r6m34M43r2k32K17k90k9
2688a80J32n1j20J62j12K29j78j22M95k98PK02O2j46J14k55L02j60l87L91jk15
$$ y = [15, 103, -97, -52, -20, -275, -90, -94, -223, -225, -172, -67, 137, -321, 5, 345, 55, 34, 236, 142, 233, 152, 127, 321, -154, -159, 9, -202, -70, 139, -401, -134, 0, -184, -124, -53, 192, 213, 79, 330, 403, -139, 108, 217, -28, 196, 20, 0, 59, -209, -269, -88, -98, 23, -202, -436, 74, 33, -318, 139, 283, -74, 11, 9, 127, 121, -148, 212, 189, -68, 103, -224, -296, 31, -250, -370, 93, 13, -209, -286, 39, 348, -123, -29, 525, 243, -89, 205, 94, 93, -41, -144, 139, -124, -335, -80, -150, -129, 19, -406, -126, 163, -163, -52, 293, 245, 56, 6, 77, 178, -153, -133, 303, -51, -118, 68, -149, -77, -180, -393, 24, -14, -110, -39, -145, 144, 169, -87, 230, 460, -31, 122, 187, 112, 164, 29, 58, 29, -157, -177, -46, -340, -24, -28, -260, 26, -3, -79, 68, 141, 208, 183, 26, 333, 237, -197, 246, 154, -78, 139, -151, -180, -48, -99, -219, -57, -169, 60, -118, -240, 255, -43, -36, 166, 228, 82, 196, -59, 243, 83, -304, 87, 86, -129]
2710a29j3j41J44J88k95Q3L26k10P6k0J24J96l45J51K68l91j65L17P4k28jj65
2732a56J56r9j74J46N5o1r3m2M68R9m38K27K04j99o3j8J60J39n11M3L33k96p6
2755a96J39l9L7r9j05N17l14l8K45p2m7J16j62M43k84k32J74J9j09Q6j88J03L0
2778B4l43L25K8l77K54N0o9K54k28N6K37j53L8P3r8K2J8k66K77j88q4J36k55J26
2802a43J72j99N1J10l7J36q9J2J85p5r3J24Oj58P4j74K23j60j45R7L7p3qn3J27
2827e3J14k25K09J14p0oJ1J33l4j86J08J55l42oJ36j42j4j09N7J97k65o5L72j07
2851a8j0p0j1K41K2j67J58J32j92p0J52j1r9l01K20M6k40j3J48N2J00j97pK81
2875A46k43J19K10l6l9k2m3J58k39n4Q9lk94J22j27K94q8k09J95K7r9J17o3J29
$$ y = [-129, -142, -283, -139, 49, -246, -163, 163, -47, 29, 9, 133, 329, -16, 135, 403, 12, -153, 164, 238, 10, 9, -156, 0, -99, -273, -127, -72, -133, -226, -268, 200, 299, -139, 88, 292, 93, 30, 12, 172, 311, -200, -157, 176, -120, -196, -57, -96, -59, -158, -263, 254, -60, -98, 147, 75, 28, 144, -18, 425, 141, -91, 83, 102, -7, 79, -109, -6, 24, -319, 6, 34, -343, -89, -39, -108, 146, -82, -26, 211, 58, 96, 169, 71, 93, 111, -155, 122, -66, -150, -14, -269, -143, 29, -170, -119, -9, -46, 90, 1, 13, 198, 123, 30, 154, 160, 2, 76, -98, 125, -35, -180, -83, -46, -119, -127, -180, -53, 61, -164, 45, 159, 89, 83, 94, 227, 193, 7, 115, 270, -72, -78, 58, -84, -98, -207, -150, 47, -218, -283, 89, -18, -28, -98, -109, 132, 154, -13, 145, 277, 85, 15, 167, 156, 57, -244, -24, 22, -218, -231, -83, -31, 69, -128, -135, 146, -97, 22, 232, 196, 157, 135, 92, 250, 11, -43, 46, 43, -251, -129, -256, 38, -50, -259, -64, -37, -136, -19, -82, 47]
2899D7K32l10j1J78k00J90M1k07J28j41p0J54k09j31K80k18J19j8p4L06jk01L02
2922A86k1j06K16k76j9K23k10j6rP2n2j80J9J45k6j75J17M7J53n9j20L19j29j40
2946d1J41M0J3j9k03N5J49k79J3J41j17p9K5J56O1l10J95P4j06K06k2l4J48j26
2970H1q8J91j4k00M0N8M4j36k95K11pj60K38nl0J62j87J36J10k48J87j4J4N8n5
2995I1j17J67k90l8K57j20l8pm5J98p7j97L22o3j31J42j00L2K37k24J16P3j79
3018IN1m8J2J01k52J00Mj99LL36k55K86r2j96K39Rp9R9j07J18L1k17Q7K7j55%
3044h8Q6K3o5j69J16J46k14N2R7m1J20M7j82K73p3j76K37o2o4j41n7R4K3k79L40
3069D3n9j88R1Q9r0J37j78K43J01k65K19j07J0J61j77l5K65k38k11K4J66n3j18
$$ y = [47, 279, -31, -42, 136, -64, 126, 167, -40, 88, -53, -123, 31, -178, -309, -29, -247, -128, -146, -220, 86, 85, -116, 186, 165, 59, 275, -1, -20, 203, -7, -23, -32, 40, -12, -192, -173, -28, -54, -229, -112, -65, 88, 29, -91, 228, 99, -41, 100, 140, 153, 134, -69, -14, 135, -144, -131, 10, -107, -186, -161, -5, 56, -254, -59, 15, -91, 115, 93, 59, 207, 81, -7, 184, 170, -30, 10, 68, 112, -24, -319, -108, -115, -275, -37, -42, -72, 90, -97, 39, 149, -99, 88, 74, 88, 146, 91, -26, 141, -149, -187, 70, -50, -88, -95, -140, 58, -19, -216, 106, 43, -88, 54, -46, -14, 223, -1, 115, 188, 9, 60, 12, 24, 125, -127, -27, -23, -222, -219, 117, -138, 148, 56, -140, 99, 108, 29, 128, 21, 139, 170, -47, 40, 67, -88, -88, -2, 21, -44, -213, -97, 49, -165, -113, -16, -57, 63, 110, -72, 201, 128, -48, 189, 127, 63, -78, -135, -41, -18, -297, 43, -16, -204, -113, -24, -114, 23, -155, 88, 189, -76, 143, 36, 46, 207, 30, -5, 260, 22, -189, -165, 1, -52, -170]
3092a70KK44j77j80L05K7k9n4O1M7j4j00J96n6q3P8k00%K61l66m0K58L2k72J07
3117a23N4N2mJ14J48j88RJ62l19J86O7j32J46j3k07j33J02O9j00j01J75O6j94
3140a64Q2K36k31J83L1j37K83k01l7O5j61K03K8k86O7M8l01J86J6l6K6k5J69p2
3164b8m5J67M2m0J66j00k18K61j50p7O0k17J46j09J5J57j17j69K66K8j71P3J82
3187A22j25J22k29J49J06j69J17j8p8J65j28j88L34j22l68K75M7l9j79Q1K79k61
3209a07L5J80j0j09P7k7J50j16j23K0J04l19J97ll2J86m55K33K59k05M3J6Q3K3
3233A00j23P8K69k50n0P1j41R8M0j90K31j70j38J1J00L1l8k4M1J59j25pR3j45
3257g9K48j02k1P7r5m3N4o5M9k4j66K14j49j4K04k71J04O6o6J61k0q1O7O5j35
$$ y = [-170, -168, 76, -101, -281, 24, 51, 22, -32, 29, 76, 62, -38, 158, 102, 19, 97, -103, -103, 158, -208, -248, 10, 42, -230, -123, -69, -17, -21, 93, 241, 53, 62, 224, -95, 91, 158, 26, 172, 159, -48, -181, -79, -10, -110, -211, -36, 30, -164, -82, 154, -77, 106, 137, 0, 283, 82, 45, 110, -51, 152, 180, -106, -39, 9, -292, -106, -90, -126, -100, -125, 44, -28, -73, 94, 136, 96, 262, 162, -56, 205, 55, -22, 38, -179, -33, -142, -127, 30, -87, -256, 10, 38, -133, -60, 122, -3, 119, -110, 39, 145, -24, 93, 75, -3, 162, 34, -154, 180, 58, -310, -35, 12, -27, -206, -125, 154, -107, -72, 108, 98, -11, 66, 39, 189, 73, -50, -30, 74, -245, -48, -51, -83, 103, -352, -119, 140, -65, -22, -6, 77, 100, -23, 55, 324, 74, 24, 95, -46, 52, 92, -98, 133, -37, -175, -164, -64, -33, -71, -95, -54, 105, -20, -27, 66, -79, 169, 67, 46, 123, 28, -15, 39, -26, 23, -1, -167, 47, -102, -116, 88, -183, -79, -13, -79, 82, 62, -19, 48, 113, -22]
3282b2J93j11k2Q8j83p3K40k05O7mp8J17o3L5J72j67qJ92j35R2P6j76R1R4k22
3307a2J67j47mk5j82K36n3k06P2K05k13J99r5J8J75j56J83Mr2q3K07j23J4O3l17
3332a65J65J20j95Qj15J85p6L5P3J4j07j4J39n1P3j36M6K13n3k19J13p9L5p2r7
3357a60J90m8j34K06q6n2M2m3K10q4m6p8J60M4j41Q6J4k4j01L0L1j19Q3p4m2J17
3383a9k7j2Oj5k2J47p4J08J5k09K12L8k13J49n4n5J38k23J2R4k09M4O8J43m2p1
3409g1P0J67p0k4Rj06J70j33n3M3j7j6K3m4NQr3kJ83j43M8Q8o0R2k04J43J00k67
3437a54J72J37k28N2l9K6J30q3j38K26m3k39J71j03O8M4KR4J4j97J51l8Q7r4q4
3462f6J47K9j67P9R3j83P1r8R5o1m5O5J23j8j10n6J72O9j60r7J86O1j53J55j38
$$ y = [-22, 171, 60, 38, 126, -57, -130, 110, -95, -28, -32, -110, 7, -56, -21, 151, -16, -24, 168, 33, 125, 201, 25, 116, 210, -12, 155, 8, 4, -21, -203, 33, -20, -226, -154, 51, -162, 37, -58, -40, 135, -21, 162, 166, 74, -9, 198, 75, 89, 152, -165, 0, 120, -75, -67, -182, 3, -73, -38, 35, 49, -58, -72, 67, 16, 89, -47, -1, 212, 159, -60, 53, -26, 9, -63, -160, 30, -18, -152, 54, -32, -84, -42, -85, 125, 41, -5, -83, 77, 121, -20, 66, 80, 56, -45, -15, 16, -103, -20, -94, -136, -19, -46, -58, -52, -67, -89, 58, -16, 92, 107, -102, 110, 148, -65, 84, 30, -25, 113, -110, -98, -4, -213, -169, -101, 42, 0, -71, -1, 166, 96, 72, 81, -25, 145, 12, -41, 2, -15, -31, -8, -52, -47, -39, -132, -134, 49, -94, -46, 42, -18, 74, -130, 13, 113, -154, 18, 155, -73, -21, -60, -34, 96, 13, -125, 101, 58, -181, -10, -113, -45, -1, 1, 95, 109, -88, 63, 25, 112, 18, -66, 81, 110, -57, 22, 115, -68, 3, -95, 0, -61, -106, -41, 82, 64, -46, -102, 70, 139, -21, -118, 68, 129, -24, 131, -7]
3487gkP9j01N4o1k0K9r1J24lj7M9R8j09J7M7o6J63j44J3Rp7J0m0q6j4J88k38J42
3516e4Q9n4j28R2J31r0m6R0O0j52R0qk2%j5q2J41q4K2R4j38J28j49r5K42n8q1
3543g7R0n9L6m4L2R1j6n4J3J53k14j4O1j02O8p0NJ89j41j09J13Q3N1q4qK04j04
3570I3r6Q9j9l9l3q8J88p0j12J80k00K0R3o6n3P9m9Q2L6Q6j89MJ8K58k07j7J86
3597A74j07k60K17j47J37K0j25J26q6nK9n0P8M1l3q9K29j80R6o6J23k4o8m6M8
3622C2r8N4J41j80jL4o7O0N0o7P5OL0n9p2J11j2q7J08O4j89O3k1m9J54j22N6l4
3650b0r5MLN7P4R8j47J34%l8P7j36J29nk52J98j07K5J1n7M3M5j07n1L9M5K0j2
3678b5O7M2l5J1K2r9Q7m8K2J9n8j18J18j2j39J66n1rRn5k7J01rl5K16j44q9Q6
$$ y = [-7, -9, 70, -31, 23, -38, -58, -29, -120, 4, 1, -16, 33, 131, 22, 39, 86, 20, 183, 39, 52, 61, -16, -6, -46, -132, -146, 42, -196, -54, 35, -19, -147, -55, 76, -14, -60, 30, 90, -62, 28, 20, -2, -2, -17, -99, 42, -42, -20, 74, -64, 64, -85, -180, 62, 4, -77, 13, -46, -10, -54, -22, 69, 53, -1, 12, 165, -49, -63, -2, -104, -36, -106, -101, 88, -53, -162, -49, 34, 85, 1, -7, 197, 93, -3, 86, 67, 28, -5, -93, 95, 25, -87, 93, -107, -87, 6, -60, -113, -34, -83, -1, 35, 121, -68, -64, -46, 212, 5, -12, 174, 67, -193, 24, -123, 14, 34, -91, 35, -51, -56, -27, -77, 1, 42, 9, -80, 149, -31, 65, -1, 122, 98, 30, -16, 32, -66, -12, 129, -51, -52, -18, -85, -25, 25, -42, 33, 39, 69, 10, -62, 49, 37, -50, 58, 122, -67, -4, -25, -74, 80, -42, 14, -20, -115, -111, -108, -51, 23, 121, -26, 108, 108, 70, 147, 11, 140, 135, -117, 81, -26, -1, 10, -47, -4, 41, -66, -117, -78, -33, -13, -25, 42, 84, 49, 60, 82, -17, 70, 22, 44, 63, 5, -113, 5, -7, -146, 20, -31, -40, -31, -86, -113, -12, -21, -56, 160, 16, -73, 13]
3706A3k3J76o1j29J79l45P6J53j06KJ41q8j6P3j11J13j10M5J41k03J31J3l9j9
3730FM8K2o6J1J4J1j33K2m7J10l0J03q0J08j03J1j5lQ3o6K8M8O5j55%J31k17N6
3758c8n9J11r3L8j9J26o2l9O6j60K36j25n5N8J08j73J3O6n1LL6N5j23p9R0j5N9
3785b6M7q4J00o4K6J35k3l5n1q8J29qj39L6M7Q1j09j0j18J03p9N4J44q6j1j05
3811a34%K13P4j96J20L0j51L9J19p4p8l2J50p5j10J66m2p8o7K3J31jm4o0N9L0
3837A2M5M5r4R8N6k34P0J09p1M6k00J25K1q1L4J3k0Nm2KJ66l8m4O2M9n9r7KR5
3866G5j78K8O9J29j71Q0j10kM5o4O0k3P1p8J48J0j49L8P3N6q0j12J82n4j30P3
3892a4Rl9j07J10jJ22m2k1o9J14l3p9J4P5L3r4L1Q7j55pj33J75j1nq3J50j3j48
$$ y = [13, -10, 166, 105, -24, 155, -190, -114, 39, -67, -65, 76, -12, -28, 45, -66, 47, -63, -18, 123, -80, 51, 64, 25, 6, 54, 76, 10, 21, 35, 46, -87, -65, -112, -2, -32, 71, -9, 99, -4, 7, -8, -11, 72, 6, 34, 82, 147, -8, -8, 123, -94, -38, -97, 14, -79, -41, -60, 66, 4, -35, 31, -129, 107, -18, -73, -15, 93, -80, -67, -1, -52, -49, -13, 42, -81, -160, -70, -85, -26, 21, -63, 37, -27, -1, 134, 111, 76, 25, -63, 66, 58, -81, -45, 2, 83, -26, -36, -154, -51, -130, -76, 68, -18, -29, -134, -134, 79, 153, -43, 77, 107, -44, -5, 114, 40, -38, -70, 80, 5, -105, 61, 19, -59, -126, -103, 28, 27, -17, -77, -18, 12, 57, 102, 8, 106, 162, -72, -2, 107, 36, 82, -118, 7, 28, -53, -19, -6, -26, -21, -63, -61, 105, 67, 23, 85, 134, 75, -22, -20, 75, -103, -75, -6, 123, -48, 32, -78, -80, -35, -99, -39, -62, 9, -69, 79, 89, -60, -22, 51, 107, 27, -85, 97, 43, -87, -14, -5, -44, -151, -41, -42, 80, 38, 17, -52, 62, 29, -50, -36, 39, 72, -22, 9, 96, -59, -66, -199, -24, -35, -40, -123, 27, 14, -134]
3920a34J93o1m6J48j73P7N7L0n3M2m9j27P2K0n9Q1q8K7J03j06J03j37j4O3M3M3
3946E5nq4J19LN6m7p5r9L1J04j69J23O2J5p6k1n5J71j32O1Rm8P9K0j31P5N1p9
3974A3rJ9k5p4J00M6j64M0M6l3K9k5O8M3m5o7M8N6l5r1J24op4L5K8m1r0J98p2
4003D2jO6q9q3N9K9j54J99p9L1m0l0K42j59k8J1L1l1j7m7P0p2K8p9J31o7n5N6
4031c6J11j16P4KN1j05J03j10l6J19K0p5P8q2n5Q0r7nM4J0l4N2j95K45pj21J9
4058f6L2J02m6j10J08K5q6L8L4j68K15j00j50J75M2k4o1o9J78o5P0k9p3M3O6p4
4084GP8O4j33P7j22K9o1rJ41j0n3q0J10o5o1J09j51J86o0pk4P2q0J4L6J47j37
4111A7l5J61r9j4P0L2q2%j90R2N4n4ql7J45Rn9P2l7l1j1oK7n7J04k4%j03k7J02
$$ y = [-134, 59, -2, -48, 100, -73, 4, 61, 91, 38, 80, 31, -96, -24, -4, -63, 18, -70, -43, 60, -46, 57, -80, -94, -31, 12, 55, 50, -34, 85, 88, 144, 97, 22, -77, -46, 58, -111, 12, 74, 89, 13, -8, -63, 108, -24, 37, 46, -2, 77, 97, -34, 41, 92, 13, 4, 23, -2, -76, 24, 70, -94, -54, -8, -41, -12, -37, 31, 74, 29, -38, 10, 66, 31, -60, 64, 58, -16, 19, 47, 6, -84, 114, 42, 41, 107, 18, -65, -6, 23, -131, 68, -11, 20, -20, -50, 192, 33, 5, 16, 47, 16, -1, -48, 22, -50, -22, -101, 30, -37, -92, -36, 75, -41, 33, 35, 86, -19, 84, -26, -62, 57, 77, 2, 80, -2, -57, 23, -74, -79, -35, -25, -59, -7, -202, 43, 36, -85, -66, -34, 68, 22, -88, 20, 45, -41, -3, 31, -137, 78, -22, -172, 3, 45, 21, -40, -109, 69, 4, 74, 45, -28, 15, 81, 7, 85, 149, 16, 93, -29, 0, -61, -70, 71, 61, 8, -72, 38, -27, -88, 21, -130, 56, -4, -11, -35, 37, -43, -29, 7, 154, 17, -18, 143, 44, 30, 100, 132, 50, 50, -140, -48, 6, -48, -56, -93, 52, 61, 2, 74, 37, 6, -5, -11, 16, -41, 63, 39, 39, -64, -91, 11]
4141A1rRj25J89j30J03j22Q2m9J70j15k0Q4M4j57L3O4j02j4l9P7K3m8q3K89l02
4167a37M2N7M2L5Mk3o6J43j74O4N3o9M4j03O9j54J58j4J32k40Q7R5j08J17m2N1
4193F3j8q6K2K1n4J09o8K6j06N9j5R5j41N6Q1n0q0J25k05J19J58j0O0j24r3J20
4219F4q1Kk5l4J46n8j05J05m2n8O1j2k3l0J1N7K9Jj9J4j21M7Q9o0O4m4R5j41P
4248f1R2R6p6On2n1m4J8J5J70j52J12n5Q3l8p6j9J43j1m6n8n4L9n8J07k5o0J6
4276c9J0m9M9K0L9j47J79J3k2p2O3k9J4j04K5O8O4Q4k63J48j67R6J75j08j66L2
4302h7J56r7m5J00R1q4J8j44J35Pm6Q1j51J9O1o9PK9N8j14J3l8R9L9q8j3L0J21
4330H8k6Kj17M6M8j1Q6k58R1mQ6j7q4J37lJq2K6o6J15j30P6o0m8K1J16J7l1O8
$$ y = [11, 2, 11, -114, 75, -55, 48, -74, 8, -41, 129, 14, -6, 78, 122, -35, -2, 62, -40, -54, -93, -16, 7, -41, -124, 165, -137, -95, -38, 4, 39, 43, 20, -46, 97, -77, -13, 40, -29, 15, -88, -19, -173, -15, -29, 103, -137, -50, 45, -63, 54, 12, 63, 45, -41, -19, 2, -52, 57, -11, 15, -91, -32, -47, 48, -93, -37, 44, -6, -86, 39, -166, -47, 111, 101, 161, 37, -56, 64, -17, -15, -40, -74, 72, 14, -91, 14, -28, -86, -25, -37, -60, -90, -79, -22, 7, 8, -11, 3, -118, -71, 18, -42, 22, -22, 73, -68, -61, 31, 127, 51, 57, 5, -46, -90, -72, -57, 113, -39, 73, 18, 101, 63, -13, -32, 111, 100, 54, -4, -58, -19, -77, 30, 5, -55, -39, -29, -78, -29, -9, 30, -117, 62, 75, 53, -19, 44, 15, 29, -75, -50, 18, 82, 166, -97, 51, -116, -20, 155, 47, -119, -87, 69, -28, -73, 27, 118, 34, 52, -92, 43, 50, 4, 85, -66, -47, 14, -55, -48, -19, 39, -75, -62, -100, -1, 38, -50, -63, -33, 88, 62, 64, -53, -7, 41, 30, 116, -142, -51, -55, 31, 14, -70, 67, 64, 65, -17, 9, -57, 58, -72, 4, -56, -104, -83, 33, 50, 19, 87]
4359H7o4j0o5qK4k8J56j12o5J80p7j26J9J64j47O6J8J25r0J03j44LL4m3m1k9K3
4386d7j1J16m4j45R8J24J6l6k2p9K9Q7k32J94j17P7k7n3Q8n5m3p1J03L3m4J33
4412G2l1j15OP2o8Q1O4nn4N4m4Kj56R8M2m1j06J23N9p5L5n9J13j67L3J54j43j2
4440f8M4M2j34J17K1q6Q6o4l2K15q4p4l5o8J64j68P0J28j08L9m3O3o3j11K46n2
4466D5m5k7j21J89l5n3q9R3j2J57j20l0K9O2ro1R0j49n4J59l7Rj0o1J02j1q3K0
4494e2J52q3p7K1J6K7Q6q6L3o3O6p3k4J10q8Nk9K2J63r5r6R2n7J0qJ3Q3l0j9q5
4524f6O9j05J67j3r0J20l9O0o7Jl5n0M7k8j02O5O0L6p1JL5n1J06r6Mq3R9N4k4
4553DJ41p9K1k8r3k7J02l1R5j29L3J11j12J8mj42J73n8K5J6n8L9j42J34l5Q5k0
$$ y = [87, 23, 13, -52, -60, -36, -64, 92, -20, -85, 95, 18, -108, -89, 75, -72, -6, 12, 137, 47, 150, 6, 9, 43, 0, -41, -70, -47, -58, 58, 14, -131, -33, 91, 107, 71, 49, -30, -1, 86, -146, 48, -69, 8, -19, -72, 16, -39, -82, -153, -50, -17, -61, 72, 41, -74, -68, 4, -64, 17, 81, 76, 22, 76, 32, 34, -122, -24, 18, -23, -129, -6, 53, -22, 13, -46, 67, -100, -67, 87, -56, -68, -24, 18, -116, 1, 22, -64, 22, -42, -74, 141, 57, -17, -52, -120, 44, -124, -54, 74, -34, 5, -38, 25, -38, -149, 97, 45, 0, -27, -148, 41, 6, -47, -136, -43, -55, 102, -18, -48, -19, 43, 34, -27, 63, -86, -140, 19, -18, -9, -19, -80, 22, 11, -72, -52, 100, 17, -60, -39, -23, 4, 90, 4, 37, -26, 40, -33, -57, 53, -35, -30, -59, -37, 126, 31, -65, 27, -30, -20, -28, -15, 68, 38, 19, -66, 3, -102, 65, 52, -38, 82, 43, 103, 36, 37, 2, -48, -1, -29, -131, -66, -6, 30, -41, -40, -5, -56, 50, -46, -42, -125, -26, 28, 4, 145, 66, 87, 59, -34, -61, 41, 10, 105, -24, 9, 120, 8, 26, 22, -120, 53, -5, 20, 36, -22, 17, -125, 9, -26, 59, 39]
4580C9o6K9k6Llr4J18lj6O4m7O1r2K9J10j87L9J47j24Q2j46J07RM8j28NM8l2l0
4609e6L9j8q7P1J04o3K9j6k5k5J09m3n8O1p0Q0QJ8l3kL3q5j04K02nm3p7L8R0j4
4639E8p5N4k9jLl5m6N4Q6Ml0q4N4k02K07j11O3K1j6M1j7K8M1l6p1P1j8j18O5J35
4669I6l1j30O9j22L1L8O5qmj1nL5p2J34o3ml5n9pP2KN0jj4j8o7N3L3q8L7j2k1
4701e7J13j3j13M7m0j7J31%L4j45P4N3n6O6j14R3m2n6P1m8J9r8P5j5M9k1kM1j6
4730A3n5L5M0Q0k9o4j8p8J13J8j6J32j51q6J30j38P1m4J33o4L0j26Q5p4rJ44%
4757G2op5N3%J8j17O5m6oK9qjj9L0J6M2o3N7m2LN5O1j19J3n2J8K6n3P2j2J2o3
4789d0O9j1j50R9L8J4N4L0j55J03k0KK4M2l7n4O5n7L2jn6L7qj01P2r4K01N9j26
$$ y = [39, -27, 2, -24, -21, -24, -118, 0, -3, -19, 45, -2, 59, -33, -4, 106, -81, -42, 105, -19, 63, -83, 24, 33, 81, -47, -42, 6, -26, -56, -17, -35, -122, -51, 53, -10, 19, 3, -22, -47, 62, 19, -39, 22, -48, 32, 40, 58, 25, 23, 56, -29, -133, 69, 64, 21, -56, -18, 72, 58, -17, 37, 8, 7, 10, -25, -71, -17, 69, 73, 43, -41, 13, -189, 18, -93, -30, -9, -25, 16, -1, 27, 68, 32, -39, 32, 14, -104, -39, 96, 65, -65, 4, -118, -87, -49, 16, 8, 4, -7, -12, 23, -49, 85, 22, 18, -17, -76, -83, -11, -9, 41, 40, 26, 8, -59, -6, 27, -61, -24, -36, -57, 56, 43, -70, -23, -63, -80, 51, 51, 85, -60, 14, 67, 11, 77, -37, 56, 14, -42, 29, -19, 0, -98, -23, -38, 11, -10, -12, 29, 13, -42, -7, 33, 113, 84, 20, 2, -76, 37, 55, 39, 171, 20, -66, 64, -74, -3, -47, 86, 22, 52, -74, 11, -63, -72, 72, 72, 66, -9, 44, 44, 62, -55, 10, -36, -42, -13, -21, -22, -41, -11, 5, 47, -16, 41, -1, 2, 57, 118, -1, 12, -40, -22, 4, -49, 23, 11, 23, -40, 29, 18, -132, -33, 5, 19, 73, 103, -52, 51, 31, 33, 57, 99, 62, 8, 73, 16, 48, 47, -9, 28, 20, -81, -9, -103, 98, 157, 31]
4818C1l2j13K1Q5N4o9j18J42qj4J62j68K2l9J04r5L7k1o7K4m1J62j62J72k0qj04
4845f3N0J54o8J0p4l7k0Q7n4n1J44lj12lK3l1J05m2Om2KQ4j12K2m1J93m5j53K7
4874d4J1K8J8q1O2n9Q0J8q0O1o8J0pP3rN1k2j52J22l5L5M2jn5r1J23qJ11j31L5
4904C7r3O9O2j42Q9q0J7n6J2N5m3NM3J5LLO0L5p8Kj9O1j08lpJ5P4j38J86Kk8q0
4936c0P2Jr7M8K7K6m2PR5m8p4J40j4m1j30pJ32r5n9J32P4p9o0J09j46P2K4p4m4
4965h1O9m2R9j9j08J74j44J18j62N4n3K25r5o4J34j61J75j07q8Q4J0O2%j59J78
4990I9p3l2j02M6J41j43j5O8J6mkm5N7k4J7l1J1R8L6j72m4Q2J63j48j3J9n9R4
5018D0j1l6M1mol4j8Q3j16J23j9k5m5M2Olj04R1n8J4qp0R6J6n0j13K11q0r5J03
$$ y = [31, -1, -114, -93, -8, 46, -23, -141, 1, -7, -21, 141, -27, -5, -44, 60, -35, 2, -19, -86, -62, -103, 59, -103, 69, 49, 41, -63, -13, 141, 73, 83, 9, -28, -48, 39, -15, -66, 78, 75, -37, -40, -17, -48, 57, 15, 21, -21, -19, 65, -47, -25, -66, 127, 82, -71, -44, -33, -5, 13, -68, -6, -65, 15, 33, -47, 14, -54, -44, -51, 22, 13, 64, 42, -110, 12, -23, 12, 54, 53, -2, -93, 30, 22, 133, 2, 37, -56, 13, 75, -67, 22, -58, -41, -97, -85, -30, -73, -68, -25, -10, -7, -4, 56, 91, 13, 15, -4, 57, -51, -54, -61, -46, 28, -110, 76, 78, 50, -30, 42, 43, -54, -6, 21, 47, 5, 12, 107, 59, -15, 125, 111, 70, -60, -67, 65, -30, -89, 43, 117, 38, -22, 87, -59, 13, 37, -37, -81, -12, -54, 45, 26, -82, 92, -52, 66, -96, -42, -95, 130, 35, -29, 105, -56, 119, 12, -76, 8, 18, 80, 80, -79, 99, 26, -6, -108, -62, 79, -64, -79, -11, 5, 1, -1, -46, 11, -13, 4, -27, -16, 82, 118, -54, -98, -16, 147, -1, -14, 5, -54, 40, 29, -7, 34, 30, 24, -10, -28, 55, -61, 62, 43, 18, -27, 15, 21, 18, -86, 5, -53, -39, -47, -117, -21, -5, -55, -168, 43, -37, -132, -29]
5048b9R4n6p9M3M4p9J12r0M8q4J59l7J9q7qo1L9Q0K1j46L2J10j55J06Q4j26P8
5075C2J1q0P6p2k6J26j01rJ12j0p2j6%L8k6n7L7N2j8j5M8j54J11N4q5N2LJ4q2
5104e7J06j02Q4l5n5r6K91q0p0r5J49l2l5N2O7j68J03p3N2J43j41L0N1p4Opk0
5131flK1Q2j07J02nj35N9rn9p2J48j3M3MN3j65J34jj01R4j15l5L8L6j16J76l8
5159A0j8l4M9M3OO3j45lK4q4K2P2P2j71R3r7K1J03L2J9j02m2Q4n4L3O4j7M9jn7
5189C4l9k0kn5J02q1J95j69Q9j26O1j20J54M0j8j67K33o9p0M5K2r2L7j49K9N5
5215h1J60j28M1J3L4N5q0L1o2m1J03q4m5J66j34j2R8J7PnJ5j71J42l9o0J69j60
5242e1J02m6p1l0J11L9n6q0pJ39m7L6pj03J7P3j07O0J01p8o2n1j5rJ20P2q8o2
$$ y = [-29, 65, 9, -70, -27, 17, -62, 50, -40, 8, -76, 83, 46, 65, -22, -30, -91, -52, 28, 49, -97, -65, 45, -110, -4, 80, -46, 32, 43, -37, 39, -33, -59, 67, -34, -43, 69, 59, -13, -29, -29, 9, -17, -74, -37, 15, -3, -18, 30, -124, -13, 41, -44, 8, 11, 25, -57, 49, -53, 31, -4, -59, -155, 136, 56, -14, -109, 40, 8, -27, 25, 92, -76, 27, -46, 6, 149, 8, 38, 89, 15, 21, 14, -6, -9, 12, 94, -13, 89, 84, -51, 8, -1, -60, -132, 16, 3, 46, 50, 103, -62, 72, 71, -30, 64, -51, -86, -48, -12, -128, 48, 10, -8, -42, 7, 50, 56, 119, -26, -29, -5, -89, -67, 5, 77, -94, -1, -98, -77, 26, 58, 77, -25, -67, 17, -37, -4, 60, 43, 92, 91, 34, -5, -25, -27, -82, 20, -61, 134, -35, 54, -72, -11, -131, 23, 63, 45, -122, 111, 42, -28, 17, 39, -53, -16, -165, -136, -81, 79, -49, -8, 5, 39, 94, 14, 45, -17, -58, 45, -39, -84, 82, -52, -64, 34, 51, 58, 53, 68, -103, 39, 0, -60, 109, -51, 51, 5, -66, -96, 15, 54, -2, -82, -89, 50, 3, 39, 32, -71, -54, 19, -88, -28, 73, -5, -67, -118, -133, -142, -22, 50, -38, -100]
5270a00K53p4j7j59J00J2J1l2J8L2L7l9o0j27J02K5j7Ll8J5J00j55O2q4L9oJ80
5297H1r0O9o4N8j77J15Qj11J22P9k17J87l7j27Q4Q6j30J66k18J71N3k37J95j51
5321h5o6Q7J98k23J27mk8j9K4o4m3J15j8o0M6j3Ql2J59j06K0L3j29J16k5o9O7
5348A6q1j8J17l1K0Pm6p9J12J6j2K7l7j2M4l0Q6po5k4n2K7J81j79RM2p4J18j19
5377d4J23j69J49lq5M1K6L2q5k3O6q7L0L2K4j20J98r7m3K1r5J23J06j09N5j56
5403i0J50o3%K0m7M3kO5j02L4j31K10Qr1j03o3R3O6j83K36n6m7R0m9q3L0R2K2
5431D9lp7M8kr1R9l4N7J23j31m1L3n4o5R3o9M4j00J02O1j7L1oo5qn0rP3Q6K0p9
5462A8l2ln9M5l1K3M8j00J41n5R7K9q5o7p4M1Q3m1p6J04N3n0On0M7JM1o0l6J62
$$ y = [-100, 153, 79, 62, -97, 3, 15, 26, -6, 12, 44, 81, 42, -18, -145, -43, -18, -35, -32, -70, -55, 45, -110, -48, -132, -93, -99, 81, -9, 60, -4, 54, -123, -8, 0, -111, 11, 90, -127, 60, 23, -104, -20, 66, -64, 102, -116, 55, 108, -129, 66, -85, -151, -64, 134, -89, 38, 34, 6, -13, 11, -53, -96, 19, 1, -59, -13, -26, -18, -50, 109, 3, 23, 56, -73, 43, 18, -51, 16, -65, -83, 34, 3, 23, 30, -16, -95, 17, 33, 21, 48, 11, -1, 43, 13, 99, 92, 27, 3, -49, -22, 159, -20, -11, 31, -43, 75, -44, 79, -90, 59, 56, -29, 12, 38, 70, -15, -38, 28, -59, -29, 3, 27, -93, 105, 8, -35, -14, -109, 14, 120, 11, 66, -90, 60, -3, -3, 17, -30, 13, 11, 76, -26, 8, -123, 87, 95, 4, -99, -162, -69, -3, -186, 50, -6, -53, 37, -12, -95, -65, 27, 49, 46, -31, 17, 15, -76, 23, -11, 46, 169, 38, -3, 30, -24, -89, 4, -65, -21, -121, -19, 42, 25, 56, 50, -15, -23, -73, -82, -9, 77, 97, 18, -14, -17, -76, -31, -62, -39, 9, -91, 50, -5, 92, 121, 36, -31, -105, -64, 19, -22, -98, 6, 59, 9, 15, -35, 12, 13, 54, -6, -42, 120]
5492A20j85N8NL0J6M0l2m7O1j1j08M6j1K1J9q0R9K0j03o1J45j26P1K9m6R0rk9
5520B2l5pN3o1j1J13k8M1j51J35k4j0n7L2kn8J12ml3m2p0M9L3k5M1L1J0q1Qk5
5550d4j1l8J21O5m6r5K1nm2J41p2J12j12o6L7KQ5J3O1q0j5Pn6M1o8l2NP4m5M9
5580GN1J7j23J55O6j01Oj04M7m4p4J04m3k2J4Q1P8j73N5K6p8J5P4j17J21l5J0
5607A3j7J20j37J07j11K3M4j35J42j49O2j6p4P4k2NK2N8L8o8jM9q0K4P3n7m0l6
5635h9J52m2p5L3K2m9n1M8l5Q2K1r6P1o9O5l9R4J01jj74j1J01q9L9n0J74o8ro4
5664hj3JJ5m1L0j1m6j3Q1J3J5l7J6j7J47j06J3r6P4K8l3K2r7j0l7O3L0J10k9j53
5694h9R4J34j38OjPL6m0J6J20j03O0j04K4Q3p9o2M5p8J00m3M4Jr6J37j8k8oK3
$$ y = [120, -65, -7, -2, 28, 44, 84, 52, 5, 66, 55, -53, -7, -18, 3, 22, -58, 41, 61, -42, -103, 42, -84, -13, 16, -30, 60, 51, 22, -13, -20, 33, -28, -39, 74, 46, 87, -64, 71, 47, 37, -20, 12, 10, -48, 64, 60, 27, -15, -85, -36, -3, -28, 13, 44, 54, -27, -19, -44, -55, -93, 28, 93, 47, -48, -27, -32, -74, 67, -5, 107, -5, -71, -34, -32, 53, 66, 127, 47, 32, 39, -17, 24, -44, -76, -71, 3, -42, 7, 58, 75, -48, 107, 173, 72, 78, -26, 21, -23, -97, 7, -36, -58, -44, 37, 115, -58, -3, 23, -55, -40, 34, -83, 38, 3, 13, -4, 116, -21, 86, -25, -2, 42, -93, 49, -100, -38, -54, -128, -54, -76, -71, -49, 9, 47, -21, -22, 27, -53, -29, 44, -13, -53, -89, 63, 21, -54, -21, 1, -48, -99, -51, -86, -4, 17, -79, -8, -77, -12, -51, 43, 144, 143, -31, -42, 59, -30, 9, -41, 133, 65, 56, -8, -21, -20, -5, -46, -16, -27, -73, -86, -5, 8, 23, -14, 2, -15, 132, 26, 39, -57, 17, 45, 12, 34, -63, -73, -110, -47, -17, 93, 64, -89, 5, 139, 1, 7, 6, 13, 49, 9, 25, 145, 42, 102, -2, 22, 105, 26, -36, 9, -69, 31, -12, 32, 33, -63, 74, 56, 28, 22, 45]
5723D5r6O2j6q1Q0j12R9K6r5J44j50j9R1M2j25L6Q2j00J05J7pq6L8K6Q4l9j09
5750e8L5P8j35O1J11j00lk0m7R8o7RQJ47j89L5lQ0j65J51j1j04K04j06j0n5k7
5777h3L4N9j4K4L7l2K7K6n5lJ23j22J2P2q1m5q6J67q4p7jjK8R5PJ22j78K6J0l5
5807b8J1J63j06j43J62r8L6K27k40NN0p0N4n5J10oj24j4Q6j13K38m3o2j51K49
5832A38r5n1P6k1p7O6Rj11K3JO8o2P8o7O7k9j7j07QM4O8jk0OK6m2O7k2l2J1P9
5863H1n6J3L4j43J46j34J79M3k19M6J25n5o5L7q0O8N7n0k1j58J15J08q2o3Q9J7
5889C2j5k2N3j52J43j41J84J3k75K46j07O1J2P7j38j1N1LJ47j63l1kN1m8J2J07
5915H7j39q5M7J20M0l6n2m8J73p0m2p0Q6j29J19k4n4JLrN5J9l3k4Q9q6M7J03k16
$$ y = [45, -51, 11, -5, -86, -6, -118, -19, 7, -88, 56, -94, -113, -22, 20, -105, -69, 13, -87, 18, 35, 28, -58, -20, 6, 90, 51, -58, -23, 55, -80, -19, 92, -8, -11, -31, -78, 20, -47, -38, -30, 117, -72, -37, -40, 40, -125, 26, 15, -89, 115, 9, -1, -56, -83, -49, 10, -4, 20, 57, 25, 52, 78, 23, 20, 143, 21, 33, 105, 24, -21, -107, 60, -24, -101, -102, -103, -75, 20, 27, 149, -29, -3, 7, -28, -17, 146, 40, -103, 59, -39, -3, 224, -16, -11, 39, -31, 23, -32, 78, 72, -52, -66, 20, -93, 145, 102, 40, -111, 138, 43, -8, 68, 47, -30, 36, 45, -66, -43, -42, 26, -36, 42, -25, 42, 13, -4, -111, -103, -59, 9, 8, -12, -6, 20, -22, 45, 23, -9, 2, 81, 25, 38, 72, -71, 75, -59, 120, 163, -56, -10, 115, 60, -5, 32, -48, 20, 77, 27, 6, -152, -37, 71, -11, -74, 15, 32, 17, -5, 48, -104, 39, -102, 82, 95, -180, 66, -41, 20, 32, 109, -29, -40, 11, 14, 161, -2, -33, -35, 16, -32, -20, 87, -52, -137, -90, 30, 70, 34, -18, -66, 107, 37, -5, -75, 11, -118, 1, -23, -77, -76, -73, -82, -27, -8, -41, -65, 24, -62, -15, 88, -128]
5944a28J22Lk8J37r3J7j58J93q6N9km0p2P0J57j90pN2k4N6lr4K4J7K3j6l6J24
5972G7o0j13J35o1l6K1J9%k3MMp2M6qJ18m1LJ9K0qj52J19ok1l8N9J2p7K4K37k31
6003c0j3M7j1O1oK5m6r6P2J6j1K4LK7r4J19j46O8n8K4j04K06n9n8j6Q6K7j0L5
6032H2j01N6kJ29j62J2n3J53j32L8M7j31j3J43j39L7q7K28j8j79J10m8j1P6j51
6057a16J01M5j62P8J21j82N8P6rO3R7k74J26%r3J01JN5Nn9m9J35j50K14q2o5K7
6084F2m3K2o9r4P1J33n0j35R3Rk2K7M8m3p3L9J13n2n0M1P5l6p3M5P5n6o8l5J9
6113b7M4o1R2j34J15K5n8O1J7Qm1q2p0J21J39q4mj00R2k3j6k1J06j10K2r3O6j7
6141c3n1J1M3P5j66P7P9m1P1j70J6J06J08j79M3n4J64j46k4J1M8K7J48r5j02N2
$$ y = [-128, -6, -3, -31, 106, 13, 30, -128, 65, -21, 38, 36, -4, -76, -6, 151, -39, -46, 6, -18, 38, 35, -59, -35, -18, 5, -11, -47, 77, 17, -96, 39, -22, -58, -37, -18, -18, -41, -37, -33, -105, -59, -67, 51, 10, 13, 32, 52, 44, -108, 11, 5, -16, -54, 5, 17, -60, -36, 201, -30, -43, 4, -7, 54, 48, 73, 27, -69, 3, 19, 8, 32, 35, 62, -32, 87, -59, 9, -49, -25, -129, 77, 18, -40, -56, 30, 57, 47, 82, -19, 37, 35, 164, 2, 14, -39, 114, -18, 20, 67, -64, -77, 66, -73, -36, -123, 105, 87, -92, 18, -30, -41, 35, -116, -15, 30, -132, -54, 67, -115, -57, 19, 10, 73, 170, -104, 22, 22, -71, 30, 31, 86, 91, 32, -17, 118, -32, 182, 100, 35, 62, 19, 41, -28, -122, -51, 82, 32, -103, -10, -1, -23, 4, 52, 9, -64, -25, 88, 36, -14, 27, 102, 66, -7, 38, 113, 57, -11, -46, -27, 17, -44, 48, -86, 29, 54, -4, 57, 74, 82, 41, -41, -111, 10, 149, 65, 61, -39, 53, 30, 14, -7, 99, -11, 11, -82, -16, -33, -84, -73, -30, 45, -121, -44, 35, -6, 65, -105, -89, 17, 125, -54, -11, -65, 99, -47, -71, -60, -12, 15, 163, 68, -34, 18]
6167A8K5o5K0o2P7J6j6q7P7P0j72R6p5Q5p8MN3kQn6Q3j2O8pm0q9R3J00k15J03
6197B0pp7Q9n8J20J5j57L1r8J12Q3q2n2J72j31K1J8q2R7k7q6N9K6j10J22p4q%
6225f4O7p4QJ33K6j00K9M3n0L2j16OK00j40q2R7j8O3r6J59r9r0J04qj4n5j0M4
6253eK5l6Nq0O4lJ06oj30N2j11J20o6N5Qj20R0l7O7M3j5l5O8j81J59k2r5L4P0
6282B4n2M3L3o9L2p8j6N7PMK9l4N8j0l6j76J52R1m1l4J1%jL9o8K2J5K0J3k5Lm6
6314c3J01k07J47lP8j01J9n6J01j12J42K6k0J4j67P9R4k9l7j19O9n4J46n6j28
6339a06J56r0O4k7J4J5j34R6Nm0K9O3p8R5r7K6K0j69O6O8K8M6Qj86J71m7qJ7n1
6368d6J17m3K2j34Q2P0j4l0j31P3p0P5LK2k6Oo9l4J44J37k24R4J13j69J40k7r6
$$ y = [18, 43, -22, -2, -64, 13, 29, 13, -74, 3, 73, -99, -3, -78, 7, -71, -67, -14, -16, -8, -64, 19, 7, 75, 68, 28, -61, 32, 132, -83, 20, 13, -64, 25, -33, 87, 102, -55, -24, -122, -10, 73, -9, -61, 111, -20, 1, 19, -63, 34, 7, -79, -20, 6, -104, 18, -56, -64, -64, 3, -71, -63, 70, 96, -4, 25, 68, 18, 50, -66, -60, 140, 0, -82, 15, -3, 60, -36, 123, 24, -66, 38, 30, 16, -39, -49, -5, 20, -16, -11, -91, -27, -30, 76, 70, -60, -8, -119, 1, -65, -10, -2, -122, -32, -69, -2, 41, 26, -9, 59, -122, 37, 15, -80, -46, 24, -28, 15, 48, -21, 11, -67, -83, -26, -19, -15, 14, -20, 38, 28, -8, -184, -32, 59, 18, -16, -5, -5, -6, 33, -35, -13, 2, 22, 35, 10, 13, -33, 68, -139, 8, 5, 83, -18, 1, -55, 46, -66, 76, 102, 82, 96, -71, 8, 102, 73, 36, -83, -14, -68, 78, 22, -106, 50, -40, 24, -3, 11, 26, -108, -12, -7, -47, -18, 45, -33, 62, -35, -9, 11, -158, -92, -24, 4, 50, 58, -128, 43, -4, -12, 5, -46, 71, 28, 50, -84, -2, 68, 54, 24, -107, -34, -104, -29, -26, -4, -30, -24, -93, -127, 17, 154, -70, 24, 137, -32, 108, 81, -15]
6395a5M1q0ml6O2k8qO8O5J1Rk4q3L6M7o9PJ1O2r6L1Q1q3R8j45R6N7j10J15oq7
6426B3j11k0J21l8K5K7J3Po7n4J8J51j2j23Rj0M4L2j02J04J2j32j7P2n8Q5j70
$$ y = [-15, 26, -54, -58, -94, -32, -60, -68, 0, 65, 76, 85, 61, -22, 14, 61, -8, -1, 10, 72, -24, 7, 88, 5, 103, -42, 54, 111, 1, 116, 110, 23, -88, -108, 13, -25, 0, 27, 40, 47, -20, -74, -56, 95, 83, -40, -31, -41, 3, 35, -67, 37, 49, -83, -100, -28, -86, -1, -171]
$$ [...]
8191D9
##END NTUPLES=NMR FID
##END=
