##TITLE=1H_DE-80H_X3
 200.13MHz, d2o
 8 sc
 
 19ns.26.2.2025
##JCAMPDX= 6.0         $$ Bruker NMR JCAMP-DX V2.0
##DATA TYPE= NMR FID
##DATA CLASS= NTUPLES
##ORIGIN= UXNMR, Bruker Analytische Messtechnik GmbH
##OWNER= pz
$$ XWIN-NMR		Version 3.5
$$ Tue Oct 28 10:56:35 2025 Russian Standard Time (UT+4h)  Yarkov@DPX200
##.OBSERVE FREQUENCY= 200.1313
##.OBSERVE NUCLEUS= ^1H
##.DELAY= (6, 6)
##.ACQUISITION MODE= SIMULTANEOUS
##.ACQUISITION SCHEME= undefined
##.AVERAGES= 8
##.DIGITISER RES= 18
##SPECTROMETER/DATA SYSTEM= spect
##.PULSE SEQUENCE= zg30
##.SOLVENT NAME= CDCl3
##.SHIFT REFERENCE= (INTERNAL, CDCl3, 0, 14.3821)
##AUDIT TRAIL= $$ (NUMBER, WHEN, WHO, WHERE, WHAT)
$$ ##TITLE= Audit trail, XWIN-NMR		Version 3.5
$$ ##JCAMPDX= 5.01
$$ ##ORIGIN= Bruker BioSpin GmbH
$$ ##OWNER= Yarkov
$$ C:/Bruker/XWIN-NMR/data/yarkov2/nmr/H-C/1/audita.txt
$$ ##AUDIT TRAIL=  $$ (NUMBER, WHEN, WHO, WHERE, WHAT)
(   1,<2025-10-28 10:55:10.71 +0400>,<Yarkov>,<DPX200>,
      <created by zg, POWCHK disabled, PULCHK disabled
       configuration hash MD5:
       00 E9 B6 7A A2 85 ED C7 34 08 36 98 17 FE 4E 26
       data hash MD5: 16K
       0D 40 5C 09 04 B0 B7 CC 02 58 4A CF 1F FA 59 71>)
$$ ##END=
$$ 
$$ hash MD5
$$ C2 74 A1 AA 40 61 77 65 B7 32 D7 34 DF 00 3C 37
##$RELAX= 
##$RELAX= 
##$RELAX= 
##$RELAX= 
##$RELAX= 
##$RELAX= 
$$ Bruker specific parameters
$$ --------------------------
##$DU= <C:/Bruker/XWIN-NMR>
##$EXPNO= 1
##$NAME= <H-C>
##$PROCNO= 1
##$TYPE= <nmr>
##$USER= <yarkov2>
##$AMP= (0..31)
100 100 100 100 100 100 100 100 100 100 100 100 100 100 100 100 100 100 
100 100 100 100 100 100 100 100 100 100 100 100 100 100 
##$AQSEQ= 0
##$AQ_mod= 1
##$AUNM= <au_zg>
##$AUTOPOS= <>
##$BF1= 200.13
##$BF2= 200.13
##$BF3= 200.13
##$BF4= 200.13
##$BF5= 200.13
##$BF6= 200.13
##$BF7= 200.13
##$BF8= 200.13
##$BYTORDA= 1
##$CFDGTYP= 0
##$CFRGTYP= 5
##$CHEMSTR= <none>
##$CNST= (0..31)
1 1 145 1 1 1 1 1 1 1 1 1 1 1 1 1 1 1 1 1 1 1 1 1 1 1 1 1 1 1 1 1 
##$CPDPRG= <>
##$CPDPRG1= <>
##$CPDPRG2= <>
##$CPDPRG3= <>
##$CPDPRG4= <mlev>
##$CPDPRG5= <mlev>
##$CPDPRG6= <mlev>
##$CPDPRG7= <mlev>
##$CPDPRG8= <mlev>
##$CPDPRGB= <>
##$CPDPRGT= <>
##$D= (0..31)
0 0.7 0 0 0 0 0 0 0 0 0 0.03 0 0 0 0 0 0 0 0 0 0 0 0 0 0 0 0 0 0 0 0 
##$DATE= 1761634510
##$DBL= (0..7)
120 120 120 120 120 120 120 120 
##$DBP= (0..7)
150 150 150 150 150 150 150 150 
##$DBP07= 0
##$DBPNAM0= <>
##$DBPNAM1= <>
##$DBPNAM2= <>
##$DBPNAM3= <>
##$DBPNAM4= <>
##$DBPNAM5= <>
##$DBPNAM6= <>
##$DBPNAM7= <>
##$DBPOAL= (0..7)
0.5 0.5 0.5 0.5 0.5 0.5 0.5 0.5 
##$DBPOFFS= (0..7)
0 0 0 0 0 0 0 0 
##$DE= 6
##$DECBNUC= <off>
##$DECIM= 32
##$DECNUC= <off>
##$DECSTAT= 4
##$DIGMOD= 1
##$DIGTYP= 9
##$DL= (0..7)
0 120 120 120 120 120 120 120 
##$DP= (0..7)
150 150 150 150 150 150 150 150 
##$DP07= 0
##$DPNAME0= <>
##$DPNAME1= <>
##$DPNAME2= <>
##$DPNAME3= <>
##$DPNAME4= <>
##$DPNAME5= <>
##$DPNAME6= <>
##$DPNAME7= <>
##$DPOAL= (0..7)
0.5 0.5 0.5 0.5 0.5 0.5 0.5 0.5 
##$DPOFFS= (0..7)
0 0 0 0 0 0 0 0 
##$DQDMODE= 0
##$DR= 18
##$DS= 0
$$ [...]
##$SUBNAM2= <"">
##$SUBNAM3= <"">
##$SUBNAM4= <"">
##$SUBNAM5= <"">
##$SUBNAM6= <"">
##$SUBNAM7= <"">
##$SUBNAM8= <"">
##$SUBNAM9= <"">
##$SW= 18.0517328524113
##$SWIBOX= (0..15)
0 0 2 0 0 0 0 0 0 0 0 0 0 0 0 0 
##$SW_h= 3612.71676300578
##$TD= 16384
##$TD0= 1
##$TE= 0
##$TE2= 300
##$TE3= 300
##$TEG= 300
##$TL= (0..7)
0 120 120 120 120 120 120 120 
##$TP= (0..7)
150 150 150 150 150 150 150 150 
##$TP07= 0
##$TPNAME0= <>
##$TPNAME1= <>
##$TPNAME2= <>
##$TPNAME3= <>
##$TPNAME4= <>
##$TPNAME5= <>
##$TPNAME6= <>
##$TPNAME7= <>
##$TPOAL= (0..7)
0.5 0.5 0.5 0.5 0.5 0.5 0.5 0.5 
##$TPOFFS= (0..7)
0 0 0 0 0 0 0 0 
##$TUNHIN= 0
##$TUNHOUT= 0
##$TUNXOUT= 0
##$USERA1= <user>
##$USERA2= <user>
##$USERA3= <user>
##$USERA4= <user>
##$USERA5= <user>
##$V9= 5
##$VALIST= <valist>
##$VCLIST= <CCCCCCCCCCCCCCC>
##$VD= 0
##$VDLIST= <DDDDDDDDDDDDDDD>
##$VPLIST= <PPPPPPPPPPPPPPP>
##$VTLIST= <TTTTTTTTTTTTTTT>
##$WBST= 1024
##$WBSW= 4
##$XGAIN= (0..3)
0 0 0 0 
##$XL= 0
##$YL= 0
##$YMAX_a= 121531
##$YMIN_a= -91666
##$ZGOPTNS= <>
##$ZL1= 120
##$ZL2= 120
##$ZL3= 120
##$ZL4= 120
##$ABSF1= 10
##$ABSF2= 0
##$ABSG= 5
##$ABSL= 3
##$ALPHA= 0
##$AQORDER= 0
##$ASSFAC= 0
##$ASSFACI= 0
##$ASSFACX= 0
##$ASSWID= 0
##$AUNMP= <proc_1d>
##$AZFE= 0.1
##$AZFW= 0.1
##$BCFW= 1
##$BC_mod= 2
##$BYTORDP= 1
##$COROFFS= 0
##$CY= 83.5205535888672
##$DATMOD= 1
##$DC= 2
##$DFILT= <>
##$DTYPP= 0
##$F1P= 10.8118882576601
##$F2P= -7.23987719738617
##$FCOR= 0.5
##$FTSIZE= 0
##$FT_mod= 4
##$GAMMA= 1
##$GB= 0.15
##$INTBC= 1
##$INTSCL= 1
##$ISEN= 128
##$LB= 0.25
##$LEV0= 0
##$LPBIN= 0
##$MAXI= 10000
##$MC2= 0
##$MEAN= 0
##$ME_mod= 0
##$MI= 1.114404
##$NCOEF= 0
##$NC_proc= 0
##$NLEV= 6
##$NOISF1= 3.799351
##$NOISF2= 2.8
##$NSP= 1
##$NTH_PI= 0
##$NZP= 0
##$OFFSET= 14.38212
##$PC= 1
##$PHC0= -4589.296
##$PHC1= 12.42191
##$PH_mod= 1
##$PKNL= yes
##$PPARMOD= 0
##$PSCAL= 0
##$PSIGN= 0
##$REVERSE= no
##$SF= 200.129724274929
##$SI= 16384
##$SIGF1= 3
##$SIGF2= 2
##$SINO= 400
##$SIOLD= 16384
##$SREGLST= <1H.CDCl3>
##$SSB= 0
##$STSI= 0
##$STSR= 0
##$SW_p= 3205.1282051282
##$SYMM= 0
##$S_DEV= 0
##$TDeff= 0
##$TDoff= 0
##$TI= <>
##$TILT= no
##$TM1= 0
##$TM2= 0
##$TOPLEV= 0
##$USERP1= <user>
##$USERP2= <user>
##$USERP3= <user>
##$USERP4= <user>
##$USERP5= <user>
##$WDW= 1
##$XDIM= 8192
##$YMAX_p= 0
##$YMIN_p= 0
$$ End of Bruker specific parameters
$$ ---------------------------------
##NTUPLES= NMR FID
##VAR_NAME=  TIME,          FID/REAL,        FID/IMAG
##SYMBOL=    X,             R,               I
##VAR_TYPE=  INDEPENDENT,   DEPENDENT,       DEPENDENT
##VAR_FORM=  AFFN,          ASDF,            ASDF
##VAR_DIM=   8192,          8192,            8192
##UNITS=     SECONDS,       ARBITRARY UNITS, ARBITRARY UNITS
##FACTOR=    0.0002768,     1,               1
##FIRST=     0,             0,               0
##LAST=      2.2672688,     0,               0
##MIN=       0,             -91666,          0
##MAX=       2.2672688,     121531,          0
$$ Real data points
##PAGE= N=1
##DATA TABLE= (X++(R..R)), XYDATA
0@%%%%%%%%%%%%%%%%%%%%%%Kj0J6j6J6j6J6j8K6l2L2l5M3m8N3o1O8p6Q5r5J05
$$ 0 0 0 0 0 0 0 0 0 0 0 0 0 0 0 0 0 0 0 0 0 0 0 2 -8 8 -8 8 -8 8 -10 16 -16 16 -19 24 -24 29 -32 36 -40 45 -50 55
43E5j16J30j45J61j78J95k14K35k58K84l14L47l81M20m66N15n74O44p23Q18r32
$$ 55 -61 69 -76 85 -93 102 -112 123 -135 149 -165 182 -199 221 -245 270 -304 340 -383 435 -497
64d97J074j254J482j754J909p5Q5578k023l9260M4186j8347q9279j9115L0982
$$ -497 577 -677 805 -949 960 885 86463 84440 45180 89366 71019 -18260 -37375 -6393
78f393k9171k1060K6099k090q810N0269K5706k4816K7834M3880n5402n4503M3406
$$ -6393 -35564 -56624 -30525 -32615 -41425 8844 34550 9734 37568 81448 26046 -28457 14949
91A4949Q877p5272m138N9356k3380m8237M6074N2539r492J4769L9124j9951m0288
$$ 14949 23826 -51446 -55584 3772 -19608 -67845 -21771 30768 21276 36045 75169 55218 14930
104A4930j4639l9734l9001L1246L0037k2015K4467O8710j1879m4227M1544L6168
$$ 14930 291 -39443 -78444 -47198 -17161 -39176 -14709 54001 42122 -2105 39439 75607
116G5607o0792m0928K7915j7843n6088J3385M4747L651R928L1568O5o922J6749
$$ 75607 14815 -26113 1802 -16041 -72129 -58744 -13997 -10346 -418 31150 31215 24293 41042
129D1042j2415l2335J3448P351n5902k6863M2548O645l0199L9201O6202j0783
$$ 41042 28627 -3708 9740 17091 -38811 -65674 -23126 -16481 -46680 -7479 58723 47940
141D7940l0522J9135J208m4593j9917Q489r442q268Q837P76J1014L7988J4687
$$ 47940 17418 36553 37761 -6832 -26749 -18260 -27702 -35970 -27133 -26357 -15343 22645 37332
154C7332j3192J7009J7217m5149m5522J6079N925l9368k196M4086R099j6446K1439
$$ 37332 24140 41149 58366 13217 -32305 -16226 -10301 -49669 -51865 -7779 1320 -15126 6313
167F313L3974J395q657l468j5027j9334j6621k2543m870K7751J4890j0293J8552
$$ 6313 40287 41682 33025 29557 14530 -4804 -21425 -43968 -48838 -21087 -6197 -16490 2062
180B062L9428m896k6431J4445J7083l3624l6234M121K047k0304o82K8582K5108
$$ 2062 41490 36594 10163 24608 41691 8067 -28167 -24046 -21999 -42303 -42985 -14403 10705
193A0705J0989N349L062M158m060k3816k0347M261k650k7765p184L0614J7254
$$ 10705 21694 27043 30105 34263 30203 6387 -13960 -9699 -12349 -40114 -47298 -16684 570
206E70p266J5908L5057J768k5388q272K385j7542k6249p990Q108O066M81P866
$$ 570 -6696 9212 44269 46037 20649 12377 14762 -2780 -29029 -37019 -28911 -22845 -22364 -14498
220a4498K4892K4506J56j0434M577L39k9546k9833K848Q499j3185m507K6359K3562
$$ -14498 10394 34900 35056 24622 29199 29538 -8 -29841 -26993 -18494 -31679 -36186 -9827 13735
234A3735j582J57J7524Q733j6026k0288o352l537j5529j5322P000K1561R123j140
$$ 13735 12153 12310 29834 38567 22541 2253 -4099 -7636 -23165 -38487 -31487 -9926 -803 -1943
248a943J4370K3034n36j9136m717M336j7251k8351n179J2357J418l196J7409K8479
$$ -1943 12427 35461 34925 15789 11072 15408 -1843 -30194 -35373 -23016 -21598 -24794 -7385 21094
262B1094J0672o577j109M558j0693k5821j5306L507K75j0801K075K3729J7302
$$ 21094 31766 25189 24080 28638 17945 -7876 -23182 -19675 -19400 -30201 -28126 -4397 12905
275A2905k267K325J6868L881k0393j6537J169m360j9511r124J4082J4500M03M314
$$ 12905 10638 12963 29831 33712 13319 -3218 -2049 -6409 -25920 -35044 -20962 -6462 -6059 -1745
289a745K0444J5883o816j3183r44k594k1127k1602J932J1934q89r29J9335K3239
$$ -1745 18699 34582 27766 14583 13639 11045 -10082 -31684 -29752 -17818 -18707 -19636 -301 22938
303B2938J860q075M527N684j4795k3185o758L738o710j0033R219K2494J0146k228
$$ 22938 24798 16723 21250 26934 12139 -11046 -17804 -14066 -20776 -30809 -21590 904 11050 8822
317H822P313J4441l206j9962j0128K383q171j8810l310J5057Q813j723Q902K1493
$$ 8822 16135 30576 27370 7408 -2720 -337 -8508 -27318 -30628 -15571 -6758 -8481 421 21914
331B1914R595j0279q617J645o387k1672j4201O372P626m389K216K0684J7098l079
$$ 21914 31509 21230 12613 14258 7871 -13801 -28002 -21630 -14004 -18393 -16177 4507 21605 18526
345A8526n061P525J363j7950j7607k87K242r352n899J2720J7091L655o87J0970
$$ 18526 13465 20990 22353 4403 -13204 -13491 -11249 -20601 -26500 -13780 3311 6966 6279 17249
359A7249J2221o491j6850n528M91j3355j7736K274J5638M787o65J3765J8565P57
$$ 17249 29470 22979 6129 601 1092 -12263 -29999 -27725 -12087 -7300 -7965 5800 24365 25122
373B5122j1063k597K053j0142j7538o409N788K007m764M920J8288J1818m271j571
$$ 25122 14059 11462 13515 3373 -14165 -20574 -14786 -12779 -17543 -12623 5665 17483 13212 11641
387A1641R287j209j9578j2694M201j394j2863o34J6248J0454j108M593J3231N314
$$ 11641 20928 19719 141 -12553 -8352 -9746 -22609 -23243 -6995 3459 2351 6944 20175 25489
401B5489r016j1389l738l076j2453j2259N295J4327J680k431J4068J6650m545
$$ 25489 16473 5084 1346 -1730 -14183 -26442 -21147 -6820 -5140 -7571 6497 23147 18602
414A8602j0838M640L052j6030j6013J172L929m417p45J1060J3643N593k138K16
$$ 18602 7764 12404 15456 -574 -16587 -15415 -11486 -15903 -16648 -5588 8055 13648 11510 11726
428A1726N801k038j5677r670M905k753j5539m8J8755P901m067R344J5971k922
$$ 11726 17527 15489 -188 -9858 -4953 -7706 -23245 -23293 -4538 3363 -704 8640 24611 21689
442B1689j4385m508K5p490r588l042L981O017Q10k10J1821J5424k376j0562L924
$$ 21689 7304 2796 2821 -4669 -14257 -17299 -13318 -7301 -6491 -6701 5120 20544 18168 7606 11530
457A1530K656j9005j5991Q154O877r268m02J5894P894l303K866P912J642n485
$$ 11530 14186 -4819 -20810 -12656 -5779 -15047 -15449 445 8339 5036 7902 15814 17456 11971
471A1971r928q889j812k403r020J619J7846P588p931M917J6125l568j4840K609
$$ 11971 2043 -6846 -8658 -11061 -20081 -18462 -616 6972 -959 3958 20083 16515 1675 4284
485D284O075j3435j4890K079N022m18M434J0040Q417M946k859q558m63L504j0135
$$ 4284 10359 -3076 -17966 -15887 -10865 -11283 -6849 3191 11608 16554 13695 5137 4674 8178 -1957
500a957j2106O116N147j3386m364J9131J1605n407M417J2643m969j5500m908Q5
$$ -1957 -14063 -7947 -2800 -16186 -20550 -1419 10186 4779 9196 21839 16870 1370 -3538 -3453
514c453m134l000p51N46O268N080k362N174J5757M34j5508k544N074j3391j5148
$$ -3453 -7587 -10587 -11338 -10792 -4524 556 -1806 3368 19125 19559 4051 1507 6581 -6810 -21958
529b1958R303J2212n399k216J1816N630l894J582M677o84l861q244j1116j528
$$ -21958 -12655 -443 -5842 -8058 3758 9388 5494 7076 11753 11069 7208 -1036 -12152 -13680
543a3680M806l402j76J6271R957j0013k870J2938r8j4074m86O635r514j3219J897
$$ -13680 -8874 -12276 -12452 3819 13776 3763 893 13831 13733 -341 -827 5808 -3706 -16925 -15028
558a5028O844K897N622P220L483K335k836j0352k872O539m653j2300L579R028
$$ -15028 -8184 -5287 335 7555 11038 13373 10537 185 -2687 3852 -801 -13101 -9522 -494
572d94q081o125J5597J3233n417k035P296l800j3185m560J350q68K33L20q13N289
$$ -494 -8575 -14700 897 14130 8713 6678 13974 10174 -3011 -7571 -6221 -7089 -6856 -6536 -7349 -2060
588b060P017j587J94J1257J838j5628p265N712n282j1579O475J3310j778m507
$$ -2060 4957 3370 3564 14821 16659 1031 -6234 -522 -5804 -17383 -10908 2402 624 -3883
602c883O926N702k090k74J515k026l444o145r062n29P997P30k234J0444J0021
$$ -3883 3043 8745 6655 6381 7896 5870 2426 -3719 -12781 -13310 -5313 -4583 -6817 3627 13648
617A3648p571o669Q539K922j1620m400N301l768r252J348P482M265M044L579N94
$$ 13648 6077 -592 7947 10869 -751 -5151 150 -3618 -12870 -11522 -4040 225 4269 7848 8442
632H442Q03j771q669m483N442q36r925P53R827j423n247R569J1382l942o038K467
$$ 8442 9245 7474 -1195 -5678 -236 -1072 -10997 -10244 -417 -1840 -7087 2482 13864 9922 3884 6351
648F351j284q357m353J184P65P44K78l19M877P206p85k630N638J680j1858p817
$$ 6351 5067 -3290 -7643 -6459 -5694 -4950 -4672 -4991 -114 7092 6307 3677 9315 10995 -863 -8680
664h680N051J92p551K448J0528J630l911K962N025p12k674j468j882j876l723
$$ -8680 -3629 -3437 -10988 -8540 1988 3618 -293 2669 7694 6982 4308 2840 958 -918 -4641
679d641n732N93P493J885k534O013Q274m070o889L625K970q044o216K779R13m016
$$ -4641 -10373 -9780 -2287 -402 -2936 3077 11351 7281 392 4017 6987 -1057 -7273 -4494 -3581 -7597
695g597L09N904M985K101o5n55J061j058o529m129L396K21o327OQ200K237l482
$$ -7597 -7288 -1384 3601 5702 5637 5082 6143 5085 -1444 -5573 -2177 -1956 -8283 -8277 -77 2160 -1322
712a322L657P233j332o100r06O03l817m504n03K602K297m6K16M397M912j802l520
$$ -1322 2335 9568 8236 2136 1230 1833 -1984 -6488 -6991 -4389 -2092 -2138 -1922 2475 7387 5585 2065
729B065K246J013p109n888K894K479l376PO773L903j817n44K850P34l634m190
$$ 2065 4311 5324 -1785 -7673 -4779 -2300 -5676 -5669 1104 5007 3190 2646 5496 6230 2596 -1594
745a594j035M71k418l428K055N953J712j549L243N005j877n611m52J583l748n079
$$ -1594 -2629 -2158 -4576 -8004 -5949 4 1716 167 3410 8415 6538 927 475 2058 -1690 -6769
761f769Q52L448K13j055K757N047J333k386r20J725j446n457k707K266O62k968
$$ -6769 -5917 -2469 -2256 -3311 -554 4493 5826 3440 2520 4245 2799 -2658 -5365 -3099 -2437 -5405
777e405M00N615L253j502M01L652J37n001l777M86l36l557j437L895L882m47k14
$$ -5405 -5005 610 3863 2361 2762 6414 6551 1550 -2227 -1741 -2077 -5634 -7071 -3176 706 259 45
794D5L803K832k537l393O20N24l892l942J291K861o15r34L600M600k76k577P40
$$ 45 3848 6680 4143 750 1370 1894 -1998 -5940 -4649 -1788 -2403 -3337 263 4863 4587 2010 2750
811B750J823k789m831o53J835j319k543J924M901J680j139J312K980r91m541k185
$$ 2750 4573 1784 -3047 -3700 -1865 -3184 -5727 -3803 1098 2778 1639 2951 5931 4940 399 -1786
827a786J146r90l555m04L972K125j271Q20M200J311l035j960J308n18m141k313
$$ -1786 -640 -1630 -5185 -5589 -1617 508 -763 57 4257 5568 2533 573 1881 1363 -2778 -5091
843e091J995J694j388j24L924L371j188j376J851Q91l850l944L52J095j949j303
$$ -5091 -3096 -1402 -2790 -2914 1010 4381 3193 1817 3668 4559 709 -3235 -2883 -1788 -3737 -5040
859e040L092L878M5j150J863K123j726l478l71J261j966l384P44L401M72j283
$$ -5040 -1948 1930 1975 825 2688 4811 3085 -393 -764 497 -1469 -4853 -4109 -708 -236 -1519
875a519K274L795j02k845n08R39j883l652q54K016Q44j212P29L869K283j792q00
$$ -1519 755 4550 4448 1603 1095 2034 151 -3501 -4355 -2339 -1495 -2707 -1978 1891 4174 2382 1582
892A582K138j39m305k430J736K72k766j01L469J968r48K26K490J106j927k521
$$ 1582 3720 3581 -724 -3154 -1418 -1146 -3912 -4013 -544 1424 476 702 3192 4298 2371 -150
908a50j34M60k332k720J476L355j26j258K921L359j735k792J207R87l184k904
$$ -150 -284 176 -2156 -4876 -3400 -45 -171 -1429 1492 4851 3116 324 1531 2518 -666 -3570
924c570O50J043o18l29J951K931J330j229o78J456l17l869j599K446j07l412K24
$$ -3570 -2920 -1877 -2495 -2824 -873 2058 3388 2159 1481 2937 2620 -1249 -2848 -402 -509 -3921 -3697
941c697L955P95j565J683L194o47k673j010o2j039j662q15J269K152j94r54K438
$$ -3697 258 1053 -512 1171 4365 3718 1045 35 -27 -1066 -2728 -3543 -2274 -122 -316 -1270 1168
958A168L117j428k514J706R23m303k963K300J280j974L79L171J168r42o9R61M92
$$ 1168 4285 2857 343 2049 2972 -1331 -4294 -1994 -714 -2688 -2309 862 2030 1088 1019 1980 2472
975B472n41k133j580P02l28k551N68M454J202k425J245L102j784l508J083J731
$$ 2472 1931 -202 -1782 -1080 -1408 -3959 -3391 1063 2265 -160 1085 4187 2403 -1105 -22 1709
991A709k395k332P22P35l42O16J405J895J611q81k392K74R06k776k299K675J659
$$ 1709 -686 -3018 -2296 -1561 -1903 -1287 118 2013 3624 2743 351 625 1531 -1245 -3544 -869 790
1008G90l169q41L966J387k025J022K676j177l027q26o4m65LO2L61J889O94j813
$$ 790 -2379 -3220 746 2133 108 1130 3806 2629 -398 -1224 -1288 -1753 -1750 -1688 -1327 562 1256 -557
1026e57O63L535m41l338L24J629l393l248K514K608j313%K638N82j344k6M24Q
$$ -557 106 3641 3200 -138 186 1815 -1578 -4826 -2312 296 -1017 -1017 1621 2203 859 833 1257 1265
1044A265l4j386k270K50J248j374k87M175K186k939p54K655r95l482O33K280j637
$$ 1265 1231 -155 -2425 -2175 -927 -2301 -2588 1587 3773 834 80 2735 1740 -1742 -1109 1171 -466
1061d66k191P52Q06K9J052J294P64R58n20k930o80J729j269k505J858K427k327
$$ -466 -2657 -1905 -1099 -1070 -18 1276 2040 2998 2478 -452 -1132 597 -672 -3177 -1319 1108 -1219
1078a219j529L539K131j808k01J859j178k922o21L25k0P66M75m35J276J220j549
$$ -1219 -2748 791 2922 1114 913 2772 1594 -1328 -1949 -1624 -1644 -878 -403 -838 438 1658 109
1095A09l32K961L33l511q18J815j802k889K115L109p77o61J758M43j176q6K18
$$ 109 -223 2738 3071 -440 -1258 557 -1245 -4134 -2019 1090 313 -348 1410 1853 677 591 809
1112H09l47O2q85k092K00J983n17o76K971K071k536j646K068r0k865m8J898q33
$$ 809 462 524 -361 -2453 -2253 -270 -787 -1463 1508 3579 1043 -603 1465 1375 -1490 -1538 360 -473
1130d73j847P02J329M34Q72O17j59M45m86k367p70J814k47k238J030K383j256
$$ -473 -2320 -1618 -289 145 1017 1634 1475 1920 1434 -933 -1703 111 -136 -2374 -1344 1039 -217
1147b17j455K404J973j461r31R51o91j820n32M64L60P52J68l91J035J248j183
$$ -217 -1672 732 2705 1244 313 1264 573 -1247 -1779 -1315 -955 -203 -35 -426 609 1857 674
1164F74p05J814J72k944j027J592m37j719J380K507j75q43O53L97n96m87l40k07
$$ 674 -31 1783 1955 -989 -2016 -424 -861 -2580 -1200 1307 1132 289 942 1339 743 256 -84 -291
1182b91J90o48j257N71J831j52q48J788J428j799j342J190K22j994o84J096J16
$$ -291 -101 -749 -2006 -1435 396 244 -604 1184 2612 813 -529 661 883 -1111 -1795 -699 -583
1199e83o37L67J149Q55M30m23l52K63n41j808l66J513j02j349P46J768l32j000
$$ -583 -1220 -853 296 1151 1581 1158 806 1069 528 -1280 -1646 -133 -235 -1584 -838 930 598 -402
1217d02J100J167q34j143L4M9p95o58J63Q89O75k49q1J232O65j125p66Q70j11
$$ -402 698 1865 1031 -112 -78 -29 -824 -1482 -1319 -430 245 -4 -85 1147 1812 687 -79 791 680
1236F80j852n98J061L06p74N29J558M54o21k50L63nr78p41J81M98n82p01R88J269
$$ 680 -1172 -1770 -709 -403 -1177 -648 910 1364 743 493 856 851 -127 -868 -687 -189 -771 -1472 -484 785
1256G85k14n94R55P41j143j070L09L38r23p89O26Q63Kk54P04J122p7j001j62M90
$$ 785 571 -23 932 1673 530 -540 -231 107 -816 -1605 -979 -116 -114 -368 336 1458 1381 380 218 708
1276G08o62j331J5R45Lo66N97J233Q8o18J28O59k69j213m84M95Kq01K9J282N65
$$ 708 46 -1285 -1270 -325 -322 -988 -391 842 930 312 440 1099 830 -383 -867 -372 -370 -1171 -1142 140 705
1297G05m81JR00J36j110n42L74%r78l33P35O36l64oQ78P29n58o46L57K23q72r66
$$ 705 224 225 1125 1261 151 -391 -17 -17 -995 -1328 -593 43 -321 -327 551 1280 722 76 433 656 -216 -1182
1319a182M97N98m30l80Q84R30k43n14L96M33o15r86q0M58k43o51L82J094J68n91
$$ -1182 -685 -87 -517 -897 -13 917 674 160 556 989 374 -612 -692 -234 -477 -1128 -746 348 516 -75
1339g5L94Q71k04j063j67M98l90r80J4Q92K69l99K77Q15K83p01k93M71l9j049
$$ -75 319 1190 986 -77 -244 254 -136 -1116 -1102 -210 59 -340 -63 752 1035 334 41 512 473 -576
1359e76m54N24L95n58MR61O26l89l04N56R3p70q04K30L33n02m65O92Q03j91k77
$$ -576 -1030 -506 -111 -669 -665 296 922 533 229 785 878 108 -696 -466 -133 -635 -1100 -408 395 204 -73
1380g3N61O67m76q26J09K65o19o15K80O06Q4l40L34Q45P3p13o7N35l58j016j73
$$ -73 488 1155 679 -147 -38 227 -392 -1007 -727 -121 -37 -377 -43 802 875 162 95 630 272 -744 -917
1401i17P29n9n28L52R97O3m11O5M86j11o94m21J78J32n10l50P76O99l40j88P65
$$ -917 -188 -247 -775 -423 574 637 226 291 777 666 -28 -449 -271 -139 -649 -999 -223 476 136 -52 713
1422G13K85q32m57M76M9p24k84M76K40k52JM48O17Qn61l6L85m36r63R9P68j37
$$ 713 998 166 -291 185 234 -490 -774 -298 -58 -310 -309 139 756 764 203 167 552 116 -847 -748 20 -117
1444a17o34M98R53l47l68M56L81m65n47j8Q4j72k55J1N15M44l40l08P43L82p74
$$ -117 -751 -253 700 353 -15 441 822 357 -190 -208 -124 -296 -551 -540 -25 419 79 -229 514 896 122
1465A22l76O20o2j057j96P18J93m15L82P59p0k60k27J1M2q8n25p6N80k83n90M15
$$ 122 -254 366 304 -753 -949 -231 -38 -453 -71 688 618 358 131 142 184 96 -429 -505 75 -208 -798 -383
1487c83J044j67n75M92N27q63n87M90K25n89j28L50O8O9N1J32L49K79m28o36K84
$$ -383 661 494 -81 411 938 75 -512 -22 203 -386 -514 -164 -96 -27 24 156 505 784 356 -280 4
1508DJ18q44j60J008K36q41K29Q46k22n13M46L96m17m49j71r9O2J28o0J97O32
$$ 4 122 -722 -882 126 362 -479 -250 596 374 -139 307 703 286 -163 -334 -433 -371 -243 -303 -106 526
1529E26j63o35L48O89m75p14N72K66r98l83P84L24k97K76M75j71k80l0k45J47
$$ 526 363 -272 76 765 290 -424 148 414 -584 -967 -183 141 -156 120 595 424 144 114 -131 16
1549A6J81l35m03M38J37o46J4J134J57p26J60M50m50p14L38L90l36j51K50MJ9
$$ 16 197 -138 -541 -103 34 -612 -598 536 693 -33 127 577 127 -587 -249 141 -195 -346 -96 -92 -73
1570g3K32l5J56L98k49p89k3N77m75m30P40N44p76j89P16J10n01J91M50l41l80
$$ -73 159 124 280 678 429 -360 -383 194 -281 -711 29 573 -203 -392 324 434 -67 124 574 233 -147
1591a47j25j25JL83j3r7M15J62o55p8P92q4p40J47M31n03n77N46N11j81J4L09
$$ -147 -272 -397 -396 -13 -26 -123 292 454 -201 -279 513 429 -311 -164 267 -236 -813 -267 244 63 77 386
1613C86n1l08n3p4n2K40n5m86J68M45l98k33P44M70o23k16M65j52o09Q0M45j01
$$ 386 335 27 -26 -100 -152 88 33 -453 -285 160 -238 -471 273 743 120 -96 369 217 -392 -312 133 32
1635C2l47J58M8J4K63O6q1K39j1o30k98O16j00n18L81O24l81n19N06M17l48j09
$$ 32 -315 -157 -109 -95 168 234 153 392 381 -249 -547 69 -31 -549 -168 456 75 -444 62 479 131 22
1657B2K62j60k84j07m4O5J99M8j57K86L59l90l88N58K12o86j60M42j23m64J83
$$ 22 284 124 -160 -267 -311 -246 -47 1 -156 130 489 99 -289 269 481 -205 -365 77 -46 -510 -327
1678c27N27m8j35J23J35j19j09j49m1J57j3l83KN04m9l38L55M84l56m05K32K53
$$ -327 200 152 17 140 275 156 47 -102 -143 14 1 -382 -380 124 75 -263 92 576 220 -185 47 300
1700C00m11k35K79P6j59m0R9J24K41p7q2J29P2m11l49M25J12m02l1N13N2m13J04
$$ 300 -111 -346 -67 9 -150 -190 -91 33 274 197 115 244 316 -95 -444 -19 93 -309 -340 173 225 -188 -84
1723h4L71j8k55j4N6j7k36r0O7J88k4j45K51K73n7l90K00K34k41m44K36J92k47
$$ -84 287 269 14 0 56 39 -197 -287 -220 -32 -56 -201 50 323 266 -124 76 310 69 -375 -139 53 -194
1746a94j37L06K65r2j30J08Q1Jl25j6J85r4k03j23M47Q8k46J09L94q1m11m1K11
$$ -194 -331 -25 240 148 18 126 207 208 -117 -133 52 -42 -245 -368 79 167 -79 30 424 343 -68 -109 102
1769A02l1l89j3J88J31j97%L04J97j54j29K54L2k85k58R3J78k09j13K37K86j25
$$ 102 71 -318 -331 -143 -12 -209 -209 95 292 138 9 263 295 10 -248 -155 23 -186 -299 -62 224 99
1791I9j06J98K04k13l49R0K02j74l70J76L05j1j90J64L45p9l03P7R4m7l89m7K21
$$ 99 -7 191 395 182 -167 -77 125 -49 -419 -243 62 51 -139 25 370 291 -12 65 159 112 -277 -324 -103
1814a03N0k11nM18J88k88k5K94J6l68k15K38jk83j05L75J64j35JK75J77l29k30
$$ -103 -53 -264 -269 149 337 49 24 318 334 -34 -249 -11 -12 -295 -400 -25 139 4 5 280 457 128 -102
1837a02O0J32k72k36K39K83j31j85L08K88j57k45J42J33k40l11O5J55k7k53J29
$$ -102 -42 90 -182 -418 -179 104 -27 -212 96 384 227 -18 124 257 17 -294 -229 -74 -101 -354 -225
1858b25L79P9j78J1K21m2l65j15K60k4l65M9L32J52k25O0L28J13l36j80K16ql51
$$ -225 154 233 55 66 287 245 -120 -235 25 1 -364 -315 17 169 -56 4 332 445 109 -71 145 137 -214
1881b14k11L01J68j72j08L86L15l15j44J56J20k77l11P7K35r1k68K50L20q3k27
$$ -214 -425 -124 44 -128 -236 150 465 150 6 162 282 5 -306 -229 6 -85 -353 -103 217 134 -93
1902i3J95K92r1n10N2K44k50l30J76L74Oj62J43L25Ql28r4J81j7l23j93L06J64
$$ -93 102 394 303 -207 -155 89 -161 -491 -315 59 65 -97 46 371 379 51 -43 138 121 -202 -395 -89 75
1925G5l17l9N26J58l08q4K39J4l84j05J44J17k24q3P6L99J0k75J77M14k38n89
$$ 75 -242 -281 245 403 95 11 250 264 -120 -225 -81 36 -188 -271 -195 204 214 -61 116 530 292 -297
1947b97J65L52m06l29L29K90k14l6K47L53j85j57J9J8r7l16j55L36K33l72m0M67
$$ -297 -132 220 -186 -515 -186 104 -110 -146 101 454 269 112 131 149 52 -264 -419 -83 150 -222 -262 205
1969B05J88m45j9N11r6m98q8K30j75k48J36K44J60Q9r1K1K30p8m59J43K86k85
$$ 205 393 -52 -71 440 344 -154 -242 -12 -187 -435 -299 -55 105 194 103 124 354 276 -183 -40 246 -39
1991c9n94L30M81l43j14O16K51m53j99K57n6k57m4MK6L4j60j11N05L45l92q4N36
$$ -39 -633 -303 178 -165 -279 337 588 135 -64 193 137 -120 -164 -160 -134 -100 -260 -371 134 479 87 3 539
2014E39j55q09L7N69j93m82L40L47k67j28K75K23K1k5k39j72J08j93m49L46N77
$$ 539 384 -425 -388 181 -12 -494 -154 193 -74 -202 73 296 317 292 53 -119 -11 -204 -653 -307 270
2035B70j88m71M85M31n68j70O23N1o08j99K98j80j86K62K77R5J14j31k55K06J60
$$ 270 82 -389 96 527 -41 -211 412 463 -145 -344 -46 -226 -412 -150 127 222 336 205 -50 156 316
2056C16m67j76N42m6r12K30P40j76l30N71M25o22k23J41Lj07l0K4j72K28n1k85
$$ 316 -151 -327 215 169 -743 -513 227 51 -279 292 717 95 -128 13 16 -91 -121 -97 -269 -41 -92 -377
2078c77M01N90k74m44L71J31p83k99P20J29n49J68M30j33k30L15J53PJ8k85l43
$$ -377 24 614 340 -104 267 398 -385 -684 36 165 -384 -216 214 81 -149 166 319 326 344 59 -284
2099b84J05J10m37N0Q37r7o04K60O15m52m04N55K29o56k55J95L0j01K08K63O2
$$ -284 -179 -69 -506 -456 381 284 -320 -60 555 103 -301 254 483 -173 -428 -233 -203 -304 -96 167 229
2120B29J46j72l21K11L07m48l76L66K30p67M6Q31K7l93K50L92k92m43R7N8j04
$$ 229 375 203 -118 93 400 -48 -424 -58 172 -595 -549 282 309 -84 166 558 266 -177 -80 -22 -126
2141a26l0L7j40K12J26l61K59O35j94n83J66L70o27m61O06K84l74j25M20J34k09
$$ -126 -156 -119 -259 -47 79 -282 -23 612 418 -165 1 371 -256 -717 -111 173 -201 -326 94 228 19
2162A9Q0K05n7m6l22k26J52K17l03p7O15J49n74P8N94j19n39J60L63m37m07J99
$$ 19 99 304 247 201 -121 -347 -195 22 -281 -358 257 406 -168 -90 504 385 -154 6 369 -68 -475 -276
2184b76K57j20N0J96J10P5j02l14J15K78l29m24K91K83m11k17O58L57l76l8L00
$$ -276 -19 -139 -89 107 217 292 190 -124 -9 269 -60 -484 -193 90 -321 -538 120 477 101 63 363
2205C63o0m12j55J93K7p8q2L8K98O8k39P3M45k9o21J1L30k62m51K94M56k74j87
$$ 363 303 -109 -264 -71 -44 -122 -204 -166 132 200 -39 34 479 450 -171 -160 170 -92 -543 -249 207 -67 -254
2228b54L31K64p5j55N5jq3k52k14J76K26k75q9M48L12l86j63M68Q4n43j29L12
$$ -254 77 341 266 111 166 165 82 -170 -384 -208 18 -257 -346 102 414 28 -135 333 417 -126 -255 57
2250E7r8l30mL72J52n0n2J93J67k30k75K2K32k54l61J83M17k41j61L20M27k03
$$ 57 -41 -371 -375 -3 149 99 47 240 407 177 -98 -76 156 -98 -459 -276 141 -100 -261 59 486 283
2272B83l13K18J03k70k97O1J50l8k07R9L84J40l13L7L58j02m61k1K43p5l78K4
$$ 283 -30 188 291 21 -276 -215 -65 -103 -310 -211 173 313 0 37 395 293 -168 -189 54 -21 -399 -375
2294c75M37J07j86LL19N2k45j82J68M1l53k39K83K42j82j49M46K48l00k39K63
$$ -375 62 169 -17 -14 305 357 112 -70 98 139 -214 -453 -170 72 -110 -259 187 435 135 -104 159
2315A59J46l98k25K13J41j86j93K06L76j08j80J56L06k21m35P8K67j75l64J72
$$ 159 305 -93 -318 -105 36 -150 -343 -137 239 131 -49 107 413 192 -243 -165 102 -73 -437 -265
2335b65M20p4j83J70L65j37k64oJ58r0m15r0L62P5l05O4M63J18l56K6L24r6l69
$$ -265 155 81 -102 68 433 296 32 26 184 94 -321 -411 -49 26 -279 -215 248 366 10 36 360 264 -105
2358a05j93K19J54l51k6L14K61j92r5K37J26k55l45J39K53l26k51K61L14j76j21
$$ -105 -298 -79 75 -276 -302 12 273 81 -14 223 349 94 -251 -112 141 -185 -436 -175 139 -37 -158
2379a58K38K98j29l34J42J60k59k90M5L05j4l18J86M43m0k55L7L40j74m25j12
$$ -158 80 378 249 -85 57 217 -42 -332 -287 18 4 -314 -128 315 275 20 57 397 223 -202 -314
2400c14K30M2l11N2M46R9l01JM14k2l58j28J64K9l03j64L02K35j58j10L39J64
$$ -314 -84 -42 -353 -301 145 244 -57 -56 358 336 -22 -150 14 43 -260 -424 -122 113 -45 -155 184 348
2422C48j93l04K32K02l08l75K45K58k27k01L44L20j17k82J69K06k18k89N3J36
$$ 348 155 -149 83 285 -23 -398 -153 105 -122 -323 21 341 224 -58 111 317 99 -190 -137 -1
2442aj29j93J8L88J18l21J25M15p2m35o8L14k12m16K11L73n4k48J32L10l2j14
$$ -1 -130 -323 -305 83 201 -120 5 420 348 -87 -155 159 -53 -469 -258 115 61 -187 -55 255 223 109
2464A09q9L5K05l53k86J79L83k81k11L96L15l40j65L87J34m48j67K80j68k53J2
$$ 109 20 55 260 -93 -379 -200 183 -98 -309 87 402 62 -103 284 418 -30 -197 83 -85 -338 -326
2485c26K29J14J66r2q5L07k9n11K6M68j57n87K24M74k53l77N16L91l48j40J38
$$ -326 -97 17 183 91 6 313 284 -227 -201 267 110 -477 -253 221 -32 -409 107 498 150 10 148
2506A48o2k08l1o4Q7J83j04l26L25M69l51j42N35Q4p19k10M82p7n05L59L35j42
$$ 148 86 -122 -153 -217 -130 53 -51 -377 -52 417 66 -76 459 543 -176 -386 96 19 -486 -127 208 66
2528F6j28J13N3J3J35j74j69K00j43m91L9P43j18m50M37M46n43l39N55J62n31
$$ 66 -62 51 104 117 252 78 -91 109 -34 -525 -486 257 139 -311 126 572 29 -310 245 407 -124
2549a24j14K79j38k62J97P7J75K68q3l68J65K58n62p4N46L5p46J30N21j70l17
$$ -124 -238 41 -97 -359 -162 -85 90 358 275 -93 72 330 -232 -306 240 275 -471 -341 180 10 -307
2570c07N10L34l90k17J66j74j25J30j01J0K50o7l73J81N84j94l92M58J75o96k95
$$ -307 203 537 147 -70 96 -78 -203 -73 -174 -164 86 19 -354 -173 411 217 -175 283 458 -238 -533
2591e33N25J20m59K68M03k57j80K11MK1J20j32l04J86J10m80NO82j4n00K05M95
$$ -533 -8 112 -347 -79 324 67 -113 98 102 123 243 111 -193 -7 103 -377 -372 310 296 -204 1 496
2613D96m57l40L96K14l98j42K33j70o3J50J07J4K67p9l91J54K48l95k65N52J79
$$ 496 39 -301 95 309 -89 -231 2 -168 -231 -81 26 40 307 228 -163 -9 239 -156 -421 131 310
2634C10o28q8O35l6l54L00K60k77l06J11j7k6J08j00l9K91L2m12J59M99j73m12
$$ 310 -318 -406 229 193 -161 139 399 122 -184 -73 -90 -116 -8 -108 -147 144 176 -236 -77 422 249 -163
2656a63K85K14n03l78N17J57l22M4M15p6k18N9j3J08L5j92l37K32J68l21JN95
$$ -163 122 336 -167 -545 -28 129 -193 -149 266 190 -28 31 18 126 161 -31 -368 -136 32 -289 -288 307
2678C07N2m88L7M52j86m01K60K63l27k75K11L4l3R8J00R1J09j02l64J54K07k17
$$ 307 359 -129 -92 360 174 -227 33 296 -31 -306 -95 -61 -94 4 104 195 304 202 -162 -8 199 -18
2700a8l27K91K42l06j68M57O5k05j9K61j42k80n4J14K2mk5l3K85Ok71J40L27p9
$$ -18 -345 -54 188 -118 -286 171 236 31 12 273 131 -149 -203 -89 -67 -71 -96 -129 156 162 -109 31 358 279
2724B79m41P1K71l00k31K40L15k27j45K61J44j71o4L2M9K3k54q5J91J02j95j6
$$ 279 -162 -91 180 -120 -351 -111 204 -23 -168 93 237 66 2 34 83 106 -148 -233 -42 60 -135 -151
2746a51L69M9l24p5L04j7l30J0K36q9k65R3K15Q8q5m2J76Q4j94k02O5K03k28j60
$$ -151 218 267 -57 -132 172 155 -175 -165 71 -18 -283 -190 25 113 28 -14 162 246 52 -150 -85 118 -110 -270
2770b70K21K28j69j41K39K16k53j60J30J32j86k12L8J84lj61J56K01K8k41P0J98
$$ -270 -49 179 10 -131 108 324 71 -89 41 173 -13 -225 -187 -3 -6 -167 -11 190 218 -23 47 245
2792B45j21k42m8K69j29k28Q7K04N4j56P1J76l8k00n9J06M2j82r3K43J21j59m5
$$ 245 124 -118 -166 103 -26 -254 -167 37 91 -65 6 182 144 -56 -115 -9 33 -149 -242 1 122 -37 -82
2815h2K32N4j74q9J03O6j92j73J81J40j87k8J89J64r5j79J58J78k34k13R6J96
$$ -82 150 204 30 -59 44 110 -82 -255 -74 66 -121 -149 40 204 109 -70 88 266 32 -181 -85 111
2837A11k12j76K35J92l3j92J30J93j52j97N3Q1j01j44Q0K14k0j37O1K34j1k44
$$ 111 -101 -277 -42 150 117 -75 55 248 96 -101 -48 33 -68 -212 -132 82 62 -75 -14 220 209 -35
2859c5kK33o5k38r4J88M3j91L4K03J12j94j03K26K0j60j82J73J32k24p5J78K15
$$ -35 -37 196 131 -107 -201 -13 30 -161 -127 76 188 -6 -109 117 137 -23 -205 -32 100 -124 -199 -21 194
2882A94k18l1J76J23k49q1J30Q6k06j44J27J81m8j39J56J13l7j35qJ76j35k65
$$ 194 -24 -55 121 244 -5 -86 44 130 -76 -220 -93 88 40 -99 57 170 133 -2 -10 166 31 -234
2904b34J17J56n1j51P7K80m0j88M0J57j16j29nP4J9j19n2J77J26j78k5J85P9j91
$$ -234 -117 39 -12 -163 -86 194 154 -34 6 163 47 -82 -87 -13 6 -113 -165 12 138 -40 -65 120 199 8
2928Hr5R6J27k63p2J94N7j45NK16Q3k07m1J30N0j33r7QJ82m8j89J37K13j12k14
$$ 8 -87 9 136 -127 -199 -5 52 -93 -88 128 211 4 -37 93 143 10 -87 -79 103 55 -134 3 216 104 -110
2953a10J03J96j32k42R8J65j63j76J99J19J0p1K9M7K9j58mJ09J3j81r3K51Lj08
$$ -110 -7 189 57 -185 -87 78 -85 -261 -62 57 67 -4 25 72 101 -57 -61 48 61 -120 -213 38 41 -67
2977f7nK90j0k27PJ26o8k20O3J53l7r3K3O8J22l4j42Q0J48j41k96K06J61j38k22
$$ -67 -72 218 208 -19 -12 114 46 -174 -111 42 5 -88 -65 3 125 91 -51 29 177 36 -260 -54 107 -31 -253
3002b53K34J38j97p0J83J53j25m0rq5Qo9k3J53J39j70j4J84L0l16Q5L00j60k43
$$ -253 -19 119 -78 -148 35 188 63 23 14 -71 -63 -132 -155 -2 137 -33 -47 137 167 -149 -64 236 76 -167
3026a67Q2J64j72j02K31J26j51l8P1m5K2Q0j83M8K06k14k67K50K05k06o4L12P
$$ -167 -85 79 -93 -195 36 162 11 -27 44 -1 21 101 -82 -34 172 -42 -309 -59 146 -60 -124 188 195
3049A95k80K8J04m8j66J37L1o2N1j2j5J65J05j96r9J93r9l11J08K94j07k26K42
$$ 195 -85 -57 47 -1 -167 -30 1 -61 -10 -22 -37 128 233 37 -62 131 32 -279 -171 123 16 -210 32
3072C2J99k80o1K60J9j79N4n3J0n3L8q6R1J86k58r1K25J66l01m2K88p5l64J11
$$ 32 231 -49 -110 150 169 -10 44 -9 1 -52 -14 -100 -9 177 -81 -172 53 219 -82 -124 164 89 -275 -164
3096a64K58r9q6R3J10q0J2Jk9L6K5j27p9J95j41j88K18K88j45k10K50P9k61j15
$$ -164 94 -5 -91 2 112 32 44 45 16 52 77 -50 -129 66 -75 -263 -45 243 98 -112 138 217 -44 -159
3120a59K41m1j65J51L2j40P4rk7J21J07k00j37K25o2k70J04L23j35k00K17J17
$$ -159 82 41 -124 27 59 -81 -7 -16 -43 78 185 -15 -152 73 11 -259 -155 168 33 -167 50 167
3142A67k17o0K16N2j31m8o5K2J4O3m2M2K11j85j91J91J64k41j14K83m4l07N8J98
$$ 167 -50 -110 106 158 27 -21 -86 -64 -50 13 -29 13 224 39 -152 39 203 -38 -152 131 87 -220 -162 36
3166C6j1q3J08J4k7m4M7p2O9K1j25p4J95n9j45J18K65j11k32J76J03k10j25K00
$$ 36 25 -58 50 64 37 -7 40 -32 37 58 -67 -141 54 -5 -150 -32 233 122 -110 66 169 -41 -166 34
3190C4P1j30jN7k5o8O9m3J03O5j49j36J84J9j64J2J66L1k46L9K33n2r0O0L7q1
$$ 34 105 -25 -26 31 6 -62 7 -36 67 132 -17 -153 31 50 -114 -102 64 95 -151 -112 121 69 -21 39 76 -5
3216ep9K3OJ0J7k7M1J29q7j57J47J41j26j44J11O7j11o5J45P7j49K9N8N1q9k6
$$ -5 -84 -61 -55 -45 -28 -55 -14 115 28 -129 18 159 33 -111 0 67 -44 -109 36 113 -36 -7 51 102 13 -13
3242a3k7R9n0r1J6J16m6j10O2J78m3j44PQ8j8j08O2L5j6p0L0N8K3n0j3P0Jq9q6
$$ -13 -40 59 9 -82 -66 50 4 -106 -44 134 91 -53 -46 42 24 -84 -22 13 -3 -73 -43 15 38 -12 -25 45 46 -43 -129
3271a29J43J18j94m2J44P7r0m2J11J5j08o6R9mj38j7J11M3l0o4O7J01n6o4L8J01
$$ -129 14 132 -62 -104 40 117 27 -15 96 111 3 -63 36 32 -106 -123 -12 31 1 -63 4 105 49 -15 23 124
3297A24j11j56J10R5m6j27O9J46o9k7K8P7l2j51K9N3o0k7K5M9R8j08%O0M1r9m9
$$ 124 13 -143 -33 62 16 -111 -42 104 35 8 36 113 81 -70 -41 12 -48 -75 -50 -1 97 -11 -11 49 90 -9 -58
3324e8J42o3j4j40J68J03p4q8M1J10r3o6J05L6j14j25Q1J48j14j01J31J06p7q8
$$ -58 84 21 7 -133 35 138 64 -24 17 127 34 -32 73 109 -5 -130 -49 99 -15 -116 15 121 44 -44
3348d4K7J22q5j21Q9P5p4o7nJ16oq5P4O1rj23J1J19o2q0L7O2L7j15L1L4J00j37
$$ -44 -17 105 20 -101 -12 63 -11 -78 -83 33 27 -58 16 77 68 -55 -44 75 13 -67 -30 32 69 -46 -15 19 119 -18
3376a8k1P6l4m8QK4Kl5m0R6P9j00m0J1Q6p7nK5Q9j06r1N8J00O6j60PJ01Lj02O2
$$ -18 -39 37 3 -45 -37 -13 -11 -46 -86 10 89 -11 -51 -40 46 -31 -36 -11 78 -28 -119 -61 39 105 -55 -48 53 56 -46 16
3406A6N6j09m7K5J10k0r6N1O1K0n5p0J58n5m8p3Q1O0j44l5J36J7n5o4J24P8j86
$$ 16 72 -37 -84 -59 51 31 -65 -14 47 67 12 -58 100 45 -3 -76 5 65 -79 -114 22 39 -16 -80 44 122 -64
3433f4KM1N3j21L4P3Q7j45j5Q7J1q5RJ1P4p6r5Q1J28n4q6O8J09q9j00L9O4J4r6
$$ -64 -62 -21 32 -89 -55 18 105 -40 -55 32 43 -42 -33 -22 52 -24 -119 -38 90 36 -50 18 127 38 -62 -23 41 55 -41
3462d1NJ28r5j1PJ13p5m0RQ9m3p3n5R2M6j24l1J34J1j24P7J12r5m4oO2p8l0M1
$$ -41 -36 92 -3 -14 -7 106 31 -9 0 89 46 -27 -82 10 56 -68 -99 35 46 -78 -1 111 16 -28 -34 28 -50 -80 -39
3491c9O4J1l1Pk2J4P0j22P4L1p2m1N0Rj7p3O6R1r8kR2p3Q2m4M6r6K8m9m7Q3Mp
$$ -39 25 36 5 12 -10 4 74 -48 26 57 -15 -56 -6 3 -14 -87 -21 70 -28 -30 62 -11 71 27 73 -23 5 -44 -91 -8 -4 -11
3523a1q4J35lj46P1J19p6n1k2J00Lj17Q7nQK3K0m8P8q0m2M2J03m5p7L8L2m8p8
$$ -11 -95 40 37 -109 -38 81 5 -46 -68 32 35 -82 5 0 8 31 51 3 81 1 -41 1 104 59 -18 20 52 4 -74
3552g4J10J6p6q3J90j07jNM4j4k6%n1O7J21j32j9P3k2j01l0K11p4j07J18L7p8
$$ -74 36 52 -24 -107 83 -24 -25 -20 24 10 -16 -16 -67 0 121 -11 -30 43 21 -80 -110 101 27 -80 38 75 -3
3579cl9N4K8k2j9M3n3k6O2j26J24J00j27p7J05M6q7r0K16k4j57J7P8q7KkN0j0
$$ -3 -42 12 40 18 -1 42 -11 -37 25 -101 23 123 -4 -81 24 70 -17 -107 109 85 -72 -55 23 -64 -62 -64 -14 -24
3607b4nK5n9M6O8p4l8J19J3j76J7J59k5j19P3J29j50m7J29m3j6K2Mqj9L3m2k5
$$ -24 -29 -4 -63 -17 51 -23 -61 58 71 -105 -88 71 46 -73 0 129 -21 -68 61 18 2 24 28 20 1 34 -8 -33
3635c3N6m0l4O7Jr9L2J08j3j07M9Q2p9l3O2J0k6K3K1n9K0R5q3l6O3k3j03J47j2
$$ -33 23 -17 -51 16 17 -82 -50 58 45 -62 -13 69 -10 -43 19 29 3 26 47 -12 8 103 20 -16 47 24 -79 68 56
3664E6m0q4P4J6l6j0Q3q9nJ1M4J3jk1m3J2O3m2l3K2M2m0j03J31K6q9l1J36q3o6
$$ 56 16 -68 6 22 -14 -24 59 -30 -35 -24 20 33 32 11 -32 -20 43 1 -32 -10 32 -8 -111 20 46 -43 -74 62 -21 -87
3694h7N7J4J5l0J6k5M3l7oM5N0Lj56P8J25j21m3J46m6o7j5O3M3m0K3n4lj6K1m1
$$ -87 -30 -16 -1 -31 -15 -40 3 -34 -40 5 55 58 -98 -20 105 -16 -59 87 41 -26 -41 22 65 25 48 -6 -9 -25 -4 -45
3724d5P7n9K7l9J03J9j16kR6m8q4O6M4o6K4m1O2km0L1K3n2K5MK2m4J5m2Q0L7j39
$$ -45 32 -27 0 -39 64 83 -33 -35 61 13 -71 -5 39 -27 -3 -44 18 16 -24 7 30 -22 3 7 29 -15 0 -42 38 75 -64
3755f4L5O7o4QPL1Rp8N7Qj3J5o9M5L5l1l3KQ7k6l4o0J16k1p5L3Jpk2J2K0J1j8
$$ -64 -29 38 -26 -18 -11 20 29 -49 8 16 3 18 -51 -6 29 -2 -35 -33 54 28 -6 -66 50 29 -46 -13 -12 -19 -41 -29 -9 2 -16
3788a6K3L4Qo4k4Q2k7p3L5J1L1Ok1L4On8o8R9Lk6J4l8L5M6k7l5P1q4l5L2PMl2
$$ -16 7 41 49 -15 -39 43 16 -57 -22 -11 20 26 5 39 45 -13 -81 18 21 -5 9 -29 6 52 25 -10 61 -23 -58 -26 -19 -15 -47
3821d7K6M9j7j4JoM2k0LO0p8J2Ln7L9M2m6K5L9j00N3K6M0m8o2J9K4j1n7O9o6J33
$$ -47 -21 28 11 -3 -2 -8 34 14 17 77 -1 11 14 -43 -4 38 -8 17 56 -44 9 35 75 27 -35 -16 8 -3 -60 9 -57 76
3853G6j15Q8n0j3rJ7K7k4m9K6K0j1j8J8Ql0K1N4N1q6m1MN1n5L2KM4m3m3J02Lk9
$$ 76 -39 49 -1 -14 -23 -6 21 -3 -52 -26 -6 -17 -35 -17 -9 -39 -18 36 87 1 -40 -36 15 -40 -8 -6 38 -5 -48 54 57 28
3885B8p8K1K4K9k9oK4N0n5oN8p2k6L8l8M4N7p8J9K2p2L8N3J0j11N5k2M1k7n3O7
$$ 28 -50 -29 -5 24 -5 -11 13 63 8 2 60 -12 -38 0 -38 6 63 -15 4 26 -46 -8 45 55 -56 -1 -23 18 -9 -62 5
3916Ej3l6j4P0M5lm2oMRL2%J1l0o7K3O8n5n6M3N6Nm5l6K1M4m3j5K2L6q5j7J41
$$ 5 -8 -44 -58 12 57 54 12 6 10 19 51 51 62 32 -35 -12 56 1 -55 -12 44 49 4 -32 -11 33 -10 -25 -3 33 -52 -69 72
3949G2r0Q9m2p5L3qj7j3P7m2l7k9O9M6r1P1lj5K8K7n6j4K2RL6n9Rl9N3J3o8J3
$$ 72 -18 71 29 -46 -13 -21 -38 -51 26 -16 -53 -82 -13 33 -58 13 10 -5 23 50 -6 -20 2 11 47 -12 -3 -42 11 24 -44 -31
3981c1M4Rr6N7N2j5n3J5O0k2k2L9K2o7l1RJ6M5n3j9M2L7l2q6P9J14q9J5L1l1k8
$$ -31 13 22 -74 -17 35 20 -33 -18 42 20 -2 37 59 -8 -39 -30 -14 31 -22 -41 1 38 6 -80 -1 113 24 39 70 39 11
4012A1K8k4mK4lK1Mj12L2k6K0K5J9n7N9k5k6J2O4q0K1k0%k1O7L3Op7lPR4o2M5
$$ 11 39 15 11 35 32 53 57 -55 -23 -49 -29 -4 15 -42 17 -8 -34 -22 42 -38 -17 -37 -37 -58 9 42 48 -29 -32 -25 69 7 52
4045E2q9K5O4q4k2P2mm4J3N5k4r5M3M5l0L1j2jQ8q1Ol1K7M4j04J6J31j32kJ3N5
$$ 52 -37 -12 52 -32 -54 18 14 -30 -17 38 14 -81 -38 7 -23 8 -4 -5 83 2 8 -23 4 48 -56 -40 91 -41 -43 -30 25
4076B5o8pN5N6j11N6N8k7j9l3J8jk1O9o1K2L2pj07N8J15j95O3K6O9j6q5P6o8J3
$$ 25 -43 -50 5 61 -50 6 64 37 18 -15 3 2 -19 50 -11 11 43 36 -71 -13 102 -93 -30 -4 65 49 -36 40 -28 -15
4106a5j3N3K3n5J5n6L4J7m1L4M6n0m4N4J35j65p8J00Pk4m5J21k0o2M4J7n2mQ6
$$ -15 -28 25 48 -7 8 -48 -14 3 -38 -4 42 -8 -52 2 137 -28 -106 -6 1 -23 -68 53 33 -29 15 32 -20 -24 62
4135F2l1L1j9m6k2J1P9j36O8O1j2j43Q4O0j6q2R4m2q0N3l4LM5M9p1K8Nk8l6O8
$$ 62 31 62 43 -3 -25 -14 65 -71 -3 58 46 -97 -13 47 31 -51 43 1 -79 -26 -60 -57 -12 37 -34 -6 -1 -29 -65 3
4165Ck6M9m0j1P5m3l5O4J6k2mj6l0j8O9j4j9L5N3j17L4J1j9k1P0ln2J9R7q9o4
$$ 3 -23 26 -14 -25 50 7 -28 36 52 30 26 10 -20 -38 31 17 -2 33 86 -31 3 14 -5 -26 44 41 -11 8 105 16 -48
4196d8O3j3l1%L6k8J3N2m7l4J2L6m7M3K4o5L7K0L8p9K8P2r5k8L4N5Rm2%n8J31
$$ -48 15 2 -29 -29 7 -21 -8 44 -3 -37 -25 11 -36 7 31 -34 3 23 61 -18 10 82 -13 -41 -7 48 57 15 15 -43 88
4227H8m9o3jK5Qn5N6%j9r4P9N1k9r7R5J5n1J7O1l3J3n2Q3qo4k4NR0N0r5k7K3Q1
$$ 88 39 -24 -25 0 8 -47 9 9 -10 -104 -25 26 -3 -100 -5 10 -41 -24 37 4 17 -35 48 40 -24 -48 -43 47 97 2 -25 -2 79
4260G9m6n1R1n5o7M7k4rl8N8L0k7Lm1L1L5nk9KP2o0o4R8l%q1J6P6l6k7K3N1j03
$$ 79 33 -18 73 18 -49 -2 -26 -35 -73 -15 15 -12 -9 -50 -19 16 11 -18 -16 56 -4 -68 30 27 27 -54 -38 38 2 -25 -2 49 -54
4293e4M2K4J5K6p8M3m9J5j0M6m5P5q5k2O3Qn8Q1j6MJ2j7j2L2j1n7kM8o2KO9n9
$$ -54 -12 12 27 53 -25 18 -31 -16 -26 20 -25 50 -35 -57 6 14 -44 37 21 25 37 20 8 40 29 -28 -30 18 -44 -42 27 -32
4325c2L3n8P0K2r5P3J3lo3K8j1P4m4k4m1J37k2j43R2M8q6k5N1M2Pn6NO1m9n8P0
$$ -32 1 -57 13 35 -60 13 26 23 -40 -12 -23 51 7 -17 -58 79 57 -86 6 54 -32 -57 -6 36 43 -13 -8 53 4 -54 16
4356A6k3N5o1m5Q6K5q9l3J68j48K7J6MK2j48P3P4k4Kl3M7L3q7mR0k9l0%L0mk7
$$ 16 -7 48 -13 -58 28 53 -36 -69 99 -49 -22 -6 -2 20 -128 -55 19 -5 -3 -36 11 44 -43 -47 43 14 -16 -16 14 10 -17
4387a7N0j8L5n5q3J04k8j1m5P9K5k0l9Q0Mq6L4NM4r5NM2J2K8n7m0M4L9n9j8N5
$$ -17 33 15 50 -5 -88 16 -12 -23 -68 11 36 16 -23 57 61 -25 9 14 58 -37 -32 10 22 50 -7 -47 -3 36 -23 -41 14
4418A4m7J0K0K4l8l1J8J07p2k1K3J6rjl2N0N1o4jj3J8n1K9P3j0p4K9qjn8N6m1
$$ 14 -33 -23 -3 21 -17 -48 -30 77 5 -16 7 23 14 13 -19 31 82 18 17 4 22 -29 0 73 63 -11 18 10 9 -49 7 -34
4450c4Q4n7rM3mj0k1m1NmM1o6J26r9K3J7M9o3m4M2J9N3q9Q1Ql7oKk8O5j3qk7L
$$ -34 50 -7 -16 27 23 13 -8 -49 -44 -48 -7 -73 53 -46 -23 -6 43 -20 -64 -22 -3 50 -39 42 50 13 7 9 -19 46 33 25 -2 1
4484Akl3Q0n6l9K1P2j1j11N0J8j%J1n3R4p1k7J0KL3k9L7J9l5q2O4N4l7n9J08J5
$$ 1 -1 -34 46 -10 -49 -28 44 33 -78 -28 -10 -11 -11 0 -53 41 -30 -57 -47 -45 -12 -41 -4 15 -20 -102 -38 16 -21 -80 28 43
4516D3r2mN3j5K1O1n6n0R9n7k4J27o1l5l8O4lm3n0O6J6m7K2K1l3j4O6o9kJ2K5
$$ 43 -49 -53 0 -15 6 67 11 -39 60 3 -21 106 45 10 -28 36 33 -10 -60 6 22 -25 -3 18 -15 -29 37 -32 -34 -22 3
4547Cl1P9m2JJ4K6j10P1J0qr1O4M3J9r4N2P4p9M5rj7l9N9n9J7M6k4p8L7O0k0j3
$$ 3 -28 51 9 10 24 50 -60 11 21 13 -78 -14 29 48 -46 6 80 1 46 37 20 -19 40 -19 -2 44 20 -58 -21 39 19 6
4579F%L5q6J3L0%r4P0R4j10P5m9L4j0K0m2K3j0L7m5j0jN1m4M4O1p1j9O5L0r5k4
$$ 6 6 41 -45 -32 -2 -2 -96 -26 68 -42 33 -16 18 8 28 -14 9 -1 36 -9 -19 -20 31 -13 31 92 21 2 67 97 2 -22
4611b2lQ0l6L3n8j5%J6r6P2P8r1K4M9j4n5l1J09rp4k6P4m0oQ9n4m6M1K4l3O8K2
$$ -22 -25 55 19 52 -6 -21 -21 -5 -101 -29 49 -42 -18 31 17 -38 -69 40 31 -43 -69 5 -35 -41 48 -6 -52 -11 13 -20 48 70
4643G0j19N6N5l6j9l4J00o0m7oJ09j02J0P1J7n3j1K0q4J05q7L8Rj1n4l1P9L5p9
$$ 70 -49 7 62 26 7 -27 73 13 -34 -40 69 -33 -23 48 65 12 1 21 -63 42 -45 -7 2 -9 -63 -94 -15 20 -59
4672e9N9L4q8m4R4P0o4n6L5L7l8N9j5K8q3Q5q2j1P9o1K8k7P5j27M4M8J3o8K9L6
$$ -59 0 34 -54 -98 -4 66 2 -54 -19 18 -20 39 24 52 -31 54 -28 -39 40 -21 7 -20 55 -72 -28 20 33 -35 -6 30
4702C0j00M9Rp8O9P2o6M2pK7r1L4jK5q0Q5K1l2p1L8R0p0o7R7jm9Qm4M8PK9m4L
$$ 30 -70 -21 -12 -90 -21 51 -15 27 20 47 -44 -10 -11 14 -66 19 40 8 -63 -25 65 -5 -72 25 24 -25 -17 -61 -13 -6 23 -21 -18
4735a8P8m5l8J5L3j0K0K9r7KM4M2j2j02l1J10l1l9N8l8N2j5J1%k0k3l6P5M0q8
$$ -18 60 15 -23 -8 25 15 35 64 -33 -31 13 55 43 -59 -90 20 -11 -50 8 -30 22 7 18 18 -2 -25 -61 14 54 -34
4765c4l1N2Q1l8q2O3k%k2NrJ0N1m1LL0m4l9J06l5l5m0N5lj4K7J9q0N9k6KJ4j6
$$ -34 -65 -13 68 30 -52 11 9 9 -13 -8 -17 -7 44 3 6 36 -8 -47 59 24 -11 -51 4 1 -13 14 33 -47 12 -14 -12 2 -14
4798a4J3j7N9m0n3L5P7q9L4J6K5p2qJ02o0l2qL8l1N4p7Q9l9lK4j0jJ1m8O8l6J5
$$ -14 -1 -18 41 1 -52 -17 60 -29 5 21 46 -26 -34 68 8 -24 -32 6 -25 29 -48 41 2 -1 23 13 12 23 -25 43 7 22
4830B2l2K2L0l1kpP2j08L2j3M8l7k1J0L4o4N3m9M0M3p3PO2n8k9O0k8L4k3MPJ7
$$ 22 -10 12 42 11 9 2 74 -34 -2 -15 33 -4 -25 -15 19 -45 8 -41 -1 42 -31 -24 38 -20 -49 11 -17 17 -6 -2 5 22
4862B2J1m2M5M2o8l9O6n0M9l5L7l6l0MJ1qJ5J0Pl1j5j1K7Rkk5J2L1k7Ql0R0r7
$$ 22 33 -9 36 78 10 -29 37 -13 36 1 38 2 -28 -24 -13 -21 -6 4 11 -20 -35 -46 -19 -10 -12 -37 -25 6 -21 -13 -43 47 -50
4895e0L7m3Q8n7kP7Oo9k1K9Qn9J9L8J0l6L9j0MlmJ0k1K3j9nK2l9l1N1l1M4l8%
$$ -50 -13 -56 32 -25 -27 50 56 -13 -34 -5 3 -56 -37 1 11 -25 14 4 8 5 1 11 -10 13 -6 -11 11 -28 -59 -8 -39 5 -33 -33
4929c3M4J7J1p7L2L0lp7R2l4NK9l4l3k4N3M4j3n4O2k0k0j5j3L1LL4Qn6M1m2K7
$$ -33 11 28 39 -38 -6 24 21 -56 36 2 7 36 2 -31 -55 -2 42 29 -25 37 17 -3 -18 -31 0 3 37 45 -11 30 -12 15
4961A5l7j0L0J8Kl3l7l6Q4m3J8Pn1Q4m8O9o2J8K7k4L3l6J6J8n2K3J0k7L9pJ1k8
$$ 15 -22 -32 -2 16 18 -15 -52 -88 -4 -47 -29 -22 -73 11 -37 32 -30 -12 15 -9 24 -12 4 22 -30 -7 3 -24 15 8 19 -9
4993ioO1k7m1N2Lo9L3qj8J7j2m9N4K9k5j2K5j3l5K6Q9ln4%l9L5K6l9k7J1l2Q7
$$ -9 -15 46 19 -22 30 33 -36 -3 -11 -29 -12 -24 -73 -19 10 -15 -27 -2 -15 -50 -24 65 62 8 8 -31 4 30 -9 -36 -25 -57 30
5026C0o2M5qqOk4N5l8n4Q0J6q9L9Q3Op7k0j4O6m7L1J2J2o1P6o2j2m4P1j4L4r2
$$ 30 -32 13 5 -3 3 -21 34 -4 -58 22 38 -51 -12 71 77 0 -20 -34 32 -15 16 28 40 -21 55 -7 -19 -63 8 -6 28 -64
5058f4JK8oJ8l8R8l0Lk4j4P4k3k7Jom5N9m5J6M6l4N1k1K2m4j4L0rJ9l4n3P0p1
$$ -64 -63 -35 -41 -23 -61 37 7 10 -14 -28 46 23 -4 -3 -9 -54 5 -40 -24 22 -12 39 18 40 -4 -18 12 3 22 -12 -65 5 -66
5091f6J13k3l6M2m1N3l2%rk0L0l8L1KJ2k7m2R4j9l4NNnl4R2m5l1J2M2k1rNl5J0
$$ -66 47 24 -12 30 -11 42 10 10 1 -19 11 -27 4 6 18 -9 -51 43 24 -10 -5 0 -5 -39 53 8 -23 -11 31 10 1 6 -29 -19
5125a9J03r4O3r3P5k4k1M8m3L9m2K7rL5m0Po7N5k4Mj8N7m6LQ3o1RL4J0o8j0K9
$$ -19 84 -10 53 -40 35 11 -10 38 -5 34 -8 19 10 45 5 12 -55 0 -24 -20 -38 19 -27 -24 59 -2 7 41 51 -17 -27 2
5157BK3m3k5P7Ko1K9n8P1k4NKl6N2k2n7QR2j37R2m4Q7l0r8J36m8M6l0rk8j2M3
$$ 2 25 -18 -43 34 36 -25 4 -54 17 -7 -2 0 -36 16 -6 -63 -55 37 -100 -8 -52 35 5 -93 43 -5 41 11 2 -26 -38 5
5189Ek6M3rm3j1L7J9n6l2O7M4m2nM9K3mj00O5mmp1P2j4K3p2K2N0J3m2n8O8M5k8
$$ 5 -21 22 13 -30 -41 -4 15 -41 -73 -6 38 -4 -9 40 63 59 -41 24 20 16 -55 17 3 26 -46 -24 26 39 -3 -61 7 52 24
5222B4q3R1k3MPl2J0j6kM6K7k0Mn5j7k9L8J1L2m8K2KPK5m4O0l7k8O1j0o9K8L3
$$ 24 -59 32 9 13 20 -12 -2 -18 -20 26 53 33 37 -18 -35 -64 -26 -15 17 -31 -9 -7 0 25 -19 41 4 -24 37 27 -42 -14 19
5255A9k9PM5j4l2Rl3J2J1M8p5J1Qn2P9nk4k6M0lJ9Nr5N1M5m3Jk9K6K9j5%L4r7
$$ 19 -10 -3 42 28 -4 5 -28 -16 -5 43 -32 -21 -13 -65 14 9 -15 -41 -1 -4 15 20 -75 -24 21 -22 -21 -50 -24 5 -10 -10 24 -73
5289g3Q3k7pK0j4L5l1J3OJ3J2o4rK4J9m3MJ3K3K4J4l8k0K3K3Ol4J7k3PL3J3j2
$$ -73 10 -17 -24 -4 -18 17 -14 -1 5 18 30 -34 -43 -19 0 -43 -39 -26 -3 21 35 -3 -23 0 23 29 -5 12 -11 -4 29 42 30
5322C0m2nk7Q9J1q6OP4r5l2L3R8j31J12p4L5K3k0J1j8L0o8N8m8M1K4%l4m5N2K
$$ 30 -12 -17 -44 45 56 -30 -24 50 -45 -77 -44 54 -77 35 -39 -4 19 -1 10 -8 22 -46 12 -36 5 29 29 -5 -50 2 4
5353Dk1lPK4l5qJ9k8P0rq7J03J2m6m9M5J6%j3K9rk1K0l3M4l2J00r0j2NN8n7K2
$$ 4 -17 -20 -13 11 -24 -32 -13 -41 29 20 -67 36 48 2 -47 -2 14 14 1 30 21 0 20 -13 31 -1 99 9 -3 2 60 3 25
5386B5n0M0o3P5Jk6K4o8K8N1q1N9qM6m4m2K2L1Lrpl1N3j1j8J6Mj7J8j1MOk1K2
$$ 25 -25 15 -48 27 28 2 26 -42 -14 37 -44 15 7 53 9 -33 -11 20 23 14 7 -24 29 18 0 16 20 3 21 10 14 20 -1 21
5420B1m4O3lk6j4j5M2k2Mk3K7m6K3po2Q0l5J9J5j6L0K3p9J5k3N1o0P8m9OJ1J2
$$ 21 -23 40 37 11 -3 -18 24 2 6 -17 10 -36 -13 -20 -82 -2 -37 -18 -3 -19 11 34 -45 -30 -53 -2 -62 16 -33 -27 -16 -4
5452dj5j6J0J4L0m7P9p7K6j8O7o5L5J7o1k0Q6m9k3K0k7P9n3L5r3O8k4k9oN2l0
$$ -4 -19 -35 -25 -11 19 -28 51 -26 0 -18 49 -16 19 36 -25 -45 41 -8 -31 -11 -38 41 -12 23 -70 -2 -26 -55 -61 -9 -39
5483c9oj5R7m8m1J01m1LJL7j12O2N3m5J9nKl1OM7qj37O8Q8k6n9K2M2n2pP9J3n7
$$ -39 -45 -60 37 -11 -52 49 8 11 12 49 -63 -1 52 7 26 21 23 -8 -2 45 37 -100 -32 56 30 -29 -7 35 -17 -24 55 68 11
5516A1Rll9K1J5lm1M2Nm0l3lOO1NJ2nl9M8Lk8lJk2M2pJ6k7pl1K5L1n7N5k4k8L9
$$ 11 20 17 -22 -1 14 11 -30 12 17 -23 -56 -59 -53 8 13 25 20 -19 29 32 4 1 2 -20 22 15 31 4 -3 -34 -9 22 -35 20 -4 -32 7
5553Gm8J3K4J2p2O5K1l7L5l1L1p5N2j2O0r4K5K3mL7k7nm6Q5n4L9oj0m3L0MJJ9
$$ 7 -41 -28 -4 8 -64 1 22 -15 20 -11 20 -55 -3 -15 45 -49 -24 -1 -5 32 5 0 -46 39 -15 24 18 8 -35 -5 -1 0 19
5586A9J2rk9M4nn1L6l5N2l7K0j8l5RN1j4k5l9M9j8L2j3L8j04K1Q7l7J1o3N2JL7
$$ 19 31 22 -7 37 32 -19 17 -18 34 -3 17 -1 -36 -27 24 10 -15 -54 -5 -23 9 -4 34 -70 -49 38 1 12 -51 1 2 39
5618C9jM4q9J2K6rO4m6Ll1m0K0L3K8l0j6J0J3n9M2k6n3O4j7kK1j1L4m5k9P4n0
$$ 39 38 82 -7 5 31 22 86 40 43 12 -28 -8 25 53 23 7 17 30 -29 13 -13 -66 -2 -19 -21 0 -11 23 -22 -51 23 -27
5650b7m3K0K0nlO4l2L2l6M8m3j4l1Q1l8Ml8L9pM6Qq6L0L3N1j24L8nJ2L6J2j7j9
$$ -27 -70 -50 -30 -35 -38 26 -6 26 -10 38 -5 -19 -50 31 -7 -3 -41 -2 -9 37 45 -41 -11 22 73 -51 -13 -18 -6 30 42 25 6
5683FJ3j7K4j6j1L5o8L3K9p3N9k7MJ0k7M6m0qN7l9J7oN1n2rNJ0oJ0l9O0k1j8L2
$$ 6 19 2 26 10 -1 34 -34 -1 28 -45 14 -13 -9 1 -26 20 -20 -28 29 -10 7 1 52 0 -9 -4 6 0 10 -29 31 10 -8 24
5717B4o7Q0l5l8N3k0OLM9o2k1M8oL5l6rJ7m7N5l0j8M3n6L2Ol2K8j0k3R2o0n9O8
$$ 24 -43 37 2 -36 17 -3 3 6 55 -7 -28 20 14 49 13 4 21 -26 29 -1 -19 24 -32 0 6 -26 2 -8 -31 61 1 -58 10
5750A0PL0m2qlk1N1k4lj5M6n0m2P6l5R1l3j35J35j3l2%J2JJ4m2K9J4o1J9J2O2
$$ 10 17 47 5 -3 -6 -27 24 0 -3 -18 28 -22 -64 12 -23 68 35 -100 35 22 -10 -10 2 3 17 -25 4 18 -43 -24 -12 50
5782E0n9J7n1J2N0j16O1mj9Q9j1p1N7N8j1n6M7j0j6nM5po6J9J8l0J9jl2L6p5K2
$$ 50 -9 8 -43 -31 19 -97 -36 -40 -59 30 19 -52 5 63 52 -4 43 33 17 12 57 50 -16 3 21 -9 10 9 -23 13 -62 -40
5814d0N5k1nN7q4M4n7L3K1k2%K8O4o5m3M4oj9oL5jLrlqj7Jm6L4M5lj3M0p7Q6o9
$$ -40 15 -6 -11 46 -38 6 -51 -18 3 -19 -19 9 73 8 -35 9 3 -16 -22 13 12 15 6 3 -5 -22 -21 -67 -33 12 9 -4 36 -41 45 -24
5850b4K8qL5qq3R7m9j5j5K5O1m7l7K1J9J0J0j2l0k7j6O7k8m4K9LO8Pq1O7k7k5
$$ -24 4 -4 31 23 -60 37 -12 -27 -42 -17 44 -3 -40 -19 0 10 20 8 -22 -49 -65 2 -26 -70 -41 -38 30 37 -44 23 -4 -29
5882b9%N9o6J3Q6n8k7j1OM6Lqn0L8N3n1mo0K1L5l3K2jK5l0L2j8okJM8r0N9j4J6
$$ -29 -29 30 -36 -23 63 5 -22 -33 -27 19 22 14 -36 2 55 4 0 -60 -39 -4 -37 -15 -16 9 -21 11 -7 -13 -15 -14 34 -56 3 -11 5
5917EO8o3J8l1m2LrM2J3kkj8R4k6k5l4K3K4n1K5L4o2j2O6J1j01M2k1M6p3jQ8k2
$$ 5 73 10 28 -3 -45 -42 -51 -9 4 2 0 -18 76 50 25 -9 14 38 -13 12 46 -16 -28 38 49 -52 -10 -31 15 -58 -59 29 7
5950GJ5k9o1P3jj6jK9j3J6k9j9N1p1O6l3m4P5j9K9K0k1m8K6K4j0p2O2rNl0MK9
$$ 7 22 -7 -68 5 4 -12 -13 16 3 19 -10 -29 22 -49 17 -16 -60 15 -4 25 45 24 -24 2 26 16 -56 6 -3 2 -28 -24 5
5983El5J2L0RM8o5Kj6l6N3Qm6P6j4l6O9n7K5m2j6L0j3OK3l3k1N9mkMOm6l2K8k
$$ 5 -30 -18 12 21 69 4 6 -10 -46 7 15 -31 45 31 -5 64 7 32 -10 -26 4 -9 -3 20 -13 -34 25 21 19 23 29 -17 -49 -21 -23
6018b3M0RJ8q3M1M3p5oQN6k0jK3j11N3L6l4NQk1K1L7p1j4M7QL1j8j7M4ql9mNM2
$$ -23 17 26 44 -39 2 45 -30 -36 -28 28 8 7 30 -81 -28 8 -26 -21 -13 -34 -13 24 -47 -61 -14 -6 25 7 -10 34 26 -13 -17 -12 30
6053C0m0L3j3j6P9n5j4j8K5L4m7%J2r2J05M7j23P4J0l2k1nO5j31K2N8k4k3J0N3
$$ 30 -10 23 10 -6 73 18 4 -14 11 45 -2 -2 10 -82 23 70 -53 21 31 -1 -22 -27 38 -93 -71 -13 -37 -60 -50 3
6083Cl5M7k7LOj4K2j1k6R4n1l8L1M4o1L6k0j9L7ok6K2rK6K0m1k7m7O6K1m4k2Q1
$$ 3 -32 15 -12 -9 -3 -17 5 -6 -32 62 11 -27 4 48 -13 23 3 -16 21 15 -11 11 2 28 48 7 -20 -67 -1 20 -24 -46 35
6116C5o9k0oO2j8n0j6M0P2k8k0L3n3l5M6pN6l9j8m5J01l4nMO7k3q2Q3J2pl4L9
$$ 35 -34 -54 -60 2 -16 -66 -82 -42 30 2 -18 15 -38 -73 -27 -34 22 -17 -35 -80 21 -13 -18 -14 53 30 -52 31 43 36 2 41
6148D1Kp2pM7j5l5L1k4K7oJ0O4n5O4r0LRm3O4J1rp0L0R0o7j3lnrk0N2o8Q2jj7
$$ 41 43 -29 -36 11 -4 -39 -8 -32 -5 -11 -1 63 8 72 -18 -15 -6 -49 15 26 17 -53 -23 67 0 -13 -16 -21 -30 -50 2 -66 16 15 -2
6183bpO7j9m4J1J5m4K1O5j5l5j2J8L7o0k7N2k5qn6J02n0RM5o8K1J3m6j3M5K4l9
$$ -2 -9 58 39 -5 6 21 -23 -2 63 48 13 1 19 56 -4 -31 21 -4 -12 -68 34 -16 -7 38 -30 -9 4 -42 -55 -10 14 -25
6215b5R%J0LJ0Lk9L1J5o5K4RJ4lK8k7l6L9nL0k9K2m8K0j0l4J1Mj3K4K6L0NK7p8
$$ -25 -16 -16 -6 -3 7 10 -19 12 27 -38 -14 -5 9 6 34 7 -29 10 5 35 6 28 -20 0 -10 -44 -33 -29 -42 -18 8 38 43 70 -8
6250hJ0J7p1M1J1jn6O2k0K6Qk1L1n4K9l2lJ8j1J5M0ok6rO9j7j9o9J04j2p7K4K1
$$ -8 2 19 -52 -11 0 -1 -57 5 -15 11 19 -2 29 -25 4 -28 -31 -13 -24 -9 31 25 -1 -10 59 42 23 -46 58 46 -31 -7 14
6283A4j7j6m2O1%Pn1j3K4M5o3K9R1k9o9QQL3j5lK1j4o8O4q7J19m9QJ3K2On8J2
$$ 14 -3 -19 -61 0 0 7 -44 -57 -33 12 -51 -22 69 40 -29 -21 -13 20 5 2 23 9 -59 5 -82 37 -12 -4 9 31 37 -21 -9
6316iLkM0J9q3rM5l2M0ppj2j8L8n0R4k0J6np6J0M7J4l3pJ3k3qL2m8K3RkJ1J2K6
$$ -9 -6 -8 32 51 -32 -41 4 -28 12 5 -2 -14 -32 6 -44 50 30 46 41 -35 -25 22 36 3 -4 9 -14 -22 10 -38 -15 -6 -8 3 15 41
6352D1k2n5Q0j6j2l8L0J7k0l2K4m3P9lql3PM2p1qJ9k9P1p4M9j6K4l8Jj2M3O5m4
$$ 41 19 -36 44 28 16 -22 8 25 5 -27 -3 -46 33 30 22 -11 -4 38 -33 -41 -22 -51 20 -54 -5 -21 3 -35 -34 -46 -3 62 18
6385A8K8n5J8J2J1Po2jK7L5m8M2k3K3m0P3j39K2M5qM1k7l5K7K1j8l4QJ4LJ0l8
$$ 18 46 -9 9 21 32 39 -23 -24 3 38 -10 32 9 32 -8 65 -74 -52 -7 -15 26 -1 -36 -9 12 -6 -40 -32 -18 -15 -5 -43
6417d3N3k2j6N1l9jK0l9K6J5K4j6k9M8o7%Q3l7J8J2m3m6M7j8NL8o2O1j7jJ1Kj3
$$ -43 10 -12 -28 23 -16 -17 3 -36 -10 5 29 13 -16 32 -35 -35 48 11 29 41 -2 -48 -1 -19 -14 24 -38 23 6 5 16 18 5
6450EM0n5N8m2k8J1m3K8O2j8k6K0Jm2j9L2j7M2k3j6K2J6j4J1J2K1m0N2k6pJ9j2
$$ 5 45 -10 48 6 -22 -11 -54 -26 36 18 -8 12 13 -29 -48 -16 -33 9 -14 -30 -8 8 -6 5 17 38 -2 50 24 17 36 24
6482B4q1N3L0l3L1k1Nk3O0j9Oj3m8NJ2K4o9J18k4j7L4o6ML8l9J1k2m7Q2q9L5J2
$$ 24 -57 -4 26 -7 24 3 8 -15 45 26 32 19 -29 -24 -12 12 -57 61 37 20 54 -12 -8 30 -9 2 -20 -67 15 -74 -39 -27
6514b7j8N7k3l0N2m1RL6JK2jo6J5mj8l1RN9KRk0L2n3J5K6L8n8L0m9OQJ1%K4l3
$$ -27 -45 12 -11 -41 11 -30 -21 15 16 38 37 -29 -14 -18 -36 -67 -58 1 3 12 -8 24 -29 -14 12 50 -8 22 -27 -21 -13 -2 -2 22 -11
6549a1k8K0J3j2l5N6l4L0%K1ln2NQ9o9L6k4K6j1j1M1j01P3j9m9P0k5k4j1O1l3
$$ -11 -39 -19 -6 -18 -53 3 -31 -1 -1 20 17 -35 -30 59 -10 26 2 28 17 6 47 -54 19 0 -49 21 -4 -28 -39 22 -11
6580a1k6O8l3pnpk0L5nJ0jp1Q0n3N6k4J7j8m7P0L0q5N9%K0pjK5m6J1M1o2M8J2
$$ -11 -37 31 -2 -9 -14 -21 -41 -6 -11 -1 -2 -73 7 -46 10 -14 3 -15 -62 8 38 -47 12 12 32 25 24 49 3 14 55 -7 41 53
6614E3n4pj3O1l8K4Ol5k7M7m6J8N5n8Rj5L9n2N4k7krj8L3Op2Q0N8q4J6oKKo1J13
$$ 53 -1 -8 -21 40 2 26 32 -3 -30 17 -29 -11 44 -14 -5 -20 19 -33 21 -6 -8 -17 -35 -2 4 -68 12 70 -14 2 -4 -2 0 -61 52
6649E2l5p1M5J5N1l6k5PJ3J9k7n0N0N8r6L2k8M1j9o5M9oJ2j5j4P0j6k7k5QM7k0
$$ 52 17 -54 -9 6 57 21 -4 3 16 35 8 -42 8 66 -30 2 -26 15 -4 -69 -20 -26 -14 -29 -43 27 11 -16 -41 -33 14 -6
6681fn0N5k0M3l9Pl7J7K7j0M9o7L8K3n0MOj0M2Mp2K8L8m6M9nl9k4jN4k5j8QK7
$$ -6 -56 -1 -21 22 -17 -10 -47 -30 -3 -13 36 -31 7 30 -20 -16 -10 -20 22 26 -46 -18 20 -26 23 18 -21 -45 -46 8 -17 -35 -27 0
6715@j0Rjj0%K7k4QL8k9qj5J0Ln0O3k6R0j11J05m3l9lNK3m3L8rP4k7l5qL6j5p1
$$ 0 -10 -1 -2 -12 -12 15 -9 -1 37 8 0 -15 -5 -2 -52 11 -15 75 -36 69 26 -13 -16 -11 12 -31 7 -2 72 45 10 2 38 23 -48
6750d8M3K0l5rj5R1n3m3K0M7J3O3n2n6L4l6N0k2J7q1M2j0R7o8m0J5j7K6j2L6l3
$$ -48 -5 15 -20 -29 -44 47 -6 -49 -29 18 31 94 42 -14 20 -16 34 12 29 -52 -10 -20 77 9 -31 -16 -33 -7 -19 17 -16
6781a6k3J0kK8nO1o7J7N1m7oKJ4l1L2J5k8k1K9l7M4nj0L5n6Nk4L3J1l9R4n0o7
$$ -16 -39 -29 -31 -3 -8 53 -14 3 54 7 1 3 17 -14 18 33 5 -16 13 -24 20 15 5 40 -16 -11 -35 -2 9 -30 64 14 -53
6814e3J00l0n8L6k4QO5k6n9N4L8o7Pj1L6l3L2K2rJ6j9k1j8M9p7N2lMn3O0k3n3
$$ -53 47 17 -41 -5 -29 -21 44 18 -41 13 51 -16 -9 -20 16 -17 15 37 28 44 25 4 -14 35 -42 10 7 11 -42 18 -5 -58
6846e8N5m5M7rJ4K4m1LK9l6m1N9j6j6J3J3%m6O8MK5l1J1j5J1m8N2j5K6j34R7m2
$$ -58 -3 -48 -1 -10 4 28 -13 -10 19 -17 -58 1 -15 -31 -18 -5 -5 -51 17 21 46 15 26 11 22 -26 26 11 37 -97 0 -42
6878d2L8mM8n5rO1jr3O3n0M7l3L8no5M9k4J7m2N2N2l9K0k7M3j8n1Mj9J42q4j2
$$ -42 -4 -8 40 -15 -24 37 36 -57 6 -44 3 -30 8 3 -62 -13 -37 -20 -62 -10 42 3 23 -4 39 21 -30 -26 -45 97 13 1
6910AL0l5l7M3J3M8p0l5M8k6Ql9J17l9j3Kk4L0m2J3K8l5L0n8N2O5m3l6j2K4l4
$$ 1 31 -4 -41 2 15 63 -7 -42 6 -20 -12 -51 66 27 14 16 -8 22 -20 -7 21 -14 16 -42 10 75 32 -4 -16 8 -26
6941b6L2lJK9J1rq6N0RK3kqNj6J5Qj0rj9mm6L5lO7p8N1k7Om8P0k8L8J5k6n2J1
$$ -26 6 3 4 33 44 35 -51 -1 8 31 29 21 26 10 25 33 23 14 -5 -9 -55 -20 -23 44 -34 17 -10 -4 -52 18 -10 28 43 17 -35 -24
6977b4L5m4K4LK0k1Qqk0j8O7l5KK7j7Ro4J22p1j4K7Nn2Q9k4p4M3J4L8o9j3N6j9
$$ -24 11 -33 -9 -6 14 -7 1 -7 -27 -45 22 -13 -11 16 -1 8 -56 66 -5 -19 8 13 -39 50 26 -48 -5 9 47 -22 -35 21 2
7010Bk6L7j6KJ7j2l4OR1o1PRp8Q0m7P7o9j5M6QJ4j1Ro8l7R8l9P0p0N8m0rj2k2
$$ 2 -24 13 -3 -1 16 4 -30 -24 67 6 13 22 -56 24 -23 54 -15 -30 16 24 38 27 36 -32 -69 29 -10 60 -10 48 8 -1 -13 -35
7044c5J9L3j4j1MK5o4N0K1l7K0J4kl3L1Pk8O0j4l4l8k5J21q3%J0J3nK1k9Rl3j1
$$ -35 -16 17 3 -8 -4 21 -43 7 28 -9 11 25 23 -10 21 28 0 60 46 12 -26 -51 70 -13 -13 -3 10 5 26 -3 6 -27 -38
7077c8N8k7M0kmk0P3j38k6P9m1O9o5N2l1k7L1O9r4KJ9K0J0k2j7K8o1J13p4K9o1
$$ -38 20 -7 33 31 27 7 80 -58 -84 -5 -46 23 -42 10 -21 -48 -17 52 -42 -40 -21 -1 9 -13 -30 -2 -63 50 -24 5 -56
7108e6N2kN4m4J5M2j10J6J04n2J1o4k6O4jj5KK4j6n9J04po2K2Np8Q7j4m3P9k1
$$ -56 -4 -6 48 4 19 61 -49 -33 71 19 30 -34 -60 4 3 -12 -10 14 -2 -61 43 36 -26 -4 1 -77 10 -4 -47 32 11
7139A1ko9M8L8j1q4MK6M3lJ8j5J7n4R1j2m7J0%rJ2k3O9q0K2J3l0L1j4j0O3k9n1
$$ 11 9 -60 -12 26 15 -69 -65 -39 4 1 19 4 21 -33 58 46 -1 9 9 0 12 -11 58 -22 0 13 -17 14 0 -10 53 24 -27
7172b7P0J5l4Nj4l6P6j7m3K3p0M1J3L9j20R2K7n1j4Q5o4rj6M5J6j02P2m1K8kK3
$$ -27 43 58 24 29 15 -21 55 38 -5 18 -52 -11 2 41 -79 13 40 -11 -25 60 -4 -13 -29 16 32 -70 2 -39 -11 -13 10
7203A0Q%Km2M6lrk6k2O1k6kN2o1L4%m5J4rL8k2m0K4N1p7n0J43n5J2J5m2k4J6K3
$$ 10 18 18 20 -22 24 21 12 -14 -36 25 -1 -3 49 -12 22 22 -23 -9 -18 20 -2 -42 -18 33 -44 -94 49 -6 6 21 -21 -45 -29 -6
7237fJ1j0K0J2j2M1j2o5K1n3J5L2l9J03m8N3p3P0k2n2M2j9q3J16l8l5K6k5L2R
$$ -6 5 -5 15 27 15 56 44 -21 0 -53 -38 -6 -45 58 10 63 -10 60 38 -14 28 9 -74 42 4 -31 -5 -30 2 11
7267A1Lj6J1K4o0N9n5J3L6m8M3K9p1K9k4l4MJ05J2n9K9rJ3q0J7nL9JM5o5lJ9j8
$$ 11 14 -2 9 33 -27 32 -23 -10 26 -22 21 50 -21 8 -16 -50 -46 59 71 12 41 32 45 -35 -18 -23 16 17 62 -3 -6 13 -5
7300en2Q1n4L5J9M9p2L1n1M2l8j1J0O5m2rk7J5P0o1mL3l0J9k6rJ6J7j8QM0m1l2
$$ -5 -57 24 -30 5 24 73 1 32 -19 23 -15 -26 -16 49 7 -2 -29 -14 56 -5 -9 24 -6 13 -13 -22 -6 11 -7 1 41 0 -32
7333c2L0NLK2Oj8M5l0l5L0j0jk5Mk7M2J3L5p8qJ4k6mJ02n2ll3j3Q5n7l9L1K7N0
$$ -32 -2 3 6 28 34 16 61 31 -4 26 16 15 -10 -6 -33 9 22 57 -21 -29 -15 -41 -45 57 5 2 -31 -44 41 -16 -55 -24 3 53
7367E3o9J4oMK4kl5M3J6n0rrN0k3k3J3N3l4L4m7M1l5%J1Qn3P9n4m3O5j4m5N0J7
$$ 53 -16 -2 -8 -4 20 18 -17 26 42 -8 -17 -26 24 1 -22 -9 44 10 44 -3 38 3 3 14 22 -31 48 -6 -49 16 2 -43 7 24
7401B4j9j09P5J6kQ0r4k0PN5Ml7M4l2M0j2p3N1pM%J1k2N0k4p2N5pK4j7K1m7K7
$$ 24 5 -104 -29 -13 -15 65 -29 -49 -42 13 17 -20 24 -8 32 20 -53 -2 -9 -5 -5 6 -16 34 10 -62 -7 -14 10 -7 14 -33 -6
7434fk9K9k7KM0n2N2M3m8LoJ0o4K2j3M9k2J2l2L7J0qjk3O3p0P2o1k6M5J6J8j0
$$ -6 -35 -6 -33 -31 9 -43 9 52 4 7 1 11 -53 -31 -44 5 -17 -5 -37 0 10 2 1 -22 41 -29 43 -18 -44 1 17 35 25
7467B5m1L5Nk9J5J7m0j4RL7om5QN4q0Q6j1j7j9K5j7l4K4%QL0q7K9L7j2N3p5R3
$$ 25 -16 19 24 -5 10 27 -13 -27 -18 19 13 -32 -24 30 -50 36 25 8 -11 14 -3 -37 -13 -13 -5 25 -62 -33 4 -8 45 -30 63
7500F3j21N8k4Pj1P5r5P9j8L0n9L9J7p3RJ3Ok1K3Ko0k1O8J6orK6m4k5P0kj6oj1
$$ 63 -58 0 -24 -17 -28 47 -48 31 13 43 -16 23 40 -33 -24 -11 -5 -26 -3 -1 -61 -82 -14 2 -4 -13 13 -31 -56 14 12 -4 -10 -21
7534b1l5Q0qJJ4m4rR1j03L8L5r1O3%k6kOK0Nn5M8m1R2m6l3LOK6j0J6l1PJ9n9L6
$$ -21 -56 24 16 17 31 -13 -22 69 -34 4 39 -52 11 11 -15 -17 -11 9 14 -41 7 -34 58 12 -21 -18 -12 14 4 20 -11 -4 15 -44 -8
7569hJ2j5k5L2K5j3J6n7J0R9p4k9L3Kk2NKJ5l7N2o6O2n3K5N4J3n5K2Qm0lk3N1
$$ -8 4 -11 -36 -4 21 8 24 -33 -23 76 2 -27 6 8 -14 -9 -7 8 -29 23 -43 19 -34 -9 45 58 3 25 33 -7 -10 -33 18
7602A8J8l4l0N7n0J3nL1J8k0j1J8n8J3L3m7K6j2Jk0L5L8n4L3pJ6o1L7K1KN4o5
$$ 18 36 2 -28 29 -21 -8 -13 18 36 16 5 23 -35 -22 11 -36 -10 -22 -21 -41 -6 32 -22 11 4 20 -41 -4 17 19 73 8
7634HL3k5kJ4Op6P4rk7Rl2K3m3N6l1K7J8onl5O5l2j3l9N9j1p2P1nKok6QK1j1m
$$ 8 41 16 14 28 34 -42 32 23 -4 5 -27 -4 -47 9 -22 5 23 17 12 -23 42 10 -3 -42 17 6 -66 5 0 2 -4 -30 -22 -1 -12 -16
7670a6L4J1j9Ol2k2Q3p1M4K3Ml5L6l0Jp2M1l6L1J1Rmm0P7p1J0l2Q1o4Q5q5J9K1
$$ -16 18 29 10 16 -16 -38 45 -26 18 41 45 10 46 16 17 -55 -14 -50 -19 -8 1 -3 -43 34 -37 -27 -59 22 -42 43 -42 -23 -2
7703bj1L5r9R5Mp0j4P0k5J9j4L4K7m4qk1QJ7L0m6J0M7l5kRk8K0j0nK6j3l8L3j
$$ -2 -13 22 -77 18 22 -48 -62 8 -17 2 -12 22 49 5 -3 -24 -16 1 31 -15 -5 42 7 5 14 -14 6 -4 -9 17 4 -34 -1 -2
7737bl8rL3J4J9j8J4l4pJ7m5O5n5O2pPl5j6J05r7j4K1K9ok9N6j5m2M2j4k1K6r
$$ -2 -40 -49 -16 -2 17 -1 13 -21 -28 -11 -56 9 -46 16 9 16 -19 -35 70 -27 -41 -20 9 3 -26 30 15 -27 15 1 -20 6 -3
7770cM5j5j5p5Q9j2JL4q2Q0%p5L5l4M7l8n8J00k7oJ6j8j8L2J1m1K2K5nj1oj8J8
$$ -3 42 27 12 -63 26 14 15 49 -33 47 47 -28 7 -27 20 -18 -76 24 -3 -9 7 -11 -29 3 14 -27 -5 20 15 4 -2 -20 -2
7803bK8m6KL2M4j7Rm6Oj6j4M0k2K6j8oPM4p0O3K5p7mO8o3jl8Q6q6J17n6o6P8n5
$$ -2 26 -20 -18 14 58 41 50 4 10 -6 -20 20 -2 24 6 0 7 51 -19 44 69 -8 -12 56 -7 -8 -46 40 -46 71 15 -51 27 -28
7837b8J6N8p9MK5L2J8l9j2N2n3k5L3L1k6j5P4r0J7oN6j08M9j2P6j9l9M8m2k5j7
$$ -28 -12 46 -33 -29 -4 28 46 7 -5 47 -6 -31 2 33 7 -8 66 -24 -7 -13 43 -65 -16 -28 48 29 -10 38 -4 -29 -46
7868d6KOK0K5Lo2K5K9J4l4L1rQj7R0q6j9Mj2%%P5k9K5om9L0mJ2k2k3J0J9N0p6
$$ -46 -44 -38 -18 7 10 -52 -27 2 16 -18 13 4 12 -5 85 -1 -20 -16 -28 -28 -28 47 18 43 37 -12 18 14 26 4 -19 -9 10 60 -16
7903a6Rpm1L5Qk1L8qL1j05L9O4%okk9O4m3j1L0o7R0p5M0k8l8J05n1Qk4j2Q8o2
$$ -16 -7 -14 -55 -20 -12 -33 5 -3 28 -77 -38 26 26 20 18 -11 53 10 -1 29 -38 52 -23 17 -11 -49 56 5 13 -11 -23 65 3
7936CNj8L6J7j4m7j2L5J4n0K9L8k0NoOj7k1m8P9p1J5N5Nn1J1k5K9L2j7RkK0j8
$$ 3 8 -10 26 43 29 -18 -30 5 19 -31 -2 36 16 21 15 21 4 -17 -65 14 -57 -42 13 18 -33 -22 -47 -18 14 -3 6 4 24 6
7970FM4m1jK4l5PK3n7jL6R%k3j9rM2nl5L2L9m8K5q8P2K0J3r0M6k0M8j1l1l4L0
$$ 6 50 9 8 32 -3 4 27 -30 -31 5 14 14 -9 -28 -37 5 0 -35 -3 36 -12 13 -75 -3 17 30 -60 -14 -34 14 3 -28 -62 -32
8004c2P3lo6j0M1JK3l6K9n9P2k2L6n7L6k8K3Jm1K7l4N6m3LJn7P2Rm1J1L1J5o1
$$ -32 41 38 -28 -38 3 4 27 -9 20 -39 33 11 47 -10 26 -2 21 22 -19 8 -26 30 -13 -10 -9 -66 6 15 -26 -15 16 31 -30
8037c0L7pJ2l4Q9r3MO5n6kO0k6m6k9P0o7N5q5J06k9m3L3R7r5J4O2p4pL7J7l9Q
$$ -30 7 0 12 -22 67 -26 -22 43 -13 -15 45 19 -27 -56 14 -53 2 -83 23 -6 -49 -16 81 -14 0 62 -12 -19 18 35 -4 4
8069DpNm5N9k5Pl6P1m5j8M1o0O0jn9K8J2J9m1l9O7M4p5J9m7J02j8Nk4j4l3Q3M
$$ 4 -3 2 -43 16 -9 -2 -38 33 -12 -30 11 -49 11 10 -49 -21 -9 10 -31 -70 -3 41 -34 -15 -62 40 22 27 3 -11 -44 39 43
8102D3m6O9r9J7K6J1j7j0nO9o1k9N4p7L7L0m5J1RK6j3m3qK9J6j0j4NKL7j9j6l
$$ 43 -3 66 -33 -16 10 21 4 -6 -11 58 -3 -32 22 -55 -18 12 -33 -22 -13 13 0 -43 -51 -22 -6 -16 -30 -25 -23 14 -5 -21 -24
8135b4R6n1j0l0Pk3K6K8lN6q5K8l5j8N3n0J7M3L9o6rKOL1JK4r4K9J3m6O9j5L2
$$ -24 72 21 11 -19 -12 -35 -9 19 16 72 -13 15 -20 -38 15 -35 -18 25 64 -2 -11 -9 -3 28 29 53 -41 -12 1 -45 24 9 41
8168D1jj9j7Pn6P0K3m0M4l5L9m3j0qm8M3L8j1n5J7K9JK3
$$ 41 40 21 4 11 -45 25 48 8 52 17 56 13 3 -5 -53 -10 28 17 -38 -21 8 9 32
8191C2
$$ Imaginary data points
##PAGE= N=2
##DATA TABLE= (X++(I..I)), XYDATA
0@%%%%%%%%%%%%%%qJ6j6J6j6K4l2L2m0M8n6P2q1Q9j04J20j37J60j84K07k32K60
$$ 0 0 0 0 0 0 0 0 0 0 0 0 0 0 0 -8 8 -8 8 -8 16 -16 16 -24 24 -32 40 -41 48 -56 64 -73 87 -97 110 -122 138
36A38k93L32l71M12m60N10n67O30o95P68q49R38j034J138j255J383j522J678j855
$$ 138 -155 177 -194 218 -242 268 -299 331 -364 404 -445 493 -541 597 -658 725 -797 881 -974
55i74K053k277K534k830L179l594M097m728N541o638Q203j0632J4948k4946R1597
$$ -974 1079 -1198 1336 -1494 1685 -1909 2188 -2540 3001 -3637 4566 -6066 8882 -16064 75533
70G5533M5998j20874J8632k2660p5113j3182O8478m531j3325L6065K3420j1832
$$ 75533 121531 657 19289 -3371 -78484 -91666 -23188 -27719 -41044 -4979 18441 6609
82F609L6976J9361l8604p894K7503n4394n8075M3726L2192n9668j018P4188j727
$$ 6609 43585 62946 24342 16448 43951 -10443 -68518 -24792 7400 -52268 -53286 20902 19175
95A9175m7042M4709N6597k6905k3865J4922l3650n5181o530j091o671M9264N0700
$$ 19175 -27867 16842 73439 46534 22669 37591 3941 -51240 -57770 -58861 -65532 -16268 34432
108C4432j4193M520M9041k1138o4324J8071L0813o2314m7137M1347J2689l6265
$$ 34432 20239 24759 73800 52662 -11662 6409 37222 -25092 -72229 -30882 -18193 -54458
120e4458K7248O3141M048j2000J5270r788k7307J029j0136l2349Q022J8397l4332
$$ -54458 -27210 35931 39979 27979 43249 33461 6154 7183 -2953 -35302 -27280 -8883 -43215
133d3215j2861N8961K8067k6806K3626N0553l0397n8536M037N321m0009j2981
$$ -43215 -56076 2885 30952 4146 27772 78325 47928 -10608 -6571 -1250 -41259 -54240
145e4240K8923R656j316J8542J3097P624K3298K156l1402q129M919m1076l8289
$$ -54240 -25317 -15661 -16977 1565 14662 22286 45584 47740 16338 8209 13128 -27948 -66237
158f6237K9858K9907k0900M834N1054J2465k6368P859K3061j6681l0082j1948
$$ -66237 -36379 -6472 -27372 -22538 28516 40981 14613 22472 45533 28852 -1230 -13178
170a3178j2463j4015r91L254J4058L5672K0003j2710M405K4171j6226m0198J858
$$ -13178 -25641 -39656 -40647 -37393 -23335 12337 32340 19630 24035 48206 31980 -8218 -6360
183f360J3905l1007l0724J9276K3432m596Q377L3717J8627p205j2493j0590r228
$$ -6360 7545 -23462 -54186 -34910 -11478 -16074 -7697 26020 44647 37442 24949 14359 5131
196E131j1652k0525j2393J3449J1913j0447N268L7821J9887j4226K30J7949j4589
$$ 5131 -6521 -27046 -39439 -25990 -14077 -24524 -19256 18565 38452 24226 24456 42405 27816
209B7816l9618j3911O800q442j3993R015K3894J5428M743P712J5934Q066j6559
$$ 27816 -11802 -25713 -18913 -27355 -41348 -32333 -8439 6989 11732 19444 35378 43444 26885
222B6885k5039o789k840k2908j7326J8273K4660n57J371K6588J8232j3156j4025
$$ 26885 1846 -4943 -7783 -30691 -48017 -29744 -5084 -5641 -4270 22318 40550 27394 13369
235A3369M468k737k4244k0993O19P470j766nJ8789K6241P327p899K564Q858j3265
$$ 13369 17837 15100 -9144 -30137 -29518 -22048 -23814 -23819 -5030 21211 28538 20639 23203 32061 18796
250A8796k8470r394N960r615j6498R539K6726J0980q6J3750J8136m826k2370j3102
$$ 18796 -9674 -19068 -13108 -22723 -39221 -29682 -2956 8024 7938 21688 39824 34998 12628 -474
264d74k329j1379j9279l109J7340J3190k32P833K2960J0983j2680j0285M489n819
$$ -474 -2803 -14182 -33461 -36570 -19230 -6040 -6272 1561 24521 35504 22824 12539 17028 11209
278A1209k5388j5821P530N869p537K914K3227J8337j525k043R999K705j9029k1299
$$ 11209 -14179 -30000 -22470 -16601 -24138 -21224 2003 20340 18815 16772 26771 29476 10447 -10852
292a0852l773L34j2251q347J5731K3025N426n39J4039J3012j1016k0501m901L80
$$ -10852 -14625 -14291 -26542 -34889 -19158 3867 9293 8754 22793 35805 24789 4288 -613 -233
306b33j5077j7743L529J5947N023n38J4476K1730L502j2324m246L381j1458k3255
$$ -233 -15310 -33053 -29524 -13577 -8554 -9092 5384 27114 30616 18292 14046 17427 5969 -17286
320a7286q215Q601R43p994P137K2692J1826l793K380J1208k896k1000j5136K93
$$ -17286 -25501 -16900 -15957 -23951 -16814 5878 17704 13911 16291 27499 24603 3603 -11533 -11240
334a1240k844j2958k169J8159J6607O05K264J5470P864j4294j5616l42k399j7401
$$ -11240 -14084 -27042 -29211 -11052 5555 6160 8424 23894 31758 17464 1848 1506 -893 -18294
348a8294j2076Q857J2437q9J302J6421J5855k028q871J361K294j3969j9980m012
$$ -18294 -30370 -21513 -9076 -9165 -7863 8558 24413 22385 13514 14875 17169 3200 -16780 -20792
362b0792O260l748o349J2666K2387O595m451N886Q488j0190j9827o920J885o666
$$ -20792 -14532 -18280 -24629 -11963 10424 17019 12568 18454 26942 16752 -3075 -9995 -8110 -14776
376a4776j0433L633J5195Q862p3N600J4273M031j3089j0449K001m769j8517q059
$$ -14776 -25209 -21576 -6381 2481 2408 8008 22281 26312 13223 2774 4775 6 -18511 -26570
390b6570J1808P735m819M993J9080R054o640l022M854l527j5818j2838q63K721
$$ -26570 -14762 -7027 -11846 -6853 12227 21281 14641 11619 16473 12946 -2872 -15710 -16573 -13852
404a3852l497j605J3376J8182K530n760O744Q238j2570j8037K6L036j3045j0330
$$ -13852 -17349 -18954 -5578 12604 15134 9374 16118 24356 11786 -6251 -6225 -3189 -16234 -26564
418b6564J0179J3161J745K305J1624R417k608r588o058k4n021j3907n884J0121
$$ -26564 -16385 -3224 -1479 826 12450 21867 19259 9671 3613 3589 -1432 -15339 -21223 -11102
432a1102N175p192N282K1323P466r894K44P646j0302j9713m487M801k002l400
$$ -11102 -5927 -13119 -7837 13486 20952 11058 11302 18948 8646 -11067 -15554 -10753 -12755 -16155
446a6155N072J0295Q147J959o15O309P092r818j7212j378K886j3787r621J5504
$$ -16155 -11083 -788 7359 9318 8703 15012 22104 12286 -4926 -6304 -3418 -17205 -26826 -11322
460a1322J4712n125l7J5478N655r519l647L308m072j0365q727l671L847N327k4
$$ -11322 3390 -1735 -1772 13706 19361 9842 6195 9503 5431 -4934 -13661 -17332 -13485 -8158 -8182
475h182N754J7118N398j2529k421R963p260j8826J75Q286r308j0105J0250J3575
$$ -8182 -2428 14690 20088 7559 5138 15101 7841 -10985 -10810 -2524 -11832 -21937 -11687 1888
489A888K672L582P605J940m521q501j0302k078M020n841q084Q960J0628p024j763
$$ 1888 4560 8142 15747 17687 13166 4665 -5637 -7715 -3695 -9536 -17620 -8660 1968 -5056 -6819
504f819J9338J0286j2028n213N990q700j7660k110P296J202O74M537M346N891
$$ -6819 12519 22805 10777 5564 11554 2854 -14806 -16916 -9620 -8418 -7744 -3207 1139 7030
518G030M408k984k96P583n205j9496n141Q201n917q920J4268J7071m730n340R828
$$ 7030 11438 8454 8158 15741 10536 -8960 -14101 -5900 -11817 -20737 -6469 10602 5872 532 10360
533A0360L963q750l343K237l977o962n599m320M500J0784K608N22J1823N769j4227
$$ 10360 14323 5573 2230 4467 490 -6472 -12071 -16391 -11891 -1107 1501 2023 13846 19615 5388
548E388q487R398q35j5766j850R410m853q886Q420J3378L690J883K816k484m952
$$ 5388 -3099 6299 5464 -10302 -12152 -2742 -7595 -16481 -8061 5317 9007 10890 13706 11222 6270
563F270o026q986j966P738p87q939N218J2525l702n432J3809J0561j1460r632
$$ 6270 244 -8742 -10708 -2970 -3757 -12696 -7478 5047 1345 -4087 9722 20283 8823 -809
577h09L490l912j2399r14Q072L428J523K863J223L706N042l377m529M508j914
$$ -809 2681 -1231 -13630 -14544 -6472 -3044 -1521 1342 2565 6271 11313 7936 3407 7915 6001
592F001j6388o809J0062J867o561Q634J4975k448q118M472M645n670m433K4l111
$$ 6001 -10387 -17196 -7134 -5267 -11828 -3194 11781 9333 1215 5687 10332 4662 229 253 -2858
607b858m310k837k341M504J1276L256l274N578N846j0538j0253O374L244j1516
$$ -2858 -7168 -10005 -12346 -7842 3434 6690 3416 8994 14840 4302 -5951 423 3667 -7849
621g849m452Q362R08n743M928J0880L387p10p39l569l865l481o466k476P149K619
$$ -7849 -12301 -3939 -3031 -8774 -3846 7034 10421 9711 8972 5403 1538 -1943 -8409 -10885 -3736 -1117
637a117o745K126J1704O67o294O179Q091q234j0794R38O10o389j261N888M013
$$ -1117 -7862 -5736 5968 6635 341 6520 14611 6377 -4417 -3479 -2869 -9258 -10519 -4631 -618
652f18J572J529O71L040M109l433o467J122M2j0667n687Q812N422m389L184J0811
$$ -618 954 2483 3154 6194 10303 6870 403 1525 1567 -9100 -14787 -5975 -553 -4942 -1758 9053
668I053N34p090M67L478l187n169j860r17r38o36j006L671Q636K397m055K023
$$ 9053 9587 2497 2964 6442 3255 -1914 -3774 -4691 -5629 -6265 -7271 -3600 5036 7433 3378 5401
684E401M666o360r340K378L860o702m661O102M686j755J625O476L126j964l359
$$ 5401 10067 3707 -5633 -3255 605 -6097 -10758 -4656 30 -1725 -100 6376 9502 7538 4179
699D179k961j370j844m895k026N202L019l645J309Q708K179n307O61M593l864
$$ 4179 1218 -152 -1996 -6891 -8917 -3715 -696 -4341 -3032 5676 7855 2548 3209 7802 3938
714C938q274j081K392j729k054K723M843K770r4m52K300J866m065n605N59J102
$$ 3938 -4336 -5417 -3025 -4754 -6808 -4085 758 3528 3434 2982 5282 7148 3083 -2522 -1963 -861
730h61n601l459N767N631j575J99O065K377m531l054J244p47m357l441Q29K378
$$ -861 -6462 -9921 -4154 1477 -98 101 6166 8543 4012 958 2202 1455 -2902 -6343 -5514 -3136
746c136J26p99L605N999P20l425K97K321l772o825l66K981j611k797L265N486
$$ -3136 -3010 -3809 -204 5795 6515 3090 3387 5708 1936 -4889 -5255 -2274 -3885 -6682 -3417 2069
762B069J030j354J933L075j205m689k452P24j268m037p27M514K672j498J035N338
$$ 2069 3099 1745 3678 6753 5548 859 -1593 -869 -2137 -6174 -6901 -2387 285 -1213 -178 5160
778E160J963l624k106J595j386n584k750K551J874j206O80N004L589j591j860
$$ 5160 7123 3499 1393 2988 1602 -3982 -6732 -4181 -2307 -3513 -2833 2171 5760 4169 2309
793B309J529P06m284m251O81J402k358j830L398M533K31j001K695K810k338m414
$$ 2309 3838 4544 260 -3991 -3310 -1908 -4266 -6096 -2698 1835 2066 1065 3760 6570 4232 -182
809a82n09J099k611l757R02L738N73j216K625M491L68l017q35J097k209m787j239
$$ -182 -691 408 -2203 -5960 -5058 -1320 -747 -1963 662 5153 5521 2504 1669 2766 557 -4230 -5469
826e469K630R45j586J341M757K009j983n59K329n10m541k658J294J69k772m99
$$ -5469 -2839 -1894 -3480 -2139 2618 4627 2644 2085 4414 3904 -637 -3295 -2001 -1832 -4604 -5103
842e103L750K972o97j99L197J761k828l026N44K20l632k729K087K952l94k05L409
$$ -5103 -1353 1619 922 723 3920 5681 2853 -173 371 591 -3041 -5770 -3683 -731 -1125 -1330 2079
859B079L053j312k657K15R45k555l680K76K209n31j788K094M287O53j835J022
$$ 2079 5132 3820 1163 1378 2323 -232 -3912 -3636 -1427 -1958 -3746 -1652 2635 3288 1453 2475
875B475K224j766m294r83J149j114k340R14L468J758q87N38K871O83l232k269
$$ 2475 4699 2933 -1361 -2344 -1195 -2309 -4649 -3735 -267 1491 604 1142 4013 4696 1464 -805
891h05J205l73l770j288L125J880j515N27L788J536k035j056J205k75k941k546
$$ -805 400 27 -3743 -5031 -1906 -26 -1541 -1014 2774 4310 2275 1219 2424 2149 -792 -3338
907c338L09J304q57j036K636L987j28j976J621K003k908l861R20J242k485j873
$$ -3338 -3029 -1725 -2582 -3618 -982 3005 2877 901 2522 4525 1617 -2244 -1324 -82 -2567 -4440
923d440K140K606O3j2J792J875m95k564j655N90m42k999o82L281J165k249P34
$$ -4440 -2300 306 369 357 2149 4024 3529 965 -690 -100 -542 -3541 -4223 -942 223 -2026 -1292
940a292M450O64k573L76J944j964l787p49R31j80n57O91K134K068j94j255J293
$$ -1292 3158 3822 1249 1625 3569 1605 -2182 -2931 -2000 -2180 -2737 -2046 88 2156 1962 707 2000
957B000J894k392l483R57J215l244j904L677K786j486M0K929M52k264q86L87k76
$$ 2000 3894 1502 -1981 -1024 191 -3053 -4957 -1280 1506 20 60 2989 3441 1177 291 678 402
974D02j255j673p74J468J154j045J075M208O73l461k80K355k190l754J119K352
$$ 402 -853 -2526 -3300 -1832 -678 -1723 -648 3560 4233 772 492 2847 657 -3097 -1978 374
990C74j842j869J816K078J4N22J214O45k75j963k652m1J357j473j391L078K383
$$ 374 -1468 -3337 -1521 557 571 1093 2307 2952 2677 714 -1938 -1979 -622 -2095 -3486 -408 1975
1007A975k533q19L874J358l013n02J866j766l353k49J424N06N64P66N51J161L24
$$ 1975 -558 -1377 2497 3855 842 340 2206 440 -2913 -3162 -1738 -1232 -668 98 649 1810 2134
1024B134j813j16K444q63l998r9K200j953k131L483L600j362j150K057N1k361
$$ 2134 321 205 2649 1786 -2212 -2311 -111 -2064 -4195 -712 2888 1526 376 2433 2484 123
1040A23o27M50l79m52q56j246J022K359k18j75L159J253l814j992K342n24l383
$$ 123 -504 -54 -433 -885 -1741 -2987 -1965 394 176 1 3160 4413 599 -1393 949 425 -2958
1057b958P79K938j137k071J567J988j06M65Q16m15o13j185k482l56K273l1j849
$$ -2958 -2179 759 -378 -2449 -882 1106 1000 1465 2281 1866 1253 68 -2414 -2770 -497 -528 -2377
1074b377J909K873j848j807L197J934k902j620J306j134k691K97J809O83P70N51
$$ -2377 -468 2405 557 -1250 1947 3881 979 -641 665 -469 -3160 -2863 -1054 -371 399 950
1090I50l33N18Q14j428r70K029K7l743q86K636m42j933K507L429j180j784J041
$$ 950 617 1135 1949 521 -449 1580 1607 -2136 -3022 -386 -828 -2761 -254 3175 1995 211 1252
1107A252K68j784n30M88l77k24k91j009Q04K567J81r70J815J239l238k273K000
$$ 1252 1520 -264 -794 -306 -683 -907 -1198 -2207 -1403 1164 1345 375 2190 3429 191 -2082 -82
1124h2N11k657M9K545k75j571J089J819J53r4K7r46n95m09j707k28K244N47j826
$$ -82 429 -2228 -2179 366 91 -1480 -391 1428 1581 1487 1514 568 -27 -436 -2143 -2371 -127 420 -1406
1143a406R27K653r88j849J906J580k228j892Q43k45j475K49J424P88O12J40o04
$$ -1406 -479 2174 1186 -663 1243 2823 595 -1297 -454 -699 -2174 -1925 -501 287 899 1039 435
1160D35N04P79j256j267J244J54k601p30K429O48j312J300K318p84j826K06L78
$$ 435 939 1718 462 -805 439 593 -2008 -2738 -309 339 -973 327 2645 1861 35 241 619
1177F19r08p27J5J43K53n8n23R52J850j01j284R34R97k153j810J269O81j748k41
$$ 619 -289 -1016 -1001 -858 -605 -663 -1186 -234 1616 1515 231 1165 2162 9 -1801 -532 149 -1599 -1840
1196a840J754N66o35M66J083K78n65q39o93j5k83j122J97J867N30j265N99J765
$$ -1840 -86 480 -155 311 1394 1672 1107 268 -425 -440 -723 -1845 -1648 219 749 -516 83 1848
1214A848n18j545O17R37j318j420K68N38l51j99O79J130N63m38l85O52K13j425
$$ 1848 1330 -215 402 1339 21 -1399 -1131 -593 -944 -1143 -464 666 1229 791 406 1058 1271 -154
1232a54r65P81J76j365j85J693P86p19L63J212q6j265n92K50j41q15l97O43Q72
$$ -154 -1119 -338 -162 -1527 -1712 -19 767 48 411 1623 1537 272 -320 -70 -211 -1026 -1423 -780 92
1251I2k27l05R39J138n43j054M96M31j260j134N43P07n57l55R13J043j00m33M19
$$ 92 -135 -440 499 1637 1094 40 536 967 -293 -1427 -884 -177 -734 -1089 -176 867 767 334 753
1270G53N18n38j313k68N81l13q76N28J384J68o35M51R56k60j082j75M06l93j066
$$ 753 1271 733 -580 -848 -267 -580 -1456 -928 456 624 -11 440 1396 1136 54 -121 285 -108 -1174
1289a174j23P91M50m84K91J219M37q55m45O47j31j211n22N90L64o67pJ040O86
$$ -1174 -1297 -506 -56 -540 -249 970 1407 552 107 754 623 -588 -1110 -520 -156 -823 -830 210 896
1308H96l27l49N80K69q82q88K54L95o90o54Q59R84j91l27P76O59n97q02N8K61
$$ 896 569 220 800 1069 187 -701 -447 -52 -742 -1396 -537 447 256 -71 705 1364 767 -35 23 284
1328B84o86p73K55P50O3l66M68R73rq02jN87m19j136j39P08q7n82L72J117K66
$$ 284 -402 -1175 -920 -170 -107 -473 -5 968 959 157 156 743 324 -812 -951 -243 -330 -912 -540 577 843
1349H43n39KO04j61q83n64M99M3p24k19R10N74l60n3R07L31p50o08L04P7q40m65
$$ 843 304 306 910 749 -134 -698 -199 -156 -880 -1099 -189 385 25 -28 879 1210 460 -148 156 233 -607 -1072
1371a072M73O78k94k46P35P74m30m75K54L17p51q33K10N06l47k93N55P92J8m78
$$ -1072 -599 79 -215 -461 274 1048 618 143 397 714 -37 -870 -660 -154 -501 -794 -239 553 571 93
1391I3L01N93l23r89j49M59k23p95J11J029J79n46L46Q94j51p15j44K68k00o39
$$ 93 394 987 664 -325 -474 -15 -238 -1033 -922 107 286 -260 86 980 829 114 -30 238 38 -601
1411f01k19M28M16k90j39P69O66n11m62M25J35r68n83P04K17o19j08P35M17k17
$$ -601 -820 -392 24 -266 -405 364 1030 519 57 482 617 -351 -934 -230 -13 -632 -740 -5 412 195
1431A95l6M22K55l14o92j99L36j85p39K93J029o5o03M45P96l93p51L02L30n88
$$ 195 159 581 836 522 -170 -369 -33 -218 -957 -664 365 300 -303 142 938 545 -206 96 426 -162
1451a62n67J89L61k6k1J77M84L50m25m13M35K34q73m85O57J47r40Q5J078J65l82
$$ -162 -729 -540 -179 -205 -226 -49 435 785 360 -53 382 616 -257 -742 -85 62 -878 -793 285 450 68
1472F8K56N41l53n57j92L8O3o3k86M6N70N9n42M34Q91l18r24L34L77p52p05O97
$$ 68 324 865 512 -45 -237 -199 -136 -199 -485 -439 131 190 -352 82 973 655 -269 65 442 -310 -1015 -318
1494c18M55m60l3N35J40q4M3O4Q4L5n85n52L33K63m74m4J093J65q14k6Q34j84
$$ -318 137 -323 -356 179 319 235 278 342 426 461 -124 -676 -343 -80 -554 -598 495 660 -154 -180 654 470
1516D70p40K52M14n88m28J67J66J39K53M5J59L20k03p25J18O66m42p12L70M60
$$ 470 -270 -18 396 -192 -620 -453 -287 -148 105 150 309 629 426 -299 -181 485 43 -669 -299 161
1536A61o63l33J025M84n35L0L62k23n19m1L1Q5K07j88l76M91K88m50k9R72J9r87
$$ 161 -502 -835 190 674 139 169 531 308 -211 -252 -221 -136 71 -117 -493 -2 286 -164 -193 779 798 -189
1558a89j37O16m72o70N21O23l36k32L23J72o7J68l0j06N2k94o33J22O29j45l76
$$ -189 -326 290 -182 -852 -331 292 -44 -276 47 219 152 320 290 184 236 -58 -691 -569 60 -85 -461
1579d61P21M98p62l54O96R9n74l8M78l42n01J21K44J11L55O7k35J87J22o21k45
$$ -461 260 758 -4 -358 338 437 -137 -175 303 -39 -540 -419 -175 -64 291 358 123 310 432 -189 -434
1600d34P47n8p89R2O16l07n23O30O91k73l33K34j28l98oM9K7K28j8l97J28N45
$$ -434 313 255 -534 -442 174 -133 -656 -26 665 392 59 293 165 -233 -239 -190 -163 65 47 -350 -222 323
1622C23j87k85N41L64q13m80N51L7n51J60O45j74k93J49J94l2J21p6j31j7jn45
$$ 323 136 -149 392 756 -57 -537 14 51 -500 -340 305 131 -162 -13 181 149 270 194 63 46 45 -500
1644e00j05O47J35m68K73N74l47n25L81L74m03k77L08l9l98%J60J21L26M3k03
$$ -500 -605 42 177 -291 -18 556 209 -316 65 439 36 -241 67 28 -370 -370 -210 -89 237 280 77
1665G7P0K28l38l71L89K14n57k70O02N2m90K61O22o5l68M3J19k41j44k0K7Q5L2
$$ 77 147 375 37 -334 55 269 -288 -558 44 96 -394 -133 489 424 56 99 218 -23 -167 -187 -160 -75 -43
1688d3k35P9M85K5l62J60M17l70n37K08K67l24j84M05J46j53o7K60N7M9j10j65
$$ -43 -278 -199 286 311 -51 109 526 156 -381 -173 94 -230 -414 -9 137 -16 -83 177 234 283 173 8
1710HJ9K7l29k44L81L17l22p3N12R0m89M5L78q9l51r3J89m5j49k3K21J98n8j02
$$ 8 27 54 -275 -519 -138 179 -143 -216 296 386 -103 -58 320 231 -120 -213 -24 -69 -218 -241 -20 178 120 18
1734A8L9K25j87l79K16K44l24k97L23K88k29j23L55J83k00j61N9L4p8k82K6J81
$$ 18 57 282 95 -284 -68 176 -148 -445 -122 166 -63 -186 169 352 152 -9 50 84 6 -276 -250 -69
1756f9P0k33N9M41Q8k85l6K83o2m55o7K46Lk63N0L42R5j74l5K23J47k47k41J20
$$ -69 1 -232 -173 268 356 71 35 318 256 -199 -266 -20 -17 -280 -230 112 207 33 -2 221 368 121 -120 0
1780@O6l07j62K56K01j49j5K79K46j97l00J78J78l03k96J31K09j43k09K64L75
$$ 0 66 -241 -403 -147 54 -95 -110 169 415 218 -82 96 274 -29 -325 -194 15 -128 -337 -73 302
1801C02p5k33J44K38k41l26N6J54j61j48lL30J22k05L5M15Kl85p4J26K9m52j05
$$ 302 227 -6 138 376 135 -191 -135 19 -142 -290 -293 37 159 -46 -11 404 406 21 -53 73 102 -350 -455
1824d55M21P4j84p4L95J59j85j51J93R0l19k56Q8K75k39k27L49L47k15j82L01
$$ -455 -34 40 -144 -218 177 336 151 0 193 283 -36 -292 -204 71 -168 -395 -46 301 86 -96 205
1845B05K32k85l51J25J26j68l04K25K66J5j58J35L02m2l10l1J98l7m99N2K55K8
$$ 205 437 152 -199 -74 52 -116 -420 -195 71 86 -72 63 365 323 13 -18 180 143 -356 -304 -49 -21
1867b1k34K4M61Q9k56oJ92k1l05k16J97J02k71j43M20K32j41j27K38K02l40k76
$$ -21 -255 -231 230 319 63 57 249 228 -77 -293 -96 6 -265 -408 12 244 103 -24 214 416 76 -200
1889b00J67J09k68k76K85K16pj77K31L04j54k45QK88k30m23Q1K89r3k50K20M06
$$ -200 -33 76 -192 -468 -183 33 26 -151 80 384 230 -15 -7 281 51 -372 -291 -2 -95 -345 -125 281
1911B81P3l26K9K38l0m38r0K33O3l79l2M27K70l29n1M32O8m83j78L32l5l46j26
$$ 281 354 28 57 295 265 -173 -263 -30 33 -346 -378 49 319 -10 -61 371 439 -44 -222 110 75 -271 -397
1934c97K98J28j12p3K72K83j08k93Q5J74j89n10J78L31j67k73M02M08l18j68K53
$$ -397 -99 29 -83 -156 116 399 291 -2 83 257 68 -442 -264 67 -100 -373 29 437 119 -49 204
1955B04K15k46k05j68J36j11j78PL84K90l52r2N38K8n20j18M54o8o32O2L86r5
$$ 204 419 173 -32 -200 -64 -175 -353 -346 38 328 -24 -116 422 450 -70 -188 266 198 -434 -372 14 -81
1977h1k33K94L15pn9j15j11J60j73l59J18L97k60m44M02N77k73k57N45J65o08
$$ -81 -314 -20 295 288 229 114 3 163 -10 -369 -251 146 -114 -558 -156 421 148 -109 436 601 -7
1998gl26L28o3k41M7J79N1P2n9m7L63K21l77l11L39j00o28P2P24o4m70K53M30
$$ -7 -333 -5 -68 -309 -262 -83 -32 40 -19 -66 297 518 141 -170 169 69 -559 -487 237 173 -297 -44 386
2021C86l10k32L47J77k68j80j01j30J11R1k18K47O55k21n41L49L88n75l73N74
$$ 386 76 -156 191 368 100 -80 -181 -311 -200 -109 -327 -80 575 354 -187 162 550 -25 -398 176
2041A76J10p34r9M43O4k35L77L18n8n9k68k67K29J97m77j17N53N8p67K61Q38j39
$$ 176 286 -448 -547 -104 -40 -275 102 420 362 303 35 -232 -3 194 -283 -400 153 211 -556 -295 543 404
2063D04n61L86L12o50l38K59J89k74J49KM4J34N3j16K34M22l07o96L37J70o63
$$ 404 -157 229 541 -109 -447 -188 1 -273 -124 -122 -78 56 109 -7 227 649 342 -354 -17 153 -510
2084e10j75Q27K15n46P8M86j01m31K97J90k03j82j91k12K16K78j98O7O47l2p47
$$ -510 -685 142 357 -189 -111 375 274 -157 140 330 127 -55 -246 -458 -242 36 -162 -95 552 520 -227
2105b27J00N86l72n32M19L24o24l22M81K75j44K05J91l2j44j41l30J06L56l11
$$ -227 -127 459 87 -445 -26 298 -326 -648 -167 108 -36 169 360 328 184 43 -287 -181 175 -136
2125a36l88M43L61n88j0Q54P9o56P9L58m11n01K36K93j52N8Q7n2J25J31j72P6
$$ -136 -524 -81 280 -308 -318 536 615 -41 38 396 -15 -516 -280 13 -139 -81 6 -46 79 210 38 114
2147A14M72k32p30O4M30l70m02O31M93m80k00N19K0l37LJ84j51j84j00j54K25
$$ 114 586 354 -376 -312 118 -252 -654 -23 470 -10 -210 309 329 -8 -5 179 28 -156 -256 -410 -185
2168a85L03j31n2M39J95o84j38O20j47o70J59L53j83m02L18M13j9n1J22rnj97
$$ -185 118 -13 -65 374 569 -115 -253 367 220 -450 -291 62 -121 -523 -205 208 189 138 260 251 246 49
2190D9l39J39K98k18m03L60L93l72j95O04L55o17k32K94n3m15j8L12M6O0j32J39
$$ 49 -290 -151 147 -71 -474 -114 279 -93 -288 316 671 54 -178 116 63 -352 -370 -58 -12 48 -84 55
2212E5J99O2k45n1K94j23n80l1M86j57m09M17N01k51l03L15J94j70l09J9R9j41
$$ 55 254 316 71 20 314 191 -389 -420 66 -91 -500 -83 418 167 -136 179 373 203 -106 -87 12 -129
2234a29j74p2K61L12j44j41M25J84n02k60M55pn08j53M06J0l24J60M43Q8r2j82
$$ -129 -303 -375 -114 198 54 -87 338 522 20 -240 215 208 -300 -453 -47 -37 -361 -201 242 330 238 56
2256E6Q6J01l05k40P5K65j37k77K08M58j41l14L14L75l98l55J77J45k58k06J61
$$ 56 142 243 -62 -302 -227 38 -99 -376 -168 290 149 -165 149 524 126 -229 -52 93 -165 -371 -210
2277b10K86l2j09J08L26Ll34j21K63j2n87J4M25m0k88J29M83K3k71k4K49r6l00
$$ -210 76 44 -65 43 369 372 38 -83 180 168 -419 -405 20 -20 -308 -179 304 327 56 32 281 185 -115
2300a15j20J65Q9k93j04L75K99j68k16L45J30l53k43J81J78l16k22K69K43j31
$$ -115 -235 -70 19 -274 -378 -3 296 128 -88 257 387 34 -209 -28 150 -166 -388 -119 124 -7
2320gj66K71L35j89l27J18J91k19l51M0L50j00k65K65L79r8k74J29K87j89l92
$$ -7 -173 98 433 244 -83 35 226 7 -344 -304 46 -54 -319 -54 325 227 -47 82 369 180 -212
2341b12j4J92L6l53P2L96J21k79ML98om25j50K60M1l94j72L73K36k63pL45K09
$$ -212 -226 -34 2 -351 -279 117 238 -41 -37 361 355 -70 -220 40 81 -313 -485 -112 124 -139 -146 199 408
2364D08k70j89J63N2k34k51J69K35k04j39K16L63j69k28K17K04k57l90J13K33
$$ 408 138 -51 112 164 -70 -321 -152 83 -121 -260 -44 319 150 -78 139 343 86 -304 -191 42
2384D2j69k42J71L74l6k02J01L72r9l41q5K50j57l60P0L18R5k61J5M11J25l97
$$ 42 -127 -369 -198 176 140 -62 39 411 312 -29 -114 136 -21 -381 -311 7 102 -159 -144 267 392 -5
2406ep4K53M9m07j65L58N1k62q2M14J46j21j48J86R7k94l22J91K45k84k59L03
$$ -5 -79 174 223 -184 -349 9 60 -202 -284 130 276 155 7 193 290 -4 -326 -135 110 -174 -433 -130
2428a30L69k16j51L35K13k44l24J91J28k54k04J06K55m9j46L7L01J22m07j4L76
$$ -130 239 23 -128 207 420 176 -148 43 171 -83 -287 -181 74 25 -121 -84 217 339 -68 -82 294
2449B94j22n89NM58l9l90K16N00r9l00J45K18j19k23k6nQ0j72k41K94L47j84k33
$$ 294 172 -417 -412 46 7 -383 -167 333 234 -66 79 297 178 -45 -71 -76 4 -168 -409 -115 232 48 -185
2472a85L68K77m14k92L90R8m28k05L72Jj96R4K78J29J1j75j79J62l0l87l4N26
$$ -185 183 460 46 -246 144 242 -186 -391 -19 -18 -214 -120 158 287 298 123 -56 106 76 -311 -345 181
2494A81j27m40J39O06j43m64L97M05m13l20J56K5j79k6O1R8J74j18j85K08M25
$$ 181 54 -386 -247 359 216 -248 149 554 141 -179 -23 2 -177 -203 -142 -44 130 12 -173 35 460
2515D60l32l67L99J36p09j60O07J01m03L07L79k36k52J27J68j07l8j35k43K04
$$ 460 128 -239 160 296 -413 -573 34 135 -268 39 418 182 -70 57 225 118 80 -55 -298 -94
2535i4O7l70J92O12o1n04K02M69m92m82N81J40n14j04L91j04j23J76K36J4R1j94
$$ -94 -27 -397 -205 407 346 -158 44 513 21 -461 120 260 -254 -358 33 -71 -194 -18 218 232 323 129
2557A29l72J27L12m51j23N27Q9o46M8P84k03m27L76L82n33l39J48O5j70K23M4
$$ 129 -243 -116 196 -255 -378 149 238 -408 -360 424 221 -206 170 552 19 -320 -172 -107 -277 -54 -10
2578a0o0K45Ql75R2N72j87o12K90K92o03k68P07K04m57J32M03k23k86J97N5j11
$$ -10 -70 175 183 -192 -100 472 285 -327 -37 255 -348 -616 91 295 -162 -30 373 150 -136 61 116 5
2600EJ05k00k76K12K17k57k9O47Qo13R7M60l50m83M59L27m48j85L22k3j03K08
$$ 5 110 -90 -366 -154 63 -194 -223 424 432 -181 -84 376 26 -457 2 329 -119 -304 18 -5 -108 100
2622A00J03p3J36j29m75J71K82k48k63N07K13o11O3O23j3m37J00K86m30l04K12
$$ 100 203 130 266 137 -338 -167 115 -133 -396 111 324 -287 -224 399 386 -51 49 335 -95 -399 -187
2643a87J89j70K25K8j35J28Ok44J21L94j82m35J06L52m27k88O33K50l99J8L07
$$ -187 2 -168 57 85 -50 78 84 -160 -39 355 173 -262 -156 196 -231 -519 114 364 -35 -17 290
2664B90m0l55O3N2m7Mj76j05J99K74k27p6N25N6n58r3L74j08l44J68L17k30k35
$$ 290 250 -105 -42 10 -37 -33 -209 -314 -115 159 -68 -144 381 437 -121 -214 160 52 -292 -124 193 -37 -272
2687b72K50J47l7JK8J0K4j74k38P6L03j80k83L48L14l70r7M18J72m46j30K64j29
$$ -272 -22 125 88 89 117 127 151 -23 -261 -185 118 -62 -345 3 317 -53 -150 268 440 -6 -136 128 -1
2710ak70K7J89M2L1n7K5J59J2j68m2K41n2m52R1L80j79k70L37J94j59k00K05J47
$$ -1 -271 -244 -55 -13 18 -39 -14 145 157 -11 -53 188 136 -316 -225 155 -24 -294 43 237 78 -122 83 230
2734B30k09r0L8J3o2j29JK19J20j22l6J77J43l83q3L06j9l62L6K65K1k41R9K36
$$ 230 21 -69 -31 -18 -80 -209 -208 11 131 9 -27 150 293 -90 -173 133 114 -248 -212 53 74 -167 -68 168
2758A68P0j93p2J38m9j64j39J62J53j42j99K70K55k04j39K17J69k70j92J60K8
$$ 168 238 45 -27 111 62 -102 -241 -79 74 -68 -267 3 258 54 -85 132 301 31 -161 -1 27
2779B7j78o2J52J93o9j09O2K03p4j95l9K05j03k75Q0K44j3k19J64K68p0k17QJ29
$$ 27 -151 -213 -61 132 63 -46 16 219 145 -50 -89 116 13 -262 -182 62 49 -170 -6 262 192 -25 -17 112
2803A12q5k07LJ00Q9j63l5K57J70j72q8K09M4l08q4J48O7k01q6K55J16j82k1J41
$$ 112 27 -180 -177 -77 12 -151 -186 71 241 69 -19 190 234 -74 -158 -10 57 -144 -230 25 141 -41 -62 79
2827G9J46j88j31J29N9j93j17J26K18j36p3K03J28j11k30J22J32j21k67J03J47
$$ 79 225 37 -94 35 94 -99 -216 -90 128 -8 -81 122 250 139 -91 31 163 42 -225 -122 25
2848B5k4j69R4K07j1k07Q1J98j8k50r7K56j9k88QK76Q0k65J03K05k0j10j21R8
$$ 25 1 -168 -74 133 122 -85 -4 194 176 -74 -171 85 66 -222 -214 62 142 -123 -20 185 165 55 -66 32
2872C2O7k35o0J35J44p6j23J96J36k08o6J21J67k62k03J91Q8j61l1J13J76o3p6
$$ 32 99 -136 -196 -61 83 7 -116 80 216 8 -58 63 230 -32 -235 -44 44 -117 -148 -35 141 78 2
2895BO0J47j58j92M3J85j33k14J31K76l2j66O0K22j01k26K8K06j15k28J07J40
$$ 2 62 209 51 -141 -98 87 -46 -260 -129 147 115 -51 9 231 130 -96 -68 138 23 -205 -98 42
2917D2Rj26L0J80Q0j98q2J88j8j58r3J55O9k12q4L41Q4k06j4J93K1k34p2O9L3
$$ 42 51 -75 -45 135 215 17 -65 123 105 -53 -146 9 78 -134 -218 123 207 1 -13 180 201 -33 -105 -36 -3
2942cq5m0Q5J88q0j67J30J94r4k48J16J68j50j66N2K30j91n8R5J97n6j52M8J28
$$ -3 -88 -128 -43 145 65 -102 28 222 128 -120 -4 164 14 -152 -100 130 -61 -119 -24 173 117 -35 13 141
2966A41r6q9l7J2J37k40Q3J69J44k69K5J70Nk85OJ96l1j87L5J39jq0O4Q2R2j18
$$ 141 45 -44 -81 -69 68 -172 -89 80 224 -45 -20 150 155 -130 -124 72 41 -146 -111 28 27 -53 11 93 185 67
2992F7j49J23J5n3k54J82K49j62j85K96N0k10l5K18j2j24j24K2N1p2J7P2J24M8
$$ 67 -82 41 56 3 -251 -69 180 18 -167 129 179 -31 -66 152 140 16 -108 -86 -35 -107 -90 -18 106 154
3016A54j23p3J48P0l04PL23k07l04J41K28q9j06K39O3j24p4qL4j4M9j28N2Q2l2
$$ 154 31 -42 106 176 -128 -121 202 -5 -309 -168 60 -29 -135 104 167 43 -31 -39 -5 -19 30 -98 -46 36 4
3041Dj35J91K48k48k00K96j7k95l7L00p9j78M6J72q8n6R8N8N4K2k13q0J46L1k54
$$ 4 -131 60 308 60 -140 156 139 -156 -193 107 28 -150 -104 68 -20 -76 22 80 134 156 -57 -137 9 40 -214
3066b14J03L51j62l06K16K08j64j05J98O6l01k7R1l6R4N1m2mJ36j14j67J63J94
$$ -214 -111 240 78 -228 -12 196 32 -73 125 191 -110 -137 -46 -82 12 63 21 17 153 39 -128 35 229
3089B29l01l9J90Nl08R7K41q3j31J59J01j91J2m1M2kQ3q5k9J28Pk17J95J97j35
$$ 229 -72 -111 79 84 -224 -127 114 31 -100 59 160 -31 -19 -60 -18 -20 63 -22 -51 77 84 -133 62 259 124
3114A24k49R8J73k97m3K75L3k10K7J31o2l6R9l1j1J02j65j73J93J47k60oL13K2
$$ 124 -125 -27 146 -151 -194 81 114 -96 -69 62 0 -36 63 32 21 123 -42 -215 -22 125 -135 -141 172 194
3138A94k76L1K40j23k19J80N2j33n9N3L6M5J1J0j4J13q1k14J72J94j89k10K70
$$ 194 -82 -51 189 66 -153 27 79 -54 -113 -60 -24 21 32 42 28 141 60 -154 18 212 23 -187 83
3161H3P4l46Q1J98m1p4M6J32j36q6O1o4J10k8p0k8J32L8q6QJ93j10k35J40P3j72
$$ 83 157 -189 -108 90 49 -25 21 153 17 -69 -8 -72 38 10 -60 -88 44 82 -4 4 197 87 -148 -8 65 -107
3187a07q2K05Q0j76LJ04Rj1MNj4J10j35j05M9J19j79J2K90n7k20N3J80j8k32J03
$$ -107 -189 16 96 -80 -77 27 36 25 29 34 20 130 -5 -110 -61 58 -121 -109 181 124 -96 -43 137 119 -113 -10
3213a0O5l7j05OP0P1l4j0J8J07j21j23R5J25j09j34J02Q7j40o4J58J02j00m7Q2
$$ -10 55 18 -87 -81 -11 60 26 16 34 141 20 -103 -8 117 8 -126 -24 63 -77 -141 17 119 19 -28 54
3238E4l0M0j82O4NN9p2L4Q6Oj06M0J51o3k33P6J35q4j30R3J79j10p5N8M9M5l1
$$ 54 24 64 -118 -54 -49 10 -62 -28 58 64 -42 -2 149 86 -147 -71 64 -20 -150 -57 122 12 -63 -5 44 89 58
3265E8o5j3J06j49l7J15J5p4RJ25K6j39m6J77J2j54n7J05K9m6n9K6J31nj00oJ10
$$ 58 -7 -20 86 -63 -100 15 30 -44 -35 90 116 -23 -69 108 120 -34 -91 14 43 -3 -62 -36 95 90 -10 -16 94
3292I4l8j48j3J97n5p7O2K1k8p8J17O0l8j43L8R3l3n1o7P2N0p0NR6Ko5o1J81q5
$$ 94 56 -92 -105 92 37 -40 22 43 15 -63 54 114 76 -67 -29 64 31 -20 -87 -15 35 -35 -30 66 68 3 -58 123 38
3321C8r5m6Q3N0m1m1K8P5l5p9J40K0j17p8P7P3q8r1J12O6m3p2Q3P8q6l2l5K11
$$ 38 -57 -103 -20 30 -11 -52 -24 51 16 -63 77 97 -20 -98 -21 52 -36 -127 -15 51 8 -64 19 97 11 -21 -56 155
3349A55j84r4P5N4N8j79R7O5k1l5M1M7p3n4l3J02j5p0l0J31k2k4m2J18L1j26J6
$$ 155 -29 -123 -48 6 64 -115 -18 47 26 -9 32 79 6 -48 -81 21 6 -64 -94 37 15 -9 -51 67 98 -28 -12
3376a2K7M3j11RJ05k9o5k9R3J3j9q6Q5L7p2p4O1J9l0k5J04P0j00j1J9N4n7r8Q
$$ -12 15 58 -53 -44 61 32 -33 -62 31 44 25 -61 24 61 -11 -85 -24 -5 -35 -60 44 114 14 3 22 76 19 -79 -71
3405g1O2J8o9M6KJ0o4Q8O4k2r2J8M5j0p2M3M7K7j10L5O2L9q7n4M3N4q0o8O4M0
$$ -71 -9 9 -60 -14 -12 -2 -66 22 86 64 -28 -10 35 25 -47 -4 43 70 -40 -5 57 96 9 -45 -2 52 -28 -96 -32 8
3435Hk6l4Q8L1j03l0Q2K1Jn7k2M5p8J4N3J00rj33L0J13m6p0K1Q2k6j89J15J6l
$$ 8 -18 -52 36 67 -36 -66 16 37 38 -19 -41 4 -74 -60 -7 93 84 -49 -19 94 48 -22 -1 81 55 -134 -19 -3 -6
3464fl3Q6Lk6l1oQ4j1j68L2P7Q3j25o9J47No8m3Q6Q3j75J1R9K2q1J9K2M5p4K9
$$ -6 -39 47 50 24 -7 -13 71 60 -108 -76 1 84 -41 -110 37 42 -26 -69 17 100 -75 -64 35 57 -24 -5 17 62 -12 17
3494A7k2M3j3l7n1J00j5j46Q9Q3n0m6R7M4j31l8R7L2n2J6k3K6mp0J7Q2J2p0qN4
$$ 17 -5 38 25 -12 -63 37 22 -124 -35 48 -2 -48 49 93 -38 -76 21 53 1 17 -6 20 16 -54 -37 45 57 -13 -21 33
3524C3J0j11K5Q0mj54R4R3J7j32O8M5L8m1o0p3R9Mj18N4Q8rj41P5Q5m2j4J7Q7
$$ 33 43 -68 -43 37 33 -121 -27 66 83 -49 19 64 102 61 1 -72 27 31 -87 -33 55 46 -95 -20 65 23 9 26 113
3553A13j50n0Q2M5r6J8J23r7pmK7l2P3l6n8R3J6j41K5J40rj18N8R9j13p8J37l8
$$ 113 -37 -87 -5 40 -56 -38 85 -12 -19 -23 4 -28 45 9 -49 44 60 -81 -56 84 75 -43 15 114 1 -77 60 22
3581B2O6j20MJj8J09q7j2R8k7q0O4M5r3m1J08J8j20j6J02j9%LL1K1l1J9j21JJ23
$$ 22 88 -32 -28 -27 -45 64 -23 -35 63 36 -44 20 65 -28 -69 39 57 -63 -79 23 4 4 7 38 59 28 47 -74 -73 50
3611E0p1k5R6j2j20M0J28o4m6O0J5n1p5O2J5J7o9J76q7n8j7J3L8O8q6q1M8Q7j28
$$ 50 -21 -46 50 38 -82 -42 86 22 -24 36 51 0 -75 -13 2 19 -50 126 39 -19 -36 -23 15 83 -3 -84 -36 51 -77
3640g7J6R9K5p8k1J21o9p1O0M0q8l0P2m1NN5Mj09J52m2q9Q2N5n3n9Q7l6j0o0J05
$$ -77 -61 38 63 -15 -36 85 16 -55 5 45 -43 -73 -1 -42 -37 18 22 -87 65 23 -66 16 71 18 -41 46 10 0 -60 45
3670D5rn8N2J2l6j2M6m0n8O7j8o8J15L7j38k0J81l0q2k1P7j4p3M9K7m5L7JJ8n1
$$ 45 36 -22 30 42 6 -6 40 0 -58 9 -9 -77 38 75 -63 -83 98 68 -14 -35 42 28 -45 4 31 -14 23 24 42 -9
3700iN9o5l6O2j1nk6O9p7%L0Q3l3m8Q1m2m2j2J4M0j1l2OoK8pL2om2j7kN2N0j40
$$ -9 50 -15 -51 11 0 -5 -31 38 -39 -39 -9 74 41 -7 74 32 -10 -22 -8 32 21 -11 -5 -11 17 10 42 36 -6 -23 -25 27 77 -63
3734f3L4R3j02k5J08m8Okj3M3j4r4O2K1L8n0m8Q9K5n2q3J25K9p1j2j5P4m3k6%
$$ -63 -29 64 -38 -63 45 -3 3 1 -12 31 17 -77 -15 6 44 -6 -54 35 60 8 -75 50 79 8 -4 -19 55 12 -14 -14
3764a4M7j7j43J48JJm3MP7l6j5lM0j8l5n3O2o0K9nR9k1q5k4N6l3qJ6Q2m6pJ4k3
$$ -14 33 16 -127 21 22 23 -20 -16 61 25 10 7 47 29 -6 -59 3 -57 -28 -33 66 45 -40 -64 -8 -41 -49 -33 49 3 -4 10 -13
3797a3K8l7N5k0k5ql9Q8Lr0N8J4M0j23P9K9ko2KLP4p1l7MP4o2m1P5K1K7j31J05
$$ -13 15 -22 33 13 -12 -20 -59 29 32 -58 0 14 54 -69 10 39 37 -25 -23 -20 54 -17 -54 -50 24 -38 -79 -4 17 44 -87 18
3829A8j6k9K1kP9l4m9J4N0k3o2M1J3K1n0mK4Qm1p6J52p1O0j21O9Q4p7o0N6K1K1
$$ 18 2 -27 -6 -8 71 37 -12 2 52 29 -33 8 21 42 -8 -12 12 20 -21 -97 55 -16 44 -77 -8 76 -1 -61 -5 16 37
3860C7l4j1O5r2K7N4m6P2j08P5o9L6j8RJ5%j1l5K6O6r0pR9n7k8mkQrm9J07Mj3
$$ 37 3 -8 57 -35 -8 46 0 72 -36 39 -30 6 -12 -3 12 12 1 -34 -8 58 -32 -39 60 3 -25 -29 -31 -23 -32 -81 26 30 17
3893A7j09J25l5Pj9O9m0j2j9J0k6O9on9N6Mm1NP4o3lJO3j21M5N5nj4n4N2l0O7
$$ 17 -92 33 -2 5 -14 55 15 3 -16 -6 -32 37 31 -28 28 32 -9 -4 70 7 4 5 68 -53 -8 47 42 28 -26 26 -4 63
3925F3q4Pk0RJ9L1j2Pk5j0L8N3j43J5R1k3k2nM2L1r3m5O7M8o7j9M2j2Lo6O9M7
$$ 63 -21 -14 -34 -25 -6 25 13 20 -5 -15 23 76 -67 -52 39 16 -6 -11 31 62 -31 -76 -9 39 -28 -47 -5 -17 -14 -80 -11 36
3957C6J9n6J7L2o2K0k3M3l3l8L1NJ7o9N6K7K4j7p0L5K1p9K9N5K3k6j18J26J9j09
$$ 36 55 -1 16 48 -14 6 -17 26 -7 -45 -14 -9 8 -61 -5 22 46 29 -41 -6 15 -64 -35 20 43 17 -101 25 44 -65
3987f5P7M8r3PM4L5p9l9J5P7l8j4J1PM5n0PJ9K5p5M3LJ6o2m5M5P6q6L2PN3q1L3
$$ -65 12 60 -33 -26 18 53 -26 -65 -50 27 -11 -25 -14 -7 38 -12 -5 14 39 -36 7 10 26 -36 -81 -36 40 -46 -14 -7 46 -35 -2
4020bJ8J3o3O7o3Q8Jj50O7M6J1r4R8L8j14k0%Q4q3P6k2J8%M0m0p7R0o4LM6Kk5
$$ -2 16 29 -34 33 -30 58 59 -91 -24 22 33 -61 37 75 -39 -59 -59 25 -58 18 -4 14 14 54 14 -63 27 -37 -34 12 14 -11
4052a1q2J16K4q3lJ01l2k0j5K3n0LK9K9mL7j10M5j2N2k1l3J03m6l9l6O1p2j2Q6
$$ -11 -93 23 47 -36 -39 62 30 10 -5 18 -32 -29 0 29 25 62 -48 -3 -15 37 16 -17 86 40 1 -35 26 -46 -58 28
4082B8K5j01K7j6Rj5J9J9Mk4L6n0J4N4k8JL8oj15K5J07k0o2P6kn6N8m8OmJ3rL1
$$ 28 53 -48 -21 -37 -28 -43 -24 -5 -1 -25 11 -39 -25 29 1 2 40 34 -81 -56 51 31 -31 45 43 -13 45 -3 3 -1 12 3 34
4115C4k9om1RR1n3o1m4J19o0l3R0P9j39RM6m5%J9j3N2m8M1m4K4O1q3p5J01K7m8
$$ 34 5 -1 -42 -33 58 5 -56 -100 19 -41 -74 16 95 -44 -35 11 -34 -34 -15 -28 24 -24 17 -27 -3 58 -25 -100 1 28 -20
4146b0PL3J2r0M4Q4q1j4K6j8kL1J7m5K1qoK4N0o7l3R8K2j43l2L7J72j75J20r1
$$ -20 -13 20 32 -58 -14 70 -11 -25 1 -17 -19 12 29 -16 5 -3 -9 15 65 -2 -35 63 85 -58 -90 -53 119 -56 64 -27
4176b7O6l9l1L7K4j5l6jJ4M5l7o6J36m9n8K9L2jk5J7ok4k2L9Jpj5K1K9j4lo4R6
$$ -27 39 0 -31 6 30 15 -21 -22 -8 37 0 -66 70 21 -37 -8 24 23 -2 15 9 -15 -37 2 3 -4 -19 2 31 17 14 -50 46
4209D6K4k5q1M6N2r2j5J24o5m2O8j6j5PL1l9K1k2j3LM0mj11J15M1qj23L2N3o8
$$ 46 70 45 -36 10 62 -30 -45 79 14 -28 40 24 9 16 47 8 29 7 -6 -3 37 33 -78 37 78 70 -53 -21 32 -36
4239c6J0mP2o4K6RK6m7O5p8k3Q1p6lM5RJ3k9Q2n0j04M7M8J4m5M4L2q5O3k2p4J11
$$ -36 -26 -30 42 -22 4 13 39 -8 57 -21 -44 37 -39 -42 3 12 25 -4 78 28 -76 -29 19 33 -12 32 64 -21 42 20 -54 57
4271E7r5K7K6N1j15NNP7k0p1P7J9k1n6L1M5l5p3Q6j6j0L1l8M1J7o2M7J4k4p9M2
$$ 57 -38 -11 15 66 -49 -44 -39 38 18 -53 24 43 22 -34 -3 42 7 -66 20 4 -6 25 -13 28 45 -17 30 44 20 -59 -17
4302a7L3lp6N5JQ6j37P4l1Kj9kK7J00p5k0L9j6qn8O0k6N5q9L3J0o3M0Q5L5j50
$$ -17 16 13 -63 -8 -7 79 -58 16 -15 -13 -32 -34 -7 93 18 -2 37 21 13 -45 15 -11 44 -45 -12 -2 -65 -25 60 95 -55
4333e5OO9pJ4q6J16o5l7L2J4mk0JM6L4j10nK0Q7m6n7P6L5k9J4m8M2m5j7L5rm1
$$ -55 -49 20 13 27 -59 57 -8 -45 -13 1 -3 -23 -22 24 58 -52 -57 -37 50 4 -53 23 58 29 43 -5 37 -8 -25 10 1 -40
4365d0L5M6m4L2r3K2P3o8M6m4Q0l6o1j0N4M4m5j6J19l7j17N5lL1k6m5J04k0n9
$$ -40 -5 41 -3 29 -64 -42 31 -37 9 -35 45 9 -52 -62 -8 36 -9 -25 94 57 -60 -5 -8 23 -3 -48 56 36 -23
4394b3LL6O0m9l9K0L8n8k2L3l8%JJ3O8l6PlJ6j16N6J1O9p8l5j8J15L0r1L9pM7
$$ -23 -20 16 76 27 -12 8 46 -12 -34 -1 -39 -39 -38 -25 43 7 14 11 27 -89 -33 -22 47 -31 -66 -84 31 61 -30 9 2 49
4426D9p0k3J0L5k9k0O5J7m2J9PP0p1Jk0j2l7K6M3K8j02N0j8O6l2k5K2lj5m1R6
$$ 49 -21 -44 -34 1 -28 -48 17 34 -8 11 18 88 17 18 -2 -14 -51 -25 18 46 -56 -6 -24 42 10 -15 7 4 -11 -52 44
4457D4n3J3Mo5N4J9J1rL1n7pK9J6k7n6M7J1m0L0l2N2M5m2Pl9R4j17%P0oo2M5j6
$$ 44 -9 4 8 -57 -3 16 27 18 49 -8 -15 14 30 3 -53 -6 5 -35 -5 -37 15 60 18 25 -14 80 -37 -37 33 27 -35 10 -6
4490f%l8RJ00p2pL5L5q8j7K2kj1P6o9L4O0n8n1N5K1j5j17J16J7j04J00k4J8rj
$$ -6 -6 -44 -35 65 -7 -14 21 56 -32 -49 -27 -29 -40 36 -33 1 61 3 -48 7 28 13 -104 12 29 -75 25 1 19 10 9
4521Il3QM5Nl8j8J8N2r9J08jo1k0O8p4J2R4o4l2J0K5K6n4l7Q9k7K1j6J6q4J06
$$ 9 -24 -16 29 34 -4 -22 -4 48 -51 57 56 -5 -25 43 -31 -19 75 11 -21 -11 14 40 -14 -51 38 11 32 16 32 -52 54
4552E4o2l2JJ02p8j5R4l6r2L7M4Ll9N3%ln8P2q6KQ4l0l3L0K5p1M5Pl1l4L4R8j72
$$ 54 -8 -40 -39 63 -15 -30 64 28 -64 -27 17 20 -19 34 34 31 -27 45 -41 -39 45 15 -18 12 37 -34 11 18 -13 -47 -13 85 -87
4585h7M5Q9k1r2L0O9Ql5M5l4J7k1j1p4J10M6j22M2N8l7m7J2J6m8l0J11Lk5M4k4
$$ -87 -42 47 26 -66 -36 33 41 6 51 17 34 13 2 -72 38 84 -38 4 62 25 -22 -10 6 -42 -72 39 42 17 61 37
4615C7n0jK5l1MQ5p6m0Q6N2n3p5N4Ol2J7M3j1n4L0M3l1J8p6K9N1Pr9K0O2ro6J0
$$ 37 -13 -14 11 -20 -16 69 -7 -47 39 91 38 -37 17 23 -9 8 51 40 -14 16 59 28 46 -30 -1 50 57 -42 -22 40 31 -35 -25
4648b5R0n3p6J22k0o8RM9j9p8P0qJ3k2Qk9J6J6k8oO9mk6J2J8j9Rjom0j7J11n8
$$ -25 65 12 -64 58 38 -30 -21 28 9 -69 1 -7 6 -16 -8 -37 -21 -5 -33 -39 30 26 0 12 30 11 20 19 13 -27 -44 67 9
4681In2K8jK1J7k4l6K7L3n1J5J0O9j18j0J34n8l4j3O7l5l7N4j8k4k9Q5m2N9l4
$$ 9 -43 -15 -16 5 22 -2 -38 -11 22 -29 -14 -4 65 -53 -63 71 13 -21 -34 33 -2 -39 15 -3 -27 -56 29 -13 46 12
4711A2k8MJ3M6m4o6J49n4o7P5J6n6K7K8j2pl1J3Ok5J0k5m6J35r7M3K7J5r2k7J48
$$ 12 -16 -12 1 47 3 -63 86 32 -35 40 56 0 27 55 43 36 5 18 24 -1 9 -16 -62 73 -24 19 46 61 -31 -58 90
4742I0m3q2M7Pk0Rk5M8n3M4K9n5Q1j30L4j1Q1p9l4O2J08j22k5N6j7Mk8K5M3q1
$$ 90 47 -35 12 19 -1 8 -17 31 -22 22 51 -4 77 -53 -19 -30 51 -28 -62 0 108 -14 -39 17 0 4 -24 1 44 -37
4772c7Q0m5oL2oo3P2l5Pj5O2J3j03K6P9o9l1j5P9ml3J0KJ8rl4N6p5N6p4J09l5
$$ -37 43 -2 -8 24 18 -45 27 -8 -1 -16 46 59 -44 -18 61 -8 -39 -54 25 21 -12 -2 0 18 9 -25 31 -44 12 -62 47 12
4804A2n1L1K7Pm2K3J5j0m0M9K2p2l5O8m1M4n6P5K9o0L1o3N8m7L7ol4j1J13p8L5
$$ 12 -39 -8 19 26 -16 7 22 12 -28 21 43 -29 -64 4 -37 7 -49 26 55 -5 26 -37 21 -26 11 5 -29 -40 73 -5 30
4835C0o1J5o3J4P0M8r8K8M1l6jO9j1p2m0J23j47Q8l1J7nL5pj3M0l8JJJ8Rk5m8
$$ 30 -31 -16 -79 -65 5 53 -45 -17 24 -12 -13 56 45 -27 -67 56 -91 -3 -34 -17 -22 13 6 -7 33 -5 -4 -3 15 24 -1 -49
$$ [...]
8191B0
##END NTUPLES=NMR FID
##END=
