##TITLE=1H_DE-80H_X3
 200.13MHz, d2o
 8 sc
 
 19ns.26.2.2025
##JCAMPDX= 6.0         $$ Bruker NMR JCAMP-DX V2.0
##DATA TYPE= NMR FID
##DATA CLASS= NTUPLES
##ORIGIN= UXNMR, Bruker Analytische Messtechnik GmbH
##OWNER= pz
$$ XWIN-NMR		Version 3.5
$$ Mon Jul 20 14:51:28 2026 Russian Standard Time (UT+4h)  Yarkov@DPX200
##.OBSERVE FREQUENCY= 200.1313
##.OBSERVE NUCLEUS= ^1H
##.DELAY= (6, 6)
##.ACQUISITION MODE= SIMULTANEOUS
##.ACQUISITION SCHEME= undefined
##.AVERAGES= 8
##.DIGITISER RES= 18
##SPECTROMETER/DATA SYSTEM= spect
##.PULSE SEQUENCE= zg30
##.SOLVENT NAME= DMSO
##.SHIFT REFERENCE= (INTERNAL, DMSO, 0, 14.3821)
##AUDIT TRAIL= $$ (NUMBER, WHEN, WHO, WHERE, WHAT)
$$ ##TITLE= Audit trail, XWIN-NMR		Version 3.5
$$ ##JCAMPDX= 5.01
$$ ##ORIGIN= Bruker BioSpin GmbH
$$ ##OWNER= Yarkov
$$ C:/Bruker/XWIN-NMR/data/yarkov2/nmr/H-C/1/audita.txt
$$ ##AUDIT TRAIL=  $$ (NUMBER, WHEN, WHO, WHERE, WHAT)
(   1,<2026-07-20 14:50:05.96 +0400>,<Yarkov>,<DPX200>,
      <created by zg, POWCHK disabled, PULCHK disabled
       configuration hash MD5:
       00 E9 B6 7A A2 85 ED C7 34 08 36 98 17 FE 4E 26
       data hash MD5: 16K
       AC 8A 6C 6D EE 06 AF 65 8F 0A 90 D5 B8 03 81 31>)
$$ ##END=
$$ 
$$ hash MD5
$$ D3 97 10 50 47 9E A9 2D E9 3B 14 91 F4 A9 2C AE
##$RELAX= 
##$RELAX= 
##$RELAX= 
##$RELAX= 
##$RELAX= 
##$RELAX= 
$$ Bruker specific parameters
$$ --------------------------
##$DU= <C:/Bruker/XWIN-NMR>
##$EXPNO= 1
##$NAME= <H-C>
##$PROCNO= 1
##$TYPE= <nmr>
##$USER= <yarkov2>
##$AMP= (0..31)
100 100 100 100 100 100 100 100 100 100 100 100 100 100 100 100 100 100 
100 100 100 100 100 100 100 100 100 100 100 100 100 100 
##$AQSEQ= 0
##$AQ_mod= 1
##$AUNM= <au_zg>
##$AUTOPOS= <>
##$BF1= 200.13
##$BF2= 200.13
##$BF3= 200.13
##$BF4= 200.13
##$BF5= 200.13
##$BF6= 200.13
##$BF7= 200.13
##$BF8= 200.13
##$BYTORDA= 1
##$CFDGTYP= 0
##$CFRGTYP= 5
##$CHEMSTR= <none>
##$CNST= (0..31)
1 1 145 1 1 1 1 1 1 1 1 1 1 1 1 1 1 1 1 1 1 1 1 1 1 1 1 1 1 1 1 1 
##$CPDPRG= <>
##$CPDPRG1= <>
##$CPDPRG2= <>
##$CPDPRG3= <>
##$CPDPRG4= <mlev>
##$CPDPRG5= <mlev>
##$CPDPRG6= <mlev>
##$CPDPRG7= <mlev>
##$CPDPRG8= <mlev>
##$CPDPRGB= <>
##$CPDPRGT= <>
##$D= (0..31)
0 0.7 0 0 0 0 0 0 0 0 0 0.03 0 0 0 0 0 0 0 0 0 0 0 0 0 0 0 0 0 0 0 0 
##$DATE= 1784544605
##$DBL= (0..7)
120 120 120 120 120 120 120 120 
##$DBP= (0..7)
150 150 150 150 150 150 150 150 
##$DBP07= 0
##$DBPNAM0= <>
##$DBPNAM1= <>
##$DBPNAM2= <>
##$DBPNAM3= <>
##$DBPNAM4= <>
##$DBPNAM5= <>
##$DBPNAM6= <>
##$DBPNAM7= <>
##$DBPOAL= (0..7)
0.5 0.5 0.5 0.5 0.5 0.5 0.5 0.5 
##$DBPOFFS= (0..7)
0 0 0 0 0 0 0 0 
##$DE= 6
##$DECBNUC= <off>
##$DECIM= 32
##$DECNUC= <off>
##$DECSTAT= 4
##$DIGMOD= 1
##$DIGTYP= 9
##$DL= (0..7)
0 120 120 120 120 120 120 120 
##$DP= (0..7)
150 150 150 150 150 150 150 150 
##$DP07= 0
##$DPNAME0= <>
##$DPNAME1= <>
##$DPNAME2= <>
##$DPNAME3= <>
##$DPNAME4= <>
##$DPNAME5= <>
##$DPNAME6= <>
##$DPNAME7= <>
##$DPOAL= (0..7)
0.5 0.5 0.5 0.5 0.5 0.5 0.5 0.5 
##$DPOFFS= (0..7)
0 0 0 0 0 0 0 0 
##$DQDMODE= 0
##$DR= 18
##$DS= 0
$$ [...]
##$SUBNAM2= <"">
##$SUBNAM3= <"">
##$SUBNAM4= <"">
##$SUBNAM5= <"">
##$SUBNAM6= <"">
##$SUBNAM7= <"">
##$SUBNAM8= <"">
##$SUBNAM9= <"">
##$SW= 18.0517328524113
##$SWIBOX= (0..15)
0 0 2 0 0 0 0 0 0 0 0 0 0 0 0 0 
##$SW_h= 3612.71676300578
##$TD= 16384
##$TD0= 1
##$TE= 0
##$TE2= 300
##$TE3= 300
##$TEG= 300
##$TL= (0..7)
0 120 120 120 120 120 120 120 
##$TP= (0..7)
150 150 150 150 150 150 150 150 
##$TP07= 0
##$TPNAME0= <>
##$TPNAME1= <>
##$TPNAME2= <>
##$TPNAME3= <>
##$TPNAME4= <>
##$TPNAME5= <>
##$TPNAME6= <>
##$TPNAME7= <>
##$TPOAL= (0..7)
0.5 0.5 0.5 0.5 0.5 0.5 0.5 0.5 
##$TPOFFS= (0..7)
0 0 0 0 0 0 0 0 
##$TUNHIN= 0
##$TUNHOUT= 0
##$TUNXOUT= 0
##$USERA1= <user>
##$USERA2= <user>
##$USERA3= <user>
##$USERA4= <user>
##$USERA5= <user>
##$V9= 5
##$VALIST= <valist>
##$VCLIST= <CCCCCCCCCCCCCCC>
##$VD= 0
##$VDLIST= <DDDDDDDDDDDDDDD>
##$VPLIST= <PPPPPPPPPPPPPPP>
##$VTLIST= <TTTTTTTTTTTTTTT>
##$WBST= 1024
##$WBSW= 4
##$XGAIN= (0..3)
0 0 0 0 
##$XL= 0
##$YL= 0
##$YMAX_a= 42116
##$YMIN_a= -39018
##$ZGOPTNS= <>
##$ZL1= 120
##$ZL2= 120
##$ZL3= 120
##$ZL4= 120
##$ABSF1= 10
##$ABSF2= 0
##$ABSG= 5
##$ABSL= 3
##$ALPHA= 0
##$AQORDER= 0
##$ASSFAC= 0
##$ASSFACI= 0
##$ASSFACX= 0
##$ASSWID= 0
##$AUNMP= <proc_1d>
##$AZFE= 0.1
##$AZFW= 0.1
##$BCFW= 1
##$BC_mod= 2
##$BYTORDP= 1
##$COROFFS= 0
##$CY= 83.5205535888672
##$DATMOD= 1
##$DC= 2
##$DFILT= <>
##$DTYPP= 0
##$F1P= 10.8118882576601
##$F2P= -7.23987719738617
##$FCOR= 0.5
##$FTSIZE= 0
##$FT_mod= 4
##$GAMMA= 1
##$GB= 0.15
##$INTBC= 1
##$INTSCL= 1
##$ISEN= 128
##$LB= 0.25
##$LEV0= 0
##$LPBIN= 0
##$MAXI= 10000
##$MC2= 0
##$MEAN= 0
##$ME_mod= 0
##$MI= 1.114404
##$NCOEF= 0
##$NC_proc= 0
##$NLEV= 6
##$NOISF1= 3.799351
##$NOISF2= 2.8
##$NSP= 1
##$NTH_PI= 0
##$NZP= 0
##$OFFSET= 14.38212
##$PC= 1
##$PHC0= -7176.722
##$PHC1= 7.421964
##$PH_mod= 1
##$PKNL= yes
##$PPARMOD= 0
##$PSCAL= 0
##$PSIGN= 0
##$REVERSE= no
##$SF= 200.129724274929
##$SI= 16384
##$SIGF1= 3
##$SIGF2= 2
##$SINO= 400
##$SIOLD= 16384
##$SREGLST= <1H.CDCl3>
##$SSB= 0
##$STSI= 0
##$STSR= 0
##$SW_p= 3205.1282051282
##$SYMM= 0
##$S_DEV= 0
##$TDeff= 0
##$TDoff= 0
##$TI= <>
##$TILT= no
##$TM1= 0
##$TM2= 0
##$TOPLEV= 0
##$USERP1= <user>
##$USERP2= <user>
##$USERP3= <user>
##$USERP4= <user>
##$USERP5= <user>
##$WDW= 1
##$XDIM= 8192
##$YMAX_p= 0
##$YMIN_p= 0
$$ End of Bruker specific parameters
$$ ---------------------------------
##NTUPLES= NMR FID
##VAR_NAME=  TIME,          FID/REAL,        FID/IMAG
##SYMBOL=    X,             R,               I
##VAR_TYPE=  INDEPENDENT,   DEPENDENT,       DEPENDENT
##VAR_FORM=  AFFN,          ASDF,            ASDF
##VAR_DIM=   8192,          8192,            8192
##UNITS=     SECONDS,       ARBITRARY UNITS, ARBITRARY UNITS
##FACTOR=    0.0002768,     1,               1
##FIRST=     0,             0,               0
##LAST=      2.2672688,     0,               0
##MIN=       0,             -39018,          0
##MAX=       2.2672688,     42116,           0
$$ Real data points
##PAGE= N=1
##DATA TABLE= (X++(R..R)), XYDATA
$$ [...]
$$ plain form
1229 818 4360 5609 4121 356 -3461 -5555 -4747 -1540 2447 5231 5238 2691 -1383 -4614 -5515 -3639
1245 -3639 166 3749 5522 4400 1127 -2766 -5201 -4939 -2325 1618 4565 5296 3306 -374 -3799
1260 -3799 -5342 -4060 -849 2918 5093 4702 1942 -1911 -4643 -5101 -2838 809 4080 5259 3719
1275 3719 359 -3312 -5113 -4409 -1431 2288 4755 4898 2466 -1120 -4196 -5044 -3394 -59 3374 4935
1291 4935 4142 1142 -2386 -4685 -4605 -2153 1316 4215 4828 3091 -316 -3555 -4861 -3798 -661 2732
1307 2732 4756 4341 1714 -1791 -4407 -4621 -2657 795 3753 4800 3458 292 -2933 -4703 -4017 -1395
1323 -1395 1983 4331 4417 2399 -988 -3739 -4617 -3151 -72 3004 4596 3755 1098 -2253 -4341 -4192
1339 -4192 -1994 1356 3873 4490 2762 -359 -3305 -4540 -3414 -666 2557 4326 3994 1646 -1598
$$ packed form
1229H18L542J249j488l765l817k094Q08L207L987K784Pk547m074l231r01J876
1245c639L805L583J773j122l273l893k435K62K614L943K947P31j990l680l425
1260c799j543J282L211L767K175l91k760l853k732m58K263L647L271J179j540
1275C719l360l671j801P04K978L719K467J43k432l586l076q48J650L335L433J561
1291D935p93l000l528k299Q0K452L469K899O13j737l407l239j306J063L137L393
1307B732K024m15k627l505k616k14J964L452K958J047j342l166l225j770O86K622
1323a395L378K348Q6k018l387k751q78J466L079L076J592q41k657l351k088J49
1339d192K198L350K517O17j728l121k946j235J126K748L223J769l32k348l244
$$ plain form
1354 -1598 -3914 -4295 -2451 557 3345 4360 3213 476 -2629 -4203 -3769 -1368 1714 3887 4108 2190
1370 2190 -810 -3468 -4232 -2911 -85 2838 4178 3509 923 -2067 -4013 -3867 -1790 1180 3610 4075
1386 4075 2611 -277 -2979 -4114 -3235 -667 2161 3955 3664 1604 -1324 -3565 -3903 -2385 470 2995
1402 2995 4020 2986 406 -2343 -3952 -3417 -1260 1650 3639 3755 2004 -874 -3202 -3956 -2639 -33
1418 -33 2583 3891 3163 938 -1881 -3632 -3580 -1744 1011 3175 3805 2427 -85 -2631 -3783 -2996 -762
1435 -762 1961 3551 3439 1504 -1189 -3245 -3655 -2130 393 2822 3697 2746 379 -2240 -3587 -3210
1451 -3210 -1120 1457 3326 3479 1863 -661 -2916 -3576 -2530 -178 2258 3498 3029 960 -1540 -3310
1467 -3310 -3316 -1696 787 2900 3457 2343 -56 -2370 -3471 -2770 -644 1775 3350 3117 1386 -1128
$$ packed form
1354a598k316l81J844L008K788J015j147k737l105j574M34K401L082K173K21j918
1370B190l000k658p64J321K826K923J340o69k586k990j946J46K077K970K430M65
1386D075j464k888k702j135Q79K568K828J794k91k060k928k241l38J518K855K525
1402B995J025j034k580k749j609N35K157K910J989J16j751k878k328p54J317K606
1418c3K616J308p28k225k819j751N2J836K755K164O30j378k512k546j152P87K234
1435g62K723J590j12j935k693k056m10J525K523K429Q75r51k367k619j347L77
1451c210K090K577J869J53j616k524k255o60J046K352K436J240m69k069k500j770
1467c310oJ620K483K113N57j114k399k314j101P01K126K419J575k33j731k514
$$ plain form
1483 -1128 -3019 -3355 -2020 413 2524 3429 2541 401 -1942 -3317 -2946 -1177 1252 2972 3234 1850
1499 1850 -511 -2536 -3330 -2381 -288 2003 3217 2789 976 -1426 -2994 -3094 -1564 752 2649 3228
1515 3228 2109 -28 -2219 -3185 -2556 -633 1642 3010 2955 1302 -920 -2708 -3104 -1893 183 2249
1531 2249 3094 2450 507 -1666 -2956 -2800 -1156 989 2685 2968 1757 -365 -2325 -3014 -2234 -242
1547 -242 1806 2952 2585 856 -1263 -2792 -2799 -1470 652 2423 2940 2034 15 -1920 -2923 -2400 -687
1564 -687 1355 2747 2702 1363 -731 -2397 -2832 -1866 103 1959 2879 2260 539 -1490 -2738 -2548 -1113
1581 -1113 957 2456 2739 1596 -373 -2111 -2816 -2009 -254 1672 2712 2391 874 -1126 -2471 -2630
1597 -2630 -1400 484 2144 2732 1906 174 -1703 -2637 -2285 -734 1183 2457 2551 1272 -595 -2197
$$ packed form
1483a128j891l36J335K433K111R05q88k140k343j375L71J769K429J720K62j384
1499A850k361k025p94R49K093K291J214m28j813k402j568j00J530K316J897N79
1515C228j119k137k191r66O29J923K275J368n5j653k222j788l96J211K076K066
1531B249Q45o44j943k173j290J56J644K145J696K83j211k122j960o89P80J992
1547b42K048J146l67j729k119j529pJ329K122J771N17r06k019j935j003N23J713
1564f87K042J392m5j339k094j666m35R66J969J856R20o19j721k029j248J90J435
1581a113K070J499K83j143j969j738p05Q07J755J926J040l21j517k000j345j59
1597b630J230J884J660N88q26j732j877r34L52J551J917J274R4j279j867j602
$$ plain form
1613 -2197 -2618 -1710 58 1829 2604 2112 467 -1366 -2494 -2370 -1002 816 2272 2512 1521 -262 -1924
1630 -1924 -2544 -1969 -318 1402 2467 2265 908 -872 -2262 -2419 -1436 356 1912 2511 1847 200 -1490
1647 -1490 -2457 -2097 -704 1051 2282 2294 1220 -586 -2005 -2424 -1592 50 1615 2423 1935 523 -1202
1664 -1202 -2274 -2199 -1046 668 1986 2358 1499 -104 -1660 -2372 -1852 -451 1254 2224 2117 922 -786
1681 -786 -2017 -2273 -1295 281 1752 2310 1688 220 -1389 -2202 -1950 -652 945 2066 2164 1117 -426
1698 -426 -1815 -2220 -1539 -83 1428 2171 1886 574 -972 -2064 -2081 -1059 485 1819 2158 1458 -36
1715 -36 -1480 -2143 -1737 -394 1085 2054 1929 839 -682 -1870 -2046 -1235 256 1565 2101 1589 243
1732 243 -1187 -2048 -1813 -719 781 1859 1997 1165 -322 -1577 -2068 -1486 -167 1221 2015 1738 618
$$ packed form
1613b197m21R08J768J771P75m92j645j833j128J24J368J818J456K40r91j783j662
1630a924o20N75J651J720J065k02j357j780j390j57R83J792J556N99o64j647j690
1647a490r67L60J393J755J231J2j074j806j419m19Q32J642J565Q08m88j412j725
1664a202j072P5J153J714J318L72q59j603j556p12N20J401J705R70j07j195j708
1681g86j231k56R78J576J471N58o22j468j609q13K52J298J597J121R8j047j543
1698d26j389m05O81J456J511P43k85j312j546j092j7J022J544J334L39p00j494
1715c6j444o63M06J343J479R69j25j090j521j188j76Q11J491J309N36n12j346
1732B43j430q61K35J094J500J078J38q32j487j255m91N82J319J388P94k77j120
$$ plain form
1749 618 -874 -1862 -1914 -984 452 1617 1999 1308 -9 -1363 -1966 -1566 -410 1012 1860 1810 812 -576
1767 -576 -1659 -1930 -1179 110 1399 1932 1527 347 -1038 -1838 -1751 -730 622 1675 1877 1116 -201
1784 -201 -1452 -1876 -1405 -168 1107 1824 1636 545 -765 -1720 -1764 -921 364 1481 1801 1272 18 -1187
1802 -1187 -1812 -1517 -439 805 1709 1689 878 -427 -1491 -1763 -1195 45 1202 1798 1449 370 -885
1819 -885 -1702 -1595 -735 548 1513 1716 1035 -191 -1280 -1739 -1273 -196 997 1670 1490 584 -659 -1515
1837 -1515 -1646 -908 271 1296 1710 1222 156 -1032 -1641 -1445 -517 693 1508 1618 842 -329 -1328 -1646
1855 -1646 -1095 -31 1110 1608 1348 358 -791 -1517 -1497 -647 445 1375 1559 972 -110 -1148 -1579 -1251
1873 -1251 -263 822 1507 1435 603 -493 -1382 -1539 -945 142 1158 1540 1188 172 -874 -1508 -1344 -495
$$ packed form
1749F18j492r88n2R30J436J165L82o91j317j354o03M00J156J422Q48n0r98j388
1767e76j083k71P51J289J289N33m05j180j385q00Q7J021J352J053K02p61j317
1784b01j251m24M71J237J275P17j88j091j310r55m4Q43J285J117L20n29j254j205
1802a187o25K95J078J244R04k0q11j305j064k72N68J240J157N96l49j079j255
1819h85q17J07Q60J283R65K03o81j226j089m59M66J077J193O73j80r06j243q56
1837a515j31P38J179J025M14m88j066j188o09J96R28J210Q15J10p76j171r99l18
1855a646N51J064J141M98k60r90j149p26K0Q50J092R30J84n87j082j038m31L28
1873a251R88J085O85p2q32j096q89j57N94J087J016L82l52j016j046o34J64Q49
$$ plain form
1891 -495 583 1382 1441 804 -296 -1190 -1487 -1036 -16 947 1477 1223 380 -677 -1381 -1369 -696 359 1206
1910 1206 1463 976 -22 -975 -1475 -1186 -343 708 1367 1329 622 -438 -1217 -1435 -873 100 1021 1413 1060
1929 1060 198 -802 -1346 -1218 -463 528 1235 1342 731 -203 -1067 -1369 -986 -114 835 1331 1207 415 -550
1948 -550 -1244 -1322 -701 221 1077 1340 948 40 -875 -1329 -1138 -325 601 1246 1217 567 -366 -1127 -1271 -822 87
1969 87 904 1270 1021 204 -668 -1227 -1149 -501 411 1116 1249 780 -123 -917 -1282 -974 -165 692 1240 1123 468
1990 468 -467 -1114 -1220 -687 205 937 1224 857 67 -759 -1207 -1010 -326 535 1102 1122 564 -298 -975 -1204
2010 -1204 -790 -21 789 1182 974 285 -585 -1100 -1108 -535 312 983 1179 741 -28 -836 -1144 -911 -196 617
2030 617 1079 1037 414 -373 -991 -1079 -619 133 845 1077 825 95 -669 -1084 -972 -349 417 992 1060 590 -176
$$ packed form
1891d95J078P99N9o37j100q94k97M51J020R63N30k54q43j057p04J2O73J055Q47
1910A206K57m87r98r53n00K89Q43J051O59l8p07j060p79k18N62R73R21L92l53
1929A060q62j000n44J28P55R91P07J07o11r34q64l02L83Q72R49M96j24p92r65
1948e50o94p8O21R22Q56K63l92r08r15m54J91Q13R26O45k9o50r33p61j44M49R09
1969H7Q17L66k49q17q72n59P8O48R12P05J33m69r03p94l65L08Q09Q57N48j17o55
1990D68r35o47j06N33Q92P32K87l67p90q26m48J97O84Q61N67K0n58q62o77k29
2010a204M14P69Q10L93k08o89q70n15qN73Q47O71J96m38p69q08l08K33P15Q13
2030F17M62m2o23p87o18q8M60P52P12K32k52p30p64m15J12O23P66N75O8m70p66
$$ plain form
2051 -176 -867 -1097 -802 -79 667 1075 938 306 -460 -1007 -1002 -521 239 871 1056 700 -33 -710 -1053 -812 -199
2072 -199 514 989 928 433 -324 -872 -1019 -627 73 725 1034 791 172 -551 -990 -927 -415 332 882 999 588
2093 588 -118 -740 -1008 -734 -102 583 960 846 309 -396 -868 -924 -470 197 763 958 650 38 -619 -928
2113 -928 -790 -246 428 870 897 428 -214 -786 -946 -628 -11 630 917 785 195 -459 -893 -858 -379 249 777
2134 777 871 538 -89 -651 -882 -681 -118 480 852 776 310 -301 -787 -832 -489 134 671 885 658 77 -504
2155 -504 -866 -763 -289 345 780 826 472 -174 -685 -861 -596 -30 527 836 688 204 -393 -775 -767 -369 204
2176 204 661 800 511 -26 -566 -821 -635 -163 407 754 740 336 -240 -688 -801 -495 43 576 808 624
2196 624 152 -439 -762 -707 -290 258 677 759 420 -99 -592 -754 -548 -60 439 721 638 199 -310 -689 -719
$$ packed form
2051a76o91k30K95P23P46M08j37o32p66n47NM81P60O32J85l56p33o77l43K41O13
2072a99P13M75o1m95p57n48j47L92P00O52L09k43o19p23m39O3N12P47N50J17m11
2093E88p06o22k68K74O32O85L77j14n37p05m72n6M54O67N66J95l08o12o57l09
2113i28J38N44O74M42K7m69o42n72j60L18O17O41K87j32n90o54m34L5M79O28N28
2134G77R4l33o27n62k31K01N63N98L72p6m66o11m86m5L43O23N37K14k27n81n81
2155e04l62J03M74O34M35M6l54o46n11j76K65N66N57L09j48m84n97l82QL98N73
2176B04M57J39k89n37n40k55J86M72N70L47j4m04n76m48j13L06N38N33K32j84
2196F24m72n91l23N5M17N48M19Q2l39n19m93j62K06M88M99K82q3m39n09l79l0
$$ plain form
2217 -719 -381 125 592 737 529 23 -469 -732 -629 -199 321 682 692 352 -170 -602 -709 -477 20 476
2237 476 708 569 136 -342 -671 -621 -282 212 575 657 404 -77 -482 -688 -520 -106 359 653 608 259 -238
2258 -238 -598 -681 -390 86 495 684 496 86 -394 -652 -569 -216 253 583 621 330 -111 -488 -631 -429 -27
2279 -27 405 609 514 156 -288 -573 -594 -290 134 509 623 413 -4 -426 -618 -525 -139 286 562 575 263 -164
2301 -164 -526 -598 -383 32 417 584 457 76 -299 -556 -526 -212 188 503 548 331 -74 -430 -553 -426 -50
2322 -50 315 557 510 187 -215 -515 -552 -322 86 441 568 414 32 -356 -564 -469 -168 230 488 507 270 -122
2344 -122 -425 -539 -361 -5 323 513 415 129 -250 -475 -488 -237 128 433 512 333 -8 -360 -522 -421 -110
2365 -110 254 489 476 220 -153 -434 -502 -299 25 350 491 379 66 -276 -467 -427 -177 163 410 451 263
$$ packed form
2217g19L38N06M67J45k08n06m92k63J03M30N20L61J0l40n22m32j07K32M97M56
2237D76K32j39m33m78l29N0L39M94L63Q2k53m81m05k06J68M14M65K94m5l49m97
2258b38l60q3K91M76M09J89j88m10m80k58Q3L53M69L30L8k91m41l77j43K02M02
2279b7M32K04r5l58m44k85k1L04M24L75J14k10m17m22j92R3L86M25K76J3l12m27
2301a64l62p2K15M15L85J67j27l81l75k57L0L14M00L15M5k17m05l56j23J27L76
2322e0L65K42m7l23m02l00l7K30M08L55J27j54l82l88k08R5L01L98K58J9k37l92
2344a22l03j14J78L56L28J90r8k86l79k25j3K51L65L05P9j79l41l52j62J01L11
2365a10L64K35j3k56l73k81o8K03L24L25J41j12l13l42j91M0K50L40K47M1j88
$$ plain form
2386 263 -62 -373 -460 -359 -57 274 461 424 150 -177 -428 -465 -256 68 370 454 350 25 -279 -447 -395 -126
2408 -126 180 410 426 225 -93 -361 -425 -302 -7 262 417 354 103 -196 -414 -404 -206 97 344 430 277 -12
2430 -12 -289 -441 -355 -105 203 411 405 197 -130 -345 -412 -262 22 285 407 316 77 -212 -382 -360 -166 120
2452 120 325 389 225 -27 -286 -396 -287 -59 225 366 355 132 -143 -358 -398 -223 40 293 403 287 41
2473 41 -239 -377 -347 -118 137 334 373 199 -50 -281 -357 -256 -29 228 358 315 110 -142 -327 -339 -191 61
2495 61 295 358 247 8 -227 -366 -322 -104 148 338 341 169 -80 -298 -349 -246 11 221 346 295 91 -159
2517 -159 -319 -316 -156 76 281 328 226 0 -214 -328 -264 -79 166 328 316 158 -102 -280 -344 -227 18 242
2539 242 336 261 58 -184 -330 -314 -143 91 271 323 195 -15 -232 -329 -253 -75 166 300 290 131 -97 -274
$$ packed form
2386B63l25l11q7J01L02L31J87l7k74l27k51l7K09L24L02Q4j04l25l04j68N2K69
2408a26L06K30J6k01l18k68o4J23K95K69J55o3k51k99k18J0J98L03K47Q6j53k89
2430a2k77j52Q6K50L08K08ok08l27k15o7J50K84K63J22r1k39k89j70K2J94K86
2452A20K05O4j64k52k59j10J09K28K84J41j1k23k75k15m0J75K63K53J10j16k46
2473D1k80j38L0K29K55J97L9j74k49k31p6J01K27K57J30m3k05k52j85j2J48K52
2495F1K34O3j11k39k35j39M4K18K52J90Lj72k49k18n1J03K57K10J25n1k04k50
2517a59j60LJ60K32K05M7j02k26k14j14O4J85K45J62j2j58k60j78o4J17K45K24
2539B42R4p5k03k42j46J6J71K34J80N2j28k10k17r7P6J78K41J34j0j59k28j77
$$ plain form
2561 -274 -324 -192 25 240 324 256 48 -184 -310 -293 -114 114 284 320 181 -26 -242 -309 -247 -46 190 315
2583 315 285 107 -112 -285 -304 -178 21 225 306 219 28 -188 -293 -281 -105 101 291 301 169 -47 -241 -310
2605 -310 -222 -20 203 317 276 101 -128 -288 -297 -155 60 240 306 212 2 -191 -296 -263 -90 123 273 299 157
2628 157 -66 -239 -302 -214 -6 190 298 256 73 -148 -298 -288 -154 65 247 300 196 4 -202 -309 -245 -71
2650 -71 165 282 285 137 -78 -250 -298 -192 7 209 306 249 66 -140 -288 -287 -137 78 239 298 189 -15 -226
2673 -226 -303 -241 -68 162 291 268 116 -101 -268 -307 -179 19 220 311 244 45 -164 -291 -288 -123 90 276 305
2696 305 189 -19 -230 -297 -234 -29 194 302 281 107 -112 -291 -312 -167 48 237 304 229 15 -192 -312 -278
2718 -278 -101 121 281 296 162 -54 -235 -297 -218 -13 188 300 268 97 -133 -290 -293 -161 66 246 302 211 -4
$$ packed form
2561b74n0J32K17K15Q4o8k08k32j26J7J79K28J70L6j39k07k16o7O2K01K36J25
2583C15l0j78k19j73j9J26J99K04Q1q7j91k16j05J2J76K06J90J0j32k16j94o9
2605c10Q8K02K23J14m1j75k29j60rJ42K15J80O6r4k10j93j05L3J73K13J50K6j42
2628A57k23j73o3Q8K08J96J08m2j83k21j50J0J34K19J82N3j04j92k06j07O4J74
2650g1K36J17Lj48k15j72m8J06J99K02R7n7j83k06j48JJ50K15J61N9j09k04k11
2673b26p7O2J73K30J29k3j52k17j67l9J28J98K01R1o7j99k09j27LJ65K13J86K9
2696C05j16k08k11o7O3K05K23J08k1j74k19j79k1J45K15J89O7p5k14k07j20L4
2718b78J77K22J60J5j34k16j81o2P9K05K01J12l2j71k30j57lJ32K27J80N6r1k15
$$ plain form
2741 -4 -206 -316 -256 -82 147 294 295 144 -79 -263 -311 -210 -1 221 311 251 71 -158 -305 -293 -154 78 258
2764 258 321 198 0 -227 -315 -250 -60 176 306 307 126 -101 -272 -327 -186 42 240 330 251 43 -180 -315 -290
2787 -290 -116 119 286 317 183 -48 -254 -332 -248 -42 192 316 291 106 -124 -293 -327 -180 50 266 330 228
2809 228 14 -211 -329 -283 -90 151 315 329 178 -69 -275 -336 -231 -4 231 339 284 83 -149 -308 -309 -151
2831 -151 88 274 314 218 -20 -239 -355 -269 -67 183 317 319 126 -112 -292 -340 -194 28 256 347 255 44 -202
2854 -202 -339 -311 -122 131 309 342 198 -37 -268 -348 -259 -24 204 351 308 107 -133 -315 -340 -187 63 280
2876 280 342 250 21 -239 -359 -310 -91 160 332 339 152 -86 -294 -354 -231 -1 249 366 305 66 -178 -341
2898 -341 -327 -155 101 310 357 223 -27 -254 -350 -286 -57 193 352 326 138 -128 -327 -351 -210 35 282 376
$$ packed form
2741dk02j10O0J74K29J47Jj51k23j84m8J01K09K22R0o0j80k29j47J2J39K32J80
2764B58O3j23j98k27q8O5J90K36J30Jj81k27j71n5J41K28J98R0p9k08k23j35K5
2787b90J74K35J67L1j34k31k06p8Q4K06K34J24k5j85k30j69l4J47K30K16O4j02
2809B28k14k25j18M6J93K41J64J4j51k47k06o1J05K27K35J08n5k01k32j59jJ58
2831a51K39J86M0r6k38k19j16Q6K02K50J34Kj93k38j80m8J46K22K28R1r2k11k46
2854b02j37K8J89K53J78L3j44k35k31q0Q9K35K28J47m3k01k40j82k5J53K50K17
2876B80O2r2k29k60j20M9K19K51J72Pj87k38k08o0J23K30K50J17o1k39k44j63
2898c41J4J72K56K09M7j34k50k27r6O4K29K50J59k6j88k66j99k4J41K45K47R4
$$ plain form
2920 376 274 35 -222 -370 -324 -132 142 335 365 192 -76 -299 -378 -264 -15 232 370 316 101 -170 -350
2941 -350 -355 -175 93 302 385 262 -7 -251 -375 -301 -75 188 363 343 151 -111 -329 -363 -223 36 276 374
2963 374 294 53 -212 -367 -341 -140 139 342 371 222 -42 -284 -384 -277 -28 236 366 331 119 -160 -346
2984 -346 -366 -190 91 318 387 277 17 -246 -378 -311 -90 185 360 368 171 -97 -324 -386 -247 15 276 390
3006 390 307 73 -205 -378 -364 -167 119 332 379 227 -47 -290 -394 -290 -53 221 394 342 143 -148 -346
3027 -346 -372 -200 77 315 402 287 31 -237 -385 -332 -107 178 366 383 192 -95 -327 -390 -271 -2 256 392
3049 392 316 75 -201 -376 -371 -175 115 343 392 248 -23 -282 -393 -306 -56 228 390 352 149 -146 -343 -380
3071 -380 -223 60 311 395 302 37 -222 -388 -339 -114 166 366 375 203 -75 -320 -387 -273 -8 267 400 334
$$ packed form
2920C76j02k39k57j48M6J92K74J93L0j73k68k23p9J14K49K47J38n4k15k71j80
2941c50nJ80K68K09Q3j23k69k44j24P4K26K63J75k0j92k62k18l4J40K59K40R8
2963C74q0k41k65j55K6K01K79K03K9j49k64k42j00J07K49K64J30l5k12k79j86
2984c46k0J76K81K27O9j10k60k63j32O7K21K75J75Qj97k68k27o2J39K62K61J14
3006C90q3k34k78j73J4J97K86K13M7j52k74k43j04J04K37K74J73n2j99k91j98
3027c46k6J72K77K38Q7j15k56k68j48N3K25K85J88J7j91k87k32o3J19K69K58J36
3049C92p6k41k76j75NJ96K90K28M9j44k71k59j11Q7K50K84J62l8k03k95j97l7
3071c80J57K83K51Q4r3k65k59j66M9K25K80K00Rj72k78k45o7J14K65K75J33o6
$$ plain form
3093 334 95 -187 -377 -376 -188 100 339 387 251 -18 -276 -395 -309 -65 220 376 365 167 -131 -343 -390 -221
3115 -221 54 307 402 293 55 -241 -382 -339 -135 155 358 387 213 -69 -319 -401 -277 -17 260 399 343 105
3137 105 -182 -377 -378 -186 90 334 409 264 -3 -277 -396 -299 -72 210 385 367 166 -116 -343 -386 -221 50
3159 50 307 406 312 48 -231 -379 -352 -136 145 365 384 216 -68 -313 -398 -281 -23 253 394 333 104 -174
3181 -174 -370 -375 -194 88 329 399 268 -8 -262 -398 -309 -71 209 391 364 158 -121 -342 -386 -230 43 296
3203 296 403 299 55 -216 -369 -340 -129 149 347 373 217 -64 -296 -390 -278 -28 244 395 336 105 -181
3224 -181 -370 -377 -192 97 328 393 268 2 -262 -390 -305 -73 200 366 371 156 -108 -338 -376 -241 44 291
3246 291 385 297 55 -206 -369 -332 -130 144 354 368 211 -71 -305 -387 -269 -37 254 385 320 105 -177 -355
$$ packed form
3093C34k39k82j90JJ88K88K39M8j36k69k58j19Q6K44K85J56j1j98k98k12m7J69
3115b21K75K53R5j09k38k96j41M3K04K90K03K9j74k82k50q2J24K60K77J39n6k38
3137A05k87j95jJ92K76K44P5j45k67k74j19R7K27K82J75j8k01k82k27m3J65K71
3159E0K57R9r4k64k79j48K7K16K81K20J9j68k84k45q5J17K58K76J41o1k29k78
3181a74j96nJ81K82K41P0j31k76k54j36Q9K38K80J82k7k06k79k21m4J56K73K53
3203B96J07j04k44k71j53K9K11K78J98K6j56k81k32r4J12K50K72J51n9k31k86
3224a81j89pJ85K89K31O5j25k66k64j28Q5K32K73J66Nk15k64k30l8J35K85K47
3246B91R4q8k42k61j63L7K02K74K10J4j57k82k34q2J18K32K91J31o5k15k82j78
$$ plain form
3268 -355 -368 -198 88 310 384 258 -13 -263 -380 -307 -83 194 369 353 174 -112 -322 -375 -235 35 272 381
3290 381 290 52 -210 -361 -336 -125 135 329 372 198 -67 -285 -380 -271 -27 251 362 324 102 -164 -350 -355
3312 -355 -178 77 311 373 242 -7 -247 -365 -302 -75 188 353 337 153 -114 -308 -366 -224 33 273 371 290
3334 290 58 -204 -356 -328 -137 133 315 345 192 -64 -286 -362 -256 -26 222 370 299 91 -157 -331 -335 -181
3356 -181 83 291 368 239 9 -239 -358 -295 -73 191 356 336 150 -105 -307 -350 -216 41 257 360 275 60
3378 60 -194 -346 -319 -130 132 313 336 179 -53 -269 -366 -258 -30 215 342 302 94 -153 -330 -330 -171 87
3400 87 284 344 236 -5 -229 -336 -286 -75 173 334 321 146 -99 -296 -335 -207 38 245 355 268 48 -180
3422 -180 -318 -298 -120 127 293 323 189 -66 -269 -337 -247 -17 207 329 290 99 -145 -307 -314 -156 81 268
$$ packed form
3268c55j3J70K86K22P4j26k71k50j17P3K24K77J75j6j79k86k10n3J40K70K37J09
3290C81r1k38k62j51K5K11K60J94M3j74k65k18r5J09K44K78J11l8k22k66j86n
3312c55J77K55K34O2j31k49k40j18O3K27K63J65j6j84k67j94n8J42K57K40R8q1
3334B90k32k62j52K8J91K70J82L0j53k56k22p6J06K30K48J48p1k08k48j74mJ54
3356a81K64K08P7j29k30k48j19O3K22K64J65k0j86k55k02m3J34K57K16J03q5k15
3378F0k54j52K7J89K62J81K3j57k32k16r7J08K28K45J27m0k08k47j77%J59K58
3400H7J97O0j08k41k24j07N0K11K48J61j3j75k45j97l9J28K45K07J10q7k20k28
3422a80j38K0J78K47J66L0j34k55k03o8R0K30K24J22l9j91k44j62pJ58K37J87
$$ plain form
3444 268 326 230 3 -205 -314 -269 -69 160 302 300 137 -87 -277 -316 -201 24 233 322 247 39 -180 -317 -282
3467 -282 -123 111 279 317 180 -47 -247 -318 -233 -35 208 319 269 88 -138 -303 -306 -152 66 254 302 218 3
3490 3 -209 -306 -249 -71 158 292 282 126 -91 -265 -309 -184 25 218 309 241 40 -171 -307 -283 -103 113 261
3513 261 285 163 -46 -235 -306 -218 -28 178 292 261 96 -114 -267 -274 -152 61 246 292 188 5 -203 -306
3535 -306 -239 -60 148 288 273 111 -82 -247 -273 -180 22 213 283 228 39 -155 -276 -258 -105 83 244 263 154
3558 154 -41 -225 -284 -207 -19 161 282 248 80 -120 -257 -267 -125 60 225 268 191 14 -183 -282 -221 -49 139
3581 139 259 251 123 -70 -226 -270 -169 14 197 262 208 41 -137 -254 -233 -101 94 225 251 145 -31 -201
3603 -201 -278 -188 -22 161 254 218 82 -112 -234 -244 -127 58 213 267 185 9 -166 -240 -205 -51 130 231 229 113
$$ packed form
3444B68N8r6k27k08j09M5K00K29J42kj63k24j90l9J15K25K09Q9p5k08k19j37L5
3467b82J59K34J68L8j37k27k00p1Q5J98K43J11n0j81k26j65lJ54K18J88M8q4k15
3490Ck12r7N7J78K29J34j0j56k17j74m4J25K09J93R1o8k01k11j36K4J80K16J48
3513B61K4j22k09j89p1Q8J90K06J14l1j65k10j53pJ22K13J85M6j04j83k08j03
3535c06O7J79K08J40j5j62j93j65k6R3K02J91P0n5j89j94j21J8J53J88J61J9j09
3558A54j95j84n9P7J88J80J21l4j68k00j37j0J42J85J65M3p7j77j97r9O1J72J88
3581A39J20qj28j93j56m4J01J83J83O5n4j67j78j17K1J32J95J31K6j06j76j70
3603b01p7R0J66J83R3l6j36j94j22j0J17J85J55N4q2j76j75p4L5J54J81J01kj16
$$ plain form
3627 113 -70 -214 -264 -147 13 175 252 196 44 -139 -239 -213 -83 91 210 242 139 -35 -184 -248 -168 -21
3649 -21 138 241 210 71 -94 -205 -215 -121 53 184 244 163 7 -136 -215 -179 -55 113 217 224 101 -61 -187
3672 -187 -228 -144 5 159 217 179 40 -114 -214 -198 -83 71 200 210 128 -20 -159 -213 -153 -20 126 214 192 75
3696 75 -75 -185 -200 -97 37 169 206 141 15 -127 -200 -162 -45 98 196 202 94 -51 -171 -204 -134 11 139 197
3720 197 158 35 -104 -202 -188 -85 61 170 202 113 -20 -132 -206 -146 -21 109 196 178 66 -68 -170 -185 -98 31
3744 31 151 183 144 5 -132 -188 -148 -46 86 181 181 94 -33 -143 -184 -123 -3 130 187 146 43 -85 -168 -163 -76 51
3770 51 145 178 107 -2 -129 -169 -127 -24 101 175 173 74 -51 -150 -160 -94 28 134 172 128 23 -98 -156 -143 -55 68
3796 68 148 155 76 -24 -134 -172 -108 -18 100 161 132 43 -63 -151 -140 -76 39 137 167 101 -4 -111 -152 -128 -34 86 150
$$ packed form
3627A13j83j44n0J17J60J62P7n6j52j83j00K6J30J74J19L2j03j74j49o4Q0J47
3649b1J59J03l1j39j65j11j0R4J74J31O0q1j56j43p9L6J24J68J04Pj23j62j26
3672a87m1Q4J49J54N8l8j39j54j00J6J15J54J29J0q2j48j39n4O0J33J46Q8k2j17
3696G5j50j10j5J03J34J32L7o5j26j42p3L8J17J43R8Oj08j45j20l3P0J45J28N8
3720A97l9j23j39r8J4J03J46J09L2q9j33j12p4O0J25J30Q7j8j12j34j02j5Q7J29
3744C1J20L2l9j39j37n6M0J02J32R5%q7j27j10m1O1J20J33N7m1j03j28q3NQ7J27
3770E1R4L3p1j09j27m0M2J03J25P4kr9j25r9j0O6J22J06L8m4j05j21n8J3Q8J23
3796F8Q0Pp9j00j10l8O4R0J18O1k9q9j06q8J1O4J15R8L0o6j05j07m1K4R4J20O4
$$ plain form
3823 150 143 74 -37 -131 -139 -87 23 111 163 117 42 -81 -137 -132 -59 50 127 136 79 -29 -113 -152 -107 -21 83 136 108 37 -66
3852 -66 -138 -135 -84 25 111 140 92 8 -82 -135 -109 -41 59 131 124 68 -33 -105 -133 -81 5 90 130 109 23 -56 -130 -120 -47 44
3882 44 105 127 88 -10 -102 -123 -110 -21 63 123 121 36 -34 -114 -134 -81 0 97 129 95 27 -65 -116 -108 -36 49 110 119 72 -12 -90 -105
3914 -105 -83 -15 69 109 97 28 -58 -111 -107 -57 32 88 117 79 -4 -75 -119 -101 -37 47 95 95 44 -25 -78 -109 -78 -9 70 106 89
3945 89 26 -44 -104 -90 -47 33 101 114 82 -5 -68 -94 -73 -14 52 100 96 31 -37 -92 -100 -76 5 59 83 84 16 -48 -94 -97 -38 30
3977 30 77 97 49 -18 -76 -100 -68 -14 54 90 82 26 -43 -86 -83 -49 16 70 94 68 13 -45 -82 -78 -27 43 90 83 43 -23 -77 -98
4009 -98 -73 -1 42 89 70 17 -50 -93 -89 -37 16 66 90 56 9 -57 -90 -69 -19 43 80 70 39 -37 -65 -87 -55 -4 66 84 69
4040 69 16 -42 -78 -80 -26 30 77 81 46 -10 -56 -78 -68 -22 44 80 77 24 -28 -78 -87 -53 9 54 74 53 -4 -43 -75 -79 -27 32 66
$$ packed form
3823A50po9j11r4qN2J10Q8N2m6p5j23n6NP3J09P7Rn7j08q4l9M5Q6J04N3k8p1j03
3852f6p2LN1J09Q6K9m8q4r0n3K6O8J00P2pn6j01p2k8N2Q6Q5M0k1q6p9p4J0P3R1
3882D4O1K2l9r8r2k1J3Q9Q4O0kq5p0q0k0N3Q1R7L2l4o8r2n1QP2Q5O1Rm7q4p8j5
3914a05K2O8Q4M0j2o9q6n3MN0Q9N6K9l8q3p1m4J8O4Q4M8%n1o9n3l1L1O9P9L6j7
3945H9o3p0o0J4M3Q0O8J3l2q7o3k6K1N9O6M8mo5o8n5qK4Q1N4K4Jo8o4m6lN9O8
3977C0M7K0m8o7n8k4L2N4O8L6qn6o9m3LL4O5N4K4k6n5n8l7MN1P0M7pm0o6n4k1
4009i8K5P2M3M7j9n3o7m3MN2N3N0K4l4m7o6l3K1N0O2L7j0l1p6k8k2L2N1P0J8j5
4040F9n3n8l6kN4N6M7Ml5n6m6k2J0M6O6L6ln3n2n0rL4O2M5K0k1n7l9l2mN2N9L4
$$ plain form
4073 66 74 49 -6 -52 -73 -62 -7 43 76 66 9 -38 -82 -84 -34 5 62 80 51 -6 -55 -75 -74 -30 32 66 69 34 -21 -70 -79 -63 -15
4106 -15 32 75 54 15 -21 -68 -67 -36 16 61 71 61 -7 -49 -84 -55 -8 43 80 67 39 -20 -58 -80 -46 6 45 68 56 18 -41
4137 -41 -66 -69 -37 23 60 65 57 6 -44 -73 -63 -19 29 70 58 33 -25 -61 -78 -37 3 52 72 62 12 -36 -66 -60 -26 29 67 74 44
4170 44 -7 -50 -71 -54 -8 48 74 65 20 -24 -65 -75 -41 15 48 65 46 14 -45 -71 -59 -28 19 52 66 41 -15 -56 -70 -47 1
4201 1 44 70 56 7 -39 -55 -69 -38 11 58 72 58 0 -44 -73 -52 -15 39 59 66 30 -17 -60 -66 -53 6 48 55 52 13 -34 -67 -65
4234 -65 -35 16 60 72 46 -8 -53 -61 -43 -7 44 73 73 34 -19 -64 -58 -33 8 61 71 51 15 -39 -63 -54 -19 27 60 59 30 -19 -56
4267 -56 -78 -39 -8 24 67 60 13 -33 -58 -67 -47 19 50 70 44 6 -41 -56 -53 -12 36 74 55 35 -14 -60 -66 -42 10 50 69 58
4299 58 19 -42 -67 -66 -18 16 54 67 36 -21 -64 -72 -60 -13 28 59 61 28 -22 -67 -69 -48 9 46 66 49 11 -38 -65 -60 -19 25 65
$$ packed form
4073F6Qk5n5m6k1J1N5N0L3j0n7m7m4kN0L9N7J8k9n7m9k0JM4O2L4Ll5n5m9rJ6M8
4106a5M7M3k1l9l6m7JL1N2M5J0j0o8m2l5K9M7N1L7j3k8n9l8k2L4N2L9K3j2l8n9
4137d1k5lL2O0L7Nqn1n0k9J0M4M8M1j2k5n8l6j7M1M0M9K0j0n0m8l0OL4N5L8Pl0
4170D4n1m3k1J7M6N6K6rm5m4m1j0L4N6L3J7j9l2n9k6J2L1M7L3J4k5n6m1j4K3M8
4201AM3K6j4m9m6j6j4L1M9M7J4j4n8m4k9K1L7N4K0Pl6m7m3oJ3N9M2Pll9m7l3K
4234f5L0N1M4J2k6n4m5qJ8L6N1K9%l9n3m5OK5M1N3J0k0l6n4k4RL5M6L3jk9m9l7
4267e6k2L9L1L2M3pm7m6k5rK0O6L1K0k6l8m7j5LM1M8L8j9k0m9m6oK4N2M0J9j1
4299E8l9o1k5JM8L4L8J3l1n7m3qJ2M7M1L1Kl3n0m5kK1N7L7K0j7l8m9k7NM1M4M0
$$ plain form
4332 65 59 43 -15 -50 -55 -32 14 50 69 63 16 -17 -62 -54 -23 15 54 58 41 -7 -49 -72 -62 -19 37 69 64 25 -25 -66 -53 -34 6
4365 6 44 63 46 9 -51 -57 -58 -25 25 50 59 32 0 -44 -68 -48 -7 31 62 55 18 -19 -63 -68 -39 21 51 58 45 5 -38 -66 -52 -18
4399 -18 33 57 58 29 -18 -47 -59 -38 7 52 69 63 23 -14 -62 -53 -27 35 59 55 38 -9 -45 -63 -52 -11 30 56 57 20 -23 -52 -55
4432 -55 -35 4 59 69 44 10 -42 -66 -58 -22 21 53 54 32 -8 -55 -74 -46 4 37 45 57 11 -23 -48 -52 -13 12 60 64 38 10 -37
4465 -37 -64 -54 -8 31 52 57 24 -21 -66 -50 -50 7 39 69 42 5 -35 -55 -56 -20 18 41 58 28 -5 -48 -54 -51 -13 32 54 54 18
4498 18 -34 -62 -49 -20 18 61 57 51 6 -28 -60 -48 -11 40 61 48 18 -12 -46 -58 -36 -5 38 56 44 16 -24 -56 -58 -31 13 50
4530 50 48 25 -10 -37 -62 -41 -6 31 63 49 20 -18 -45 -53 -27 5 53 64 44 -2 -33 -50 -44 -17 29 55 49 24 -23 -45 -57 -40
4562 -40 -4 34 52 37 3 -34 -55 -51 -30 13 47 50 30 -6 -31 -40 -24 13 31 47 59 17 -17 -47 -53 -20 13 47 56 33 -2 -30 -32
$$ packed form
4332F5oj6n8l5nK3M6L6J9om7l3m5QL1L8L9Mj7m8m2k3J0M3N6L2nl9n0m1J3J9M0
4365FL8J9j7l7o0ojL3N0K5Rk7l2m4k4K0M1L8L1pl7l7m4nK9O0L0Pj3m0m3k8J4L4
4399a8N1K4Jk9m7k9j2K1M5M5J7om0l7m8RK6O2K4mj7m7l6j8J1M1M1K6Jl7m3k9l
4432e5K0L9N5J0k5l4n2k4QL6M3L2Jk2m0m7j9K8N0L3QJ2m6l4k5mL9K5M8Mk6k8m7
4465c7k7J0M6L9K1Nl3m5m5J6%N7L2L0k7l7m0k0jL6L8K3J7l0l3m3oLL8M5K2%l6
4498A8n2k8J3K9L8M3mom5l4l2J2L7N1K1j3l0l0l4j2K2L1M3J8j2k8m0l2kK7M4L7
4530E0kk3l5k7k5K1L5L7L2j4k9l8k7qK6L2M8J1k0m6l1j7OK7M6K6ok5m7k2j2J7
4562d0L6L8J8j5l4l7k1MK1M3L4Lk0l6k5rJ6L7J8J6J2m2l4l0oL3L3L4Rk3l5k8k
$$ plain form
4595 -32 -43 -12 28 48 41 16 -8 -42 -58 -32 1 26 41 49 3 -27 -42 -43 -17 6 32 52 28 -1 -29 -48 -31 14 27 58 42 18
4627 18 -6 -31 -30 -21 16 34 55 38 9 -18 -45 -44 -24 13 43 44 20 -7 -31 -42 -32 -2 30 44 41 19 -8 -40 -36 -22 16 33 41 32
4661 32 4 -33 -50 -35 -13 26 41 44 19 -12 -33 -40 -15 17 44 48 39 13 -11 -30 -29 -1 12 43 32 22 -10 -27 -49 -24 -5 29 38
4694 38 41 15 -15 -30 -38 -11 13 30 39 31 5 -15 -27 -25 4 23 43 44 27 1 -32 -29 -23 1 37 32 31 15 -18 -29 -26 -8 16 29 34 21
4730 21 -7 -24 -30 -26 -7 11 32 23 12 -12 -25 -24 -17 0 26 27 25 7 -7 -27 -23 -14 20 27 25 16 -2 -18 -20 -18 3 22 44 15 1 -12 -30
4767 -30 -26 -9 -3 31 35 32 8 -13 -27 -29 -5 21 21 26 18 -16 -30 -39 -19 -10 11 33 33 6 -17 -17 -17 -3 5 27 34 7 5 -17 -27 -21 -14 21 26 25
4807 25 15 -9 -16 -29 -16 -4 13 10 12 1 -17 -29 -32 -13 2 16 21 31 3 -22 -26 -11 -5 18 20 28 11 -1 -14 -30 -16 0 23 24 17 4
4843 4 -12 -5 -15 -2 11 21 31 21 1 -10 -14 -24 1 13 26 17 18 4 -15 -21 -18 4 20 30 23 15 -9 -11 -7 -1 11 23 27 15 0 -6 -13 -13
$$ packed form
4595c2j1L1M0K0pk5k4l4j6K6L3K5J5Qm6l0j5jK6K3K6K0k4k9k8j9J7M5J3L1j6k4
4627A8k4k5JRL7J8K1j7k9k7k7JK0L7L0Jk4k7k4j1J0L0L2J4lk2k7l2MJ4L8J7Qr
4661C2k8l7j7J5K2L9J5Lk5l1k1pK5L2K7Mrk6k4j9JK8J3L1j1j0l2j7k2K5J9L4R
4694C8Lk6l0j5qK7K4J7Rqk6k0j2KK9J9K0Jj7k6l3LOK4L6njj6l3j1LJ8K4J3Nj3
4730B1k8j7oMJ9J8K1rj1k4j3JPJ7K6Jkj8j4k0MRL4Pkrj8j6kKK1J9K2k9j4j3j8
4767c0MJ7OL4Mlk4k1j4kK4K6%Nql4j4rK0RK1K2%k7k3%%J4QK2Pk7kk2j0OPL5Nj
4807B5j0k4pj3J3J2J7lKj1j8j2lJ9J5J4NJ0k8k5mJ5OK3KQj7j2j3j6J4J6K3Jpj3
4843Dj6Pj0J3J3J0J0j0k0j1mj0K5J2J3rJj4j9oLK2J6J0pqk4kMOJ2J2Mj2j5op%
$$ plain form
4881 -13 8 17 17 22 18 -4 -7 -19 -1 0 17 18 17 -4 -18 -17 -12 -14 9 9 18 14 -6 -15 -27 -13 2 6 17 25 8 -2 -15 -22 3 4 12 14 19 -1 -6 -14
4923 -14 -7 -4 13 24 10 15 -2 -18 -16 -26 -6 8 17 6 1 -14 -8 -19 -13 2 10 18 8 5 -14 -14 -12 -1 4 25 23 11 2 -8 -15 -17 1 17 16 20
4963 20 4 -7 -10 -17 -2 10 22 12 24 -6 -12 -25 -11 -12 0 18 17 7 3 -9 -14 -3 -4 11 12 13 3 -4 -12 -10 -7 5 28 33 23 -1 -11 -6
5001 -6 -24 2 13 23 17 21 2 -3 -10 -17 -1 16 16 23 3 -6 -18 -24 -1 -5 13 18 13 1 -10 -20 -16 -8 10 19 24 7 -3 -9 -17 0 8 18 15 15 14 -2
5043 -2 -12 -17 -4 -1 17 22 12 -3 -11 -19 -5 -7 7 14 16 4 -1 -10 -13 -6 -6 9 17 14 -7 -12 -17 -19 -15 4 16 12 12 0 -10 -9 -3 6 22 18 12 19 -5 -6 -18
5088 -18 -13 8 11 19 18 0 -10 -15 -20 -15 -10 16 18 11 -5 -22 -29 -11 1 -3 22 15 4 -2 -14 -26 -16 -3 14 28 16 5 -15 -16 -17 -7 -1 22 20
5127 20 12 9 -19 -20 -13 3 12 17 23 9 -11 -19 -18 -12 5 14 30 12 -3 -14 -26 -33 -13 13 26 10 3 -11 -25 -21 -6 -3 11 9 15 -4 -16 -29 -31
5166 -31 -23 -1 16 21 9 -3 -16 -13 -18 -2 14 24 24 13 -2 -11 -14 4 9 13 20 20 6 -12 -26 -24 -16 -7 15 15 12 -8 -3 -12 -10 -3 8 24 16 10 5 -15
$$ packed form
4881a3K1R%Nmk2lj2J8JJ7Jjk1j4JNkK3%Rmk0rj2J4J5MJ1Qj7j0j3pK5JQKNk0nq
4923a4PLJ7J1j4Nj7j6Kj0K0J4Rj1nj5Oj1OJ5QQj0lj9%KJ1NK1kj2rj0pkJ8J6jM
4963B0j6j1lpJ5J2J2j0J2l0oj3J4jJ2J8jj0mj2nJ1jJ5JJj0pqKLJ2K3Nj0k4j0N
5001fj8K6J1J0oMj9nppJ6J7%Pk0rj2oK3mJ8Nnj2j1j0MQJ8RNj7j0oqJ7QJ0l%jj6
5043bj0nJ3LJ8Nj0j5qqJ4kJ4PKj2nrlP%J5Qlk1nnkMJ9J2m%j2j0JORJ6moPk4jj2
5088a8NK1LQjj8j0nnNNK6Kpj6j7pJ8J2mK5pj1oj2j2J0J3J7J4j2j1k0jjJ0OK3k
5127B0qlk8jPJ6RNOj4k0qJOJ7RJ6j8j5j1j2pK0K6J3j6pj4j4MJ5LJ4kOj9j2j3k
5166c1QK2J7Nj2j2j3LnJ6J6J0%j1j5rlJ8NMP%j4j8j4KQRK2%lk0NrKPJ1J6qonk0
$$ plain form
5208 -15 -10 -10 1 10 17 17 1 -13 -21 -20 -8 5 12 16 18 -4 -18 -23 -10 -1 13 29 12 -2 -21 -21 -42 -29 -7 9 17 16 6 -13 -33 -16 -3 15
5246 15 8 22 14 12 -15 -18 -3 0 14 29 27 5 -2 -22 -20 -6 15 12 23 2 -5 -14 -33 -21 -7 5 11 18 9 -10 -18 -24 -11 12 9 14 1 5 -11 -17
5286 -17 -26 -19 7 14 6 7 -2 -13 -16 -17 11 18 18 21 18 -7 -9 -16 -20 9 20 34 20 -1 -4 -22 -19 -12 0 10 31 5 -3 -18 -18 -16 -6 12 19 12 9 -13
5328 -13 -24 -17 -10 -2 19 14 14 4 -10 -25 -12 -3 15 21 15 9 -1 -10 -17 -9 1 18 19 19 4 -12 -13 -24 -8 12 15 15 8 -9 -13 -22 -24 -10 -12 22 16 18
5370 18 0 -16 -14 -6 -2 24 21 23 9 -3 -14 -19 0 8 15 16 13 4 -5 -28 -15 -5 4 14 16 10 -6 -11 -11 -2 3 6 16 11 -1 -16 -27 -26 -13 2 4 11
5412 11 13 0 -22 -21 -22 0 3 16 24 10 -3 -14 -14 -10 5 17 11 25 7 -16 -14 -26 -8 -5 15 16 11 1 -3 -10 -19 -6 18 9 29 2 -4 -20 -25
5451 -25 -24 -6 12 15 17 11 1 -25 -14 -9 -2 15 22 13 -1 -14 -6 -2 6 22 19 20 18 -9 -25 -16 -7 1 17 22 12 -4 -13 -18 -15 -3 6 17 21 2 -1 -16
5493 -16 -17 -21 -5 10 18 11 -2 -12 -22 -22 1 -2 12 24 11 -10 -3 -25 -28 -1 12 22 27 14 -6 -21 -25 -11 -5 15 22 11 2 -9 -31 -25 -4
$$ packed form
5208a5N%J1RP%j6j4qJJ2J3PMKk2j4nJ3RJ4J6j7j4j9%k1J3K2J6Qjj0j9k0J7J3J8
5246A5pJ4qkk7lJ5LJ4J5kk2pk0KJ4K1lJ1k1prj9J2J4J2OPrj9qoJ3K3lNj3Mj6o
5286a7rPK6PqJrj1ljK8P%Llk5kpmK9J1J4j4k1lj8LPJ2J0K1k6qj5%KJ0J8Pplk2
5328a3j1PPQK1n%j0j4j5J3RJ8Oooj0rpQJ0J7J%j5j6jj1J6K0L%pj7mrkJ4kL4oK
5370A8j8j6KQMK6lKj4j2j1nJ9QPJlrrk3J3J0RJ0Koj6n%RNLJ0nj2j5j1JJ3J5KP
5412A1Kj3k2JjK2LJ3Qj4j3j1%MJ5J2oJ4j8k3Kj2J8LK0Jnj0mprJ3K4rK0k7oj6n
5451b5JJ8J8LKoj0k6J1NPJ7Prj4j3QMQJ6lJkk7j6RRQJ6Nj0j6rnLJ2RJ1Mj9lj5
5493a6jmJ6J5Qpj3j0j0%K3lJ4J2j3k1Pk2lK7J3J0Nj3k0j5mJ4OK0Pj1rj1k2OK1
$$ plain form
5530 -4 3 18 29 12 -7 -18 -17 -18 -12 15 25 24 18 -3 -15 -17 -3 -3 28 25 30 8 -17 -28 -24 -20 8 20 33 16 -2 -13 -28 -25 -12 6 23
5567 23 18 18 -15 -32 -31 -22 -4 22 33 16 -3 -18 -12 -29 -18 7 18 27 19 -4 -13 -21 -10 -7 7 27 20 19 -8 -30 -34 -9 1 27 31 23 11 -19
5605 -19 -23 -27 -6 7 24 32 7 -8 -28 -41 -32 -14 12 37 28 -1 -11 -34 -35 -25 4 18 25 27 0 -18 -24 -26 2 24 25 45 29 -6 -24 -40
5641 -40 -31 3 23 29 35 6 -16 -21 -31 -13 5 28 32 16 0 -19 -32 -30 -11 17 37 36 26 -6 -35 -24 -23 2 22 43 36 0 -19 -33 -28
5676 -28 -12 15 30 34 25 -4 -35 -41 -41 -1 16 36 33 5 -14 -43 -31 -29 -15 20 38 17 -6 -32 -56 -37 -29 4 38 37 12 -14 -43 -40 -27
5711 -27 7 28 50 35 6 -18 -36 -23 -24 20 36 32 31 -8 -26 -49 -33 -6 13 44 40 9 -9 -26 -40 -23 2 34 41 32 8 -31 -46
5744 -46 -40 -19 19 35 45 32 -9 -31 -44 -34 -6 34 55 47 24 -11 -35 -41 -22 10 45 45 37 -7 -28 -46 -43 -8 16 54 44 23 -8
5777 -8 -34 -42 -26 -2 21 46 39 7 -28 -51 -44 -23 20 59 52 28 -4 -33 -49 -47 6 36 47 50 16 -3 -48 -33 -27 19 54 57 40 -4 -34
$$ packed form
5530dPJ5J1j7j9j1JjOK7J0jok1j2kJ4%L1lNk2k5j1MMK8J2J3j7j8j1j5LJ3J8J7
5567B3n%l3j7JRJ8K6J1j7j9j5Oj7J1K5J1Rqk3rqJ1LJ4K0pjk7k2mK5J0K6Mqj2l0
5605a9mmK1J3J7Qk5j5k0j3RJ8K6K5rk9j0k3jJ0K9J4PKk7j8okK8K2JK0j6l5j8j6
5641d0RL4K0OOk9k2nj0J8J8K3Mj6j6j9j3KJ9K8K0jj0l2k9J1JK5K0K1pl6j9j4N
5676b8J6K7J5Mrk9l1o%M0J7K0lk8j9k9J2KJ4L5J8k1k3k6k4J9QL3L4jk5k6k9LJ3
5711b7L4K1K2j5k9k4j8J3jM4J6mjl9j8k3J6K7J9L1ml1j8j7j4J7K5L2Prk4l9j5
5744d6OK1L8J6J0j3m1k2j3J0K8M0K1qk3l5k4oJ9L2L5%qm4k1j8LL5K4L8j0k1l1
5777hk6qJ6K4K3K5pl2l5k3PK1M3L9pk4l2k9j6KN3L0J1Ll4j9m5J5OM6L5Lj7m4l0
$$ plain form
5812 -34 -60 -49 -18 27 41 51 17 -23 -42 -54 -38 3 37 49 36 1 -26 -56 -50 -27 9 48 59 37 3 -39 -54 -45 -12 31 51
5843 51 61 8 -21 -57 -58 -33 11 36 52 39 -2 -34 -64 -47 -19 21 54 51 28 -19 -57 -59 -43 -11 31 59 38 0 -29 -57 -62 -19
5875 -19 19 43 49 42 1 -47 -55 -48 -9 30 60 53 26 -14 -59 -55 -37 7 45 59 41 3 -50 -63 -61 -13 28 51 63 31 -18 -57 -61 -45
5909 -45 -9 26 61 48 21 -33 -67 -67 -32 21 55 70 41 -1 -46 -66 -54 -7 41 65 67 25 -12 -57 -55 -39 5 54 57 41 7 -36
5941 -36 -71 -58 -14 24 60 68 31 -4 -52 -70 -50 -6 45 59 58 11 -33 -62 -62 -34 18 59 70 40 -1 -38 -62 -55 -7 34 67 71 27
5974 27 -18 -51 -59 -39 7 55 65 53 6 -51 -74 -74 -30 21 53 78 41 -17 -60 -71 -54 1 34 69 58 16 -32 -69 -67 -40 16 67
6006 67 69 53 2 -40 -64 -65 -16 31 68 67 35 -6 -61 -68 -49 19 56 79 48 -2 -43 -90 -67 -32 20 62 64 28 -21 -66 -80 -50 -1
6039 -1 57 76 64 26 -32 -79 -72 -30 25 69 77 48 3 -47 -69 -61 -22 42 73 60 28 -25 -71 -78 -45 5 59 77 59 2 -35 -69 -66
$$ packed form
5812c4k6J1L1M5J4J0l4m0j9j2J6M1L4J2j3l5k7l0OK3L6L9J1k2l4m2j5RL3M3K0
5843E1J0n3k9l6jK5M4K5J6j3m1l2l0J7K8M0L3lk3m7l8kJ6L2M2K8k1l8k9k8nM3
5875a9L8K4Opm1m8qPL9L9L0pk7m0m5MJ8M4L8J4j8l8n3j3KM8M1K3J2l2m9l9mJ6
5909d5L6L5L5j3k7n4l4%L5N3L4J5k9m2m5k0J2M7M8K4Km2l7m5KJ6M4M9Lj6l4m3
5941c6l5J3M4L8L6Ql7l5m8j8K0M4N1J4jm7m4k9%K8N2M1J1l0m1l7k4PM8M1L3Mm4
5974B7m5l3qK0M6M8J0j2m7n7k3%M4N1L2K5l7n8m3j1J7N5L3L5j1m2m8l7KK7N6N1
6006F7Kj6n1m2k4jM9M7L7jl2m1n5pJ9O8L7K3l1n0m1m7K3L5N2M2Kl6m9m5j4L0M9
6039aN8J9j2l8n8m7PM2N5M4Qk9m5n0k2QL9O4L1j3l2n3m6pL3N0N4J8j8n7l7l4L
$$ plain form
6072 -66 -28 36 65 69 38 -17 -53 -84 -57 -14 39 74 60 25 -28 -65 -70 -27 23 76 84 58 9 -45 -78 -54 -13 49 82 71 29 -23
6104 -23 -66 -87 -50 6 45 69 54 3 -48 -80 -80 -42 28 69 80 40 -5 -59 -80 -58 -9 53 69 71 23 -36 -77 -69 -36 21 72 96
6136 96 65 1 -51 -74 -52 -17 49 74 82 41 -13 -73 -73 -48 16 69 75 61 4 -48 -84 -89 -39 21 68 78 44 -11 -56 -71 -64 -15 48
6169 48 79 77 24 -29 -79 -83 -33 25 77 89 71 9 -47 -86 -67 -21 34 87 80 35 -22 -66 -87 -51 2 63 81 59 16 -41 -88 -73
6201 -73 -42 24 70 83 40 -16 -66 -86 -56 -3 49 76 79 27 -34 -72 -78 -41 21 75 95 68 5 -57 -86 -71 -25 36 78 81 31 -23
6233 -23 -72 -81 -49 5 63 87 69 14 -55 -84 -86 -39 28 68 81 52 -7 -57 -100 -64 -7 47 93 86 30 -36 -57 -83 -41 14 63 83
6265 83 62 11 -48 -79 -70 -23 31 84 84 45 -23 -72 -89 -59 -11 50 84 62 7 -53 -95 -85 -45 28 75 82 54 -15 -65 -82 -65 -13
6297 -13 47 83 80 34 -35 -81 -80 -48 20 73 92 66 6 -51 -88 -77 -28 27 86 79 40 -20 -72 -89 -72 0 50 71 66 13 -47 -95
$$ packed form
6072f6L8O4K9Ml1n5l6l1K7M3N3L5j4l5n3l7nM3N0N3Qk6m9n4l3K4M1O2L3j1m2n2
6104b3m3k1L7N6L9K4j5n1n1l2%L8P0M1J1m0m5n4k1K2M9O2J6Km8n9m1QL3N7N1K4
6136I6l1o4n2k3K2L5O6K5Qm1n4o0%K5O4N3Oj4n7n2l6nN0O0M7J0l4n5m5j5PM9O3
6169D8L1kn3n3n0mN0N8N2J2j8o2n6l9J9M6N5N3pm5n7m4k1L6N3O1J8k2m3n7m7J5
6201g3L1O6M6J3m3n6n0k0L0N3N2K7Ln2o1l8oL7O2N4K0k7o3o2k9J5M6O1M2Ln0n4
6233b3m9rL2N4N8K4j8n5o9k9kM7O7M0J3k9n9n0m3L6N7N4M6pn6o6k1k6M2N5M9K0
6265H3k1n1n9l1RM7N4N3%l9o8m9j7L0M8O1L4k2n5o0m2J0M0P3M7Pk8o9n0j7J7N2
6297a3O0L6lm6o9m6JL2O8N3J9k6o0n7l7J1M9N5N9pl9o0n2j7J7P2N0K1nn3o0m8
$$ plain form
6329 -95 -87 -35 21 68 94 49 -17 -64 -91 -58 -4 49 98 75 41 -30 -74 -83 -40 23 70 93 69 5 -58 -87 -75 -26 31 80 95
6360 95 56 -18 -80 -98 -64 -5 49 87 70 19 -43 -86 -81 -38 21 74 73 51 3 -60 -81 -66 -14 61 97 80 41 -25 -79 -85 -54 18
6392 18 71 98 64 16 -52 -82 -75 -34 40 83 81 48 -25 -67 -90 -59 3 52 90 72 24 -30 -82 -89 -42 17 66 99 58 -5 -67 -86
6424 -86 -69 -11 49 85 86 47 -17 -71 -81 -54 32 66 88 72 16 -44 -75 -73 -31 37 79 87 45 -13 -66 -93 -59 -4 48 89 70 23
6456 23 -52 -92 -85 -45 17 95 92 66 -3 -61 -81 -70 -5 58 94 86 44 -28 -74 -90 -51 6 65 103 77 13 -54 -90 -84 -33 29 73
6488 73 91 53 -15 -81 -98 -76 -24 54 81 78 30 -33 -77 -84 -42 20 73 96 53 7 -51 -74 -78 -16 52 86 97 47 -13 -78 -79 -61
6520 -61 6 67 98 65 8 -57 -89 -76 -40 34 81 89 51 -18 -81 -84 -75 -24 53 85 76 31 -35 -87 -96 -40 16 70 98 69 -5 -56 -86
6553 -86 -72 -20 53 95 104 40 -19 -68 -89 -61 9 63 93 77 11 -50 -97 -86 -40 25 75 92 47 -8 -68 -105 -77 -16 43 86 84
$$ packed form
6329i5QN2N6M7K6m5o6m7k7L3N4N3M9k3l4p1m4rM3O3M7K3k4o4o3k9J2M9N7M9J5
6360I5l9p4o2j8L4N9N4L8j7n1o2m3NM3N9N3jk2m8o3k1J5N2P5L6j7l9o6n4oL1P2
6392A8N3K7l4m8o8l0PM1P4M3kl3p3m2k3L1O2M9L8j8m8n4n2pM7N9M9L3m1o3o2j9
6424h6J7N8O0L6Jl9o4n4j0K7Q6L4K2j6n6o0l1KM2O8M2Qm2n8n3k7L4N5N2M1j9m7
6456B3p5m0PM0O2P8lk6o9n8k0J1O5O3L6qm2p2m6j6L9N7N9L8k6o4o7l6ON1O2M4
6488G3J8l8o8o6j7K2N2P8K7lm8o3m4pM2O2N3K3m3m6n8k3mO2O8L4J1n0o0o5jJ8
6520f1O7O1L1l3n7o5l2J3L6P4M7Ql8o9o3lRN1P7L2rm5o6n2rN6N6N4K8k9p4n1l0
6553h6J4N2P3M2Ro4n9m9k1K8P0N4L0j6o6o1m7J1M6O5N0J7m5n5o0l7K8O1N9M3k
$$ plain form
6584 84 32 -43 -83 -93 -42 22 76 96 72 -1 -64 -82 -68 -19 43 97 96 52 -20 -72 -84 -63 -3 64 93 76 26 -48 -102 -91 -38
6615 -38 19 80 81 56 -21 -75 -104 -80 -14 53 87 88 36 -18 -85 -93 -54 15 75 94 68 10 -51 -92 -90 -27 40 85 98 57 -11 -72
6647 -72 -86 -70 -2 73 91 79 13 -56 -96 -90 -41 18 76 89 51 -9 -71 -99 -87 -14 49 99 91 47 -23 -80 -91 -54 16 82 109
6678 109 78 18 -47 -84 -84 -12 33 97 98 70 -10 -70 -95 -53 -7 63 102 97 35 -39 -90 -95 -52 21 86 100 71 -1 -61 -108 -82 -19
6710 -19 45 100 102 41 -23 -82 -81 -53 18 77 109 85 23 -58 -89 -90 -35 44 93 102 64 -2 -75 -98 -78 -9 68 93 80 29 -42 -93
6742 -93 -89 -58 12 76 98 73 -2 -55 -91 -83 -27 48 98 95 50 -24 -80 -92 -57 13 84 111 81 21 -50 -97 -86 -33 38 107 119 62
6774 62 -5 -79 -109 -79 -15 48 97 85 31 -51 -94 -97 -41 15 84 100 67 -4 -70 -105 -90 -24 52 102 105 57 -27 -89 -95 -52 14 75
6806 75 110 88 23 -47 -101 -83 -28 32 88 106 81 -6 -70 -97 -83 -11 53 89 81 34 -50 -102 -108 -71 11 77 98 71 2 -78 -104
$$ packed form
6584H4n2p5m0j0N1O4N4K0k4p3o3j8J4M9O2N4jm4p2n2j2K1O0O7K9j7n0p4n4J1N3
6615c8N7O1Jk5p7n4k9K4O6O7L4Jn2n4o7qL9O9O0J9k6n8o1m1KO3O7M5J3m1o8o1
6647g2j4J6O8P5J8j2o6o9m0OM9N9N8J3l8o0o2k8J2P3O3N0qm4p0n7j1L7P0O6K7
6678A09l1o0o5l7%P2M5O4Jk8q0o0k5M2M6P0L9no2p4n1nM3P3O5J4k9p2o0m7K6O3
6710a9O4N5Ko1o4n9JK8P1N9L2k4o2q1l1jN5P9M9Rl8o6p3k3K0O9P7K5j3n1p1n1
6742i3ML1P0O4K2k5p5n3l6QN6P5N0lm5p4n6j2L5P0P1K7l0o0p1m7J1N3P1O9J2n7
6774F2o7p4l0L0O4O3M9j2n4q2m3lN6N6O9J6l3p1o6l5J5O6P6N0Lm8q4o2oM3O6O1
6806G5L5k2o5p0n4J8N5O0N6J8k5q7o4k7J4P2O4L6qm7q4n2oL7Q2O6K1k7o9q0k6
$$ plain form
6837 -104 -93 -27 45 109 101 58 -25 -92 -98 -61 7 77 116 85 25 -44 -89 -88 -39 34 92 103 67 -3 -68 -110 -86 -22 56 106 94
6868 94 36 -34 -88 -116 -72 14 79 105 77 5 -75 -106 -101 -35 39 94 102 59 -21 -92 -101 -70 -6 81 107 93 26 -49 -97 -104 -43 27
6900 27 93 104 68 -7 -77 -120 -86 -25 47 97 94 32 -40 -98 -118 -73 13 72 109 81 1 -65 -121 -98 -41 50 96 111 61 -25 -83
6931 -83 -110 -65 2 73 120 102 35 -52 -108 -103 -60 35 95 121 73 -11 -82 -109 -97 -35 54 100 107 39 -35 -113 -114 -61 12 86 112 83
6963 83 18 -58 -111 -93 -33 56 103 115 57 -13 -83 -110 -74 6 70 129 102 35 -67 -112 -117 -56 33 98 114 75 -6 -85 -118 -94
6993 -94 -31 54 104 94 32 -54 -107 -117 -72 2 79 109 92 14 -78 -104 -95 -43 56 119 120 64 -16 -89 -117 -75 6 79 134 103 39
7024 39 -44 -102 -103 -58 25 103 118 62 -3 -88 -114 -100 -25 72 115 105 44 -39 -108 -112 -66 9 93 126 95 9 -76 -110 -94 -27 59
7055 59 116 115 72 -13 -83 -106 -74 10 79 125 98 33 -62 -112 -112 -48 32 94 116 74 -4 -94 -120 -101 -27 61 110 106 52 -48 -112
$$ packed form
6837a04J1O6P2O4qm3q3o7oL7O8P0L9l1o0o9m5JM9P3N8J1l6p0o5m2K4O4P8N0j2
6868I4n8p0n4k8M4Q6O5K6k8p2q0l1NO6P4N5Qm3q0p1rL1O4Q7K6j4o7p5m8pO1P0
6900B7O6J1l6p5p0m3L4O1P2N0lo2p2n8k0M5Q6N9L7k8q0o6n6K3N7R1M6J5n0q6n8
6931h3k7M5O7P1M7j8o7q7n6NM3R5O0K6m8q4p1k7J2O2Q9M6Po8p4p8jN3P3P4K6k9
6963H3o5p6n3J8O0Q9M7J2n8p0p0k7L6Q0O4N9k7o7j02m5nO1Q9O5J6l9q1p9l3K4
6993i4O3Q5N0j0o2q6n3j0M5P4P7L0j7p8r2k6RN2R9O3Jn6q0p3k8M2Q1P3N5l1o4
7024C9q3n8jM5Q3P8J5n6o5q5k6J4P5R7M3j0o1q3o9mM6P5Q4L3l1q6q5l4J6O7Q6
7055E9N7jm3q5p0k3L2Q4O9M6k7o5r5n0%O4Q0O2K2m2p8r0k6J9P4Q8M9mn4j00o4
$$ plain form
7086 -112 -120 -74 5 91 119 87 19 -76 -112 -99 -46 49 112 117 66 -6 -93 -113 -84 4 90 137 113 36 -50 -126 -116 -56 32 108 107
7117 107 80 -12 -92 -128 -107 -24 69 115 109 46 -47 -113 -117 -77 8 98 122 101 24 -60 -133 -97 -35 58 116 115 74 -23 -91 -118 -78
7148 -78 6 83 136 107 27 -67 -123 -110 -56 30 101 127 74 0 -84 -123 -103 -36 59 110 104 44 -49 -112 -127 -77 2 92 139 95 17
7179 17 -74 -126 -101 -42 52 120 115 63 -20 -99 -129 -92 -7 76 134 104 14 -61 -122 -125 -57 30 108 115 70 -8 -93 -129 -104 -17 67 112
7211 112 114 32 -42 -116 -131 -71 19 97 125 100 19 -80 -127 -101 -28 61 114 130 64 -29 -93 -130 -78 1 84 133 102 29 -70 -125
7241 -125 -131 -63 30 106 120 70 -15 -90 -135 -102 -20 62 120 115 44 -45 -121 -134 -72 14 105 139 101 15 -76 -123 -97 -33 47 122 122
7272 122 66 -19 -102 -123 -75 -9 85 121 99 22 -78 -128 -124 -64 31 107 119 66 -16 -105 -117 -98 -13 68 126 109 41 -52 -113 -117
7302 -117 -70 27 97 139 95 12 -66 -129 -95 -31 55 123 116 57 -23 -101 -124 -77 6 91 127 104 21 -64 -133 -128 -58 36 92 118 61
$$ packed form
7086a12qM6P9Q6K8l2o8r5l6J3N3R5O3Nn1p2q7k0K9Q8Q6M7k4p7q6p6J0O0Q8P6j
7117A07k7r2q0l6K1Q3R3M6oo3r3o6mM0Q5R0K4k1p7q4p3L6O2R3N8jm1r7o8k7M0
7148g8Q4P7N3k9q0r4n6J3N4Q6P1K6n3p4q4l9K0O7R5N1oo0r3o3j5N0P9R0M7m4p8
7179A7r1n2K5N9R4O8nn2q3p9l0L7Q5Q3N8l0r0p5o1lO8Q7P8Pm5p8q5l6K5Q7Q4M5
7211A12Kq2p4p4j5O0R0P8K8k5q1r9m7K6P3Q9N3J6o6r3o4l7N2P9Q3M9l1p3r9n5
7241a25oO8R3P6J4n0q5p5m5L3Q2Q2N8np1q9p6j3O2Q6R1L4l8q6r1m7K6O4Q0P5%
7272A22n6q5q3k1M8O6R4L6k2p7j00n0MO0R5P6J2n3q2q9j2J9Q5Q1N8j7o8r3o1m
7302a17M7R7P0M2m4q3p8o3L4O4Q6O8pn9q0p8k3M7Q3Q5L6k3q3q5o9NP0R4N6K6n7
$$ plain form
7333 61 -20 -99 -141 -93 -27 66 126 110 35 -59 -119 -125 -59 24 112 132 94 12 -59 -116 -106 -26 57 128 126 59 -31 -106 -132 -88 7
7364 7 84 134 103 15 -79 -134 -120 -56 39 110 114 64 -32 -110 -132 -96 -9 71 117 105 33 -49 -117 -129 -68 24 107 137 99 0 -86
7395 -86 -121 -91 -25 64 125 120 60 -31 -109 -122 -75 7 78 122 86 3 -78 -122 -121 -47 38 108 114 68 -25 -102 -132 -94 -19 72 126 110
7427 110 33 -56 -123 -122 -66 29 109 136 88 1 -82 -120 -91 -13 72 123 102 56 -36 -105 -121 -74 17 90 133 89 14 -84 -135 -117
7457 -117 -48 43 100 111 64 -30 -99 -127 -96 -4 74 128 103 29 -55 -111 -113 -43 35 105 142 86 1 -75 -124 -82 -7 75 129 124 54
7488 54 -43 -109 -129 -68 21 92 116 110 12 -86 -128 -117 -37 55 119 123 57 -38 -111 -124 -81 8 91 136 105 42 -45 -112 -108 -51 47 110
7520 110 136 85 3 -96 -122 -99 -23 79 117 113 48 -51 -120 -119 -75 20 101 125 79 6 -79 -123 -110 -46 47 102 113 54 -17 -104
7550 -104 -104 -74 5 92 133 112 27 -61 -121 -108 -46 46 106 139 92 -8 -83 -106 -88 -19 74 122 111 39 -43 -105 -125 -69 20 86
$$ packed form
7333F1q1p9m2M8O6R3O0j6p5r4o0oO6Q3Q8K0l8q2p1n7J0Q0Q3P1ko7r0p5k6M4R5
7364GP7N0l1q8r4n5J4O4R5P1Mn0r6p8k2L6Q7Q0M6j2p2q2o8j2O1R2Q3L0l8r9q6
7395h6l5L0O6Q9O1no0r1p8j3M7Q2P1M4l6q3q1m4JP4Q5P0Om6r3p7l0L8P5R1N4j6
7427A10p7q9o7JN6R5Q0K7m8q7q3l8K9P8Q5N1k1m6r2o9j6M7R1P3M3m4p5r8n1J8
7457a17O9R1N7J1m7r4o9k8L1R2P8N4k5p4q4n6kP0P8P0L7n6q5p6m9M2P5Q2N4np0
7488E4r7o6k0O1Q9P1K4or8r8m2J1Q0R2O4Mo6r5p3j3M3Q9Q3M5l1o3q7o7MN7R8O3
7520A10K6n1q2r9k6K3P6J02L8mo5r9o9JM4R5Q1K4m6p3q5m4J3O4R3N5J1n9p1q7
7550a04%L0P9Q7M1k1q5q8o0J3O2R2O0L3m7j00p5k3J8O9R3M8j1p2q2o2k0N6Q9O6
$$ plain form
7580 86 123 88 7 -76 -119 -111 -34 50 110 110 52 -33 -101 -129 -80 12 90 132 104 24 -53 -121 -112 -30 39 103 122 73 -20 -77 -119 -89
7612 -89 -11 77 110 103 31 -49 -118 -123 -66 6 88 117 82 4 -91 -126 -115 -29 56 107 107 56 -37 -100 -108 -68 10 93 134 100 27 -59
7644 -59 -108 -97 -43 41 111 125 79 -8 -97 -123 -93 -6 72 112 97 32 -57 -118 -121 -61 18 90 117 74 -14 -88 -131 -107 -36 53 109
7675 109 100 38 -32 -105 -111 -72 10 90 125 98 17 -62 -105 -100 -31 40 119 110 64 -12 -95 -122 -83 -8 72 116 96 29 -63 -122 -120 -67
7707 -67 17 89 112 67 -12 -83 -110 -95 -24 47 107 95 37 -36 -98 -115 -67 7 88 117 91 24 -53 -112 -99 -37 55 112 106 65 -26
7738 -26 -96 -117 -81 0 76 106 86 13 -51 -110 -120 -64 15 95 97 68 -9 -86 -111 -92 -29 56 99 105 52 -41 -114 -110 -65 24 102 114
7770 114 85 7 -64 -115 -93 -22 52 97 110 49 -23 -96 -103 -70 8 69 104 79 24 -68 -109 -108 -57 25 92 101 62 -2 -82 -119 -88
7801 -88 -15 60 111 101 44 -30 -104 -103 -48 9 86 108 74 13 -69 -95 -84 -23 44 94 101 49 -11 -98 -100 -67 3 66 102 87 15 -62
$$ packed form
7580H6L7l5q1q3m3QP7Q4O0%n8q5o8k8M9R2P8M2k8q0p7o8RQ2O9O4J9m9r3n7m2L0
7612h9P8Q8L3pp2q0o9nN7P2Q2K9l5p8r5l5J1Q6Q5N1%n1r3o3qM0P8Q3M1l4p3q6
7644e9m9J1N4Q4P0J4m6q7q9k6L0Q7P8M0j5o5q9o1lO0P9P2K7m3q8p4m3K4P1Q9N6
7675A09ro2p0p3oL9Q2Q0L5k7q1p9m3NO9P1P9rm6p6q3k7L9P5Q0M4k0o7r2n9KN3
7707f7Q4P2K3m5p9p1k7J5P1P1O0j2n8p3o2j7M8P4Q1K9k6o7p7n9J3O2R2N7om1r1
7738b6p0k1L6Q1P6L0k0p3o4n9j0N6P9Q0Kk9p7p7k5J9O3Q5M3On3r3p3MM5Q9P8J2
7770A14k9p8p1n1K2P1P4M5J3o1p2p3pL3P8O1L5k5n5r2m1JN1Q2O7Rl9o4q0l7L1
7801h8P3P5N1j0n7p4p4JN5N7P7K2l4o1q2k6J1O1O7N0Pn2o0q7kL3P0O3L6j5p2p7
$$ plain form
7833 -62 -112 -105 -47 22 87 98 48 -25 -85 -119 -76 -7 62 108 93 43 -38 -92 -90 -48 23 93 105 83 8 -59 -90 -75 -36 49 94
7864 94 94 37 -27 -94 -109 -70 2 75 97 72 10 -63 -104 -94 -47 33 80 101 59 -13 -81 -113 -84 -5 68 105 86 38 -41 -95 -91
7895 -91 -48 11 77 116 81 17 -59 -93 -80 -25 48 98 85 48 -34 -108 -109 -75 -5 56 96 70 5 -60 -107 -100 -51 29 78 88 54
7926 54 -34 -80 -97 -62 -4 61 97 83 23 -42 -84 -99 -44 25 84 109 70 8 -60 -103 -79 -24 46 94 87 24 -29 -95 -101 -56 -5
7957 -5 56 89 69 4 -62 -105 -101 -44 20 79 87 48 -8 -72 -83 -65 -6 61 96 77 32 -40 -89 -80 -57 25 81 99 63 1 -66 -93
7989 -93 -82 -26 42 86 91 26 -38 -85 -93 -62 1 69 83 58 3 -57 -105 -83 -32 21 73 81 42 -23 -65 -97 -63 -1 70 101 91 32
8021 32 -31 -76 -78 -30 29 85 96 60 -4 -55 -80 -74 -13 42 84 79 29 -31 -86 -99 -54 5 70 90 68 2 -60 -88 -78 -29 30 89
8053 89 81 39 -18 -57 -83 -54 4 58 93 88 34 -33 -75 -80 -32 27 77 99 55 3 -67 -81 -70 -15 38 82 74 27 -43 -83 -88 -54 0
$$ packed form
7833f2n0PN8O9O5J1n0p3o0l4M3O9O9M6j5n0q1n4KM2P1P0J2k2p5o7l1J5L9Q5M5
7864I4%n7o4o7j5L9P2P3K2k5o2p3m1J0M7Q0M7K1m2p2o8l2K9P9P3L7j9m8p9n4M
7895i1M3N9O6L9l5o4p6l4J3N5P3N0j3l7q2p4jL4P0O1M0k6o5o5m7PM9Q0M9J0l4
7926E4q8m6j7L5N8O5L6j4o0o5m2j5N5O9N9K5l9o2o8m3K4N5P0M8po3n3o6oM5N1
7957eO1L3k0o5o6m3MN7O4N9Ql9n6o4j1J8N9O7L5j9m5p2m9RK3Q2N6J8l6o2o7k7
7989i3J1N6O8M4No5o4m7qL1O3O8J4k5n5o0m8K2N1N3N2Ql9o5m2l2L4O2P1L1j0n9
8021C2o3m5kM8N9N6J1l6o4n1k5OO1N5M2nn0o0n5j3M5N9O5K0k2o6o2k8J0M9N9N9
8053H9qm2n7l9k6K9N8N4L5nn4o7m2nM8N9N0K2m4n2p0j4J1N5N3M4qm7p0m0nL4N4
$$ plain form
8086 0 51 84 65 1 -57 -90 -83 -24 28 82 86 39 -12 -65 -80 -60 4 58 80 73 27 -35 -71 -84 -35 34 78 86 57 -5 -64 -78 -60
8119 -60 -8 39 78 70 24 -35 -86 -73 -50 1 50 75 43 -2 -53 -90 -70 -22 23 69 78 37 -21 -68 -82 -38 14 57 81 75 28 -43
8151 -43 -73 -69 -37 22 67 67 42 -11 -58 -76 -61 -16 38 77 70 24 -35 -78 -71 -49 5 61 76 55 -8 -49 -85 -66 -23 34 82 79 39
8184 39 -5 -54 -61 -46 4 62 89
$$ packed form
8086@N1L3j9o4n8l3PN9N2N4Mm7n1n3j5K0O4N4K2pm6o2l6j3M9O9M4Qk9o2n9j4J8
8119f0N2M7L9qm6n9n1J3K3N1M9K5l2m5n1l7K0M8M5M6Rm1n8m7j4M4N2M3K4om7p1
8151d3l0ML2N9M5%k5n3m7j8J5M5N4L9pm6n9m3PK2N4N6J5k1o3m1l6J9M3N7M8lm0
8184C9m4m9pJ5N0N8K7
8191H9
$$ Imaginary data points
##PAGE= N=2
##DATA TABLE= (X++(I..I)), XYDATA
$$ plain form
0 0 0 0 0 0 0 0 0 0 0 0 0 0 0 0 0 0 0 0 0 0 0 0 0 0 0 5 -8 8 -8 8 -8 8 -8 12 -16 16 -16 17 -24 24 -25 32 -32 37 -40
45 -40 45 -49 56 -60 67 -73 81 -89 99 -108 119 -133 148 -165 186 -209 241 -278 325 -391 485 -631
67 -631 898 -1522 6299 -5671 -32621 -39018 -27632 -733 25079 39305 31958 9816 -18630 -35979
81 -35979 -35992 -16821 10122 32035 37520 23547 -2063 -26721 -37514 -28977 -6098 20359 35704
94 35704 33505 13393 -12933 -32869 -35884 -20333 5091 28318 36557 26406 2634 -22370 -35432
107 -35432 -30795 -9931 15162 32872 33384 16863 -7820 -28710 -34192 -22787 545 23080 33859
120 33859 27399 6604 -16872 -32247 -30482 -13632 10298 28992 32579 19916 -3494 -24510 -33380
133 -33380 -24878 -3778 18996 32466 28730 10855 -12940 -29669 -31225 -16978 6087 25448 32283
$$ packed form
0@%%%%%%%%%%%%%%%%%%%%%%%%%Nj3J6j6J6j6J6j6K0k8L2l2L3m1M8m9N7o4O9p7
45d0Q5r4J05j16J27j40J54j70J88k07K27k52K81l13L51l95M50n19O03p16Q76j116
67f31J529k420P821j1970k6950o397J1386K6899K5812J4226p347k2142k8446j7349
81c5979j3J9171K6943K1913N485j3973k5610k4658j0793Q537K2879K6457J5345
94C5704k199k0112k6326j9936l015J5551K5424K3227Q239j0151k3772k5004j3062
107c5432M637K0864K5093J7710N12j6521k4683k0890n482J1405K3332K2535J0779
120C3859o460k0795k3476j5375J765J6850K3930J8694L587j2663k3410k1016q870
133c3380Q502K1100K2774J3470l736j7875k3795j6729j556J4247K3065J9361O835
$$ plain form
146 32283 22055 1049 -20459 -31419 -25985 -7827 14670 29124 29044 13907 -8251 -25869 -30611
159 -30611 -19198 1428 21744 30740 23994 5142 -16687 -29488 -27698 -11327 10463 27028 29883
172 29883 17074 -3934 -23378 -30298 -22074 -2539 18201 29350 25868 8688 -12259 -27200 -27938
185 -27938 -14479 6020 23747 28839 19670 83 -19193 -28675 -23630 -6209 13866 27434 26516
198 26516 12312 -8304 -24774 -28273 -17705 2324 20708 28895 22065 3939 -15905 -27949 -25149
211 -25149 -10066 10393 25266 27210 15406 -4507 -21522 -27942 -19638 -1746 17016 27202 23129
224 23129 7719 -12064 -25193 -25703 -12955 6407 22282 27201 17704 -408 -18675 -27189 -21755
237 -21755 -5433 14008 25877 24968 10857 -8484 -23507 -26590 -15762 2529 19928 26693 20056
$$ packed form
146C2283j0228k1006k1508j0960N434J8158K2497J4454q0j5137k2158j7618m742
159c0611J1413K0626K0316Q996o746j8852k1829j2801J790J6371K1790J6565K855
172B9883j2809k1008j9444o920Q224J9535K0740J1149l482j7180k0947j4941p38
185b7938J3459K0499J7727N092r169j9587j9276r482N045J7421K0075J3568r18
198B6516j4204k0616j6470l499J0568K0029J8384Q187o830j8126j9844j2044K800
211b5149J5083K0459J4873J944j1804j9913j7015o420Q304J7892J8762J0186m073
224B3129j5410j9783j3129n10J2748J9362J5875M919r497j8112j8267q514N434
237b1755J6322J9441J1869r09j4111j9341j5023l083J0828J8291J7399O765o637
$$ plain form
250 20056 3134 -15345 -25621 -23165 -8474 9936 23567 24984 13576 -4496 -20580 -25664 -18048
263 -18048 -920 16476 25530 21674 6359 -11780 -24347 -24046 -11671 6672 21782 25481 16524
276 16524 -1324 -18022 -25743 -20136 -4246 13427 24626 22752 9691 -8520 -22121 -24316 -14318
289 -14318 3189 18555 24885 18093 2314 -14640 -24235 -21102 -7617 10134 22372 23449 12391
302 12391 -5121 -19765 -24680 -16504 -327 16313 24531 20125 5643 -12039 -23086 -22694 -10403
315 -10403 6893 20633 23993 14752 -1515 -17338 -23862 -18385 -3576 13068 22754 21185 8367
328 8367 -8278 -20938 -22744 -12857 3301 18150 23356 16946 1556 -14509 -23143 -20084 -6438
341 -6438 10048 21866 22162 11265 -5380 -19402 -23150 -15431 475 15711 23147 18643 4575
$$ packed form
250B0056j6922j8479j0276K456J4691J8410J3631J417j1408j8072j6084n084P616
263a8048J7128J7396R054l856j5315j8139j2567L01J2375J8343J5110L699q957
276A6524j7848j6698p721N607J5890J7673J1199j874j3061j8211j3601k195R998
289a4318J7507J5366O330o792j5779j6954r595L133J3485J7751J2238J077j1058
302A2391j7512j4644m915Q176J6177J6640Q218m406j4482j7682j1047L92J2291
315a0403J7296J3740L360r241j6267j5823o524N477J4809J6644R686j569j2818
328H367j6645j2660j806R887J6158J4849N206o410j5390j6065q634L059J3646
341f438J6486J1818K96j0897j6645j4022l748P719J5906J5236P436m504j4068
$$ plain form
354 4575 -11478 -21947 -20736 -9339 6946 19536 22093 13554 -2191 -16379 -22557 -16845 -2761
367 -2761 12729 21930 19602 7574 -8715 -20261 -21617 -11838 4066 17630 22589 15542 893
380 893 -14430 -22265 -18572 -5702 10300 20648 20768 10023 -5628 -18299 -21737 -13756 737 15149
394 15149 21541 17071 3903 -11361 -20490 -19483 -8116 6993 18788 20964 12236 -2498 -16327
407 -16327 -21416 -15855 -1969 12813 21037 18682 6428 -8729 -19743 -20341 -10703 4284 17186
420 17186 21022 14449 192 -13776 -20821 -17165 -4706 9766 19590 19028 9048 -5705 -17445 -20158
434 -20158 -12767 1422 14510 20567 15825 3080 -11218 -19973 -18153 -7410 7453 18270 19913
447 19913 11325 -3191 -15768 -20602 -14487 -1370 12553 20022 17124 5751 -8793 -18440 -18923 -9549
$$ packed form
354D575j6053j0469J211J1397J6285J2590K557q539j5745j4188o178N712J4084
367b761J5490R201k328j2028j6289j1546j356R779J5904J3564M959p047j4649
380H93j5323p835L693J2870J6002J0348J20j0745j5651j2671l438P981J4493J4412
394A5149O392m470j3168j5264r129J007J1367J5109J1795K176q728j4734j3829
407a6327n089N561J3886J4782Q224k355j2254j5157j1014n98R638J4987J2902
420A7186L836o573j4257j3968p045L656J2459J4472R824n62r980j4753j1740k713
434b0158P391J4189J3088O057m742j2745j4298q755J820J0743J4863J0817J643
447A9913q588j4516j2577m834O115J3117J3923P469k898j1373j4544r647m83R374
$$ plain form
461 -9549 4465 16089 19701 12901 -79 -13310 -19483 -15766 -4057 9843 18485 18015 7936 -5920
475 -5920 -16956 -19247 -11525 1799 14550 19558 14825 2308 -11305 -19030 -17177 -6280 7381
488 7381 17564 18541 10134 -3313 -15192 -18950 -13362 -742 11912 18617 15801 4769 -8366 -17572
502 -17572 -17405 -8622 4660 15541 18383 12012 -849 -12946 -18741 -14680 -3208 9822 18066 16771
516 16771 7185 -6346 -16393 -18129 -10597 2409 13861 18584 13449 1791 -10871 -17908 -15613
529 -15613 -5650 7389 16303 17177 9089 -3551 -14250 -17868 -12011 -405 11670 17628 14598 4136
543 4136 -8643 -16753 -16571 -7563 5019 15179 17607 10812 -1229 -12980 -17742 -13635 -2479 9838
557 9838 17012 15720 6089 -6201 -15595 -16748 -9426 2518 13321 17051 12377 1120 -10432 -16746
$$ packed form
461i549J4014J1624L612o800j2980j3231o173L717J1709J3900Q642m70j0079j3856
475e920j1036k291P722J3324J2751N008m733j2517j3613p725J853J0897J3661
488G381J0183R77q407j3447j1879l758N588J2620J2654O705k816j1032j3135r206
502a7572J67Q783J3282J0881K842o371j2861j2097n795M061J1472J3030Q244j295
516A6771r586j3531j0047j736P532J3006J1452M723n135j1658j2662p037K295
529a5613R963J3039Q914Q74q088j2640j0699l618N857J1606J2075N958l030j0462
543D136j2779q110J82R008J2582J0160K428o795j2041j1751m762M107J1156J2317
557I838P174j292r631j2290r394j153P322J1944J0803L730m674j1257j1552o314
$$ plain form
571 -16746 -14466 -4671 7214 15748 15946 8166 -3909 -14026 -16815 -11186 426 11513 16997 13598
585 13598 3248 -8633 -16330 -15328 -6819 5325 14557 16401 9920 -1733 -12179 -16674 -12335 -2005
599 -2005 9344 15954 14256 5557 -6252 -14525 -15596 -8533 2811 12601 16209 11194 760 -10355
613 -10355 -15991 -13449 -4114 7526 15045 15190 7236 -4186 -13563 -16012 -10080 664 11290 15863
627 15863 12556 2726 -8416 -15113 -14269 -5897 5069 13649 15112 8874 -1744 -11671 -15317 -11396
641 -11396 -1425 9047 14994 13330 4642 -6165 -14133 -14554 -7669 3175 12463 15235 10423 9
655 9 -10131 -15285 -12457 -3286 7350 14456 13887 6520 -4332 -12793 -14717 -9202 1094 10479 14820
670 14820 11314 2246 -8028 -14211 -12951 -5336 5233 12864 14117 8026 -2201 -11196 -14679 -10320
$$ packed form
571a6746K280R795J1885Q534J98p780j2075j0117k789N629J1612J1087N484l399
585A3598j0350j1881p697J002Q509J2144R232J844o481j1653j0446m495M339J0330
599b005J1349O610j698q699j1809q273j071P063J1344R790L608n015j0434j1115
613a0355n636K542R335J1640P519J45p954j1422r377k449N932J0744J0626M573
627A5863l307r830j1142o697Q44Q372J0966Q580J463o238j0618r927l646L921
641a1396R971J0472N947j664q688j0807p968m21O885J0844R288K772m812j0414
655Ij0140n154K828R171J0636P106n69p367j0852q461j924N515J0296R385M341
670A4820l506r068j0274o183J260P615J0569P631J253o091j0227q995l483M359
$$ plain form
684 -10320 -965 9085 14387 12341 4039 -6473 -13445 -13741 -6768 3404 11879 14355 9329 -170
698 -170 -9801 -14138 -11389 -2834 7124 13284 12892 5651 -4159 -12033 -13634 -8227 1197 10205 13745 10502
714 10502 1637 -7934 -13495 -12182 -4421 5308 12614 13237 7220 -2545 -11065 -13732 -9559 -312 8801
729 8801 13613 11375 3343 -6199 -12760 -12500 -6128 3475 11141 13148 8555 -562 -9107 -13247 -10353
744 -10353 -2338 6862 12647 11792 5126 -4426 -11522 -12839 -7481 1709 9870 13229 9537 1206 -7933
759 -7933 -12905 -11227 -3939 5470 11835 12407 6436 -2642 -10351 -12832 -8568 -253 8368 12505 10416
774 10416 2988 -5966 -11708 -11656 -5381 3359 10564 12299 7696 -711 -8967 -12397 -9649 -1781 6873
789 6873 12034 11118 4302 -4464 -11210 -11969 -6732 1905 9596 12229 8827 720 -7492 -12026 -10319 -3350
$$ packed form
684a0320R355J0050N302k046q302j0512o972k96O973J0172Q475K476n026r499
698a70r631m337K749Q555R958O160l92p241r810p874j601N407R424R008L540l243
714A0502q865r571n561J313P761R729P306O23o017r765q520k667M173R247R113
729H801M812k238q032r542o561K60O372R603P666K007m593r117q545m140K894
744a0353Q015R200N785q55o666r552p096j317N358R190Q161L359l692q331r139
759g933m972J678P288R409O365N72n971r078p709k481M264Q315Q621M137k089
774A0416p428q954n742N2O275Q740P205J735m603q407q256l430K748P868Q654
789F873N161r16o816q766o746p59N237Q637P691K633l402q107q212m534J707O969
$$ plain form
805 -3350 5091 11121 11248 5870 -2619 -9673 -11738 -7903 121 7835 11792 9507 2486 -5838 -11267
820 -11267 -10698 -4859 3669 10143 11568 7004 -1183 -8609 -11845 -8737 -1419 6722 11364 10170 3912
835 3912 -4453 -10315 -11109 -6064 1880 8815 11361 7923 698 -7066 -11047 -9442 -3034 4953 10270
850 10270 10543 5170 -2630 -9242 -11050 -7115 326 7775 11060 8865 1986 -5826 -10638 -10074 -4159
865 -4159 3595 9709 10703 6326 -1231 -8213 -10819 -8101 -1080 6221 10470 9329 3389 -4069 -9685
880 -9685 -10085 -5525 1941 8336 10454 7323 255 -6738 -10500 -8668 -2478 4951 9950 9693 4656 -2957
896 -2957 -8893 -10356 -6478 742 7397 10480 8004 1672 -5593 -9943 -9124 -3821 3562 8869 9885
911 9885 5714 -1254 -7546 -10084 -7270 -984 5950 9716 8591 3052 -4138 -9058 -9523 -4882 2063
$$ packed form
805c350Q441O030J27n378q489p054k065L835Q024P714L957k285p021q324n429
820a1267N69N839Q528O474J425m564q187p426l236L108P318Q141M642j194o258
835C912q365n862p94N045P944O935K546l438p225p764l981J605O408P987N317
850A0270K73n373p800o612j808L935P441P449L285k195o879p812m812N64N915
865d159P754O114R94m377p557o982k606K718P021P301M249j141n940p458n616
880i685m00M560P466O395K118l131p068o993l762J832O190P429M999k57n037p613
896b957n936j463L878P220O655L083k476o332p265m350Q19N303P383N307J016
911I885m171o968o292k538K814O286O934L766j125n539p190m920m65M641O945
$$ plain form
926 2063 8048 9907 6607 62 -6694 -9826 -8062 -2091 4875 9286 9095 4092 -2736 -8352 -9522
941 -9522 -5901 640 6921 9508 7473 1452 -5088 -9134 -8465 -3394 3205 8363 9049 5268 -1312 -7206
957 -7206 -9360 -6796 -596 5691 9263 7926 2594 -4037 -8716 -8766 -4503 2182 7590 9189 6105 -146
973 -146 -6144 -9181 -7330 -1927 4474 8565 8231 3870 -2600 -7560 -8787 -5402 664 6323 8886 6726
989 6726 1318 -4929 -8531 -7794 -3063 3320 7842 8530 4668 -1436 -6901 -8827 -6127 -464 5562 8549
1005 8549 7334 2298 -3856 -7987 -8140 -4014 1929 6998 8375 5542 -51 -5708 -8289 -6792 -1687
1020 -1687 4127 7880 7635 3399 -2444 -7192 -8087 -4920 825 6146 8242 6273 909 -4750 -8107
1035 -8107 -7195 -2637 3176 7465 7785 4316 -1490 -6388 -8064 -5666 -315 4991 7910 6650 2152
$$ packed form
926B063N985J859l300o545o756l132J764N971O966M411j91n003o828n616j170
941i522L621O541O281K587k035o021o540m046O69N071O599N158O86l781o580n894
957g206k154K564O200O287L572j337n332o631m679n0M263O685N408J599l084o251
973a46n998l037J851N403O401M091l34m361o470m960j227L385O066N659K563k160
989F726n408o247l602P37M731O383M522O88l862o104n465j926K700N663O026K987
1005H549j215n036o154m131j53M126N943N069J377k833n593n657k581J497N105
1020a687N814L753k45m236n843m748q95L167N745N321K096j969n364n659l357
1035h107R12M558N813M289L20l469n806m898j676K398N351N306K919j260m498
$$ plain form
1050 2152 -3491 -7344 -7356 -3758 1907 6393 7757 5086 -208 -5315 -7824 -6148 -1478 4088 7465
1065 7465 7042 3067 -2575 -6759 -7617 -4414 919 5795 7737 5657 857 -4507 -7402 -6635 -2437 2946
1081 2946 6740 7230 3919 -1226 -5859 -7403 -5189 -406 4666 7186 6215 1903 -3290 -6813 -6886 -3318
1097 -3318 1816 6154 7190 4672 -306 -5143 -7238 -5753 -1151 3845 6989 6517 2760 -2314 -6304
1112 -6304 -6909 -4152 824 5257 7040 5296 789 -3959 -6836 -6055 -2300 2651 6239 6556 3685 -1260
1128 -1260 -5407 -6887 -4776 -203 4388 6822 5624 1689 -3245 -6430 -6338 -3045 1900 5686 6723
1143 6723 4225 -323 -4721 -6704 -5186 -1204 3546 6311 5981 2621 -2106 -5633 -6407 -3757 646
1158 646 4822 6464 4821 780 -3784 -6232 -5632 -2013 2556 5821 6144 3237 -1216 -5187 -6361 -4374
$$ packed form
1050B152n643l853j2L598N665M486J364k671n294n107k509J676M670N566L377
1065G465m23l975n642m184q58L203N333M876J942k080m800n364k895P67M198N383
1081B946L794M90l311n145m633j544K214M783N072K520r71m312n193l523p3L568
1097c318N134M338J036k518m978m837k095J485M602M996L144m72l757n074l990
1112f304o05K757M976M433J783j744m507m748k877P81L755M951L588L17k871m945
1128a260m147j480K111M573M591K434j198l935m934l185R2L293M945L786J037
1143F723k498m548m398j983J518L982M750K765l30l360m727l527p74K650M403
1158F46M176J642j643m041m564k448O00L619M569L265L23k907m453l971j174J987
$$ plain form
1174 -4374 -121 4179 6239 5257 1470 -2934 -5910 -5835 -2796 1573 5211 6057 3993 -194 -4209 -6066
1190 -6066 -4876 -1112 3089 5814 5480 2433 -1891 -5268 -5826 -3541 726 4477 6015 4434 553
1205 553 -3537 -5920 -5114 -1852 2459 5419 5607 3025 -1220 -4678 -5882 -4017 -164 3723 5738 4759
1221 4759 1504 -2668 -5316 -5354 -2645 1450 4681 5632 3598 -168 -3940 -5606 -4400 -993 3053 5369
1237 5369 5088 2100 -1923 -4928 -5443 -3112 724 4276 5514 4059 508 -3328 -5349 -4776 -1681 2154
1253 2154 4924 5164 2789 -935 -4307 -5302 -3767 -221 3378 5197 4466 1358 -2359 -4950 -4902 -2412
1269 -2412 1351 4439 5146 3376 -272 -3674 -5216 -4092 -825 2778 5032 4633 2020 -1724 -4507
1284 -4507 -4960 -2995 613 3755 5059 3775 614 -2864 -4901 -4358 -1732 1907 4421 4738 2665 -871
$$ packed form
1174d374M253M300K060r82l787m404k976P5L039M369L638Q46k064m187m015j857
1190f066J190L764M201K725l34l047m324l377n58K285M267L751J538j581l881
1205E53m090k383Q06L262M311K960J88k582m245l458j204J865L853L887K015r79
1221D759l255m172k648l8K709M095L231R51k034l766l772j666J206L407M046K316
1237E369k81k988m023l005n15K331L836L552J238j455l551l836k021N73L095L835
1253B154K770K40k375l724l372r95J535L546L599J819p31l108l717k591M8K490
1269b412L763L088P07j770l648l402j542J124L267L603K254l99k613l744k783
1284d507m53J965L608L142J304j284l161l478k037N43K626L639K514L17k073l536
$$ plain form
1300 -871 -3866 -4957 -3434 -229 3153 4851 4044 1254 -2323 -4550 -4557 -2167 1328 4076 4804 3021
1316 3021 -186 -3393 -4751 -3765 -869 2543 4487 4315 1875 -1433 -4055 -4570 -2761 412 3444 4574
1332 4574 3508 583 -2655 -4450 -4065 -1492 1753 4149 4352 2383 -837 -3670 -4504 -3175 -100 2928
1348 2928 4457 3746 1110 -2027 -4204 -4129 -2082 1105 3674 4327 2923 -76 -2929 -4336 -3493 -915
1364 -915 2161 4125 3913 1873 -1278 -3685 -4185 -2584 416 3113 4272 3173 536 -2472 -4161 -3688
1380 -3688 -1429 1691 3793 4019 2202 -743 -3300 -4190 -2897 -250 2625 4039 3464 1174 -1795 -3730
1396 -3730 -3862 -1955 880 3295 4005 2676 44 -2725 -3957 -3236 -808 2050 3778 3664 1603 -1205
1412 -1205 -3465 -3873 -2328 396 2957 3883 2966 450 -2243 -3804 -3452 -1314 1405 3474 3668 2123
$$ packed form
1300h71k995j091J523L205L382J698q07k790l577k227pK390L495K748P28j783
1316C021l207l207j358R86K896L412J944j72k440l308k622n15J809L173L032J130
1332D574j066k925l238j795L85K573L245K396K03j969l220k833q34J329L075L028
1348B928J529p11k636l137k177P5K047L187K569O53j404k999k853j407Q43K578
1364i15L076J964k12k040l151k407n00J601L000K697J159j099k637l008j689M73
1380c688K259L120K102K26j817k945k557q90J293K647K875J414n75k290k969j935
1396c730j32J907K835K415P10j329k632k769j232P21K428K858J728j14k061k808
1412a205k260m08J545K724K561R26r17k516k693j561L52K138K719K069J94j545
$$ plain form
1428 2123 -549 -2958 -3778 -2787 -294 2269 3704 3234 1136 -1538 -3461 -3518 -1867 829 3050 3683
1444 3683 2491 -41 -2470 -3718 -2958 -756 1865 3517 3335 1561 -1104 -3103 -3577 -2210 258 2569
1460 2569 3605 2757 603 -1931 -3432 -3190 -1386 1194 3069 3419 1999 -418 -2650 -3525 -2547 -349
1476 -349 2125 3380 2990 1029 -1461 -3158 -3277 -1646 747 2825 3404 2291 49 -2282 -3354 -2803
1492 -2803 -755 1614 3148 3138 1483 -831 -2812 -3276 -2149 97 2293 3241 2633 586 -1694 -3159
1508 -3159 -2989 -1268 1041 2855 3109 1875 -421 -2447 -3228 -2384 -260 1887 3153 2740 994 -1268
1524 -1268 -2909 -3002 -1641 615 2483 3139 2208 153 -1927 -3082 -2604 -865 1351 2833 2893 1500 -721
1541 -721 -2487 -3062 -1990 36 2063 3016 2373 584 -1593 -2868 -2748 -1192 986 2572 2907 1716
$$ packed form
1428B123k672k409q20R91K493K563J435m70k098k674j923n7J651K696K221O33
1444C683j192k532k429j248P60K202K621J652j82j774k665j999m74J367K468K311
1460B569J036q48k154k534j501K42J804K580J875L50j420k417k232q75R78K198
1476c49K474J255l90j961k490j697j19J631K393K078N79j113k242k331j072N51
1492b803K048K369J534j0j655k314j981m64J127K246K196R48o08k047k280j465
1508c159J70J721K309J814K54j234k296k026p81Q44K124K147J266m13j746k262
1524a268j641r3J361K256J868O56r31k055k080j155M78J739K216J482O0j393k221
1541g21j766n75J072K026K027R53o43j789k177j275J20J556K178J586L35j191
$$ plain form
1557 1716 -290 -2205 -2958 -2214 -382 1692 2820 2600 1025 -1028 -2564 -2818 -1573 393 2240 2857
1573 2857 2086 248 -1752 -2766 -2452 -789 1214 2612 2670 1345 -630 -2341 -2774 -1848 60 1901
1589 1901 2742 2225 515 -1383 -2661 -2529 -1156 796 2355 2657 1712 -191 -1926 -2717 -2121 -437 1412
1606 1412 2611 2402 1053 -901 -2345 -2572 -1528 380 2005 2657 1922 214 -1582 -2596 -2212 -759
1622 -759 1145 2386 2457 1285 -575 -2080 -2602 -1733 -60 1673 2516 2086 656 -1202 -2363 -2409 -1181
1639 -1181 609 2066 2500 1607 -31 -1732 -2479 -1983 -463 1306 2354 2256 958 -782 -2138 -2380 -1377
1656 -1377 299 1864 2412 1805 244 -1427 -2343 -2111 -758 911 2168 2282 1278 -368 -1877 -2364
1672 -2364 -1726 -154 1433 2298 2005 656 -986 -2176 -2199 -1136 523 1899 2268 1519 -67 -1554 -2300
$$ packed form
1557A716k006j915p53P44J832K074J128k20j575k053j536k54J245J966J847O17
1573B857p71j838k000j014L14J663K003J398N8j325j975j711m33R26J908J841
1589A901Q41n17j710j898j278J32J373J952J559L02r45j903j735p91N96J684J849
1606A412J199k09j349j954j444k27J044J908J625O52p35j708j796j014L84J453
1622g59J904J241P1j172j860j505n22Q69J673J733Q43m30j430j858j161m6J228
1639a181J790J457M34q93j638j701p47M96J520J769J048r8j298j740j356k42J003
1656a377J676J565N48o07j561j671r16K32J353J669J257J14j004j646j509m87
1672b364O38J572J587Q65k93j349j642j190k3J063J659J376L69p49j586j487p46
$$ plain form
1689 -2300 -1812 -418 1165 2185 2049 945 -701 -1925 -2190 -1338 225 1601 2241 1712 362 -1196
1705 -1196 -2151 -1973 -837 771 1906 2142 1252 -262 -1642 -2201 -1586 -220 1297 2088 1830 626 -928
1722 -928 -1953 -2031 -1022 461 1730 2091 1394 33 -1414 -2061 -1731 -469 1015 1952 1954 935 -511 -1733
1740 -1733 -2028 -1312 58 1447 2042 1664 391 -1031 -1946 -1864 -788 637 1768 1939 1159 -243 -1513
1757 -1513 -1980 -1491 -165 1165 1916 1684 599 -783 -1811 -1850 -1037 363 1547 1942 1396 110 -1189
1774 -1189 -1927 -1626 -545 828 1785 1812 976 -421 -1534 -1895 -1245 29 1266 1890 1499 410 -962
1791 -962 -1772 -1693 -751 598 1586 1802 1081 -166 -1344 -1840 -1385 -258 1033 1723 1625 670 -634 -1596 -1786
1810 -1786 -1018 210 1369 1798 1325 201 -1062 -1716 -1546 -529 728 1601 1686 872 -336 -1425 -1708
$$ packed form
1689b300M88J394J583J020j36j104j646j224k65Q52J563J376O40n29j350j558
1705a196r55J78J136J608J135K36q90j514j380n59O15J366J517P91k58j204j554
1722i28j025p8J009J483J269L61o97j361j447o47L30J262J484R37Kj019j446j222
1740a733k95P16J370J389N95l78j273j422r15Q2J076J425J131J71p80j402j270
1757a513m67M89J326J330P51k32j085j382j028l9Q13J400J184L95n46j286j299
1774a189p38L01J081J373R57K7q36j397j113l61O50J274J237O24l91j089j372
1791i62q10P9R42J349R88K16p21j247j178m96M55J127J291O90r8r55j304r62j90
1810a786P68J228J159M29m73j124j263o54J70J017J257Q73Q5q14j208j089k83
$$ plain form
1827 -1708 -1145 -1 1168 1693 1409 360 -827 -1628 -1584 -737 448 1440 1668 1089 -69 -1182 -1685 -1367
1845 -1367 -321 835 1609 1524 677 -513 -1453 -1620 -1003 184 1201 1644 1241 191 -926 -1579 -1386 -511
1863 -511 654 1455 1539 859 -295 -1232 -1600 -1087 -67 995 1586 1323 461 -683 -1446 -1514 -794 325 1237
1882 1237 1571 1045 19 -1025 -1547 -1275 -373 749 1421 1407 640 -448 -1289 -1494 -890 120 1095 1474
1900 1474 1152 210 -825 -1404 -1333 -520 525 1317 1440 839 -164 -1108 -1449 -1100 -151 865 1415 1277 471
1919 471 -553 -1324 -1396 -763 258 1136 1389 982 9 -921 -1402 -1164 -318 647 1314 1268 619 -372 -1174 -1356
1939 -1356 -880 85 951 1381 1097 285 -667 -1302 -1240 -573 422 1170 1351 847 -112 -961 -1357 -1029 -194 748
1959 748 1292 1163 468 -505 -1176 -1278 -703 213 1003 1294 894 70 -822 -1273 -1098 -369 553 1144 1215 620
$$ packed form
1827a708N63J144J169N25k84j049j187q01M4Q47J185R92K28n79j158j113n03L18
1845a367J046J156P74q5q47j190r40j67O17J187J017M43m03j050j117o53J93Q75
1863e11J165Q01Q4o80j154r37l68N13J020J062N91k63q62j144p63o8P20J119R12
1882A237L34n26j026j044n22K72R02J122O72j4p67j088q41k05O04J010R75L79
1900A474l22r42j035n79P1Q13J045P92J23o01j003r44l41L49R49J016N50j38q06
1919D71j024p71p2O33J021Q78K53m07r73r30m81K38Q46R65O67m6o49r91q02j82
1939a356M76R65Q66M30k84q12r52o35O2O67R95P48J81n04r59q49l96L28Q35R42
1959G48N44j29o95r73o71j02N75R16P90K91m00q24q92m51J75P29R22N91P1n95
$$ plain form
1979 620 -263 -1030 -1285 -875 -40 839 1258 1078 326 -575 -1161 -1187 -542 325 1044 1220 775 -52 -870 -1204
1999 -1204 -963 -178 647 1153 1081 433 -401 -1069 -1164 -695 134 877 1171 900 118 -678 -1169 -1057 -413 430
2019 430 1063 1126 662 -187 -900 -1167 -848 -56 704 1166 978 341 -491 -1047 -1038 -533 291 916 1123 724 -18
2040 -18 -739 -1105 -871 -232 557 1042 1019 477 -322 -927 -1114 -698 42 760 1099 856 197 -586 -1046 -995 -409
2061 -409 359 928 1040 591 -120 -797 -1051 -755 -89 644 1006 902 311 -413 -917 -978 -502 198 821 1015
2081 1015 721 53 -653 -1001 -889 -278 423 932 963 475 -231 -848 -1013 -692 1 648 975 791 187 -476
2101 -476 -940 -885 -393 297 831 923 584 -85 -669 -946 -712 -115 524 930 849 374 -321 -833 -915 -551 131
2122 131 697 954 701 105 -547 -923 -800 -310 375 821 860 461 -193 -728 -913 -616 -40 565 864 713
$$ packed form
1979F20q83p67k55M10Q35Q79M19j80p52r01n86k6O45Q67P19J76m45q27q18l34
1999a204K41P85Q25N06p2o48q34o68r5M69Q29P43K94k71p82p96m91J12O44Q43
2019D30O33O3m64q49p13k67L19P92P60M62j88o37q32n56RN05Q24O25K07l99p42
2040a8p21l66K34O39P89M85k3n42p99o05j87M16P40P18L39k43o59p83m60N1N86
2061d09P68N69J12m49p11o77k54K96O66P33L62j04n91p24n04o1M76P00O23J94
2081A015k94o68p06l48J12O11P01N09L1m88p06o17j65L21O93O47L27j84o04o63
2101d76m64N5M92O90N34R2l39o69n84k77K34N97O39M06q1m75o95n12q2L64O82
2122A31N66K57k53n96o52l76J23M90O85M46L9l99o54n35j85K97N76O05K99j51
$$ plain form
2142 713 215 -434 -814 -825 -389 220 717 880 566 0 -598 -870 -711 -172 440 822 826 385 -237 -731 -851
2163 -851 -520 65 613 839 651 118 -464 -810 -741 -287 286 722 771 435 -135 -635 -801 -608 -67 470 779
2184 779 684 235 -319 -756 -774 -434 138 631 805 576 41 -490 -795 -666 -192 358 748 731 393 -194 -618
2205 -618 -752 -479 46 511 752 588 139 -386 -712 -683 -320 230 624 727 444 -67 -541 -755 -580 -136
2225 -136 398 702 662 271 -252 -636 -716 -397 93 541 721 529 91 -417 -670 -603 -202 297 621 675 343
2246 343 -109 -541 -673 -460 -28 443 649 575 175 -304 -639 -647 -332 140 545 655 445 -12 -457 -670 -566
2267 -566 -153 306 606 599 270 -183 -554 -621 -385 66 461 623 489 95 -323 -605 -539 -225 220 549 612 368
2289 368 -82 -463 -635 -464 -72 351 613 535 213 -257 -564 -612 -340 93 454 593 404 20 -376 -593 -495
$$ packed form
2142G13m98o49l80j1M36O09M97J63l14n66n98k72J59N39O12L82Mm41o22m94j20
2163h51L31N85N48K26j88n33n82l46O9M54N73M36M9l36n70n00j66J93N41N37L09
2184G79r5m49n54m37j8L40N72M93J74k29n35n31l05J29M74N50L90j7l38n87m24
2205f18j34K73N25M65K41j64m49n25l26K9L63N50L94J03k83n11m74k14J75M44
2225a36N34L04m0l91n23l84q0L19M90M48J80j92m38n08k53O7M01M99L24N4l32
2246C43m52m32j32K13M32M71K06p4m00m79l35qL15M72M05J10k10m57m45k13J04
2267e66M13M59L00pl29m53l71o7K36M51L95J62j34l94m18k82O6L14M45L29O3k44
2289C68m50l81j72J71L92M23K62p8l22m70l07m8K72M33L61J39j89l84l96k17R8
$$ plain form
2310 -495 -178 248 527 529 270 -148 -458 -567 -354 5 385 566 480 131 -277 -535 -538 -241 156 483 565 359
2332 359 -12 -402 -559 -465 -102 286 518 485 199 -169 -483 -534 -319 30 379 497 394 46 -299 -503 -461
2353 -461 -176 176 457 486 284 -78 -402 -512 -390 -25 306 515 466 164 -195 -473 -485 -266 98 394 498
2374 498 352 13 -297 -482 -396 -124 213 442 424 223 -124 -395 -477 -324 -1 301 469 378 114 -229 -452
2395 -452 -437 -217 132 390 476 309 -5 -323 -468 -364 -83 258 453 422 195 -132 -371 -432 -257 41 320
2416 320 426 325 66 -245 -415 -388 -155 144 363 406 236 -69 -358 -444 -334 -54 238 414 375 134 -159
2437 -159 -400 -409 -226 74 326 411 302 29 -250 -391 -338 -95 159 370 368 198 -67 -303 -377 -270 -3 245
2459 245 381 323 94 -175 -384 -375 -193 84 321 386 253 -19 -280 -408 -326 -98 182 355 339 171 -110 -312
$$ packed form
2310d95L17M26K79Kk59m18l10j09K13L59L80J81q6l49m08k58lK97L97L27Q2k06
2332C59l71l90j57R4L63L88K32l3k86l68l14n1K15L49L49J18j03l48l45k04M2
2353d61K85L52K81K9k02l62l24j10J22L65L31K09m9l02l59k78j2K19L64K96J04
2374D98j46l39l10j85Q6K72L37K29j8k01l47k71q2J53L23L02J68r1k64l43k23
2395d52J5K20L49K58Q6j67l14l18j45J04K81L41J95l1k27l27k39o1J75K98K79
2416C20J06j01k59l11j70K7K33K99K19M3j70l05k89q6J10K80K92J76l9k41k93
2437a59k41rJ83L00K52Q5j09k73k79j41N3K43K54K11kj70k65k36p4J07K67K48
2459B45J36n8k29k69k09RJ82K77K37O5j33k72k61j28Q2K28K80J73j6j68k81k02
$$ plain form
2481 -312 -363 -235 17 244 360 291 83 -176 -342 -306 -133 117 315 378 232 -23 -252 -364 -272 -61 199 352
2503 352 329 133 -124 -325 -372 -214 32 256 339 245 41 -208 -350 -312 -129 108 287 323 184 -38 -255 -333
2525 -333 -247 -39 201 331 303 109 -120 -301 -319 -172 59 283 353 261 33 -206 -327 -293 -92 118 297 321
2547 321 153 -73 -262 -324 -242 -35 180 301 259 67 -138 -304 -308 -165 55 257 314 217 15 -199 -317 -271 -81
2570 -81 154 303 306 164 -74 -255 -318 -207 10 214 319 258 87 -138 -293 -284 -140 80 247 303 202 -14 -206
2593 -206 -319 -253 -80 124 274 268 124 -100 -274 -329 -205 0 212 317 250 59 -158 -303 -293 -124 95 261
2615 261 312 193 -10 -212 -298 -217 -50 173 300 273 127 -97 -253 -304 -188 10 217 300 223 38 -181 -308
2637 -308 -278 -121 99 267 292 167 -50 -259 -309 -235 -48 170 300 273 98 -104 -269 -277 -169 43 229 310 239
$$ packed form
2481c12n1J28K52K27J16o9k08k59j66L6J73K50J98O3j46k55k29j12R2K11K60J53
2503C52k3j96k57k01m7J58K46K24Q3r4k04k49j42L8J83K37J79L6j39k22k17p8
2525c33Q6K08K40J30k8j94k29j81j8J47K31K24P0r2k28k39j21L4K01K10J79K4
2547C21j68k26j89o2Q2K07K15J21m2j92k05j66mJ43K20K02N7r7k02k14j18M6J90
2570h1K35J49Lj42k38j81o3J11K17K04J05o1j71k25j55RJ44K20J67N6j01k16j92
2593b06j13O6J73K04J50oj44k24j74n5J24K05K12J05o7j91k17j45J0J69K19J66
2615B61N1j19k03k02q6Q1J67K23J27k7j46k24j56n1J16J98K07Q3p7j85k19j27
2637c08L0J57K20J68K5j25k17k09n0P4J87K18J30k7j75k02j65qJ08K12J86Q1p1
$$ plain form
2660 239 39 -155 -285 -254 -86 115 282 298 162 -41 -250 -309 -221 -28 187 292 256 85 -151 -306 -304 -172
2682 -172 60 238 294 200 8 -198 -312 -270 -92 134 285 292 146 -53 -222 -295 -203 4 207 316 261 90 -147
2705 -147 -275 -287 -133 92 260 314 198 -10 -209 -314 -254 -66 152 282 282 124 -98 -276 -322 -208 4 215
2727 215 300 247 66 -164 -299 -285 -115 99 271 318 194 -18 -222 -306 -238 -32 176 318 287 122 -109 -281
2749 -281 -300 -170 49 251 321 247 39 -181 -307 -288 -106 103 283 298 170 -60 -263 -322 -233 -30 180 312
2771 312 268 99 -145 -300 -320 -166 74 276 334 232 9 -196 -315 -259 -68 163 323 319 169 -73 -267 -332
2793 -332 -207 5 224 319 260 63 -169 -309 -300 -155 92 275 314 195 -23 -245 -342 -269 -61 176 308 291 126
2816 126 -107 -298 -336 -195 33 261 350 270 55 -185 -306 -285 -107 131 315 334 193 -48 -261 -332 -245 -26
$$ packed form
2660B39k00j94j30L1J68K01J67J6j36k03k09n9Q8J93K15J05l6j71k36j55KJ32
2682a72K32J78N6r4j92k06j14M2J78K26J51Pj46j99j69p3R2K07K03J09n5j71k37
2705a47j28j2J54K25J68N4j16k08j99j05O0J88K18J30%j58k22j78m6J14K12K11
2727B15Q5n3j81k30j35J4J70K14J72M7j24k12k04q4O8K06K08J42l1j65k31j72
2749b81j9J30K19K02P0p4k08k20j26J9J82K09J80J5j28k30k03n9Q9K03K10J32
2771C12m4j69k44j55k0J54K40K02N8j02k23k05j19N6J91K31J60mj50k42j94o5
2793c32J25K12K19R5n9j97k32j40RJ45K47J83L9j19k18k22r7P3K08K37J32j7j65
2816A26k33j91l8J41K28K28Q9q0k15k40j21K1J78K38J84J9j41k41k13p1Q7K19
$$ plain form
2838 -26 204 336 294 88 -150 -336 -344 -182 59 278 337 223 -11 -232 -344 -300 -89 161 330 322 159 -88 -299
2861 -299 -347 -230 30 252 362 293 80 -163 -328 -312 -127 112 312 356 221 -25 -251 -353 -263 -55 200 348
2883 348 308 125 -128 -336 -359 -208 33 260 356 257 18 -219 -363 -312 -120 133 330 337 195 -61 -277 -352 -239
2906 -239 -8 249 375 317 108 -143 -331 -335 -163 91 320 367 241 0 -243 -374 -302 -76 184 352 325 142
2928 142 -108 -334 -378 -242 17 257 356 286 51 -210 -360 -330 -133 135 326 366 220 -51 -273 -368 -279 -24
2950 -24 229 374 338 130 -129 -338 -355 -193 76 313 370 269 12 -253 -381 -315 -98 157 344 346 169 -103
2972 -103 -323 -385 -257 -5 249 373 301 76 -205 -372 -349 -157 117 332 375 240 -25 -280 -383 -283 -42
2993 -42 221 379 350 150 -129 -327 -365 -203 61 289 391 280 30 -238 -377 -332 -120 172 347 371 191 -90
$$ packed form
2838b6K30J32m2k06k38j86qJ62K41K19N9j14k34k21j12M4K11K50J69qj63k47k11
2861b99m8J17K60K22J10o9k13k43j65J6J85K39K00M4j35k46k26j02R0K08K55J48
2883C48m0j83k53k08k3J51K41K27R6r9k39k37j44N1J92K53J97Pj42k56k16p5J13
2906b39K31K57J26n8k09k51j88mJ72K54K29M7j26k41k43j31P2K26K60J68k7j83
2928A42k50k26m4J36K59K40R9p0k35k61j50L0J97K68J91M0j46k71k22r5Q9K55
2950b4K53J45l6k08k59k09j7J62K69K37N7j01k57k65j28O6K17K55J87Kj77k72
2972a03k20o2J28K52K54J24p2k25k81j67K3J92K74K15M3j35k65k55j03J00K41
2993d2K63J58k9k00k79j98l8J62K64K28J02j11k50k68j39M5K12K92J75K4j80k81
$$ plain form
3015 -90 -323 -404 -276 -18 247 374 321 85 -198 -374 -359 -165 109 338 395 258 -7 -273 -386 -298 -63 216
3037 216 384 354 157 -131 -335 -372 -215 53 306 409 305 29 -237 -388 -349 -135 148 346 379 201 -81
3058 -81 -316 -406 -295 -18 239 392 323 98 -188 -376 -369 -180 101 343 398 270 -5 -267 -380 -304 -70 221
3080 221 388 379 161 -111 -340 -395 -233 38 303 407 311 47 -235 -391 -356 -137 145 339 383 212 -72 -321
3102 -321 -406 -296 -34 235 385 328 113 -171 -370 -369 -189 103 331 408 277 4 -265 -393 -313 -70 201 391
3124 391 376 174 -108 -335 -387 -248 35 286 395 300 51 -219 -408 -367 -154 127 346 370 226 -66 -319 -402
3146 -402 -293 -28 232 388 329 119 -166 -371 -381 -202 83 332 406 285 10 -258 -390 -321 -90 205 384
3167 384 385 186 -111 -324 -377 -241 28 281 397 299 58 -218 -393 -373 -163 129 334 385 226 -56 -304 -404
$$ packed form
3015i0k33q1J28K58K65J27n3k36k83j76J5J94K74K29N7j37k65k66j13Q8K35K79
3037B16J68l0j97k88k04l7J57K68K53J03j04k76k66j51L9K14K83J98L3j78k82
3058h1k35r0J11K77K57J53o9k25k86j88PJ89K81K42N5j28k75k62j13P6K34K91
3080B21J67rk18k72k29n5J62K71K65J04r6k64k82j56L5K19K82J94M4j71k84k49
3102c21q5J10K62K69J50n7k15k84j99JJ80K92K28P7j31k73k69j28Q0K43K71J90
3124C91j5k02k82k27n2J39K83K51J09r5k49k70j89M1K13K81K19K4j44k92k53q3
3146d02J09K65K60J56n9k10k85k05j0J79K85K49P4j21k75k68j32O9K31K95J79
3167C84Jj99k97k13n3J36K69K53J16r8k41k76j75K0K10K92K05N1j59k82k48j00
$$ plain form
3189 -404 -294 -38 236 387 337 116 -165 -366 -372 -195 87 330 407 279 18 -259 -383 -316 -88 193 380 371
3211 371 185 -98 -324 -386 -244 21 277 398 301 67 -227 -398 -371 -159 124 345 379 217 -60 -309 -399 -304
3233 -304 -34 233 390 345 125 -151 -349 -359 -193 92 328 394 275 14 -240 -384 -311 -94 182 360 360 175
3255 175 -95 -333 -386 -240 24 271 379 298 55 -212 -381 -354 -153 112 329 371 212 -52 -295 -387 -279 -33
3277 -33 227 370 324 120 -146 -337 -343 -173 80 320 401 282 20 -229 -370 -314 -75 186 362 357 172 -105 -308
3300 -308 -373 -246 14 264 366 289 53 -195 -371 -342 -152 111 318 354 213 -52 -276 -377 -268 -47 223
3321 223 368 322 121 -139 -325 -349 -185 87 311 385 270 29 -228 -354 -297 -94 179 339 347 158 -94 -324
3343 -324 -372 -227 15 236 345 273 56 -199 -370 -342 -149 109 299 348 205 -32 -268 -364 -267 -29 211 358
$$ packed form
3189d04J10K56K74J51n0k21k81k01oJ77K82K43P7j28k61k77j24O7K28K81J87r
3211C71j86k83k26o2J42K65K56J21r7k34k94j71K7K12K83K21L4j62k77k49r0R5
3233c04K70K67J57m5k20k76j98j0J66K85K36O6j19k61k54j44P3K17K76J78%j85
3255A75k70k38n3J46K64K47J08q1k43k67j69K7K01K65K17M2j59k64k43r2J08K46
3277c3K60J43m6k04k66j91oJ70K53K40Q1j19k62k49j41N6K39K61J76nj85k77k03
3300c08o5J27K60K50J02p7k36k48j76K9J90K63K07L6j41k65k24j01J09K21K70
3321B23J45m6k01k60j86k4J64K72K24P4j15k41k57j26N7K03K73J60Qj89k52k30
3343c24m8J45K42K21J09p2k17k55j71K8J93K58J90M9j43k37k36r6R7K38K40J47
$$ plain form
3365 358 323 119 -144 -327 -339 -179 87 287 371 252 10 -219 -342 -291 -81 164 325 321 149 -85 -299 -353
3387 -353 -228 3 247 334 267 52 -193 -359 -330 -155 106 293 334 195 -54 -261 -334 -262 -24 211 337 306
3409 306 117 -131 -301 -322 -172 72 280 347 246 28 -215 -322 -281 -77 166 318 311 146 -92 -288 -332 -218
3431 -218 5 225 336 251 56 -175 -339 -322 -138 106 285 327 188 -34 -247 -325 -258 -31 203 311 290 102
3453 102 -120 -285 -309 -163 69 266 343 240 13 -202 -316 -265 -83 152 291 290 148 -82 -268 -317 -212 19
3475 19 212 305 244 62 -165 -306 -287 -132 100 270 317 174 -34 -223 -304 -216 -23 185 314 277 122 -101 -266
3498 -266 -285 -145 84 257 328 222 16 -198 -305 -252 -70 138 275 288 132 -87 -257 -313 -200 4 207 290
3520 290 231 47 -154 -294 -266 -110 88 269 288 182 -19 -214 -281 -207 -25 195 292 280 106 -110 -261 -261 -140
$$ packed form
3365C58l5k04k63j83j2J60K66K00Q4j19k42k29j23N1K10K45J61mj72k34k14n4
3387c53J25K31K44Q7o7k15k45j66K9J75K61J87M1j39k49k07p3P2K38K35J26l1
3409C06j89k48j70k1J50K44K08O7j01k18k43j07M1K04K43J52pj65k38j96m4J14
3431b18K23K20J11q5j95k31j64J7J84K44J79M2j39k22k13p8O7K27K34J08k1j88
3453A02k22j65k4J46K32J97P7j03k27k15j14N1J82K35J39jj42k30j86m9J05K31
3475A9J93R3o1j82k27j41J9J55K32J70M7j43k08j89q1Q8J93K08J29l7j55k23j65
3498b66j9J40K29J73P1j06k06k14j07N3J82K08J37J3j56k19j70n6J13K04K03Q3
3520B90n9j84k01j40K8J56J98J81J9j06k01j95o7P4J82K20R7j2j74k16j51%J21
$$ plain form
3543 -140 74 239 297 204 14 -173 -285 -234 -73 126 257 253 127 -75 -244 -284 -184 5 182 274 207 40 -148
3566 -148 -276 -257 -114 85 241 274 161 -15 -196 -276 -207 -20 172 280 251 96 -100 -233 -253 -135 48 210
3588 210 263 188 15 -163 -263 -222 -67 113 247 235 106 -66 -230 -266 -176 -3 175 253 211 48 -147 -256 -237
3611 -237 -108 73 228 260 152 -16 -182 -244 -173 -15 151 261 238 103 -80 -209 -229 -124 57 212 242 180
3633 180 12 -151 -249 -203 -72 113 214 217 109 -69 -211 -261 -173 -2 156 243 182 44 -125 -229 -212 -98 70
3656 70 188 234 145 -17 -165 -218 -159 -25 143 237 209 94 -71 -203 -214 -113 40 183 224 160 11 -135 -227 -192
3680 -192 -72 85 199 201 91 -68 -193 -232 -148 -9 149 218 170 44 -107 -204 -191 -96 57 187 217 148 9 -146
3704 -146 -212 -144 -9 126 216 187 83 -68 -187 -202 -114 34 160 216 155 19 -128 -207 -179 -66 64 170 171 86
$$ packed form
3543a40K14J65N8r3j90j87j12N1J61J99J31mj26k02j69m0J00J89J77R2o7j67j88
3566a48j28J9J43J99J56L3j13j76j81q0O9J87J92J08k9j55j96j33k0J18J83J62
3588B10N3p5j73j78j00M1J55J80J34j2j29j72j64l6R0J73J78P8m2j63j95j09J9
3611b37J29J81J55L2j08j68j66o2P1J58J66J10k3j35j83j29k0J05J81J55L0o2
3633A80j68j63r8M6J31J85J01Lj08j78j42n0Q8J71J58Q7o1j38j69j04J7J14J68
3656G0J18M6q9j62j48n3N9J34J68R4k8j15j65j32j1J01J53J43M1o4j49j46r2L5
3680a92J20J57J14Kj10j59j25l9Q4J39J58O9m8j26j51r7J3R5J53J30L0o9j39j55
3704a46o6O8J35J35R0k9j04j51j19j5Q8J48J26N6o1j36j47p9K8J13J30J06Jq5
$$ plain form
3728 86 -47 -165 -209 -153 -7 116 192 151 54 -93 -178 -172 -80 50 174 202 130 0 -124 -177 -143 -26 109 195 177
3753 177 74 -56 -156 -191 -104 12 126 179 135 24 -109 -183 -164 -72 59 158 154 94 -34 -150 -183 -139 -11 96
3777 96 167 152 42 -69 -167 -163 -78 47 142 162 113 4 -108 -159 -127 -23 92 168 161 70 -36 -135 -163 -105 9 108 161
3804 161 114 18 -90 -155 -144 -74 52 138 151 77 -22 -125 -161 -115 -18 98 161 137 48 -68 -135 -145 -71 22 123 161 112
3831 112 18 -90 -134 -120 -35 77 149 145 70 -23 -117 -149 -96 -11 99 137 111 22 -79 -150 -141 -74 29 114 131 71 -15 -111
3859 -111 -144 -115 -29 76 133 125 64 -45 -116 -115 -67 25 113 151 104 29 -70 -126 -92 -35 66 125 130 75 -5 -99 -130 -96 8
3888 8 79 122 97 29 -66 -128 -122 -73 21 96 108 74 -8 -83 -126 -123 -36 59 109 119 64 -20 -91 -116 -61 23 101 132 116 44 -51 -104
3920 -104 -96 -30 44 106 123 59 -16 -90 -115 -89 -17 54 99 90 41 -38 -99 -112 -70 6 83 104 77 4 -83 -119 -98 -32 46 96 112
$$ packed form
3728H6j33j18m4N6J46J23P6m1r7j47q5OR2J30J24K8p2j30j24n3L4J17J35Q6j8
3753A77j03j30j00l5Q7J16J14N3m4j11j33p4J9R2J31R9mo0j28j16l3M4J28J07
3777I6P1j5j10j11r8MQ5J25R5K0m9j09j12n1L2J04J15P6pr1j06r9k8N8J14R9N3
3804A61m7r6j08o5J1P0J26Q6J3p4r9j03l6M6R7J16O3k4q9j16o7j0P4R3J01L8m9
3831A12r4j08m4J4Q5J12P2mp5r3r4l2N3Q5J10L8k6q9j01p1RO7J03Q5J7o0q6r6
3859a11l3K9Q6J05N7qo1j09p1JM8R2Q8L8m7p5r9n6L4N7J01N9Nn5q0r4l1L4J04
3888HP1M3k5o8r5o2OM9R4P5J2l4q2p5m3LQ7R5N0J0n5q4p1k5N5Q4P8L1j6p2r5n3
3920a04QO6P4O2J7o4p5p4k5K6P2P1M5rm9p9o1j3M2P6P7K1k7p3q7l6K1O6P8N0J6
$$ plain form
3951 112 59 -7 -82 -100 -66 12 79 106 92 42 -31 -88 -84 -42 27 96 95 69 10 -79 -107 -88 -34 38 87 79 41 -29 -81 -105 -62
3982 -62 8 59 97 71 31 -48 -93 -80 -31 32 86 101 68 4 -52 -79 -65 -2 68 104 85 45 -20 -67 -77 -45 16 67 99 75
4012 75 9 -61 -95 -91 -34 23 71 74 46 -14 -81 -104 -77 -18 48 86 77 27 -37 -76 -81 -45 11 80 95 70 20 -44 -77 -61 -14 39
4044 39 84 81 51 -13 -63 -66 -46 4 55 86 72 13 -48 -82 -82 -50 1 51 75 35 -23 -61 -91 -70 -20 24 71 69 38 -27 -63 -84
4076 -84 -49 6 62 93 78 19 -32 -58 -74 -29 35 67 80 47 -5 -56 -77 -58 -9 41 69 76 34 -30 -78 -87 -65 11 42 77 55
4107 55 -4 -52 -77 -70 -33 24 63 66 36 -4 -50 -72 -61 7 49 73 76 37 -21 -51 -59 -22 19 70 82 52 5 -45 -72 -69 -30 32 56
4140 56 64 34 -24 -65 -80 -71 -24 32 62 48 18 -36 -65 -71 -45 12 59 84 48 7 -38 -64 -52 -3 36 84 83 50 -3 -52 -57 -41 9
4173 9 48 79 61 15 -28 -70 -72 -28 22 58 64 33 -18 -58 -89 -61 -27 28 61 48 20 -32 -72 -75 -48 -1 58 84 60 29 -37 -55
$$ packed form
3951A12n3o6p5j8L4P8O7K7j4n0p3n7MM2O9O9jk6n9q9k8J9N4P2M9ql8p0n2k4M3
3982f2P0N1L8k6m0p9m5J3M9O3N4J5l3o4n6k7J4O3P0L6j9m0o5m7j0L2O1N1L2k4
4012G5o6p0l4MN7N7M8Lk8o0o7k3K7N9O6L8rn0o4l9nL6N6O9J5k5n0o4l3J6M7N3
4044C9M5ll0o4n0lK0N0N1L1j4n9o1l4%L2N1N0K4m0n8l8l0K1N0M4M7kl1o5l6k1
4076h4L5N5N6L1j5n9n1k6j6M5O4L2J3l3n2n1k1J9M9N0K8Pm2o4m8rK2P6L1L5k2
4107E5n9m8k5PL7N7L9Ll0m0m6k2J1O8M2K4Ll9n8l0qL7M1N1J2l0m7n0k7LL9O2K4
4140E6Ql0n8m1j5RM7N6L0j4l0n4k9oK6N7M7K5l6m1m5k6J2M9L9M8jl3n3m9nJ6N0
4173IL9L1j8m6m3m2kM4N0L6Ol1n1m0l1K8L4N5L3j3k8n2m0lK7M7N9K6k4l1o6j8
$$ plain form
4205 -55 -71 -17 39 74 77 51 -4 -35 -68 -48 9 34 64 59 18 -24 -70 -81 -40 19 50 68 42 4 -46 -89 -83 -36 20 57 59 22
4237 22 -20 -53 -71 -41 -3 41 75 70 36 -20 -56 -52 -15 21 70 83 66 13 -34 -57 -39 -4 31 66 53 28 -16 -66 -87 -45 -9
4268 -9 36 84 51 -10 -35 -70 -65 -32 11 57 66 40 -10 -52 -75 -42 -3 47 76 64 35 -16 -48 -58 -27 21 64 76 71 20 -37 -62
4300 -62 -49 -9 30 66 65 30 -10 -48 -80 -62 -11 37 61 48 21 -46 -76 -65 -38 15 51 71 52 1 -39 -66 -45 5 38 69 77
4331 77 28 -3 -57 -58 -26 11 60 75 54 31 -23 -50 -49 -24 29 65 59 38 -4 -58 -63 -59 -1 35 58 52 21 -25 -64 -69 -37 14 58 61
4365 61 42 7 -49 -55 -41 -1 42 81 80 52 -8 -45 -56 -30 12 48 73 53 17 -28 -55 -56 -19 23 51 64 30 -17 -48 -73 -55 -16
4397 -16 26 43 51 10 -41 -59 -74 -40 1 45 60 41 7 -32 -50 -43 -8 36 73 75 44 -2 -44 -51 -44 12 50 75 59 17 -19 -51 -52
4430 -52 -40 11 44 62 21 -8 -56 -76 -62 -26 19 46 52 10 -25 -57 -68 -33 2 34 57 46 9 -26 -53 -49 -14 33 59 67 47 5
$$ packed form
4205e5j6N4N6L5Lk6n5l1l3K0N7K5L0nm1m2m6j1M1N9L1J8k6l8n0m3OM7N6L7Kl7
4237B2m2l3j8L0L8M4L4nl4n6l6ML7L6M9J3j7n3m7k3J8L5L5L5j3k5m4n0k1M2L6
4268iM5M8l3o1k5l5NL3M3M6Rk6n0m2k3L3L9N0K9j2k9n1l2j0L1M8M3J2nn1n7k5
4300f2J3M0L9L6jl5m0l8l2J8N1M8K4j3k7o7l0J1K7N3L6K0j9n1m0k7K1N0L3L1Q
4331G7m9l1n4jL2L7M9J5k1k3n4k7JK5N3L6ok1m2n4nMN8L6K3ol1m6l9nL2N1M4L
4365F1j9l5n6oJ4M0M3L9jk8o0l7j1K6M2L6K5k0l6m5k7jL7M2K8J3l4m7l1k5J8L9
4397a6M2J7Qm1n1j8j5L4M1M4J5j9l4l9j8PL5M4L7Kl1m6m2pPN6L8K5j6m2l6l2j
4430e2J2N1L3J8m1k9m8k0J4L6M5K7Om2l5l2j1L5L5L2K3j1l7l5k7ML5M7K6Qk0m2
$$ plain form
4462 5 -39 -54 -42 16 53 69 60 35 -21 -53 -52 -24 14 55 63 39 -7 -50 -72 -59 -18 17 48 56 25 -13 -55 -58 -37 7 46 61 51
4495 51 19 -24 -52 -35 -12 35 67 58 31 -3 -35 -42 -49 -4 41 56 60 23 -27 -53 -56 -13 5 46 50 35 -7 -50 -76 -73 -23 9 46 46
4529 46 22 -14 -50 -50 -31 1 41 64 54 14 -28 -45 -37 -11 33 62 66 47 0 -42 -48 -39 4 23 52 43 21 -22 -51 -53 -33 9 46 51
4563 51 26 -7 -45 -49 -52 -19 18 40 57 20 -7 -37 -51 -33 -3 39 50 44 28 -11 -45 -30 -3 21 45 59 41 -2 -32 -36 -31 7 26
4596 26 45 46 7 -14 -45 -50 -28 4 40 39 29 -14 -45 -59 -52 -22 4 44 42 27 -8 -34 -41 -28 -9 28 55 42 18 -23 -38 -33 -19 35
4630 35 66 64 40 19 -15 -36 -30 1 17 42 39 20 -14 -46 -53 -25 -9 24 34 11 -4 -36 -51 -45 -15 5 38 40 24 5 -40 -35 -18 4
4664 4 33 49 42 15 -3 -16 -34 -6 20 38 57 39 16 -22 -33 -22 -10 15 34 35 19 -3 -39 -33 -30 -5 14 25 36 -1 -23 -38 -44
4697 -44 -15 11 34 40 28 -2 -14 -22 -20 6 34 34 40 26 -1 -17 -22 -2 6 24 39 30 12 -18 -29 -29 -22 7 17 36 16 -10 -27 -36 -26 -4
$$ packed form
4462Em4j5J2N8L7J6rk5n6l2JK8L8M1Qk4m6m3k2J3M1L5L1Ql1l8m2lK1M4L9J5j0
4495E1l2m3k8J7K3M7L2rk7l4l2ppM5M5J5Ml7n0k6lM3J8M1Mj5m2m3k6LN0L2L7%
4529D6k4l6l6%J9L2M0K3j0m0m2j7QK6M4K9Mj9m7m2oRM3J9K9rk2m3k9kK0M2L7N
4563E1k5l3l8mlL3L7K2J7l7k7l0j4J8L0M2J1oj6l9l4J5K7K4K4J4j8m3l0mNL8J9
4596B6J9Jl9k1l1nK2L2L6jj0m3l1j4PL0K6M0kj5l5k6pJ3J9L7K7j3k4m1j5NJ4N4
4630C5L1kk4k1l4k1OL1J6K5lj9l4l2pK8J6L3J0k3j5l2j5OL0K0L3Kj6j9m5NJ7K2
4664DK9J6pk7j8j3j8K8K6J8J9j8k3l8j1J1J2K5J9Jj6k2l6OLK5J9J1J1l7k2j5o
4697d4K9K6K3Oj2l0j2qKK6K8%Oj4k7j6nK0QJ8J5rj8l0j1%PK9J0J9k0k6j7rJ0K2
$$ plain form
4733 -4 17 18 18 7 -24 -48 -38 -22 7 19 38 25 12 -15 -21 -11 7 25 33 39 28 3 -13 -16 -10 7 39 42 25 11 -19 -25 -29 -22 -2 17
4769 17 19 5 -7 -31 -32 -20 -10 11 20 9 4 -25 -30 -28 -14 -4 29 33 26 9 -11 -14 -7 5 18 30 44 14 5 -9 -17 -11 8 36 42 22 11
4806 11 -4 -20 -16 -16 -2 18 6 18 7 -18 -36 -17 -8 3 16 20 13 -6 -30 -17 -11 4 16 27 27 6 2 -18 -5 5 11 24 38 29 4
4841 4 -13 -18 -13 8 9 21 22 16 6 -6 -15 -10 -1 15 10 16 8 -9 -29 -14 -11 3 17 22 19 -8 -15 -27 -6 -4 12 30 31 18 12 -9 -10 1 19 24 25
4882 25 16 11 -5 -12 -12 -7 14 10 20 7 3 -20 -17 -14 -9 4 5 4 6 -8 -22 -24 -15 5 -1 12 11 1 -13 -9 -4 5 21 22 25 28 2 -2 -5 0 5 20 35 21
4926 21 18 -3 -13 -11 -9 2 13 19 16 -1 -20 -24 -21 -17 -7 5 9 8 1 -23 -25 -10 -8 3 16 26 14 3 -8 -12 -17 10 16 27 28 18 5 -6 1
4965 1 2 23 24 19 20 -3 -1 -11 -17 -7 16 14 3 2 -4 -25 -31 -23 -10 8 13 9 -6 -13 -28 -16 -14 10 21 30 16 2 -4 -18 -5 5 18 23 29 11
5005 11 1 5 1 6 1 1 31 20 3 -15 -12 -25 -8 1 10 16 8 -3 -9 -20 -11 -12 -3 0 12 -7 -8 -20 -18 -20 -2 22 27 23 19 5 -17 -4 -4 15 18 32
$$ packed form
4733dK1J%j1l1k4J0J6K9J2J9j3j3k7oJ0J8J8QOj1k5j6lOJ7L2Lj7j4l0omPK0J9
4769A7Kj4j2k4jJ2J0K1Rj1nk9nKJ4J0L3Mpj7k0lPJ2J3J2J4l0rj4qOJ9K8Ok0j1
4806A1j5j6M%J4K0j2J2j1k5j8J9RJ1J3Mpj9k4J3OJ5J2J1%k1mk0J3J0OJ3J4rk5
4841Dj7nNK1JJ2Joj0j2rNRJ6nOqj7k0J5LJ4J4Nlk7pj2K1KJ6J8Jj3ok1jJ1J8NJ
4882B5rnj6p%NK1mJ0j3mk3LLNJ3JjKj4j4kRK0oJ3jj0j4MNRJ6JLLk6mlNNJ5J5j4
4926B1lk1j0KKJ1J1Olj7j9mLMJ0J2Mjpk4kJ5KJ1J3J0j2j1j1mnK7OJ1Jj0j3j1P
4965AJK1JnJk3Kj0oJ0K3kj1jok1oQJ3J8Nmj5pj5J2KK4J1Rj4j4oj4J3J0J3NOj8
5005A1j0MmNn%L0j1j7j8Lj3J7RROqj1oj1RjRLJ2j9jj2KkJ8K4Nmmj4k2J3%J9LJ4
$$ plain form
5047 32 26 13 3 -5 1 13 16 22 18 12 -4 -11 -20 -19 6 7 18 2 -2 -20 -26 -20 -10 6 7 9 11 -2 -7 -17 -13 6 18 19 15 14 -1 -7 -23 1 13 29
5089 29 37 36 16 -3 -8 -8 11 10 27 19 8 -10 -24 -27 -25 -17 3 18 11 3 -3 -17 -22 -6 -19 15 14 6 -7 -19 -19 -13 -3 15 19 19 13 4 -10 -8 -8 -12
5131 -12 17 23 25 6 -2 -22 -16 -3 12 20 25 3 1 -31 -28 -30 -17 -1 3 3 1 -12 -25 -36 -24 -16 3 17 10 -5 -15 -15 -16 -2 4 21 43 16 11
5170 11 -7 -10 -10 1 18 32 23 6 -11 -14 -16 -11 6 17 18 12 -1 -11 -29 -26 -10 8 14 22 1 -14 -30 -24 -26 -10 9 25 11 5 -1 -21 -21 -8
5208 -8 13 31 41 24 12 -3 -10 -10 4 13 28 23 26 -2 -10 -28 -12 -5 7 19 3 -2 -14 -40 -34 -21 0 10 16 3 -14 -24 -17 -14 -15 12 8 18
5246 18 9 -15 -14 -8 -5 17 25 28 28 13 -11 -9 -11 1 19 13 27 17 -3 -15 -19 -30 -17 7 18 21 1 -22 -29 -35 -20 -4 2 21 9 -9 -20 -12
5284 -12 -21 -2 1 15 30 1 -2 -11 -14 -7 9 24 31 20 13 -4 -11 -13 -16 8 20 19 18 5 -16 -28 -20 -7 1 7 7 9 -18 -20 -40 -26 -12 0 14 13
5324 13 -8 -17 -27 -24 -10 7 18 21 17 6 -10 -10 -11 -1 26 36 32 12 4 -11 -18 -17 2 1 19 12 0 -5 -18 -16 -7 3 17 14 5 -11 -27 -34 -26 -19
$$ packed form
5047C2oj3j0qOJ2LOmoj6prJK5JJ1j6mj8oOJ0J6JKKj3nj0MJ9J2Jmjj5oj6K4J2J6
5089B9Qjk0j9n%J9jJ7qj1j8j4lKQK0J5pqoj4nJ6j3L4jqj3j2%OJ0J8M%orj4K%m
5131a2K9OKj9qk0OJ3J5QNk2kl2LkJ3J6M%kj3j3j1J2QJ9J4pj5j0%jJ4OJ7K2k7n
5170A1j8l%J1J7J4rj7j7lkNJ7J1Joj3j0j8LJ6J8OQk1j5j6OkJ6J9J6j4ook0%J3
5208hK1J8J0j7j2j5p%J4RJ5nLk8qj8J6PJ2J2j6nj2k6OJ3K1J0Oj3j7j0PLjK7mJ0
5246A8rk4JOLK2QL%j5k4KkJ2J8oJ4j0k0j2mj1J3K4J1Lk0k3poJ5J6OJ9j2j8j1Q
5284a2rJ9LJ4J5k9lrlPJ6J5Pj1pj7pklK4J2jjj3k1j2QJ3QO%Kk7kk0J4J4J2J4j
5324A3k1rj0LJ4J7J1Lmj1j6%jJ0K7J0mk0qj5pJJ9jJ8pj2nj3KRJ0J4lrj6j6pQP
$$ plain form
5364 -19 4 17 1 9 -2 -34 -13 -12 -2 16 21 27 9 -8 -11 -13 -4 23 38 32 27 16 -7 -15 -17 0 4 14 15 6 -13 -25 -26 -24 -7 5 11 6 -3 -28
5404 -28 -38 -25 -17 2 10 17 7 -8 -14 -27 -9 -6 10 25 18 16 2 -17 -13 -7 13 34 25 25 12 -12 -14 -16 -11 -3 11 16 14 -14 -22 -32 -20 -9 -1 14
5444 14 7 -10 -23 -27 -27 -16 -10 24 19 19 4 -14 -28 -15 -2 11 12 25 6 8 -8 -18 -6 2 26 47 28 6 -13 -14 -17 -11 5 17 15 3 -4
5481 -4 -29 -29 -31 -16 -1 6 13 -9 -14 -16 -32 -24 -1 8 11 24 14 1 -15 -14 -12 5 19 25 11 3 -5 -13 -19 2 17 24 21 11 -4 -20 -20 -17 -10 3 21
5522 21 6 -1 -25 -25 -35 -17 -8 3 16 6 -7 -26 -26 -15 -12 15 14 20 22 0 -18 -14 -6 17 21 27 28 8 -3 -9 -17 1 11 20 25 18 -2 -24 -35
5561 -35 -21 -2 3 13 10 -5 -14 -28 -43 -20 -6 9 14 23 -9 -27 -31 -27 -8 8 17 24 18 3 -17 -27 -3 4 19 28 30 19 -1 -22 -20 -4 8
5598 8 25 25 29 -1 -17 -39 -32 -11 -3 16 9 1 -19 -40 -50 -33 -15 0 25 14 0 -31 -35 -34 -20 3 35 31 26 11 -17 -21 -16 -6 10 36 28
5635 28 16 -15 -16 -30 -18 3 22 31 23 -1 -28 -35 -35 -8 -5 16 20 5 -21 -36 -36 -37 -11 10 32 31 20 -22 -32 -28 -16 16 30 48 38 15
$$ packed form
5364a9K3J3j6Qj1l2K1JJ0J8NOj8j7lkRK7J5onj1k3qkJ7MJ0Jrj9j2jKJ7J2Onrk5
5404b8j0J3QJ9QPj0j5oj3J8LJ6J5pkj4j9MOK0K1r%j3k4kkNQJ4Nkk8qj0J2J1QJ5
5444A4pj7j3m%J1OL4n%j5j8j4J3J3J3JJ3j9Kj6j0J2QK4K1j9k2j9jlOJ6J2kj2p
5481dk5%kJ5J5PPk2nkj6QK3RLJ3j0j3j6JKJ7J4Oj4qqqoK1J5Plj0j5j6%LPJ3J8
5522B1j5pk4%j0J8RJ1J3j0j3j9%J1LK7jOKk2j8MQK3MOJk0j1oqJ8J0RNpk0k2j1
5561c5J4J9NJ0lj5rj4j5K3J4J5NRl2j8mMJ9J6RPoj5k0j0K4PJ5RKj1k0k1KJ6J2
5598HJ7%Ml0j6k2PK1QJ9pqk0k1j0J7J8J5K5j1j4l1mJJ4K3L2mnj5k8mNJ0J6K6q
5635B8j2l1jj4J2K1J9Rqk4k7p%K7LK1Mj5k6j5%jK6K1K2jj1m2j0MJ2L2J4J8j0k3
$$ plain form
5671 15 -7 -19 -7 -3 24 49 43 30 -5 -25 -20 -13 -9 31 37 27 7 -20 -39 -42 -30 11 26 20 16 -20 -33 -42 -34 -15 9 35 35 16 -1 -30
5707 -30 -45 -20 15 47 47 46 20 -9 -22 -13 -1 22 55 54 27 6 -26 -30 -28 -7 22 45 35 14 -21 -52 -49 -30 10 38 48 29 -1 -27
5741 -27 -47 -38 3 19 53 44 27 -9 -36 -40 -24 14 39 57 50 19 -8 -40 -28 -3 19 60 58 36 0 -29 -46 -37 6 35 42 38 3 -16
5775 -16 -45 -46 -47 -4 34 36 23 -9 -31 -51 -46 -15 27 46 53 29 -10 -44 -41 -33 1 43 59 51 22 -15 -37 -42 -23 22 49 51 31 -7 -45
5810 -45 -59 -45 -9 35 55 56 10 -23 -41 -62 -40 1 27 43 28 -10 -42 -59 -62 -19 23 43 46 31 -2 -35 -40 -26 -6 57 70 60
5842 60 31 -20 -42 -51 -15 24 46 50 46 -8 -44 -61 -59 -17 29 47 37 14 -19 -64 -64 -36 3 33 47 29 -10 -45 -70 -52 -29 32 45
5875 45 70 34 2 -58 -49 -36 2 53 74 70 21 -8 -53 -46 -30 25 61 64 43 -5 -53 -63 -54 -22 33 58 51 9 -25 -67 -68 -49 -11 43
5909 43 47 45 10 -29 -71 -59 -16 28 54 64 30 -7 -43 -43 -31 0 46 64 70 24 -29 -50 -52 -25 15 56 71 42 1 -43 -73 -60 -29
$$ packed form
5671A5k2j2J2MK7K5oj3l5k0NPMM0Oj0k0k7j9lJ2M1J5oml6j3rQJ9K4K6%j9j7k9
5707c0j5K5L5L2%jk6k9j3RJ2K3L3jk7k1l2mKK1K9K3j0k1l5l1LJ9M0K8J0j9l0k6
5741b7k0RM1J6L4rj7l6k7mJ6L8K5J8pl1k7l2J2K5K2M1kk2l6k9j7RM3K9Pml5j9
5775a6k9jjM3L8Kj3l2k2k0NL1M2J9Pk4l9l4LQL4M2J6qk9l7k2nJ9M5K7Kk0l8l8
5810d5j4J4L6M4K0Jm6l3j8k1K2M1K6J6j5l8l2j7lM3M2K0Lj5l3l3nJ4K0O3J3j0
5842F0k9n1k2rL6L9K2Mmn4l6j7KM2M6J8j0k3l3m5%K8L9L0J4j8l9l5k5J8K3O1J3
5875D5K5l6l2o0RJ3L8N1K1mm9k9m5PJ6N5L6Lk1m8m8j0RL2N5K5pm2l4m2jJ9L8N4
5909D3Mkl5l9m2J2M3M4K6J0l4l7l6%J2L1M6J8Om6n3k1kK7M0M1J5k9m1m4l0J3L1
$$ [...]
8191A2
##END NTUPLES=NMR FID
##END=
