##TITLE=1H_DE-80H_X3
 200.13MHz, d2o
 8 sc
 
 19ns.26.2.2025
##JCAMPDX= 6.0         $$ Bruker NMR JCAMP-DX V2.0
##DATA TYPE= NMR FID
##DATA CLASS= NTUPLES
##ORIGIN= UXNMR, Bruker Analytische Messtechnik GmbH
##OWNER= pz
$$ XWIN-NMR		Version 3.5
$$ Wed Jul 22 14:14:52 2026 Russian Standard Time (UT+4h)  Yarkov@DPX200
##.OBSERVE FREQUENCY= 200.1313
##.OBSERVE NUCLEUS= ^1H
##.DELAY= (6, 6)
##.ACQUISITION MODE= SIMULTANEOUS
##.ACQUISITION SCHEME= undefined
##.AVERAGES= 8
##.DIGITISER RES= 18
##SPECTROMETER/DATA SYSTEM= spect
##.PULSE SEQUENCE= zg30
##.SOLVENT NAME= CDCl3
##.SHIFT REFERENCE= (INTERNAL, CDCl3, 0, 14.3821)
##AUDIT TRAIL= $$ (NUMBER, WHEN, WHO, WHERE, WHAT)
$$ ##TITLE= Audit trail, XWIN-NMR		Version 3.5
$$ ##JCAMPDX= 5.01
$$ ##ORIGIN= Bruker BioSpin GmbH
$$ ##OWNER= Yarkov
$$ C:/Bruker/XWIN-NMR/data/yarkov2/nmr/H-C/1/audita.txt
$$ ##AUDIT TRAIL=  $$ (NUMBER, WHEN, WHO, WHERE, WHAT)
(   1,<2026-07-22 14:13:56.89 +0400>,<Yarkov>,<DPX200>,
      <created by zg, POWCHK disabled, PULCHK disabled
       configuration hash MD5:
       00 E9 B6 7A A2 85 ED C7 34 08 36 98 17 FE 4E 26
       data hash MD5: 16K
       22 9A D7 6D 2C 47 7B B4 A7 34 83 77 3B 02 8A B9>)
$$ ##END=
$$ 
$$ hash MD5
$$ 12 F4 22 39 DF D8 0C 62 1B 74 B4 57 B6 20 1D B0
##$RELAX= 
##$RELAX= 
##$RELAX= 
##$RELAX= 
##$RELAX= 
##$RELAX= 
$$ Bruker specific parameters
$$ --------------------------
##$DU= <C:/Bruker/XWIN-NMR>
##$EXPNO= 1
##$NAME= <H-C>
##$PROCNO= 1
##$TYPE= <nmr>
##$USER= <yarkov2>
##$AMP= (0..31)
100 100 100 100 100 100 100 100 100 100 100 100 100 100 100 100 100 100 
100 100 100 100 100 100 100 100 100 100 100 100 100 100 
##$AQSEQ= 0
##$AQ_mod= 1
##$AUNM= <au_zg>
##$AUTOPOS= <>
##$BF1= 200.13
##$BF2= 200.13
##$BF3= 200.13
##$BF4= 200.13
##$BF5= 200.13
##$BF6= 200.13
##$BF7= 200.13
##$BF8= 200.13
##$BYTORDA= 1
##$CFDGTYP= 0
##$CFRGTYP= 5
##$CHEMSTR= <none>
##$CNST= (0..31)
1 1 145 1 1 1 1 1 1 1 1 1 1 1 1 1 1 1 1 1 1 1 1 1 1 1 1 1 1 1 1 1 
##$CPDPRG= <>
##$CPDPRG1= <>
##$CPDPRG2= <>
##$CPDPRG3= <>
##$CPDPRG4= <mlev>
##$CPDPRG5= <mlev>
##$CPDPRG6= <mlev>
##$CPDPRG7= <mlev>
##$CPDPRG8= <mlev>
##$CPDPRGB= <>
##$CPDPRGT= <>
##$D= (0..31)
0 0.7 0 0 0 0 0 0 0 0 0 0.03 0 0 0 0 0 0 0 0 0 0 0 0 0 0 0 0 0 0 0 0 
##$DATE= 1784715236
##$DBL= (0..7)
120 120 120 120 120 120 120 120 
##$DBP= (0..7)
150 150 150 150 150 150 150 150 
##$DBP07= 0
##$DBPNAM0= <>
##$DBPNAM1= <>
##$DBPNAM2= <>
##$DBPNAM3= <>
##$DBPNAM4= <>
##$DBPNAM5= <>
##$DBPNAM6= <>
##$DBPNAM7= <>
##$DBPOAL= (0..7)
0.5 0.5 0.5 0.5 0.5 0.5 0.5 0.5 
##$DBPOFFS= (0..7)
0 0 0 0 0 0 0 0 
##$DE= 6
##$DECBNUC= <off>
##$DECIM= 32
##$DECNUC= <off>
##$DECSTAT= 4
##$DIGMOD= 1
##$DIGTYP= 9
##$DL= (0..7)
0 120 120 120 120 120 120 120 
##$DP= (0..7)
150 150 150 150 150 150 150 150 
##$DP07= 0
##$DPNAME0= <>
##$DPNAME1= <>
##$DPNAME2= <>
##$DPNAME3= <>
##$DPNAME4= <>
##$DPNAME5= <>
##$DPNAME6= <>
##$DPNAME7= <>
##$DPOAL= (0..7)
0.5 0.5 0.5 0.5 0.5 0.5 0.5 0.5 
##$DPOFFS= (0..7)
0 0 0 0 0 0 0 0 
##$DQDMODE= 0
##$DR= 18
##$DS= 0
$$ [...]
##$SUBNAM2= <"">
##$SUBNAM3= <"">
##$SUBNAM4= <"">
##$SUBNAM5= <"">
##$SUBNAM6= <"">
##$SUBNAM7= <"">
##$SUBNAM8= <"">
##$SUBNAM9= <"">
##$SW= 18.0517328524113
##$SWIBOX= (0..15)
0 0 2 0 0 0 0 0 0 0 0 0 0 0 0 0 
##$SW_h= 3612.71676300578
##$TD= 16384
##$TD0= 1
##$TE= 0
##$TE2= 300
##$TE3= 300
##$TEG= 300
##$TL= (0..7)
0 120 120 120 120 120 120 120 
##$TP= (0..7)
150 150 150 150 150 150 150 150 
##$TP07= 0
##$TPNAME0= <>
##$TPNAME1= <>
##$TPNAME2= <>
##$TPNAME3= <>
##$TPNAME4= <>
##$TPNAME5= <>
##$TPNAME6= <>
##$TPNAME7= <>
##$TPOAL= (0..7)
0.5 0.5 0.5 0.5 0.5 0.5 0.5 0.5 
##$TPOFFS= (0..7)
0 0 0 0 0 0 0 0 
##$TUNHIN= 0
##$TUNHOUT= 0
##$TUNXOUT= 0
##$USERA1= <user>
##$USERA2= <user>
##$USERA3= <user>
##$USERA4= <user>
##$USERA5= <user>
##$V9= 5
##$VALIST= <valist>
##$VCLIST= <CCCCCCCCCCCCCCC>
##$VD= 0
##$VDLIST= <DDDDDDDDDDDDDDD>
##$VPLIST= <PPPPPPPPPPPPPPP>
##$VTLIST= <TTTTTTTTTTTTTTT>
##$WBST= 1024
##$WBSW= 4
##$XGAIN= (0..3)
0 0 0 0 
##$XL= 0
##$YL= 0
##$YMAX_a= 3985
##$YMIN_a= -5683
##$ZGOPTNS= <>
##$ZL1= 120
##$ZL2= 120
##$ZL3= 120
##$ZL4= 120
##$ABSF1= 10
##$ABSF2= 0
##$ABSG= 5
##$ABSL= 3
##$ALPHA= 0
##$AQORDER= 0
##$ASSFAC= 0
##$ASSFACI= 0
##$ASSFACX= 0
##$ASSWID= 0
##$AUNMP= <proc_1d>
##$AZFE= 0.1
##$AZFW= 0.1
##$BCFW= 1
##$BC_mod= 2
##$BYTORDP= 1
##$COROFFS= 0
##$CY= 83.5205535888672
##$DATMOD= 1
##$DC= 2
##$DFILT= <>
##$DTYPP= 0
##$F1P= 10.8118882576601
##$F2P= -7.23987719738617
##$FCOR= 0.5
##$FTSIZE= 0
##$FT_mod= 4
##$GAMMA= 1
##$GB= 0.15
##$INTBC= 1
##$INTSCL= 1
##$ISEN= 128
##$LB= 0.25
##$LEV0= 0
##$LPBIN= 0
##$MAXI= 10000
##$MC2= 0
##$MEAN= 0
##$ME_mod= 0
##$MI= 1.114404
##$NCOEF= 0
##$NC_proc= 0
##$NLEV= 6
##$NOISF1= 3.799351
##$NOISF2= 2.8
##$NSP= 1
##$NTH_PI= 0
##$NZP= 0
##$OFFSET= 14.38212
##$PC= 1
##$PHC0= -7264.547
##$PHC1= 21.42198
##$PH_mod= 1
##$PKNL= yes
##$PPARMOD= 0
##$PSCAL= 0
##$PSIGN= 0
##$REVERSE= no
##$SF= 200.129724274929
##$SI= 16384
##$SIGF1= 3
##$SIGF2= 2
##$SINO= 400
##$SIOLD= 16384
##$SREGLST= <1H.CDCl3>
##$SSB= 0
##$STSI= 0
##$STSR= 0
##$SW_p= 3205.1282051282
##$SYMM= 0
##$S_DEV= 0
##$TDeff= 0
##$TDoff= 0
##$TI= <>
##$TILT= no
##$TM1= 0
##$TM2= 0
##$TOPLEV= 0
##$USERP1= <user>
##$USERP2= <user>
##$USERP3= <user>
##$USERP4= <user>
##$USERP5= <user>
##$WDW= 1
##$XDIM= 8192
##$YMAX_p= 0
##$YMIN_p= 0
$$ End of Bruker specific parameters
$$ ---------------------------------
##NTUPLES= NMR FID
##VAR_NAME=  TIME,          FID/REAL,        FID/IMAG
##SYMBOL=    X,             R,               I
##VAR_TYPE=  INDEPENDENT,   DEPENDENT,       DEPENDENT
##VAR_FORM=  AFFN,          ASDF,            ASDF
##VAR_DIM=   8192,          8192,            8192
##UNITS=     SECONDS,       ARBITRARY UNITS, ARBITRARY UNITS
##FACTOR=    0.0002768,     1,               1
##FIRST=     0,             0,               0
##LAST=      2.2672688,     0,               0
##MIN=       0,             -5683,           0
##MAX=       2.2672688,     3985,            0
$$ Real data points
##PAGE= N=1
##DATA TABLE= (X++(R..R)), XYDATA
$$ [...]
943B79J23L5k10O32l31p69J046o43o23O62q29n15N94m23O90K2o23J053j93m81
963e04Q05P5k28M91l09K64K35j095Q41N5j204N68J17q93M35j27o0L94p05M49P46
984C50r02N71P22p78N06J32k87M20n37p6P14j120MO93r36L1K31l53K80k39n1R13
1006B88o30M8Q68m16NO06l86K26j34l69O59p55n12R75p80m49N96l76k3L09m35
1027f85P43j59n28J078J0o00Q17j32m06M26m68L51jr70P52Rj186P19m1m61L87
1048c45k09K36M81p91Q02N31j071P56L10l95K22j48k65M76q11J3N74j069K60M83
1068D0p26J49K79j45M27m04J87Q68p42O4R74p41P0L35m22J98l84l42O48p52l60
1089g79R96p49k49N46k13J40K65k62O22m7m45R49k55n04O95l17j25n2m38M57j75
$$ plain form
943 279 402 437 227 859 528 -241 805 162 -461 201 -628 -1143 -549 -972 -282 -260 -883 170 -23 -504
963 -504 301 376 148 639 330 594 829 -266 575 630 -574 -6 111 -782 -347 -474 -534 -140 -845 -396 350
984 350 -552 19 741 -37 469 601 314 734 197 121 835 -285 -281 412 -524 -493 -262 -615 -335 -574 -625 288
1006 288 -342 -294 574 158 163 769 383 609 475 106 765 10 -502 473 -307 -756 -160 -536 -559 -250 -685
1027 -685 58 -101 -629 449 459 -141 676 544 138 564 96 447 446 -524 228 237 -949 -230 -271 -732 -345
1048 -345 -554 -318 163 -628 174 705 -366 390 700 305 527 379 114 590 -221 -208 366 -703 -443 40
1068 40 -686 -537 -258 -403 24 -380 -193 675 -67 -3 971 230 300 635 213 411 27 -315 333 -419 -779
1089 -779 217 -532 -781 -235 -448 -308 -43 -305 317 270 -175 774 519 15 710 393 268 216 -222 235 60
1110F0r16P43K3q06P67j30j78L94k16L50K32n33O88L30p22M84J00o57L12l49p1
1131i5K83q36K90M59r31L25M42n31M57N5o7P50o15J71O98q30J97M99n19r5K03
1152C10m95K77l85j83O12p12j07O54l30q9M98j89L54p8j14P02l26l71P85m51l86
1173b4L10k47m9jn88M92k09n68P94j52m52P70j64J66J82k65N12R2o96N36J93p44
1195a12K91O1l93K25n59K87J78p61N88L15p69M25L37k14K24l0Q0M77o26K50M31
1216G05p56J10L99o54R2l2j45K74n84P9N99n02k6P21m51L5M79q3J49q2k40N87
1238F74n13l20O63n79m1J87l75N7m3k19N01k98l30P60j63j96N73j32J86K0l22
1259I0M00j63n12N00j6o47M77k64k36Q2k49L65O7n40O98J38n82N92j4m1K55k50
$$ plain form
1110 60 -856 -113 -90 -896 -129 -259 -437 -43 -259 91 323 -210 478 808 86 570 670 13 325 -24 -95
1131 -95 188 -648 -358 101 -830 -505 -63 -594 -137 -82 -149 601 -14 157 855 25 222 721 202 107 310
1152 310 -185 92 -293 -476 136 -576 -683 -29 -359 -448 50 -139 215 137 23 725 399 28 813 362 -24
1173 -24 286 39 -10 -11 -599 -107 -316 -884 -90 -242 -694 76 -88 78 260 -5 507 599 -97 439 632 -112
1195 -112 179 240 -153 72 -487 -200 -22 -783 -195 120 -649 -224 113 -101 123 93 173 650 24 274 705
1216 705 -51 59 458 -196 -104 -136 -281 -7 -591 -512 87 -415 -441 280 -171 -136 343 260 409 327 87 674
1238 674 161 -159 504 -75 -116 71 -304 -247 -290 -509 -8 -306 -636 124 -39 -235 338 206 392 412 90
1259 90 490 327 -185 315 299 -348 129 -135 -371 -289 -538 -173 -106 -646 52 190 -392 200 186 145 400 150
1281A50Q1L75p55K99M43q78O1L01m14J91j82r0M44m94J74M70k97L6N32l72P4J92
1303C41j79L53k82k48O11o84k63N78m87j80K73k55J62k8j67O56k87k85P59k67
1323A21n5M24k32J38P6n29L41K3o64M04j17m29K09J4n9J74k85L83J76m18M40K33
1345C68m56M06J48k14N9k03J48Q9o25J98K73o70J48J48k55K43rm2M37l96J70N49
1367E14o35J94M19l49J13r5j63M86n74k90O67o75p7M25l05jK57k41K61K5j53O03
1389D06j77l01N45k16j71K54k15J00j14k93L17p3n30M02j16k84K65n4N2L03m03
1410c03N84J13m89M09J06l12J42j21k0J95l94K1J11o08M00J25n08L83j2j20L05
1431Gr6N2K98l47K50L98m17Q3J48k51R8j67k01K07l46j56N71n19l6L52k21J89
$$ plain form
1281 150 231 606 -149 150 593 -285 -224 77 -337 -146 -328 -418 26 -468 -294 176 -121 -85 447 75 149 341
1303 341 162 515 233 -15 596 -88 -351 227 -260 -440 -167 -422 -260 -288 -455 201 -86 -371 388 121
1323 121 66 490 258 396 472 -57 284 307 -357 47 -70 -499 -290 -276 -335 -161 -446 -63 113 -305 135 368
1345 368 -88 318 466 252 311 108 256 345 -280 -82 191 -479 -331 -183 -438 -195 -204 -246 191 -205 -35 514
1367 514 -121 73 492 143 256 161 -2 484 -90 -380 287 -388 -465 -40 -345 -346 -89 -330 -69 -44 -197 406
1389 406 229 -72 473 257 86 340 125 225 111 -182 135 62 -468 -66 -182 -466 -201 -255 -203 100 -303
1410 -303 281 394 -95 314 420 108 250 129 109 304 -90 -69 42 -566 -166 -41 -549 -166 -178 -298 7
1431 7 -89 -37 261 -86 164 562 145 228 376 125 223 56 -145 62 -284 -440 131 -388 -424 -72 -293 -104
1453a04M8o7M08k47j13M04o8j93K16j40j35J71k52J49j24l40M37j22l86M88r6
1474f6j97L55j62J94P8l02M28j0l51L07l4k08J64j36j79J12m11L57K8m80L22J53
1496c8l02K77J18j0P3q3J44J74k89J83K18m37J34J6l76K5l8j06K38k88l8M79k59
1519a85J4K52j56K45L7k54M09k51o4M18l62m4J89l24p2J5j26J96j91r0K61j4j57
1542b54L27r2j6M00k79J50O5k77L12m3l73K95j65k35J47j51MJ00k59L10R7l99
1564c36J97J97r2R2K7O1J20l28K19K06n57L84k1m13J45n4r0J09k14J5L55l01J69
1587a10L06k81J66J54k48J05N7r7L37m60jJ92j66o4J05j21L1r5nJ04j20k7M66
1610B28k03j57L45o8k3K19l47K95j49j92J92o3k88J76n5j0L6j71K9R2j93K89J17
$$ plain form
1453 -104 -56 -123 285 38 -75 329 261 68 284 144 9 180 -72 77 -47 -387 50 -72 -458 30 -66
1474 -66 -263 92 -70 124 202 -100 328 318 -33 274 240 32 196 60 -119 -7 -418 -61 -33 -513 -191 -38
1496 -38 -340 -63 55 45 118 35 179 353 64 247 465 28 162 178 -198 -173 -211 -317 -79 -367 -405 74 -185
1519 -185 -171 81 -75 170 207 -47 362 111 47 465 103 59 248 -76 -148 -133 -259 -63 -254 -344 -83 -97 -254
1542 -254 73 -19 -35 365 86 236 301 24 336 293 -80 215 50 -185 -38 -189 -185 -85 -344 -34 63 -336
1564 -336 -139 58 -34 58 85 146 266 -62 157 363 -194 190 169 -244 -99 -153 -243 -134 -348 -333 22 -279 -110
1587 -110 196 -85 81 235 -13 92 149 52 389 -71 -72 120 -46 -110 -5 -126 -95 -190 -195 -91 -211 -238 228
1610 228 25 -132 213 145 122 341 -6 289 140 -52 140 77 -211 -35 -90 -100 -64 -235 -206 -114 -307 -18 99
1633I9j30J81k7j12K52j25N6N6k29K56n8l64J23R9k82l8N5J8O5p4P6K22j39J9
1657aK76k06L0J47j46J60q9j64K05l59m3L01l50k8J87j53K32j65j6K44q0k7K04
1680A59j03o7K27j06R7L5l05J37j01j48J51m0k56K70o4o4J33j58K45j4k19K96
1702A05K4k41K76J03j69J44k06R9m7k13J38J1m20K17P8p5R8k6NJ57k21J00L41
1725B78l99J61P4j21O1l0j03J30j46kL4q8q4K24j83P6J05j06P6jp9L40p3q8K69
1750C25k02k4J51j91lk8p5J64k56j84L01m0k55L83q3p5N4O3R0L0j85K86n0j14
1774H2L6l3o7kn4j8N7k96J90N0j30lK40k45J99M1N2J24j83P5N8j99J77J25l42
1799f6j5J1l6k1nj75K38J1j32J25j21J97qk6J58n4K4J79j93p9J71j17j22N9r6
$$ plain form
1633 99 -31 150 123 11 263 138 194 250 21 277 219 -145 -22 77 -205 -243 -188 -170 -105 -179 -103 119 -20 -1
1657 -1 275 69 99 246 100 260 171 7 212 -147 -190 111 -239 -267 -80 -233 -1 -166 -182 62 -18 -45 159
1680 159 56 -11 216 110 207 242 -63 74 -27 -175 -24 -64 -320 -50 -114 -178 -45 -203 42 28 -191 105
1702 105 129 -112 164 267 98 242 36 135 88 -125 13 24 -396 -179 -101 -176 -78 -104 -99 58 -163 -63 278
1725 278 -121 40 114 -7 54 24 -79 51 -95 -97 -63 -151 -235 -11 -194 -118 -13 -119 -43 -44 -123 217 144 56 325
1750 325 123 99 250 59 56 28 -47 117 -139 -323 -22 -62 -317 66 -17 -92 -38 25 115 145 -40 246 196 82
1774 82 118 85 18 16 -38 -56 1 -295 -105 -55 -185 -188 52 -193 6 47 99 223 40 115 173 -26 151 276 -66
1799 -66 -81 -70 -106 -127 -132 -307 -69 -58 -190 -65 -186 11 3 -23 135 81 105 284 91 12 183 66 -56 3 -93
1824i3J04k00j2J50k3k81L78k6k4N7j27R9J73k03J89k7j73K45m9j26J8j14N8r3
1848a00k3n8K5n4J75J1j24J69m6k3K11j29M7O8j74J94k4j49nK6j56R0l4j05K17
1873B9k81P1K66j62J90j05p0J45rj09J02K8j25J46q1q5Q9l9q8M3j29J53j12k3
1897a56K05o0j21K29p8n4K23k64J87p3NJ81k00j00n6Q2J9k5j10k6J67k02L15o4
1921B4k31L42K7j20J5J06r9J96k34M1jj33P2J05j18j36J01j41J61r4j1K47k14
1944i5J4K22j46l6K19p9O6j24l0M8n7p4K36k60j6J41p9k0j04J17o4R6k3J45j25
1969b8q5K44j86L4J81p6j4o7q0J08l4j53J29K3j06P7m3O5j2p0J42M6j38P6M8j35
1995e4J25Nm8Rj09K38j47q2j3Q0j67J12l8q5J57o2M1J38k49K38P5j41K2L1k0J14
$$ plain form
1824 -93 11 -189 -201 -51 -74 -355 23 -3 -27 30 -97 2 175 -28 161 134 -39 206 157 31 49 -65 -7 -100
1848 -100 -123 -181 -156 -210 -35 -24 -148 21 -25 -48 163 34 81 149 -25 169 145 -4 -9 17 -139 -49 -83 -188 29
1873 29 -252 -181 85 -77 113 8 -62 83 74 -35 67 95 -30 116 35 -50 39 0 -88 -45 -174 -21 -133 -156
1897 -156 49 -11 -132 97 19 -35 188 -76 111 38 43 224 24 -76 -132 -50 -31 -56 -166 -192 -25 -227 88 24
1921 24 -207 135 162 42 57 163 64 260 26 67 66 -67 5 110 -8 -144 -43 -184 -23 -117 -128 119 -95
1944 -95 -81 141 -5 -41 178 99 165 41 11 59 2 -72 164 -96 -112 29 -50 -70 -174 -57 -121 -25 -48 97 -28
1969 -28 -113 131 -55 -21 160 84 70 3 -77 31 -3 -156 -27 -4 -110 -33 -76 -11 -23 -93 49 95 -43 33 81 -54
1995 -54 71 76 28 37 -72 166 19 -63 -76 4 -163 -51 -89 -174 -17 -79 -38 100 -149 89 164 23 45 76 56 170
2021A70j64j39K34k18Q1N4k00M4Q9j41Q5J73q0J02N0k16K20j14j11L22k26j07
2043i2J20p0P8Rj10J22j97OlJ17j22Q4l0M0O4p2J20m5M5k1J00j66J58j11k6N9
2069E7j31O3J8l30L57j29j71J85J42p4m6J03J86j19k01Q6K51m19L88k61K13j77
2091ij82o6J00j73k48N40j53k15M17j07K83m88K91J55m40O98o6l07K7K90o40k59
2113e52O86l64L72q9n08L19K1j29L19l40L50p15L75Q14n75J06l9L17l63J51j59
2134cj84J69n3j29R0m1J12j7q9J16j1j3M7J02n3J37q9L4M0p7j07J17j29J04kj58
2160h7P5m9J0J04j34J3J41k4j11L8J2OJ1m2J71p1j39K10J2r9k19Q7M4m9M1J22
2186G3j90L3J67k2q7J58o4K9j7l2O5n9j06Q3N5k48J51o7k0J24j67J10Q3n7P8J8
$$ plain form
2021 170 6 -133 101 -117 -36 18 -182 -138 -49 -190 -105 68 -12 90 140 -76 144 30 -81 241 15 -92
2043 -92 28 -42 36 45 -65 57 -140 -134 -137 -20 -142 -58 -88 -48 16 -56 64 19 64 43 143 -23 135 24 -2 57
2069 57 -74 -11 7 -323 34 -95 -266 -81 61 -13 -59 44 230 111 -90 -4 247 -172 216 -45 168 -9
2091 -9 -191 -257 -157 -330 -578 -38 -191 -406 11 -96 187 -301 -10 145 -295 403 337 30 57 347 -293 -552
2113 -552 134 -230 142 53 -455 -136 -115 -244 75 -265 85 -630 -255 559 -16 90 51 368 5 156 -3
2134 -3 -187 -18 -71 -200 -110 -151 -39 -56 -145 -29 -40 -53 -6 96 43 180 91 125 165 88 -19 98 -31 73 71 -87
2160 -87 -12 -61 -51 53 -81 -68 73 49 -62 -24 -12 -6 5 -37 134 63 -76 134 146 47 -172 -85 -41 -90 -49 73
2186 73 -117 -84 83 61 -26 132 68 97 80 48 113 54 -52 31 86 -162 -11 -78 -98 26 -141 -31 52 -5 73 91
2212I1j65J70P2j95Q2r5J09o3K4j42J00j3r7R1R0q7p7m8Q9n1Q5j53J32K11J7j94
2238a7J6J61j15M2j11P2K4j02k5J23l2J4n0j69J01N4j64J75r4QK33p8p9J34j01
2263B0j3P6j19Q9k4j24K28k21p8J75j18M3m1M0l2J44r5N9O8j9m4J32q5P1j43R7
2289H6Lj30K8Jo8R4J6j02r4J59l3P4l4j13J97j39K24J4k01j0J93r3j3k14JK62
2315A08j49N4k4j35J24Q8j64R3J17j33Q2m4o2J32l7j3K3o6j04R6Ko6M2o7J9Q7
2341Ck7J9k2m5j8J1J61%l9M4N0j29N2j5o1k1J6JR3j63m8J46o1P6J4l7Q9j92J76
2370G3P7j84J3J49j25J2R8q2j8k6J2M4j22O1J57k67k5J14R0q1QkL4K3oj1n9L1
2398a2K3j0P4j40R4l0J8j37J14o1l0N2Kk9J64K4n5Pn2M8O3j05J31r1j97R7o1O1
$$ plain form
2212 91 -74 96 168 -27 55 -40 69 6 30 -112 -12 -25 -122 -31 59 -28 -105 -153 -64 -115 -30 -183 -51 160 177 -17
2238 -17 -1 160 45 87 -24 48 72 -30 -55 68 36 50 0 -169 -68 -14 -178 -3 -97 -89 144 66 -13 121 20
2263 20 7 83 -36 53 29 -95 133 -88 -166 9 -109 -66 -107 -67 -99 45 -50 9 77 58 14 146 61 132 -11 86
2289 86 89 -41 -13 -12 -80 14 30 -72 -166 -7 -40 34 0 -113 84 -55 169 183 -18 -28 165 72 59 -155 -154 108
2315 108 -41 13 -11 -146 -22 66 -98 -5 112 -21 61 17 -45 87 50 37 60 -6 -110 -14 -12 -78 -36 -103 -84 3
2341 3 -24 -5 -27 -72 -90 -79 82 82 43 87 137 8 60 45 -16 -37 -21 -20 73 -90 -138 8 -53 23 37 0 89 -103 73
2370 73 150 -34 -21 128 3 15 113 31 13 -13 -1 43 -79 -18 139 -128 -153 -39 51 -30 -22 -24 10 33 27 16 -43 -12
2398 -12 11 1 75 -65 29 -1 17 -120 -6 -67 -97 -45 -43 -72 92 116 61 68 16 64 127 22 153 62 -135 -38 -99 -38
2426c8J02p8j23J69j20J4L7K7J6O6o6%O7l8M7Qj35J9m8J84p5p3p2N2Q0j07m8Q9
2454d4J2N8p1O7o9J37R8k38J17m7kJ9L1k09K90k49lP6L4r0o3P4R2l3j64K42j32
2481f7J19n9j0L9J8J6m7k1o4Q7Q3j17p2o6J13L8j71N5J45l3l6J17j07L7P4j5l
2508E3m2j0j3o9J08l7O6p5n7m3J92j18n5Q6p0rJ64m5M7Q8K2j91J2m3nR6k8J50
2536A74j78o0M5j20Mk5M9L8n0J43K9j69j2K51n0j52J68j15Q5n8RR4j19o2M7l5
2562f9RJ42j18k5P8q4J16n4l5m9K41k02R4p4J49p6j1m3J24Jr9K3j10L5n7N1O4
2589B1q0M9N9OL4k20J12J05N8m8m2m1%j8M2j7j5oq2J63n5q3P3nk7Q0n8R0p5n1
2619c1N9p9O7L0LJ8oj46o6N7J1J28j14M0m2M9o2R3j04J66N5j94J4N5m7pM1J14
$$ plain form
2426 -38 64 -14 -137 32 -88 -74 -37 -10 6 72 6 6 73 35 82 90 -45 -26 -74 110 35 -38 -110 -58 22 -85 -133 -44
2454 -44 -32 26 -45 22 -47 90 188 -50 67 20 18 37 68 -141 149 -100 -103 -27 7 -83 -146 -72 20 -13 -177 65 -67
2481 -67 52 -7 -17 22 40 56 9 -12 -76 11 94 -23 -95 -161 -48 -10 -181 -126 19 -14 -50 67 -40 -3 71 56 53
2508 53 11 1 -12 -81 27 -10 56 -19 -76 -119 73 -45 -100 -14 -84 -93 71 26 73 161 183 -8 4 -39 -44 52 24 174
2536 174 -4 -64 -19 -139 -135 -160 -111 -73 -123 20 49 -120 -132 119 69 -83 85 -30 55 -3 6 100 -19 -81 -34 -69
2562 -69 -60 82 -36 -61 17 -67 49 -5 -40 -89 152 -50 44 -30 119 43 32 -11 113 114 15 38 -72 -37 -94 -43 21
2589 21 -59 -10 49 55 89 -131 -19 86 144 96 54 13 13 -5 37 20 5 -1 -83 80 25 -58 15 10 -17 63 5 95 20 -31
2619 -31 28 -51 16 46 49 67 61 -85 -151 -94 -83 45 -69 -29 -71 -22 -84 9 -95 71 126 -68 -54 1 -46 -53 -12 102
2647A02r4m1J3j3l7O2R1k35J60r2L4M1j17J60j9M8j15J09j13K8J05j03Q5l3l4
2672hQ5j23K3M6r3rO6l4j7J13J9k7N4j10Q7j65P2m2J39Pj20n6M1Q6k05J13N7j7
2700a8o0J10n5J33p6K3r4R7M4r5k4J8N7j23R2qm6J33k03O5N8j15Q5Rn7Q0K5o5
2728a0L1l9O0O0k1k2j35J92p9k5k4K6l4Oo0K2L1oJ8J70j84qM4j11J84j36J96k19
2756g3O9M2j23J72l4l9n0n3J13N8p4o2K0o4J44j07Q8M0j69J08p5Q3n8R4k2m5k2
2783c9J0Kk7M7N3q2J7Q1l8l4R0L4N0j57P5o5l0L3Pn7k8J25k5j18j7L2nP6j5m3
2813d8M9J57j48L4lm3nJ3l3N9P9m4q2oJ9LMN5R8j28o2N1l1j9J05O4j98J13k1j64
2843a32K20j02n7P0j21J37n8q3J49j54J82j21k4J63p3j16J60K3q8L0OK4j5Pj15
$$ plain form
2647 102 8 -33 -20 -33 -70 -8 83 -152 8 -84 -50 -9 -126 34 15 63 -52 57 -56 -28 77 -26 59 26 -8
2672 -8 77 -46 -23 23 -70 -79 -13 -47 -64 49 68 41 95 -15 72 -93 -21 -63 76 83 -37 -93 -52 34 -171 -58 -1 -18
2700 -18 -78 32 -23 110 34 57 -37 60 104 9 -15 3 60 -63 29 21 -25 108 -95 -30 28 -87 -2 7 -50 30 55 -10
2728 -10 21 -18 42 102 81 59 -76 116 37 12 -12 14 -20 -14 -74 -52 -21 -27 -9 161 -23 -31 13 -98 86 -50 146 -73
2756 -73 -4 38 -85 87 53 14 -36 -89 24 82 8 -54 -34 -98 46 -61 27 67 -102 6 -69 14 -44 50 28 -17 -39
2783 -39 -29 -27 -54 -7 46 -36 -19 62 24 -10 80 114 164 7 82 17 -13 20 27 -30 -58 67 42 -76 -93 -61 -66 10 -5 -48
2813 -48 1 158 10 44 41 -2 -7 6 -27 32 111 67 -15 -21 -2 1 5 60 158 30 -32 19 -12 -31 74 138 -60 53 32 -132
2843 -132 88 -14 -71 -1 -122 15 -43 -126 23 -131 51 -70 -94 69 -4 -120 40 63 -25 5 11 35 20 27 -88
2868h8J83j32M5qj2J21j93K9J28k3n8ok6P0M7j33N8P5J4n9m0o4J80p0n1R6k8o8
2896a3Ro8L7R1j87P7M1m7L3J7Q6o9M7ror1Q9r9N0K5n8J03n0M4Qj44Q7P0m3l3k1
2927b4O7k7Opm0M4K9l9L4j18l6J35m3QOk7o0R1n7P3n7O0j2m7Q8k6n0l9J37j06
2957c7M7m9J88j39om1J14n7P8j95J00PL7k7jJ16k50J95j29mP8J45k16J26k72K69
2983G7k31J32o43L0j33J42R16m60L12j75P7o1O7j04L3Q3no0n4j8P7j4J04j10O4
3008D6m2l1QN3q3J68j02M9l2j43J34mP6j09j5kL6O8j26O2J9K5j73J30P3k0Po9
3036Ck5N3n2O0Q0r6l0R0q2Q0q6P9j02j1j3Q2M5ln7j6o3N0K0p2J75jo3oJ19r2j3
3067E3j37J36Rr2j29J78l7np0O5L1Ln4l7J63k0l9p7Rl0J07m6J03p6k9O2l1rO2
$$ plain form
2868 -88 95 -37 8 0 -12 109 -84 -55 73 50 -8 -14 -40 30 77 -56 2 77 91 32 -8 -72 108 38 -13 83 55 -13
2896 -13 -4 -72 -35 56 -131 -54 -13 -60 -27 -10 76 7 54 45 39 -52 37 -62 -12 13 -45 58 8 52 60 -84 3 73 30 -3 -24
2927 -24 43 16 22 15 -25 19 48 9 43 -75 -111 24 -19 -11 -5 -32 -92 -1 -58 15 -42 18 6 -41 47 21 -29 -68 69 -37
2957 -37 10 -39 149 10 4 -37 77 20 98 -97 3 10 47 20 19 135 -115 80 -49 -53 25 170 -46 80 -192 77
2983 77 -154 -22 -665 -635 -768 -626 290 -170 142 -33 44 -17 50 -54 -21 62 57 -3 -57 -75 2 -12 92 -18 46
3008 46 4 -27 -19 34 -49 119 17 66 34 -109 25 21 97 -12 -27 -29 7 75 -51 11 30 55 -118 12 85 65 72 3
3036 3 -22 31 -21 39 119 23 -7 83 1 81 -5 74 -28 -39 -52 30 75 72 15 -1 -64 -14 6 -66 109 108 45 39 158 66 53
3067 53 -84 52 61 -31 -160 18 -19 -24 -94 -29 2 5 -49 -86 77 57 18 -59 -50 -80 27 -19 84 8 -21 41 10 1 63
3096F3j79P1j8n4O3Q5l0K3pp1K02q8K9l6L1m4q0j2L6o8M1m1J18%l5JN1j23L9J02
3126F9Jj06O3r1J27j35N6P2j33J8L7J4n5J41J8n2l0L5m7k5l1J13P0j14J6q3O7
3153A5m5mJ1q3O2J23j24oM7l5K0J22j18N0M9o3qpm1O8N9j17J09j12P3j21N5PJ18
3182A04o8q5J50n3k9j29J63p9J10j45oJ48j04rqk8J12nl9LOql9N5K2k0p6R0J7
3211E0q6P5L7m1k5j8J23r5j4N8j4p8J71j68NJ06j08q0R7n0ln1J26M7j13k5K8Q8
3239D2k6M5k13J94J1j32J80j72J57j05kmj11J10k3m3J99p9L9j35R9kJ1l7MN0m
3266E3q3Q9j30P7k2l3j8M3N4j58J68o0J5J43j00L1j72J89j28N3L1j26R6p2Q7m8
3292b1j13Q3Q3l1J9j88J92o0N6L1K8k21R0R8n9ON8o6o2J06J19j51J49k32Pl2O0
$$ plain form
3096 63 -116 -45 -63 -117 -54 31 1 24 17 -54 148 60 89 53 84 40 -40 -52 -16 -84 -43 -84 34 34 -1 0 51 -72 -33 69
3126 69 70 -36 27 -64 63 -72 -16 56 -77 -59 -22 -8 -63 78 96 44 14 49 2 -23 -54 59 129 15 31 -52 15
3153 15 -30 -34 -23 -106 -44 79 -45 -51 -4 -39 -19 103 -15 35 84 21 13 6 -35 33 92 -25 84 -28 45 -76 -21 -14 104
3182 104 36 -49 101 48 19 -110 53 -26 84 -61 -67 81 -23 -32 -40 -68 44 39 0 3 9 1 -38 17 39 19 -57 33 50
3211 50 -36 39 76 35 10 -8 115 20 6 64 50 -28 143 -25 -20 86 -22 -102 -5 -55 -58 -109 17 64 -49 -74 -46 42
3239 42 16 61 -152 42 53 -79 101 -71 86 -19 -21 -25 -136 -26 -49 -92 107 28 67 -68 31 29 40 3 7 57 53
3266 53 -30 59 -71 6 -16 -49 -67 -24 30 -128 40 -20 -5 138 38 69 -103 86 -42 11 42 -84 12 -60 27 -21
3292 -21 -134 -51 32 1 20 -168 24 -36 20 51 79 -142 -52 46 -13 -7 51 -15 -77 29 148 -3 146 -86 -79 -111 -51
3319e1MJ04L2m8j02l3n3J90K8p9RQ8j92J95j07l0J7P5lj7k8k7J19j43L8k8J4J
3347b7L5L9Nj10K1M4j1l6P0j57O8O2m6J46j90M8M4j26J64Ro9Q0p3m3M7pj18J33
3375Bj3m5R6mM0r2J35j88J18q3n3J33j44J14J3j07O4m8J65p9M0O9q5J3n9O4k0
3402D6K3j74P0J24j64n3J23N3k4m0%K0k4o8J32J3o4K1O7j17L8p2Q7r4%kM1O6n5
3431b7j9l9N5O8j07L0j1O9o4m6P4Nj2ooR1k4n5M2po4K5no5J67j74J01K3Rj22J79
3462H5m6l9K7M2N4j78L0K5lO2N2q4Nm7r5J69jj06L3O3m1Q3r7K1p6P2ok1J3P3j41
3493g2J4J88j38R2r0M4j29Q8kk2j0l6J43k9q2J27j04Lm1J4J1P1j04L3j0QM4Oq4
3522f7K7k8R3n9M2N5N6m1j20J33j60L6J15j23k8N6p9J6J21j06J50m7p9j17J36
$$ plain form
3319 -51 -47 57 89 41 -61 -94 -147 43 71 -8 1 89 -103 92 -15 -45 -28 47 44 27 -1 -28 91 -52 -14 -42 -28 -27
3347 -27 8 47 52 -58 -37 7 -4 -40 30 -127 -59 3 -43 103 -87 -39 5 -121 43 52 -17 63 -10 -53 -6 -13 -131 2
3375 2 -11 -56 40 36 76 -16 119 -69 49 -34 -87 46 -98 16 29 -78 -14 -62 103 24 64 133 48 61 2 66 46
3402 46 69 -105 -35 89 -75 -128 -5 48 24 -16 -16 4 -20 -88 44 57 -7 14 81 -36 2 -70 17 -77 -77 -79 -38 28 -27
3431 -27 -46 -85 -30 38 -69 -39 -50 19 -45 -91 -17 -12 -24 -30 -36 55 31 -24 18 11 -53 -28 -33 -98 69 -105 -4 19 28 -94 85
3462 85 39 0 27 69 123 -55 -25 0 -3 59 111 27 32 -15 -110 59 58 -48 -15 48 7 90 -7 14 -62 10 4 -17 -4 69 -72
3493 -72 -58 130 -8 84 -6 38 -91 -3 -5 -27 -37 -73 70 41 -41 86 -18 -15 -56 -42 -31 40 -64 -31 -41 -33 11 17 -67
3522 -67 -40 -68 25 -34 8 63 119 78 -42 91 -69 -33 82 -41 -69 -13 -92 -76 45 -61 89 42 -37 -154 -18
3547a8P2o6O1j20J87k04Q8M7j28N4O7L2m5R8j64P3n0P7j87M4J59j22N5R6r8k8
3573b0N6n5n1J13n1l8J51nm9j58N2nJ11q4n1lJ10p5K4MN3m8M6N7m1N9n6o6J06
3602H6j31J02j02RJ81j87oL2J6r8K00j33j1K6J76j33k3M3L6K8r9n5L3N8p5M2r7
3629h2J66j94J51q3N2k5JJ1Q1j14K5P9m3J05j48Q0n4RN3p2O5k4m9Nk4N9n0l3p6
3658a29R6O8p1O2j48J77P1q8J1q1J08l7j04J09M0k7p4r7Q0j0N6J2O5j41L5oJ35
3685A12p4M7o1m4L7N2p0j07J28P1j76J02pM1l1Nj22O7N4k7Q9j6j06J52o0k1j83
3712a48R3pq2J66nm0J38q7KK1Q3k85J33L1o0R6l8qJ53k19R7J08k25K12j22K1l1
3739cO1lN2o3p5r0J7O4L2pQ2k0j28R4J2J5m4k2N4m4J29l8j46L3K9RO8o8j50L8
$$ plain form
3547 -18 54 -12 49 -71 116 -88 0 47 -81 -27 40 72 27 125 -39 34 -16 61 -126 -82 77 -45 10 106 8 -20
3573 -20 36 -19 -70 43 -8 -46 105 100 51 -107 -55 -60 51 -33 -84 -87 23 -52 -28 -24 29 -19 27 84 43 102 46 -20 86
3602 86 -45 57 -45 -36 145 -42 -48 -16 0 -98 102 -31 -42 -16 160 27 4 47 83 111 12 -43 -10 48 -27 15 -82
3629 -82 84 -110 41 -42 10 -15 -14 -3 78 -36 -11 68 25 130 -18 62 8 17 70 -2 63 39 -10 -5 -29 30 -20 -53 -129
3658 -129 -33 35 -36 26 -122 55 126 38 49 -32 76 39 -65 44 84 57 -17 -114 -34 -44 12 24 89 -52 -17 -23 112
3685 112 38 85 24 -20 17 69 -1 -108 20 91 -85 17 10 51 20 25 -97 -30 24 -3 86 70 -36 116 56 35 -148
3712 -148 -55 -62 -144 22 17 -23 115 28 30 51 134 -151 -18 13 -47 49 11 3 156 -63 34 142 -83 129 7 28 -3
3739 -3 58 55 107 44 -31 -121 -104 -40 -8 -15 67 47 -81 13 25 40 -4 -26 28 -16 113 75 -71 -38 -9 0 68 0 -150 -112
3769a12J16L8O5j09j2R7n8n0M0Q2o9J17j25J00m9j02R8l9m9J8j40J36M5o8O9k9
3795A0L3o0J8j4K1l8Q4n7j9O2j9j8N2N8m9j5p0J2KRp5O8J04r9O5r9m9J25j12J88
3825A18j50J20k02O3O6ko2J4p6J07k5N2p7J27pj11R4j7m9L7k5m5l9J63k7j27N7
3852b3rK1PQ6q8q0J66j00L5l4P0J5J7o4o6J43r2m6p3K40j79QN2O7n1n0o1L9J26
3881G6j06J2KK0K1L2l5J2K1k5Rj04K8M9n3N4k9O7r4p1J74q6M8K0p8L2J06o9R4
3910A27j57R7l5P5j53nj6RO1pm9P7J6p3rrR9l8p1L2L8J94j59q9k4M1M7L2o3J8
3940Fj41J52l4O6p8J8j12J0P5j2N0L0n0OP8J1k4L4l0k1pL8j4l6O1L0m7j14m0j8
3970a13J13N9l2j00J49p4n3M9J02p3J9o1M0r7J69j61pj1k4J7N1Qo0J70o6r0K8
$$ plain form
3769 -112 4 42 107 -2 -14 83 25 -25 15 97 28 145 20 120 71 -31 67 28 -21 -3 -143 -7 38 -30 39 10
3795 10 43 -17 1 -13 8 -30 54 -3 -22 40 21 3 55 113 64 49 -21 -9 -7 2 -73 -5 99 0 65 -34 -83 42 -70 118
3825 118 -32 88 -114 -51 15 13 -49 -35 -111 -4 -29 23 -54 73 66 -45 49 32 -17 20 -5 -50 -89 74 47 -80 -23
3852 -23 -32 -11 -4 82 -6 -86 80 -20 15 -19 51 66 83 19 -47 96 4 -42 -115 125 -54 -46 6 73 22 -28 -89 -50 76
3881 76 -30 -18 -16 4 25 57 22 34 55 30 39 -65 -37 12 -41 13 -16 51 -43 -114 60 -26 22 42 -36 -4 102 33 127
3910 127 -30 67 32 107 -46 -51 -67 -58 3 -4 -53 24 40 -33 -42 -51 48 10 -61 -29 9 203 44 -45 -69 -28 19 51 -12 6
3940 6 -135 17 -17 49 -29 -11 -123 -113 -38 -50 0 30 -20 -14 64 75 51 85 55 34 27 65 51 15 76 106 59 -55 -95 -113
3970 -113 0 59 27 -73 76 2 -51 -2 100 27 46 -15 25 -72 97 -64 -71 -82 -106 -89 -38 -30 -90 80 14 -76 -48
3997d8Mj1J27q7P1p1J23j59J19q1K8p9J45kK2p0r9J26j32L4R9j52J06j1q1J68
4023H9j06M6o7oL6K2M4N9j63J2p6Q7R5j66J41q6M6P8j72R2k4Q5l2%k9P5L2r0r
4052A3l0J4j19J14L5qq9m9R7L3n0J01q0N8L2n2N8l6n6Q0r0M7p9k1J75j59J05o
4080C8j73R1N7j1Q0j7o0k1M9J3qq9J43o2j7n0M3J7Q5L3l47K59q6P6J03j51O6r3
4108c2O1m7P2j6j01J01l2J7j00OO9q7J5P6q8K9O8J3m7L0m2l5O6l8O5o6P8k0p8
4137f3N4J9j9j1P3m6p9Q5l7J00Mn6l7k5N7q6L6m6j7O2J4R7L8j10k3K7o7n4P0J24
4167H4p9M9N1j81J05j02j8J45L7r5pQ1j15J43l9l3K1j28N3jR4j10R8r4Ml8J45
4194G0k2l6l7J27k9m5J4k5j4M9l9J16q9k3K8j18K7R9mK6n9j44K30p5kj6m2L1j12
$$ plain form
3997 -48 -44 -55 72 -15 56 -15 108 -51 68 -13 15 -64 81 79 101 31 -68 58 -74 -40 59 -93 13 2 -79 89
4023 89 -17 29 -38 -44 -8 14 58 117 -46 -34 -110 -23 72 -94 47 -39 7 85 -87 5 -19 66 34 34 5 80 112 22 13
4052 13 -17 -3 -122 -8 27 19 -70 -119 -22 11 -39 62 -18 40 72 20 78 42 -14 66 -24 23 -56 -77 98 -61 44 38
4080 38 -135 -44 13 2 82 65 5 -16 33 46 38 -51 92 30 13 -37 6 23 108 141 -206 53 -33 43 146 -5 61 -32
4108 -32 29 -18 54 38 -63 38 6 23 -77 -71 -2 -89 -74 2 -86 -57 11 24 -23 7 -35 -70 -4 -42 23 -43 35 15 -63
4137 -63 -9 10 -9 -20 53 7 -72 13 -24 76 80 24 -13 -38 19 -67 -31 -77 -94 -32 -18 79 117 7 -16 11 -56 -110 -40 84
4167 84 5 54 105 -76 29 -73 -91 54 91 -4 -11 70 -45 98 59 26 47 -81 -28 -29 65 -45 53 -41 -37 -75 70
4194 70 48 12 -25 102 73 28 42 17 3 52 13 129 40 17 45 -73 -46 53 49 75 16 -128 102 27 25 9 -33 -2 -114
4223a14J51p4J15k6j03J01o3m9K7P0n5Ok9P1P1o6P7j42J8j6Q0j15J52j22O8l6
4249cJ3Q3N0k14mO9K5k0mJ9j17J26o3J09j06K9j42Q7pJ60l8m4K2p8J33j47J31
4276F9j59J64l6r9J06p2Rk8M9k4J04j87J44L5j37Q6p0P5m7N6l5K0O9k39J82l1
4302Dm5j2n8J92j0n1pK9J4j3o1j0l3N1O3j39O6J13o2m1N9l7oP7j20l8P0j16J71
4331E0j4q4K1N8M2k3m8K9J1qJ6j13qK19j42N0p4Mjj2l3oJ7J21j35J24k7k8rN1
4361D8M1p6p5K23j84k4R4j16Q3Po1N4Rq9J05p5PO8O4j37j2Q1q4j7%J4J5L3mJ1
4391Cq7J62k9J9r3LO1j38O7J29j44nP6l9P2m1k5J01l9l8Klmn1K8m7K6j8K1J19
4421H8j33O7J02r1pj50K01j2j10L6k1P1L7j01J8P4p7J2NO9j9Nj17N5J01j02K1
$$ plain form
4223 -114 37 -37 78 52 -51 50 -13 -62 -35 35 -20 -14 -43 28 99 33 110 -32 -14 -30 50 -65 87 -35 33 -3
4249 -3 10 93 143 -71 -75 -6 19 -1 -5 14 -103 23 -40 69 -37 -8 -150 -63 -70 90 52 8 30 -48 85 -62 69
4276 69 -90 74 38 -61 45 -27 -18 -46 3 -21 83 -104 40 75 -62 24 -46 29 -18 38 3 23 92 -147 35 4
4302 4 -41 -53 -111 81 71 20 13 42 56 43 -18 -28 -61 -10 53 -86 -20 93 31 -10 49 12 6 83 -37 -75 -5 -121 50
4331 50 36 -48 -27 31 73 50 2 31 42 34 50 -63 -71 148 6 56 -18 -14 -15 -27 -60 -66 -49 72 -63 61 34 6 -3 48
4361 48 89 13 -62 161 -23 -47 47 -69 14 21 -40 14 23 -66 39 -36 -29 39 103 -34 -46 35 -49 -66 -66 -52 -37 -4 -8 3
4391 3 -84 78 49 68 -25 -22 39 -99 -32 97 -47 -52 24 -15 57 16 -9 92 53 15 17 14 10 -41 -13 -60 -34 -52 -31 88
4421 88 -45 22 124 33 26 -124 77 65 -45 -9 -30 41 78 -23 -5 69 -8 4 9 78 59 64 -53 2 103 1 22
4448B2P5j18O7j2l5k1R8L6p2K2K9p3j7oQ6o0pJ0j06P3oJ56k01R4L0Mj45L7Q7o8
4478b1K8N9q6J6L2n6J18j02Q2M7k40J73Q7j29m9N7Q6j39m8J15m8J50j56K09k60
4503g5M8J4l7J15Ll1j6o9R2J00j06O5j7k2lok7Q0j12M8q9Q0J4j22pR6r2j9K31
4532A36j40L3j0j14J64k9lL9l4j36L1Q6p5J6p1M9k3K3K6mQ2j7j27P1P7j6p3J26
4560H7n2l2N2j10R1m3K1N5n5J23r6m9oJ5k2R7j18J03j21J17j0o8ON5m3k2Q5o2
4588bj06J41O4q3m8l3J12q8Q7p4n3Q9k8J09n9J31j33p8M3L5l1P9j46J45j19N9
4614A3K8M6m6lr1J05n1L6k6r4k5K60j01M8j15N1p2KL1O3Jk3j11M1N2J0k0n6n0
4643i7J09k1k3L3j6J16p6jJ7k6L3j1o6L5n7P0o7O2Krn6LJ23o4l2J34j27j00J13
$$ plain form
4448 22 97 -21 46 34 -1 -22 76 112 40 62 91 18 1 -5 81 21 14 24 -82 -9 -15 141 -60 34 64 68 -77 -40 47 -21
4478 -21 7 66 -20 -4 28 -28 90 -12 70 117 -123 50 137 8 -41 16 102 -37 -85 30 -18 132 -24 185 -75
4503 -75 -27 -13 -50 65 68 37 21 -48 44 144 38 103 86 64 61 55 28 108 -4 44 -45 35 49 -73 -80 16 -76 -95 136
4532 136 -4 29 19 -95 69 40 37 76 42 -94 -63 23 -52 -36 -107 -58 -81 -58 -32 -36 46 29 -98 -27 50 34 -39 87
4560 87 35 3 55 -55 36 -7 14 69 14 137 41 -8 -14 1 -21 76 -42 61 -60 57 47 -21 -15 40 -3 -25 60 -2
4588 -2 -108 33 97 14 -34 -67 45 -43 44 -30 -83 6 -22 87 28 159 26 -52 -9 26 -5 74 -72 73 -46 13
4614 13 41 87 41 38 -53 52 1 37 11 -83 -108 152 51 99 -16 35 -37 -35 -4 59 60 37 -74 -33 19 29 9 -47 -97
4643 -97 12 -9 -32 1 -15 101 25 24 41 15 48 37 -29 6 -51 19 -48 14 16 7 -49 -46 77 13 -19 115 -12 -112 1
4672ARn7M3RM0Om3rmL3j2n7rj7nNK3p0J10R7q0k2l0K8M8j9pj09J32o0k6Q5q8j9
4706g4O8jL6JL0Mo8R4l1M3j58J8NO0J2l3q3O8l6KR7J3n1o2r6J03P5rq4M6N7p2
4738b6k0KJ22k7%k3q5J09o4O9m1n7M8o2J62j31N4M6m7l1n3j7MQ1J3n1k1M6o9O7
4768bn1r3J27o6P1j0J8q7J38m7Q3q3K5Qp7Q9l8q2R8j3K7m4k7K5L5L2p5M9j27R1
4798fk3j0R5k7l0r2O8L7l6RL5r7O1K7M8j00oo5J26k7M4N2p7MM9j23O4r3P2P3k4
4829B8k8j9O5j75J49Q3n9m7j00O9P7j07P5J2K5j21M9J95k43O1P1Qk9p7P4j03J3
4856e4J65j20m3P4JJj13J82n2j25M3J68j51M3q0K9k5O0o0M8L8r8m9O4p8Q3J43
4883I4j63J40r2Q1j1o3nL7q2OJ38r2N0l0o9K01j06Q6j78k0J17j19R4Lr0R8J4n4
$$ plain form
4672 1 10 -47 -4 5 45 51 8 -1 -5 28 16 -41 -50 -67 -72 -67 -44 -114 -4 93 13 -9 -39 -11 37 18 11 -98 34 -26 -52 33 -55 -74
4706 -74 -6 -7 29 30 60 64 -4 90 59 102 -56 -38 -33 27 39 6 -77 -9 -45 -43 54 67 16 -46 -142 -39 36 27 -57 -11 46 -26
4738 -26 -46 -44 78 51 51 28 -57 52 -12 57 16 -41 7 -55 107 -24 30 76 29 -2 -55 -72 -68 13 26 -25 -46 0 -69 -2
4768 -2 -53 -146 -19 -85 -14 -24 -6 -93 45 -2 81 -2 23 31 -46 43 5 -77 21 8 35 -9 -36 -11 24 56 -19 30 -97 -6
4798 -6 -29 -39 56 29 -1 -93 -25 12 -24 -15 20 -77 -16 11 59 -41 -47 -112 14 -13 31 83 6 10 59 -64 0 -93 -21 52 28
4829 28 0 -19 46 -129 20 103 44 -3 -103 -34 43 -64 11 23 48 -73 -24 171 -72 -11 60 68 39 -38 36 -67 -54
4856 -54 111 -9 -52 22 23 24 -89 93 41 -84 -41 127 -24 19 -61 -32 -57 3 -57 -9 29 -69 -118 -54 -132 -49 94
4883 94 -69 71 -21 60 49 -14 -19 18 -64 -58 80 -12 38 8 -61 140 34 120 -58 -78 39 -80 14 17 -73 25 39 -15
4911a5rj8N8k9L3j0m0N7m8R1m4q3K0o2Q5l7J38r4Ql2J9J34m0j42RL8r2R1JkMJ65
4943A54j27j4L9l4Np2M1J1NpJ6j58K17j42Q5j4J5On2K8Jm2j18P5J22Q3q8o0R4
4972F9j12L0k8N4M3m3r3k5O6J7j16N5O5J21%j90R9K8n5P6q3J6k3k7P2j27J05j0
5000a6n5J15r4k5M1RR6p8l1O9p7N0N9pn6k5l0k3N0L3r1r2J47M0L3m5j1J07j61
5029f8L9N0M3qq8Qj46K42j5rj07N2J2l2O7jKp6O4o6k9L4N9j57J31j6L7j37J65
5058E0l0J20k15J60r9o7l0Q1N7j37J16Q0j07P1K6r6j0R4oj33l5J50k4np0N0r0
5085i9KJ19q2M5Ln3n8N6J48p4q6J27p7k1q3R6L9K3q3J32j72K18k10M5P2m1J12
5112I8j48J8O0prj41K41j72J55r5kj7l0lR9P8k42J06lK8k1l8pM2l1j4N1J2J5o
$$ plain form
4911 -15 -24 -42 16 -13 20 10 -30 27 -21 70 26 -57 -37 -99 -14 -51 87 -7 1 -31 -12 122 82 -60 -51 -13 -105 -14 -13 -15 -11 154
4943 154 27 13 52 18 23 -49 -8 3 8 1 17 -141 76 -66 19 5 20 26 -26 2 3 -39 -157 -82 40 123 35 -25 69
4972 69 -43 -13 -41 13 56 13 -80 -105 -39 -22 -138 -83 -18 103 103 -87 12 40 -15 61 -22 -6 -29 -56 16 -111 -6 -16
5000 -16 -71 44 -50 -75 -34 -25 71 -7 -38 31 -46 4 63 56 0 -25 -55 -78 -28 5 -86 -178 -31 9 42 -3 -14 93 -68
5029 -68 -29 21 64 56 -32 -24 -170 72 57 48 -59 -7 5 -27 40 39 41 -35 29 -37 -66 -32 27 -130 1 -15 22 -115 50
5058 50 20 140 -75 85 -14 -81 -111 -30 27 -110 6 86 -21 50 76 -20 -30 64 58 -75 -110 40 16 11 -59 -9 -99
5085 -99 -97 22 -60 -15 -12 -65 -123 -67 81 7 -79 48 -29 -50 -133 -37 2 25 -58 74 -98 120 -90 -45 27 -14 98
5112 98 -50 -32 28 21 12 -129 112 -60 95 0 -2 -19 -49 -52 47 125 -117 -11 -14 14 -7 -45 -52 -10 -41 -55 -4 8 23 17
5142A7j03N8j3J20j36%M8n5J54K7m0j48P5M8j32M7k3k5L8O7m7N6ln0o9J5L1n4
5170i7J38m7n3R7k9l0R4l9r0mJ23r6N5k5l7J3J92k28J53j16R0o3m2P4K5j19P7
5197A6o5m9Q4M1m5q9J00o8J16J9j46J36m1Pj8j00J86L7j41q2J84r0k9K8l2R6O
5224F1p1KM1N1m4K7q9M4J0k9mk1J30r4K1Lomo6o5J60j11Q5jr5L9j19J41k9k8K2
5255c9N4K8r6O3K5n1K7m9J16j25M9nj30J04J98j82l4L3N7q9N7n6K5N0j04J57q7
5282dp2Po6J25J16j4j12J53j54l2MlQ9k1n6%L7L0jj06J17Lmj12R2nL2J2m7Q0k36
5313a48J52j29J05N8r6Q3J7j15J62j66P3l2lnJ0J17o5j08O5N1j8P3o4O7l6j55
5339a07N4R2p4n1L5Q2Oj4L6r6J6N7L5n6j03J05NL5j1j30L9k4k2rJ14o5N6m9M6
$$ plain form
5142 17 -86 -28 -41 79 -57 -57 -9 -64 90 117 77 -71 4 52 -80 -33 -56 -81 -43 24 -23 33 30 -20 -89 -74 -43 -97
5170 -97 41 -6 -59 38 9 -21 73 34 -56 -60 63 -33 22 -3 -40 -27 165 -63 90 -26 64 1 -41 33 58 -61 16
5197 16 -49 -98 -14 27 -18 -107 -7 -75 41 60 -86 50 9 16 -2 -102 84 121 -20 -102 82 -8 -37 -9 -41 55 61
5224 61 -10 -8 33 84 40 67 -22 22 32 3 -1 -22 108 14 35 38 32 28 -38 -103 57 -54 31 30 -65 -26 -145 -4 -33 -61 -39
5255 -39 15 43 -53 10 35 -16 11 -38 78 -47 2 -3 -133 -29 169 -13 -47 -14 43 -46 11 -45 -20 30 -74 83 -4
5282 -4 -76 -69 -135 -10 106 92 -20 133 -21 -53 -49 -52 37 16 -40 -40 -3 27 26 -80 37 40 36 -76 16 11 43 55 8 88 -148
5313 -148 4 -125 -20 38 -58 25 42 -73 89 -77 -4 -36 -39 -44 -34 83 18 -90 -25 26 8 81 17 84 48 -107
5339 -107 -53 39 -35 -86 -51 31 37 23 59 -37 -21 36 71 15 -88 17 22 57 46 -84 -45 -69 -91 -100 14 -51 5 -44 2
5368BkpN4r1M9P1k0l0r7%P7Lp0N1O6m5j8K9J08j62kjN4R0j12Q4j07m4J17o1JP9
5400F6q4N9o7L2RP8j12j1P0Ln5pL1J9o4p3J23n4ON9k7k7N4k4JL4n9O6k8qpJ7n2
5433c2N3n2P3j03J4pqR8J7j02O7L5o4O8o4K5M0J5K1j33KJ23r8O7Pj14M1j3K4l1
5463c1J6Q0n4O4p6J12j43J43n4o4Q6l4j02M4M4k4r2j7R7JoJkJ00n6j22Q1M4j33
5492i7R4O2k2p9rQ8k29K58j32L2J36m6p3K6K0j19J0O1N2k4o6J69j02J3Pr4K37
5519A73j51p5L4o5J30Mo6OQ7n7Rj2j36L3Q9n6O9O4r8p9J41j0j1m9m0J39m6m8J86
5548A65j16pp6Q9R0j42M8m2o8QJ16m4qJl5M0n5j8M4m3%R9K6k2q8j1m5j5O7J11
5578F9l1j9jl4K6r2J5J9P3PO9k5j37J25Q1Mj29L4j78J90j0j32J51L2o1N4j32J08
$$ plain form
5368 2 0 -7 47 -44 5 76 56 26 -71 -71 6 9 -61 -10 56 11 -7 22 130 -32 -34 -35 19 109 -3 81 -26 -70 47 -14 -13 66
5400 66 -18 41 -26 6 15 93 -19 -30 40 43 -12 -19 12 31 -33 -106 17 -37 -31 28 1 -26 28 4 5 39 -20 46 18 10 3 20 -32
5433 -32 21 -31 42 -61 -47 -54 -62 36 53 -49 18 53 -11 57 -7 18 58 73 94 -39 -37 86 -12 55 62 -52 -11 -24 0 -31
5463 -31 -15 65 11 75 -1 111 -32 111 57 -7 79 45 -57 -13 31 7 -85 -102 -5 -4 -10 -9 -11 89 33 -89 -8 36 -97
5492 -97 -3 59 37 -42 -51 37 -192 66 -66 -34 102 56 -17 9 29 -90 -80 -19 33 9 -57 112 10 23 30 -64 173
5519 173 22 -53 -19 -84 46 50 -16 -10 77 20 29 17 -119 -86 3 -53 16 80 -18 -97 44 34 23 -26 -66 73 27 -21 165
5548 165 49 42 -34 55 145 3 51 9 -59 -51 65 21 13 14 -21 19 -36 -54 -10 -53 -53 46 72 50 -38 -49 -94 -109 -42 69
5578 69 38 19 18 -16 10 -82 -67 -48 25 32 101 76 -61 64 145 149 20 54 -124 66 56 -76 75 107 46 100 -32 76
5606G6J7k33J65l8R2l8L3q5J26j53QO8K8J3Nj85pN8K0n9J11Mk2l6J29N5j43Oj08
5635i3J44q9J36j10L1%nn6l3P9Jn7mM0R0K6k24J60P8l6n8k7K5J8o8J2P1OnRm0
5666B1l9O2Lj3K2r1pmN9o7p2R7PQ0r2J34j14J6l2R6j20K9J05j35L3N4k5K1LO9
5696A00q0p3O4n3K7k3M3K5J8m2J0m0O4j2m9m1J40kl7o0L5q2J11p6M0l0k3K2l0
5725e4q8J89J00k13Q7n8j1k1J12m8l1K7J3K3o7J03p9O6j06QM7p3J33Nk7j58R2
5752b9K5k6k5J08q0k8R4n2M2L8j51R6n6M7n0r3J46n3J19j48Q9m8L2L0j39J05R7
5779I0o1o1N1O3n8j42M9M3R3m2pL5J6o1j77J38M4q0R2K6J0j72O6O9p5L4k3j55
5807a95J55J2K7K6k6P5j9j59K10j27j7J11K3k01K35j02p5P5J06l7j11J12j40N8
$$ plain form
5606 76 93 -140 25 -13 79 41 74 -11 115 -38 -30 38 66 79 84 -101 -108 -50 -30 -89 22 26 4 -32 97 152 9 15 -93
5635 -93 51 -38 98 -12 19 19 14 -42 -75 4 5 -52 -56 -16 74 100 -124 36 114 78 20 -7 18 36 -32 -20 51 57 52 61 21
5666 21 -18 44 47 34 56 -35 -42 -46 13 -54 -126 -29 -22 58 -34 100 -14 2 -30 66 -54 -25 80 -55 -22 32 7 28 31 100
5696 100 20 -53 11 -42 -15 -38 5 30 48 6 16 -24 40 28 -21 -62 78 76 39 -21 14 -68 43 -33 7 -23 -46 -24 -54
5725 -54 -142 47 147 -66 21 -37 -48 -69 43 -5 -36 -9 4 27 -40 63 -16 50 -56 -48 -1 -74 59 64 37 -121 -29
5752 -29 -4 -30 -55 53 -27 -55 39 -13 29 67 -84 12 -44 3 -47 -140 6 -47 72 -76 13 -35 -3 27 -112 -7 90
5779 90 29 -32 19 82 24 -118 -69 -26 67 25 18 53 69 8 -169 -31 13 -67 25 51 61 -111 -45 24 -51 -17 -40 -195
5807 -195 -40 -28 -1 25 -1 74 55 -104 106 -21 -38 73 96 -105 130 28 -47 28 134 97 -14 98 -42 16
5831A6J0k5Oq8P5n0pL0n1Q6m6M0Q6j34R7o4Q4j57J18Mj1n7J38K0q6m6r7J09RR9
5861A08j9j33K2L7Lk7k3K0Q9p5o5Q7j63N4O5Pr7JJ02K0l1ll8m8N9O7k2K5M9n4
5891A7l2O1j0q0J55j12K8J9n0L3o0R0j15R4K5j11K0K1Q9l0L0j20J50r6j49R9O
5918b8M3n1R0m7J9n1RP3j6l8j05J62o5j10K03r8Qj2R7k05O2P8j25K9J01R7p2p1
5946b3P6j7ol2j7k1J10m8n1j22J85j06J6L8M8p3J00l7nM9m6l3kl1J32j5m1j03
5974g5M3l7l1J14m5N1P1q7L0p9J15j49q2J42J7Q5m8L5n7L5p8Mn6N1O1Q9o9j19
6002f9J14q6L2n0P3p9Q7jom4j2O2R6q1M1o5K8q3M3m7K1l0PP6M0M1j32l0N8j2j5
6033b3qJ4l9R3m0l2K9r5J75j11qL0P6q3k0M3J16j32k3P9o1L5q0R5l8j76J86l2
$$ plain form
5831 16 26 1 7 -81 -6 -56 -63 -33 -84 2 -44 -4 82 -52 45 -19 65 -92 26 30 19 -38 100 120 34 -12 -109 0 9 108
5861 108 89 -44 -22 15 18 -9 -32 -12 77 2 -63 24 -139 -85 -20 -13 -110 -109 -7 13 -18 -21 -59 -107 -48 19 -3 22 71 17
5891 17 -15 46 36 -44 111 -1 27 46 -4 29 -31 59 -56 38 63 -48 -28 -7 82 52 82 -38 112 16 -133 -34 -28
5918 -28 15 -36 54 7 26 -25 -16 57 41 3 -102 60 -5 -115 88 -10 -2 -14 83 -122 -60 18 -107 -78 23 120 48 -23
5946 -23 53 36 30 -2 -19 -40 70 22 -29 -151 34 -72 -56 -18 30 -43 57 20 15 64 18 -15 -17 -48 84 69 28 -75
5974 -75 -32 -69 -100 14 -31 20 91 4 34 -45 70 -79 -161 -19 -2 83 35 70 13 48 -30 -26 -82 -31 30 119 50 -69
6002 -69 45 -41 -9 -59 14 -65 22 21 15 -29 -41 21 117 36 77 12 40 -43 0 -47 -26 -56 -49 27 67 108 -24 -54 4 -8 -23
6033 -23 -31 -17 -56 37 -3 -35 -6 -101 74 -37 -45 -15 61 -22 -42 1 117 -15 -38 41 -20 15 -65 30 -8 -184 2 -30
6061c0j1J5M9L6p2M5L4j76Q1J15j46J1K7L1M9L6k26J33P2l8L4Jp5J5R8j44KPp
6090c4J1m1Q6LL4k8n7J12mp2k0M3p2M7n7Q2M9r6p0pJ49j22R4Q0o3oo9j06J98o3
6120AK6J4ll6N4o9O5n9j40J72kR9j42nj8Q2q9L3p2K05j27%n3jP5j0m8J58r5N6
6150G1O4j99N6j81J84oM2j2l6L1p8O7j41N8J24R6k29J06j32Q6J0K0J32j04jJ2
6176D0k3Q6j57m4J83p4m2M8J27q7j08P0M3m3l8L9k8KR8n7n4j5O7k0n1K4k2%J8
6205a8Qn9O3P3j14k2N5m1mJ23k2m0l9L1N8Q6j48J9R4j60n2N2L6N5j11J16k6m4
6233c1L9K6q6M8J23J4j52M8j06Q5K6N2j61LM3j9M2K5o4J21p0q0R8j75J69p3J25
6260G0M1j80K6M4N5l5m1J05j19M5J06p1RN1j40J22q3K3q0N6O4L4j7j51q8J29M8
$$ plain form
6061 -30 -41 -26 23 59 -13 32 66 -110 -29 86 -60 -49 -22 9 58 94 -132 1 73 35 69 70 -5 10 108 -36 -34 -27 -34
6090 -34 -23 -64 22 25 59 31 -26 86 82 10 -10 33 -39 8 -49 33 82 -14 -84 -91 58 -64 30 110 47 41 -28 -134 64 1
6120 1 27 41 38 2 56 -13 52 -7 -147 25 23 122 -20 -25 -43 39 -50 -17 -89 116 -11 -11 -64 -65 10 0 -48 110 15 71
6150 71 135 -64 -8 -189 -5 -11 31 19 -17 14 -64 3 -138 -80 44 140 -89 17 -115 -29 -19 1 133 29 28 40
6176 40 17 103 -54 -98 85 11 -31 17 144 57 -51 19 62 19 -19 20 -8 -6 92 35 -19 -34 33 13 -38 -14 -36 -36 -18
6205 -18 -10 -69 -6 67 -47 -69 -14 -55 -59 64 42 2 -37 -6 52 138 -10 9 103 -57 -109 -57 -21 34 -77 39 13 -31
6233 -31 8 34 -52 -4 119 133 -19 29 -77 8 34 86 -75 -72 -29 -48 -6 19 -45 76 6 -74 24 -151 18 -55 70
6260 70 111 -69 -43 1 56 21 -20 85 -34 11 117 46 55 106 -34 88 5 28 -52 4 68 102 85 -66 -154 -25 23
6287B3n1J07J3l7J5j35j6N9k5l7J21k0ko8K9N4m0J14j21m3N9JK7j8Q7j00Ln4O9
6316A4j24R3Pm0N1p8J8R4m9K4j2J11r3m0J07o8N2n8k7k8J6j1J5J18n1P0p2k1j46
6345a28J45l5N3K0O1p3j2Q2k52R8l7P6K1J1Jk1j02R2mL5k6r8J01Rn1j03J3J17
6373gj01P4m5R3Mj74J25J4Kj23R4Q1l2j00J40r5J26j20M1O3j29J21L9m0m9q2O3
6400a7r7R4rj6P4j0j6N4l4n5j5O8n1l6R8k2k0KJ9j1n8P6L1r0oJ50j39K5rK6K1
6431B7l6L7OK5k4k5k1k5J73l8n3m0J32o4j14pJ00j38P8l4N6o5j2J37rr9o0J37
6459D4j00J40k8j19J5K5PN6o5m1J86j61Q5k3j56K25j35R1r6Q3n1J12j16Op6J37
6485D5N7j19m7N6K1m7N6j52J65j6j90K48j25O4m6m3P0O4j61J09o5K0J3k1m0K09
$$ plain form
6287 23 -28 79 92 55 70 -65 -81 -22 -47 -84 37 17 15 -53 -24 30 -10 104 -17 -60 -1 0 27 9 96 -4 -1 -55 14
6316 14 -110 -17 -10 -50 1 -77 -59 35 -14 10 -2 109 16 -24 83 15 67 9 -18 -46 -30 -41 -26 92 41 111 39 18 -128
6345 -128 17 -18 35 55 116 43 31 113 -139 -41 -78 -2 19 30 31 10 -92 0 -4 31 5 -93 8 17 -34 -137 -124 -7
6373 -7 -108 -34 -79 14 18 -156 -31 -17 -15 -138 -44 37 5 -95 45 -50 76 -44 -3 60 -69 52 91 51 2 -80 -17
6400 -17 -114 -20 -29 -45 29 19 3 57 23 -32 -47 21 -30 -66 32 10 -10 -8 11 0 -58 18 49 -41 -47 103 -36 -11 -20 6 27
6431 27 -9 28 34 59 35 10 -11 -36 137 99 46 6 138 74 -40 -47 53 -85 -7 -41 15 -50 -62 75 66 -33 -93 44
6459 44 -56 84 56 -63 -48 -23 -16 40 -25 -66 120 -41 44 21 -135 90 -45 46 -50 33 -18 94 -22 -16 -92 45
6485 45 102 -17 -64 -8 13 -34 22 -130 35 19 -171 77 -48 16 -30 -73 -3 61 -100 9 -56 -36 -23 -44 -84 125
6511A25o3j03P5J5j8l1p1P0J77j34J3j6p3J36j27o6K3lR3j41J17m8l5J45n6k1
6537a7J2j9J21j28J2o6O5J23Oj40J10j22p7J09j14M9J39mj34J14m6k0K9j1oQ3
6563F8RK9j69Q1j09R3l8k8J74r7k1qqR6p3J6n8N2L0q1M4L7K5j41J38j08J39Kn2
6592D2%j6J0L7o3p6N2%Rj2q1K4K2J03R8j13n3J32n6L0m2m5l2j10K17j76J39j35
6620i5Q5L3m8j7J03m9n2l9M9k2J6O5k6j04Q2N3p5K8pl8J22l4p3N6p9J38p3J21
6648A20j24L9j9P6j29J0p5J10KK5k4Jn7J26p9N5o0k0o0P3Q7j28M2L6k8n4P1j2
6676DL7Kl0q1P1K8pq9O7K8lNj13J46o4O2m7Nn4J40o1m0J3N0L3r5Q7r0r7J00j01
6707i4J29j19P8%j8M1mp6R8n6m9J4K1P5m0Nn3J78j27O0j13j30K32o0n1K26j33
$$ plain form
6511 125 62 -41 34 49 31 0 -71 -1 176 42 55 39 -34 102 -25 -91 -68 -71 22 -119 -2 -50 -85 60 4 -17
6537 -17 -5 -24 97 -31 -19 -85 -20 103 109 -31 79 -43 -120 -11 -125 -76 63 59 -75 39 -7 -27 2 -9 -15 68
6563 68 77 106 -63 18 -91 2 -36 -64 110 13 -8 -16 -24 72 -1 15 -43 9 39 -42 2 39 64 -77 61 -47 92 94 42
6592 42 42 26 36 73 10 -66 -14 -14 -5 -17 -98 -74 -52 51 149 36 -17 115 59 89 47 2 -30 -140 77 -99 40 -95
6620 -95 -10 23 -25 -42 61 12 -40 -79 -30 -52 -36 29 3 -101 -19 34 -41 -13 -20 -58 64 30 -43 13 -66 72 -1 120
6648 120 -4 35 16 92 -37 -27 -102 8 10 35 11 12 -45 81 2 57 -3 -23 -83 -10 77 -51 -9 27 -1 -55 16 4
6676 4 41 43 13 -68 3 31 24 -65 2 30 27 32 -81 65 1 63 16 21 -33 107 46 6 19 69 102 7 94 4 -93 7 -94
6707 -94 35 -84 -6 -6 -24 17 13 -63 35 -21 -70 -56 -35 40 0 5 -48 130 3 63 -50 -180 52 -8 -59 167 34
6734C4N9p8M5M9j56O5mJ1j28J65p9K8n0Q0rR6j29J03r9M2p4O1mp0l4P8J5q8JJ1
6764e9N9r8N2O9J48k10N0J8Or2M1N8N1j40K9k5qQ2L2j25M3RJ1O1p3rr5J65n3J22
6794A19j83L9O2j15J24q6Q5j22J21J1p7j0R8Qj15pR9p3N4j12J19j02J38l1L4o1
6820A7m5J2J3lN8m3Qln4P1J2R5j59k2L0K8n6P6k2q4Q3qOJ9l7L2O3n0n1O8j09J16
6852F1n%M1j60KJ4Q3j43J62r2mk7L7J51o7p9j31J75LL0j3J4P1j12l4J33j51K2
6880a9j21J43m8O7o3N1RN8l8l8r0J31Q0j77Q2k0J89j60n6rK9J75k21J2K5j7O9
6907D3k8K8r6J02q3K5L1r5K2J16m9j13L4P1m5l8j6J24On9O5r4Q4K0Oo4p6J03k5
6936aq1N2J3J04j23J25%m9P3j02k5p8L2Q5J36j37J07k39J16M3j00j5J6j8J13r9
$$ plain form
6734 34 93 15 60 109 -47 18 14 25 -103 62 -17 11 -39 41 32 128 -1 102 3 45 -29 32 28 -42 -76 2 17 -71 -70 -59
6764 -59 0 -98 -46 23 171 -39 11 29 35 -57 -16 42 93 -47 -18 -43 -51 31 63 -62 -19 -10 1 62 -11 -20 -115 50 -3 119
6794 119 -64 -25 37 -78 46 -40 45 -77 44 55 -22 -32 66 74 -41 -48 51 -22 32 -80 39 -63 75 44 78 17
6820 17 -28 -16 -3 -6 52 9 17 14 -40 31 43 138 -21 -43 -13 15 -41 35 13 -71 12 4 10 29 -8 24 87 37 -14 54 -55 61
6852 61 56 56 97 -63 -61 -47 36 -107 55 -37 -41 -68 -31 120 53 -26 -157 18 21 51 38 52 123 11 -23 110 -41 -19
6880 -19 -140 3 -45 22 -41 10 19 77 39 1 -89 42 122 -55 27 7 196 36 -20 -29 0 175 -46 -34 -9 -26 43
6907 43 15 43 -53 49 -34 -9 22 -73 -51 65 16 -97 -63 8 -37 -75 -91 33 39 -20 45 -49 35 55 61 -3 -79 24 -1
6936 -1 -82 -30 -17 87 -36 89 89 40 113 11 -14 -92 -60 25 161 24 131 -108 8 51 -49 -64 -48 -66 47 -52
6962e2L9L3pL6o8j51J61R0k02J51q4N1q9Q6l4J2KJ03j93J05J01Q8j39j27J11p0
6988d7Q8L4l9q5J5R7j05l4J60j26o2K19j76j2J17r4J07J4j5l6j3r3Q8Qq9J29j7
7015C3r0J16O3j05k3q6O3N6k3L6l1J0l4n3J92j47Qj4JM2j1l7nJ65n4j53P9L7m7
7044a2n1N0p5Q6O1l2q1M3N9o2m5R1M0j19Q5mp9P3n1j05J08P3J9p3r2J68n6l2L5
7073B2m7Rj4L9J3N8l6r4Q7O3j83R3L4L3p1l2qQ7m4J49j53L1r5P5N1p3l8Q1K3q6
7103b6L5p2kL7M7j03J31o7p7J27n9N7L6k11K61j06Rr3K2J28q8n9N4N5q3N9k3j10
7131a21J19K4K0j25O5l1k0mJ18r0J7J06pr7N1m0J4R6n4p9R6q9L4o1O8p4J86r7
7159B5L9M0k33R6Q0m8q0J51j32J9J34l9j15ML8J31j67Q3j02P2j25J28k2J66k85
$$ plain form
6962 -52 -13 20 13 49 -19 -170 -9 81 -121 30 -54 -3 -92 -6 -40 -28 -26 77 -116 -11 90 178 39 -88 23 -47
6988 -47 41 75 36 -49 -34 63 -42 -76 84 -42 -104 115 -61 -73 44 -50 57 71 56 20 7 -86 2 10 -79 50 33
7015 33 -57 59 122 17 -6 -92 -29 27 4 40 9 19 -15 -68 124 -23 -15 -29 -28 14 3 -34 -39 126 72 -81 -2 35 -12
7044 -12 -63 -13 -88 -2 59 27 -54 -11 48 -14 -59 32 72 -47 38 34 -45 28 -23 -128 -20 53 72 -1 -93 75 19 -13 22
7073 22 -25 -16 -30 9 22 80 44 -50 37 100 -83 10 44 77 6 -26 -34 53 9 158 5 36 -59 16 67 -6 -44 37 60 -26
7103 -26 9 -63 -65 -28 19 -84 47 -20 -97 30 -29 28 64 -147 114 8 17 -76 -54 74 -14 -73 -19 36 -47 12 -11 -121
7131 -121 -2 22 42 -83 -18 -49 -69 -73 45 -45 -28 78 71 -26 25 -15 -1 95 41 -38 58 -31 3 -58 10 -64 122 25
7159 25 64 104 -129 -33 47 -1 -81 70 -62 -43 91 52 -63 -59 -21 110 -57 26 -76 -4 -129 -1 -23 143 -142
7184a42K00O9j50m6J68p1n3L5l5Q4m3o1R9q2M5oo3N3Q2m9M2j24J28p4L9j13K00
7211A32j64j7P0m9P6k1pj08L9M5j56J31O9o8J8J6j0M1j47Q7J1q6J42Rp4L0k2K6
7239A3O0N6j08j02nJ40j0l7R1l8j38J39L4j30J22j18o4R5J5Kj7O8j40j7P2q3Q3
7266a7L9ON4l9r8J15q6J20j15p5J09Q2j26P4l0o3J14k0k3q1Q1o1n4L5Q0k2O1o5
7294eK1n0J11K9j23P7r6j4N4j48nR7M6J4n7R6p4O8o2O5Q3k3K6k85O6J48m8n4J6
7323b7K3m5j0R4m0q8J32J10j73L8q6Q6k1M3J1N4p5n7o8J70p2o3R8j3K4ro9jO2
7352B8m6NJ18L2j39lP3o2O8k12R5k0J02j95R1R7m0p4J05m6J26q4n8J20j02r5J81
7379F5j7q8RJ33p9r1K05q6P1j28j03Q6M2j59K78r7M3j42J81j35qO6n6j07J07o7
$$ plain form
7184 -142 58 127 -23 -69 99 28 -25 10 -25 59 16 -45 54 -28 17 11 -52 1 83 34 76 -48 80 6 45 -68 132
7211 132 -32 -49 21 -28 48 27 20 -88 -49 -4 -160 -29 40 -28 -10 6 -4 37 -110 -23 -12 -98 44 53 -21 9 -13 13
7239 13 73 129 21 -81 -86 54 44 7 98 60 -78 61 95 -35 87 -31 -95 0 15 17 0 68 -72 -89 -17 -100 -17
7266 -17 22 28 82 43 -55 60 -26 94 -21 -96 13 95 -31 43 13 -50 64 44 21 -60 21 -40 -94 -59 21 -1 60 -5
7294 -5 16 -34 77 106 -17 60 -36 -50 4 -144 -149 -52 -6 8 -49 47 -27 41 -21 44 127 104 130 -155 -89 59 11 -43 -27
7323 -27 -4 -49 -59 35 -5 -93 39 149 -24 14 -72 14 -7 36 47 101 26 -31 -99 71 -1 -64 34 21 45 36 -33 -34 28
7352 28 -18 -13 105 137 -2 -5 68 6 74 -138 -43 -63 39 -156 -65 32 -8 -82 23 -23 103 19 -39 81 -21 -116 65
7379 65 48 -40 -31 102 23 -68 137 51 122 -6 -109 -23 19 -140 138 41 84 -58 123 -12 -20 46 -10 -117 -10 -77
7405g7J01L9j31O7O9P2k22K2Q0j12P5k0p5J38nkj6j83J81j8M2q1R2n7k1M5M8q1
7433c0O8ln0J04k2K8n7k5q4l1j3J07L2l3Q0p4p3J08p2J44r5j23J01R6q1MlM2k2
7462B3J3k7R5j18r6K4J46k0j54J86q4j7j1J8j0N4L0o1Nj1J06k19L1L4R6j9mK6
7490C6j47N4J14r8M8p3J15q7L4Q8j67R4J8n3j2j6J38o9p5P9Pj0mJj6J23k46K02
7518G8m6q0L1j7J02j00O7j11J53j68R3l8Q6o6Q6L3m9o6O8j23J12Nm4L7n9P8r7
7545c5M8J4r4J38j33j7O3L9J2j5p7P0l2J3n6j7Q8m2Q7k3j07O3P3j07j3J04n3p7
7573h6L7J2n4R4K6p6o9K09j65R2m5K8q0R6J1J4k8LJ6j5n2L0J3n0o1J86j41R2j03
7602f6K4O0r5M9L4n1j9J10j23J7J14j88J35p9m2L6J17p9pM6L1J04m3r4J5j00M2
$$ plain form
7405 -77 24 63 -68 -1 68 140 -82 -60 20 -92 -17 -37 -112 26 21 19 3 -180 1 -17 25 -56 36 -21 -42 3 51 -30
7433 -30 38 35 -15 89 67 95 38 13 -71 -102 -115 -8 24 -9 71 -3 -76 32 -40 104 9 -114 -13 83 2 6 3 45 23
7462 23 36 9 104 -14 -110 -86 60 40 -114 72 -12 -29 -40 -22 -32 22 52 -9 -4 -15 91 -128 -97 -63 33 14 10 36
7490 36 -111 -57 57 -41 7 -66 49 -38 -4 84 -83 11 29 -24 -36 -52 86 17 -58 21 28 18 14 15 -1 122 -124 78
7518 78 32 -48 -17 -34 68 -32 35 -76 77 -91 2 -36 50 -16 70 103 54 -12 56 -67 45 50 6 43 -16 62 -35
7545 -35 13 27 -67 71 -62 -79 -16 23 35 20 -57 13 -19 -6 -62 -79 9 -33 54 31 -76 -13 60 -47 -60 44 -9 -86
7573 -86 -49 -37 -91 3 29 -47 -116 93 -72 20 -25 3 -77 19 30 44 16 19 35 20 -32 -2 11 -39 -100 86 -55 37 -66
7602 -66 -42 18 -77 -28 6 -45 -64 46 -77 -60 54 -134 1 -78 -120 -84 33 -46 -53 -7 24 128 85 -9 6 -94 -52
7629e2Q5m5rk1O5L8q7k6R9o2o5R5o3l3L7Lj5K2N8M6j45K1J40j50N5L6K1j40J26
7658C4j8p7O3p3J16M4m7L9Q6j89p5J27l4Pm5R4j3L5L8k01J48o9Pj16K13K1p3r4
7686e2J20j18J11j01L7j1lk5L4O9j0n8o9K18r6p2n8R8K3j53l3J65k7J04q8JL4
7713D0Rj4o7K8o7J55j44O4k3j5L3K6M8n6p6pO8nL2r3K1l5K0M0o0P3j41N8J14k4
7743Bo8J11oj08P2m6Pj2J38lo5j14O5m4K9J05j45n1KQ3J9O5JL3n2o8O5M0r1O5
7773B9O6j05j1n6J04j14J03j20J95r3M0J5m5N2n4N0k4o8NR5j17l6N5L4oK9q7J0
7801e4lM6Q3k2j38R3Lk8J0J61j29j0k4P7q9L5n2L4N8n8R8j29NN7j8o4L4J5j3P9
7831E7j37L5R3p3L5j2n3J20Q0Rq4l1j8p8R4k8j28J18L6k7q8J8O9J6J8q3J20j99
$$ plain form
7629 -52 33 -12 -21 -42 23 61 -26 -52 47 -15 -80 15 -48 -81 -44 -41 -56 -34 24 70 -75 -54 86 -64 -9 27 48 -92 34
7658 34 16 -61 2 -71 45 89 42 81 167 -22 -97 30 -4 3 -42 52 39 74 112 -89 59 -10 -3 -119 94 115 42 -52
7686 -52 68 -50 61 -40 -3 -14 -17 -42 -8 61 51 -7 -76 142 46 -26 -84 14 37 -116 -149 16 -11 93 5 6 40
7713 40 49 35 -32 -4 -71 84 -60 4 -19 -34 -1 25 73 17 -59 -66 2 -3 29 -64 -43 -78 -58 -18 -78 -5 -146 -88 26 2
7743 2 -66 45 39 -69 3 -43 -36 -48 90 87 22 -92 -27 -71 -42 63 -82 -133 -131 -48 -29 36 37 70 18 -50 15 55 -36 29
7773 29 95 -10 -21 -77 27 -87 16 -104 91 -2 38 53 8 60 6 56 32 -36 -31 64 -53 -89 -34 0 -6 23 -64 -54
7801 -54 -57 -11 72 50 -88 5 8 -20 -10 151 22 12 -12 65 -24 11 -41 -7 51 -7 91 -38 -33 24 6 -58 -24 -9 -22 57
7831 57 -80 -45 48 -25 10 -2 -55 65 145 154 70 39 21 -57 37 9 -119 -1 35 8 -80 -62 7 23 41 -42 78 -121
7859a21J8N6M4k3M3M4j19R1J4r1O1p4Q7NlP2j53K2Q4Rq8O9j15q7J28m0n5L8N9
7888b5J7J1O2j15N3M2j2l4r8R3Q0p7k4M1o4K4K2O3j25O0R1j34R2l7M9k3q1j9J8
7917e0M0%k1R4q6J28j18n6Q8j1r4R2K0j0J0r8P8J0O9j69L1K9L4R5Qp5k6M3j05
7946e0M2j6j4R5j47K03J3rj38J05o8K2L0j9L2j49J06j8j04J94j18j2J09j19N8
7971B8j12J41k0M6Qq0N1rl7Nk9P4N6j38M7q4J60l3o7l2O2m9N2o9q0M9J13j0j5
8000B8k4o3M3M7m6O9j5j3p6R8N2o9o2M3n0K0k8J44p6lK4k4P7j73L4Q4rr8J15m
8030D5q6J60m7j94J73p2R7k5L1j55R1J6J13j33K3r2J74j0m7M7j86J79j00J05q6
8055B1K4O2m4J9r6k0P2j3l1K5lJ2%l9q8J98o4l7%r8N3J02j39J23J2k1j5m3p6N2
$$ plain form
7859 -121 -103 -47 -3 -26 17 61 -58 33 47 -44 17 -57 30 35 32 104 -49 -27 57 66 -22 47 -68 -155 -27 -67 -122 -84 -25
7888 -25 -8 3 65 -50 3 45 33 -1 -99 -6 74 -3 -27 14 -50 -26 -4 59 -66 -6 85 -49 43 6 55 32 -49 -68 -50
7917 -50 -10 -10 -31 63 -23 105 -13 -69 19 8 -86 6 26 16 26 -72 6 16 85 -84 -53 -24 10 105 113 38 12 55 -50
7946 -50 -8 -24 -38 57 -90 113 126 117 -21 84 16 38 68 49 81 -68 38 20 -84 110 -8 -20 89 -30 28
7971 28 -84 57 37 83 91 11 62 53 16 21 -8 66 122 -16 31 -53 107 74 7 -25 37 -12 40 -29 -109 -60 53 43 28
8000 28 4 -59 -16 31 -15 54 39 26 -50 48 100 31 -31 12 -38 -18 -46 98 22 19 43 19 96 -77 -43 41 32 -66 49 45
8030 45 -41 119 72 -122 51 -21 76 51 82 -73 18 34 147 14 37 -55 119 109 62 109 -77 102 2 107 21
8055 21 45 107 63 82 -14 -34 38 25 -6 19 16 28 28 -11 -99 99 35 -2 -2 -100 -47 55 -84 39 51 30 15 -28 -104 -52
8085e2J6P9JM2q5%P4r3L1O7j43K9pKJ03k29R8R9n4j4J15l9j8N8q1j8j3n1J00j52
8115a35J01l6J48O8j15kj4k8O5O2r9J1q4J31n7j02P7PL4k1m1J22j50J69k6r4J30
8142A21l9J1R1k68J01Q6j12K4M5r2j35J31M9L1m1L5r7Q2n9q4K14n1l6n7M8K9P
8169C4o6J0l3J8Q2N6j93J0N7J11m6r0K9N3n3l3J68p0j61M7J37p3
$$ plain form
8085 -52 -36 43 44 86 1 1 75 -18 13 80 -63 -34 -41 -39 64 -165 -67 32 -22 -36 79 40 22 80 -1 -19 -32 -83 17 -135
8115 -135 -34 -70 78 146 31 29 15 -13 52 114 15 26 -58 73 16 -86 -9 -2 32 11 -30 92 -58 111 85 -9 121
8142 121 82 93 184 -84 17 103 -9 15 60 -32 -167 -36 13 44 3 38 -59 23 -36 -120 94 43 7 -50 -2 27 34
8169 34 -32 -22 -55 -37 45 101 -92 -82 -25 86 40 -50 -21 32 -21 -54 114 44 -117 -70 67 -6
8191f
$$ Imaginary data points
##PAGE= N=2
##DATA TABLE= (X++(I..I)), XYDATA
0@%%%%%%%%%%%%%%%%%%%%%%%%%%%%%jKnRj2J5j6J6j6J7j8K1k4K5k9L3l7M0m2M8
49B6n5N8o5P2p7Q7r6J05j17J30j45J66j91K20k59L11l85N00p07J197o458K618
71c065N059l051J170J305m51J103j361J77L099l847n17K938k854j083J692j659
87a345M85j078o36K932k110j037M230j570j223K975p32M39J57r95K417j497k298
104h86L179j366k785K289q16j175L50j143J840l21k460L605M33k674K983N08j187
121C74J107o57J087K41k983K274O49l927J689P24k608R03m08J26J068k216J829
138g28K111l096J630K212j953P61N86k79R16k011M66J787l392NK178k705j11R42
156f81j004R86j089K02K755k127k83L433j597n69J905p79N31o85j001K168j980
$$ plain form
0 0 0 0 0 0 0 0 0 0 0 0 0 0 0 0 0 0 0 0 0 0 0 0 0 0 0 0 0 0 0 -1 1 -4 5 -7 8 -8 8 -8 9 -9 12 -12 13 -16 17 -20 20 -22 26
49 26 -29 29 -36 36 -41 46 -50 55 -62 68 -77 89 -102 118 -141 170 -215 285 -422 775 -5683 -3065
71 -3065 1994 -1057 113 1418 967 2070 709 886 3985 138 -379 2559 -295 -1378 314 -1345
87 -1345 -860 -1938 -2574 358 -1752 -2789 1441 -129 -1352 1623 891 1330 1487 492 2909 1412 -886
104 -886 2293 927 -1858 431 -385 -1560 -1210 -2353 -513 -834 -3294 311 744 -1930 1053 1561 374
121 374 1481 824 1911 2152 -831 1443 2092 -1835 -146 578 -2030 -1127 -1535 -1409 -341 -2557 -728
138 -728 1383 -1713 -83 2129 176 937 1523 1244 2160 149 615 2402 -990 -985 1193 -1512 -1623 -681
156 -681 -1685 -699 -1788 -1586 1169 -958 -1241 2192 595 26 1931 1152 1683 998 -3 2165 185
173A85j722K802j739j824J926q93q7K54p61K323o79j696L464k71j995K599k15
190A671q34N82j092J060k50k662J975J70l057J571M13j392Q73o39R10R52j900
207a649K055J556k676J677J322j820Q25k89k35P72k345O17J395l194M89J728k131
224a903M02N71p7J137j206N39K562k166K2K672j657k60J006r76N27j067p97J978
242A307k313j248K631j626q74J556n47N64J42o03K410q57j302K942o05j615J804
259A766o41l51m2j405J411p56k427K439k61k308J888O5m99R97o95J231P23j953
277h18K249Q04k431J479O27j563M57r22J38N40k454J058J266k732Q76J473j505
294a458Q12K92K72J113j343O84K273k365J90J854j756j82K15o41M74j406m69K030
$$ plain form
173 185 -1537 1265 -474 -2298 -372 -1265 -1352 -1098 -1859 464 -215 -1911 1553 1282 -713 1886 1671
190 1671 837 1419 327 1387 1137 -1525 450 620 -2437 -866 -453 -1845 -972 -1611 -701 251 -1649
207 -1649 406 1962 -714 963 2285 465 1290 1001 766 1538 -807 -190 1205 -1989 -1500 228 -1903
224 -1903 -1501 -930 -1007 130 -1076 -537 2025 -141 -119 2553 896 636 1642 666 1193 126 -671 1307
242 1307 -1006 -2254 377 -1249 -2123 -567 -1114 -550 -408 -1011 1399 542 -760 2182 1577 -38 1766
259 1766 1125 774 732 -673 738 -18 -2445 -6 -267 -2575 -687 -622 -1121 -124 -819 412 1135 -818
277 -818 1431 2235 -196 1283 1910 347 804 -118 20 560 -1894 -836 430 -2302 -1426 47 -1458
294 -1458 -646 -354 -82 1031 -312 372 2645 280 470 2324 568 386 601 -40 434 -972 -1441 589
312E89k186n86K391j335k44J449l74Q59l30l59K213j123j335K704j274j079J069
329A049r38r8l78j189J682j033j584K371l74j445J759R6j40Q30p79J595K46k058
347c88K080L26k433J280p2j195K40r78N86M29k313J553J042k082J190J177j026
364e84Q03l1N74R99j851Q84J565k365J79J223j651k5k11n63R29j661J13K133k059
383a599J10K118j085R5R66k55J210r90k89J991j640r25J897j327j045R23q97K92
401d50m73r60J839p80j169K474m78q40J457j4L11J81q76J522l01j965J806l93
419H91j814J047m61n14K81j018R29M30j837J719R60j846J571O59p14Q84o17N41
437A091O66j914Q61J000k501M66P41j404K80l33m2Q22j520P65J911j830M74J678
$$ plain form
312 589 -1597 -2183 208 -1127 -1371 78 -296 563 233 -126 2087 964 -371 2333 1059 -20 1049
329 1049 111 13 -365 -1554 128 -905 -2489 -118 -492 -1937 -178 -82 -222 608 -171 1424 1670 -388
347 -388 1692 2018 -415 865 793 -402 -162 -1140 -554 -125 -2438 -885 157 -1925 -735 442 -584
364 -584 219 188 762 1761 -90 794 2359 -6 173 1396 -255 -280 -491 -1054 -125 -1786 -1673 460 -1599
383 -1599 -1489 629 -456 -361 605 350 1560 570 281 2272 632 -293 1604 277 -768 155 -742 -450
401 -450 -923 -1883 -44 -824 -1993 481 3 -837 620 606 917 1098 222 1744 1443 -522 1284 891
419 891 -923 124 -337 -851 -570 -1588 -659 -229 -2066 -347 613 -1233 338 997 283 1167 550 1091
437 1091 1757 -157 704 1704 -797 -331 410 -994 -714 -1047 -1089 -267 -1787 -1022 889 -941 -467 1211
455A211q90L69L08k47R45j283m18J753j865p76J678j404m87N44p11P82n71m23
473a485K049j029o86K309o16n12J282m68L86j96j049J500q39j756J712n15j450
490a363R12m61N0J57q15J435K29j433J824N58j439J168L08m38M43r94P47K33j997
509h76J045M63j917N54M60r63N00m39M60J048j428Q76J617j649N82J160q33K47
527I07j54k48P85j592j32J447j856n25J434j135l4L85k10R28n85j70J923r65m16
546b13J833p76m00O53o60N99n56j183J575j065j414J600p01p82R60l01M22J24
564b85p75J760J35j350J824J01j237R03j70l48K06j166P31J6j832J092M10j542
582a527Q46K59m09N45m30P89Q91j453R92J278j640N08O29q53L00o89j04P00j751
$$ plain form
455 1211 321 690 998 751 1696 413 -5 1748 -117 -893 785 -619 -1106 -562 -1273 -491 -1062 -1485
473 -1485 564 -465 -1151 1158 542 30 1312 844 1230 1034 -15 1485 646 -1110 602 87 -1363
490 -1363 -451 -912 -862 -705 -1520 -85 144 -1289 535 1093 -346 822 1130 692 1135 141 888 1121 -876
509 -876 169 632 -1285 -731 -271 -1234 -734 -1173 -713 335 -1093 -217 1400 -249 333 1493 660 907
527 907 753 505 1290 -302 -434 1013 -843 -1368 66 -1069 -1103 -718 -928 0 -585 -755 1168 203 -213
546 -213 1620 844 444 1097 437 1036 480 -703 872 -193 -1607 -7 -708 -1490 -530 -831 -409 -285
564 -285 -1060 700 835 -515 1309 1410 173 1076 906 558 764 -402 329 345 -1487 -395 15 -1527
582 -1527 -681 -422 -831 -286 -716 73 964 -489 503 1781 141 649 1278 425 725 36 -68 632 -1119
601a119K39J241j694O7J092q32M68J65j0J244r28l7J973j262m38J513j131j79
619C72Q4o02N39q74p64J372q82r42J441m10k21O71k15Q26r9o82J696l54j192J546
639A310k32j084O57n38n3L9j215J036r2j594J198M16j066R30J27J9N96p27J041
658G68O57j585J035N72j519N49J38o27J44q71J77O39j547N87J052j304K58J060
676A83o17O86j03J72R76j103L9J477j289l44R68j035J8j23o46Q02j020n00J722
695B63j037m85J481m54r9O87k56R08k54q76J596o26j096J159n03p98L17m59J39
714c93j13r89J252p4j118J270K71o44Q17o8L05L38p87R06K08j304P37L68j430
733d48L44r4l47L43j016O01O70j482Q73R88j043N35N04k22N20n09L93P86j269
$$ plain form
601 -1119 -880 361 -1333 -1266 -174 -1006 -538 -373 -383 861 -67 -104 1869 607 169 1682 551 372
619 372 456 -146 393 -481 -1245 127 -755 -1697 -256 -666 -887 -216 -431 395 296 -386 1310 956 -236 1310
639 1310 1078 -6 651 113 60 99 -1116 -80 -172 -1766 -568 -152 -1218 -288 -161 -142 454 -273 768
658 768 1425 -160 875 1447 -72 477 615 -12 132 -739 -562 77 -1470 -883 169 -1135 -877 183
676 183 -434 252 149 321 1297 194 233 1710 421 77 1045 10 28 -95 -741 61 -959 -1459 263
695 263 -774 -1259 222 -232 -331 356 100 1008 754 -122 1474 848 -248 911 408 -390 -73 -532 -393
714 -393 -506 -1495 -243 -317 -1435 -165 106 -538 279 211 516 854 67 973 1181 -123 614 982 -448
733 -448 -104 -198 -545 -202 -1218 -617 53 -1429 -556 432 -611 -76 428 206 726 217 610 1396 127
752A27R3J082j560j59O60p70R4l01k80R93j060L4J534r53r6J243m04K19K14l66
772C44Q80n55p13J285r11q30R67o86m88L25m82M62j66p37J452k19q64J423P2m72
792H7O53k52M13j0j000Q78jj440J057k13j006M92l91l6L68p31P35O26j071Q74
812C2Q01r87N58L30j34L61p12J59P76j576L33O69j318J12L62m83K63l36R6J064
832C70j008J56J417q41N0Q58n36K42j84j79O03r33m62J118j100m98Q67m83j94
851g37K93m56Q67k10n28J452j79q29J266l19k05L63n19N26l36j129J000k07j212
870a099Q81n0o06M47k70L12L02o14Q72N37j176J011K97p94N41L8p9J04r91N38
890B01J55j696R44O17r72m9P54K45k40m85j09J017m44O37N13p16n0M98m92L29
$$ plain form
752 127 220 1302 -258 -417 243 -527 -433 -734 -1014 -21 -1081 -1047 487 -466 -562 681 277 496 710 344
772 344 1224 669 -44 1241 330 -500 467 -219 -707 -382 -864 -402 -568 -1305 147 -72 -936 487 559 87
792 87 740 488 901 891 -109 769 768 -672 385 172 -834 -342 -733 -769 -401 -1132 -397 229 -842 32
812 32 833 -154 404 734 600 961 249 408 1184 -392 -59 610 -708 -596 -234 -717 -454 -790 -694 370
832 370 -638 -482 935 94 144 1002 466 708 524 345 948 15 -447 671 -429 -927 -60 -543 -737
851 -737 -444 -900 -33 -243 -771 681 502 -327 939 620 415 778 259 785 449 -680 320 113 -1099
870 -1099 -218 -268 -874 -427 -697 -385 -83 -697 175 712 -464 547 844 50 591 629 550 654 -337 201
890 201 356 -1340 -396 221 -751 -800 -46 199 -41 -526 -635 382 -62 575 1088 372 322 820 328 657
910F57m76l27O23q75l70R35q84k57P67l90K72J38k49R32m53l62J260l79n77R29
930I14l18k95J41o23M68k81r55R61l87p82R71j61k58N29m33O79K00p31R59K65
950H63j016R41Mo17M02q4l35o9p78M48L35j468P75M49o23M71R6Q1M73n39M43P64
972A016r47K31O83q61J86J56n45L78o40j86P08j071j2J009p73J07O72m51M85m2
992A03j30Q64m31m28J135o58m33N73n37J7r5o22N51l70n75R91l16o17J002r7q7
1013a60M27k19N69q7n42Q27q5r13P04j12n95J68k83L0J65q37N53K94r89R24L26
1034A65n44N24j18K67L60o16M71M26r63L81L21q32J54n6l62M06o45P8O97q55N7
1055f84Q05m00J07L70j67M17p3j24P56p26k98P66o98k98L55l76J20k49l24O70
$$ plain form
910 657 181 -146 477 -398 -768 167 -717 -974 -207 -597 -325 -187 -436 496 43 -319 941 562 -15 914
930 914 596 301 442 -181 287 6 -949 12 -375 -1157 -186 -347 -605 -76 -509 170 370 -361 598 863
950 863 -153 788 792 175 577 493 158 89 -689 -241 94 -1374 -599 -150 -773 -302 -206 -125 348 -191 252 1016
972 1016 69 300 983 122 308 464 -81 297 -343 -529 179 -892 -904 105 -668 -561 111 -340 145 103
992 103 -27 837 406 -22 1113 455 22 595 58 75 -20 -642 -91 -461 -1036 -45 -361 -978 24 -73 -160
1013 -160 267 48 617 530 -12 815 730 -183 521 409 -186 -18 -301 -271 -106 -943 -390 -96 -1085 -161 165
1034 165 -379 145 27 294 654 38 509 935 -28 353 674 -158 -4 -60 -422 -16 -661 -583 114 -741 -684
1055 -684 121 -279 -172 198 31 448 375 251 1007 281 -17 749 51 -247 108 -268 -148 -397 -721 -51
1075e1m57l72J104k48m12R48l23J60Pl44P00j33p34P60j82p84M95k49m96M81n64
1096f94L36J47o74Q91J88q01P10L06l08K69j17J55L36p01K88M02j101M36J72p12
1116d72L40k51j21L52o47K42Q90p77L33N65n13K80J87j70M30n66jO58q83j59O23
1137C40p73K3J28l80M77j98k86Q61l79l24R79l70jM51l20K63Pl56M63l30o95P33
1159C13l91m68M24j73k11K62l80M98J79o55Q57J68n39M80j7q1K96l03K4K37q48
1180c28M07K52j495Q68J97m70L56k68J06N80o71M01N52o79L62M38m44L05p2k56
1200A41M25n99j71O36q08j67P62p47J88J01l01N65l05m0Q48n98pP86m12j65M37
1221E69l63K18k45m36N24m56l02N16j79o82J018l12j44K24l26P48k14m16O95K1
$$ plain form
1075 -51 -508 -880 224 -24 -436 512 189 349 356 12 712 579 -155 605 423 -361 134 -115 -611 -130 -694
1096 -694 -358 -211 -885 6 194 -607 103 409 101 370 253 408 744 43 331 733 -368 68 240 -472
1116 -472 -132 -383 -504 -152 -799 -557 333 -444 -111 454 -59 221 408 238 668 102 101 759 -124 -283 340
1137 340 -433 -410 -282 -662 -185 -383 -669 192 -187 -511 468 98 97 548 228 491 498 142 605 275 -420 313
1159 313 -78 -546 -122 -295 -506 -244 -624 -126 53 -602 255 423 -116 364 347 266 562 259 283 520 -328
1180 -328 79 331 -1164 -296 -99 -569 -213 -481 -375 205 -466 -65 487 -192 170 608 164 469 397 141
1200 141 566 -33 -204 432 -376 -543 219 -528 -340 -239 -540 25 -280 -320 528 -70 -77 709 297 132 569
1221 569 206 424 179 -257 267 -189 -491 25 -154 -836 182 -130 -274 -50 -376 372 158 -258 437 458
1241D58l71N12k07j70N6j99O9O9q00M75Ro30M35J29l86M57r8P6M54n24L97N16
1263G27p19J67L05m05L06k46k19K01m87Q6M21o50O0M21m40K61J8Q2M48l05k6O88
1285F94n92o4O09m44n4K23l87J57l00k10M72m20l59O46j35k28M51k58L00N9l33
1306a73O66k42l63P74k35m36L49l52Q5p9m01K70l8n00N58q2l25N25J2j85K88j67
1328e1K95K95n15L51J67n71K31J08l97K27l97J41O4n57K87L78o02J58M42l32L18
1349D0O7k3L43l32j8N82o39q2M51m03J06q8m09L36k58j59N15l51j46M31J1m7K31
1372A58k17L66Ml28N78j93n57N46k48k75K29l14J21ml20L53p7m16N25J54l40L86
1394A31jQ4J28l22M34j29m18K84K74p15K50l9j86R7k65J27K75m79K81L05m78L60
$$ plain form
1241 458 87 599 392 222 278 79 148 217 -583 -108 -99 -729 -294 -165 -551 -94 -192 -116 338 -186 211 727
1263 727 8 175 480 75 381 135 -84 117 -370 -284 137 -513 -453 -32 -472 -211 -193 -111 337 32 6 694
1285 694 102 38 647 203 149 372 -15 142 -158 -368 104 -316 -675 -29 -164 -392 59 -199 101 160 -173
1306 -173 493 251 -112 662 427 -9 340 -12 73 -6 -407 -137 -175 -675 -117 -199 -524 1 13 -172 116 -51
1328 -51 244 539 24 375 542 -29 202 310 -87 140 -257 -116 -52 -609 -322 56 -546 -388 54 -278 40
1349 40 107 84 427 95 77 659 20 -62 389 -14 92 4 -405 -69 -327 -486 29 -322 -468 -37 -26 -73 158
1372 158 -59 307 311 -17 561 368 -189 357 109 -166 63 -251 -130 -134 -454 -101 -178 -594 -69 85 -255 131
1394 131 130 214 342 20 454 325 -93 191 465 -250 0 -39 -225 -128 -393 -266 9 -470 -189 116 -362 -2
1416bK63j12J74j61rK51m40J33L19m17j01K52m23N0o5QJ43J1m01P04k89j87N63
1439B64k51O1K71l22L64j95k66M88l32l30L09r8l40L22l45K22J14l51M23k4l26
1460c42N62M7k14K43q6M3%k63L20n6m65J78J03l13Q3q9n5J34k11L02J17l02K86
1483B2K91m10K23K77k71K27j79k5K13n19J33J54k42n7Kr6O5n0J7L36l30K2N24
1506C27l35O7K67j59K05r1j83J55l46j06L18k70k10L26j73j01K35l01L75M1j90
1527a49L64j28j52L80l0j59K59k82J41j18l06L22n2n61M07n5l29K88m8M0K33k32
1549a67K21K13l79L03J22l40K91k9j44R1k26NJ54k62N3M2l15K09L0q8R8n0N2L50
1573B34k09k4L95k32k2K37l08MM2k09J33j40j58J81j06j40M40l20KN4K3K47M5
$$ plain form
1416 -2 261 149 323 162 153 404 -36 97 416 -1 -102 150 -273 -223 -288 -280 -137 -126 -527 177 -112 -299 264
1439 264 13 74 345 23 387 192 -74 414 82 -248 61 -37 -377 -55 -400 -178 -64 -415 8 -16 -342
1460 -342 220 267 53 296 210 253 253 -10 310 254 -211 -33 70 -243 -160 -249 -304 -170 -381 -79 38 -264 22
1483 22 313 -97 126 403 132 359 180 155 368 -151 -18 136 -106 -163 -161 -257 -192 -242 -225 111 -219 -197 327
1506 327 -8 59 326 167 372 281 98 253 -93 -199 119 -151 -361 -35 -208 -309 -74 -375 0 41 -149
1527 -149 215 87 -65 315 285 126 385 103 244 126 -180 142 90 -471 -64 -119 -448 -160 -208 -168 65 -167
1549 -167 54 267 -112 191 313 -27 264 235 91 182 -44 -39 115 -147 -94 -52 -367 -158 -128 -216 -118 -168 -116 234
1573 234 25 1 396 164 142 379 71 75 117 -92 41 -99 -257 -76 -182 -322 118 -202 -200 -146 -123 124 169
1596A69k70L87j33j58J79%l9P3k44P1o3l26K41N6l35L07o0q6K13KO1J31j07J40
1620B09J93m41K77Q6k83J38l8p1qk24L0K51m98K39J84j66j9M5k4K66m5m5K28k03
1644H1k8K75k69o7N9j53J59j69j72K44k24rL40j84OJ35k17K28J50k7J21o4j94
1667B1L05j62j25R5q2j28P2k9L2o6k36J61K5j88L40J7p8K16j61J54j5j55K09O3
1691B85m21J96J12l42R5p4L8J29k63J46K82m05N8K31o6J87j36R7j7p7p5L26l61
1714e5J09R8k39n8R2n8R2j13m0J37j22oL20k26o8K42k1N6J17j82J29n6k98K09
1738E9l9j48J58j84M1Q0k73J92K5k31K88j02J52M2KJ06m0%J9O5k78J98r5j09K3
1763d9l6j25J22p0j3J35k81K66J33k35J57J33k07K32l8n4J20o9j74J55k99J3J81
$$ plain form
1596 169 -101 286 153 -5 174 174 135 208 -36 35 -28 -354 -113 -57 -392 -85 -145 -231 -18 -16 45 176 69 209
1620 209 402 -39 238 324 41 179 141 70 62 -162 -132 119 -379 -140 44 -122 -141 -96 -120 146 101 56 284 81
1644 81 53 328 59 -8 51 -102 57 -112 -284 -40 -264 -273 67 -117 -111 24 -193 35 185 158 279 215 21
1667 21 326 164 39 134 52 -76 -4 -33 -1 -67 -303 -142 -117 -305 35 52 -26 190 29 183 168 13 222 285
1691 285 -136 60 172 -170 -75 -149 -111 18 -245 -99 183 -222 -164 67 1 188 52 149 132 55 -20 306 -55
1714 -55 54 152 -87 -145 -53 -111 -19 -132 -172 -35 -157 -163 157 -69 -137 105 84 140 257 75 204 148 -150 59
1738 59 20 -128 30 -154 -113 -33 -306 -114 -89 -320 -32 -134 18 60 62 168 128 128 147 212 -66 132 37 -72 -49
1763 -49 -85 -210 -88 -158 -171 -36 -317 -51 82 -153 4 137 -70 162 124 70 190 121 -53 102 -197 -184 -3
1786cj73R3j30qJ74j05Q0J72j65K0K09m9j61K31j2m6P0k56J92j42l30N39l03p5
1810a78O5j7o8K20j52J82m1j99L90j12j20J64L9p0J07j43nR6k28Q3k8k08J27N4
1834d2j81J67Q8M4Nk23J62P8j10J03L2%Q0j13L4K1k67M7J02k58R0O6j09j1J82
1859a3j09K47j77oK41j74J1K24j95l7N5r0J37r0j50K54k10j72K14j10L4R1k0J08
1883F3p2M4L04k01k13L25j11q1P3p7J8M7k43M3N4j61K26n4j51J08M5p0J93j54
1907d5J49O4k48J34J95j97k8J41j51N8q0p4J05j18JJ29k48J58N7p2j0J34K7O8
1931A49j38L9J43j17j31J36k2o2K1q4J07j63J3J14q7j12K70p5r2J24K6J05o7m9
1955D8J05q8m6J26k0k01J25j05lL3m4L3Pn7K7J01j17R3K1m7K18k76K26r6rO1j1
$$ plain form
1786 -3 -176 -83 -213 -221 -47 -152 -72 100 -65 -45 164 115 -46 185 173 127 197 -59 133 -9 -339 200 -103 -178
1810 -178 -113 -130 -198 22 -130 52 11 -188 202 90 -30 134 173 103 210 67 62 158 -70 13 -15 -223 -96 -42
1834 -42 -223 -56 32 76 81 -142 20 98 -12 91 123 123 203 90 124 145 -122 -75 27 -231 -141 -75 -184 -195 -13
1859 -13 -122 125 -52 -58 183 9 20 244 49 12 67 -23 114 24 -126 128 -82 -254 -40 -150 -116 -25 -45 63
1883 63 -9 35 339 138 -75 250 139 58 131 54 72 119 -124 -81 -27 -188 38 -16 -167 -59 -14 -84 109 -45
1907 -45 104 168 -80 54 249 52 24 165 14 72 -8 -82 23 -95 -94 35 -213 -55 2 -70 -80 54 81 149
1931 149 11 50 193 76 -55 81 59 -3 18 -66 41 -122 -109 5 -82 -194 76 1 -91 33 59 164 97 48
1955 48 153 65 19 145 125 -76 49 -56 -59 -26 -70 -37 -30 -87 -60 41 -76 17 38 -9 209 -67 159 63 54 115 104
1982A04j05K4r7No9j8Q0P2j17k7J76j00j4K27j23M2q7K7K61k40L4K0j00P8P5j88
2008f0j15P2jJ78o5k57K77j14LL4Q5P9Lk0J07k1j09Q3k23J07O1q5q3L1r8J82j54
2035a03j64K95j6nnJ3M5r3P2J23m5o8J23Lj75l6J38k64J26J6n0P6j40l2K59k62
2061a69J03Q6p7J68m1N5m1k7j67K03k23J14N9j66J19o3J72Rj85K6m2k2K15J6Q3
2086B05r4%kr6J62n6l57J44J15J18j34o9r2j12J44K70J7l84L15l43L07m9K27l9
2110A97k65R4L50l35N25k71k29J40m39J70J20o57K02O86j303J274n06p7L92J9
2130H7k34L05po6pk4r3K15p0j82K2nj09K14k04LM6MJ8M0l4J05J1P1k9J5m4N3p0
2159C1L0P5j99O8o9k5J20j06J9o5J45j62Q8L2Q3n4l9J39l8j94L51k07N3j44J12
$$ plain form
1982 104 -1 23 -74 -69 -138 -156 -76 -4 -121 -148 28 -72 -86 141 18 60 -27 0 261 21 55 75 -25 53 128 -60
2008 -60 -175 -103 -104 74 9 -248 29 -85 -82 -48 37 116 119 99 206 185 76 159 -64 43 104 19 -64 -33 -131 51 -103
2035 -103 -267 28 12 7 2 15 60 -33 39 162 117 49 172 175 0 -36 102 -162 -36 -20 -70 6 -134 -166 93 -169
2061 -169 -66 20 -57 111 70 125 84 57 -110 93 -130 -16 43 -123 -4 -67 105 114 -71 -45 -87 -109 106 122 205
2086 205 111 111 109 13 175 119 -238 -94 21 139 5 -64 -156 -268 -124 146 163 -221 94 -249 58 9 236 197
2110 197 -68 26 376 41 566 295 66 206 -233 -63 57 -600 -398 288 -1015 259 -247 -324 68 87
2130 87 -147 158 151 85 78 54 -39 176 106 -76 -54 -59 -168 46 -158 -155 -109 -105 -87 -47 -81 24 35 106 77 92 48 101 31
2159 31 61 136 -63 5 -64 -89 31 -75 -56 -121 24 -138 -50 -18 65 11 -28 111 73 -121 230 23 76 -68 44
2184D4l0J14k79Q3P5k16N0J59q3jN1J3M5j13RJ36j11J75r1r0R4N8k22O9N2n7M5
2211b1n1l1M3O0j4N7r9J11P8j11J27Rj11K8j98Q8Q9n7Nk0oJ3n8N3N0o1j22R5N7
2240Cj7P8j51J94m9j95K46j49L9J34o7j66O9M7Jm8o6J33k9l5J1kM8L7j41J90R
2267A24j50J86j3k42J32Qn7QLp0J54j78p3J87j04J56J3k34J21J37k5l4N7q9J75
2292A92k27Q3J1j6k4j4j8j25L8k0J17l0K0J8o6K8L9l5J74p1J5r9R6p1P8rj33O5
2320A6r7J29r1j20J34K1k32K86k20J54J01pk5J9M3n8P2j15J02l8nj43On4J59n6
2346a9q3k5m9K58j1k51J12J50j38k7J59k8O8Lj87J18r4jO0k04J08j2p9K07j40
2371a05O2K8m5K0J70j58O5K0k1K4o7J0N4L5k29K38j95q4J70m8O0K9j54R4p5M1
$$ plain form
2184 44 14 128 -151 -68 7 -209 -159 0 -83 -84 -33 -20 25 -88 -79 57 -54 121 30 -60 34 92 -130 -61 -9 -66 -21
2211 -21 -72 -103 -60 0 -14 43 -56 55 133 22 149 158 47 75 -123 -35 54 -3 2 -18 -24 -11 -69 -16 34 -27 -149 -54 3
2240 3 -14 64 -87 107 58 -137 109 -40 -1 133 66 -100 -31 16 17 -31 -97 36 7 -28 -17 -19 29 66 -75 115 124
2267 124 -26 160 147 -95 37 45 -12 -4 -1 -71 83 -95 -168 19 -85 71 84 -150 -29 108 83 49 106 17 192
2292 192 -35 48 59 43 19 5 -13 -138 -100 -120 -3 -33 -13 5 -61 -33 6 -29 145 74 89 -10 86 15 93 84 -49 16
2320 16 -81 48 -43 -163 -29 -8 -240 46 -174 -20 81 74 49 68 111 53 125 10 112 74 69 -74 -68 -122 37 -19
2346 -19 -102 -127 -176 82 71 -180 -68 82 -56 -83 76 48 116 119 -68 50 -44 -45 15 -189 -81 -93 -172 35 -105
2371 -105 -43 -15 -60 -40 130 -28 37 57 36 60 -7 3 57 92 -137 101 -94 -178 -8 -56 4 33 -121 -27 -102 -61
2397f1J84j80KK00j62n8J21j09J41N7j24L5j23l1O4R0k3o6M7o2L1K8O8k6l3Q3
2423I3jk2m1k9m4J30j59K5L3m9M4K3j8q6M4Q8n6M4k4LM8m6J12k04J30N6j41J27
2451H0j58O8N1j3j56K07k40J24N2OJ11k00J15l0J0Rm8K0NQ2mj3o5J8r0M1j08K04
2479G8r0j56J48p1L3m4Q5L5p5%O4P4l8L7j32M0j3m0J26l6j24M5N7j10J48j7l9
2506a5m7l4J67j02R1m1R3j24L8Q1j3P0j65m2P3l7MP9j74J67j44J26j39J65o7%
2532A0%K6k3k2PM2M1n7O8j60nO3J2r8Q9j14J35K4j04J59r0M4j0j9J78j31j39Q9
2560A5J2j0q0o9O2k8L3Q9n3m1oN4p1J16n8K2L1M5l8K5kOQ9k24RO3j2R4l7j06J17
2591D7n3%k1J8k6L2p2m1J70n9Q6j17L9N2L5r6L1pj02J25m1k3P6j60J34K5j40K10
$$ plain form
2397 -61 123 -57 -55 145 -17 -75 46 -63 78 135 11 46 -77 -108 -44 46 23 -43 4 -58 -27 1 69 43 10 93
2423 93 92 70 29 0 -44 86 -73 -48 -15 -64 -20 3 -15 -101 -57 31 -25 19 -5 -2 46 0 112 -92 38 94 -47 80
2451 80 -78 -10 41 28 -128 79 -161 -37 15 21 132 -68 47 17 27 36 -12 8 13 95 91 78 13 31 -59 -18 -126 78
2479 78 -12 -168 -20 -91 -58 -102 -17 18 -57 -57 7 81 43 80 -52 -12 -25 -65 61 25 -99 -54 3 -107 41 24 -15
2506 -15 -62 -96 71 -31 60 19 112 -12 26 107 94 164 -1 -43 30 -7 -3 76 -98 69 -75 51 -88 77 10 10
2532 10 10 36 13 -9 -2 40 81 24 92 -68 -73 -10 2 -96 -7 -121 14 38 -66 93 3 47 37 18 196 65 -74 15
2560 15 27 17 -63 -132 -70 -98 -65 24 -29 -70 -76 -22 -93 23 -35 -13 18 63 25 50 48 54 143 -81 -72 -9 -21 73 36 -70 47
2591 47 -6 -6 -27 -9 -35 -3 -75 -116 54 -5 81 -36 3 55 90 -6 25 18 -84 41 0 -23 53 -107 27 52 -88 122
2619A22k6q9n6J09L3Mj51J19m1J24j05n1J90k65R9p7Mm4rkJ73m3n3nJ00k9k3M0
2647D8l1m3PJ6j4L5r8J15r3k5J8J19j18J21n9j15J25q7p8K36o3k2M1p9J67j24
2673aj41J84l1j62J85j02m2J6P6qQ0m6pM9m3L7M3k8J7k4J04j61j29K29Q8l58J78
2700Co3l7K02o6j55J96j14QO7l0R2l2o2j7Q0j31J27p5N0Q8j28N1k1j1p8J9K4k0
2728c3K5J4Rj4M2Q0K2j98J03n3pj1RJ07l1m0p3L1qo1l9J48Ol1J76j35p2R7mj0
2758D9K7j85J41Q1j07j6j03j6N3M7l6JM5r4R1qo5R4n2N3J17r2kN5j2p7j1l7j6
2787g5r9J30J1P8j15j0Q6j35J30N5m2o0R7L1j46R1N0m5n8K6k9M5j3K9J16k19j7
2814h8K5M6k7o4O8K5L3N1N4n0L6n0j09R2qo2J4K5Kj2k8JP4o7l2oJ37j43Q9j17
$$ plain form
2619 122 96 7 -49 60 93 97 -54 65 24 148 43 -8 182 -83 16 -61 -57 -101 -110 -112 61 18 -35 -40 60 31 8 48
2647 48 17 -26 -19 -3 -17 18 -80 35 -58 -83 -65 54 -64 57 -2 -117 8 -79 -157 79 16 -6 35 -44 123 -1
2673 -1 -142 42 11 -151 34 -68 -110 -94 -18 -26 54 8 1 50 7 44 87 59 76 52 156 -5 -134 95 183 -175 3
2700 3 -60 -97 105 39 -116 80 -34 -26 41 11 103 71 9 -8 72 -59 68 -7 43 131 3 54 33 22 -56 -37 -13 -33
2728 -33 -8 6 15 1 43 123 145 -53 50 -3 -10 -21 -12 95 64 24 -49 -18 -26 -87 -126 22 28 -3 173 38 -34 63 59 49
2758 49 76 -109 32 113 6 -10 -113 -129 -76 -29 -65 -64 -19 -113 -22 -30 -95 -1 -53 0 117 25 23 78 66 -11 -22 -59 -75
2787 -75 -174 -44 -33 45 -70 -80 6 -129 1 56 14 -46 51 82 -64 27 77 32 -26 0 -29 16 3 32 148 -71 -88
2814 -88 -63 -17 -44 -108 -40 -15 18 69 123 73 109 59 -50 42 34 -28 -14 11 13 1 -27 -26 48 -19 -51 -57 80 -63 26 -91
2844i1J08RN6o6l2k8R0l4m3K9p4n7Q5J15l4n6nO9n3J1j10K06kn0l4r0K00J7k32
2873i6J61o6O8j22N8OJ5q2Q7j05J6J01r7J15m9J10q0n4k1L0O1N5j69O4K5N0j98
2900a17J6R9ro9J00P4k1j76J53k8O4o9M4j27Q0o9O5j16J56j30Q5mj04J42p9M6
2926FL5r7Q7p2m9J51o3L4Ll1p3J11P6q2M2n6K3ql6M3N0j28J00j60N7p5P2q8J90
2955F2j71P7J09o1N6Rj85J36k3j23J01R1q1nK3j2l5k5J3Q7Nj5%j21K07j34J07
2982I2J57j93M17o01m5N39m17K3m8N0J6k5P6q5j20J52l6m5J47pm5J2m1J11o0J42
3008A66j93k1Pl1J37mm1j3L7k1p4O8R3j74O1p2J04o8MQ2j51K55k30L2P3m4J8o7
3036f7J53N7j64O9p4j5kJ00j3m3q9J36m3L5L9p2J34q8m9J46k38J70j4p6j25Q0
$$ plain form
2844 -91 17 26 82 16 -16 -44 46 12 -31 -2 -76 -133 -48 67 33 -23 -28 41 -12 -1 -111 95 93 43 9 -81 119 136 -96
2873 -96 65 -1 67 -55 3 9 24 -58 29 -76 -60 41 -56 59 10 120 40 -14 -35 -5 56 111 -58 6 31 81 -117
2900 -117 -101 -2 -11 -80 20 94 73 -103 50 22 86 17 61 -66 14 -55 10 -106 50 -80 5 1 -103 39 -40 6
2926 6 41 -56 31 -41 -90 61 -2 32 35 4 -69 42 118 36 78 22 45 37 1 44 94 -34 66 -94 -37 -112 -40 -128 62
2955 62 -109 -32 77 16 72 81 -104 32 9 -114 -13 78 -3 -8 15 3 -32 -57 -44 43 48 33 33 -88 119 -15 92
2982 92 249 56 473 -128 -173 366 -51 -28 -76 -26 -10 -35 41 -44 -164 -12 -48 -93 54 47 2 14 -27 84 24 166
3008 166 -27 -48 -41 -72 65 61 20 7 44 23 -51 17 110 -64 -3 -75 29 -39 -35 47 -104 151 -79 -47 26 -18 0 -67
3036 -67 86 143 -21 48 -26 -41 -43 57 44 1 -88 48 5 40 79 7 141 53 4 150 -88 82 68 -8 -133 -53
3062e3RR0Qj44J12p6N0L8jl4L4o7J00j0p1P9M1j13j5J19k40J75j02J07p3l7J25
3089E1On0M3j43N3N7m5O1q6Q4Ql5l3N6o9qL9M8OP4l4O1k15J07P5j19J02qm7J4
3119E3K4m1L0r2q8J31m5j6L7Q9j09J0mP3p6P2n6j6M3J27k43J37k2q9J75j49P8
3146C3K4o3J9lm5j3j39L21j25mk0r9J08Q2r6k9Q9j50J68n9K8mr6J21l1j49J13
3173a9O1R6j90O0L9o1J6q5NR3N7j02KR5j55J55r7M6m9K9p7P4K8l9M3r3J74o7J14
3202A53p8o2j15L1P2P7l5M1m3j09K5P3K8l1q0K2P5j21J46n7M7K4J3o0O1o1o2r
3230c5o0R2O8nN4p7k4ro2M8J1r5j7Q8j0O2n5m2J0o3K05m5j45J68k05L7J21j00
3258h5L3L6l8K8J01l5l6m0r0J80K4Pj89oJ67l6r0N2r8r5K24J8m3j7Q9j25M7J25
$$ plain form
3062 -53 -44 46 54 -90 22 -54 -4 34 33 -1 33 -34 66 56 -15 64 105 -8 -23 96 -144 31 -71 36 -37 -74 51
3089 51 57 7 50 -93 -40 17 -28 33 -53 31 39 4 -29 27 -42 -50 -11 37 43 117 83 144 -71 36 111 -8 94 86 39 53
3119 53 77 36 66 -26 -114 17 -28 -44 -7 82 -27 -17 -21 52 -24 48 -8 -24 19 146 -97 40 18 -71 104 -45 33
3146 33 57 -6 13 10 -35 -48 -187 134 9 5 -15 -114 -6 76 -20 -49 40 -110 58 -1 27 23 -73 48 17 -132 -19
3173 -19 42 138 -52 8 47 -14 2 -83 -78 15 72 -30 -28 67 -88 67 -30 16 -33 -4 -81 -7 21 -18 25 -68 106 39 153
3202 153 75 13 -102 -71 1 78 43 84 41 -68 -43 30 58 27 -53 -31 44 -77 69 12 59 83 96 36 97 36 -26 -35
3230 -35 -95 -3 65 60 114 37 13 4 -58 -10 1 -94 -111 -23 -33 29 -26 -68 -58 -121 84 39 -106 62 -143 -106 15 -85
3258 -85 -52 -16 -54 -26 75 40 4 -36 -126 54 78 85 -104 -110 57 21 -69 -17 -115 -210 14 32 -11 -28 61 -64 -17 108
3286A08j94J77p4K7r7p2J64L5r0L6j20J28K0j02K4P8n7M4r1J15j61J06M8J0n0
3311A2l2R3n9p9O7rr7J52pK2j43P1J9K3r9Q9Lj7R2j06R1o1J6qn3j8M0l9L2k5J0
3342b0r2J44j9R5q4k5K6j18L0M6M0NR5r1nj7j1Kk4J8J31q7NJ6j73j0J79k9M3j02
3372c2M1N8q6o9K1J86j88Q3P8J9j28J8o6P5l0J00r9j23J00O5j29Q6j6M3j3n4K3
3399c7P0k2m0k2O6%L6K0j69lJ72r5l3L7nJ26p4k6L6L1qj3r6j04J44RK4J3m6P5
3429F6j20M3n8K9P8j0n8j37J05O6M8j16J26k9m7P3Q4J7j5q3q9J10j37M4M2mK0
3456D8q2J02K0j01N9n7po5N8k4N3n3M5p1M3N4l8P5p2p4Q4J05j82M9R1o2Q3r0j00
3485a09J60J3o9J4J59Lj07L8r7N6np7R4j27l3M1O7n9oJ19j22N1lN0n8o6J24j25
$$ plain form
3286 108 -86 91 17 44 -53 -125 39 74 -16 20 -100 28 48 -54 -30 48 -9 35 -56 59 -102 4 52 62 12
3311 12 -20 73 14 -65 2 -7 -104 48 41 63 -80 -9 10 33 -66 23 26 9 101 -5 86 25 41 33 -20 -38 2 -37 -5 -30 -20
3342 -20 -112 32 13 108 24 -1 25 -93 -63 -17 23 28 123 32 27 10 -1 1 -23 -5 126 39 44 60 -113 -123 56 27 70 -32
3372 -32 9 67 -19 -88 -67 119 -69 14 92 111 -17 1 -65 10 -20 80 -19 -142 -42 23 -106 -20 -36 7 -6 -60 -37
3399 -37 33 11 -29 -51 15 15 51 71 -98 -101 71 -24 -57 -20 -25 101 27 1 37 68 60 47 -49 -153 -9 0 24 37 -9 66
3429 66 -54 -11 -69 -40 38 28 -30 -167 -62 4 52 -64 62 33 -14 59 143 160 145 62 -27 83 -54 -10 32 28 48
3456 48 -34 68 88 -13 46 -11 -18 -83 -25 -49 4 -49 -4 -75 -32 22 -16 59 -13 -87 -3 102 -80 -31 60 -2 81 -9 -109
3485 -109 51 64 -5 9 168 171 64 102 5 61 56 -21 73 -54 -87 -46 21 -38 -44 75 -47 4 1 51 -7 -73 51 -74
3513g4O8P7j49J66l2l6r8Q4l5l7J28J29j98m0J57j04n6l5J89j03J37j53M5J6N6
3538A02j17Pj71J95P1j36k8L5J12j94J48o1q0%K18o4k7m3p3L0K27q1j16P2k6P5
3564G5k44K23l1j5p3O4K0o1q7M0K8NO6qR9j69J56j18l5L7J2MJJ7n3P6rq7Q5j26
3594a08J46p6n3l7J06OP4Nk1m9K7oj9R4n1J3j9o5J16q7K4q4L4J7o9P5K6J41j55
3623Ej40J77j12J80j52m0O0Q0l8j00L7k2N7l5J07j06O4o5j3K4J39m1j06NJ55M1
3649A61j10r6Q7O2l7j14N5N6j5m3L5qq6J06j74J16l5P5M1n8l9K0J40j34l4j4O6
3676B3m3J08r9J04r4m6J79k52Q9j7L6J24j06kJ0qM7k2q6O5N8k2j25M7O7L3n7j05
3704i4R6o1J23n4m2L4P5m8j0m1K7KJ8j09J66j34J80j88k6J52mo9M9k5m4pR5o7
$$ plain form
3513 -74 -6 71 -78 88 56 20 -78 6 -29 -66 62 191 -7 -47 110 6 -50 -85 104 1 138 -15 30 46 102
3538 102 -15 -8 -179 16 87 -49 -77 -42 70 -124 24 -37 -117 -117 101 37 10 -33 -106 -76 151 70 -46 26 0 75
3564 75 -169 54 23 8 -65 -1 19 -42 -129 -89 -61 -56 10 2 101 -68 88 -30 -65 -28 -16 -12 -11 6 -47 29 20 -67 18 -108
3594 -108 38 -38 -91 -128 -22 -16 58 63 42 -7 20 14 -5 89 38 51 32 -33 83 -4 20 -64 -30 -13 -82 -7 19 160 5
3623 5 -135 42 -70 110 -42 -82 -22 58 20 -80 -43 -65 -8 -43 64 -42 22 -43 -56 -32 107 66 -40 -35 120 161
3649 161 51 -45 42 104 67 -47 8 64 49 6 41 33 -53 53 -121 -5 -40 35 76 18 -21 -1 139 5 -29 -43 23
3676 23 -20 88 -11 93 -1 -47 132 -120 -31 -48 -12 112 6 4 14 6 53 31 -55 10 68 46 -79 -32 35 68 11 -94
3704 -94 2 -59 64 10 -32 2 77 29 19 -22 5 7 25 -84 82 -52 128 -60 -86 66 62 -7 42 17 -27 -34 61 -6
3732fP2j43P3j45J17Q4r2r9J59p6O3R7k01J64j23N4N5k9j18J56L1j48J43K1j52
3757d3N2n4J26l3L3Lj22N0JL8r6J02j2p4Lr6Q7P7j02j2J05j30K01r0R7k3q2O2
3785F8p9kkL6K4k8l2L4jqq2Q6J08o9j09J24l4P0j32Q9n1kQ0o6j7j1j36Q9J92m23
3815b84K27J3N9p0K6nP5j7j29j7J00J18r6j6P3J0q1k3Q0j16J2N2m3J52j45oQ6
3842C5o6j5P8l8m8K5rO8kr1P0Mj4J61j81QJoJ2m9O3KOJ9n5Nl3K5m9Q7J8j3Jp7
3876e8J02j9j07P8P6j20J94p4j37o2Q5Q4n2k3K8K4L1J15j54M3r0M1MJ7k2nj3n1
3904f5N0o6N7jm0P6Qo1R4J9r5K4kk7N4N4r0Q4J5r1L9Qj21J86r4O8p7P5o8m9N6
3935B0j3k6J4rr6J08Q7j3j33R6j35M5J09q8K53l75J57m7O8nOM3q3J30K9m3m2j9
$$ plain form
3732 -6 66 -77 -4 -149 -32 52 -40 -139 20 -56 7 104 -97 67 -56 -2 53 24 -94 62 93 -55 88 109 -43
3757 -43 9 -45 81 48 81 84 -38 12 13 51 -45 57 45 -29 -26 -122 -35 42 -60 -72 33 -97 104 14 111 88 6 68
3785 68 -11 -13 -15 21 45 17 -15 19 18 10 -72 14 122 53 -56 68 34 104 -28 61 10 8 88 22 5 -6 -142 -53 139 -284
3815 -284 -57 -44 15 -55 -29 -34 41 24 -105 -122 -22 96 0 -16 57 67 -14 -37 43 -73 -61 -9 -52 100 -45 -51 35
3842 35 -31 -46 32 -6 -54 -29 -38 30 28 -63 7 11 -3 158 -23 -15 -14 -20 -8 -57 6 8 14 33 -22 -17 -50 -25 -74 13 31 18 19 -58
3876 -58 44 25 -82 -4 72 -48 146 72 -65 -127 -42 42 -10 -33 -5 19 50 165 11 54 -36 5 9 26 4 -1 -14 -65
3904 -65 -15 -81 -24 -25 -65 11 19 -42 52 71 -24 0 -2 -29 25 79 -11 73 88 -3 36 44 -77 109 15 83 6 81 13 -36 20
3935 20 7 -19 -5 -14 -110 -2 85 72 -61 35 -100 -55 54 -34 219 -156 1 -46 22 17 23 66 -17 113 142 99 57 38
3963C8j01J58j15O6J1j02R2j44J12Qj6Ml3JM9O7j25l6M9%J54j09k1m8J09n5m6
3990c3K6L6NK4m7j0km0O2j5M0q3J79o8J1j59J22o7k4nJ08lO4k12J19p1O4k0o0
4019e9qQR7j40P6l7Q8P2R2j59K6n6O6q6K8Q7j84O6q8K6J14m6j3P8N1j14oO3q7
4048d5l6J69q4m3RK1j9L2l1n0J29o9%j2j5j0J31o0m3J03q3O6jl3j22J7M6L8q5
4077h0n0J21M2j88J62n2Qj2O7M5l4nl9K8j22J92m7j2o9J1k8R9j14K9R8r5m4J16
4105B7p8O8kp3R4L3L1q1j8p6N4K6j50J92l0M8o6j11R7J3q0J29j3n6P0j3q9Q0j4
4134A2k3L9J4n2k3Qk2L0j17J26J21j48M6n6Q0m1j2m5L0m7R7K8n7K4K6o3O0l4N9
4163F0j47J02P6j28J03l2mj08Q5K3j01j6O7R8q3j04J74j59N2K0k9J21r1l8Q1M7
$$ plain form
3963 38 -63 95 -20 46 57 -45 47 -97 15 23 7 11 -22 -21 28 95 -30 -66 -17 -17 137 28 7 -41 68 13 -33
3990 -33 -7 29 34 58 11 1 -1 -41 21 6 46 -37 142 74 85 -74 48 -19 -43 -48 60 57 121 -91 28 -43 21 1 -59
4019 -59 -67 -59 38 -102 -26 -63 25 97 189 30 56 0 66 -20 8 95 -89 -23 -111 -85 29 -17 -30 48 99 -15 -21 42 -45
4048 -45 -81 88 4 -39 -30 -9 -28 4 -27 -77 52 -17 -17 -29 -44 -54 77 17 -26 77 -6 60 59 26 -96 -79 -33 5 -80
4077 -80 -130 -9 33 -155 7 -45 -37 -49 18 63 29 24 -15 13 -109 83 36 24 -45 -34 -62 37 -77 -48 50 -45 -89 27
4105 27 -51 17 15 -58 36 69 100 19 1 -75 -21 5 -145 47 17 65 -1 -112 -15 -2 -82 47 34 -22 48 35 -54 26 12
4134 12 -11 28 42 -10 -33 -25 -47 -17 -134 -8 113 -35 11 -45 35 -6 -18 -63 -33 -80 17 45 -12 12 38 -25 35 1 60
4163 60 -87 15 91 -37 66 34 30 -78 7 30 -71 -87 -20 78 -5 -109 65 -94 -42 -22 -51 70 -21 -59 22 69
4189F9p4N6p9P7l8j0k9m3O0L9m6P9q3Q1r1K4L7j2p8O0N7J4j8r6M2N8q8O7n4K4
4219En2k4oJ14k9j66O6%R3p7Q7n0P6L4l2PO3j63J16n3k0kj39J51O0n5o7K3J8l9
4249f1P7O6j07K8J8L5K1j47O1O1m1L1k1j20K56o5o9m5PJ8N8q3J82j53M6K8j00
4276a9K9j2JK3l8M2j08J09r1J55j20K5pL5j33J33L0j62J15p2J26q8R4r1K1N0q1
4303c4j8n7J5QL0LK0N0mj29J41M3j64J59Mn6PkM6o7J3L6j00M3j3N5m8M4k5j02
4333a02J22j7j8l7P6Qj0q8N9M6P0j98J81j27rl2J78j32Q5o1o1J62L4j99K2N0o2
4360f0k1R6n6l4J10j8M8q6jM2m2K0P2j79J03l1L6L8o5m3L9K0o9R7J0N0p9M2l9
4389@j4K2k0k1n7J13j18J0M7q7RR9J1k1J6k6J17k6kO1q3P7j59J40j57J13%j7P6
$$ plain form
4189 69 -5 51 -28 49 11 1 -28 -71 -11 28 -18 61 -22 59 -32 -8 29 17 -61 -1 56 70 52 -44 -2 56 -32 35 -19 5
4219 5 -47 -71 -77 37 8 -158 -92 -92 1 -76 11 -39 37 71 39 46 109 -54 62 9 -11 -13 -152 -1 59 4 -63 -40 -22 -61
4249 -61 16 82 -25 3 21 56 77 -70 -9 52 11 42 21 -99 157 92 23 -22 -15 3 61 -22 160 7 53 81 -19
4276 -19 10 -2 -1 22 -16 26 -82 27 -64 91 -29 -4 -11 24 -109 24 54 -108 7 -65 61 -27 67 -24 -3 47 -34
4303 -34 -52 -109 -94 -86 -56 -53 -33 17 13 -116 25 68 -96 63 67 11 18 16 62 -5 8 44 -56 -13 -26 29 -19 25 0 -102
4333 -102 20 3 -15 -52 24 32 22 -66 -7 39 109 -89 92 -35 -44 -76 102 -30 55 -6 -67 95 129 -70 -48 2 -60
4360 -60 -81 15 -41 -75 35 17 65 -21 -22 20 -22 -2 70 -109 -6 -37 -1 37 -28 -71 -32 -12 -81 16 26 76 -3 39 0
4389 0 -14 8 -12 -33 -90 23 -95 -85 -38 -125 -116 -17 -6 -27 -11 -37 80 54 52 113 30 107 -52 88 -69 44 44 27 103
4418A03k9o1j40J19LP9o8LK3l9m7J7Q4O1j74R4N6j01k7N8K5L0N9k90K51j73N5
4445b9Q1j07qJ04L7k2k14K45n4j07J04j2P9J7m6n6O0L1j22N7q2K1j6N3rR8j20
4472a7L0M1p5oJ44p5P7j38n6J81k28J23nj2O8K1k03J94n5j28Q3L9l2j8J34k09
4498a22J84p1oj0L8K7l5j29J38l7N2R3L0q8k5n4N9r0pN4Q0Rj5N4j44n5J45j00
4526b5J61j24M3j01p5R6l9L5lk0O0p7L2Q8j05J05p4mm4O0p9P5KO7m6k2Q8o1n8
4555d5O4m9R5l9j06L8J11l9o5L6Q0r1LL8j30J95j18nj8k0o1N3M2M8Nq0Q6l0qL2
4585B2%m7M6o2K9j02P3N1P7j23R9o4P2r5m2OJ14n4O0l3K0l2lJ7m4J8O9p8p8M9
4615c5M0L3j62J4M7q6J17O4PQ3j5l2j03N2l4O6j00N2k2kQ6j04p3Q1n7P9j7J18
$$ plain form
4418 103 74 13 -127 -8 -5 74 6 9 32 -7 -54 -37 47 108 -66 28 84 -17 -44 14 39 69 128 -162 89 -84 -29
4445 -29 52 -55 -63 41 78 56 -158 87 33 -74 30 18 97 114 68 12 72 103 -19 38 -44 -23 -39 14 5 103 -17
4472 -17 13 54 -21 -27 117 42 119 -19 -75 106 -122 1 -4 -16 52 73 -130 64 9 -119 -36 3 -29 -47 87 -122
4498 -122 62 -9 -15 -25 13 40 5 -124 14 -23 29 122 152 64 39 -15 44 -46 -53 1 81 90 75 129 -15 -70 75 -25
4526 -25 136 12 55 -46 -121 -25 -64 -29 -32 -52 8 -69 -37 51 -54 51 -23 -27 -71 -11 -90 -15 -13 54 8 -14 74 13 -45
4555 -45 19 -30 65 26 -80 -42 69 30 -35 1 81 -10 -7 31 -99 96 -22 -27 -45 -65 -126 -73 -31 17 22 -58 28 -2 -10 22
4585 22 22 -25 21 -41 -12 -114 -41 10 87 -36 63 -1 71 -24 -66 -60 54 0 60 27 47 15 12 29 -15 3 72 -6 -84 -35
4615 -35 5 38 -124 -110 -63 -149 -32 32 39 122 107 75 -28 24 -10 56 -44 8 -14 -16 70 -34 -107 -26 -83 -4 -21 97
4643I7k8J0o1L4j0j38l7J76l7k8J05k34J66qN9o3M0j2J00q2o2n8Q7m5L0mL3o6
4671c6K8R1q7O8j3r5L8k5q3J50q4L3On0N6p7R5K0q7j41K03j00O3K8j2O9r7m5Q6
4700BQ5p1l4P7q7N5Lj32N9m3O8MJ6K6m6K9O2r0K5j4p9J14l9n3K4K1Jj6Q5L7K0
4731A09j30n6J04l3Qk2K6o0kM1R2q1J2k5M8l2J45j13M0pj20R4j51R1L1j2o2k2
4759h7J16j7k4p7J40p0N2r0J52j8p5L9p1l0J64r3L4j19L7pj05J39oO0o9j2N3J9
4787C5n7J7l5j9qR8q0O9l2pj23k1J86MN8r9J56q3K4r3j05J36j6L8p6J31p5q9%
4816f6O3J49p8m5M0n0k2J03r3k3j2P9k0m3N3m4q4R6OM2r2Q2J09r5L4k2p6L9J32
4845A62j50k5M4m5P3K1r0K6kq6O8R1j19o9J51j97Q4R0l5o5P7L9o0J28j81Q4n3
$$ plain form
4643 97 69 79 18 52 42 -96 -133 43 6 -22 83 -151 15 7 66 3 43 31 131 49 -13 -71 16 -29 1 -3 30 -36
4671 -36 -8 83 -4 64 51 -44 -6 -31 -114 36 -48 -15 -9 -59 -3 -80 15 35 -52 -193 10 -90 -27 1 -11 58 -39 -84 2
4700 2 87 16 -18 59 -28 27 30 -102 -43 -86 -18 -14 2 28 -18 11 73 -17 8 -6 -85 29 -10 -63 -39 -18 -17 -33 52 89 109
4731 109 -21 -77 27 -6 2 -20 6 -54 -56 -15 77 -4 8 -17 31 -1 144 31 71 64 -56 38 -113 -22 9 -3 -65 -87
4759 -87 29 12 -12 -89 51 -19 33 -57 95 77 2 41 -30 -60 104 11 45 -74 -37 -44 -149 -10 -16 44 -25 -37 16 35
4787 35 -22 -5 -40 -59 -67 31 -49 20 -12 -19 -142 -163 23 27 85 -14 142 59 83 -10 -115 21 5 43 -33 98 23 -66 -66
4816 -66 -3 146 68 23 63 13 -9 94 1 -22 -34 45 25 -18 35 -9 -93 3 9 51 -41 41 150 55 89 67 -9 30 162
4845 162 12 -13 31 -14 59 80 -10 16 14 -72 -4 87 -32 -101 50 -147 -63 27 -8 -73 4 43 -17 111 -70 14 -39
4872c9M7K7L9l3LJ1o5O5l4pr3P3L8j0LJ7q9pJ36j5j16kJ09j05Q6j25K33m6j99
4901i8J11o4O7k3J0L3j39J35m4o1P6MK3m9J6r3J05k3j1J9L8j3j1o5%K9rJ1R7j46
4931g5P6N6j09J08j5K9j31J12j46O2L6k8P4o4l6L8O3r4O3m2m5M5L2n6j2O1l6O0
4959B6j04j4J12j10L9J31K5j84J54j06N4Rm7k3P4K7l3L8j69J74j76J24o9R3l1
4984A4M9n3r8J13L4n7L8p3P1j5o1M5rm0L5Mq3J14n5o2P0J26m5jq7M6K0Opj11J50
5015G8j3o0k2p1P6n4J33q7J10j79J55j04J40j22M5m2j8L3o6J54p3J0qL0m1j19
5041a15O8J2p4Q2L1L3l4p8J02q8J02q6J48r4m4L2R8M4q8O4j13jk9J00Nr1Q4q1
5069a1r1M7mN2NN7M0j47L4M8j6oj02J67j66M1j3L8m6Q7j00J10o0lQ2j13r7J39
$$ plain form
4872 -39 8 35 74 41 44 55 -10 55 21 14 -79 -6 32 22 25 42 -47 -54 82 67 -49 -51 58 -47 39 -86 147 101 -98
4901 -98 13 -51 16 -7 3 36 -103 32 -12 -73 3 7 30 -19 -3 -96 9 -14 -25 -6 32 19 8 -57 -57 -28 -37 -26 71 -75
4931 -75 1 57 -52 56 41 70 -61 51 -95 -33 3 -25 49 -15 -51 -13 50 -44 19 -23 -68 -23 9 -47 -59 2 -34 26
4959 26 -78 -92 20 -90 -51 80 105 -79 75 -31 23 32 -15 -38 36 63 30 68 -101 73 -103 21 -48 45 14
4984 14 63 10 -88 25 59 2 40 -33 38 23 -38 7 -2 -42 -7 -3 -86 28 -27 -89 -19 107 62 61 -26 20 40 46 39 -72 78
5015 78 65 5 -17 -88 -12 -66 67 -20 90 -89 66 -38 102 -20 25 -17 -35 -2 -68 86 13 23 15 45 4 -115
5041 -115 -47 -35 -109 -27 4 37 3 -75 27 -61 41 -45 103 9 -35 -3 95 139 51 115 2 1 -28 72 77 -14 70 -11
5069 -11 -102 -55 -59 -7 -2 55 95 -52 -18 30 14 8 -94 73 -93 -52 -65 -27 -73 14 -86 24 -36 -39 43 -70 -167 -28
5097b8mj9J04m8j8J6R2K9p5r3Q0n2p5R8p4J34k6n3kMn4R6L7Rq1j4N3K2Rj14PJ03
5129F3n7nJ2O5l5m8O9j64P6l3J49j09J12K6j08o7LP4n4Q7j18J39J1pj06k8J2J5
5157b6J01m1q7J1O1j24J98j18j14J80j12L1J44j62Q9j5R%j0J2nJ0q7J2R5j3j03
5184f4M6L7k3J24n5J0j23J57j85R6R3j33J3J9j0j1K0n3lR7p1PJ5J2r7J8J20o1
5212eJ5p9J27l8O4p2N7K5j15l4R0L4j7o4L8Rn1j27N9J42j60J20p3O5l3O8p5m7
5240g7Q1J40k61M4J77o2l7l1L2l3p0J24o2l7K6j0O7nl9N6o6J22l4o0J0K6j02M5
5268c6MK0J31p0j9j29M2M2j4L5N1r1k2l3j8J55K5r3P9K7p9q2R8k2M5Pm9j33J36
5297GkJ28j55j21J78o0Q3j41O1o6J04L4k1Q1q2m9%M9P2q7j7l8J10j09J43q9J9
$$ plain form
5097 -28 -32 -51 53 5 -13 3 95 124 49 -44 36 -16 -91 7 -67 67 41 -12 -14 -10 -64 32 69 78 -3 -17 36 58 67 -47 -40 63
5129 63 6 1 13 78 43 -5 64 -100 -24 -57 92 -17 95 121 13 -54 -51 23 -31 56 -62 77 88 81 -25 -53 -41 -26
5157 -26 75 34 -53 -42 19 -105 93 -25 -139 41 -71 -40 104 -58 31 16 25 25 15 27 22 32 -55 -43 52 39 -64
5184 -64 -18 19 -4 120 65 75 -48 109 -76 20 113 -20 -7 12 2 -9 11 -42 -45 52 -19 -12 3 15 -82 -64 56 -5
5212 -5 10 -69 58 20 84 12 69 94 -21 -55 35 69 52 -12 26 35 -16 -143 -84 58 -102 18 -55 10 -23 45 -30 -77
5240 -77 4 144 -117 -73 104 42 5 -26 6 -27 -97 27 -35 -72 -46 -56 11 6 -33 23 -43 79 45 -15 -5 21 -81 -36
5268 -36 -32 -12 119 49 30 -99 -57 -15 -29 6 57 -34 -56 -89 -107 48 73 -20 59 86 7 -75 23 1 46 53 4 -129 7
5297 7 5 133 -22 -143 35 -25 58 -83 -22 -88 16 50 29 110 28 -21 -21 28 100 13 -4 -42 68 -41 102 13 32
5324C2k2p1O6m1R6p7l9P3j72J61N9q8M6k6j4k0K3J00j2M3j61J38j59J07L9j15
5350c4P6on4l6N1j3OM8np1L4M0m8JN7Lq4L4j28J04n9M2P2n7J38j87J48k9K1q2
5380a8K3RQ2j61M4o0M9m2J07o5J5n4L5P8p1O8J5o0J4rj3k5J9k1j9M0l2J41J7n1
5410E5l2k7p8J0Or0k0J82l3o2P6K0J3p4m0J04M9J0k2j47J32q0J4o1R5N8kp1L7
5439B2n9j3J40j42J67m3o6M2j10O0K6M6j23K1N3j13J60o4k9K0l9KJ9K1NO1k5r6
5467e7O7Q4K8j53L4ll8J2N6j02R5m7m7J72j61M7J27j43j6O3Jj18R5r9P6Nj5M3
5495Fj66J57j2M2n4J25n7l9M5k4r1J49l4n5P3j1o1J44k3j18L5l5Or1O2l0J98l5
5523A06p4O7j04m7O0m0J50j92M8L0k4l9N3P1r0m2Q9Mq4r0R7R0j11R7p9J48j19
$$ plain form
5324 32 10 -61 5 -36 60 -17 -56 17 -155 6 65 -23 23 -3 -17 -37 -14 86 74 117 -44 94 -65 42 81 -34
5350 -34 42 36 -18 -54 -3 -16 -10 38 33 -38 -4 36 -12 -11 46 49 -35 -1 -129 -25 -84 -42 30 -27 111 -76 72 43 64 -18
5380 -18 5 14 96 -65 -21 -81 -32 -74 33 -32 -17 -71 -36 42 -29 39 54 -6 8 -1 -14 -39 -20 -41 -60 -20 -52 89 106 55
5410 55 23 -4 -82 -72 -66 -156 -176 6 -27 -89 -13 7 20 -54 -94 10 59 69 47 -100 32 -48 -34 -95 0 58 56 -15 22
5439 22 -37 -50 90 -52 115 72 6 48 -62 -2 24 70 -53 -32 21 -92 68 4 -25 -5 -44 -42 -23 -2 3 64 39 -57
5467 -57 10 94 122 -31 3 0 -38 -26 30 -72 23 -24 -71 101 -60 -13 114 -29 -45 18 19 -99 -4 -103 -27 -22 -37 6
5495 6 -160 -3 -15 27 -27 98 41 2 47 23 -68 81 47 -8 65 54 -7 137 114 -4 31 -4 2 -89 -27 -57 141 106
5523 106 32 99 -5 -52 8 -32 118 -74 -26 4 -20 -59 -6 65 -25 -67 22 26 -58 -148 -51 39 -72 25 -54 94 -25
5550b5%m0N8n6n5K10j19L0Km3O8L4k6LJ7j8j70J64Kl9j27R7J22k20J65j3k7L2
5578B6J8j6j01N2j62K06r2O8j1M1R8p0L9j45O1j19N7R2j01M5k5L3Q0r3N9Q2l5
5605H7j54J74j98M1Q0r1J27q1M4lj27K3R1P6j56Q3r5J04M1%p9j7Rl0J10o1K2j43
5633a23J56j52J35l6K7J07j25p9L4Q7K6m4j38P9P3m0J53o4j18R1j16J16M1l7j64
5658a11J33j89J00n9J34j24J40k2p8J05m1J5p0O9P3j01n4J30p7k3j7R2k0J4L4
5683E3rQ3j10n3N2P9n9j31O8q5J60q7Jl6N3O1n6j3P2k7k5O9j88J59L5o5N6J5j19
5712d7RlJ03r1Rr0J64j7N4j08j6JO1q0k0N2Jl5K5KJ8R2q6L5j1kn6R2R1j42j8l3
5744d6k4j21J40J26j42K5P6m9j8M8l9l5K2M3j2K%L8n1k2m5QO3L4J2qm2ORlR8j16
$$ plain form
5550 -25 -25 -65 -7 -63 -118 92 -27 3 5 -38 30 64 38 41 58 40 -130 34 36 -3 -130 -33 89 -131 34 21 -6 26
5578 26 44 28 -73 -21 -183 23 -69 -1 -12 29 127 57 96 -49 12 -107 -50 42 -59 -14 -39 -6 74 -19 40 122 87
5605 87 -67 107 -91 -50 30 -61 66 -15 29 26 -101 -78 13 89 -67 16 -79 25 66 66 -13 -30 -21 -51 59 -2 20 -123
5633 -123 33 -119 16 -20 7 114 -11 -90 -56 31 57 13 -125 -46 27 -13 140 76 -42 49 -67 49 90 53 -111
5658 -111 22 -167 -67 -126 8 -116 24 2 -76 29 -12 3 -67 2 75 -26 -80 50 -27 -50 -67 25 5 19 53
5683 53 44 127 17 -36 16 95 36 -95 -27 -112 48 -39 -38 -74 -21 40 -16 -29 43 16 -9 60 -128 31 66 1 57 72 -47
5712 -47 -38 -41 62 -29 -20 -110 54 37 91 -17 -33 -32 29 -51 -71 -19 -18 -53 -28 -26 -8 84 -2 33 22 20 -36 56 147 5 -13 -46
5744 -46 -70 -191 -51 75 -67 -42 34 -15 -33 15 -24 -59 -37 6 -6 -4 -4 34 -17 -39 -84 -76 -13 21 33 25 -17 -11 -2 -5 93 -23
5776b3K8J0N9r3P2m2j08Q8K9Qq7qJ56j26N9m4J7k5J49q1k1k1M6q0lO2N9q5Q9j51
5806f7Q2r2qN6M1K5n9N7Jn7Q3n5m7R2M6j14L0K5p3P2%m7J29r2j04LJ59m2p4N0
5836B0p3kJ66q0j20Q1pK5L7j45J05k0J49q7k5j46O8K9R7j43RnJ26q1l3R6O8j38
5864b9m2J04n9L0%P7k3m7M5q3L6rk3J6R2o2k8R3j27q1J30n4K0q4J28j33P5n8j3
5893a09K7J20k8J7j5QRpj19J74q6m8Q2m1J8J8KP5j22p5J51n9n8JJ17q2q0R4q6
5922a02J63k2j31J54r3l7J99j33n7L5Q0m1k9K3j29K05p6l7K7k0P7L2j70L7J12
5947F7l5o3M1l4P5m8m4P6M6r0O2j44K6J39j17k4O3J2Rm4N7j74J16l2K1O2k2j41
5975a40J75j11J53j05K7j04R3N1p8R0M2j31mO9%k8q1J07k1j1q4J91j38M2j5O2
$$ plain form
5776 -23 5 15 74 -19 53 11 -97 -9 20 28 -59 -67 89 -37 22 -22 -5 -30 119 38 17 -4 42 -38 -41 21 80 -5 84 -67
5806 -67 15 -77 -85 -29 12 37 -22 35 36 -21 62 7 -40 52 98 -16 14 39 -34 38 38 -9 120 28 -76 -73 86 44 -30 20
5836 20 -53 -55 111 31 -89 -8 -15 10 47 -98 7 -13 136 49 24 -122 -54 -25 72 -71 -62 -67 59 -22 -55 41 109 -29
5864 -29 -71 33 -26 4 4 81 58 11 56 -27 9 0 -23 -7 85 23 -5 88 -39 -120 10 -44 -24 -108 20 -113 -38 -96 -109
5893 -109 -82 38 10 27 12 20 29 22 -97 77 -9 -57 25 -16 2 20 22 97 -25 -100 51 -8 -66 -65 52 -30 -110 -16 -102
5922 -102 61 39 -92 62 -31 -68 131 -2 -59 -24 56 15 -14 9 -120 85 9 -28 -1 -21 56 88 -82 -45 67
5947 67 32 -31 10 -24 51 3 -41 35 81 -9 53 -91 -65 74 -43 -67 -4 8 17 -27 30 -144 -28 -60 -39 23 1 -140
5975 -140 35 -76 77 -28 -1 -105 -12 39 -39 51 93 -38 -42 27 27 -1 -82 25 4 -7 -91 100 -38 4 -11 51
6001E1j15J27j4Jj48M5K4M0j09J05j41J62r9m4P0J30p8n5P3n4J0j8J03ro2j2P7
6028F0n9J4m0NK7m7J03R7j24j71K01oj20Q7j19P9RK4R1j52J47q1k0n7J4M7j32
6055a23J57j14J55j97J20P7j7j21K2kJ05Kj05M6J04j78J5n1j1O9J65j96R2j5N7
6080E6L9o8J3q3N5m9m3K2P1J9j42L6J3m1M3N0n2NJ1K5r4J15R5j38N6j76J70k1
6108a3N8m4P2r1P4k6j11Q8O7R2j49K0j0j22K11q3n0m5M1N4j10P2K2N4l5mj08K5
6136e1j1Nj4l6l2J35Q4l1m2j19R4L6J4Ok3oP4r5OO8l7j89J56J61j28j42J26j39
6164a30J22Q3o0%P9k0j13J80k24Q9l2J44r8r0L5J25j50N3k6n1l4J95j10j0J58
6189A15j06p9J14q6L7J21p1n8J8L3q9J19o8m3mj1J28o9M3N8j39N1j25J33Q3j63
$$ plain form
6001 51 -64 63 49 50 -98 -53 -29 11 -98 7 -134 28 -71 -115 -45 85 7 -48 25 -29 -19 -37 66 57 -5 -17 60
6028 60 1 15 -25 -20 7 -40 63 160 36 -135 66 60 -60 27 -92 -13 -4 20 111 -41 106 25 5 -52 -38 9 -123
6055 -123 34 -80 75 -122 -2 75 58 -63 -41 -43 62 64 -41 5 109 -69 -54 -105 -116 -47 118 -78 14 -1 56
6080 56 95 27 40 -43 12 -37 -80 -58 13 32 -110 -74 -61 -102 -59 -9 -61 -56 -45 -20 -114 1 96 -42 14 -162 8 -13
6108 -13 45 1 73 -18 56 30 -81 7 74 166 17 37 27 -95 116 33 -17 -62 -21 33 -77 -5 17 71 36 32 -76 -51
6136 -51 -62 -57 -71 -107 -139 -4 80 49 7 -112 -18 18 32 38 15 9 83 -12 -6 62 25 -164 -8 153 25 -117 9 -130
6164 -130 -8 75 15 15 94 74 -39 141 -83 6 -26 118 20 -70 -35 90 -60 -7 -33 -84 -118 77 -33 -43 115
6189 115 9 -70 44 -42 -5 116 45 -13 5 38 -51 68 0 -43 -47 -58 70 1 44 102 -37 14 -111 22 105 -58
6215e8J2q4O6J46j40N1p5J02Lj0m2O4p0r5P5Q0k9l4J08p1j08J50j03K7P3q9O7
6242A6j3N8j37N2Q8j7k8o6J85m9j45j2J26mk6j0j6r7J53j14N1o7M9q3M1N2m6J5
6270d4R3J8j27Rl2M6l2J07om8K0q7O3rj9J08j31j6J17P8j49N1K9N1r9K3J08n6
6298F6p5o1J17J0lR8j29P1j11r0J78j27M0k2pJ08O9l4j06rL3RQ6n4j21K4J22j10
6326b8p5P6N2Rl3p8j1J17L3m3o0J9Q9j03J32r3J17n7o1l1PK8rj7Kj4j0P4k9N9
6356F2L8k28J77l6M7j5K5J9n7q0M0k9M0nNo6P0j7l3J44q0l3r3J21j6K9r3J9J9
6385b6J11jo0O2m2j28P4N1j4k8l1%o6P8J5M9j72J97n4o5R5k9rO7j39L6l8L3O5
6414C1RL2j3L7j92J12M0j34n9O6J45QM1n5jj92K9J96j03Q1n9o5J36j17o0Q3j3
$$ plain form
6215 -58 -46 -130 -64 82 -58 -7 -82 20 23 13 -29 35 -35 -130 -55 25 -4 -38 70 -1 -109 41 -62 -35 38 -51 16
6242 16 3 61 -76 -24 64 47 19 -47 138 89 -56 -68 58 54 28 18 2 -95 58 -56 -5 -72 -23 -106 -65 -13 -59 -44
6270 -44 49 67 -60 -51 -83 -37 -69 38 32 -16 4 -83 -20 -29 -48 60 -71 -87 30 108 -41 10 39 90 -9 14 122 66
6298 66 -9 -70 47 57 54 152 23 94 -17 -107 71 -56 -16 -38 -45 63 132 98 -8 -17 16 25 111 57 -64 -40 82 -28
6326 -28 -103 -27 25 34 1 -77 -88 29 62 19 -41 -22 67 -36 96 3 120 63 2 -29 -22 6 -3 -20 -18 -32 -42 32 3 62
6356 62 100 -128 49 13 60 45 70 89 32 -48 -8 -37 3 -2 3 -63 7 -10 -43 101 21 -12 -105 16 0 29 -64 -45 -26
6385 -26 85 84 24 86 44 -84 -10 41 27 -1 -32 -32 -98 -20 -5 44 -128 69 15 -50 45 16 7 74 -65 -29 -67 -34 31
6414 31 40 72 59 96 -96 16 56 -78 -137 -71 74 82 123 68 67 -125 -96 100 -3 78 19 -46 90 -27 -87 -4 -17
6441a7K3j7K1q4J6J58j64R3p4k3K5J68q4k4j22R9L2M7lo6K3m5k6k6P3M3j17K4
6469d7N0k3j9R1j02L1M1j7P4j49Q8j0M0o6N1j18O2j71J20J24r9P2k3O8j54M9J56
6496A19p2r4R3j73J09Nj2J5R8Jr0j7Jo3JJ56k0j25Q5RJ7l3Pq6J38o9O4M4k13J69
6526F4l6L9q4P5o3l5J10j0m7j7rN9m6lJ47j17j01n1J90j29j1J27j08J89k00K1
6552d6m7R9r9P8n0O1n8j6J50q6k9K0R2r2N1l7K6j36L22j62n6o2N6l9J18l3q8R7
6580C4j16P6K4L5k24K16m2N6m5L2L4j42J35p0P7pJ2l6L8rk7J04j64O4j06M0N2
6607D1j20q5J21M4Q8o2Km4kj5j4O1O7r9p2J62K0j45J30k8j32J30j31K3J08k6J1
6634C3k8N4l1o4N8p2J8m7rN9mq1j0P0J9m0J89r9K6n5n4J70j09n0J8K4Kpj03J61
$$ plain form
6441 -17 6 -11 10 -74 -58 100 -64 29 -45 -68 -43 125 41 17 -105 -6 26 73 70 4 27 -18 -44 -70 3 46 -71 -47
6469 -47 3 -20 -39 52 -50 -19 22 5 79 -70 18 8 48 -18 33 -85 -23 -194 -74 50 -49 23 0 68 -86 -37 119
6496 119 47 -47 46 -127 -18 -13 -25 -10 88 89 -1 -18 -17 -80 -79 77 57 -68 17 26 43 10 17 -69 69 0 64 108 -105 64
6526 64 28 67 -17 58 -5 -40 70 60 13 -4 -13 46 0 -3 144 27 -74 -125 65 -64 -75 52 -56 133 -67 -46
6552 -46 -93 6 -93 -15 -65 -4 -62 -78 72 -14 -43 -23 69 -23 28 -9 17 -119 203 41 -15 -77 -21 -60 58 25 -63 34
6580 34 -82 -6 18 53 -171 45 3 59 14 46 80 -62 73 3 80 73 85 49 87 78 51 155 -9 55 -51 -11 41
6607 41 -79 -164 -43 1 89 27 29 -15 -17 -32 -46 15 82 -17 -89 73 93 -52 78 50 -82 48 -83 -60 48 22 33
6634 33 5 59 28 -36 22 -50 -32 -79 -88 -29 -33 -114 -124 -54 -35 -75 114 15 41 -14 -68 102 -7 -57 -39 -15 -13 -20 -123 38
6664C8P0j77j9J97j10J30m9K8p0l8m6M6R9j51J01q0J56k14N1K3r1J81Mn4m4Q9
6690G0O7k38J00N1r0J95j89lQ6r0j9M7Lk2Q4P2p7l8K8K6P8j95Q6j36J13J7M8l
6718G1j24L1M9L3r4L0OJ7Nq3L7P5p6m3j2L0R0k31J96j08O8J30j20N3j6j6M7p2
6746b7j1J11r4N6l8N0K5j90J07N1k1j15L08j39j50J17l8O7r2K2K9k5M8j01L4O3
6772D7j25J45q9L7Kp0O0m6J30j82N3N3R3j75J10J8q2j1J1J9m7Q8j72K06j10Q3
6798D6j16J26j59J66j8L5j11O1m5k1L6k9Q7J3p7k4J27j64J08r1O3j1n0J05q6J0
6824a9q8J88q3O1K4j86M1R7J19j92O4p1N1L2m0N4j67K12r1JL2j1k0P9j66oN5R5
6852F5p3k5j4K2P9p0k6K9O7j06O7l8l6J13o1o3O4K4P9j24M4q8K2pj7LJ9J29p7
$$ plain form
6664 38 108 -69 -88 109 -1 129 80 108 38 0 -46 0 99 -52 49 -31 125 -89 -38 -15 -106 75 79 25 -19 70
6690 70 137 -101 -1 50 -40 155 -34 -37 49 -41 -60 -13 -10 -32 52 124 47 9 37 63 141 -54 32 -104 9 26 74 71
6718 71 -53 -22 27 60 -34 -4 2 19 24 -59 -22 53 -23 -66 -78 -48 42 -189 7 -101 -33 97 -23 30 14 -2 45 -27
6746 -27 -38 73 -21 35 -3 47 72 -118 -11 40 19 -96 212 73 -77 40 2 69 -23 -1 28 3 51 -50 -16 47
6772 47 -78 67 -22 15 17 -53 7 -39 91 -91 -38 15 108 -67 43 61 -21 -32 -21 -2 -49 39 -133 73 -37 46
6798 46 -70 56 -103 63 45 80 -31 30 -15 -36 0 -29 58 71 -6 -30 97 -67 41 -50 13 2 -48 57 -29 -19
6824 -19 -107 81 -2 59 83 -103 -62 35 154 -38 26 -45 6 38 -2 52 -115 97 6 7 39 28 8 87 -79 -85 -30 65
6852 65 -8 -33 -47 -25 54 -16 -42 -13 54 -52 15 -23 -59 54 -7 -70 -6 18 97 -27 17 -71 -49 -56 -73 -70 -51 78 1
6881AJ3r3Q4j6k9K2L6l4q6J15j6Oq0l5Q9J3q7N6j7O9O2o2o5Q2j4m4M4p3J32j8
6911E5Qj79M0L8P8kj1jOl1%j3P0q5J05j8j29P6j2J08j25j0K7k0M6K5q1q7J59k8
6941Ilr9J57j59O9p8J14Mj6qL5N6q2R4j04P5l9j21R9Mo1P4Po7j0k9O3q8J45j05
6971f4J25p2Mk6Rq0K14p5P4j42%N1p0j6J40j46K2P0jj5O1j87J11P3L7q4j31J33
6999A5J1r9J76j59j23J66J5k8q1J61M5Oj30L0k2m7J45j04K3j2J00o5jk7j48K51
7025I8k22J17M9Mk7M4r7J00o8L8L4n7p3J02j12l2J31l2j3j43J60p7j00J14j1R0
$$ plain form
6881 1 14 -79 5 -11 -40 -18 18 -16 -102 13 -3 3 -77 -112 -23 -10 -97 -41 -58 11 73 11 -54 28 14 -30 14 -59 73 55
6911 55 63 -116 -76 -38 40 38 27 26 32 1 1 -12 58 -27 78 60 -69 7 -5 103 -22 -32 -5 -25 21 46 -35 -122 37 9
6941 9 6 -93 64 -95 -26 -104 10 14 -2 -10 25 81 -1 93 -11 64 25 -96 3 7 -54 20 27 -40 -50 -79 -16 -104 41 -64
6971 -64 61 -11 -7 -33 -24 -104 110 35 109 -33 -33 18 -52 -68 72 -74 -52 18 17 2 63 -124 -13 60 97 13 -118 15
6999 15 26 -73 103 -56 -179 -13 2 -26 -107 54 99 105 -25 5 -17 -64 81 -23 0 -12 88 23 22 -5 -153 98
7025 98 -124 -7 42 46 19 63 -34 66 -2 36 70 13 -60 42 -70 -102 29 -3 -16 -159 1 -76 -176 -62 -73 17
$$ [...]
8191A3
##END NTUPLES=NMR FID
##END=
