##TITLE=1H_DE-80H_X3
 200.13MHz, d2o
 8 sc
 
 19ns.26.2.2025
##JCAMPDX= 6.0         $$ Bruker NMR JCAMP-DX V2.0
##DATA TYPE= NMR FID
##DATA CLASS= NTUPLES
##ORIGIN= UXNMR, Bruker Analytische Messtechnik GmbH
##OWNER= pz
$$ XWIN-NMR		Version 3.5
$$ Thu Jul 23 16:30:16 2026 Russian Standard Time (UT+4h)  Yarkov@DPX200
##.OBSERVE FREQUENCY= 200.1313
##.OBSERVE NUCLEUS= ^1H
##.DELAY= (6, 6)
##.ACQUISITION MODE= SIMULTANEOUS
##.ACQUISITION SCHEME= undefined
##.AVERAGES= 8
##.DIGITISER RES= 18
##SPECTROMETER/DATA SYSTEM= spect
##.PULSE SEQUENCE= zg30
##.SOLVENT NAME= DMSO
##.SHIFT REFERENCE= (INTERNAL, DMSO, 0, 14.3821)
##AUDIT TRAIL= $$ (NUMBER, WHEN, WHO, WHERE, WHAT)
$$ ##TITLE= Audit trail, XWIN-NMR		Version 3.5
$$ ##JCAMPDX= 5.01
$$ ##ORIGIN= Bruker BioSpin GmbH
$$ ##OWNER= Yarkov
$$ C:/Bruker/XWIN-NMR/data/yarkov2/nmr/H-C/1/audita.txt
$$ ##AUDIT TRAIL=  $$ (NUMBER, WHEN, WHO, WHERE, WHAT)
(   1,<2026-07-23 16:29:33.34 +0400>,<Yarkov>,<DPX200>,
      <created by zg, POWCHK disabled, PULCHK disabled
       configuration hash MD5:
       00 E9 B6 7A A2 85 ED C7 34 08 36 98 17 FE 4E 26
       data hash MD5: 16K
       9A E1 50 24 D9 E6 BB 14 75 32 F7 90 3D 46 D7 E0>)
$$ ##END=
$$ 
$$ hash MD5
$$ E4 07 F7 59 A7 DB D4 9C C9 89 AD 87 6A 32 DA 98
##$RELAX= 
##$RELAX= 
##$RELAX= 
##$RELAX= 
##$RELAX= 
##$RELAX= 
$$ Bruker specific parameters
$$ --------------------------
##$DU= <C:/Bruker/XWIN-NMR>
##$EXPNO= 1
##$NAME= <H-C>
##$PROCNO= 1
##$TYPE= <nmr>
##$USER= <yarkov2>
##$AMP= (0..31)
100 100 100 100 100 100 100 100 100 100 100 100 100 100 100 100 100 100 
100 100 100 100 100 100 100 100 100 100 100 100 100 100 
##$AQSEQ= 0
##$AQ_mod= 1
##$AUNM= <au_zg>
##$AUTOPOS= <>
##$BF1= 200.13
##$BF2= 200.13
##$BF3= 200.13
##$BF4= 200.13
##$BF5= 200.13
##$BF6= 200.13
##$BF7= 200.13
##$BF8= 200.13
##$BYTORDA= 1
##$CFDGTYP= 0
##$CFRGTYP= 5
##$CHEMSTR= <none>
##$CNST= (0..31)
1 1 145 1 1 1 1 1 1 1 1 1 1 1 1 1 1 1 1 1 1 1 1 1 1 1 1 1 1 1 1 1 
##$CPDPRG= <>
##$CPDPRG1= <>
##$CPDPRG2= <>
##$CPDPRG3= <>
##$CPDPRG4= <mlev>
##$CPDPRG5= <mlev>
##$CPDPRG6= <mlev>
##$CPDPRG7= <mlev>
##$CPDPRG8= <mlev>
##$CPDPRGB= <>
##$CPDPRGT= <>
##$D= (0..31)
0 0.7 0 0 0 0 0 0 0 0 0 0.03 0 0 0 0 0 0 0 0 0 0 0 0 0 0 0 0 0 0 0 0 
##$DATE= 1784809772
##$DBL= (0..7)
120 120 120 120 120 120 120 120 
##$DBP= (0..7)
150 150 150 150 150 150 150 150 
##$DBP07= 0
##$DBPNAM0= <>
##$DBPNAM1= <>
##$DBPNAM2= <>
##$DBPNAM3= <>
##$DBPNAM4= <>
##$DBPNAM5= <>
##$DBPNAM6= <>
##$DBPNAM7= <>
##$DBPOAL= (0..7)
0.5 0.5 0.5 0.5 0.5 0.5 0.5 0.5 
##$DBPOFFS= (0..7)
0 0 0 0 0 0 0 0 
##$DE= 6
##$DECBNUC= <off>
##$DECIM= 32
##$DECNUC= <off>
##$DECSTAT= 4
##$DIGMOD= 1
##$DIGTYP= 9
##$DL= (0..7)
0 120 120 120 120 120 120 120 
##$DP= (0..7)
150 150 150 150 150 150 150 150 
##$DP07= 0
##$DPNAME0= <>
##$DPNAME1= <>
##$DPNAME2= <>
##$DPNAME3= <>
##$DPNAME4= <>
##$DPNAME5= <>
##$DPNAME6= <>
##$DPNAME7= <>
##$DPOAL= (0..7)
0.5 0.5 0.5 0.5 0.5 0.5 0.5 0.5 
##$DPOFFS= (0..7)
0 0 0 0 0 0 0 0 
##$DQDMODE= 0
##$DR= 18
##$DS= 0
$$ [...]
##$SUBNAM2= <"">
##$SUBNAM3= <"">
##$SUBNAM4= <"">
##$SUBNAM5= <"">
##$SUBNAM6= <"">
##$SUBNAM7= <"">
##$SUBNAM8= <"">
##$SUBNAM9= <"">
##$SW= 18.0517328524113
##$SWIBOX= (0..15)
0 0 2 0 0 0 0 0 0 0 0 0 0 0 0 0 
##$SW_h= 3612.71676300578
##$TD= 16384
##$TD0= 1
##$TE= 0
##$TE2= 300
##$TE3= 300
##$TEG= 300
##$TL= (0..7)
0 120 120 120 120 120 120 120 
##$TP= (0..7)
150 150 150 150 150 150 150 150 
##$TP07= 0
##$TPNAME0= <>
##$TPNAME1= <>
##$TPNAME2= <>
##$TPNAME3= <>
##$TPNAME4= <>
##$TPNAME5= <>
##$TPNAME6= <>
##$TPNAME7= <>
##$TPOAL= (0..7)
0.5 0.5 0.5 0.5 0.5 0.5 0.5 0.5 
##$TPOFFS= (0..7)
0 0 0 0 0 0 0 0 
##$TUNHIN= 0
##$TUNHOUT= 0
##$TUNXOUT= 0
##$USERA1= <user>
##$USERA2= <user>
##$USERA3= <user>
##$USERA4= <user>
##$USERA5= <user>
##$V9= 5
##$VALIST= <valist>
##$VCLIST= <CCCCCCCCCCCCCCC>
##$VD= 0
##$VDLIST= <DDDDDDDDDDDDDDD>
##$VPLIST= <PPPPPPPPPPPPPPP>
##$VTLIST= <TTTTTTTTTTTTTTT>
##$WBST= 1024
##$WBSW= 4
##$XGAIN= (0..3)
0 0 0 0 
##$XL= 0
##$YL= 0
##$YMAX_a= 82181
##$YMIN_a= -145498
##$ZGOPTNS= <>
##$ZL1= 120
##$ZL2= 120
##$ZL3= 120
##$ZL4= 120
##$ABSF1= 10
##$ABSF2= 0
##$ABSG= 5
##$ABSL= 3
##$ALPHA= 0
##$AQORDER= 0
##$ASSFAC= 0
##$ASSFACI= 0
##$ASSFACX= 0
##$ASSWID= 0
##$AUNMP= <proc_1d>
##$AZFE= 0.1
##$AZFW= 0.1
##$BCFW= 1
##$BC_mod= 2
##$BYTORDP= 1
##$COROFFS= 0
##$CY= 83.5205535888672
##$DATMOD= 1
##$DC= 2
##$DFILT= <>
##$DTYPP= 0
##$F1P= 10.8118882576601
##$F2P= -7.23987719738617
##$FCOR= 0.5
##$FTSIZE= 0
##$FT_mod= 4
##$GAMMA= 1
##$GB= 0.15
##$INTBC= 1
##$INTSCL= 1
##$ISEN= 128
##$LB= 0.25
##$LEV0= 0
##$LPBIN= 0
##$MAXI= 10000
##$MC2= 0
##$MEAN= 0
##$ME_mod= 0
##$MI= 1.114404
##$NCOEF= 0
##$NC_proc= 0
##$NLEV= 6
##$NOISF1= 3.799351
##$NOISF2= 2.8
##$NSP= 1
##$NTH_PI= 0
##$NZP= 0
##$OFFSET= 14.38212
##$PC= 1
##$PHC0= -7254.183
##$PHC1= 2.82197
##$PH_mod= 1
##$PKNL= yes
##$PPARMOD= 0
##$PSCAL= 0
##$PSIGN= 0
##$REVERSE= no
##$SF= 200.129724274929
##$SI= 16384
##$SIGF1= 3
##$SIGF2= 2
##$SINO= 400
##$SIOLD= 16384
##$SREGLST= <1H.CDCl3>
##$SSB= 0
##$STSI= 0
##$STSR= 0
##$SW_p= 3205.1282051282
##$SYMM= 0
##$S_DEV= 0
##$TDeff= 0
##$TDoff= 0
##$TI= <>
##$TILT= no
##$TM1= 0
##$TM2= 0
##$TOPLEV= 0
##$USERP1= <user>
##$USERP2= <user>
##$USERP3= <user>
##$USERP4= <user>
##$USERP5= <user>
##$WDW= 1
##$XDIM= 8192
##$YMAX_p= 0
##$YMIN_p= 0
$$ End of Bruker specific parameters
$$ ---------------------------------
##NTUPLES= NMR FID
##VAR_NAME=  TIME,          FID/REAL,        FID/IMAG
##SYMBOL=    X,             R,               I
##VAR_TYPE=  INDEPENDENT,   DEPENDENT,       DEPENDENT
##VAR_FORM=  AFFN,          ASDF,            ASDF
##VAR_DIM=   8192,          8192,            8192
##UNITS=     SECONDS,       ARBITRARY UNITS, ARBITRARY UNITS
##FACTOR=    0.0002768,     1,               1
##FIRST=     0,             0,               0
##LAST=      2.2672688,     0,               0
##MIN=       0,             -145498,         0
##MAX=       2.2672688,     82181,           0
$$ Real data points
##PAGE= N=1
##DATA TABLE= (X++(R..R)), XYDATA
0 0 0 0 0 0 0 0 0 0 0 0 0 0 0 0 0 0 -7 8 -8 8 -8 13 -15 16 -19 23 -24 31 -34 39 -47 55 -61 69 -78 86 -96 109
38 109 -122 135 -151 169 -188 208 -228 253 -279 308 -340 374 -412 453 -500 554 -610 675 -748
57 -748 832 -929 1045 -1181 1347 -1555 1823 -2185 2700 -3493 4900 -8115 32478 -46098 -128672
72 -128672 -47386 20375 55565 53607 36194 -27586 -74820 -49386 6553 32168 60561 54096
84 54096 -19280 -87122 -62309 23305 70224 38245 5076 -15025 -44568 -44032 1363 42998 53866
97 53866 26465 -15185 -50993 -57859 -7960 57140 59315 13907 -30726 -56620 -42433 4075 50429
110 50429 61677 16166 -38458 -55598 -41545 5179 60410 61423 8669 -52514 -67154 -18213
122 -18213 37954 55312 35939 -10707 -45242 -39720 -13775 20682 41322 28372 -1159 -33250
134 -33250 -47935 -18000 28235 49322 29968 -17870 -41219 -26213 -7431 13396 31862 28398
146 28398 4777 -31149 -45261 -14305 25334 44158 32258 -11777 -45044 -38213 -6530 30334
158 30334 39601 15963 -10525 -34205 -38417 -5705 32072 43351 19007 -24561 -41450 -26177
170 -26177 -270 31916 40882 10961 -24724 -40043 -21009 14923 29141 24621 8370 -20568
182 -20568 -32842 -19119 4298 28283 28326 5283 -18652 -34216 -20398 15013 28676 19614 3141
195 3141 -17615 -26151 -19482 2774 31914 29411 -658 -22813 -30009 -14665 14864 28395 21596
208 21596 -916 -24717 -24792 -11344 7194 29852 25962 -4152 -27837 -29984 -6027 20937 24939
221 24939 16076 -3716 -26472 -24521 -4057 16623 27470 12967 -10264 -22271 -22065 -1362 21498
234 21498 20636 9165 -6823 -21295 -17849 -3983 14320 26168 9932 -13588 -21112 -16565 1910
247 1910 18535 17823 9287 -7656 -22363 -15882 -512 15846 24015 7229 -14153 -21275 -14986 6174
261 6174 20606 15716 5790 -10337 -22383 -13302 3810 18879 20766 595 -16644 -17820 -9844
274 -9844 8805 19272 12833 2380 -13025 -20079 -7758 7025 17626 15396 -3476 -15251 -13557
287 -13557 -6348 9238 16504 10493 1211 -13579 -18742 -5103 8764 16997 12307 -5668 -14038 -11618
301 -11618 -4870 9970 15885 9208 -1074 -15073 -16951 -1667 10118 15674 9190 -7901 -13356
314 -13356 -9962 -2262 11507 14370 6087 -3435 -15493 -13713 1894 11361 13862 5357 -9187 -11663
328 -11663 -8017 -625 11913 12919 3885 -5608 -15013 -10093 4203 10566 11759 3350 -9533 -10708
342 -10708 -6618 1169 12199 10935 2103 -6831 -14696 -7295 6455 10286 9369 1092 -9334 -9173 -5827
357 -5827 2572 13106 9173 -655 -7897 -12804 -4251 7179 9366 7941 -875 -9826 -7634 -3920 3685
372 3685 12330 7570 -1722 -8967 -11557 -988 8258 7583 6037 -1824 -9336 -7026 -2898 5661 11891
387 11891 4802 -3097 -8460 -10041 418 8384 7006 4297 -3714 -8749 -5161 -1739 6253 11276 2908
402 2908 -4790 -8258 -7512 2182 7238 5840 3968 -4446 -9001 -4026 538 7098 8927 971 -4641
417 -4641 -7662 -6308 3487 6920 4702 2953 -4807 -8231 -3474 1428 8164 7882 -1491 -5135 -6090 -4515
433 -4515 3590 6121 4593 1972 -6160 -7633 -1662 2475 7822 6336 -2539 -5322 -5753 -2647 4697
448 4697 4885 3405 1589 -6185 -6795 -868 3132 7481 4554 -3374 -4795 -5354 -2235 5244 5023 2720
464 2720 -7 -6311 -5182 97 3185 7301 3234 -4207 -4603 -4314 -857 5132 4464 2643 -1253 -7296
480 -7296 -3679 2199 3391 5308 1724 -3727 -3988 -4283 92 5864 3366 1214 -1594 -6414 -2842 2206
496 2206 3974 4929 -491 -4181 -1961 -3072 -555 4699 3888 1866 -2876 -6900 -1486 2867 3468 4276
512 4276 -686 -4081 -2779 -3091 1340 5134 2420 952 -2878 -6182 -987 3042 3972 3933 -2301 -4627
528 -4627 -1594 -1454 1680 4155 1670 203 -3716 -5391 865 2949 2577 2982 -1942 -4031 -2156 -1104
544 -1104 3243 3528 -255 -265 -3056 -3601 1303 1257 2127 2929 -1339 -2482 -2575 -1811 4001 5014 -119 -444
562 -444 -3107 -3885 790 2809 3451 1690 -3956 -2905 -916 -1389 3145 4347 -345 -2496 -4064 -1245
578 -1245 2850 1317 1922 2057 -3734 -3482 -253 1016 3121 1496 -1019 -344 -3403 -1025 4177 1757
594 1757 229 -50 -2330 -1008 -479 -644 3360 999 -992 0 -2050 -2265 1963 1228 2876 1711 -3937
611 -3937 -2321 -1639 740 4681 1933 -2010 -1851 -2827 -169 3179 1746 1850 -996 -4224 -1026 493
627 493 1274 3412 39 -2414 -1342 -1729 1274 2414 -14 950 -398 -2860 -294 426 1017 2373 -696
644 -696 -1100 -122 -1509 547 1563 -301 1421 428 -2076 -925 -1358 830 3521 621 -942 -1610 -3247
661 -3247 866 3527 1583 513 -2456 -2868 528 376 1866 3112 -1283 -2303 -816 -636 1994 1765
677 1765 -36 462 -2005 -2127 1569 657 569 1195 -1019 -365 -630 -1180 1926 1112 -689 827 -878 -1246
695 -1246 541 -132 1342 1597 -1030 76 -464 -1876 1107 1729 924 1066 -2276 -2119 618 556 2280
712 2280 1470 -1982 -1212 -825 -184 2486 1108 -322 11 -2123 -887 1513 549 1475 115 -2139 116
729 116 34 -266 2033 319 -382 282 -1390 -102 811 -294 1442 724 -1687 38 -215 -264 1325 56
747 56 383 564 -1886 -412 724 -258 1627 713 -1372 -481 -1242 352 2518 128 -222 -42 -2131 -275
765 -275 1080 614 1546 -624 -1911 409 -262 579 1900 -489 -546 -321 -1339 793 876 -327 1107 -579
783 -579 -1091 630 -487 428 1350 -660 117 197 -1298 542 509 -29 1206 -667 -849 371 -956 316
801 316 1667 -187 25 -540 -1421 782 409 184 1314 -1032 -1232 367 -288 950 1210 -861 -35 -797
819 -797 -1225 1459 661 -261 546 -1003 -441 574 -519 959 622 -1219 320 -103 -960 817 -25 145
837 145 677 -1146 -266 619 -811 732 838 -628 220 -848 -726 1211 -146 251 883 -1341 -673 268
855 268 -161 1315 303 -953 482 -689 -636 1252 3 65 215 -1348 130 518 -436 1104 50
872 50 -1126 210 -467 -203 900 -690 351 405 -1232 131 463 -445 959 -162 -510 354 -1078 -63
890 -63 1264 -529 144 331 -846 315 -106 -245 1320 -282 -675 448 -943 161 1005 -335 367
907 367 -221 -1136 818 138 -439 1055 -144 -476 129 -919 547 811 -661 407 -83 -1109 645
924 645 193 -99 745 -725 -100 495 -1164 267 1007 -374 262 -386 -574 842 -283 -84 1028 -765
942 -765 -281 298 -769 462 447 -366 603 -633 -849 1017 -46 -234 571 -557 23 134 -867 949
960 949 361 -654 541 -442 -619 681 -311 347 434 -1212 154 353 -823 692 337 -451 482 -663
978 -663 -194 886 -567 197 725 -735 57 107 -357 836 -219 -408 646 -542 -468 802 -314 386
996 386 282 -980 385 -58 -542 997 20 -515 465 -542 44 403 -450 596 328 -962 361 108
1014 108 -333 666 -335 -187 604 -914 336 646 -623 416 170 -756 355 -212 -133 861 -560 -202
1032 -202 587 -723 166 314 -343 666 -213 -756 591 -270 -230 806 -459 -33 340 -768 514 208
1050 208 -565 643 -106 -657 544 -221 57 658 -582 108 220 -728 615 301 -359 537 -366 -369 663
1069 663 -574 26 699 -531 166 150 -665 452 138 -238 874 -551 -439 746 -357 12 397 -458
1087 -458 331 -65 -663 856 116 -384 538 -403 -53 611 -438 303 315 -613 472 196 -544 537 -24
1106 -24 -178 439 -655 73 611 -694 374 375 -550 363 -159 -493 490 -294 93 696 -706 -16 456 -502
1126 -502 435 83 -603 347 -332 -377 764 -59 -61 371 -771 268 500 -498 524 16 -592 505 -133
1145 -133 56 602 -529 -31 474 -473 183 237 -487 344 -193 -240 460 -573 -159 673 -572 20 299 -414
1165 -414 345 -34 -440 887 -180 -434 484 -317 -95 670 -233 211 -99 -668 487 62 -431 617 -382
1184 -382 -519 496 -144 289 199 -835 269 324 -400 535 -104 -473 424 -250 11 384 -625 45 373
1203 373 -545 379 162 -508 362 -191 -96 634 -415 -147 323 -349 350 323 -531 330 -122 -412 508 -80
1223 -80 -98 270 -554 83 301 -514 523 215 -627 365 6 -132 396 -349 8 320 -631 307 434 -665
1243 -665 96 44 -240 291 -335 -276 564 -554 4 610 -422 -10 115 -257 495 -113 -336 472 -506 -228
1263 -228 524 -226 0 183 -535 258 -21 -460 431 -38 -271 335 -411 57 380 -321 441 91 -523 374
1283 374 205 -375 358 -241 -156 271 -345 34 334 -469 216 230 -267 383 -186 -256 460 -172 -121 370 -355
1304 -355 -47 186 -296 391 38 -454 488 -199 -225 473 -236 -133 194 -285 279 136 -513 256 -20 -353
1324 -353 250 -71 -154 273 -473 66 295 -431 224 240 -491 221 -93 -125 506 -321 -146 361 -324 51 302
1345 302 -342 280 -32 -157 493 -30 -323 412 -262 -113 363 -273 148 40 -426 313 145 -350 316 -176
1365 -176 -152 305 -311 -70 218 -576 -150 175 -322 300 143 117 534 226 -375 487 -467 50 741 493 744
1386 744 493 -1141 2 -171 -76 227 -1308 465 -204 -242 54 283 -328 648 16 28 28 348 339 -34 -50
1407 -50 69 223 -56 811 521 -68 807 13 -128 591 -285 227 555 319 -236 681 -283 148 424 623
1427 623 740 -554 52 -209 -249 -132 369 -691 -57 574 226 228 109 -317 375 -606 -196 299 -607 276
1447 276 -371 48 985 287 -798 128 251 59 539 -297 -141 197 -628 -285 244 -83 180 61 -207 313
1467 313 -212 -60 288 -370 92 226 -413 110 19 -315 247 -4 -61 352 -326 -43 289 -206 0 76 -212
1488 -212 239 -37 -232 228 -36 -27 274 -241 71 101 -347 146 191 -205 280 -48 -156 215 -69 -59 219 -384
1510 -384 113 208 -279 217 198 -362 217 -110 -51 246 -348 -75 209 -213 112 139 -190 268 33 -178 337
1531 337 -191 -155 288 -179 -96 115 -297 177 -1 -271 273 0 -317 276 -104 -62 199 -272 49 144 -295
1552 -295 -43 107 -246 214 -126 -198 301 -165 -57 301 -270 -24 113 -116 143 -218 -245 378 47 -53 270
1573 270 -166 0 142 -206 49 59 -285 119 -156 -320 250 -138 -84 91 -98 65 171 -308 309 79 -249
1594 -249 266 -74 -59 159 -211 -17 249 -292 157 72 -310 167 -24 -112 233 -73 -158 219 -294 13 208
1615 208 -150 126 -52 -210 85 -35 -221 140 -130 -171 198 -212 22 169 -254 184 27 -86 239 -139
1635 -139 -138 69 -175 30 49 -343 48 139 -174 -12 64 -166 163 -137 56 216 -184 79 98 -169 103 35
1657 35 -157 153 -158 -95 355 -102 -147 136 -108 -33 123 -249 215 -20 -212 229 -64 13 194 -234 -27 199
1679 199 -125 74 -49 -103 113 94 -135 85 -88 -48 -3 -142 153 168 -206 -30 -48 -119 238 -188 -68 302
1701 302 -27 -167 111 -249 115 44 -293 124 -38 -155 245 -68 -141 152 -58 35 68 -228 164 106 -110 168
1723 168 -46 -29 147 -82 -14 207 -118 -2 103 -223 163 128 -168 20 22 28 79 -146 -100 72 -206 2 -81
1746 -81 -59 161 -111 -210 201 -79 -23 256 -92 103 80 -105 79 51 -110 127 23 -159 128 72 -28 74
1768 74 -204 183 151 -170 32 32 24 175 -1 -111 115 -167 -122 115 -85 72 123 -247 168 78 -88 111 -69
1791 -69 191 537 -94 -41 -49 -107 99 178 291 390 180 7 121 -128 -66 277 -84 -10 70 1 151 41 -250 203
1815 203 3 -14 94 -134 -77 199 -174 -5 168 -197 107 -160 -130 152 113 -77 101 -164 44 159 -146
1836 -146 71 93 -87 96 -90 -130 340 4 -54 32 -172 101 17 -190 128 112 -172 30 27 12 212 -87 -153
1859 -153 104 -73 142 41 -129 128 76 -65 -14 -44 117 69 -224 -79 -168 -256 12 117 -189 26 4 -204
1881 -204 159 -206 46 86 -95 -81 127 -336 54 170 -86 12 -58 -484 171 -170 129 175 184 45 129 -146 71
1904 71 4 -9 146 -65 -26 174 -13 -7 54 -240 -74 146 -194 -59 -20 -45 174 -11 -19 127 -98 14 7 -78 60
1929 60 -20 -232 103 21 -13 201 -83 45 18 -19 38 27 -148 127 202 -113 50 51 -11 19 -136 10 236 -81
1953 -81 50 -85 -26 160 -19 -206 43 -65 114 175 -161 -4 35 -286 -92 -86 3 138 -63 -32 141 -118 -119
1976 -119 61 -149 51 106 -181 31 82 -36 132 -126 -5 169 3 -21 -3 -194 126 131 -172 107 24 -176
1998 -176 487 149 -113 211 -185 -3 81 -29 129 58 -245 93 80 24 3 -91 65 114 -62 -19 -50 -90 89
2021 89 14 -188 25 -88 -128 68 -194 117 86 -190 107 68 -110 29 19 -75 123 -140 -78 -12 -67 34 150
2044 150 -100 -38 -17 -118 83 -25 -208 83 -143 -76 -2 -13 106 -8 -231 106 39 -43 51 120 -78 10 -134
2067 -134 20 -54 -18 638 30 47 259 611 -183 364 -853 -339 108 -67 9 53 -28 -33 -74 -150 86 23 -31 154
2091 154 6 1 152 -195 -74 34 -66 109 86 -73 185 11 -68 32 -74 -4 34 -90 70 15 -59 108 9
2114 9 -38 46 -14 -61 53 -212 97 84 -200 71 -22 3 -231 -324 -209 -166 -95 -90 98 -110 144 22 -213 169 78
2139 78 -43 87 -73 -35 193 -71 -48 54 52 -12 14 -100 135 54 -11 63 -124 -25 32 -92 -51 -8 -78 38 -24
2164 -24 -94 -11 4 -17 -25 -62 74 19 -163 108 83 -67 74 -12 -122 259 -56 -67 111 -17 -38 -40 -184 95 -8
2189 -8 -45 86 118 -33 146 -86 -83 9 -114 -6 -9 -110 6 82 -176 139 40 -8 38 -94 -109 100 4 -26 5 -64
2215 -64 -6 128 -109 8 -109 -34 32 -122 96 85 -6 88 60 -184 51 -7 -125 -18 64 -17 179 -134 -37 48
2239 48 -37 5 32 -21 148 -46 -218 123 -91 -5 60 -23 53 45 -43 67 -94 -87 101 16 -31 110 69 5 -7 -98 -42
2266 -42 -44 -66 98 -31 -54 69 9 -54 131 -52 -2 147 -35 -13 -5 -137 70 -149 -45 77 -214 -140 131 -167
2290 -167 25 92 -89 106 71 -45 133 -45 -50 170 -168 18 56 -83 1 -35 -203 53 30 -131 58 -14 -66
2313 -66 71 -99 97 120 -128 9 85 -111 230 3 -52 148 -16 -125 -43 -175 57 85 -37 -15 104 -78
2335 -78 146 56 29 -7 -35 -46 26 -57 -35 73 -129 71 93 -44 -53 -94 -3 37 -104 -56 -1 -130 89 39 -67 67
2361 67 -37 -43 176 -49 36 44 -209 69 56 -35 23 14 -110 72 24 13 -111 -110 -93 121 -58 15 14 4 10 53 -76 140
2389 140 -21 21 82 -78 -42 223 -135 152 63 -37 77 122 -3 224 -181 -187 451 -201 65 -69 -129 70 -1
2412 -1 -149 119 -63 -54 -4 -5 -84 83 -85 7 168 -26 51 157 -32 47 -51 -51 100 -77 27 157 -18 -12 48 16
2438 16 -5 -57 -91 68 -79 -24 86 -60 -40 88 47 165 -37 -142 39 5 -35 -31 -41 -34 29 88 13 41 -79 16
2464 16 3 -83 75 -41 -34 -37 -51 49 59 -19 46 61 -67 -136 16 -6 109 -143 14 21 -174 60 26 -71 71 -27
2490 -27 -113 12 -75 -23 68 -115 119 158 -37 33 -42 2 43 7 -110 155 -11 99 9 -93 14 -16 -74 -31 -62
2515 -62 -58 34 28 41 126 -70 -55 167 -82 36 -27 -24 170 110 -100 55 -60 -64 -30 -69 -50 -52 -90 7 203 -15 -2 -151
2543 -151 -69 -23 -92 -68 171 -14 -55 59 -213 9 9 -90 -92 -16 -16 4 -94 -31 88 -19 -25 54 -70 159 -30 27 64
2570 64 27 -39 96 -135 10 -48 12 33 110 -35 36 -55 -115 11 59 52 -19 -42 74 44 -29 -15 23 -170 58 91 -8
2597 -8 105 -88 -28 60 -99 12 18 -28 73 10 -139 84 -110 -50 29 -15 -45 52 -43 -102 102 -77 80 -42 -68
2622 -68 156 -95 -25 77 -13 48 4 106 -28 -67 -105 70 -75 56 84 -1 59 54 -5 -69 -7 25 91 -120 -60 49
2648 49 -45 3 17 -62 8 90 -35 7 8 56 28 -60 34 104 -28 -12 71 -93 74 66 -90 35 -43 -144 27 72 -62
2675 -62 50 -34 -57 45 -92 42 42 -62 104 -57 -81 152 -83 38 74 -34 -19 51 -52 26 45 -9 90 39 -48
2700 -48 71 -60 -112 115 -93 20 24 -62 51 17 30 65 -48 -100 -20 -43 28 -42 -129 -76 19 45 72 -44 -155 137
2726 137 -56 -81 12 -115 -31 14 91 -26 -390 -99 102 -581 -357 -403 -71 70 218 -534 -18 -372 -1031 160
2748 160 -213 275 567 319 215 -24 -300 -10 -67 -36 -18 -85 -44 -4 -30 -109 188 71 -39 -7 -71 -33 -16 -86
2772 -86 0 48 -105 61 -6 13 74 4 -17 40 -79 31 -91 82 48 -5 -53 107 29 19 88 -59 -48 -105 -6 -52
2798 -52 74 -99 79 -28 64 40 -60 -53 87 157 82 25 -77 73 -3 4 -5 -2 -51 51 46 29 2 -21 -40 52 -36 56
2826 56 -27 -112 131 -20 -74 24 20 -19 -5 -23 -4 52 -184 -89 31 94 177 -12 -25 120 49 74 -21 58 -2 -105 -17
2853 -17 73 89 17 53 -16 34 -62 -50 101 -7 -44 122 137 -95 -24 -14 -41 -10 -92 18 -12 -204 -67 55 51 9 -21
2880 -21 -4 43 -67 -90 51 31 -10 15 -97 28 -31 -50 121 18 -80 109 -20 7 -33 -100 150 11 -13 -50 -73
2905 -73 -115 12 12 -34 37 -61 -71 -31 -15 63 -10 -4 -89 -16 -51 49 -64 25 165 -112 71 -35 37 -12 41 64 -33 -46
2933 -46 22 52 -53 -14 -42 -46 107 -5 -37 79 -32 -180 -9 -41 -74 77 73 12 170 -64 50 13 1 61 38 -57
2959 -57 92 -123 77 41 -28 -76 46 -122 53 78 -89 28 -89 -143 39 -46 -96 87 -162 73 -17 60 75 -132
2983 -132 -107 -17 -147 -100 81 -52 -119 7 23 -49 25 -108 -7 14 41 29 13 34 -110 -85 -13 -44 -124 -59 -35 -24
3009 -24 160 54 -116 104 -44 -8 28 -88 67 -80 -114 26 -33 -4 111 -131 28 18 -50 60 -41 -119 -3
3032 -3 72 47 -7 -48 27 34 -79 18 -20 -116 24 -59 -94 150 86 7 -20 6 -33 11 25 51 -68 -74 -79 84 -41 -84 29
3061 29 -45 49 -38 -14 -15 -54 81 105 -86 35 -21 49 52 55 5 110 -44 13 -13 -99 60 12 45 -18 -57 -46 27 -76
3089 -76 51 71 -27 -33 -78 40 39 -1 -11 54 22 -64 168 -15 9 164 34 47 -20 -121 -56 43 38 31 -57 -10 3 17 49
3118 49 -7 -81 153 -18 -135 -38 -13 -62 163 -71 18 -1 0 -79 59 -54 -33 58 51 58 141 17 62 55 69 -19 -59 85
3146 85 23 -72 213 14 -31 167 22 -1 4 -25 32 -52 -15 71 13 13 -124 53 -36 94 -27 -64 193 -8 145 50
3172 50 -82 87 61 107 148 -59 -10 16 49 -76 107 -96 30 -33 -80 -62 -10 103 183 -64 -6 291 -146 106
3196 106 -48 17 30 108 -124 78 59 -68 -27 35 93 -18 -124 123 32 -41 6 -56 8 26 59 -9 75 -22 -69 73
3222 73 -46 -25 13 -107 93 40 -55 40 -22 -14 -32 -67 48 42 43 28 41 47 100 47 45 83 6 -34 31 -11 -30 119 -9 170
3252 170 78 6 24 -61 -89 74 20 59 24 -87 69 52 -1 59 156 16 92 64 -92 -2 -50 -60 37 -113 12 120
3278 120 79 79 -123 -2 -25 10 -78 40 -173 -39 70 -35 130 29 -40 13 70 -71 83 -227 92 297 -16
3301 -16 50 31 -3 80 -111 23 78 -173 -39 129 28 52 5 -67 88 -3 67 163 79 -25 43 -49 -4 -20 73 -75
3327 -75 -28 -115 35 -33 -49 134 36 90 40 -30 -119 132 -48 -139 4 46 27 -36 -49 -38 -8 -33 65 120 40 77 -111
3354 -111 24 -5 -33 -20 12 -50 -34 -48 -37 27 -73 47 24 -16 10 -87 -122 -35 47 -73 -26 55 -107 -8 -4 -12 -41 48
3382 48 106 -33 -46 101 -2 -94 -9 -25 -100 41 -118 21 17 -3 -11 58 -6 145 89 -52 60 -60 27 49 -66 44
3408 44 -52 -58 -12 -16 -23 9 -56 28 35 -50 3 44 -103 57 7 -103 72 -142 -29 18 -62 -29 3 -40 -58 -24 -29 -31 16 -13
3438 -13 41 93 30 68 -58 13 -44 -116 -73 65 -78 -17 -23 -17 19 -37 54 108 21 86 -10 -137 53 -3 3 86 -64 -101 131
3467 131 -46 -25 -56 -60 -3 5 -60 96 22 31 12 -20 -11 -53 -1 -25 -76 -66 4 8 -128 -17 -37 -9 74 -35 -36 35 -19 77
3497 77 123 96 -45 34 -87 106 48 -52 -78 -32 -55 207 -80 136 -74 1 30 -42 -73 78 -80 -243 -90 -7
3521 -7 17 -58 26 50 61 -93 7 -147 -78 -62 -142 1 89 -50 -128 19 -61 10 -22 -73 136 55 -31 11 -50 -14 -8 -113
3549 -113 7 87 42 13 -67 -117 20 -27 -1 -9 -106 96 -8 -47 61 61 2 4 -28 -5 16 110 9 14 45 -46 -15 5 139
3578 139 -11 54 -39 -89 -62 12 -13 -13 -41 -62 -27 63 20 139 -45 70 92 -19 52 48 -65 114 46 -5 -113 -112 -91
3605 -91 80 -77 9 54 -13 106 153 53 26 84 -42 0 -33 39 34 144 -97 73 -65 132 -77 -8 -21 -17 -59 -13
3631 -13 -66 -110 17 32 72 4 -24 65 55 41 15 -27 -49 48 -7 -52 4 27 28 21 95 8 113 -11 -22 28 84 74 21 0
3661 0 38 -139 -2 9 -64 -55 21 -26 -14 -52 6 56 54 -2 -33 46 82 20 -16 149 30 -9 37 2 132 31 -158 90
3689 90 -80 33 -69 47 -57 -61 42 13 95 -118 -78 61 -17 -3 10 34 40 -70 -20 74 -36 -148 -4 -95 -78
3714 -78 39 -55 -32 14 -72 52 -57 -22 43 60 33 59 -76 6 -5 -66 16 33 -95 17 18 -63 -22 -55 -29 65 -100
3741 -100 -77 67 -97 -6 -91 131 -27 -180 34 -32 16 104 63 115 0 -83 -60 16 4 59 17 24 33 112 -13 -34 -38
3768 -38 5 23 25 -54 16 -153 21 146 -58 26 70 -43 31 -29 6 -61 19 -105 58 -25 5 -56 -29 111 -6 -114
3794 -114 65 50 -8 16 85 -26 102 -90 49 -12 -5 41 -20 58 21 17 -34 147 -81 -25 71 116 -19 0 -34 28 -107
3821 -107 -1 1 -48 -16 -33 32 4 -2 4 22 -9 -42 32 12 52 16 -18 -95 84 64 -45 -56 -95 49 50 34 -42 -47 -58 -33
3851 -33 68 23 78 -26 9 60 -136 59 115 7 -21 40 -30 99 1 -28 -150 -45 7 42 1 64 85 -31 126
3876 126 -90 31 -21 -51 83 16 -47 87 58 31 -85 45 -86 91 18 12 -16 -57 31 45 -59 -60 -59 -37 137 44
3902 44 -1 71 -49 -78 -123 -60 62 -51 -73 -12 7 -51 -7 6 71 60 78 43 -24 -95 -23 28 -82 30 -9 53 -123
3929 -123 125 -105 118 -91 28 -266 107 51 -400 278 366 120 -730 -25 -659 283 -194 -291 43 -84 -277
3950 -277 376 252 418 413 549 225 -739 -591 84 142 44 -34 -269 -66 -97 107 -160 147 -221 -309 -219 168 233
3973 233 -45 170 7 252 -123 -24 -64 130 93 -22 -35 114 -91 98 -32 -70 61 17 -57 -29 100 52 95
3996 95 -8 -26 -120 -25 79 -48 -90 20 4 53 144 -36 -18 6 -340 -254 -84 259 -957 -67 -416 -227 -628
4019 -628 -81 563 228 696 364 -74 -424 155 -191 -74 -40 24 -17 -39 -99 56 54 -15 -108 30 -54 25 -21 75
4043 75 -44 -109 50 -65 -14 49 -59 -22 -46 34 -34 41 37 81 146 29 87 -64 -136 -7 -9 164 -67 -42 61 36
4069 36 46 84 -101 16 -64 75 65 -24 -6 -6 18 121 -50 35 -104 119 -15 -13 35 27 168 311 -347 561 -732
4094 -732 218 -607 66 722 166 66 296 353 -1045 382 444 -364 15 223 184 74 -708 -286 -144 -30
4114 -30 -642 -172 -31 -71 55 58 85 76 -205 -10 -83 70 -63 155 18 26 -45 25 -3 -3 -91 -13 45 79 0 49 -263
4141 -263 -172 21 -34 -45 0 -32 -97 -11 3 10 -97 -11 -40 -66 67 -75 4 -9 -8 84 -42 30 -27 108 2 -7 -28 57
4169 57 -71 25 16 30 -28 -138 12 -73 -7 -71 51 -67 7 -51 36 10 -9 32 -14 -59 -93 77 -91 94 32 -28 76
4196 76 5 -23 18 30 34 1 -29 -17 43 1 -12 -58 85 30 -57 10 -18 71 -3 -56 -31 101 -8 -64 13 -54 -25 -1 -62
4225 -62 -55 -52 -48 -60 4 16 -122 -58 -83 -43 -49 -34 33 -45 -23 -20 -29 -50 19 -6 45 -86 1 41 -40 -70 68 -23 38 31 25 38 10
4258 10 168 17 -31 -9 -64 -51 -12 0 86 -45 27 87 -107 -18 20 60 -24 -45 -1 54 -41 -69 -3 -49 13 -73 -43 -24
4286 -24 -65 1 59 -133 56 -28 -37 8 -132 -69 76 26 179 -36 -57 -37 -7 -33 -84 42 10 131 -16 -62 -95 -32
4312 -32 59 74 41 49 -73 76 -18 11 -51 76 82 -51 119 12 -45 55 -10 43 21 64 79 0 -28 52 93 31 41 -168
4340 -168 -52 61 33 -49 -52 30 35 133 -87 -76 -67 1 93 -31 -73 16 -68 80 5 -38 13 64 36 -7 -60 -60 7 -17 8
4369 8 21 -58 -4 73 -19 -6 58 18 -120 37 45 64 83 -84 35 56 -9 74 33 51 -17 -7 117 -148 55 -23 30 -34
4397 -34 37 -70 -20 3 36 -34 -11 -93 127 29 -75 -77 15 145 -81 5 71 -15 -102 0 45 18 -51 -33 -11 107 -74
4424 -74 87 -1 18 -98 48 -105 -115 3 11 -68 98 -65 -10 72 -5 21 -85 -52 -39 -41 89 -113 -9 31 -1 23
4450 23 -57 45 -38 47 62 -13 -109 20 -78 79 -26 47 -124 65 35 38 -1 -53 78 37 118 20 -16 51 -61 44
4476 44 46 119 21 56 -8 44 -30 46 -12 80 79 -41 9 -14 22 68 126 72 -15 -107 19 88 -62 10 49 25 86 -115 66
4505 66 76 12 -69 32 106 17 49 57 -40 18 66 -87 -33 76 2 -9 11 -56 11 43 -80 94 -3 -14 -47 29 -67 -29
4533 -29 48 62 -64 -60 3 80 76 57 -1 59 0 -47 -21 22 48 -124 123 -13 -6 -14 100 47 84 -96 31 -19 -53 23 -26
4562 -26 -19 17 54 30 -16 -9 59 64 -15 -1 43 -5 -64 99 -33 84 57 89 -97 -12 3 54 65 35 -43 -75 -406 -172 4
4591 4 -66 47 -13 65 -24 -55 47 -67 1 30 -54 109 11 51 -82 30 -1 32 -8 -12 31 -22 -4 18 -39 -31 36 14 -65
4620 -65 19 20 125 -72 68 79 -116 19 17 -91 95 9 30 -46 -25 -59 74 22 -40 39 2 59 26 -54 131 63 58
4647 58 -50 -22 -71 88 -36 -84 -47 -62 41 -77 -30 45 -82 10 -9 -14 -90 -61 -85 68 -60 -74 6 0 -38 26 82
4674 82 57 3 -72 -37 -27 -19 42 -22 -34 18 -91 44 6 1 -61 -45 -25 41 7 -41 -36 47 5 -15 -7 28 0 85 42 0 -12
4705 -12 25 -76 -10 113 -74 89 67 56 -19 -117 -60 -61 33 97 30 38 -70 77 3 56 146 81 27 -8 -50 -28 -1 -75
4733 -75 -2 -39 -113 10 -47 44 40 -104 0 -14 16 -84 35 -29 -26 37 -38 -11 15 -42 118 39 -58 33 19 -42 -41 -59 -13
4762 -13 7 -61 -7 64 81 27 -2 -4 -100 -27 -5 93 -30 -157 -74 -84 41 -17 -61 -63 12 78 42 -57 -40 37 29 -8 -81 -18
4792 -18 169 2 -47 164 3 -116 156 -135 -445 8 -53 171 155 316 231 -148 87 68 -212 -274 182 -30
4814 -30 -125 202 1 139 -17 -97 -220 134 10 -186 218 144 -71 -245 681 222 -120 -44 159 144 -106 95
4836 95 106 -63 -30 -32 -114 6 82 44 61 -55 83 -96 180 -58 -127 -68 115 -206 -1 29 -14 -53 -25 2 -26 -48
4862 -48 -63 -66 47 -152 9 -115 6 -37 -31 119 -32 -50 -40 6 -88 72 -33 -72 50 -22 64 11 90 -47 -35 28
4888 28 -50 23 4 19 22 89 -79 -68 -5 3 17 -17 90 -4 -60 5 38 146 -19 40 8 -163 74 97 -72 -2 17 109
4916 109 34 -65 -4 -30 -34 53 40 7 93 -11 14 -36 37 -7 -24 175 -37 55 -67 56 86 -9 57 8 -109 130 -131
4943 -131 -137 -12 -138 244 59 -110 -85 34 19 -51 77 -22 -13 18 -10 -55 -14 -84 47 -44 -63 -2 -32 68 -11 -27
4969 -27 -12 -56 34 38 -42 -80 43 49 28 99 -48 -52 14 -9 44 -139 -27 39 9 41 -30 -37 -5 -20 90 -5 17 -29 9 31
4999 31 175 331 6 -37 22 -26 -66 51 -73 -19 21 -20 -26 45 -118 89 74 -32 87 79 38 -9 52 11 -17 -36 13
5026 13 -12 -37 99 -36 -81 -56 -16 -46 24 -68 -14 59 10 14 50 -97 145 2 -24 65 17 -77 92 -65 112 -12
5052 -12 8 128 -80 7 -8 27 -31 6 -59 -8 -5 -103 49 -29 78 -60 -62 -86 3 -21 -12 -159 124 63 -62 -100 -24 37
5080 37 -56 -26 -188 -102 68 -89 90 -23 27 25 61 8 41 95 -18 1 -97 -6 -21 -43 11 75 45 -14 -28 35 13 -125
5108 -125 -19 -38 -68 25 -35 46 -43 64 50 15 -71 172 171 0 62 -44 2 -49 -7 51 -55 -54 10 45 57 -4 -81 -101
5136 -101 -52 -55 42 -169 43 198 127 37 -6 -347 -293 -202 259 18 183 -44 35 270 -68 34 106 226 19 349
5160 349 364 292 215 343 -152 382 515 124 -218 -631 988 26 258 -166 609 23 622 -435 -150 480
5180 480 -152 387 68 162 -465 292 -155 207 -166 -94 150 -21 25 -29 46 -79 -31 4 -12 68 -65 187 17
5203 17 40 0 29 1 80 -6 99 -57 -38 67 -7 -2 -49 -41 33 -24 54 -3 47 -46 54 70 -51 -14 48 19 -49 64
5231 64 58 1 -12 42 42 70 -2 -16 -71 -61 42 51 64 -36 -17 87 59 4 -111 16 -81 -90 27 1 -66 -29 38 24 -17
5260 -17 -91 -6 117 32 -31 72 201 -63 101 -52 158 -19 270 -82 -45 -70 -23 -223 171 -103 -65 3 -398
5283 -398 -443 208 140 215 560 324 -53 -603 614 407 54 -309 430 213 182 187 247 210 164 45 -109 160 1
5306 1 -107 136 37 -19 214 -108 87 150 235 -356 -283 -681 -303 554 -264 223 714 146 174 -464 -399 -15 -3
5329 -3 -148 -178 -5 -134 24 1 -63 12 141 -56 -48 43 -56 92 -41 -160 -175 362 327 237 -6 212 23 128
5353 128 96 -270 -169 81 115 78 22 -103 -50 96 -74 -31 -26 66 44 30 119 -16 71 -58 -27 -29 -19 46 133 -13
5379 -13 81 -67 15 -23 -33 -71 -103 -60 63 -34 -20 -64 34 54 -8 46 17 103 -5 -19 107 35 -78 20 52 -38 49 -47
5407 -47 17 69 45 128 -39 82 -43 32 29 -4 -64 -36 -57 8 11 -95 42 45 -34 -3 29 -14 -52 -8 -33 -44 2 -42 24
5436 24 17 20 -97 -69 17 -16 26 68 92 135 131 31 -12 82 50 12 113 9 147 104 -16 56 -12 -64 74 58 31 26 -76
5465 -76 -38 -190 17 100 -35 560 33 254 -85 577 607 363 113 -47 -353 269 -166 63 87 -88 1171
5486 1171 -487 -134 55 340 -331 11 -109 60 36 -563 145 462 -338 -328 244 127 -271 10 -290 -124
5506 -124 397 173 365 30 -46 -36 278 247 249 -564 606 60 54 -109 -155 123 -159 198 -51 30 -125 -19 -82
5529 -82 79 -14 -26 -2 22 -48 -21 -76 8 -19 -95 16 -28 3 111 -57 -12 52 -26 -52 -7 -62 -27 76 -103 -54 51
5556 51 -26 12 -34 -35 104 -14 -120 -10 67 27 79 41 -207 -62 85 -26 83 -41 66 14 158 53 106 -86
5580 -86 -97 0 -47 75 -64 44 51 -28 -29 -2 -60 33 -106 6 -49 10 100 -45 0 14 -31 -93 28 -82 38 -33 35
5607 35 -16 74 60 -69 83 2 -100 29 57 -39 -45 4 124 84 23 -68 -34 74 47 51 -27 7 9 52 -73 -19 -16 -10 24
5636 24 -27 -2 66 -93 -7 20 -129 -40 -61 57 -65 -42 -28 -17 77 -97 -77 17 52 -25 -65 -105 -75 -45 130 -34 -77
5663 -77 23 20 23 1 -113 -165 12 71 -37 43 146 76 57 1 -7 111 -53 -83 36 -5 -8 46 60 88 -131 -35 -94 -46
5691 -46 74 -39 -24 -14 16 -15 79 -46 25 4 91 95 -7 59 56 -75 41 -3 -25 74 -15 29 30 17 11 -65 69 -17 0
5720 0 -31 -100 32 97 -42 4 -28 130 32 -30 -47 -41 -69 -13 -12 -25 118 16 37 -82 -21 4 42 20 44 -62 -59 -13 124
5749 124 -29 -45 61 -10 37 5 21 -43 -116 49 36 40 -59 -108 65 40 148 88 -28 -74 55 80 7 44 25 45 -61
5776 -61 -68 -46 4 16 81 -141 -169 147 -49 -61 -61 21 85 14 -22 39 -54 -38 73 -50 108 -45 28 172 37 -31 -63
5803 -63 109 -58 158 -24 17 -22 -33 39 -25 -68 -83 78 -93 -20 134 -89 -35 -21 24 42 -13 -19 4 119 -20 -92
5829 -92 -65 -81 -32 -25 27 -47 -30 56 -62 150 -56 12 72 5 -43 83 -56 6 15 -80 -41 -7 -52 99 35 -10 -69 -4
5857 -4 -50 -3 -55 13 -26 -11 -105 19 -50 -31 15 -22 1 82 -31 -75 -8 55 -3 -30 8 39 -37 1 34 12 -74 5 21 16
5887 16 77 77 48 121 -41 1 -63 67 25 -75 -24 15 -76 -18 -8 -129 -53 151 19 -62 32 -110 -31 -55 56 11 -51
5914 -51 9 37 -33 -24 72 -4 -139 52 7 -43 -10 6 15 -90 -12 140 32 -44 -62 4 -115 -51 -68 127 -172 309 83
5941 83 -98 -262 66 -211 352 255 557 375 -45 405 -39 -233 -375 -37 -27 -429 118 128 -153 -235 90 38
5963 38 -27 -23 375 123 83 -38 22 -96 -14 -15 -73 15 -37 16 11 25 -41 22 5 22 -65 -27 -45 -31 43 60 38 56 -96
5992 -96 -65 -38 -2 15 -130 48 -66 -43 65 -3 -121 125 -69 -13 -73 -62 7 -2 -51 59 11 -61 49 16 -51 -40
6018 -40 75 -148 -36 31 16 82 -135 -64 88 47 -97 -67 -52 -55 -16 25 -79 -2 37 8 -75 -104 21 15 -28 -7 2 -34
6046 -34 -28 76 24 94 -67 -52 -1 -33 -38 -104 62 56 -15 17 -31 -124 49 -43 28 -7 125 -102 32 73 16 -43 -211 -19
6074 -19 -38 21 -231 96 17 -78 -23 129 -38 148 -75 136 -107 -62 -66 8 146 -25 123 -228 -1 -202 185
6097 185 127 -100 -44 -89 134 -30 56 117 -105 -91 -22 58 -16 162 -22 -662 -454 -218 -162 197 -353 -76 119
6120 119 487 475 -416 -221 135 -314 609 188 207 -159 -380 -912 -676 -48 726 705 -117 155 467 18 205
6141 205 209 -164 119 78 -9 -24 -222 102 56 81 -92 -73 106 161 35 36 103 -68 -28 8 7 30 -13 -65 26 21 -36 -118
6169 -118 13 5 63 32 -29 33 112 -31 -11 -45 32 33 -28 -23 -40 -54 57 -73 -52 7 -49 -2 30 44 -73 -68 66 -19 35
6198 35 -58 -115 40 118 -14 76 15 -61 34 -40 -71 27 -12 -88 -55 14 62 -58 115 7 87 40 -41 -59 -135 -26 55
6225 55 -24 86 -9 -9 -59 25 12 -104 -66 71 -38 51 -362 -473 146 -43 -19 -36 40 39 157 71 -22 -17 -32 -24 149
6252 149 -53 1 -86 49 -18 107 -126 20 -65 60 -48 110 -142 -39 -28 -178 -76 -107 -216 156 252 251 -134
6275 -134 -145 104 -160 88 -71 252 308 564 199 -532 131 874 -174 715 430 905 34 227 -88 -466
6295 -466 -435 -309 146 64 532 356 116 -326 -123 55 74 301 -53 101 -66 25 -8 -98 32 -109 106 23
6317 23 -25 -145 -111 102 33 41 -3 -15 78 -38 35 83 115 -51 -14 -20 -73 81 91 -37 -7 -74 -87 -1 -66 -22 51 69
6345 69 15 -49 9 -83 -26 46 -74 -57 150 -66 -34 94 -25 8 -3 8 -19 91 19 38 113 11 15 22 32 17 17 85
6373 85 165 98 -49 -26 -37 -84 -174 -104 -43 -5 34 -42 -1 91 4 -89 -26 -23 12 61 -18 -7 -42 -39 -48 68 54 39 11 -8 115
6404 115 30 -43 41 -125 -30 -32 29 -25 -87 -113 11 -58 82 45 -41 99 -48 -110 6 86 -34 147 46 -16 30 27
6430 27 60 51 -87 45 15 -86 10 -9 -41 -99 -83 2 37 -64 1 133 35 -84 17 -42 -142 -80 -63 132 -18 92
6456 92 -148 -367 -199 191 90 302 138 47 -517 248 28 -109 -262 94 216 34 91 80 49 -101 -77 -92
6478 -92 -175 252 64 40 127 -173 118 -130 37 -24 -114 129 -199 -66 -170 -94 -119 186 70 -162 223 108 -129
6501 -129 97 -25 3 140 -162 -96 81 46 41 -124 55 93 -98 -12 -1 -25 24 42 11 1 -107 53 -142 -112 -33
6526 -33 -32 -1 -97 -123 52 26 14 -46 8 -72 46 -67 -9 15 52 64 104 -29 -62 -3 63 -11 132 331 -364 -298 -103
6553 -103 260 -20 21 5 -23 -14 89 -12 -42 -58 17 -134 -92 115 151 -102 -29 -57 268 -253 148 -292 -4 110
6577 110 -230 495 271 -381 19 435 -66 268 -99 -226 -9 -19 -244 -154 -143 85 -134 -92 -43 -99 -101 421 -41
6600 -41 -149 -199 -141 95 -57 117 77 -115 78 -131 -20 -224 -89 367 -195 1 225 874 -37 -658 -140
6621 -140 -239 -61 197 318 207 -145 -321 1122 -86 -492 -135 102 409 -419 999 328 -167 54 606
6640 606 -693 -110 737 -2 -46 -485 7 132 -72 -294 473 489 -27 384 -173 118 -787 -448 -194 -195 -228
6661 -228 413 251 17 -608 -23 290 -214 -153 69 882 657 -654 -1033 583 747 -986 -587 -274 -812
6680 -812 773 -433 -213 68 -228 323 -289 154 -72 263 921 -205 -221 493 -17 239 -153 -42 -141 297
6700 297 -644 -326 50 143 88 -191 726 813 43 361 205 306 -630 -69 653 45 -604 15 -113 -94 -68 -37
6722 -37 410 -648 -76 -179 -281 454 -87 -73 -5 264 -179 126 -289 -481 96 10 30 51 15 -238 222 71
6744 71 -169 230 46 -126 56 78 -185 -402 -321 -10 259 191 414 -144 64 -202 99 204 -166 102 -48
6765 -48 -163 -78 -26 283 151 -62 -437 -50 90 363 108 240 -84 -113 -69 -155 251 462 -102 373 380 146 70
6788 70 -295 -161 340 -212 -266 96 82 -190 -243 433 705 644 884 299 -797 233 403 -299 162 260 183 -398
6810 -398 797 -371 583 -333 -60 -513 -319 -613 9 977 -547 65 288 -114 436 -608 44 832 -216
6829 -216 701 269 285 384 -160 -129 -8 -106 -64 -234 -527 122 -207 -443 302 -397 -177 122 725 -514 481
6850 481 -35 126 336 -294 422 29 138 -216 353 135 -849 -5 -94 712 200 214 324 13 -506 -694 -290
6871 -290 277 -586 477 25 215 -227 -75 236 -373 444 -127 55 -113 167 117 36 -27 -136 -39 31 -5 -6
6893 -6 -44 -57 -80 20 -47 -36 -74 -12 32 -18 54 -39 -93 109 16 74 64 -41 76 36 55 -90 -116 -100 8 10 -15 92
6921 92 -108 131 82 19 3 62 -7 99 83 41 -21 -83 2 -36 -1 35 -34 -97 -71 20 49 76 6 -38 93 -21 -6 -99
6949 -99 17 -25 74 -32 61 -52 68 52 170 -43 208 -247 -142 -123 -219 57 -132 -11 94 -19 -6 14 -40
6972 -40 -21 -23 -3 -98 57 9 60 -8 -35 -60 -35 -37 39 -50 -2 -30 -6 -13 106 118 -32 -57 -168 -42 246 936 -206
6999 -206 698 -583 -836 264 343 64 314 82 -255 50 -43 -353 -237 463 171 -171 -217 29 21 -411 416
7020 416 -26 361 429 250 308 138 809 410 85 -389 -485 392 -213 173 381 -389 756 -478 -231 430
7040 430 -235 -81 92 638 -690 142 489 -457 -142 179 164 156 -865 30 563 -33 7 94 108 -330 29
7061 29 240 43 -63 337 16 -475 -281 170 -305 -158 86 -84 -36 -67 -126 -299 -63 155 275 136 351
7082 351 402 189 -69 58 -175 248 -29 162 -272 29 34 -13 69 -224 -55 -93 109 177 139 -145 234 71 89
7105 89 88 114 -17 -25 -73 70 -60 -64 -20 33 82 1 -1 17 -32 10 6 -68 4 82 2 52 -54 41 94 58 62 -31 15 21 -13 65
7137 65 69 -94 -24 -26 54 -1 26 96 102 -104 10 32 -72 16 -8 44 -2 0 51 94 37 36 31 -84 -41 -1 -66 -72 -87 -93 12
7168 12 25 6 67 -11 -1 65 -22 5 -35 98 -43 49 67 47 33 83 7 -43 -110 -26 35 -19 20 91 23 -36 -2 48 73
7197 73 19 30 -92 32 -56 23 -18 13 6 47 -12 57 -91 11 28 31 38 -9 44 -94 75 68 18 -7 27 -47 -18 -37 85
7226 85 -18 -57 -74 47 -33 -19 -108 -10 59 50 -46 -42 -72 -46 -79 -46 38 -14 60 -78 -47 -43 87 12 16 8 16 -61 22 -28 43
7257 43 63 -13 -135 1 -177 109 -16 47 -56 239 -722 283 189 -243 82 -377 -113 443 21 -130 -309
7278 -309 -31 755 8 27 -570 -683 372 -168 -476 -61 -372 633 -352 24 -832 -196 -620 251 328 69
7298 69 -248 95 1082 401 62 -593 267 -365 -255 392 -88 35 253 -224 243 148 -340 386 321 30 384
7319 384 131 159 258 -235 -138 60 147 -13 12 130 42 134 57 -41 45 118 45 65 -32 45 57 -40 -20 4 15 -18 -19 52
7347 52 28 -24 -63 15 25 -19 -200 20 44 112 -2 85 9 -68 64 61 -28 -27 133 86 -41 85 31 59 18 -11 47 100
7375 100 1 -71 -103 -11 -90 -70 38 85 84 16 28 56 90 84 26 47 149 -17 -143 -18 23 -41 58 -49 48 -78 -15
7402 -15 -48 54 79 145 -30 20 -75 24 41 -30 -64 -111 57 48 60 55 95 -2 11 -117 48 -114 -10 -30 7 56 7 78
7430 78 -95 36 -58 -108 32 66 -32 -35 43 -70 -78 -66 -36 -30 36 -41 62 -55 -14 27 127 7 31 -76 26 -45 -6
7457 -6 29 20 71 42 43 35 23 -26 -7 -21 -3 24 -57 -78 -80 87 36 -36 -21 90 87 -39 -192 -21 12 44 22 0 5 -85 -64
7488 -64 -7 -14 -65 90 -63 112 -26 -22 -40 4 65 13 -84 -40 119 -57 15 95 9 -9 50 -104 8 145 50 -49 85
7515 85 -53 -45 -33 -57 95 21 19 -30 -44 -83 2 34 -11 69 -167 44 -63 14 -3 -89 -10 17 44 27 48 103 123 83 36
7544 36 41 -6 -17 105 -78 -60 67 39 100 25 49 1 94 119 -32 76 18 40 13 -26 -22 -11 -37 -45 -32 9 -93 23
7572 23 -47 3 77 64 42 -37 15 -107 -74 -11 14 -24 85 -68 -18 151 28 -74 -31 -76 -6 21 -67 -51 -158 21
7598 21 13 130 61 -13 -8 -97 -52 127 -7 11 -37 -100 100 -37 -46 101 32 64 -83 -57 -57 -77 -62 -3 -9 -70 75 -5 48
7627 48 96 -22 -1 -2 17 -113 36 -10 12 28 10 -49 31 -124 32 41 -17 34 22 -94 -68 -150 19 -91 -15 -36 -58
7654 -58 -119 -12 -30 41 -40 26 -12 -125 -18 -101 6 -12 31 44 83 -47 -54 -35 39 -118 34 70 2 -4 93 1 35 -12
7682 -12 -30 52 28 -80 88 -9 2 114 103 43 -12 10 -66 8 -65 -31 -10 -7 64 -29 -21 46 63 67 -14 -19 37 40 -45 46 12
7713 12 -42 41 -4 45 120 -41 2 65 9 85 -39 -30 134 71 -53 31 -36 -66 0 -45 56 35 8 -6 -24 60 -15 -60
7741 -60 -16 -54 -58 -35 46 137 -15 84 46 -10 -8 -27 -46 -17 68 142 78 60 -3 78 51 -74 -81 -4 104 -17 -2 -47 -59 44
7771 44 10 50 16 52 12 23 -97 -33 16 20 6 -12 97 -131 28 106 70 -120 23 63 -8 -86 58 95 -74 40
7797 40 59 -73 70 89 -16 52 3 20 -14 28 3 27 14 31 -74 74 -77 -71 9 -32 24 -116 -110 74 34 -44 -97
7824 -97 -24 83 87 -35 1 56 -7 7 74 103 44 -109 13 -5 71 65 120 105 106 36 -92 51 -15 -14 69 -71 -13 -24 -110
7853 -110 -16 -12 -85 -112 -12 26 15 98 32 122 -82 -19 -5 -77 -73 60 -65 -61 36 78 6 -59 60 -39 -2 21 84 23 46
7882 46 25 70 50 -46 -71 37 12 -30 43 -11 -12 22 109 -25 16 -3 78 -58 -14 0 4 -49 -42 114 62 68 28 -206 -8
7911 -8 40 43 171 202 386 -4 7 -35 30 -32 8 38 19 10 -26 43 46 -74 17 30 14 -16 -1 87 -52 -20 -12 7 3 -33 45
7942 45 -40 -119 -16 52 34 -28 158 11 47 -35 -41 57 75 56 150 50 29 113 72 25 -63 -1 37 -95 35 -20 32 29
7970 29 -30 4 -75 90 -33 -72 -39 48 -51 -46 -24 19 8 -64 -92 -27 -33 -10 -61 27 101 36 -13 77 -12 -6 35 -12 169 -11
8000 -11 -30 -52 -13 -15 28 55 56 -41 17 -17 10 47 -119 -7 79 57 127 57 -19 112 53 -79 -33 -48 -80 -22 -120 -31 28
8029 28 -5 -56 55 -90 7 -47 -2 -22 95 26 145 21 -149 161 -35 8 4 -85 -31 45 -136 50 3 -6 -13 -15 -24 -43
8057 -43 -46 120 119 20 26 8 111 -39 -44 -6 -31 63 -93 30 55 8 75 16 -56 24 3 62 78 51 -14 36 -32 -25 73 -23
8087 -23 -22 8 -49 -35 10 87 22 -81 -19 58 128 -57 20 -5 -71 -9 -45 119 29 -14 48 -81 62 -32 -43 -29 9 -22
8115 -22 21 23 14 102 -12 26 -12 -106 -10 -11 54 36 -12 -28 82 -46 -29 87 -65 149 -56 69 -36 10 -11 42 -50
8142 -50 -24 -72 17 -31 -53 41 65 81 -57 -60 -92 -12 40 34 -35 -2 -8 12 57 11 112 -61 -23 -4 28 -89 76 51 1
8171 1 69 10 85 -10 -7 7 73 29 -64 -45 1 -39 15 -27 -20 11 149 -4 104 112
8191A12
$$ Imaginary data points
##PAGE= N=2
##DATA TABLE= (X++(I..I)), XYDATA
0 0 0 0 0 0 0 0 0 0 0 0 0 0 0 0 0 -8 8 -8 8 -8 16 -16 16 -24 24 -32 32 -40 48 -51 57 -66 76 -88 97 -111 122
37 122 -138 154 -172 192 -213 236 -262 289 -319 352 -389 428 -473 521 -573 633 -697 770 -853
56 -853 950 -1059 1185 -1336 1518 -1743 2028 -2401 2920 -3687 4944 -7348 13658 -67522 -145498
71 -145498 -77 76419 72035 25684 -9692 -56702 -69085 -18051 49525 52234 36809 7133
83 7133 -52991 -84959 -23900 63767 82181 16729 -34356 -37531 -35703 -18889 29384 52507 31414
96 31414 -11774 -47163 -50507 -24418 27393 69459 39900 -26043 -56796 -47067 -8724 39114 57288
109 57288 35011 -22203 -62909 -45438 -1546 40028 64445 32989 -32987 -70523 -47480 18746
121 18746 63519 45882 656 -41371 -52936 -20495 17576 37472 35999 4192 -29505 -40683
133 -40683 -30446 10526 47417 41422 1976 -39912 -45240 -8223 19704 26392 26036 7204 -20383
146 -20383 -38114 -29835 11748 44586 36054 3986 -35275 -48925 -17750 22188 41721 29223
158 29223 -9017 -32987 -32774 -16824 19740 44955 30499 -7452 -41643 -38944 -2913 24966 36443
171 36443 25284 -13507 -40111 -30978 1518 33923 32792 7428 -13276 -30039 -27147 302 22705
184 22705 29403 14744 -14844 -29471 -23609 -158 31096 31311 4325 -15778 -25536 -20039 -558
197 -558 19030 31695 16351 -19818 -31896 -18172 5022 28745 27420 4509 -18463 -30276 -16552
210 -16552 7962 20966 26267 11231 -20778 -31919 -15458 13070 31806 19996 -2789 -18699
222 -18699 -27492 -13055 14333 25857 20327 -1408 -23227 -21979 -7188 13218 27368 14146 -7534
235 -7534 -17989 -20272 -7007 11883 20967 18949 -2330 -24119 -19293 -2461 14140 22683 10534
248 10534 -5921 -16443 -20262 -4767 14372 20297 15553 -5087 -23592 -17618 -899 16812 22517
261 22517 6468 -9308 -17097 -17706 -1085 17060 20146 10604 -11286 -23058 -11716 3703 16712
274 16712 18866 2885 -10725 -16390 -14003 3638 17393 15983 5650 -12926 -19368 -6901 5218
287 5218 14726 15040 961 -9742 -15038 -12331 5520 17135 13636 2404 -14020 -16715 -4196 5743
301 5743 14348 13495 -482 -10829 -15044 -9752 8766 17141 10336 -810 -14621 -14235 -1611 7176
315 7176 14178 10889 -3488 -11405 -13674 -6411 10691 15442 7505 -3307 -14279 -11074 778 7244
329 7244 13082 8784 -5205 -11727 -11967 -3015 11948 12932 4770 -4259 -13285 -8881 2072 7894 12246
344 12246 6028 -6693 -11278 -10426 -463 12985 11099 2074 -5515 -11963 -6545 2704 7814 12020 3799
359 3799 -8773 -10746 -7882 1919 12513 8810 800 -6081 -11137 -4308 3952 7437 10298 2096 -9301
374 -9301 -10251 -6290 4513 12312 5693 -761 -5838 -9882 -3147 4318 7929 8996 -858 -9804 -8374
389 -8374 -4463 5413 11601 4441 -2156 -6628 -8552 -998 4681 7326 7760 -2546 -9973 -6962 -1906
404 -1906 6446 9443 2629 -1957 -6660 -8221 291 5853 6910 5442 -4106 -8772 -5334 -1204 6814
419 6814 8540 1120 -2599 -6244 -6916 1167 6164 7134 4102 -6154 -8238 -3165 196 6375 6892 537
435 537 -2682 -6881 -6061 2775 6057 5833 2469 -6587 -7293 -2164 1410 6755 5056 -732 -2401 -6178
451 -6178 -5060 3330 6001 5264 1011 -6839 -5858 -1345 1465 6726 4610 -1605 -3288 -5790 -3168 4167
467 4167 5136 4404 116 -7189 -5142 -300 2172 6008 3470 -1965 -3667 -6108 -1482 5767 4278 2265
483 2265 -1035 -5969 -3670 -350 2321 6371 2071 -3036 -3232 -4878 -684 5390 4104 1892 -2658
498 -2658 -5906 -1287 430 1074 5111 2425 -2088 -4000 -5320 789 5950 2981 1140 -2537 -5518
513 -5518 -1564 648 2520 5031 523 -2946 -3211 -4256 1312 5744 3013 537 -3932 -5570 75
528 75 1890 2273 3665 -132 -2466 -3233 -3276 2832 5090 1030 -3 -3023 -4497 -104 1873 3203 3212
545 3212 -2079 -2428 -1559 -2225 2480 3183 1024 1014 -1935 -3226 -190 815 3637 4133 -1922 -3187 -1944
562 -1944 -2271 2682 4115 1622 -603 -4512 -3128 1654 1122 2819 3439 -2209 -4014 -2191 447 4250
578 4250 1729 -436 358 -3491 -3064 2070 2695 2386 288 -2582 -1184 -1214 -343 3820 2473 -2231 -1296
595 -1296 -1692 -679 1598 306 2447 1786 -2546 -791 -771 -1409 2377 1998 1606 33 -4274 -2215 1511
612 1511 2794 4162 640 -3944 -2050 -428 1198 3863 1550 -631 -1381 -3449 36 2865 1485
627 1485 1935 -620 -3504 -752 458 1646 2881 -478 -874 -266 -2502 220 2136 755 1355 -837
643 -837 -2201 335 -179 604 2059 -411 38 435 -2151 -596 760 1196 2997 -116 -2773 -1215 -1354
660 -1354 1690 4141 468 -1605 -2323 -2225 1663 2085 989 1744 -1939 -3238 378 982 1870 1690 -1280
677 -1280 -779 -1183 -1542 2180 1606 -447 540 -1019 -988 571 -368 1506 1600 -1454 -257 -314 -1398 1097
695 1097 704 436 1126 -1375 -811 393 -1199 1140 2296 -147 -409 -1932 -1979 1940 1595 1135 690 -2684
713 -2684 -1779 709 479 2153 998 -1773 -721 -1149 -564 2245 981 -38 -97 -2224 -175 1167 -202
730 -202 1365 400 -1635 -124 -663 -319 1447 -137 316 675 -1922 -352 828 -199 1155 98 -795
747 -795 202 -1356 -717 1736 133 493 427 -1889 -724 120 270 2081 -41 -1745 -223 -1168 -121
764 -121 1971 384 233 -708 -2210 505 959 122 1296 -671 -1589 13 -496 739 1406 -801 41
781 41 -102 -1566 615 418 -128 1107 -775 -793 370 -978 141 1101 -520 436 -279 -1382 602 -117
799 -117 8 1604 -484 -1086 -129 -1006 644 1224 -433 430 -889 -1641 804 519 418 964 -1184 -858
817 -858 148 -670 1258 1074 -1052 6 -518 -619 1083 15 130 771 -1390 -368 552 -893 676
834 676 568 -489 421 -839 -635 1140 -361 31 996 -895 -395 -126 -816 1159 370 -615 450 -962
852 -962 -886 1061 9 561 364 -1471 103 164 -636 1149 397 -671 128 -995 -102 1109 -437 492
870 492 275 -1415 84 409 -288 792 -289 -383 552 -1053 -208 1082 -326 438 211 -1088 296 -144
888 -144 -168 1338 -221 -704 446 -834 26 732 -277 829 -25 -1379 375 27 -271 1114 -311
905 -311 -388 155 -879 526 810 -763 694 111 -942 341 -296 128 1195 -773 -312 340 -868 605
923 605 766 -551 523 -283 -726 630 -670 -6 1288 -574 -415 -15 -619 745 387 -645 756
940 756 -413 -854 606 -294 73 966 -557 158 -109 -850 981 344 -670 518 -432 -349 519 -466 450
959 450 829 -832 133 153 -844 739 157 -275 518 -764 -204 844 -593 137 685 -666 160 -165 -460
978 -460 968 -185 -482 740 -648 -378 693 -281 418 217 -834 462 -125 -697 892 62 -295 405
996 405 -694 60 570 -570 684 413 -920 416 -54 -314 673 -489 99 447 -982 114 761 -395
1014 -395 436 -17 -498 457 -457 -271 890 -520 -133 393 -775 145 290 -385 739 -235 -738 751
1032 751 -250 -253 757 -248 42 241 -942 611 361 -593 816 -186 -553 439 -394 115 632 -690
1050 -690 176 218 -826 380 377 -402 598 -462 -317 588 -548 16 630 -619 81 -83 -607 627 12
1069 12 -426 693 -251 -400 513 -544 302 427 -639 428 -82 -778 768 -45 -329 536 -367 -112 320
1088 320 -592 611 529 -728 226 -76 -446 699 -197 -191 436 -653 122 515 -654 356 365 -568 248 -374
1108 -374 -300 934 -416 -208 631 -654 24 300 -577 413 182 -418 481 -350 -459 717 -196 82 471
1127 471 -619 179 147 -578 712 95 -548 356 -499 -136 743 -411 -132 276 -708 341 257 -406 485
1146 485 -379 -278 678 -432 -238 469 -464 58 291 -519 445 -244 -367 769 -125 -400 493 -289 -94
1165 -94 357 -399 512 30 -707 402 10 -430 455 -58 -199 127 -602 442 433 -690 362 -42 -724 433
1185 433 96 -308 365 -587 -97 606 -469 183 208 -542 283 166 -376 398 -333 -220 680 -331 21 237
1205 237 -557 295 350 -306 487 -146 -487 452 -212 27 482 -676 150 217 -548 498 182 -344 294 -250
1225 -250 -189 608 -292 21 408 -658 -29 319 -259 274 -102 -369 412 -357 5 527 -651 -115 393 -257
1245 -257 244 -85 -432 379 -119 -165 643 -265 -399 373 -272 295 92 -540 336 -95 -426 597 -22 -234
1265 -234 214 -377 32 307 -457 308 50 -525 219 151 -224 176 -565 -255 355 -548 129 296 -426 203
1285 203 4 -372 528 -108 -324 452 -401 -139 436 -362 212 195 -371 452 24 -480 402 -132 -247 410
1305 410 -226 230 261 -580 288 215 -429 467 -35 -435 341 -193 43 411 -396 106 274 -444 296 174 -236
1326 -236 165 -320 -69 521 -216 -110 339 -424 94 352 -223 412 -143 -383 447 -209 -170 303 -321 -55
1346 -55 213 -283 349 46 -459 487 -6 -339 462 -187 -124 253 -446 173 300 -518 127 132 -407 353 -145
1367 -145 127 -474 -464 159 427 -800 448 218 34 -228 29 132 164 -305 -465 229 -381 644 -150 -127
1387 -127 344 -309 -686 850 -370 397 384 -569 401 -64 -814 284 -94 -142 242 869 -827 -73 -473
1406 -473 -805 472 -303 -232 350 -432 -76 -102 -1177 55 -479 -449 352 106 -374 343 -247 -430 521 45
1426 45 -132 319 -804 481 -249 -666 816 -422 17 55 -95 126 565 -559 -175 -227 -108 397 -200
1445 -200 156 -316 -9 310 348 -10 35 -65 -246 402 152 51 -40 85 -199 291 -500 -152 259 -332 121
1466 121 32 -259 396 -219 -199 293 -238 -21 185 -229 102 152 -363 283 -46 -231 275 -105 -114 89 -209 -35
1488 -35 180 -323 299 159 -340 252 8 -234 232 -205 -107 246 -316 112 210 -299 129 18 -243 199 -175
1509 -175 -114 287 -303 74 237 -179 79 64 -189 227 22 -251 413 -152 -113 253 -283 -3 156 -324 86
1530 86 55 -163 267 -20 -191 172 -223 -49 137 -304 129 295 -305 133 28 -150 284 -119 -103 218 -217
1551 -217 -104 179 -259 40 155 -423 190 -106 -135 268 -222 -190 322 -146 3 19 -209 240 -85 -266 229
1572 229 -107 -234 196 -144 15 222 -114 51 184 -188 222 160 -187 225 -53 -6 197 -196 44 112 -222
1593 -222 104 88 -127 52 -96 -184 207 -166 -84 223 -231 -83 153 -255 112 42 -120 207 -95 -240 234
1614 234 -151 -27 61 -225 121 -32 -239 162 61 -236 114 -129 -151 164 -195 -20 234 -176 93 17 -277
1635 -277 133 66 -187 140 -162 38 326 -163 32 233 -173 160 -168 -218 182 -71 -125 196 -103 -32 335
1656 335 -210 -4 -80 -123 177 -22 -232 175 -23 -144 125 -78 179 110 -214 81 64 -155 59 -126 -188 313
1678 313 -92 -62 137 -190 11 198 -275 58 67 -188 197 -42 20 253 -39 -114 160 -148 88 42 -251 199
1700 199 23 -43 221 -36 -42 130 -223 -4 211 -23 106 11 -246 246 57 -149 129 -200 16 144 -231
1721 -231 55 210 -119 125 -90 -77 241 -43 -97 229 14 30 177 -131 23 73 -81 48 -18 -76 240 -109
1743 -109 -131 168 -139 28 3 -234 187 146 -186 26 -84 -114 114 -87 -13 144 -156 129 -20 -173 73 77
1765 77 -179 35 -116 74 207 -200 -127 143 -141 -1 38 -138 125 5 -55 190 -116 -87 153 -228 22 90
1787 90 -109 147 3 -13 237 132 -201 197 -231 -223 2 -281 42 -324 -477 150 320 -47 184 -137 -166 39
1809 39 -17 -30 104 -152 125 75 -93 146 52 20 146 -179 -11 175 -101 82 -92 -201 240 59 -107 184
1831 184 46 -20 241 -30 -63 84 -71 -18 5 -158 249 39 -282 128 45 -5 -39 -67 -119 143 -176 -23 -4
1854 -4 -95 96 55 -148 198 -1 15 124 -269 20 274 -137 -69 -110 86 380 -3 -246 122 -90 -198 -242 -229
1877 -229 -16 -53 -90 148 26 -54 180 -26 -296 288 -144 -12 89 -16 263 152 -190 20 221 -278 246
1898 246 -427 -73 85 -109 -23 156 -19 99 -134 -201 15 11 -112 58 -105 21 94 -45 21 35 36 109 -53
1921 -53 -223 193 69 -91 121 -146 109 52 -86 -82 -11 -9 147 -44 -30 128 -38 36 73 -144 -47 100 -87 144
1945 144 -16 -90 16 -83 -78 149 -105 -139 -47 -41 98 -10 -92 57 41 33 38 -95 -91 213 -147 -145 16 -128 30 96
1971 96 -119 107 62 -49 -38 -88 -63 150 -155 -83 90 -96 59 -15 -141 114 77 -47 91 -143 62 164 -95
1994 -95 -61 23 -13 84 -158 -692 190 6 -151 73 -30 115 139 -105 157 62 -77 131 -191 -69 92 -109
2016 -109 -21 57 -80 95 80 -201 32 8 -86 -36 -114 -19 246 -31 -9 107 -13 26 157 -222 70 75 -164 79
2040 79 -15 -1 131 -119 -87 121 -79 86 28 -140 181 -24 -182 95 -50 -58 29 -132 6 237 -3 91 51
2063 51 -25 57 -3 -179 243 366 1096 -219 -11 -117 -66 -47 -49 -120 242 864 -60 -51 123 19 -84 153 -158
2086 -158 52 46 -54 109 9 33 25 -44 -56 46 -35 -3 41 -111 230 61 -178 -19 -104 128 17 -60 -119 106
2110 106 -101 -10 -19 -105 93 1 -26 79 78 99 36 -140 -40 103 -60 76 -4 33 21 -371 -101 120 -32 18 155
2135 155 -152 22 79 -129 -49 80 7 43 -60 9 138 -24 4 9 -147 84 -13 -152 97 83 -31 54 24 8
2159 8 193 -36 61 -14 -74 127 67 -21 88 -8 49 66 -131 -177 178 -71 -25 25 -103 27 -1 -125 93 78 0
2184 0 42 -13 85 118 -51 -25 -3 -88 145 -41 -75 60 68 -79 96 -98 -43 15 -48 20 46 -21 60 -59 27 97 -98
2211 -98 -33 20 6 -45 116 -16 -56 -41 -56 87 -109 -131 61 -61 -26 24 59 -9 1 -54 60 140 -1 82 -10 37
2237 37 36 -63 -22 33 -69 63 56 -196 112 -11 47 119 -135 84 134 -114 1 90 -34 71 -110 -8 112 17
2261 17 -88 32 -62 24 49 23 -43 -57 -115 -12 -27 -90 73 -28 -59 -1 -47 55 106 -76 -1 98 -84 34 -128
2286 -128 -49 70 -71 6 -51 -57 -48 139 -136 -17 58 -104 20 -38 -76 120 13 -113 34 -3 30 100 -129 101
2310 101 -23 -96 -1 -49 -4 33 -89 72 14 -34 34 13 49 113 -46 -33 35 -51 73 79 29 18 91 -60 -22 85 -175
2337 -175 51 -50 -105 52 -14 -54 107 -8 3 56 -156 30 -47 -75 135 25 -52 54 -134 -11 -1 -45 8 7
2361 7 -126 32 -44 -144 68 6 -59 -26 -38 -47 52 -162 32 63 -90 1 -86 -12 84 -130 -49 72 -110 26 -10 -86
2387 -86 140 28 -59 74 -60 -6 32 -18 -185 103 -173 -34 -10 -155 276 -22 -239 675 140 -168 61 -60
2409 -60 -5 35 -159 9 252 63 65 -31 -94 82 -95 -12 117 -7 -2 -10 -60 -40 -76 -41 128 33 -17 180 -15 -104
2435 -104 101 -50 -2 115 -60 47 -104 -3 32 -10 -112 97 -32 42 53 37 112 -34 -27 -40 -9 -58 31 -81
2459 -81 19 77 -127 121 149 -58 -17 -80 -118 29 -12 36 65 -75 83 -37 -47 92 -129 -72 96 18 -29 113
2483 113 42 -130 72 -80 4 6 -7 132 -30 -54 66 39 10 114 25 139 124 -116 32 54 -96 31 61 -38
2507 -38 -21 -85 -46 32 -36 -61 112 -203 98 80 -41 77 -38 -80 97 56 -19 33 -62 -63 31 -55 34 -34 -52 27 -73
2534 -73 -107 16 -28 73 125 -32 13 -66 -17 -63 80 14 31 -26 -60 -49 -83 66 45 -112 -18 -71 10 145 44 -80
2560 -80 10 80 5 68 14 29 57 4 -21 -175 -96 135 114 -2 49 -23 19 236 12 44 32 -65 151 -63 -100 14
2586 14 -5 -47 60 23 37 31 -91 103 90 -122 19 76 -59 157 -114 -25 120 -38 7 -2 -47 7 -110 -12 127
2611 127 19 -155 21 -47 -76 57 -83 -20 -5 -153 32 -10 -36 33 51 -28 57 -116 -9 -15 -49 28 -34 -100 135
2636 135 18 33 39 -59 -12 -15 -67 28 -64 -27 -8 -78 -99 6 -26 -19 -55 -89 -18 11 -99 -6 -35 -46 23 -40 18 38 34 21
2666 21 -22 11 96 -8 -100 60 93 30 132 62 -46 27 67 33 86 -47 -81 -20 20 93 87 -66 -1 -1 89 115 -63 64
2694 64 93 -5 10 14 -104 -25 -17 -17 -19 -105 42 126 -11 -57 -26 -13 63 57 -87 109 -71 40 86 -83 44 -4 -75 -11
2722 -11 6 0 -10 -27 -72 85 -25 8 98 42 -65 89 -39 52 279 51 -26 -280 59 -679 -550 145 645 -371
2746 -371 -71 167 -641 -627 -123 -141 -310 -181 56 184 -131 -5 -7 -31 -48 49 -10 36 -98 6 -49 -33 9 4 68
2771 68 28 12 35 -7 51 -43 -47 -106 -64 99 18 -20 154 -97 14 49 -68 83 89 46 185 32 -92 89 11 -47
2797 -47 102 -4 11 112 -177 -20 59 -135 -44 -42 -70 45 -127 -8 4 -98 210 0 8 32 30 -31 37 -20 -141
2822 -141 99 -96 65 81 -110 -56 76 -87 -25 -34 -77 100 -50 31 81 20 86 101 -46 73 32 -68 87 -15
2846 -15 -19 62 -31 -10 58 1 -39 44 -80 105 79 -88 112 -6 -67 91 17 -60 83 -139 126 10 -32 -15 0 20
2872 20 66 17 -52 5 24 -142 -27 -61 9 2 39 49 -95 -114 -8 -48 32 37 -50 21 40 -42 48 21 12 64 21 -45 65
2901 65 -58 90 15 -188 -9 81 -59 -18 -31 -56 213 18 -46 58 -57 -99 47 -74 54 9 42 118 98 -152
2925 -152 -13 -60 -27 -11 -3 -63 36 -4 154 46 -27 39 -15 79 51 -49 116 58 -120 43 113 -72 -34 45 -14 105
2951 105 -101 11 11 8 8 101 -30 -84 -64 -92 -26 46 28 33 -55 82 52 -77 53 -16 -40 -1 21 0 69 57 -12 -71 -111
2980 -111 -31 71 -16 26 -25 -96 -57 18 74 36 18 55 -6 -18 -30 31 -102 -31 33 -12 94 -60 -48 27 97 -54 153
3007 153 -78 60 52 -97 -16 -40 25 -65 31 -15 46 -124 70 62 -26 0 35 -44 78 -8 67 34 -81 54 -67 -64 18
3034 18 -6 -166 20 112 -115 -22 13 58 182 -55 69 -46 9 19 107 -115 80 -40 -3 83 -123 -97 31 27 20
3059 20 -23 51 153 -81 -74 -13 85 -90 37 -213 -88 136 -169 6 -63 -39 -4 -33 -59 -43 -16 -44 62 -56 24
3084 24 -26 -6 -43 -42 15 62 65 -141 -45 -21 28 85 18 -47 -45 -73 -67 12 -71 122 46 -31 70 -27 -61 11 -61 78 -57 -126
3114 -126 5 60 -128 -32 28 -60 97 19 -3 -16 -31 -14 -37 -55 -49 -57 -44 153 8 -79 52 -48 40 -63 29 21 5
3141 5 -5 -14 -1 16 114 48 70 46 -27 -16 55 4 116 -33 -36 49 26 -40 -5 -20 15 14 -151 15 37 -49 176 -11 -87
3170 -87 103 25 -22 9 -65 -25 25 13 86 86 -58 111 -111 -91 26 -121 21 15 -78 150 19 -110 41 72 -39
3195 -39 -61 -55 14 -10 -28 -148 24 -55 92 17 -114 24 -48 10 41 10 -41 -6 9 -30 -26 -69 -75 141 -11 94 -23
3222 -23 -126 -86 -34 0 54 29 195 36 -62 129 106 -3 59 -18 124 195 64 92 37 -152 54 46 56 35 -43 11
3248 11 -64 2 55 -19 -161 46 -61 -85 -28 13 47 82 -36 32 105 30 -12 -30 -101 17 8 -57 73 -24 83 -1 6 139
3276 139 104 42 37 -17 104 -63 -4 6 109 20 -4 68 -7 -48 -36 -150 116 44 -34 -11 25 55 195 44 -58 26
3302 26 -24 109 78 -74 11 4 -26 70 -14 -16 -5 -11 -41 -34 25 125 47 -94 124 -4 -62 31 -14 -100 11 -21 53 78 -205
3331 -205 29 134 -23 70 75 5 -53 23 -32 87 -60 -16 -25 -7 41 -40 -20 15 -11 -10 14 -16 -31 -2 -47 11 5 15 200
3360 200 12 -31 -50 -73 -28 77 -78 -17 25 -57 111 175 6 22 -15 12 -21 -82 -26 -76 46 26 -39 -85 105 14
3386 14 -54 -39 28 -20 129 19 22 22 -135 55 164 -51 42 -10 -113 8 4 50 -23 -115 -71 16 17 57 -20 -14 45 -17 -71
3415 -71 14 38 -61 -20 -36 -9 95 -193 126 -37 113 -49 -46 -84 85 -96 -24 -29 -190 29 30 -19 105 -31 -81 130
3441 130 -19 -40 6 -36 5 154 -52 31 25 -53 -15 -38 -49 123 38 44 120 -56 47 63 -112 -32 -4 -48 55 -14 85
3468 85 34 96 91 81 -46 -21 -19 -23 88 -39 -3 86 27 34 74 -30 -42 105 -71 29 -1 98 38 -98 -28 47 -51 26
3496 26 -21 17 90 -31 83 -73 94 -87 -36 -45 -42 -29 32 -28 130 -54 -23 -79 -129 2 51 -32 302 -114 -5 -16
3522 -16 -69 6 43 36 57 -55 -24 -10 71 -6 76 -2 17 58 -30 -113 -101 95 75 19 -75 -93 8 4 -46 -63 -65 50 81 -49
3552 -49 -66 -21 41 -42 23 7 -53 144 58 -113 -9 17 18 -26 101 -71 -74 56 -68 66 3 0 -27 36 98 -44 3
3579 3 161 64 -121 7 32 84 -1 108 -208 -86 -65 -14 66 -40 -45 -29 -97 95 50 -77 26 -95 1 4 -141 64
3605 64 46 -8 131 -4 63 3 24 -145 50 38 -50 40 46 46 -29 68 51 3 123 20 -52 10 22 -87 -40 1 -73 8
3633 8 7 -34 111 -93 16 -2 14 -14 -16 -150 57 -6 64 34 -2 19 7 -61 -53 -17 -79 14 -33 0 28 15 20 118 6 34
3663 34 152 41 3 29 -29 93 -24 -19 24 -33 33 53 41 -14 75 -42 82 95 -86 35 25 96 -9 70 39 19
3689 19 35 -74 45 41 -26 -16 -4 -50 24 40 46 75 8 41 -27 2 -130 49 97 -76 -50 -89 -27 41 29 -80 -62 57
3717 57 36 2 22 -118 13 -7 -99 46 -35 -2 35 -32 14 99 -28 38 -6 -92 6 -6 14 68 -51 -80 90 -70 -67
3744 -67 -41 -32 -48 -36 -38 105 -44 -40 38 20 -70 9 -34 63 39 30 -7 77 -121 0 -19 26 13 -20 34 -20 -108 -21 -16 42 138
3775 138 54 2 2 -94 -26 86 -13 58 -94 -50 51 10 -37 36 -125 -53 129 56 21 26 -41 98 -13 -79 19 -43 -18
3802 -18 -14 37 -43 -53 -99 -34 -27 -82 -51 -75 31 -77 -23 -106 91 -45 -99 -90 -91 106 26 -116 -9 73 91 57 82 21 -10
3831 -10 -5 -52 14 -92 135 90 -5 76 -54 51 69 117 8 98 -46 -57 -76 -122 190 56 -9 56 6 71 29 74 -28
3858 -28 -2 -95 -56 26 -46 83 110 31 -13 5 -129 -81 27 -97 117 -68 74 -38 -77 15 -19 -25 3 -36 25 10 -21
3885 -21 -49 4 -39 8 -40 -6 24 -92 -77 51 -37 7 3 11 -86 132 -19 24 28 -17 72 -14 -143 -46 -113 -55 22 -70 99
3914 99 14 -166 36 -103 -54 -25 -42 -61 -31 -48 -116 -72 -41 73 -93 -71 30 39 3 -170 59 -17 -103 333 -226 -30
3940 -30 -404 214 1091 209 -61 22 366 -342 -174 574 40 242 -72 231 265 -226 692 580 54 526 -87
3961 -87 -270 349 -131 -72 96 -197 119 -314 168 -15 65 19 -162 -6 -2 62 4 266 -79 32 67 -56 12
3984 12 -59 54 30 -51 -53 57 -46 126 12 39 -79 62 -128 -33 82 -62 21 -70 35 2 -55 -25 -45 -211 196
4009 196 -18 3 -181 -425 231 -437 -152 -241 -14 494 211 -29 -129 528 1114 140 56 -67 81 83 -76 -156
4031 -156 -9 109 -62 -35 -73 36 -15 92 -3 75 2 19 -78 70 -13 -191 7 -118 5 76 36 -64 24 80
4055 80 49 4 10 35 -38 -89 22 128 5 21 8 -45 62 -71 -68 -35 -46 -6 -40 -26 37 -15 23 8 8 89 13 59 -42
4084 -42 71 -81 76 -114 -15 12 380 -136 -32 190 -70 499 102 -148 239 408 345 -941 -80 -87 525 1076
4106 1076 -94 175 260 270 -134 -82 -305 -329 25 -139 -254 138 -4 513 92 -106 42 96 -132 -81 12 63
4128 63 -3 -29 15 111 10 23 36 -38 -68 1 12 86 -187 62 111 -54 42 -33 -21 102 -20 -11 44 -26 -32 0 -16 6
4156 6 88 43 -65 69 -99 141 -82 11 94 66 -8 21 100 8 34 -43 51 106 -42 134 47 34 42 -39 -51 -17 -65 -73
4184 -73 -102 -86 126 25 -31 14 -25 -26 24 66 26 22 -1 19 74 -6 98 26 -77 -40 20 35 -2 -52 94 16 34 -8 -91
4213 -91 46 -106 -103 -60 192 -4 -68 -40 -74 -23 11 39 -3 17 33 0 -80 93 70 76 27 2 -92 -70 -25 2 -60 17 -83
4242 -83 -57 107 1 6 31 11 -49 -23 102 -39 -55 -2 -47 -12 -36 -29 -70 108 -22 -92 -43 18 -35 13 -130 -18 -81
4269 -81 95 -45 -123 -49 -15 153 28 -75 -167 86 62 26 24 -66 -63 52 -3 151 28 -62 92 -14 -29 64 -29 -32
4295 -32 -28 -27 67 2 -7 18 47 -81 -43 73 -47 9 -44 85 -51 -24 -39 62 88 -101 17 -146 -70 16 -4 18 -5
4322 -5 -6 -97 -4 -59 71 -54 37 33 -27 11 1 -20 -105 -57 72 48 69 19 3 -29 -88 -5 -7 -57 -40 -75 -131 0 -13 33
4352 33 -58 111 11 22 -35 -21 -13 18 12 84 58 -148 37 70 25 9 62 -17 -18 -14 31 67 -4 -41 -21 28 -40 53 4 55
4382 55 -22 -53 -72 51 51 4 12 95 23 -80 138 -22 -43 27 -7 -13 52 45 -57 40 -138 -32 -18 -44 24 5 -31 -17 49
4411 49 -40 -24 -92 -5 -115 -74 -25 -101 -6 -89 39 -68 46 105 10 4 44 -10 -9 -96 87 -31 -4 -175 -71 -5 -113
4438 -113 -48 -79 23 91 -12 41 10 17 -66 -16 25 77 -2 -82 14 -3 47 -17 -54 17 74 -65 58 -80 -9 -81 -31 66
4466 66 -24 9 -25 -104 16 -6 51 -44 22 92 -47 43 -24 -69 216 -58 132 -522 -623 114 -136 32 -178 133
4490 133 -11 32 10 14 -6 23 -53 82 -12 -31 -80 -13 120 8 44 -62 16 -23 -14 14 41 -31 -58 52 -8 106 -66
4517 -66 -43 44 59 46 15 37 -11 45 -23 96 120 -30 18 -30 -30 12 -16 39 109 13 30 -37 58 9 25 44 132 18 39
4546 39 15 87 61 -115 111 27 15 -71 -28 -47 -125 -42 -16 27 -70 -15 169 0 29 29 -19 -91 -27 -60 44 20 -26 -4
4574 -4 41 12 -85 -68 -94 -14 -27 -27 -34 -93 -119 -55 51 0 54 -256 -240 -57 9 50 140 21 88 4 63 118 -44 -18 94
4603 94 -27 -73 -16 -4 -18 -47 33 12 11 -64 -12 -45 -74 -59 12 25 25 -59 7 27 35 15 -102 -4 -13 -14 -56 80 -16 132 -134
4634 -134 6 10 33 0 -97 -30 -41 -12 36 86 -36 8 -15 103 52 9 1 95 26 7 9 -21 90 50 -114 -41 -29 30 -8
4663 -8 26 -28 58 -43 20 -4 -61 36 -141 -16 36 -57 7 -51 -62 60 -69 12 -3 38 26 -30 76 -16 -10 56 67 21
4691 21 63 69 -12 27 14 66 26 34 -40 57 6 3 -5 -50 -11 -5 -1 30 -105 38 -68 41 14 -8 63 54 48 -125 26 -4 -71
4722 -71 -28 -23 -44 39 -17 13 -12 -77 103 -114 -22 51 -18 -63 -32 15 18 -8 -39 50 -39 -15 20 12 -74 -12 23 -9 -15 -74 -46
4753 -46 -47 -50 81 -98 68 -65 -31 -72 -8 19 44 24 -18 44 -83 16 10 -112 -60 96 -65 -58 -67 60 -19 64 26 56
4781 56 -19 -31 -143 6 -20 -67 -28 -84 90 6 73 30 -34 43 -184 -81 166 -24 -196 -249 60 -23 -57 -40 262
4806 262 192 -90 38 -21 -253 -152 -35 -73 -77 23 -100 -109 138 -47 339 78 -100 157 -76 63 58 42 167
4829 167 261 -215 130 -179 127 3 -11 18 -15 -29 -176 19 -81 -133 42 -179 -43 -20 95 -8 -39 81 20
4852 20 -5 39 32 -121 -24 22 7 88 111 55 10 76 12 -47 161 31 -33 -31 -21 52 -24 19 27 13 -21 73 41 31 -59 -97
4882 -97 -54 29 -18 13 -16 -2 -101 -88 33 -61 126 15 34 -26 21 40 19 -18 10 75 -35 -37 -57 -76 -18 -78 -61 31 -41
4911 -41 34 -21 -2 -58 -8 -32 16 3 18 -76 21 114 -106 -61 64 8 -85 7 -26 -72 -209 12 21 -30 -73 99 119 -40
4939 -40 181 -160 21 101 64 -78 -240 51 -54 10 -6 63 27 8 69 63 -40 27 -65 -8 -48 -32 84 -42 -27 -20
4965 -20 -26 4 -70 138 0 32 36 -23 -15 73 -48 -53 -21 2 12 10 -136 74 61 42 68 -96 -24 44 31 17 133 -22 38
4994 38 21 95 16 141 -86 199 539 -104 57 49 18 -45 66 -51 11 -108 -89 37 -8 93 -78 -6 -23 61 40
5019 40 23 -8 32 -37 -18 45 50 23 -1 0 -97 48 32 -60 10 -41 4 63 38 -23 24 23 -23 12 -1 3 -87 -132 -14 -69 -61 36
5051 36 13 -21 -6 -70 81 -29 5 67 -44 -58 101 30 65 52 23 -20 -41 -28 61 14 23 54 -123 34 63 73 -87
5078 -87 -26 -32 37 -49 -61 9 26 -23 23 -98 -101 -99 33 -77 33 42 -47 -25 -11 -76 -53 -68 -88 36 -34 -71 37 30 -25 -64
5108 -64 64 12 -71 -31 35 -19 -61 57 57 -6 -12 -148 -32 -57 -19 13 43 16 -29 139 -12 -89 -71 69 128 -39 7
5135 7 -129 86 -132 -81 41 -90 7 419 -179 193 -199 -449 -92 -318 -152 406 -373 12 -24 -279 141 45
5157 45 -181 -98 91 -189 -85 65 -475 1 15 303 -622 -309 1070 722 213 -885 -110 -373 176 452
5177 452 59 10 -68 165 -335 168 107 -154 40 -62 199 154 -276 154 -59 64 -43 116 86 42 -22 5 -56
5200 -56 3 -15 10 -86 -5 -17 -1 -1 -59 41 17 -28 52 30 -74 -24 -20 -46 -77 7 77 53 -95 -37 -98 34 33 -14 31 26
5230 26 87 71 -51 -14 -2 -155 -77 63 -36 23 80 51 -135 43 -23 -37 76 62 -53 -31 96 -2 -19 31 -77 32
5256 32 53 -3 -14 -28 -30 34 112 39 -44 -107 52 -87 -33 -22 -15 11 -129 215 161 116 227 -318 -293 104 -348 -82 -197
5283 -197 -312 -137 41 -90 128 210 305 470 -328 281 -68 -256 -610 140 -400 164 -5 -94 121 -189 -161
5304 -161 209 117 -116 -165 -3 -15 -129 -58 315 -227 -198 7 -33 273 490 328 221 115 -375 16 -509 -57
5326 -57 287 -315 -122 -25 79 -7 -167 -17 -80 -20 -33 -3 -103 44 60 -50 1 18 123 62 -15 98 -181 -272
5350 -272 51 -48 -229 125 291 -139 -80 158 -78 -2 -200 45 3 94 -7 162 -76 89 -136 -7 135 -88
5372 -88 -9 -106 2 28 161 20 10 -90 -9 -66 56 -7 -55 5 -65 -54 -16 92 -59 12 34 -1 -18 27 -70 -33 50
5399 50 -87 98 13 19 99 61 48 -41 -62 124 -46 161 25 -25 36 -33 61 36 17 3 -51 41 -37 -64 17 8 -15 -1
5427 -1 11 6 10 27 42 87 19 -100 26 28 117 49 -43 58 -67 -57 -62 -182 -73 -31 2 -3 -30 -183 35 43 26 3 -12 -49
5457 -49 -34 -27 105 -40 25 -6 -1 -85 50 -94 172 67 225 459 112 77 235 -145 167 218 -293 -25 88 1119
5481 1119 151 -280 91 91 -813 -415 289 369 84 66 -258 4 -342 91 -64 -348 291 490 1013 49 -121
5502 -121 -294 -11 161 -234 -58 -295 1161 -229 -396 -338 61 -221 -464 -71 -565 169 323 340 -51 201
5522 201 -21 -23 -53 47 -98 -14 57 13 76 62 -57 -65 28 14 -149 107 171 -11 33 -16 13 -124 116 61 36 -17
5548 -17 -27 118 71 -68 32 24 54 13 -81 146 -59 19 42 40 106 40 -89 -59 -41 -65 104 -15 26 86 -45 90
5574 90 -53 37 62 -44 15 19 34 33 68 40 8 130 -41 43 -76 -109 112 -40 50 192 -65 73 -40 -34 -63 -136
5600 -136 -44 6 -51 17 11 -4 7 92 41 133 -41 29 65 86 3 6 31 66 2 -35 -110 77 -36 -25 -50 -50 -39 -96 -12 -35
5630 -35 9 98 55 27 -49 -50 -10 23 10 -28 36 17 -47 30 -7 -40 73 13 46 6 46 -15 -39 59 58 2 7 11 -17 26 -117
5661 -117 31 19 -25 67 -16 38 -66 15 -24 55 41 -6 -73 -21 -82 -11 -8 43 2 27 -28 -6 69 56 70 55 62 -108 -15
5690 -15 11 42 56 171 58 -84 -43 33 -15 -114 -49 28 30 154 11 -20 -43 73 32 28 -17 51 -9 -4 -29 -31 55 58 29 -33
5720 -33 23 -51 -41 24 -108 -17 -68 -72 -2 6 118 -25 -68 -9 -66 90 43 33 -162 34 82 64 -22 -61 150 -69 22
5747 22 -29 -28 17 -63 -42 -61 62 -42 142 74 -85 38 25 18 69 -89 60 58 44 60 42 -10 25 66 164 2 6 21
5775 21 -64 21 18 -18 -47 46 84 39 -55 -55 -32 56 -79 -19 9 99 47 47 12 -101 60 66 -27 -136 -33 -32 -66 117 -47
5804 -47 -78 26 44 52 55 19 -2 87 -26 -39 13 -13 -48 72 15 -99 -21 -6 -33 32 62 3 29 -31 80 80 4 -63 26
5833 26 -35 36 2 -14 -29 -32 42 138 75 12 11 -37 11 64 -23 -72 127 46 7 3 -65 -52 -58 16 -2 -12 42 119 44 -40 -13 -56
5865 -56 51 -26 68 85 77 73 -58 60 36 -21 22 -69 126 83 -63 -30 172 -68 22 137 -18 -50 -5 12 106 -26
5891 -26 23 39 -92 47 88 111 -84 -111 -21 -4 -71 83 86 -6 -20 -7 14 69 25 18 -12 -58 -19 -44 21 6 67 87 19
5920 19 24 -13 -69 29 69 32 -15 42 -91 -35 56 -37 58 67 19 -108 78 -291 64 58 -305 -118 -236 159 81 372 -115
5947 -115 -983 134 -970 -560 -37 -302 -27 -781 -215 -594 -207 325 -64 69 291 -90 -404 -47 212
5966 212 -147 0 76 -10 -46 -18 47 -3 64 80 -73 40 53 23 -49 -53 22 2 26 -63 -25 -6 36 -35 -118 42 -45 35
5994 35 -94 46 -53 7 -68 -123 -63 48 59 13 54 -25 75 83 50 12 7 -10 14 59 -19 56 128 79 -11 -32 -63 -69 -13 -20
6024 -20 -4 47 116 -41 -4 27 -100 -39 -34 -28 23 65 -12 -15 4 92 -143 -41 71 -110 -5 129 25 -62 -38 -104 -7
6051 -7 -9 51 -35 -10 -52 -25 28 4 4 -91 -37 -49 1 37 52 15 -43 -38 -46 -2 -60 -9 53 60 -58 -97 59 63 -12 -72 -22 -225
6083 -225 1 -81 78 -86 -22 132 282 -157 123 102 -54 -2 -69 132 112 -15 41 71 -117 -135 81 99 224
6106 224 18 54 -187 -100 214 282 93 164 -50 -236 18 213 -537 -130 -106 -100 -101 -432 156 230 -375 -451 461 -392
6130 -392 -117 165 -424 729 -486 311 181 -297 -23 -669 -13 -51 230 -29 89 192 -149 -17 123 -153
6150 -153 -56 -123 -213 -19 9 -98 96 125 14 21 24 35 23 27 -17 -38 -53 -7 -50 63 -75 -54 -45 7 -46 -15 71 -54
6178 -54 79 -53 45 -53 -55 67 94 6 57 82 39 -61 37 -41 -80 -33 -9 -46 2 -98 -22 -107 -4 -51 -31 5 67 57
6206 57 -20 -60 2 -22 -29 -19 78 106 42 56 16 26 38 -18 -50 -42 -44 -52 -107 48 -28 55 -132 19 -101 113 50 66 14 1
6236 1 -69 237 486 -168 36 -183 -18 -68 18 6 -27 -69 51 -101 32 -62 70 -30 65 23 22 -52 -35 -31 125 -64
6262 -64 8 -117 200 58 -22 -389 59 -222 -4 -5 614 -399 56 -10 -248 -501 -67 157 114 415 -375 -703
6284 -703 -267 345 63 -756 -89 268 -283 -322 777 351 108 190 -150 13 633 -562 -12 220 153 -360
6304 -360 15 -35 27 2 27 -69 46 -118 95 70 -38 -132 -74 7 31 51 75 -28 -20 -35 -17 -68 -136 -13 55 -69
6330 -69 -86 -6 54 -30 -73 -65 -153 5 35 -76 10 -33 -67 -64 24 -16 -73 22 61 -10 44 -16 49 6 15 100 -29 -55 -10 -35
6360 -35 -71 15 -123 -108 125 50 108 -4 63 28 -74 60 -20 30 29 13 34 -17 1 -68 2 -16 44 119 67 64 -48 -62
6388 -62 -58 79 -79 -37 -56 32 -20 -55 3 60 70 -61 -30 28 -15 19 -7 33 32 10 0 -5 42 -73 -71 -19 -7 6 119 -57
6418 -57 -46 -80 44 -122 -17 -19 -9 -23 20 -3 6 71 -30 78 -15 -18 -31 -9 -33 -1 17 33 118 -20 20 44 -70 -85
6446 -85 -38 5 -153 19 83 -72 -63 47 19 -27 230 -366 -216 24 260 493 466 810 -590 -324 591 -327 332
6469 332 -12 -242 63 -13 4 51 -115 169 250 92 -233 -135 182 33 -127 229 31 -57 -159 -15 178 -21
6491 -21 120 3 -14 -168 211 -110 7 258 64 24 146 221 165 30 -16 13 -137 -42 131 229 155 110 61 41
6515 41 -124 74 187 0 5 121 50 -99 21 56 -6 -14 42 -108 42 49 17 -135 46 -28 35 56 36 -47 55 -16
6541 -16 60 25 -34 -45 133 -193 470 218 91 523 -103 -147 -33 11 83 28 -14 50 15 81 -44 -53 46 -28 1 34
6567 34 25 96 -48 114 10 -118 120 14 62 207 -179 -127 -325 40 400 -66 -462 -13 376 76 -74 -610
6589 -610 255 -46 42 -158 -58 -31 70 174 109 -188 172 -127 241 -124 -36 10 154 102 90 54 167 226 88
6612 88 67 -25 77 238 -884 -15 154 107 526 -106 -186 290 -995 358 240 -488 423 525 -30 -557 -167
6633 -167 933 -463 -11 93 139 162 -62 1239 238 101 268 443 -161 -493 -142 184 128 -155 -431 318
6653 318 654 -361 -428 -225 -440 -133 789 321 91 -59 264 -16 -142 -512 -197 442 -748 -351 53 -300
6673 -300 145 129 221 -394 68 39 -551 473 227 122 503 87 -60 242 147 -250 68 -160 214 -271 254
6694 254 102 334 -181 -115 64 -19 237 114 14 135 -180 160 101 -490 108 -520 -183 -150 69 485 403 -26
6716 -26 121 -107 178 50 -71 167 -532 -550 -60 -164 56 91 -393 488 515 -38 -219 -202 314 254 169 -611
6738 -611 -351 25 115 95 -49 21 -126 14 62 321 -149 -527 280 -29 -26 35 93 228 132 21 -138 75 279
6761 279 13 329 -7 411 393 241 355 174 43 264 382 -246 -121 22 509 -200 -18 -164 381 181
6781 181 -43 -81 -44 -58 -295 -9 137 -422 22 9 91 -108 -220 -76 -61 -175 -646 -342 115 -496 -183 154
6803 154 284 -78 -409 -11 -187 25 223 799 67 121 -909 -618 -573 -209 -506 664 200 -264 184 615
6823 615 -491 207 -104 489 -179 437 20 -551 150 -34 0 208 374 85 -506 210 -99 76 353 -464
6843 -464 166 -134 -409 -344 -361 -312 -512 23 67 -199 -46 -400 153 95 -258 -326 -486 -506 -160 -345 -657 -84
6865 -84 552 -170 199 -38 -843 376 -30 127 76 -372 138 116 -314 251 -171 90 -66 269 -239 -99 -191
6886 -191 61 144 -39 54 15 -138 -94 -55 -67 -55 -117 -3 25 -20 87 103 21 41 -38 -2 -63 22 83 -32 9 -94
6912 -94 -56 12 -79 -30 -13 44 -68 13 -3 -125 -31 109 37 -44 8 26 -83 20 28 -40 34 -54 26 -32 -49 27 34 -3 28
6941 28 122 61 -94 17 -25 21 25 -44 56 49 -14 -27 29 -14 -162 -20 -21 -153 -31 16 -129 -443 -133 -30 45 19
6967 19 -70 -23 57 -47 28 -44 -34 -9 -71 46 -66 49 -84 8 -44 -32 136 -23 127 16 -17 31 -226 -55 52
6992 52 -152 -18 -137 10 211 19 -191 463 -181 -208 -655 -103 433 -609 356 -242 435 90 125 114 531
7013 531 -477 -972 1176 -371 692 814 -228 -316 -658 338 -181 -495 -792 167 174 91 -112 -90 -53 324
7033 324 -498 69 -211 -66 388 91 -797 26 292 -1006 -138 223 154 256 -176 152 -412 59 45 436
7053 436 77 -292 -50 341 70 521 -320 82 40 -64 -506 -162 750 48 253 369 -631 -133 38 -573
7073 -573 607 -540 371 290 -500 241 -119 15 183 -65 -28 77 -283 28 -324 302 53 101 100 132 227 306
7095 306 -182 -160 -201 274 144 -200 -124 0 238 169 119 95 93 -46 59 -3 -68 -77 26 148 39 51 9 11 -54 0
7121 0 15 3 41 25 -6 -1 -19 13 56 44 66 -83 4 -60 -83 -96 62 41 93 -87 -90 63 32 -101 -50 142 112 67 -40
7150 -40 70 -54 -29 -37 37 88 -24 -10 -71 -22 9 -43 -10 44 80 -4 -15 -10 -24 -28 -26 14 -8 -32 -30 -126 78 11 51 29 -124
7181 -124 2 80 -18 40 -66 79 45 27 -133 -8 -29 28 -6 -116 35 -8 -21 -100 85 91 -60 -35 -73 106 -101
7206 -101 -31 -74 -7 10 -3 -92 -19 0 0 -45 -31 55 33 49 -123 23 49 -25 -8 107 74 25 12 23 25 -104 -4 27
7234 27 79 -69 37 28 -22 127 109 -39 -11 -32 -76 72 -16 1 12 64 -20 -1 -117 -33 -43 58 86 -18 27 -47 21
7261 21 92 63 -159 -3 -43 -139 -182 -208 354 -272 -206 -194 177 564 -543 -752 -552 -274 -49 -528 -110 49 -249
7284 -249 272 -483 48 1171 -253 162 -353 198 -1531 -1063 -877 585 -275 -120 100 234 -470 138 -325
7303 -325 -281 436 -1263 40 -129 -420 250 111 -150 455 231 -252 54 -29 10 -25 -227 -231 116 -246 -81
7324 -81 83 -203 12 108 -38 67 7 -34 -47 -27 -79 -124 -45 -26 1 -64 48 69 31 20 40 68 28 52 26 -35 62
7351 62 -2 -12 -61 43 -89 8 151 3 -64 71 -65 50 70 -9 -27 -37 -13 2 -35 -87 -34 -62 1 -18 -83 9 -28
7378 -28 -97 14 -29 -70 -119 60 -134 30 -36 -65 -40 -22 -1 -12 -28 38 -79 -90 56 80 -18 37 -27 45 -45 72 -66
7405 -66 -116 -61 -31 -28 -22 55 -7 50 -63 159 35 33 -36 72 -12 -14 34 -62 -4 81 5 22 57 -24 -91 51 -59 8 -49
7434 -49 -86 -52 -58 117 -5 -43 -84 137 -43 -9 -20 -4 79 100 47 11 3 -36 -29 23 -7 -41 -214 -57 -36 -10 -130 2
7462 2 -41 -91 -14 -15 32 -93 -31 7 -29 52 6 -49 -64 -68 11 13 -60 48 -60 -36 10 25 -116 22 -45 -42 43 -2 -24 -73
7492 -73 -133 66 81 21 38 15 -12 -51 -4 2 121 41 75 22 -31 21 0 -16 -131 -3 -38 -11 8 -43 -50 71 11 54 -50
7521 -50 18 68 3 -10 -35 77 58 -9 39 32 -95 63 33 77 48 42 11 15 -54 10 -15 -19 74 75 -45 26 -59 -21 -38 73
7551 73 26 -26 -4 -68 -11 -9 -32 -35 -76 -27 -21 27 27 62 -55 -75 -39 34 59 -24 -56 -19 68 -6 -41 52 -42 8 30 45 -36 -33
7583 -33 33 111 -73 -94 13 9 -45 80 -22 67 22 -45 -115 89 -57 6 -65 56 -19 -95 50 -45 -92 -93 51 -18 -23
7610 -23 35 4 63 -88 -19 12 -125 100 -105 -27 11 -113 16 -150 34 -16 -78 -113 6 67 15 60 -9 34 -90
7635 -90 -78 -64 122 116 -48 22 61 -64 50 -123 65 92 31 112 -89 19 -2 94 22 55 -26 72 131 31 20 44
7661 44 -18 1 -20 -11 9 25 25 -36 85 -15 -66 124 77 139 -31 -59 28 -50 -61 -101 -112 84 -23 69 -50 -94 21
7688 21 -37 -7 9 -15 22 78 -7 -33 -79 -57 6 -31 4 -38 14 -21 -56 -2 114 157 -22 -31 39 95 -6 22 85 28 -51
7717 -51 128 -19 -5 1 -4 59 -107 31 -19 59 -33 30 27 16 74 63 29 133 -18 -24 -77 16 -32 24 -25 39 -13 -73 -46
7746 -46 -92 -20 -26 -60 13 -22 13 115 25 -92 -77 21 36 -44 44 -40 -62 -42 -5 38 -19 -39 -2 53 27 -99 71 -27 -50
7775 -50 -44 31 -75 -53 83 6 -97 -79 51 -154 76 50 -18 -35 -75 -37 -70 36 53 10 9 83 -77 34 -57 -31 -93
7802 -93 67 12 -4 -70 89 23 -68 104 -99 44 50 -26 -19 -70 38 -23 14 44 37 33 24 -95 21 -97 25 -88 -142
7829 -142 -19 -51 44 43 15 22 73 -17 -78 -30 -61 -97 -73 -53 47 -16 44 221 -23 11 60 173 -78 -30 54 -49 -17
7856 -17 -78 53 -59 -41 14 76 -41 -25 86 20 -9 45 -22 52 0 1 -54 -28 -52 51 -32 -53 -65 42 16 0 50 18
7884 18 -42 -159 -166 65 -87 21 48 -105 55 -21 -20 -19 -109 11 -62 122 78 -77 51 -49 7 -40 -36 149 84 8
7910 8 -153 -49 -62 -221 -211 -573 66 -78 54 8 11 -11 78 -38 6 -12 21 57 -41 -66 -46 46 33 -51 -18 0 -20
7937 -20 -2 80 112 -10 1 -9 16 -25 -1 104 47 77 23 24 67 38 69 -5 107 -28 -103 9 -36 29 57 19 -93 103
7965 103 -72 34 45 12 67 -122 10 84 -26 -11 -61 50 -45 -22 8 11 -54 39 50 -25 50 43 -16 24 6 28 15 -95
7993 -95 -48 -148 129 20 86 63 -54 65 24 1 27 -10 61 58 2 11 128 33 -49 29 -48 -28 -23 -88 50 -104 -64 -8
8021 -8 -10 26 -6 121 -95 47 56 62 -34 143 84 -69 60 -32 -89 38 129 -119 -40 -56 -240 43 -75 -100 -24 108
8047 108 20 -55 -10 -30 42 33 13 5 87 -53 -35 -56 25 10 31 -52 27 -5 18 21 98 22 35 5 31 17 -142 -54 71 30
8077 30 78 34 32 -5 -39 153 -21 -18 -25 10 124 -53 104 -113 47 153 -35 -55 -42 17 -4 -5 13 -32 7 47 -151
8104 -151 6 -77 87 -18 19 -17 -66 36 82 -43 90 27 -72 -95 3 -46 96 -28 39 -64 -83 3 -55 3 25
8129 25 0 -158 -107 21 6 -39 -54 8 -40 15 -75 -15 100 -31 -26 54 51 64 84 -15 -33 51 -84 9 -14 -35 -10 -29 -36
8158 -36 35 144 45 -81 4 52 -86 51 30 5 -70 -56 16 72 -13 -99 62 61 -75 1 91 29 -70 29 -11 27 10 73
8186 73 -34 52 39 -82 25
8191B5
##END NTUPLES=NMR FID
##END=
