##TITLE=1H_DE-80H_X3
 200.13MHz, d2o
 8 sc
 
 19ns.26.2.2025
##JCAMPDX= 6.0         $$ Bruker NMR JCAMP-DX V2.0
##DATA TYPE= NMR FID
##DATA CLASS= NTUPLES
##ORIGIN= UXNMR, Bruker Analytische Messtechnik GmbH
##OWNER= pz
$$ XWIN-NMR		Version 3.5
$$ Fri Jul 24 13:01:13 2026 Russian Standard Time (UT+4h)  Yarkov@DPX200
##.OBSERVE FREQUENCY= 200.1313
##.OBSERVE NUCLEUS= ^1H
##.DELAY= (6, 6)
##.ACQUISITION MODE= SIMULTANEOUS
##.ACQUISITION SCHEME= undefined
##.AVERAGES= 8
##.DIGITISER RES= 18
##SPECTROMETER/DATA SYSTEM= spect
##.PULSE SEQUENCE= zg30
##.SOLVENT NAME= CDCl3
##.SHIFT REFERENCE= (INTERNAL, CDCl3, 0, 14.3821)
##AUDIT TRAIL= $$ (NUMBER, WHEN, WHO, WHERE, WHAT)
$$ ##TITLE= Audit trail, XWIN-NMR		Version 3.5
$$ ##JCAMPDX= 5.01
$$ ##ORIGIN= Bruker BioSpin GmbH
$$ ##OWNER= Yarkov
$$ C:/Bruker/XWIN-NMR/data/yarkov2/nmr/H-C/1/audita.txt
$$ ##AUDIT TRAIL=  $$ (NUMBER, WHEN, WHO, WHERE, WHAT)
(   1,<2026-07-24 12:59:49.89 +0400>,<Yarkov>,<DPX200>,
      <created by zg, POWCHK disabled, PULCHK disabled
       configuration hash MD5:
       00 E9 B6 7A A2 85 ED C7 34 08 36 98 17 FE 4E 26
       data hash MD5: 16K
       C4 0C EC 29 3B A9 1D 26 A2 29 D0 F7 99 E8 F6 31>)
$$ ##END=
$$ 
$$ hash MD5
$$ 32 1E 69 4C C4 50 2D 92 44 99 3B 77 6C A0 FE 05
##$RELAX= 
##$RELAX= 
##$RELAX= 
##$RELAX= 
##$RELAX= 
##$RELAX= 
$$ Bruker specific parameters
$$ --------------------------
##$DU= <C:/Bruker/XWIN-NMR>
##$EXPNO= 1
##$NAME= <H-C>
##$PROCNO= 1
##$TYPE= <nmr>
##$USER= <yarkov2>
##$AMP= (0..31)
100 100 100 100 100 100 100 100 100 100 100 100 100 100 100 100 100 100 
100 100 100 100 100 100 100 100 100 100 100 100 100 100 
##$AQSEQ= 0
##$AQ_mod= 1
##$AUNM= <au_zg>
##$AUTOPOS= <>
##$BF1= 200.13
##$BF2= 200.13
##$BF3= 200.13
##$BF4= 200.13
##$BF5= 200.13
##$BF6= 200.13
##$BF7= 200.13
##$BF8= 200.13
##$BYTORDA= 1
##$CFDGTYP= 0
##$CFRGTYP= 5
##$CHEMSTR= <none>
##$CNST= (0..31)
1 1 145 1 1 1 1 1 1 1 1 1 1 1 1 1 1 1 1 1 1 1 1 1 1 1 1 1 1 1 1 1 
##$CPDPRG= <>
##$CPDPRG1= <>
##$CPDPRG2= <>
##$CPDPRG3= <>
##$CPDPRG4= <mlev>
##$CPDPRG5= <mlev>
##$CPDPRG6= <mlev>
##$CPDPRG7= <mlev>
##$CPDPRG8= <mlev>
##$CPDPRGB= <>
##$CPDPRGT= <>
##$D= (0..31)
0 0.7 0 0 0 0 0 0 0 0 0 0.03 0 0 0 0 0 0 0 0 0 0 0 0 0 0 0 0 0 0 0 0 
##$DATE= 1784883589
##$DBL= (0..7)
120 120 120 120 120 120 120 120 
##$DBP= (0..7)
150 150 150 150 150 150 150 150 
##$DBP07= 0
##$DBPNAM0= <>
##$DBPNAM1= <>
##$DBPNAM2= <>
##$DBPNAM3= <>
##$DBPNAM4= <>
##$DBPNAM5= <>
##$DBPNAM6= <>
##$DBPNAM7= <>
##$DBPOAL= (0..7)
0.5 0.5 0.5 0.5 0.5 0.5 0.5 0.5 
##$DBPOFFS= (0..7)
0 0 0 0 0 0 0 0 
##$DE= 6
##$DECBNUC= <off>
##$DECIM= 32
##$DECNUC= <off>
##$DECSTAT= 4
##$DIGMOD= 1
##$DIGTYP= 9
##$DL= (0..7)
0 120 120 120 120 120 120 120 
##$DP= (0..7)
150 150 150 150 150 150 150 150 
##$DP07= 0
##$DPNAME0= <>
##$DPNAME1= <>
##$DPNAME2= <>
##$DPNAME3= <>
##$DPNAME4= <>
##$DPNAME5= <>
##$DPNAME6= <>
##$DPNAME7= <>
##$DPOAL= (0..7)
0.5 0.5 0.5 0.5 0.5 0.5 0.5 0.5 
##$DPOFFS= (0..7)
0 0 0 0 0 0 0 0 
##$DQDMODE= 0
##$DR= 18
##$DS= 0
$$ [...]
##$SUBNAM2= <"">
##$SUBNAM3= <"">
##$SUBNAM4= <"">
##$SUBNAM5= <"">
##$SUBNAM6= <"">
##$SUBNAM7= <"">
##$SUBNAM8= <"">
##$SUBNAM9= <"">
##$SW= 18.0517328524113
##$SWIBOX= (0..15)
0 0 2 0 0 0 0 0 0 0 0 0 0 0 0 0 
##$SW_h= 3612.71676300578
##$TD= 16384
##$TD0= 1
##$TE= 0
##$TE2= 300
##$TE3= 300
##$TEG= 300
##$TL= (0..7)
0 120 120 120 120 120 120 120 
##$TP= (0..7)
150 150 150 150 150 150 150 150 
##$TP07= 0
##$TPNAME0= <>
##$TPNAME1= <>
##$TPNAME2= <>
##$TPNAME3= <>
##$TPNAME4= <>
##$TPNAME5= <>
##$TPNAME6= <>
##$TPNAME7= <>
##$TPOAL= (0..7)
0.5 0.5 0.5 0.5 0.5 0.5 0.5 0.5 
##$TPOFFS= (0..7)
0 0 0 0 0 0 0 0 
##$TUNHIN= 0
##$TUNHOUT= 0
##$TUNXOUT= 0
##$USERA1= <user>
##$USERA2= <user>
##$USERA3= <user>
##$USERA4= <user>
##$USERA5= <user>
##$V9= 5
##$VALIST= <valist>
##$VCLIST= <CCCCCCCCCCCCCCC>
##$VD= 0
##$VDLIST= <DDDDDDDDDDDDDDD>
##$VPLIST= <PPPPPPPPPPPPPPP>
##$VTLIST= <TTTTTTTTTTTTTTT>
##$WBST= 1024
##$WBSW= 4
##$XGAIN= (0..3)
0 0 0 0 
##$XL= 0
##$YL= 0
##$YMAX_a= 126444
##$YMIN_a= -68487
##$ZGOPTNS= <>
##$ZL1= 120
##$ZL2= 120
##$ZL3= 120
##$ZL4= 120
##$ABSF1= 10
##$ABSF2= 0
##$ABSG= 5
##$ABSL= 3
##$ALPHA= 0
##$AQORDER= 0
##$ASSFAC= 0
##$ASSFACI= 0
##$ASSFACX= 0
##$ASSWID= 0
##$AUNMP= <proc_1d>
##$AZFE= 0.1
##$AZFW= 0.1
##$BCFW= 1
##$BC_mod= 2
##$BYTORDP= 1
##$COROFFS= 0
##$CY= 83.5205535888672
##$DATMOD= 1
##$DC= 2
##$DFILT= <>
##$DTYPP= 0
##$F1P= 10.8118882576601
##$F2P= -7.23987719738617
##$FCOR= 0.5
##$FTSIZE= 0
##$FT_mod= 4
##$GAMMA= 1
##$GB= 0.15
##$INTBC= 1
##$INTSCL= 1
##$ISEN= 128
##$LB= 0.25
##$LEV0= 0
##$LPBIN= 0
##$MAXI= 10000
##$MC2= 0
##$MEAN= 0
##$ME_mod= 0
##$MI= 1.114404
##$NCOEF= 0
##$NC_proc= 0
##$NLEV= 6
##$NOISF1= 3.799351
##$NOISF2= 2.8
##$NSP= 1
##$NTH_PI= 0
##$NZP= 0
##$OFFSET= 14.38212
##$PC= 1
##$PHC0= -7256.183
##$PHC1= 2.82197
##$PH_mod= 1
##$PKNL= yes
##$PPARMOD= 0
##$PSCAL= 0
##$PSIGN= 0
##$REVERSE= no
##$SF= 200.129724274929
##$SI= 16384
##$SIGF1= 3
##$SIGF2= 2
##$SINO= 400
##$SIOLD= 16384
##$SREGLST= <1H.CDCl3>
##$SSB= 0
##$STSI= 0
##$STSR= 0
##$SW_p= 3205.1282051282
##$SYMM= 0
##$S_DEV= 0
##$TDeff= 0
##$TDoff= 0
##$TI= <>
##$TILT= no
##$TM1= 0
##$TM2= 0
##$TOPLEV= 0
##$USERP1= <user>
##$USERP2= <user>
##$USERP3= <user>
##$USERP4= <user>
##$USERP5= <user>
##$WDW= 1
##$XDIM= 8192
##$YMAX_p= 0
##$YMIN_p= 0
$$ End of Bruker specific parameters
$$ ---------------------------------
##NTUPLES= NMR FID
##VAR_NAME=  TIME,          FID/REAL,        FID/IMAG
##SYMBOL=    X,             R,               I
##VAR_TYPE=  INDEPENDENT,   DEPENDENT,       DEPENDENT
##VAR_FORM=  AFFN,          ASDF,            ASDF
##VAR_DIM=   8192,          8192,            8192
##UNITS=     SECONDS,       ARBITRARY UNITS, ARBITRARY UNITS
##FACTOR=    0.0002768,     1,               1
##FIRST=     0,             0,               0
##LAST=      2.2672688,     0,               0
##MIN=       0,             -68487,          0
##MAX=       2.2672688,     126444,          0
$$ Real data points
##PAGE= N=1
##DATA TABLE= (X++(R..R)), XYDATA
0 0 0 0 0 0 0 0 0 0 0 0 0 0 0 0 0 0 0 8 -8 8 -8 8 -8 16 -16 16 -24 24 -28 32 -38 40 -48 56 -60 68 -76 85 -96
39 -96 106 -118 132 -146 162 -178 196 -217 239 -263 291 -319 352 -389 429 -475 523 -583 650 -727
59 -727 821 -932 1071 -1246 1478 -1796 2273 -3057 4567 -8610 44457 126444 95491 49628
73 49628 -17973 -52443 -50054 -9757 34981 61050 43520 2912 -42138 -64296 -53636 -10727
85 -10727 33819 59352 55011 26483 -7352 -22646 -16100 11704 37289 42609 27549 -3587 -35302
98 -35302 -43511 -26486 6308 36063 46228 33097 4666 -24316 -34836 -19380 10122 34703
110 34703 43888 29556 -2876 -33047 -47044 -36768 -8110 20561 38759 38446 18889 -2333 -13428
123 -13428 -10814 3165 18542 25075 17301 -1393 -19402 -26478 -20019 -5693 10697 20347 15917
136 15917 5326 -3227 -5149 3866 16961 27097 28568 16005 -1437 -14227 -19187 -12399 2528
149 2528 15147 18576 11089 -1885 -13004 -15964 -9398 4946 19148 22560 16212 5134 -7869
162 -7869 -14255 -11288 -1951 9823 14469 11858 6042 -1978 -6164 -3121 3280 9019 9960 5398 -2799
177 -2799 -10495 -13343 -10237 -2966 3366 6022 6035 1492 -2444 -1170 3604 9084 12246 10507 5476 -2702
193 -2702 -10114 -10795 -6855 -1149 3226 4291 1168 -4667 -8716 -8342 -3127 4176 9305 11509 8462 1280
209 1280 -3970 -6388 -5457 -318 4096 6268 5027 736 -2736 -4504 -4501 -1770 1714 3255 1884 -134
225 -134 -2214 -3621 -3273 -2167 -854 -319 -2013 -2144 -1044 839 4665 7589 8077 5720 693 -4117
241 -4117 -6816 -7243 -4333 20 2606 2268 -45 -3356 -6451 -6604 -3656 875 5283 7140 6862 4890
257 4890 803 -2120 -3022 -3122 -1906 -1006 -465 -131 -760 -892 -496 -576 -875 -1435 -2080 -2472 -1914 14 1767
276 1767 2842 2806 1272 -846 -3181 -3800 -1809 785 3513 5365 5206 3233 -98 -3170 -4328 -4367 -3337
293 -3337 -1614 -203 -33 -638 -916 -1430 -1316 -96 583 1382 1961 1958 2555 2436 1937 1803 731 -1058 -2528
312 -2528 -3412 -3419 -2657 -1315 261 1254 962 16 -729 -1221 -1151 -98 1244 2281 2999 2351 1447 500 -578
331 -578 -661 -812 -902 -459 -463 -468 -482 -432 -256 -470 -997 -1339 -1629 -1738 -1207 59 1409 2296 2875 2298 1265 434
353 434 -607 -833 -287 358 1072 1055 571 -257 -1340 -1973 -2420 -2063 -1371 -703 145 891 1253 1573 1262 806
373 806 449 -121 -277 -37 438 1130 1417 1163 642 -557 -1717 -2588 -2565 -2001 -1032 336 1059 1400 1491 590
393 590 102 -429 -377 63 615 1198 1815 1560 1028 321 -816 -1369 -1848 -2077 -1648 -969 -126 379 756 668 122
414 122 -496 -1036 -1055 -581 -21 1070 1529 1804 1635 473 -307 -938 -1209 -1087 -576 -23 464 515 196 -325
434 -325 -1002 -1535 -1924 -1894 -1077 -225 632 1477 2020 1809 1113 327 -401 -954 -919 -559 -205 487 478 441 -240 -1009
456 -1009 -1485 -1823 -1574 -965 245 1405 1977 2245 1848 993 138 -521 -745 -523 -127 367 921 919 700 21
476 21 -795 -1389 -1652 -1737 -880 7 712 1447 1427 717 -166 -907 -1677 -1301 -855 -187 858 1089 1159 1031 135
497 135 -853 -1464 -1768 -1667 -1236 -438 247 551 467 135 -686 -1293 -1530 -1249 -588 230 1028 1569 1613 1120 488
518 488 -246 -1159 -1333 -1165 -726 40 565 1106 1126 313 -348 -725 -1116 -782 -8 919 1805 2291 2374 1930 1116
539 1116 224 -703 -1158 -1144 -922 -74 774 1117 1008 538 -291 -1256 -1531 -1145 -546 281 1197 1788 1694 889 70
560 70 -575 -1558 -1781 -1558 -755 -5 771 990 921 -24 -830 -1420 -1460 -1245 -301 637 1183 1399 1090 427 -877
581 -877 -1603 -1704 -1303 -731 435 1457 2129 1880 1193 353 -714 -1564 -1449 -1061 -372 552 1166 1427 1046
600 1046 444 -44 -514 -720 -459 410 986 1319 1663 1392 756 109 -707 -822 -918 -728 54 639 678 456 394
621 394 129 -297 -556 -210 35 156 478 704 623 224 -230 -359 -724 -913 -590 -257 50 360 631 515 307
642 307 -99 -350 -647 -918 -852 -439 -13 336 848 1075 963 482 -97 -494 -1081 -1357 -984 -466 -45 341 758
663 758 725 387 -291 -522 -765 -743 -100 598 1015 1216 1113 587 -361 -1136 -1374 -1228 -879 -239 655 1152 917
684 917 652 143 -426 -990 -894 -278 170 663 1116 817 -4 -811 -1679 -1884 -1698 -951 346 1479 2027 1983
704 1983 1292 193 -972 -1915 -1964 -1589 -675 411 1413 1452 953 291 -671 -1361 -1543 -859 26 630 1495
723 1495 1686 1105 -45 -879 -1742 -2076 -1770 -802 463 1014 1420 1525 810 -133 -780 -839 -775 -397 443 986
743 986 1039 505 -399 -879 -1563 -1627 -1164 -240 896 1585 2000 1625 960 -90 -765 -1452 -1651 -1078 -262 180
763 180 639 829 383 5 -280 -574 -597 -626 -251 465 1251 626 391 306 -423 -651 -1064 -800 -524 -157 348
784 348 643 771 362 378 314 -166 -242 -514 -186 -244 -226 50 132 -152 -92 -110 -216 -265 -361 329 502 662 667 616 250
809 250 -312 -630 -840 -1056 -844 -150 460 617 1018 1261 714 99 -395 -635 -815 -520 -55 461 874 659
829 659 505 38 -636 -1021 -844 -708 -95 638 1226 1458 964 368 -421 -1119 -1368 -1156 -561 269 704 1127
849 1127 1009 347 -243 -639 -758 -816 -217 456 973 949 840 423 -284 -945 -1259 -1029 -531 137 1027 1408 1124
870 1124 728 -70 -729 -1261 -1320 -879 -63 539 1004 1124 789 187 -448 -879 -967 -857 -71 447 848 1177 857
891 857 368 -327 -878 -1055 -892 -491 85 763 851 905 589 6 -458 -734 -764 -531 -65 448 779 898 616
912 616 -171 -360 -663 -924 -498 39 674 561 1037 738 243 -434 -275 -760 -763 -366 -47 188 1050 603 470
933 470 62 -167 -1437 -974 -647 -354 267 490 683 449 251 -222 -458 -682 -584 -402 48 350 733 621
953 621 346 10 -479 -865 -812 -514 -10 341 609 699 553 244 -342 -730 -715 -660 -430 131 585 649 694 498
975 498 -201 -408 -719 -672 -332 253 674 922 754 480 -33 -464 -850 -855 -644 -157 221 582 898 766 276
996 276 -128 -548 -749 -54 -43 -89 370 786 543 199 -374 -599 -781 -610 -576 38 461 673 565 480 136 -387
1018 -387 -651 -786 -612 -217 162 501 747 540 301 -99 -496 -723 -537 -362 -29 413 481 609 261 -95
1038 -95 -430 -704 -747 -451 -153 373 654 658 619 412 -115 -443 -837 -423 -254 79 492 560 631 284 -26 -388
1060 -388 -530 -524 -371 43 416 778 804 738 179 -78 -465 -735 -581 -211 209 611 742 769 476 -221 -603 -772
1082 -772 -922 -528 -30 470 716 839 648 189 -411 -698 -825 -557 -197 400 549 688 578 347 -236 -824
1102 -824 -952 -787 -367 158 638 816 794 526 102 -438 -691 -597 -443 127 482 757 729 484 104 -469 -625
1123 -625 -776 -562 -245 406 701 760 628 286 -91 -510 -786 -615 -382 41 481 741 808 475 111 -186 -598
1144 -598 -576 -355 -35 326 594 540 505 -15 -307 -437 -547 -484 -64 176 356 674 591 373 63 -311 -570 -526
1166 -526 -531 -78 245 434 513 235 83 -298 -482 -523 -430 -157 2 561 637 501 339 -3 -337 -548 -574 -396
1188 -396 -25 243 500 566 507 139 -120 -396 -638 -440 -249 60 494 600 438 316 -68 -367 -551 -579 -288
1209 -288 133 403 500 557 264 43 -393 -513 -593 -481 -154 279 505 605 452 209 -117 -483 -628 -611 -205
1230 -205 73 521 623 551 275 -136 -440 -558 -625 -293 62 380 582 556 459 130 -270 -636 -624 -511 -183 174
1252 174 490 585 568 229 -167 -539 -590 -496 -273 -7 337 539 579 320 41 -248 -530 -457 -236 -77 250 462
1274 462 429 356 172 -201 -463 -593 -481 -163 114 453 547 459 425 -73 -345 -516 -645 -357 67 335 523 562
1296 562 395 -7 -326 -510 -561 -383 -177 166 487 533 460 261 -156 -441 -568 -594 -358 45 294 575 600 397
1318 397 89 -250 -408 -455 -423 -50 232 460 517 487 86 -147 -509 -385 -411 -146 108 414 584 577 128 -188
1340 -188 -474 -483 -539 -241 113 294 546 490 340 -11 -255 -628 -587 -408 -85 288 418 578 309 105 -220 -553
1362 -553 -686 -574 -206 79 353 575 469 328 25 -283 -399 -490 -307 -117 27 412 384 126 142 -139 -391
1383 -391 -352 -334 -167 147 455 470 419 143 -143 -246 -487 -418 -232 63 217 479 404 382 -22 -115 -215 -312 -253
1406 -253 -46 249 352 457 363 43 -156 -366 -431 -427 -222 24 256 533 490 322 76 -151 -531 -398 -448 -240
1428 -240 162 328 513 422 274 -118 -246 -364 -462 -313 -44 308 227 462 281 44 -246 -389 -550 -225 -45
1449 -45 175 418 437 340 108 -234 -427 -479 -294 -41 131 345 347 348 260 58 -300 -401 -482 -332 0 365 399 426
1473 426 303 -46 -312 -484 -496 -401 -224 78 399 358 398 166 -141 -282 -408 -340 -199 -121 220 384 262 121
1495 121 -71 -316 -300 -553 -249 91 165 267 396 208 117 -126 -287 -381 -330 -126 80 186 324 391 230 -170
1517 -170 -286 -368 -311 -93 52 284 354 337 220 -33 -244 -364 -245 -247 5 155 365 336 318 145 -115 -224 -444
1540 -444 -346 -191 23 197 303 337 218 -55 -84 -224 -339 -251 -46 144 252 252 200 43 -174 -198 -333 -261 -185
1563 -185 -26 163 263 279 80 -21 -262 -374 -142 -132 -65 265 309 441 80 39 -266 -567 -183 -508 65 -22
1585 -22 284 230 130 88 -54 -260 -348 -322 -93 76 234 298 360 179 13 -158 -287 -293 -252 -64 130 234 218 200
1609 200 -20 -141 -318 -516 -392 -230 -7 241 347 206 96 -57 -186 -149 -254 -171 330 171 360 218 231
1630 231 20 -177 -416 -358 -340 -132 118 196 314 188 38 -129 -65 -148 -138 -81 52 206 240 349 241 -49 -191
1653 -191 -287 -315 -215 -45 23 239 219 96 84 -120 -218 -157 -113 -3 183 210 358 349 90 -54 -129 -323 -275 -235 -82
1678 -82 118 219 163 75 -63 -135 -156 -288 -179 -60 76 375 385 319 188 94 -87 -224 -156 -99 -54 252 112 172
1702 172 30 -192 -310 -385 -260 -185 -70 132 240 303 265 160 -108 -130 -156 -73 -23 75 215 209 184 189 -181 -284 -335
1727 -335 -358 -275 -96 98 250 226 206 118 -27 -189 -160 -209 34 169 258 357 151 97 27 -321 -319 -266 -219 96 103 90
1753 90 93 151 93 -84 -148 -226 -112 27 274 313 355 119 59 -126 -240 -442 -298 -232 2 103 189 89 109 -34
1777 -34 -254 -173 -95 -122 -22 190 319 295 207 194 -9 -186 -328 -148 -105 34 -11 246 18 3 -65 -264 -335 -279
1801 -279 -143 32 168 199 219 297 124 -30 -175 -140 -138 5 42 174 106 76 -121 -252 -179 -256 -288 -218 -12 70 239
1826 239 325 169 135 -33 -179 -96 -85 -45 89 241 89 159 11 -195 -192 -237 -306 -207 -16 131 119 152 132 16 -68
1851 -68 -164 -39 -51 294 246 274 209 168 -28 -193 -126 -322 -287 -222 -15 -33 20 129 -72 -80 -198 -87 -193 75 103
1876 103 367 225 254 234 -39 -159 -118 -100 -129 -136 -2 159 79 -29 -84 -104 -279 -128 -172 12 180 250 283 310 133
1901 133 108 -95 -117 -204 -70 126 110 127 144 70 -174 -261 -179 -252 -244 86 61 54 364 299 573 107 -1 -91 -220 0
1927 0 19 172 173 -13 0 -72 -180 -196 -324 -300 -140 38 128 211 117 143 -42 38 -124 -66 -18 166 120 144 165 16
1953 16 -128 -182 -250 -235 -177 21 141 101 169 91 53 -65 -76 -72 -131 -60 81 268 236 180 52 -10 -220 -148 -203 -167 -70
1980 -70 54 46 70 -23 -47 -62 -127 -173 -211 14 208 256 285 323 159 -38 -18 -55 -199 -37 56 83 7 105 18 -118 -175
2007 -175 -132 -252 -91 -105 155 89 210 232 104 8 -106 -11 -114 -40 8 93 22 -4 44 -148 -175 -182 -229 -187 13 75
2033 75 190 291 82 -2 28 -133 -7 -181 47 88 79 212 166 -12 -54 -273 -221 -330 -121 -65 45 229 100
2056 100 78 -39 3 -70 -41 16 53 104 140 221 149 88 -204 -212 -236 -142 -122 -167 94 117 110 42 41 -122 -128 -32 -11 183 118
2085 118 138 207 167 -78 -2 -51 -125 -198 -40 -146 -304 132 -15 52 -68 -22 -156 -61 -30 133 54 171 197 167 44
2110 44 -64 -112 -83 -75 21 44 -48 28 71 -46 -98 -157 -143 -111 -92 63 174 190 184 221 94 67 -110 -59 34 -47 68 94
2138 94 14 19 -128 -35 -190 -120 -57 -95 6 71 164 174 35 29 -37 -60 -91 71 15 138 41 136 -2 -88 -110 -212 -206 -85
2166 -85 -65 137 119 76 112 123 -103 -58 -133 -38 24 41 62 245 75 6 -2 -133 -149 -168 -163 -13 118 -19 51 80 -4
2193 -4 -38 -127 -29 -75 15 157 202 129 209 39 56 -109 -173 -176 -136 -72 -36 187 148 44 -145 -26 -156 -105 -37 -32 113
2220 113 165 147 118 75 -27 -62 -194 21 -21 -37 45 52 82 83 -32 -185 -93 -204 -187 63 31 116 212 117 46 16 -177
2247 -177 -115 -37 -66 93 119 102 -30 81 -21 -231 -247 -72 -110 -183 22 115 173 193 99 -167 -125 -73 -9 -45 122
2272 122 200 169 161 95 23 -48 -214 -177 -94 -86 41 -24 34 0 -23 -55 -81 -35 -156 -16 203 178 139 142 108 -34 -134 -134
2300 -134 -135 -58 -15 86 56 13 -69 -51 -13 -59 -134 -91 -78 70 90 66 1 60 -93 -14 -100 -108 8 -15 5 45 98 68 327
2329 327 14 -149 -132 -85 13 55 93 180 149 25 15 -80 10 -59 -81 47 70 90 114 108 -130 -94 -119 -91 -91 -12 16 53
2357 53 187 5 -7 -68 -63 3 -116 16 -83 -4 104 28 -50 6 -28 -72 -94 -70 -40 65 204 80 65 27 -45 -196
2383 -196 -78 -92 -43 38 139 90 28 36 -25 -65 -160 -111 -96 -2 66 15 41 47 1 -106 -59 -121 -118 42 91 106 13 157 66
2412 66 -64 -170 -82 -20 -56 76 88 221 96 39 -13 -109 -85 -65 -67 -124 32 32 3 93 -31 -33 -105 -144 -41 25 -29 95
2440 95 29 110 -13 -145 -113 -155 -176 -38 228 71 123 51 61 -43 -79 -100 -137 -28 -74 36 51 15 62 98 -60 -44
2466 -44 -113 -156 20 46 26 77 131 19 35 -60 -96 -129 -3 57 72 14 101 83 -22 -78 -95 23 56 40 -22 -208 42
2493 42 147 -372 -283 -152 61 -30 82 9 52 87 47 -18 -12 -103 -141 -95 21 -81 99 0 -2 95 -3 13 -64 7 -190
2520 -190 60 97 -6 137 65 36 72 -34 -80 -56 -26 63 107 13 72 35 -84 -109 -112 -150 -87 -88 125 -52 103 -114
2546 -114 162 -185 222 -453 510 22 641 -389 -572 255 -84 229 -132 12 -168 -25 -25 83 138 146 -4
2567 -4 7 -46 -25 -153 -100 11 32 74 188 49 40 10 -29 -50 -68 -160 17 107 64 -35 30 -121 130 -55 -39 28 -5
2594 -5 8 -131 104 55 63 82 1 -108 -65 -51 -82 21 67 156 44 7 1 -106 26 -102 2 -30 1 44 65 117 -27
2621 -27 21 6 -173 -147 -45 13 52 -81 119 33 -83 -6 -9 -101 25 -43 51 -4 -4 53 -119 -53 -63 -79 -56 27 -37 56
2649 56 24 82 37 -91 -96 -48 27 -25 -15 60 170 5 -58 -7 -83 -56 -22 45 -36 44 69 14 102 41 97 -125 -29 29 -20
2678 -20 90 66 41 -54 102 -48 -92 -35 -66 29 3 93 122 -52 63 50 -45 -73 -16 -20 -63 112 -75 71 -37 -54
2704 -54 -21 -72 -199 -100 -34 -19 -44 115 148 -95 11 -8 -125 -5 6 9 -16 67 115 29 98 -29 -57 -67 -36 166 13
2731 13 -8 93 -47 60 55 -71 -46 -188 8 56 33 32 24 -10 -51 13 -122 -111 55 -38 -22 114 36 105 -43 -72 30
2758 30 -57 -4 -29 68 -49 -14 13 -8 -7 8 -27 -135 -24 -39 76 11 88 55 31 -131 -48 -33 18 -19 1 -26 223 220
2786 220 -129 235 -159 -9 -135 -25 92 -6 28 -108 -12 -84 44 -87 82 5 8 134 86 31 -72 -88 -118 -45
2810 -45 -130 -1 -128 21 -123 99 31 -107 -49 -119 -77 -70 -73 55 27 159 -1 -84 6 -12 -70 -95 -70 65 9 31
2836 31 88 -49 14 -76 26 18 -81 12 54 38 -21 49 44 -15 12 -48 -66 80 12 116 -26 -30 12 19 11 41 -83 -27 -44 53
2866 53 -13 -96 24 -4 145 309 152 -175 35 -1 22 16 0 -155 94 -78 -24 -57 -16 8 57 62 49 16 -4 94 -76
2893 -76 -53 -102 -111 1 -44 41 22 -50 100 -48 -80 -154 -107 -89 37 61 97 41 36 64 -74 -116 -96 -16 8 59 55 84 -65
2922 -65 -27 -23 -41 -8 4 75 -23 -95 15 62 -79 -71 2 -63 -30 31 -12 103 -67 -42 25 135 -85 30 -74 7 -80
2949 -80 50 -29 60 -48 -3 15 -61 -64 -35 23 30 11 16 83 47 19 -39 -19 -97 -35 84 41 -27 16 98 37 17 50 -54 -44
2979 -44 2 19 -50 79 17 15 53 -74 -34 43 -28 153 -24 26 -86 68 -108 -5 -15 -49 42 -80 36 86 -7 -9
3005 -9 63 27 28 -30 -33 -50 66 -4 143 13 -14 33 159 -110 18 101 -11 40 48 -54 20 69 22 -83 -24 66 1 109
3033 109 -54 -6 161 -44 -91 27 -159 -93 -26 -119 -64 154 103 33 21 55 -87 83 -26 86 -29 58 162 113
3057 113 -19 78 420 54 -409 435 505 71 203 -98 47 -213 -150 164 -199 -92 61 -113 159 -39 13
3078 13 -95 -28 -150 76 -46 21 14 172 49 8 -83 22 -62 -56 -166 4 37 82 56 -78 17 30 -48 13 85 -96
3104 -96 97 1 62 108 105 51 -25 -59 -78 -99 11 -44 4 -40 27 13 -113 52 36 45 -46 60 33 -2 34 101 -6 -30
3132 -30 45 -22 -29 78 -28 135 125 94 23 -5 35 71 -36 -63 17 -77 105 -74 -33 51 103 6 -107 5 -133 46
3158 46 113 64 73 -80 -109 -72 -21 -71 -139 93 2 -32 81 79 18 61 -125 54 -73 26 25 -16 12 65 146 43 68 -21
3186 -21 -73 -119 72 5 0 -20 7 -35 -27 -86 -51 47 32 -37 -52 59 -30 12 48 -21 -71 -63 -20 27 -67 71 42 -27 -270 -76
3216 -76 -56 2 18 -35 -21 -13 6 92 -24 -44 -9 -55 -31 -9 -38 -123 127 -20 -34 23 31 -30 43 -7 -67 14 120 117 -36
3245 -36 -42 -69 -97 -84 -57 -86 -2 -39 47 -26 67 -53 -26 -112 28 -19 -23 72 164 24 130 74 1 30 98 -87 -82 227 29
3274 29 -382 -131 283 -58 64 -104 -127 -73 20 132 -5 92 -28 6 -109 -144 -79 -48 86 89 -96 -132 25 1
3298 1 -41 33 -40 8 2 -31 17 -37 25 -106 55 -13 -94 26 -154 55 -38 54 -75 -1 13 -144 -57 -35 -107 -86 -36 -106
3326 -106 67 -18 57 53 27 -39 -10 -73 110 128 -74 -52 130 4 39 -2 13 28 -68 43 -45 45 92 50 -36 17 -159
3353 -159 -63 42 69 65 53 -41 18 37 9 -56 57 -25 -19 3 109 -95 24 46 15 -48 -100 -78 -78 -64 44 129 -122 -35
3381 -35 59 38 -100 24 -91 -94 10 118 11 -91 -76 38 -40 -48 -55 -106 75 -7 182 110 -24 105 -19 -69 -59
3406 -59 -11 46 -40 86 128 -44 15 -170 86 79 94 410 -290 33 -11 164 116 -18 30 -55 -59 73 -71 98 20
3431 20 -32 99 93 -2 73 -124 -38 72 34 -72 57 71 -47 -38 104 -91 26 -102 2 -102 -113 -38 -11 -41 -75
3456 -75 -78 -82 27 15 -65 -45 78 90 7 -22 8 12 -66 -7 -93 -44 109 12 2 -20 -80 5 80 -27 -60 -37 106 71 7
3485 7 58 -73 -87 -36 -19 -8 -120 35 2 -132 -72 -22 -26 56 -8 73 -78 26 37 6 -33 -128 -20 -16 -39 21 -5 112
3513 112 -94 22 136 -20 -66 -25 25 5 20 -137 79 47 97 23 -80 -33 -9 52 51 -2 19 39 201 -37 -136 103
3539 103 -99 456 -493 -430 -50 -47 371 -362 -354 395 -431 120 -129 -134 -399 410 414 -355 531 514 -294 -13 31 140
3563 140 -170 350 -164 -311 -44 248 -69 -93 -178 -15 -442 232 435 101 50 295 384 -684 -109 -133 -63 -523
3585 -523 280 388 24 -178 -579 158 -111 -588 -8 139 42 -179 -273 -152 -246 398 336 -252 182 -809 614
3606 614 -650 -689 -419 421 180 -522 406 -237 -333 100 55 -327 204 107 -4 109 -21 19 -80 -214 -46 52
3628 52 64 -28 90 -28 16 9 -6 8 -28 -7 -28 -24 51 9 37 -25 -47 -17 -28 17 -9 64 -36 -60 -28 -135 -45 37 -66
3657 -66 2 -94 53 2 43 9 -54 -33 -43 1 -52 -140 7 27 -31 2 -23 6 8 -25 -16 106 55 -2 -77 -76 -27 -6 -41 -13
3687 -13 -5 76 3 46 25 34 68 -31 -144 12 -52 4 81 -31 -35 -37 -71 -14 -3 85 -57 8 -22 -37 14 3 -2 -39 16 91 -33
3718 -33 -41 -78 -101 25 47 65 13 -19 -54 -3 22 -14 -10 -16 79 21 -18 -1 -14 -20 14 -83 -16 4 42 -37 19 -18 18 -58 -98 -48
3750 -48 -55 16 122 -10 -42 -29 35 44 -13 -18 53 5 20 95 -87 140 93 12 56 -10 -70 -26 12 -69 60 23 39 74 0
3779 0 -28 47 -135 9 28 12 50 17 33 -14 -72 13 -63 -42 -17 -82 -4 25 98 -3 -60 -40 50 45 0 64 183 47 -16
3808 -16 59 16 75 -51 -77 -32 52 -17 -127 51 -26 -93 -112 15 -20 34 12 -129 5 -27 18 93 -11 -23 -1 -17 -48
3835 -48 67 -23 7 -37 43 34 -38 -33 -14 70 -8 7 -86 119 -87 -81 -44 -63 27 153 -99 54 -31 67 79 -9 -63 -139 -102
3864 -102 -19 45 -16 -1 -58 -55 -1 -44 -34 -125 76 65 -36 119 -47 9 -1 15 -38 -16 -89 55 -63 -41 35 81 81 -42
3892 -42 30 124 -91 -31 -79 51 46 26 16 -67 67 -73 0 -55 119 65 44 111 -25 -103 43 -23 10 -91 -49 -72 11
3919 11 59 58 -54 45 104 -71 -31 14 41 128 -29 -29 148 55 27 65 -9 -144 -126 -78 114 61 -9 -23 15 -34 -19 -6
3947 -6 -34 -48 -77 -20 86 21 22 62 -87 -87 -131 -55 -66 106 -103 103 31 86 78 -85 -10 -81 19 -2 100 -80 84
3974 84 24 25 -20 100 -49 -103 96 -4 16 51 41 -50 135 -114 -42 34 62 20 32 86 -65 -25 74 -30 -57 92
4000 92 -29 -72 -1 128 -20 45 130 -92 6 -52 4 61 19 98 -85 64 27 52 -39 -148 66 17 21 -7 124 123 117
4027 117 -193 3 75 -140 -48 -29 -128 -16 -26 0 -8 -4 3 -37 24 -10 -99 -11 71 78 -85 -23 23 -95 -95 -33 3 12 79 75
4057 75 -48 -32 6 -122 -27 -38 -118 -9 2 92 30 53 1 53 -68 29 -56 47 -21 114 83 70 -59 -11 -68 16 3
4084 3 -30 -66 393 -394 -181 125 -75 -17 -65 25 -49 0 -81 93 103 -59 -56 59 3 39 4 -25 -128 -38 -29 -2 -16
4111 -16 -85 32 37 14 9 85 -11 -52 31 26 -109 0 -18 83 36 -72 27 38 -56 62 -19 -14 -17 30 -76 -15 105 211
4139 211 -82 42 -29 57 -25 -10 34 42 -6 -55 118 36 43 1 70 -69 -50 -30 -55 14 -17 -2 7 45 -64 -37 52 13 -48
4168 -48 -93 109 12 -5 -26 -66 90 -67 -7 -12 -16 -6 -16 50 28 4 -21 -26 -83 70 -38 -43 -48 77 9 -36 -88 -14 39 -9
4198 -9 -15 64 62 11 44 -34 -5 1 -53 45 -23 53 60 56 -68 -65 -9 -115 -29 -83 43 -41 -3 -57 49 -3 -19 45 69 143 -21
4229 -21 -55 122 -85 59 187 71 -53 37 -40 -90 -93 -21 194 123 -14 -66 23 -53 -66 3 -55 33 30 -61 -138 136 46
4256 46 23 -11 -89 27 3 62 -41 -38 -1 53 57 62 25 -4 -56 28 -29 -19 112 -38 -25 -64 -48 -94 -6 -25 -22 -23 67 65 -49
4287 -49 -57 46 -86 23 -12 7 70 50 120 33 44 131 11 -35 60 41 88 40 -8 -14 141 51 54 -12 -62 -36 24 92 -22
4316 -22 38 49 -93 149 -174 -53 73 2 -6 110 -11 12 -41 -105 7 -55 -43 19 -31 25 41 32 -133 -108 -45 14 41
4343 41 25 31 18 32 70 123 42 29 48 -120 19 -84 25 50 0 85 65 37 -122 17 -83 24 -28 125 40 -80
4369 -80 3 53 -123 -32 -17 2 66 30 3 -9 34 -71 23 -48 -53 -73 25 26 -38 159 113 62 -30 80 89 -82 -100 -3 -80
4398 -80 -19 -55 -10 31 61 -46 -31 29 -16 121 61 72 18 -22 66 33 -56 -23 -5 27 17 -3 -46 40 49 1 -70 -10 -12 12
4428 12 29 72 -5 -38 -52 -19 -55 44 -3 -47 26 40 101 30 -31 -4 -19 35 48 -44 -78 17 27 -68 -42 31 -30 56 18 -61
4458 -61 11 40 54 -5 23 -20 85 116 -5 -26 -58 -7 -88 -79 30 -42 81 10 -92 -136 52 -76 72 33 127 56 -28
4485 -28 35 19 12 -54 35 54 -95 -59 50 29 -44 37 -32 -82 -45 -53 37 -19 -43 53 52 -14 27 106 -5 -150 47 69 70 -6
4515 -6 10 -122 -83 -43 29 60 -69 -58 -21 30 28 -67 -2 37 -65 -18 -78 19 89 25 91 -78 2 -18 -76 -51 59 -113
4543 -113 -27 -54 64 16 13 -28 -8 -39 -32 -52 19 82 -4 -28 36 -30 6 -4 77 20 -54 120 60 110 104 35 20 -65 117 -99
4573 -99 -64 -14 60 29 71 14 -130 48 -26 40 23 25 -178 126 14 -63 -31 -43 25 -20 24 6 54 -82 32 31 -27 -38
4601 -38 -78 -5 19 65 85 -48 16 -53 20 -11 -30 15 -29 49 77 94 6 112 -32 -40 33 31 -33 -23 -79 -40 -1 113 -113
4630 -113 -22 66 -86 -34 -48 -32 62 40 -47 28 -40 -73 4 18 -88 2 -85 100 -38 -61 -99 -36 -92 27 31 -72 -70 -48
4658 -48 31 41 124 21 32 -62 -35 47 -62 -10 -2 29 47 68 28 -59 17 -8 -27 -3 -33 62 2 -6 51 -133 10 -28 159
4687 159 160 29 22 42 46 -86 101 -52 49 -26 40 -57 49 115 92 36 -68 7 -123 21 83 63 69 75 -37 -60 -28
4714 -28 13 -52 -38 14 -44 73 -60 -36 -45 22 -64 -14 -91 -34 -39 26 59 86 21 -25 20 -53 -63 -57 -43 68 -35 37 112 1
4744 1 72 -85 18 -86 -44 -42 107 48 34 71 -103 -77 -65 -116 11 136 5 13 119 -60 71 -77 -1 -5 -10 122
4770 122 -34 -11 68 -31 31 -81 71 62 11 -72 -22 -57 76 31 74 -37 -30 -89 60 -61 -84 40 -82 -58 8 -61
4796 -61 74 10 0 -63 -119 -17 35 21 22 21 -66 -21 -36 30 -64 27 -31 66 -45 23 114 -60 -17 84 -12 60 23 12 72
4825 72 -26 -54 11 75 -14 -41 10 -60 49 -44 13 47 44 -65 -61 35 31 -64 132 -38 2 -25 84 69 -143 108 9 43
4853 43 -84 33 -112 83 7 70 59 75 -170 -40 -10 69 94 -24 73 53 68 -11 -122 -45 68 -84 -34 -17 67
4878 67 -17 105 71 22 1 44 10 69 -60 -26 136 48 89 -105 26 -20 -79 -56 173 18 66 28 -22 -104 -110 -72 52
4905 52 59 45 77 45 86 83 49 -132 74 -96 -89 -62 -107 -6 50 28 72 -87 10 16 23 24 7 -22 26 -29 62 20 -32 -11 -49
4936 -49 -8 -52 -77 -12 103 -50 -16 -75 -62 92 -60 49 7 46 77 61 84 -15 -112 -63 8 -95 89 -13 39 91
4962 91 -27 -56 -26 -32 -41 -8 -176 -31 95 90 47 10 32 4 56 10 31 26 55 50 51 18 40 -32 -14 -130 -6 60 -55 -15
4992 -15 7 55 -8 57 43 -21 10 -53 19 30 -4 -72 85 0 -25 -33 -14 -62 -4 21 -76 36 23 47 75 -11 -116 41 56
5021 56 1 32 38 7 -4 39 -115 17 43 50 85 120 85 90 -31 -12 -20 47 -44 -12 54 61 -3 -8 -54 23 -102 -4 -46 10 128
5052 128 6 112 47 157 27 -17 -58 -23 54 64 29 5 49 91 -62 12 -92 -49 -26 -108 16 30 -28 133 12
5077 12 27 -63 -68 159 -62 -13 17 18 38 -22 -40 -81 -70 -38 -32 -8 5 176 -55 -4 7 -131 3 -22 -97 -38 27 -10 41
5106 41 29 58 161 -37 -47 -33 -49 14 4 -24 84 47 -17 -3 -28 -66 -59 13 108 162 7 -16 37 10 -20 -159 -196 -82
5134 -82 -63 97 136 -18 40 31 -61 -96 -22 6 -55 -13 87 -23 -16 29 55 40 -107 -102 -4 31 118 49 -27 -69 -13 -15 40 -15
5164 -15 -17 -90 -100 113 127 1 44 67 -49 -19 30 -92 -44 -59 95 40 2 -32 -19 77 -20 -54 -3 -56 120 29 58 16
5192 16 -30 -89 -56 3 19 29 104 131 -90 -28 11 -96 -45 45 45 -66 52 38 12 64 29 3 -25 -4 12 -42 116 -157
5220 -157 71 -93 162 -19 -186 -36 -25 -2 -12 99 16 14 94 -9 -2 -114 -76 76 30 -75 50 139 8 66
5244 66 -10 7 83 -14 -28 -116 -87 60 -36 -70 -35 -55 -16 -96 -136 -77 44 79 41 87 55 23 -9 -63 -24 -104 93 37 5
5273 5 29 -32 -47 -48 -25 -88 -24 11 -53 -37 57 72 -80 -134 147 -44 -76 -58 33 57 87 -58 -11 -56 -39 -60 -143 -54 15
5302 15 95 -134 33 29 -19 -13 -32 -89 -36 -6 -24 25 45 58 72 -24 -13 25 29 28 -82 -21 51 -26 -11 -65 24 -137 -61 -86
5332 -86 48 57 113 -26 -56 54 -171 -12 18 10 -63 -90 38 -4 26 44 -89 -54 -115 -90 -18 65 16 -14 -39 -6 -73 -125
5360 -125 -96 27 -94 39 15 -12 43 34 14 -39 -39 -125 -22 27 77 123 -99 -18 73 -91 -72 -174 -48 -53 -18 39 79
5387 79 159 74 -35 42 -46 14 -19 -13 -2 63 -16 -14 -94 -60 347 -68 150 -29 1 -49 69 -75 15 -137 42 4 -48
5414 -48 54 62 -12 173 101 -16 -12 116 -11 18 -39 -94 -49 -24 106 96 -9 -141 28 58 -25 -53 67 22 87 49
5440 49 45 45 -87 -88 40 -80 76 -23 15 -113 -9 -37 21 -98 -44 -59 42 -4 3 128 15 41 -161 27 -26 75
5466 75 48 -76 35 -36 -5 6 169 -28 -5 -125 21 -52 38 -37 37 83 146 34 -100 52 127 -11 80 50 -18
5491 -18 56 -20 -51 -24 -64 25 76 -79 1 -62 153 39 -30 21 16 -75 -61 5 53 -4 43 14 -10 99 60 -25 -51 -28 -75
5520 -75 -67 115 -5 -68 -25 -97 -81 -66 -4 53 91 31 137 -86 -43 -39 -50 34 23 75 44 71 132 22 -12 -108 -100 -23 -90
5549 -90 25 -12 -54 61 -38 -16 -52 -36 -34 -8 -103 69 88 -13 15 169 -14 42 23 28 -59 -124 98 50 54 46 89 -19
5577 -19 -33 -28 5 12 130 -33 170 52 93 44 -79 122 31 97 -53 25 75 56 -55 -11 -13 -151 0 34 66 -14 24
5604 24 90 -13 -38 -56 1 -15 111 -68 109 -54 3 35 100 -2 -34 35 -93 12 16 -127 -37 25 -35 36 20 29 23
5631 23 -70 -79 -58 32 73 -4 -2 -114 -27 99 -1 42 -63 10 54 73 22 9 -17 -147 60 -113 -119 109 -95 19 83
5658 83 -31 8 -2 19 8 95 64 -24 20 1 -40 11 -60 3 -140 -10 57 46 43 43 104 31 11 43 30 -88 -86 38 64
5687 64 22 40 -1 -59 -18 -57 -15 -117 108 43 99 72 65 -94 97 -200 18 92 -299 58 -18 58 -45 54 -59 41
5713 41 4 -77 44 7 -119 -53 33 100 68 -82 31 -27 17 100 -128 81 75 41 -87 -65 -79 -51 -6 28 -78 -54 62
5740 62 -55 37 -23 -89 -7 -22 17 -98 -20 -29 31 34 113 -74 -83 -131 -96 -72 4 -18 51 16 7 -50 5 -114 46 32 28 52
5770 52 70 47 -49 -79 -75 -41 0 -107 -22 22 -33 56 -5 -8 -101 -41 -26 30 -57 4 40 -7 128 93 -30 52 15 -2 -18 -7
5800 -7 147 94 -41 -1 61 53 -3 -9 -80 -32 37 173 -35 22 -24 -40 -9 31 -2 -52 -20 -34 32 23 33 19 -91 -21 -48 10
5830 10 39 28 46 -21 9 70 38 -33 5 57 -32 16 -30 -52 63 46 6 -33 -52 -30 -32 -12 42 26 140 41 -1 -11 -39 -17
5860 -17 10 -29 44 55 134 -16 70 -117 96 -107 21 17 -68 9 7 39 22 -30 -13 37 -9 5 -24 -123 30 -11 -83 -87 -89
5889 -89 47 57 -31 -40 114 16 91 47 8 -15 -115 -16 -74 -45 21 54 66 -46 44 23 -22 -17 -23 -6 -13 101 129 79 46 64
5919 64 72 11 14 -22 2 -17 -121 -117 -15 21 49 -57 -33 -31 -16 76 -37 -38 24 42 -34 -36 12 116 8 20 -25 -87 2 -40
5949 -40 49 -15 34 -77 30 -64 41 18 -33 32 6 -35 75 59 17 78 -43 20 6 70 19 -25 -72 8 -59 -44 -89 10
5977 10 8 36 -12 25 18 -21 5 -51 90 75 -11 26 65 -32 -71 10 -79 104 6 42 95 -21 42 137 -24 -3 27 24 -11 -85
6007 -85 45 72 47 21 46 -91 -30 -31 -62 -31 -26 -40 101 137 -25 -40 -30 -55 86 -29 107 -30 47 -104 17 -52
6033 -52 66 109 -7 44 48 57 -117 28 58 106 0 -17 -20 48 11 95 65 52 17 -75 92 -19 -32 22 -40 27 1 68
6061 68 78 141 -12 18 17 3 -76 0 -30 -113 52 20 107 1 111 278 -57 26 -105 -25 -27 -10 -45 88 59 47 -44
6088 -44 -20 -124 20 -17 52 18 -36 62 147 -130 0 -10 37 -27 1 83 -9 -38 -41 10 0 22 -65 38 0 -101 -102 60
6116 60 -29 65 -31 -27 -55 42 67 -36 3 -34 87 -103 -88 50 23 -11 84 -3 57 126 -67 -31 -378 361 241 -69
6142 -69 67 54 90 -22 23 26 -99 49 51 39 -53 32 47 53 32 -48 43 -12 -4 64 49 67 44 125 -12 73 101 25 -107
6171 -107 -40 -61 -96 -20 -25 52 -48 10 -67 -47 18 0 -51 -69 59 53 72 44 92 72 137 36 51 7 -35 79 19 -12 29
6200 29 -39 -42 15 -43 -16 116 43 -6 -139 -16 60 -50 59 -47 -10 14 106 48 132 73 -75 -30 -43 -97 -143 39 -17
6227 -17 -63 72 -77 -36 -71 46 61 -112 -118 58 4 64 65 23 51 18 -22 -81 58 -72 78 31 75 -123 54 -95
6253 -95 -4 -18 22 65 -79 -26 40 23 -40 56 -142 12 107 15 -141 -8 -133 19 54 32 -20 -42 -50 78 37 127 -16
6280 -16 0 42 71 -38 22 -7 -75 -70 8 15 34 96 11 -83 -13 29 -69 -37 28 36 19 48 107 72 37 31 -74 -109 -57 -26 11
6311 11 19 32 115 45 -89 -69 -68 -7 -96 5 197 -46 74 50 100 18 -4 -9 -13 -60 -16 -104 67 43 -8 27 24 6 58 8
6341 8 -79 -41 23 31 -51 46 64 32 32 -67 -19 3 76 -44 15 -60 -74 -34 -13 6 29 -83 95 73 -77 99 62 88 103
6370 103 41 -22 -21 88 79 67 -39 -58 -21 -35 64 -81 19 -3 -24 -66 -62 -38 -11 -15 -109 68 -115 -14 108 -38 16
6397 16 -78 -48 -42 4 -66 -25 -23 92 -194 -60 -93 -63 65 -12 95 -116 -134 -230 -18 231 64 -182 -16 56 9 -413
6423 -413 -78 -338 -240 190 27 279 -70 187 -339 -739 127 22 -568 -76 -136 331 -434 281 -9 390 150
6444 150 263 490 -224 -310 229 75 -297 171 -207 152 88 -183 44 24 49 -33 -59 -4 13 -22 29 51 92 -61
6468 -61 12 79 -1 23 22 99 25 30 8 -16 22 8 -37 39 -14 78 60 18 37 73 -51 -17 64 7 -29 28 -21 42 6 3 47
6499 47 -67 14 63 112 -92 -40 69 12 91 69 -3 -78 57 38 6 -68 -4 28 -108 -118 21 26 34 117 19 -11 -90 15
6527 15 134 4 -42 6 29 55 5 -35 -16 -72 41 54 76 27 35 66 -4 13 43 4 -99 -25 -56 54 -62 8 -8 62
6555 62 5 -5 -128 -14 2 74 156 111 -76 -118 -97 -62 -82 11 -1 123 16 17 17 -41 43 -48 -126 68 -75 146 -19
6582 -19 31 -11 -103 -48 46 44 -68 58 -113 149 1 -116 -2 -13 -42 -86 -22 12 -58 45 -12 84 82 59 -22 26 27 75
6610 75 18 84 42 65 70 27 -3 -39 -43 35 -41 91 -16 -30 24 22 -24 33 -25 -142 -21 47 -125 106 -15 -8 -50 45 -11
6639 -11 18 29 -142 4 -5 -42 -22 53 -103 -28 14 50 -37 50 98 104 40 59 8 44 -72 -69 -139 -42 -39 30 29 56 15 81 -39
6670 -39 -78 3 39 101 -100 1 55 -20 -38 -52 50 79 -21 -81 41 -53 -37 101 31 103 56 -98 -48 -1 37 43 35 -3
6698 -3 64 -41 100 44 -9 129 7 -89 -107 -98 -79 6 4 -55 -106 -56 -7 -18 -14 75 -8 86 -55 13 -18 97 98 8 92 -73
6728 -73 -57 -155 67 -48 -39 33 -29 31 -63 -53 -23 -49 -5 27 -50 -27 -50 -15 38 10 4 73 15 105 -6 -47 -15 25 -74 -91
6758 -91 -65 -15 -115 169 40 -109 -42 54 85 -11 -40 18 -50 19 -11 -136 -9 -14 -8 41 -94 31 0 63 -60 -67 -37
6785 -37 -77 -8 -161 105 37 -57 -7 29 -61 35 -16 60 -119 -31 70 -111 72 -10 -97 40 30 -149 -456 -232 -5
6810 -5 -137 -62 -19 -43 -101 56 14 64 -54 -15 -48 17 65 35 -31 26 6 101 -147 -46 75 -5 15 -8 -49 -41 13 63
6838 63 93 30 75 119 94 14 -59 -11 -74 -53 29 -92 -4 -53 -27 -68 40 37 -94 134 -69 39 42 -45 -30 -32 -7 -36 0
6867 0 73 -37 16 -20 -147 -151 19 -35 43 28 7 151 -52 -24 -30 14 -2 11 -149 -1 -20 -36 27 -9 58 47 -18 -60
6895 -60 -155 -1 -59 8 -61 26 90 -1 26 19 81 65 -30 -16 63 -100 -40 -57 67 -30 93 -72 -12 -20 18 85 3 34 -88
6924 -88 83 -57 -35 0 -30 -134 7 0 2 85 -81 -13 -12 -4 -35 -72 -32 -13 85 31 -33 -12 -11 -77 -83 -1 120 -55 9 105
6954 105 -17 12 -8 32 28 -17 44 114 6 1 33 -13 12 47 -34 -97 73 -38 10 14 18 25 -74 75 -8 -24 -56 73 -21
6983 -21 33 11 19 42 31 20 9 1 -16 9 -41 11 -23 37 -17 42 75 -54 38 153 44 12 -50 -172 32 37 30 49 -31 -3
7013 -3 -37 -83 -2 -46 -13 -1 0 -59 1 -13 -67 -95 -12 -21 92 -62 -11 -103 -77 -4 -81 -90 5 49 -117 -69 -44 -20 40 -53 101
7044 101 1 -63 40 -104 0 -31 69 5 30 -80 25 40 -2 -67 16 -26 39 -74 37 -48 -106 42 44 131 112
7069 112 -14 41 19 -7 58 38 68 22 -38 38 -136 -64 -74 49 22 9 104 62 26 36 -3 31 22 -11 29 -42 12 -39 -93
7098 -93 44 -7 147 -212 42 -42 700 -372 87 -388 -322 472 -132 92 -60 119 -44 65 -109 -35 -86 123
7120 123 -87 70 -33 4 -23 -52 -85 131 -119 12 10 -5 -20 97 -12 17 -64 -37 -44 19 -88 -81 34 -6 93 25
7146 25 -36 -35 8 25 111 16 -38 50 13 25 -34 43 -122 -113 -32 132 26 57 16 -26 85 11 19 -21 10 34 5 -68 6 41
7176 41 -85 35 -35 -75 -154 24 3 -65 -8 -21 -60 -12 -44 61 36 -124 -27 59 9 -75 3 -88 -14 -56 111 45 61
7203 61 10 -35 51 -5 -67 16 9 43 -14 40 15 -68 -59 87 -57 -30 -117 55 23 -47 -49 -11 16 0 76 -37 52 33 76 62
7233 62 100 -17 15 23 0 -48 7 8 4 1 -23 31 36 51 10 -72 47 25 161 16 50 -19 7 99 -52 4 7 -28 21 -16 29
7264 29 -51 13 -48 56 98 99 14 89 -4 -9 -25 70 -16 -77 77 -104 -75 -49 40 -169 -74 27 4 -49 0 43 -66 6
7292 6 21 -121 -100 -47 26 175 -68 24 66 91 61 130 -115 23 -53 -75 59 -38 -44 -9 -9 -1 -77 -121 -97 -7 -26 -43 -43 30
7322 30 -114 28 145 0 16 35 26 -67 34 -34 12 13 68 39 -31 -23 -86 15 -25 10 66 158 -9 -89 9 -7 56 -36
7350 -36 26 68 -21 -8 19 13 2 19 41 38 -72 -21 8 -38 186 -43 28 -41 -23 -16 82 -41 -51 73 2 22 -116 -36 -8
7379 -8 -23 -41 101 -95 -141 -49 22 -43 4 -56 -5 3 -28 -1 -33 60 37 31 -76 8 95 -218 40 19 -136 274 -65 -9
7407 -9 308 324 233 301 85 91 -63 -14 -48 -44 3 117 18 -57 48 -15 23 71 8 74 -19 -137 141 67 83 167 66 66
7435 66 -50 11 6 66 36 -43 -82 -30 -37 -20 -44 87 -68 18 102 14 -65 22 -12 83 67 -32 -12 64 92 -89 68 5 -18
7464 -18 -26 41 -11 56 -30 26 121 24 42 -1 -5 30 -59 -75 10 77 -1 -63 -9 -54 -51 -13 65 130 -28 -13 -8 -8 -13 -11 106 0
7496 0 16 -28 10 -53 30 -52 155 41 -11 -56 -11 86 -50 -8 11 -38 120 -18 -74 73 86 -30 -78 84 -35 -45
7522 -45 9 54 52 63 -87 -22 27 -16 48 -52 -7 -115 -105 27 25 48 -52 98 51 -34 -5 81 -39 -90 84 -19 -71
7549 -71 -32 -36 -55 -54 1 -22 112 -135 -74 -54 119 0 -38 -3 -3 87 63 34 11 120 -44 17 90 -86 -174 8 -17 -3
7577 -3 -7 -64 -98 108 -53 -120 -53 119 -29 -60 6 35 -40 -7 -34 -6 14 47 4 -88 -57 68 35 41 -26 -46 17 -24 -39
7606 -39 -48 74 60 -79 -96 25 144 47 -51 33 -6 38 -41 -112 -45 73 -14 39 17 -16 4 -67 -19 -41 31 -19 18 28
7634 28 -34 2 8 14 96 -45 94 -6 -114 -126 21 -7 33 -9 18 -87 -8 9 -20 59 67 -47 43 1 36 3 -12 -49
7662 -49 34 4 -122 55 75 100 13 -19 27 -49 -53 -73 62 6 60 147 95 12 -37 9 -72 11 -88 13 -13 98 -6 45
7690 45 67 -62 -53 -32 -39 -26 -10 -61 -110 -1 -81 78 -30 -60 -61 81 -73 63 10 -49 131 38 -42 -23 27 2 -8 -39
7718 -39 7 54 63 68 33 77 64 -98 25 -118 -43 -21 -25 69 -100 -39 9 -77 17 -8 -135 95 -35 23 -69 -172 -72
7745 -72 93 74 15 67 -33 57 42 53 69 13 55 -1 -55 -17 5 -25 -41 10 84 36 34 13 -61 53 -9 -31 -25 -82 36
7774 36 128 -12 11 65 -47 -39 -5 65 39 50 -5 -67 -69 17 69 105 -30 5 2 59 -39 -44 -36 -79 -18 -28 163 -7 60 4
7804 4 -10 76 77 -13 72 -14 15 -25 -10 -63 37 -30 55 63 -418 127 -14 -123 -142 20 -133 48 -177 99 -8 48
7830 48 58 -30 58 13 20 -13 199 19 14 -106 0 -22 60 -108 -27 18 68 -6 57 38 153 41 31 10 42 -10 17 62
7858 62 98 57 -9 22 -39 3 49 65 89 9 68 -23 -5 -17 19 -16 -24 16 -61 73 4 102 14 4 -128 -13 88 23 63
7887 63 42 -17 -72 78 37 -95 23 101 -111 -115 57 -78 -32 -74 -128 40 -2 -52 14 -17 19 34 -24 73 99 41 14
7914 14 45 -33 14 -55 58 81 -58 17 -53 66 72 123 -32 83 85 -27 -19 16 -10 123 26 6 36 -17 -38 -104 43 11
7942 11 60 -23 174 55 -72 -107 24 -7 -2 30 -31 -53 13 -55 -39 9 31 108 9 -29 -25 82 2 74 -24 75 56 -96
7970 -96 -64 150 -31 -59 23 -125 19 57 91 -24 -75 104 20 23 24 -62 25 -63 49 -41 48 -22 38 35 149 -38 61
7997 61 19 9 62 66 -85 -78 -65 33 15 19 -77 -54 -25 44 92 134 98 60 99 -62 -39 -34 -10 22 -20 -41 12 -27 67 16 143
8028 143 7 -31 -89 -58 -10 -21 -67 36 44 -6 -48 -6 -50 -26 -67 -14 -12 8 48 63 -93 -100 139 60 49 -38 45 18 43
8057 43 -30 -9 -102 49 69 -11 37 104 -43 27 -12 -39 -67 5 109 33 -46 -22 55 -66 -118 -3 40 -41 -73 6 28 6
8085 6 136 -50 100 0 -12 -45 -43 -13 -8 21 24 -35 -61 21 96 -64 -64 1 -85 -34 -120 4 -50 67 -69 -94 39 67
8113 67 7 -28 13 29 -37 56 96 -107 -38 106 -26 -20 -108 58 -103 -42 -16 77 -79 6 43 66 -7 29 130 -7 107
8140 107 -5 -26 27 -15 -10 -8 -18 15 -97 21 -24 -41 8 3 36 -39 -30 -1 3 38 14 63 -51 -22 -59 -24 7 43 18 -37
8170 -37 -6 35 5 22 24 -7 -60 50 -94 34 35 87 -117 144 -107 82 27 -52 57 -20 -4
8191d
$$ Imaginary data points
##PAGE= N=2
##DATA TABLE= (X++(I..I)), XYDATA
0 0 0 0 0 0 0 0 0 0 0 0 0 0 0 0 0 0 8 -8 8 -8 8 -8 16 -16 16 -24 24 -32 32 -40 48 -49 56 -64 72 -82 96 -104
38 -104 120 -130 145 -161 178 -200 221 -242 269 -297 328 -361 396 -438 482 -531 587 -651 722
57 722 -803 898 -1011 1147 -1311 1520 -1791 2160 -2699 3559 -5158 9175 -44330 -45472 40257
72 40257 70971 76156 28905 -17458 -51084 -42032 -5878 38131 53591 40636 -740 -44283 -68487
85 -68487 -55076 -21510 17841 38353 30457 2937 -24700 -36417 -17690 12945 40834 51431
97 51431 33404 -3802 -36284 -49315 -34891 -4397 25459 39441 29631 1085 -26459 -34800 -22322
110 -22322 3169 30827 41061 28070 195 -29481 -43056 -36205 -16245 9531 23980 19179
122 19179 4152 -11838 -18017 -9764 8432 26667 32773 22238 1375 -18171 -28549 -26583 -11905
135 -11905 4061 10024 7021 -3452 -13476 -14509 -7446 7505 21009 22609 15671 3263 -9330
148 -9330 -13237 -6792 4992 13974 14266 5868 -6787 -17170 -19732 -9788 6534 18101 22606 17385
162 17385 3474 -9408 -16296 -12766 -1073 9108 15236 15048 7301 -1531 -5651 -3843 2566 9457
176 9457 12884 10820 4356 -2769 -6507 -5937 -3923 -1384 106 -3116 -6357 -6370 -2423 5448 12405 16444
192 16444 15791 7890 -1876 -7582 -8070 -3505 3694 9814 10539 5240 -3181 -10214 -12190 -8955 -2183 6286
208 6286 10493 9841 6363 844 -3112 -3424 -1795 1672 3224 2791 2126 755 -128 1113 3214 4071 2733
225 2733 636 -1754 -3235 -2532 -499 2658 3615 1390 -1537 -4934 -6524 -4277 124 5762 9832 10235
241 10235 8053 3608 -1073 -3178 -2821 -982 517 1384 542 -2195 -3968 -4537 -3095 -650 981 2653
257 2653 2832 1375 810 909 1681 3059 2966 2487 894 -1496 -2745 -2644 -1324 401 1971 2464 1183 -373
275 -373 -1370 -1939 -1337 -503 333 664 -578 -1274 -976 -552 658 2061 3002 2794 1528 341 -279 44 809
294 809 1485 1678 212 -1998 -3676 -5014 -4734 -2832 -730 1653 2914 2946 2422 1034 135 464 945 1516
312 1516 1936 2153 1649 712 -324 -1077 -1733 -2341 -2942 -2412 -2008 -913 550 1452 2233 1916 492 -475 -1642
331 -1642 -1686 -465 875 2488 3533 2988 1749 -108 -1727 -2256 -2237 -1436 -329 635 972 310 -202 -987
349 -987 -1554 -1544 -1245 -283 687 1461 2272 2665 2676 1896 771 -416 -1384 -1614 -1314 -778 347 998 781 90
369 90 -1209 -2109 -2553 -2347 -1279 360 1651 2577 2651 2248 1382 377 -171 -420 -165 74 417 764 834 507
389 507 -165 -1079 -1644 -2213 -2226 -1524 -598 761 1791 2071 1966 1268 272 -433 -1011 -721 190 989 1502 1661
409 1661 1206 89 -937 -1738 -1929 -1595 -824 67 878 1434 1345 1095 188 -305 -701 -1104 -637 183 1164 1947
429 1947 1974 1828 946 -339 -1448 -1985 -1790 -1220 -580 138 514 239 -266 -972 -1260 -1517 -1058 -61 776 1676
449 1676 2285 2153 1597 613 -432 -1132 -1518 -1427 -1125 -295 182 229 175 -41 -720 -1099 -1268 -955 -196 565 1402
470 1402 1900 1764 1337 447 -498 -1017 -1191 -807 -18 505 973 1018 857 158 -271 -634 -1117 -792 -238 372
490 372 1013 1330 1277 942 -50 -586 -803 -812 -413 368 1029 1280 944 419 -395 -1188 -1919 -2109 -1723 -1275 -528
511 -528 206 489 393 -144 -773 -1375 -1435 -863 -248 386 966 1177 825 152 -601 -1143 -1535 -1801 -1297 -743 -39
532 -39 313 492 361 -152 -675 -801 -487 67 791 1406 1791 1659 1098 179 -370 -897 -1096 -776 -402 18 572
553 572 854 795 467 -20 -270 -441 -545 82 690 1215 1419 1296 868 79 -731 -920 -1097 -1048 -641 -7 401
574 401 509 609 239 -104 -798 -922 -832 -958 -610 -79 105 143 7 -136 -300 -740 -626 -314 71 293 587
595 587 796 574 -62 -531 -1030 -1504 -1512 -811 17 663 1006 1356 938 192 -302 -567 -764 -650 48 851 1279
616 1279 1233 1212 678 -452 -1356 -1648 -1444 -861 181 1510 2150 1984 1443 608 -483 -1285 -1334 -731 -66 780
636 780 1504 1734 1121 223 -491 -1167 -1421 -1184 -255 777 1055 1277 981 37 -1005 -1413 -1410 -877 -145 1101
656 1101 2146 2006 1473 473 -718 -1817 -2135 -1685 -722 189 1356 1940 1533 733 -172 -986 -1575 -1249
674 -1249 -467 657 1344 1723 1616 960 -345 -1403 -1893 -1845 -1379 -447 668 1564 1367 1208 736 -192 -585
693 -585 -735 -457 -173 334 584 551 76 -387 -678 -809 -745 -295 434 1049 1079 1078 831 232 -512 -945 -940 -1072 -763
716 -763 -221 275 470 478 474 310 -48 -260 -121 -245 -260 35 242 195 121 -99 -274 -569 -765 -665 -622 -572 -74
739 -74 625 952 1144 1070 820 249 -629 -995 -1168 -1055 -932 -447 119 624 422 730 268 -225 -601 -604 24 323
761 323 222 857 503 114 -564 -691 -1428 -1151 -715 285 1019 1089 1672 644 -203 -571 -984 -926 -820 -228
781 -228 585 1127 699 494 -330 -945 -1449 -1560 -606 411 933 1578 1672 865 162 -730 -1388 -2107 -1345 -698
801 -698 427 958 1690 1319 704 -246 -902 -897 -863 -410 430 710 1106 483 219 -498 -1389 -1198 -856 -272 298
822 298 1210 1463 1145 523 -151 -864 -1175 -1279 -762 -51 539 814 845 477 -166 -808 -972 -754 -423 243 808
843 808 1145 994 648 65 -651 -1092 -1176 -779 -522 106 682 913 723 581 199 -345 -729 -678 -405 -211 230
864 230 442 494 423 -67 -103 -484 -506 -365 -98 268 466 535 573 342 -5 -366 -651 -560 -563 -243 377 479 557 664
888 664 355 -113 -238 -594 -467 -291 -12 355 648 654 355 29 -412 -740 -808 -715 -96 578 782 1042 693 378
910 378 -78 -412 -948 -774 -363 279 440 1212 1011 501 340 -374 -485 -799 -1113 -513 503 705 402 1114
930 1114 224 -233 -182 -510 -1 -548 381 705 1043 755 400 -74 -756 -968 -933 -544 28 563 863 924 638
951 638 46 -432 -662 -717 -551 -106 425 653 794 603 269 -263 -687 -937 -844 -307 94 596 873 894 267
972 267 -151 -572 -913 -879 -677 -25 260 616 672 597 369 -83 -542 -630 -651 -377 254 526 828 702 308 -194
994 -194 -630 -829 -815 -470 -66 671 666 701 592 258 -252 -513 -761 -681 -213 169 577 717 685 379 -213 -533
1016 -533 -804 -642 -336 15 647 769 720 501 94 -453 -822 -848 -595 -169 379 746 799 589 96 -474 -782
1037 -782 -953 -767 -440 140 394 626 534 195 -90 -557 -688 -766 -368 75 609 805 811 546 -19 -449 -744
1058 -744 -798 -625 -157 132 479 613 417 154 -344 -564 -633 -526 -126 115 438 730 546 420 -44 -398 -472
1079 -472 -582 -272 -2 458 538 599 370 1 -216 -613 -690 -504 -194 190 630 698 582 409 47 -270 -545
1100 -545 -506 -331 -164 194 596 500 205 -67 -314 -559 -588 -485 -142 244 420 555 476 274 -41 -444 -605
1121 -605 -540 -441 -122 309 465 566 393 84 -205 -505 -502 -376 -61 177 453 532 325 181 -302 -409 -594 -462
1143 -462 -182 73 469 724 723 328 11 -331 -636 -661 -487 -163 341 587 570 518 56 -353 -575 -583 -487 -46 455
1166 455 621 740 526 347 -138 -548 -752 -627 -298 124 371 621 618 340 124 -412 -698 -512 -166 38 429
1187 429 583 567 423 -51 -282 -496 -692 -470 -187 214 574 617 494 154 -211 -645 -601 -556 -274 154 345
1208 345 624 481 333 184 -275 -417 -510 -514 -48 294 402 641 375 164 -92 -449 -633 -530 -190 34 331
1229 331 519 525 268 10 -302 -478 -483 -339 -7 257 442 518 318 172 -221 -390 -365 -402 -175 253 399 482 374
1252 374 147 -195 -345 -451 -364 -162 83 444 499 514 250 17 -323 -388 -525 -416 5 240 406 575 422
1273 422 245 -209 -399 -405 -453 -268 25 218 503 442 335 79 -187 -430 -512 -325 -39 349 333 470 281 47
1295 47 -213 -306 -425 -256 -209 6 431 434 448 264 -196 -309 -400 -502 -201 83 210 429 379 222 87 -184 -332
1318 -332 -408 -429 -12 164 392 416 424 155 -38 -298 -383 -392 -255 60 334 374 405 234 61 -60 -421 -369 -267 -121
1342 -121 10 301 508 261 209 -80 -320 -405 -481 -124 46 200 472 462 360 -32 -268 -325 -246 -246 -113 35 294
1365 294 435 356 -92 -148 -311 -304 -251 -51 164 388 464 368 55 -73 -307 -432 -396 -256 -7 221 463 499 273
1388 273 28 -173 -423 -446 -408 -93 210 366 524 292 152 -108 -364 -462 -405 -162 88 356 402 339 69 39
1410 39 -382 -384 -413 -316 -76 181 443 342 268 97 -157 -374 -349 -134 106 323 339 335 186 148 -244 -316 -405 -330 -193
1435 -193 38 313 413 199 162 -35 -218 -369 -338 -154 36 149 281 358 224 4 -160 -196 -230 -272 -135 133
1457 133 383 441 308 210 -139 -145 -298 -379 -178 98 195 349 263 350 9 -162 -153 -286 -261 -53 49 144 359 202
1481 202 184 -78 -236 -342 -264 -160 88 217 311 437 245 95 -215 -275 -369 -284 -164 145 265 353 340 147 -166
1504 -166 -160 -343 -168 -179 87 263 317 468 262 -49 -192 -209 -367 -227 -51 157 247 299 336 116 -104 -394 -421
1527 -421 -345 -112 82 179 390 297 148 -99 -124 -307 -307 -125 96 284 416 468 188 -72 -220 -339 -443 -379 -126
1550 -126 42 257 436 260 112 -19 -310 -250 -284 -205 129 128 345 349 150 -5 -217 -353 -376 -249 -111 180 183
1573 183 310 268 118 -273 -326 -359 -266 -94 -294 -30 350 285 199 -21 -151 -81 -269 -232 -156 108 333 157 130
1596 130 82 -108 -368 -325 -190 -159 44 240 420 251 158 -61 -180 -301 -260 -161 9 98 209 350 82 25 -141
1619 -141 -383 -240 -284 -106 138 269 224 300 197 -28 -112 -215 -110 -68 73 179 258 230 220 -103 -205 -355 -372
1642 -372 -260 -139 89 161 356 147 114 -121 -184 -282 -152 -9 102 295 225 194 137 -33 -227 -225 -196 -266 -33 106
1666 106 185 285 266 55 -130 -189 -120 47 -83 203 246 357 115 42 -79 -230 -245 -304 -207 -85 241 209 189 142
1690 142 -10 -173 -195 -167 -131 104 276 225 340 163 120 38 -204 -157 -222 -64 -90 129 182 225 109 -134 -151 -303
1714 -303 -326 -93 88 238 259 387 374 113 -25 -78 -196 -44 27 31 121 101 27 -23 -100 -250 -265 -224 -197 9 180
1739 180 259 271 170 0 -32 118 -113 -233 54 173 251 331 54 -15 -228 -371 -312 -332 -96 97 143 237 310 129
1763 129 29 110 -90 -136 -94 156 192 247 181 253 15 -119 -248 -265 -280 -117 -6 188 153 18 33 -110 -182 -127
1787 -127 -104 -59 211 189 294 328 201 58 -94 -327 -231 -243 -31 40 88 116 97 19 -21 -261 -250 -59 7 157 280
1812 280 178 241 223 27 -12 -253 -98 -177 -76 -83 14 64 -20 -89 -162 -229 -256 -190 -1 56 220 156 221 133 102 -18
1838 -18 -203 29 -101 -43 97 110 47 38 0 -215 -315 -234 -258 -118 121 212 225 152 177 5 -150 -16 -194 27
1862 27 59 104 215 98 121 43 -66 -231 -157 -298 -151 -15 130 240 140 160 -4 -142 -152 -90 -29 136 215 255
1886 255 217 173 -10 -108 -241 -224 -255 -87 35 13 52 -4 -17 -66 -111 -169 -140 54 228 284 270 228 214 7 -126 -215
1912 -215 -183 -118 -163 -33 61 132 -63 -27 161 327 -391 57 -41 242 351 248 279 105 -99 32 -63 -77 -29 -20
1936 -20 51 169 86 14 -82 -175 -267 -195 -286 16 159 183 239 199 229 -24 61 45 -118 42 81 135 78 167 18 -127
1962 -127 -132 -297 -288 -187 -67 62 213 153 132 205 78 -15 -34 32 -41 149 125 186 58 12 -197 -218 -251 -144 -112 -54
1988 -54 39 99 129 19 -74 -9 -177 -162 56 35 146 253 266 192 61 -216 -159 -158 -194 -179 -64 43 105 51 -69 -88
2014 -88 -90 -168 -125 -74 148 117 278 229 88 81 43 -96 -124 -180 -32 30 -36 153 -65 1 -151 -250 -233 -187 -107 22 139
2041 139 187 211 199 165 -30 -55 -43 -38 22 -50 0 55 73 75 -88 -244 -176 -163 -103 -42 8 124 145 35 62 -97 21
2068 21 -63 -212 37 61 195 80 64 -97 -112 -211 -201 -255 -120 -62 2 67 198 99 88 103 -33 -62 87 58 116 272
2094 272 84 -60 115 -168 -136 -142 -182 -165 -81 -2 108 85 14 -107 -82 -92 -85 31 170 132 54 67 71 -25 -5 -118 -48
2121 -48 -101 -67 62 80 15 99 -81 -28 -55 -172 -172 -38 131 125 147 226 160 -29 -70 -33 -103 -131 -42 40 105 57 -15 -25
2149 -25 -127 -53 -55 -16 -19 24 141 124 96 52 -90 -106 -107 -94 -61 15 112 94 153 39 -11 -141 -234 -196 -108 -156 127 225 228
2178 228 183 -14 63 -81 -76 -176 -56 5 116 118 171 79 -12 -134 -210 -178 -139 49 111 9 150 89 44 8 -164 -156
2204 -156 40 -112 -8 107 299 44 44 -10 -54 -124 -155 -52 -13 117 206 6 77 -106 -41 -189 -92 122 -25 127
2228 127 130 151 74 -68 -103 -152 -4 -66 -43 21 34 21 112 63 52 -78 -187 -61 -54 -16 158 87 163 105 7 -51 28 -52
2256 -52 -3 -41 -30 -3 130 -3 -26 -28 -64 -173 -3 -129 -127 80 49 40 -12 130 -1 -98 -88 38 -79 143 131 67
2282 67 126 -41 -89 -86 -102 -50 -85 -65 122 192 33 21 14 -79 -152 -23 -55 -28 101 87 127 123 153 -35 -137 -269 -121
2309 -121 -48 -51 60 180 75 19 34 -54 -123 -75 1 89 -1 129 165 274 -82 134 -376 318 8 -157 100 91 218
2334 218 73 9 -113 -65 -104 -30 -5 79 -88 115 55 98 119 5 -150 -155 12 92 -6 -22 112 51 15 -40 -46 -101 -164
2361 -164 -7 -12 155 128 26 20 93 -116 -87 -92 -8 -34 16 147 48 44 -31 -100 -79 -74 -155 -16 -5 81 196 111 128 -94
2389 -94 -100 -5 -4 -24 66 80 48 -11 93 6 -64 -193 -191 -8 -35 147 29 241 21 1 -76 -108 -123 -28 96 24 82 40
2417 40 163 118 50 -163 -237 -129 -46 -44 16 124 109 78 -64 -32 25 -127 90 -25 -92 36 41 51 56 39 -55 -134 -257
2444 -257 -9 -95 90 51 107 1 -101 -62 -143 -131 -122 -49 15 149 88 41 46 -6 -3 -13 -70 40 -5 126 32 32 -20 24
2472 24 -120 -49 -17 -75 -8 89 95 93 85 20 68 -36 -82 -73 -85 8 29 210 -128 -76 -197 -291 -341 -875 113 -120 250 -37
2500 -37 144 146 -37 -42 41 -102 -65 -101 -23 47 102 59 -61 -18 -89 -90 -16 -185 32 -47 155 130 81 113 -143 -8 -10 -85
2528 -85 92 55 61 101 -74 44 14 -99 -85 -161 -58 -57 -15 70 33 107 26 -120 7 -60 -53 49 126 -375 -110 156
2554 156 -435 -165 31 -39 22 -36 -103 76 75 97 83 37 -49 28 -14 -68 -32 17 -48 39 86 53 -93 -109 -95 -59 42
2581 42 76 64 -5 89 25 -23 -163 -63 -88 -71 68 12 75 124 60 67 -71 -72 -69 -78 86 -26 -14 66 104 44 18 15 -5 -60
2611 -60 -7 12 -19 100 102 36 -47 -5 -83 5 16 40 3 53 -12 15 -57 -54 21 -86 -47 -66 40 -8 92 129 -5 72 41
2640 41 93 -44 -61 -77 -12 -4 32 56 -35 -22 -137 -80 -50 -120 99 -38 15 34 -38 39 -85 40 -81 24 28 -42 56
2667 56 142 85 33 83 -11 -44 80 70 185 13 85 -48 -31 -3 -96 -157 -85 132 60 56 135 80 63 -59 -85 -58 -132 -79
2695 -79 7 15 22 4 -13 -63 -40 19 -29 -84 -61 165 -6 -44 5 81 15 -11 -173 -167 -26 108 54 33 -17 -45 83 -35
2723 -35 47 -153 -151 -154 1 60 22 -32 -29 92 -144 -40 -107 -100 -149 34 109 66 34 -18 -88 -72 -105 -140 -76 -33 155 79 30
2752 30 15 64 -87 14 -84 -36 54 66 14 68 2 -63 5 -37 50 82 7 162 53 156 42 63 93 -75 -47 -117 8
2779 8 -67 61 24 31 186 -42 13 -623 155 375 -82 72 -20 116 13 4 -71 -93 -64 -137 -7 39 163 103 148 23
2805 23 14 -17 -66 -64 -35 -63 -14 36 -34 23 -68 172 30 72 111 -18 112 12 -67 89 23 -16 -68 -3 -153 -31 -157
2832 -157 30 109 -7 34 21 -116 -117 -129 -70 -31 162 58 -70 -33 23 -107 30 -81 -20 -21 50 -119 105 29 98
2857 98 -37 29 -138 -9 -54 58 68 98 0 73 124 -19 -159 -459 71 -96 92 51 -87 59 53 55 -102 -135 -24
2882 -24 -47 -107 4 135 94 -25 -21 21 -57 12 -125 36 -53 128 38 -27 84 92 -4 -11 -53 -13 -51 100 -17 40 143
2909 143 -49 -39 -25 18 -78 20 -14 13 184 -20 21 -26 -28 -16 8 11 65 100 62 174 -10 26 -74 -83 -67 13 36 51
2937 51 -31 -9 102 16 34 -25 15 -36 214 -88 23 22 -27 45 -34 40 -103 -61 36 41 -17 52 29 -39 14 -66 -40 -16 12
2966 12 116 -75 -31 22 -21 123 -53 17 43 10 71 42 31 21 -34 151 12 13 -44 -80 -27 -56 39 -21 93 -26 8
2993 8 -21 -92 -92 -94 -120 13 12 103 4 -78 -37 -64 -56 -27 6 -33 93 81 -7 59 11 -38 -74 77 -102 -79 126 71 37 5
3023 5 7 -114 -130 -26 4 26 80 89 88 72 -54 12 -4 6 -60 -57 18 68 8 27 2 -8 86 16 15 -43 65 -25 90 20 74
3054 74 -17 -13 -282 -187 -260 36 -408 -464 535 -226 514 212 -210 -286 402 63 210 -45 58 -126 172 -67 69
3077 69 -82 85 -89 31 40 264 -46 75 3 102 -9 -107 -22 -19 46 -5 24 56 67 4 123 37 11 76 11 -93
3103 -93 16 117 45 111 59 -57 -59 44 -48 -60 -16 127 100 78 3 -102 -39 3 -49 -45 47 25 -51 78 6 -37 15 -42
3131 -42 -70 -142 21 -63 -7 24 -93 -97 -28 -10 -72 -5 -33 134 82 63 23 -89 -15 -31 -40 -62 -27 -54 65 25 68 -13 27
3160 27 96 -10 -18 -6 60 -15 -15 -100 127 59 -39 7 17 -85 45 -16 -9 70 -40 12 62 -13 -41 -171 43 -15 -70 -17
3188 -17 19 -61 114 -54 54 35 -169 131 -13 -31 -11 53 -5 -42 -50 49 -90 -46 -49 -65 -42 -4 48 -20 -77 45 96
3215 96 -80 29 -18 35 97 58 -33 -29 -13 -174 -21 65 39 101 37 101 93 -69 32 -81 -98 -68 -78 60 61 -48 -6
3242 -6 81 30 -6 -69 15 -50 -13 -88 103 18 -54 22 -41 7 -97 39 42 7 -28 85 76 13 -56 30 -172 -162 -310 -47
3270 -47 689 236 -67 -504 -109 -456 -221 -6 81 -189 -166 61 -117 3 -59 84 -88 -68 -38 -43 14 -36 48 -15
3294 -15 -45 78 -19 43 -27 -109 -95 42 -4 -64 -26 -1 -63 -47 72 -144 49 11 -28 42 57 28 124 -30 -59 -94 -10
3321 -10 -21 -26 13 -86 68 83 -46 14 23 19 -81 -39 80 -40 -43 -29 72 -52 8 -160 102 40 2 -66 32 -118 -96
3348 -96 12 -2 -33 2 -86 128 107 9 47 78 69 -33 -26 73 -69 4 31 31 -76 20 48 19 38 17 -26 -21 -13 73 7 51
3378 51 78 83 70 -20 -61 22 1 -7 13 17 45 13 -103 -66 -64 -115 -80 -13 -37 90 4 4 -13 -110 -12 23 -70 77 5 104 -2
3409 -2 3 -25 -75 -41 -144 -147 -161 -178 13 -45 160 -35 -13 -58 136 -7 -80 44 -32 -51 -8 -26 85 42 -47 54 -43
3436 -43 -13 -57 -2 -3 4 -73 20 -57 13 24 -66 126 125 51 65 -8 28 -6 -14 -58 37 -20 29 -35 -70 -12 -59 -7 -66 -138 -42 37
3468 37 -5 -58 -35 145 -80 -70 -69 -78 1 -7 -43 49 11 54 -19 20 -11 27 4 -79 46 114 0 -10 34 -12 -7 16 24 -67 48
3499 48 -103 13 -50 51 -27 -66 -25 31 -111 -73 4 71 54 8 14 -14 -119 69 -54 44 -28 67 39 55 19 180 94
3526 94 84 -19 -18 -41 -88 113 111 -50 -142 280 -73 -21 122 -244 -17 172 -442 373 -135 -454 -172 -260 -403 -114
3550 -114 438 682 35 -98 22 -495 -350 6 323 543 175 -427 412 94 -254 -118 66 168 -292 -96
3570 -96 29 -150 167 198 184 250 326 -506 251 713 -469 -1078 113 279 59 -176 385 72 66 338 58 162
3592 162 -262 -26 280 -96 -158 66 108 58 -61 21 -277 -441 -37 -65 924 900 -1494 124 176 -204 53 70
3614 70 -290 142 -99 -208 -123 -238 -61 -79 -32 45 -71 -39 -158 -180 142 104 -32 -43 47 -13 4 104 -58 -10
3638 -10 127 14 -11 -43 -10 27 -6 42 -29 78 37 59 26 -36 -89 -125 -20 2 88 82 52 -30 -5 7 -21 -11 -76 4 -21
3667 -21 -3 -27 43 -48 -57 32 -124 40 59 -18 -111 -48 -65 58 -59 -144 -1 100 -58 67 -117 -9 -7 -35 -84 -77 -21
3694 -21 -24 -48 4 -17 -55 67 11 -19 -119 -57 -50 -40 -10 34 149 6 12 51 18 -105 -47 -17 -108 -18 32 59 89 60 -119
3723 -119 -63 26 -69 -39 -61 4 43 28 3 22 6 77 -161 -60 32 67 -7 22 73 78 30 -24 3 60 -166 -3 -55 94
3751 94 9 0 -15 -29 -124 -157 -4 -91 31 -39 12 5 -20 -55 -32 -20 -38 80 49 136 23 74 18 -130 35 -22 51 39
3779 39 -27 69 24 44 -14 46 -44 -48 -55 25 -80 -52 3 54 6 49 103 -13 -72 108 -60 -34 124 143 50 12 -40 22 55
3808 55 -28 -78 -16 -81 -153 -28 0 87 8 -77 6 53 53 44 19 1 -19 23 -35 -61 -2 3 -52 60 -31 -41 133 -35 -17 -65
3838 -65 -17 -18 -18 -30 29 -32 -5 35 -33 -9 2 -12 5 -115 -65 40 75 40 126 -32 -6 64 -50 -14 -17 -73 -57 -15 125
3867 125 149 17 -39 -53 36 -157 25 47 -17 74 -14 -46 95 -4 -13 -32 -35 113 35 123 -23 3 -28 -19 17 -64 3 2 28
3896 28 9 -20 17 78 -31 -45 0 -83 -205 7 12 66 19 -23 -5 114 -15 -50 79 -4 -38 124 152 -12 48 -87
3922 -87 -163 -18 -7 13 -28 43 117 -56 -41 -18 -63 -31 -36 -69 51 10 118 -26 62 -22 -9 -125 -33 8 -35 53 26 54
3950 54 4 42 19 -28 -18 -63 5 25 -129 82 19 90 18 -74 -35 -106 23 -62 -56 -43 105 67 3 47 16 81 39 27 66
3979 66 85 -67 2 -37 -2 -54 -79 -99 -1 15 38 -23 -87 90 45 -9 -71 -41 -72 -65 62 52 13 39 46 -63 -152 -40 -92
4008 -92 1 -81 38 21 39 -12 97 -30 61 4 25 3 -121 19 -29 115 60 34 -3 -28 -239 29 79 -37 107
4033 107 -4 37 38 -34 -88 -24 -10 -14 -3 38 29 -34 -22 97 -10 2 -80 -19 44 -27 58 25 5 -31 28 -115 -66 70 16
4062 16 -17 50 90 -4 31 -68 75 -71 -96 80 80 -73 29 -52 78 -93 3 -173 25 -65 116 -145 71 34 31
4087 31 -463 -72 53 -6 -14 -136 2 -56 20 54 -66 -108 -20 26 -1 -21 48 40 -5 106 22 47 49 -104 79 35 -16
4114 -16 39 63 117 51 13 24 -123 118 -60 -32 22 59 102 16 157 20 -22 24 -35 -98 -86 94 -29 9 -18 -114 -101
4141 -101 -188 -18 -28 107 25 11 80 63 115 28 -3 13 23 -28 -95 108 86 80 26 59 -98 20 -95 -97 46 8 73
4168 73 -75 48 89 76 -173 -2 6 25 101 -12 55 -1 21 -60 -19 -2 46 -10 -13 101 12 57 84 -2 23 -76 -74 -12 41
4197 41 10 193 -48 104 2 63 -9 -43 -134 -66 51 37 -28 59 18 -23 41 57 -64 -21 -5 9 -18 13 20 -23 -24 -81
4225 -81 -33 -26 -49 -12 -98 124 -33 -114 -45 -5 -79 22 56 12 50 -5 295 113 1 -2 -17 42 17 -7 45 34 49 90
4253 90 21 -27 56 -41 81 -67 -29 57 -9 -61 70 14 -2 -71 -66 -141 -74 44 -2 -26 92 -143 -24 -33 27 -83 57
4280 57 -31 65 -34 71 -26 -87 -41 -34 -25 40 26 27 50 74 -7 96 -58 -94 -22 -57 -96 -33 36 -76 -69 85 210 7 -46
4309 -46 -39 42 -21 30 46 20 5 0 36 -18 17 14 -55 20 126 136 -26 -19 -38 55 -13 51 73 60 23 46 66 14 -53 -43 -129
4340 -129 -60 6 8 -1 -28 98 -17 114 18 2 -57 4 -1 -55 61 -46 -35 -128 -25 -69 28 -18 61 11 22 -63 -2 13
4368 13 11 -59 -16 -100 -6 -32 113 -24 -98 -2 -33 31 -1 -116 -88 -32 45 -23 -76 17 82 -101 33 -58 -27 -92 17 51
4396 51 -45 -20 66 4 10 17 -34 31 15 -61 -56 43 17 -2 -80 -17 98 10 -32 75 -3 106 125 67 63 21 -119 -82 91 -21
4426 -21 4 -16 76 -25 -77 4 -13 161 -77 -52 19 48 -15 74 -30 36 -139 -2 -20 -1 -64 -16 51 98 0 -35 -39 113
4454 113 6 6 -58 56 50 72 -51 -119 93 -29 -14 101 -20 -40 -35 -53 -33 -3 -25 -14 -93 -74 1 154 39 -8 -83
4481 -83 39 -45 46 39 -31 -1 -62 -35 9 104 -10 36 -20 38 43 59 -13 11 144 49 75 91 69 -79 1 -4 -34 12 94 52
4511 52 -96 46 41 -35 -114 -62 -76 -106 96 128 16 90 54 -26 -55 23 -28 2 106 59 18 49 -3 38 12 -20 44 59
4539 59 48 58 4 -12 -34 110 -67 -147 -43 47 -20 -43 80 50 -13 59 147 5 -49 -64 -43 -97 65 -24 -60 40 -37
4566 -37 19 -88 -138 -49 88 -27 13 45 -41 56 20 20 -142 30 70 54 -21 58 38 -51 47 -25 -61 54 9 4 24 40
4594 40 2 103 86 -79 -90 -22 -7 -4 66 33 -104 62 27 2 -29 14 -45 -44 -12 13 75 75 96 21 -9 9 -47 -8 23 -20
4624 -20 22 8 54 -12 -42 6 -15 -112 -22 58 -160 -31 61 1 -102 0 -20 43 66 -43 68 -28 39 50 49 -11 45 -13
4652 -13 21 8 -39 102 156 121 66 129 -6 11 -97 -72 -79 71 28 -32 97 20 46 -22 -63 -64 -78 1 33 38 51 101 -9
4681 -9 18 11 -39 -95 32 39 105 0 -34 -67 -9 -16 -43 -57 -50 82 91 62 64 -14 64 -33 -58 58 -101 164 -42 94 67 39
4711 39 19 -49 -50 -135 15 -13 3 -22 7 75 -46 -9 -73 40 125 -10 -30 102 1 -14 96 -8 -100 -107 -70 -94 -109
4738 -109 6 -33 72 33 36 -24 -60 -55 29 76 74 140 91 -87 69 1 -119 31 -55 -60 25 105 80 -25 -23 -71 -45 15 44
4767 44 -54 -3 -9 -55 63 55 70 34 65 2 -108 98 41 25 88 -21 13 36 -50 -18 -28 78 52 36 4 30 57 43 57
4796 57 18 -51 -60 50 162 41 -1 -11 -6 -47 -85 -87 36 -4 93 -70 103 -8 -101 21 -79 -80 42 42 139 -41 15
4823 15 -7 80 41 32 15 -33 -51 7 20 149 0 38 29 -110 13 50 6 50 -12 73 0 -40 -26 130 59 -145 -26 -93
4851 -93 -17 -43 -73 74 -8 58 -105 -12 15 -51 -67 45 59 50 41 108 136 52 37 -21 53 -11 35 32 81 49 -49 93 -20
4880 -20 -25 48 -59 37 -25 17 48 -105 90 9 -36 -52 -103 -35 -66 67 25 49 -10 -40 -77 34 20 -63 26 59 92 103
4908 103 -45 48 19 -34 76 -26 26 -22 45 46 31 -14 -41 2 43 -33 -137 -58 88 39 77 -3 -18 -101 0 -2 22 -24
4936 -24 9 28 54 -41 77 -82 -54 -134 -5 -6 -38 -35 94 46 4 -68 -104 -96 -48 46 9 16 61 43 9 20 25 -41 -35 -4 56
4967 56 127 20 15 32 -73 -83 -39 -99 55 -18 -73 68 106 -43 -4 35 -72 -148 -65 -25 81 -64 -40 -2 -67 -140 -51
4994 -51 -111 131 -28 -24 -13 105 -27 -31 -78 -34 15 68 39 -15 21 62 121 45 -13 -64 7 23 64 -98 18 55 119 43
5022 43 -25 31 36 -41 -59 7 -56 -29 95 0 58 -12 -38 -15 32 -21 39 101 37 102 96 2 80 149 95 -80 -37 -18 40 -10
5052 -10 5 35 -16 -12 -85 31 98 51 -13 11 -47 134 36 42 29 -63 -18 75 28 147 34 55 25 -15 52 -71 14 -14 -66
5081 -66 -69 71 136 52 -7 -54 -23 -59 72 98 -6 128 61 -73 -1 -19 60 -42 36 38 -74 32 123 55 -36 -133 8
5108 8 -36 -144 -23 83 -42 55 30 65 11 4 74 41 -93 -65 -4 -37 7 56 6 -11 -45 -31 2 -53 17 107 36 26 19
5137 19 26 8 -14 2 -54 -62 59 -42 10 7 8 42 -124 -92 29 -29 30 71 117 -23 -13 15 -78 66 26 -84 42 6
5165 6 122 53 151 41 -50 -68 -21 58 -77 -69 46 147 26 40 -53 -93 -50 -47 -118 -54 96 53 71 54 -1 -29 27 43
5193 43 -14 109 59 36 36 -19 -54 -24 -125 -78 -5 -5 137 51 55 82 -12 -124 50 -46 -22 -123 6 80 35 -30 22 45
5221 45 21 43 -62 -10 14 80 -1 -6 117 43 -50 56 -50 -43 100 70 46 -67 66 11 -23 -76 -10 -123 58 126 38
5248 38 40 -90 146 -8 -26 70 -54 1 154 -25 -61 -65 -110 -192 59 -10 -86 -83 -42 -80 164 63 19 43 112 -1 -105
5275 -105 -124 -82 20 -15 50 -17 95 -6 -51 25 -27 -17 42 -61 -78 67 132 -38 7 13 -24 15 61 -71 -49 63
5301 63 75 89 -50 -27 31 71 -23 78 -25 60 35 -119 13 -29 -53 -23 -99 -40 64 22 19 -61 83 -59 -65 -62 -96 67
5329 67 -80 139 69 100 76 50 -72 -97 -24 14 -9 23 61 14 -11 121 14 -56 -18 4 -91 36 -7 -29 60 -25 -51
5356 -51 -64 -128 16 41 162 7 41 69 -16 109 -41 56 16 -22 22 38 42 33 75 -7 33 85 -121 -18 -8 -81 88
5383 88 109 3 -45 42 -17 -39 -100 -48 -28 109 25 10 73 166 81 64 -74 -134 155 339 185 -21 38 103 18 -23 15
5410 15 -95 100 55 -2 45 264 -166 -25 -77 45 1 91 -18 68 -66 142 98 98 35 -30 67 -34 -91 -45 43 -52
5436 -52 47 -37 -126 -41 -6 -66 25 34 132 68 -62 67 -26 -122 -79 -31 -43 3 34 84 68 -5 -18 71 -24 0 -129 -168 101
5465 101 117 110 12 49 103 42 -112 -64 -80 20 34 96 17 21 37 20 -52 -9 17 26 -70 -62 120 -37 99 -44 -48 -90 -20
5494 -20 -112 61 -5 -26 77 91 -38 99 114 41 42 -88 13 26 -98 1 93 -5 -37 -120 -27 -26 -48 111 -3 104
5520 104 101 -92 30 6 0 1 -95 58 -19 -110 99 -49 -18 18 -92 19 -30 29 82 36 -32 -65 -110 -10 3 -5 13 -46
5548 -46 108 83 80 11 87 -56 -24 10 106 41 -36 55 42 25 35 3 2 -61 20 47 -56 190 92 -59 85 -87 -108 -41
5576 -41 -105 40 -74 72 84 6 61 83 -7 -4 -44 0 65 47 -47 89 197 -42 40 -55 -60 -49 -30 6 23 -22 137 -3
5604 -3 -67 -85 -15 -33 57 -90 -47 -25 65 76 -25 -9 12 -24 -76 -133 -76 17 84 1 18 67 -107 -108 -63 -98 12 67 102
5633 102 -34 -45 -35 -39 1 -139 -21 131 55 10 98 -27 1 93 70 -53 -154 -140 -49 -42 18 84 107 41 64 45 -37
5660 -37 -56 -8 22 -27 37 -55 117 62 64 30 -112 -12 -93 12 5 -57 115 3 25 13 -93 58 0 -170 4 175
5686 175 13 14 5 -10 35 20 -37 163 39 -15 -53 83 -10 -17 -18 -15 339 13 -89 194 48 74 42 -9 52 56 -45 74
5714 74 72 -5 92 -13 19 19 29 0 32 -89 -53 32 95 -69 -3 -132 61 14 48 -10 -99 20 -111 74 18 67 -101
5741 -101 -4 0 -52 4 67 30 23 13 44 105 -33 43 -24 7 84 86 96 30 105 -12 103 32 42 28 -96 -31 86 -27
5769 -27 14 -46 10 -61 -51 -22 -115 123 12 83 54 27 -29 -26 25 -10 -122 -45 54 45 -33 18 -89 89 24 -10 -98 25
5797 25 30 33 -36 -3 59 27 -6 -44 -10 94 19 98 36 71 106 -59 5 -69 96 -16 -13 10 73 -14 60 32 94 -84 -22
5826 -22 -29 44 54 -46 58 12 -115 -39 46 -5 -19 123 34 92 122 123 38 -33 -36 48 39 -84 -13 3 190 84 62 140 -12
5855 -12 -41 -70 -11 -48 -99 62 -44 8 -61 4 -85 -30 -8 -108 -41 0 83 -58 27 -18 78 26 53 43 4 30 100 120
5883 120 99 9 69 -39 90 -9 -45 -36 -20 57 33 30 94 25 -6 3 39 45 38 -91 48 -33 34 -9 88 -58 -84 -22 10 139
5913 139 39 67 55 -38 -133 -18 28 87 -15 90 46 45 16 3 -79 7 33 2 42 86 121 17 25 39 -30 -20 -38 -38 -12
5942 -12 -71 -18 -58 15 95 -44 -70 40 29 -12 -110 -75 23 68 -64 53 -75 -21 104 -9 -13 15 -40 35 -36 -19 23
5969 23 84 90 18 -15 -115 129 31 -40 37 55 -125 73 34 4 17 20 92 -32 0 45 -87 -9 -19 -79 -40 32 -14 -161
5997 -161 -11 -12 27 -32 -50 -66 -91 1 51 11 -52 -92 17 8 3 -15 -11 -22 122 20 26 205 2 -35 -51 85 -37 -9
6025 -9 16 37 122 -62 -2 -10 -91 -48 19 -9 -55 -74 141 178 -35 15 68 5 89 -132 23 140 -44 74 87 0 0 -67
6053 -67 2 -1 53 51 87 -31 -61 61 19 -84 112 126 -29 9 12 2 57 113 88 -26 11 -34 -92 -134 -825 -106 43
6080 43 95 18 -18 -106 4 -117 78 41 150 -20 -35 152 -34 34 30 51 24 91 37 73 14 -20 191 -75 46 39
6106 39 2 40 73 31 -31 68 28 -37 -42 6 -19 -14 -6 -37 102 13 -15 145 -47 21 64 23 38 -21 -22 30 -19 81 21 -265
6136 -265 209 -4 39 178 -471 120 -36 33 -17 -41 8 43 -229 60 -23 148 -13 -40 -148 40 -31 -61 11 -37
6160 -37 -14 -29 7 13 42 -68 34 -36 -8 -39 -76 -9 107 76 -13 85 22 69 43 -47 42 -85 -50 82 3 29 38 13 79
6189 79 104 -71 11 -19 -69 -15 88 62 -38 -98 -104 -23 -48 8 -88 79 43 70 10 -5 105 -28 19 36 -11 8 62 37
6217 37 -18 7 -18 -55 24 62 -35 -51 10 5 3 -8 7 103 -58 -89 -10 32 98 -132 -32 41 -49 39 -91 -96 -68 48 6
6246 6 -10 56 -100 90 11 36 84 -26 17 52 46 14 -102 12 110 79 -30 14 48 -25 23 -29 10 46 -13 -37 -73 -8
6274 -8 -37 55 -47 27 -2 94 -132 -15 -101 -36 -71 -4 46 -15 47 65 45 -87 3 13 -4 -45 -97 26 -26 60 31 38 -20
6303 -20 -35 -40 54 77 47 72 -27 87 89 47 -56 31 14 57 -27 -103 -23 21 -4 -40 34 65 89 -45 -9 34 48 -18 139
6332 139 20 15 -110 31 29 -8 -34 -107 55 116 -11 -22 116 -39 -81 -45 28 100 37 -30 27 -11 -56 -45 -20 -157 38
6359 38 21 -4 52 53 -72 -27 -35 3 54 -11 157 38 24 19 25 35 20 20 -15 19 47 34 -58 62 -89 124 2 23 -23
6388 -23 -33 2 -63 -56 -42 139 75 24 -54 -40 -160 6 -37 41 115 0 -44 142 106 -56 46 -17 -25 62 -64 170 38
6415 38 71 118 2 -542 70 20 69 253 96 -104 321 120 -373 -264 -48 315 -291 322 -393 -554 -251 483
6437 483 -342 -286 238 224 75 194 114 -579 822 26 -877 -1053 34 213 81 38 48 -151 -124 13 -31 -50
6459 -50 -1 37 57 -38 13 23 -51 -27 -10 -94 -53 45 21 51 -12 49 48 79 150 -22 109 44 12 -92 -91 19 66 8 -68
6488 -68 -33 31 90 13 -3 45 2 25 -6 13 -7 -28 107 -66 -47 35 70 3 176 64 71 -5 46 9 50 -23 -31 -2 153
6517 153 143 -38 12 -66 -65 -123 29 65 -24 -96 -26 2 61 61 7 101 -48 -72 -15 29 70 85 -4 -100 -9 -69 61 31 -1
6546 -1 36 -37 -31 17 133 50 -17 -88 10 23 12 -25 -38 -13 41 6 43 35 140 -1 26 22 -52 98 10 23 -72 -33 -79 -88 -53
6577 -53 -16 -49 -46 8 -15 107 39 44 -125 -42 -35 50 52 30 38 -75 37 65 -35 24 129 12 5 88 20 126 0 69 13
6606 13 -93 69 -13 -61 19 18 -81 11 -86 54 -78 -18 61 -50 19 -27 -53 8 -9 -56 39 -76 53 19 121 60 45
6633 45 1 123 -31 -142 5 39 -31 45 24 27 -35 42 -49 2 -17 25 -48 -1 -35 -143 5 -64 -68 0 -11 35 68 5
6661 5 -9 25 -45 -6 -51 11 71 -8 -18 77 14 57 17 118 57 -44 -27 62 54 33 19 -13 36 5 -53 -28 90 -6 -86 162
6691 162 32 52 63 -120 -66 88 101 3 -176 -85 164 33 -37 54 124 -18 82 3 126 -34 50 92 17 -38 114
6716 114 64 16 -47 -20 22 -28 34 -109 115 5 25 26 62 -26 -46 48 -28 -79 41 -35 83 34 -49 -64 -120 -4 9
6743 9 37 -41 9 -73 150 90 -100 172 21 -91 -59 37 61 -93 68 -12 -3 -19 13 -97 -23 69 13 35 -79 38
6769 38 54 27 -50 -48 -43 -24 27 -158 -53 112 82 -140 -66 109 -25 -30 -40 51 100 -41 -32 20 -133 38 -66 -22 -67
6796 -67 0 -116 -43 -1 131 -23 -37 64 -39 32 -228 506 -64 -73 -5 7 -8 84 79 26 22 -46 132 153 104 75 -50
6823 -50 -51 42 -96 -29 68 25 -78 47 42 -25 45 72 -149 18 42 12 -29 29 -179 6 -18 16 -9 33 -26 24 -43 -51
6851 -51 -10 74 -59 -56 -6 -72 102 6 10 -43 113 18 45 60 9 -17 15 88 20 -137 -84 5 -123 -137 16 140 -17
6878 -17 -53 -11 -29 -76 27 0 -6 23 58 -7 -55 27 62 -94 19 -11 -58 -3 -74 -23 19 -5 13 -8 82 7 35 -14 181
6907 181 -115 -31 43 -7 -35 -11 44 -105 -91 -1 10 49 -22 90 15 -50 121 -3 44 -52 55 105 5 44 -139 -115
6933 -115 37 102 -56 -81 -91 -19 47 -2 60 84 92 37 37 59 72 -41 -99 23 -15 -75 -4 24 -66 0 -16 -111 37 -29
6961 -29 120 66 39 -187 58 31 -104 47 27 -35 -17 12 1 19 31 10 -58 162 0 -51 30 -15 89 8 28 -8
6987 -8 3 44 -14 -43 -82 -113 11 -13 -17 -109 -129 18 0 53 43 -78 -56 -139 -67 71 -63 -36 49 -52 -18 1 42 -19
7015 -19 -13 14 15 -84 -61 -95 64 24 -95 -54 51 -2 -67 -71 -89 22 -34 26 -87 -76 -31 -65 -95 -73 56 -29 -52 -103 123
7044 123 85 -9 19 76 6 -40 35 -19 -3 -95 34 -89 74 -12 143 37 -3 9 22 65 -106 5 -43 -65 26 91
7070 91 -31 21 32 19 -55 -34 -6 58 -46 29 6 25 110 -66 -26 59 -51 21 92 -61 -7 129 63 82 64 -81 48
7097 48 67 -10 -39 52 26 233 -11 371 -168 234 580 -295 34 -168 -7 -52 52 -77 -15 -2 68 -125 14
7120 14 -77 -35 -75 7 -60 82 -73 -53 -67 -68 -4 -4 -22 -80 -20 -10 -12 -52 18 110 15 -54 -49 -69 -53 -84 -46 -112 -51 16 -77
7151 -77 48 -16 -34 -20 -36 -72 -83 75 -60 -58 14 -79 -79 16 56 34 -49 -33 -72 -2 -3 -80 -34 -45 -41 4 17 58 -11 58 -50
7182 -50 12 43 54 13 -19 22 3 -10 102 15 37 75 41 -20 49 47 -82 37 -7 -11 -37 -127 16 95 -3 -13 61 -53 -77
7211 -77 -29 9 -105 39 -15 -70 -18 -57 -32 -26 11 32 -50 -37 19 25 -12 10 112 -33 -81 33 -76 13 28 -16 74 -103
7239 -103 62 -109 60 -39 -94 -178 -54 6 -73 25 12 64 57 -24 -82 -22 -11 -112 -12 -37 -90 9 -17 -39 -28 12 -8
7266 -8 64 -1 -52 51 40 41 8 22 20 27 -53 -47 -50 27 32 -29 -80 38 13 -89 51 21 38 58 88 -100 -48 154 51 -80
7296 -80 42 -27 57 -22 10 115 1 -21 50 -61 3 -24 -19 31 -81 -104 41 -35 79 -9 108 -40 -8 61 54 33 35
7323 35 -6 8 -16 -1 3 -48 -72 -22 5 41 -61 22 -22 38 -52 -48 -68 100 -26 -34 9 8 86 -30 -17 30 59 12 2 9 -72
7354 -72 -16 -10 -15 84 34 -115 41 -59 40 -86 33 16 -39 19 78 57 62 -24 -20 69 55 -51 2 69 -92 145 2 -39
7382 -39 71 -66 -108 26 109 27 8 27 -57 -66 39 -75 11 -68 10 34 45 400 -27 -173 44 -179 -324 -386 -319
7407 -319 -31 -452 379 -196 86 47 119 -67 57 -28 -14 -69 -7 -92 8 -168 22 -67 -87 -68 43 23 -39 72
7431 72 -44 -22 34 63 -48 23 -19 36 33 -10 31 50 60 15 -34 129 82 98 -21 -163 49 74 41 -26 -92 -46 -56 77
7459 77 -24 34 -41 -83 41 -3 131 105 32 -31 60 33 20 -13 -56 13 42 19 54 60 -60 9 14 32 -23 -65 62 15 35
7488 35 57 -63 -107 29 -19 75 -36 -7 -1 5 100 26 94 -55 89 71 62 -30 112 -124 99 -58 -29 -23 105 76 34
7515 34 25 -68 91 104 113 -29 -23 -39 84 56 -71 37 18 -55 28 -8 95 -57 37 43 52 -62 -55 9 21 89 -43 -49 -85
7544 -85 104 -95 6 -82 94 -15 33 145 -29 81 -19 102 18 27 30 -53 57 34 -98 112 -75 12 -17 44
7568 44 139 24 53 -35 -102 9 9 3 -45 6 7 -20 26 -18 44 92 -67 21 100 10 -87 47 -28 63 -74 45 5 32 69
7597 69 -28 130 -4 6 71 -3 -5 63 24 33 8 80 79 50 43 -73 80 49 74 -1 -13 -31 -39 -9 40 45 101 -69 26 73 7
7628 7 56 -116 6 -119 19 -16 60 81 87 -25 23 69 82 34 85 46 66 -26 67 3 -44 61 -46 -13 11 10 -24 -20 -52
7657 -52 -8 -74 33 59 8 23 -3 -33 1 148 -130 -91 59 -30 105 -37 18 70 -25 -39 7 86 36 10 -85 -135 -37
7684 -37 -125 38 -8 -17 4 -25 50 -15 -124 -21 38 30 29 -83 -9 -70 -28 -15 17 24 24 2 -95 15 -75 -69 -21 -36 64 43
7714 43 -38 53 -75 65 -50 -27 -63 -58 60 -32 -37 78 -13 24 -25 61 -51 21 1 16 114 43 -19 -79 -60 44 18 23
7742 23 20 3 -39 -15 86 -17 -36 55 -26 -91 -30 31 20 37 -30 50 17 -45 98 34 83 7 -91 18 -69 -31 -68 -24 6
7771 6 97 -196 -4 108 120 35 -1 138 86 89 -58 52 -2 69 48 -65 -44 -87 -87 30 -20 -73 63 -32 -31 -17 -35 29
7799 29 -21 -79 10 -102 28 -4 -65 -96 1 -2 -98 -137 -139 7 -48 24 32 4 494 116 87 187 -31 115 -76 11 -42
7826 -42 62 -8 -27 16 3 -122 9 -99 -65 25 -21 32 -99 -132 32 -60 -13 -75 -90 88 -26 -59 -2 -4 -81 -32 -136
7853 -136 -29 85 -97 102 -27 2 -67 4 -41 53 93 -8 -48 -60 -75 3 19 -60 -65 -124 -69 48 33 65 76 -22 9
7880 9 48 35 -74 45 3 -72 8 189 29 97 -23 43 49 147 -45 -22 -29 -32 19 -57 -57 34 -28 34 -41 -11 44 -85 -24
7909 -24 -21 15 111 109 -69 -8 -5 17 -42 24 -92 75 -104 54 13 32 -83 -28 -17 70 23 42 -74 -21 -62 -14 -46 -80
7937 -80 25 7 -42 -21 67 -66 74 -16 -71 -72 -61 -51 -32 2 76 -59 79 23 75 -79 -30 -68 -52 30 28 -77 38
7964 38 -82 29 -21 17 21 -26 22 -147 -10 -66 -4 86 -134 -13 88 -13 48 4 -53 -72 27 -27 19 -29 -92 -15 -12
7991 -12 59 115 28 -51 88 -37 1 20 -116 -47 -110 29 18 63 65 31 -56 82 51 -63 31 79 24 42 -27 132 -4
8018 -4 107 34 -14 91 -22 -113 25 -2 25 28 5 -15 -133 -113 59 -23 -113 95 40 14 -23 -36 -51 7 5 -31 -66 -98
8046 -98 -136 10 38 -69 -77 1 -1 43 -32 7 74 29 -28 -4 -76 -34 94 -22 52 35 -66 61 31 -33 178 62 -20
8073 -20 -86 -97 42 -34 -32 -66 108 30 136 30 -106 -12 -79 -109 -67 -23 6 -54 10 36 -37 20 -2 -61 -50 43 -42 5
8101 5 28 -55 -46 20 96 -41 -21 -35 -26 -70 78 -11 -95 -79 44 -76 42 23 -75 0 -24 -95 28 24 63 25 98 -37 -77
8130 -77 -83 38 97 -57 -26 -64 37 2 -19 -19 -1 -34 -27 -50 92 40 130 36 -16 -33 49 58 -21 88 -66 3 13 -21 18
8159 18 -54 -20 54 -99 30 -41 -56 36 61 25 -64 62 -17 -10 73 -35 124 -111 90 -35 60 46 -58 -40 -3 -39
8185 -39 20 -42 10 113 113 -45
8191d5
##END NTUPLES=NMR FID
##END=
