##TITLE=1H_DE-80H_X3
 200.13MHz, d2o
 8 sc
 
 19ns.26.2.2025
##JCAMPDX= 6.0         $$ Bruker NMR JCAMP-DX V2.0
##DATA TYPE= NMR FID
##DATA CLASS= NTUPLES
##ORIGIN= UXNMR, Bruker Analytische Messtechnik GmbH
##OWNER= pz
$$ XWIN-NMR		Version 3.5
$$ Thu Jul 23 14:33:14 2026 Russian Standard Time (UT+4h)  Yarkov@DPX200
##.OBSERVE FREQUENCY= 200.1313
##.OBSERVE NUCLEUS= ^1H
##.DELAY= (6, 6)
##.ACQUISITION MODE= SIMULTANEOUS
##.ACQUISITION SCHEME= undefined
##.AVERAGES= 8
##.DIGITISER RES= 18
##SPECTROMETER/DATA SYSTEM= spect
##.PULSE SEQUENCE= zg30
##.SOLVENT NAME= DMSO
##.SHIFT REFERENCE= (INTERNAL, DMSO, 0, 14.3821)
##AUDIT TRAIL= $$ (NUMBER, WHEN, WHO, WHERE, WHAT)
$$ ##TITLE= Audit trail, XWIN-NMR		Version 3.5
$$ ##JCAMPDX= 5.01
$$ ##ORIGIN= Bruker BioSpin GmbH
$$ ##OWNER= Yarkov
$$ C:/Bruker/XWIN-NMR/data/yarkov2/nmr/H-C/1/audita.txt
$$ ##AUDIT TRAIL=  $$ (NUMBER, WHEN, WHO, WHERE, WHAT)
(   1,<2026-07-23 14:32:35.10 +0400>,<Yarkov>,<DPX200>,
      <created by zg, POWCHK disabled, PULCHK disabled
       configuration hash MD5:
       00 E9 B6 7A A2 85 ED C7 34 08 36 98 17 FE 4E 26
       data hash MD5: 16K
       C9 99 F9 9A 17 35 3C 0E E2 A7 D2 36 86 10 B2 73>)
$$ ##END=
$$ 
$$ hash MD5
$$ BD 16 B4 B6 29 FF 46 48 0A CF F8 50 70 9C 7C F2
##$RELAX= 
##$RELAX= 
##$RELAX= 
##$RELAX= 
##$RELAX= 
##$RELAX= 
$$ Bruker specific parameters
$$ --------------------------
##$DU= <C:/Bruker/XWIN-NMR>
##$EXPNO= 1
##$NAME= <H-C>
##$PROCNO= 1
##$TYPE= <nmr>
##$USER= <yarkov2>
##$AMP= (0..31)
100 100 100 100 100 100 100 100 100 100 100 100 100 100 100 100 100 100 
100 100 100 100 100 100 100 100 100 100 100 100 100 100 
##$AQSEQ= 0
##$AQ_mod= 1
##$AUNM= <au_zg>
##$AUTOPOS= <>
##$BF1= 200.13
##$BF2= 200.13
##$BF3= 200.13
##$BF4= 200.13
##$BF5= 200.13
##$BF6= 200.13
##$BF7= 200.13
##$BF8= 200.13
##$BYTORDA= 1
##$CFDGTYP= 0
##$CFRGTYP= 5
##$CHEMSTR= <none>
##$CNST= (0..31)
1 1 145 1 1 1 1 1 1 1 1 1 1 1 1 1 1 1 1 1 1 1 1 1 1 1 1 1 1 1 1 1 
##$CPDPRG= <>
##$CPDPRG1= <>
##$CPDPRG2= <>
##$CPDPRG3= <>
##$CPDPRG4= <mlev>
##$CPDPRG5= <mlev>
##$CPDPRG6= <mlev>
##$CPDPRG7= <mlev>
##$CPDPRG8= <mlev>
##$CPDPRGB= <>
##$CPDPRGT= <>
##$D= (0..31)
0 0.7 0 0 0 0 0 0 0 0 0 0.03 0 0 0 0 0 0 0 0 0 0 0 0 0 0 0 0 0 0 0 0 
##$DATE= 1784802754
##$DBL= (0..7)
120 120 120 120 120 120 120 120 
##$DBP= (0..7)
150 150 150 150 150 150 150 150 
##$DBP07= 0
##$DBPNAM0= <>
##$DBPNAM1= <>
##$DBPNAM2= <>
##$DBPNAM3= <>
##$DBPNAM4= <>
##$DBPNAM5= <>
##$DBPNAM6= <>
##$DBPNAM7= <>
##$DBPOAL= (0..7)
0.5 0.5 0.5 0.5 0.5 0.5 0.5 0.5 
##$DBPOFFS= (0..7)
0 0 0 0 0 0 0 0 
##$DE= 6
##$DECBNUC= <off>
##$DECIM= 32
##$DECNUC= <off>
##$DECSTAT= 4
##$DIGMOD= 1
##$DIGTYP= 9
##$DL= (0..7)
0 120 120 120 120 120 120 120 
##$DP= (0..7)
150 150 150 150 150 150 150 150 
##$DP07= 0
##$DPNAME0= <>
##$DPNAME1= <>
##$DPNAME2= <>
##$DPNAME3= <>
##$DPNAME4= <>
##$DPNAME5= <>
##$DPNAME6= <>
##$DPNAME7= <>
##$DPOAL= (0..7)
0.5 0.5 0.5 0.5 0.5 0.5 0.5 0.5 
##$DPOFFS= (0..7)
0 0 0 0 0 0 0 0 
##$DQDMODE= 0
##$DR= 18
##$DS= 0
$$ [...]
##$SUBNAM2= <"">
##$SUBNAM3= <"">
##$SUBNAM4= <"">
##$SUBNAM5= <"">
##$SUBNAM6= <"">
##$SUBNAM7= <"">
##$SUBNAM8= <"">
##$SUBNAM9= <"">
##$SW= 18.0517328524113
##$SWIBOX= (0..15)
0 0 2 0 0 0 0 0 0 0 0 0 0 0 0 0 
##$SW_h= 3612.71676300578
##$TD= 16384
##$TD0= 1
##$TE= 0
##$TE2= 300
##$TE3= 300
##$TEG= 300
##$TL= (0..7)
0 120 120 120 120 120 120 120 
##$TP= (0..7)
150 150 150 150 150 150 150 150 
##$TP07= 0
##$TPNAME0= <>
##$TPNAME1= <>
##$TPNAME2= <>
##$TPNAME3= <>
##$TPNAME4= <>
##$TPNAME5= <>
##$TPNAME6= <>
##$TPNAME7= <>
##$TPOAL= (0..7)
0.5 0.5 0.5 0.5 0.5 0.5 0.5 0.5 
##$TPOFFS= (0..7)
0 0 0 0 0 0 0 0 
##$TUNHIN= 0
##$TUNHOUT= 0
##$TUNXOUT= 0
##$USERA1= <user>
##$USERA2= <user>
##$USERA3= <user>
##$USERA4= <user>
##$USERA5= <user>
##$V9= 5
##$VALIST= <valist>
##$VCLIST= <CCCCCCCCCCCCCCC>
##$VD= 0
##$VDLIST= <DDDDDDDDDDDDDDD>
##$VPLIST= <PPPPPPPPPPPPPPP>
##$VTLIST= <TTTTTTTTTTTTTTT>
##$WBST= 1024
##$WBSW= 4
##$XGAIN= (0..3)
0 0 0 0 
##$XL= 0
##$YL= 0
##$YMAX_a= 74214
##$YMIN_a= -126380
##$ZGOPTNS= <>
##$ZL1= 120
##$ZL2= 120
##$ZL3= 120
##$ZL4= 120
##$ABSF1= 10
##$ABSF2= 0
##$ABSG= 5
##$ABSL= 3
##$ALPHA= 0
##$AQORDER= 0
##$ASSFAC= 0
##$ASSFACI= 0
##$ASSFACX= 0
##$ASSWID= 0
##$AUNMP= <proc_1d>
##$AZFE= 0.1
##$AZFW= 0.1
##$BCFW= 1
##$BC_mod= 2
##$BYTORDP= 1
##$COROFFS= 0
##$CY= 83.5205535888672
##$DATMOD= 1
##$DC= 2
##$DFILT= <>
##$DTYPP= 0
##$F1P= 10.8118882576601
##$F2P= -7.23987719738617
##$FCOR= 0.5
##$FTSIZE= 0
##$FT_mod= 4
##$GAMMA= 1
##$GB= 0.15
##$INTBC= 1
##$INTSCL= 1
##$ISEN= 128
##$LB= 0.25
##$LEV0= 0
##$LPBIN= 0
##$MAXI= 10000
##$MC2= 0
##$MEAN= 0
##$ME_mod= 0
##$MI= 1.114404
##$NCOEF= 0
##$NC_proc= 0
##$NLEV= 6
##$NOISF1= 3.799351
##$NOISF2= 2.8
##$NSP= 1
##$NTH_PI= 0
##$NZP= 0
##$OFFSET= 14.38212
##$PC= 1
##$PHC0= -7254.183
##$PHC1= 2.82197
##$PH_mod= 1
##$PKNL= yes
##$PPARMOD= 0
##$PSCAL= 0
##$PSIGN= 0
##$REVERSE= no
##$SF= 200.129724274929
##$SI= 16384
##$SIGF1= 3
##$SIGF2= 2
##$SINO= 400
##$SIOLD= 16384
##$SREGLST= <1H.CDCl3>
##$SSB= 0
##$STSI= 0
##$STSR= 0
##$SW_p= 3205.1282051282
##$SYMM= 0
##$S_DEV= 0
##$TDeff= 0
##$TDoff= 0
##$TI= <>
##$TILT= no
##$TM1= 0
##$TM2= 0
##$TOPLEV= 0
##$USERP1= <user>
##$USERP2= <user>
##$USERP3= <user>
##$USERP4= <user>
##$USERP5= <user>
##$WDW= 1
##$XDIM= 8192
##$YMAX_p= 0
##$YMIN_p= 0
$$ End of Bruker specific parameters
$$ ---------------------------------
##NTUPLES= NMR FID
##VAR_NAME=  TIME,          FID/REAL,        FID/IMAG
##SYMBOL=    X,             R,               I
##VAR_TYPE=  INDEPENDENT,   DEPENDENT,       DEPENDENT
##VAR_FORM=  AFFN,          ASDF,            ASDF
##VAR_DIM=   8192,          8192,            8192
##UNITS=     SECONDS,       ARBITRARY UNITS, ARBITRARY UNITS
##FACTOR=    0.0002768,     1,               1
##FIRST=     0,             0,               0
##LAST=      2.2672688,     0,               0
##MIN=       0,             -126380,         0
##MAX=       2.2672688,     74214,           0
$$ Real data points
##PAGE= N=1
##DATA TABLE= (X++(R..R)), XYDATA
$$ plain form
0 0 0 0 0 0 0 0 0 0 0 0 0 0 0 0 0 0 0 8 -8 8 -8 8 -8 16 -16 16 -24 24 -32 32 -40 47 -49 56 -64 72 -81 94 -103
39 -103 116 -129 143 -158 176 -193 215 -238 263 -287 318 -350 386 -426 469 -517 571 -636 707 -791
59 -791 888 -1005 1145 -1323 1551 -1859 2299 -2981 4196 -7010 28762 -31657 -108234 -54831
73 -54831 8489 50791 44935 33715 2506 -40025 -55766 -29785 6970 54783 63129 14863 -45236
86 -45236 -61947 -21375 28799 28836 19375 21657 2880 -31787 -46596 -21310 31276 52149 33492
99 33492 332 -40647 -51209 -13845 25062 40898 29760 1915 -20055 -37876 -33332 9904
111 9904 43846 41651 13614 -30381 -49765 -24714 15567 42352 28210 -7638 -16317 -12464 -15781
124 -15781 -8541 8272 27700 27716 -4989 -29102 -26559 -9756 19851 31580 10898 -6846 -11308
$$ packed form
0@%%%%%%%%%%%%%%%%%Qj6J6j6J6j6K4l2L2m0M8n6O4p2Q7r6J05j20J36j53J75j97
39a03K19k45K72l01L34l69M08m53N01n50O05o68P36q12Q95r86J088j207J343j498
59g91J679j893K150k468K874l410M158n280P177j1206L5772o0419p6577N3403
73e4831O3320M2302n856j1220l1209m2531j5741K5981L6755M7813Q346m8266o0099
86d5236j6711M0572N0174L7r461K282j8777l4667j4809K5286N2586K0873j8657
99C3492l3160m0979j0562L7364L8907J5836j1138k7845k1970j7821M544M3236
111I904L3942k195k8037m3995j9384K5051M0281K6785j4142l5848q679L853l317
124a5781P240J6813J9428J6l2705k4113K543J6803K9607J1729k0682j7744m462
$$ plain form
137 -11308 -9430 -8746 -10900 10846 35470 16005 -18926 -29300 -15392 9128 18407 14727 11713
150 11713 -5143 -19990 -15368 -7120 7487 23667 18755 -746 -23460 -26915 1624 21064 15310
163 15310 7837 -2815 -12755 -13830 -8436 8534 16660 6022 2095 -1895 -13394 -11372 -98 12087
177 12087 16652 1929 -9035 -7983 -8175 -326 7690 5387 7407 5069 -4780 -10683 -13698 -803
191 -803 19194 14208 -2257 -10537 -12405 -3526 3444 5769 13034 6904 -8278 -12135 -10492 683
205 683 15267 11412 -84 -8387 -10561 504 4907 1064 5643 5120 -2207 -4997 -7710 -1887 6143
220 6143 3372 3722 2876 -4859 -4608 -2927 -1237 5568 4555 2204 1427 -6617 -7277 -302 1924 7968
236 7968 8723 -1357 -7700 -10346 -3320 10643 8092 -20 -1912 -5817 -3963 213 613 6897 6055
$$ packed form
137a1308J878O84k154K1746K4624j9465l4931j0374J3908K4520R279l680l014
150A1713j6856j4847M622Q248J4607J6180m912j9501k2714l455K8539J9440n754
163A5310p473j0652r940j075N394J6970Q126j0638l927l990j1499K022J1274J2185
177A2087M565j4723j0964J052j92P849Q016k303K020k338r849n903l015J2895
191h03J9997m986j6465q280j868Q879O970K325P265o130j5182l857J643J1175
205F83J4584l855j1496q303k174J1065M403l843M579n23p327k790k713N823Q030
220F143k771L50q46p735K51J681J690O805j013k351p77q044o60O975K226O044
236G968P55j0080o343k646P026J3963k551q112j892l905J854M176M00O284q42
$$ plain form
251 6055 -2874 -4582 -5458 -1785 6525 3347 -915 -108 -1925 773 -112 -5066 1298 5573 1734 -45
267 -45 -4314 -3871 1404 -155 2215 5052 -395 -1690 -2926 -5040 2021 4916 2716 2115 -4192 -5272
283 -5272 -101 7 4017 5766 -1262 -3086 -3674 -2633 4053 2264 -971 1757 -745 -1889 -880 -2667
299 -2667 2371 4579 -600 -433 -1702 -2497 2109 -431 -1522 3300 1596 5 -2065 -5180 1533 4908
315 4908 185 207 -1708 -2284 1471 -1519 -895 3795 1286 123 -1465 -4475 1023 3183 84 1314
331 1314 -1362 -1939 1220 -1904 -688 3710 548 -100 -1088 -3095 1332 951 -1195 2247 243 -1150
347 -1150 399 -2705 -57 3266 -34 416 -245 -2249 1143 -605 -1828 2779 1087 -191 -16 -3242
363 -3242 75 2709 -860 597 506 -1300 896 -1660 -1885 2843 940 65 314 -3105 685 2098
$$ packed form
251F055q929j708q76L673Q310l178m262Q07j817K698q85m954O364M275l839j779
267d5m269M43N275j559K370K837n447j295j236k114P061K895k200o01o307j080
283e272N171J08M010J749p028j824n88J041O686j789l235K728k502j144J009j787
299b667N038K208n179J67j269p95M606k540j091M822j704j591k070l115O713L375
315D908m723K2j915n76L755k990O24M690k509j163j588l010N498K160l099J230
331A314k676n77L159l124J216M398l162o48r88k007M427l81k146L442k004j393
347a150J549l104K648L323l300M50o61k004L392j748j223M607j692j278J75l226
363c242L317K634l569J457r1j806K196k556k25M728j903q75K49l419L790J413
$$ plain form
379 2098 -1521 608 464 -526 1279 -2061 -1575 2767 392 290 405 -2368 854 880 -1852 1220 760
396 760 -481 1211 -1960 -1042 2331 -113 455 394 -1899 1077 81 -2095 1702 948 -423 848 -1866
413 -1866 -275 1815 -1387 448 945 -1364 1180 -392 -2075 1645 247 -234 1406 -1580 -171 1093
429 1093 -2096 723 1404 -499 940 -1542 -1790 2565 118 -835 686 -1113 864 642 -2378 956
445 956 1213 -745 1017 -1592 -933 2481 -426 -654 691 -1206 1326 686 -2462 531 869 -70 1247
462 1247 -1839 -953 2251 -744 -532 538 -805 1422 -51 -2414 942 543 -279 1505 -1380 -560
478 -560 1322 -1547 424 1015 -1409 932 443 -1299 807 -1039 -371 2047 -1333 -302 918 -1545
494 -1545 729 873 -1068 1000 -521 -1031 2032 -615 -1262 906 -290 821 47 -2466 1242 1534
$$ packed form
379B098l619K129j44r90J805l340M86M342k375j02J15k773L222K6k732L072m60
396G60j241J692l171R18L373k444N68o1k293K976r96k176L797p54j371J271k714
413a866J591K090l202J835M97k309K544j572j683L720j398m81J640k986J409J264
429A093l189K819O81j903J439k482k48M355k447r53J521j799J977k22l020L334
445I56K57j958J762k609O59L414k907k28J345j897K532o40l148K993L38r39J317
462A247l086Q86L204k995K12J070j343K227j473k363L356l99q22J784k885Q20
478e60J882k869J971N91k424K341m89j742K106j846O68K418l380J031J220k463
494a545K274J44j941K068j521n10L063k647o47K168j196J111p74k513L708K92
$$ plain form
510 1534 -1480 46 -395 -43 1607 -1582 -460 1423 -1023 630 594 -1760 551 325 -594 1334 -1136
527 -1136 -729 1786 -985 -752 612 -444 1161 -306 -2198 1728 549 -1361 498 -606 404 1279
543 1279 -1876 -22 982 -1414 681 472 -808 1092 -1050 -896 1773 -647 -182 578 -1822 223
559 223 1135 -421 948 -1279 -1653 2275 414 -1068 -13 -1197 854 964 -1897 582 903 -1135
575 -1135 218 -842 -368 1906 -770 -859 517 -1547 860 1813 -1023 -297 -1183 -980 2285 30 -1192
592 -1192 517 -1256 -250 891 -833 1149 196 -2304 246 367 84 1610 -1100 -1549 123 -691
608 -691 1832 1790 -2586 -1378 -36 653 2284 -1121 -2164 734 -284 350 834 -1479 278 603 -1456
625 -1456 639 -76 -424 1850 -1059 -2188 297 352 1704 582 -3034 -444 1189 274 1119 -915 -1475
$$ packed form
510A534l014J526m41L52J650l189J122J883k446J653l6k354K311k26r19J928k470
527a136M07K515k771K33J364j056J605j467j892L926j179j910J859j104J010Q75
543A279l155J854J004k396K095k09j280J900k142J54K669k420M65P60k400K045
559B23R12j556J369k227l74L928j861j482J055j184K051J10k861K479L21k038
575a135J353j060M74K274k676q9J376k064K407R53k836P26q86K03L265k255j222
592a192J709j773J006J141j724J982r53k500K550J21k83J526k710m49J672q14
608f91K523m2m376J208J342O89J631l405j043K898j018O34M84k313J757L25k059
625a456K095p15l48K274k909j129K485N5J352j122l616K590J633r15Q45k034n60
$$ plain form
642 -1475 1032 -759 -350 1174 -924 288 234 -1961 742 1001 -168 475 -1949 -1773 2133 782 -173
659 -173 -483 -2248 859 1603 -737 58 -964 -1024 1833 -429 -1015 637 -805 684 599 -2005 296
676 296 795 -311 848 -1081 -1440 1374 36 34 303 -1836 338 1030 -983 609 47 -774 869 -884
694 -884 -765 1341 -415 -112 46 -1876 664 1261 -708 161 -1036 -737 1771 -273 -1000 262 -833
711 -833 605 502 -1750 486 714 -420 548 -1438 -1153 1836 347 -111 -558 -2205 846 1720 -658
728 -658 105 -1023 -1274 1365 59 -298 545 -1391 -233 789 -757 1062 428 -1420 30 -612 -40
745 -40 1886 -498 -989 -79 -1194 868 1109 -998 143 -591 -1014 1470 -104 -640 913 -1006 -470
762 -470 318 -787 1150 646 -1713 -296 -413 24 2279 -330 -1622 -484 -887 1427 1533 -1572 -708
$$ packed form
642a475K507j791M09J524k098J212n4k195K703K59j169O43k424J76L906j351r55
659a73l10j765L107P44k340P95j022o0K857k262n86J652j442J489q5k604K301
676B96M99j106J159j929l59K814j338kK69k139K174O92k013J592n62q21J643j753
694h84J19K106j756L03J58j922K540N97j969Q69j197K99K508k044p27J262j095
711h33J438j03k252K236K28j134R68j986K85K989j489m58m47j647L051Q74k378
728f58P63j128k51K639j306l57Q43j936J158J022j546J819o34j848J450o42N72
745d0J926k384m91R10j115K062K41k107J141p34m23K484j574n36J553j919N36
762d70P88j105J937n04k359J417j17M37K255k609j292J138m03K314J06l105Q64
$$ plain form
779 -708 -564 -545 1619 101 -970 316 -1205 -141 1175 -428 489 225 -1689 226 365 81 1427
796 1427 -1096 -1448 617 -205 666 631 -1524 -104 155 -655 1028 -1 -745 666 -988 -557 1069
813 1069 -324 470 79 -1949 193 716 118 996 -1130 -1470 865 85 485 408 -1856 -94 722 -347
831 -347 850 -259 -1016 772 -436 -370 956 -791 1 311 -1113 470 732 -686 696 -752 -879
848 -879 1301 -311 -165 376 -1013 251 533 -925 480 -39 -745 730 -502 -719 869 -461 39
865 39 351 -1235 408 811 -687 499 -492 -755 1231 -270 -391 600 -830 276 556 -956 165
882 165 189 -564 794 -429 -848 919 -241 -17 579 -1165 166 575 -749 514 -235 -871 935 -357
900 -357 -299 815 -793 15 488 -1074 554 508 -642 470 -570 -631 894 -168 -244 399 -1127 244
$$ packed form
779g08J44J9K164j518j071J286j521J064J316j603R17k64j914J915J39k84J346
796A427k523l52K065q22Q71l5k155J420K59q10J683j029p44J411j654M31J626
813A069j393P94l91k028K142N23n98Q78k126l40K335p80M00p7k264J762Q16j069
831c47J197j109p57J788j208O6J326j747P92L10j424J583K62j418J382j448j27
848h79K180j612J46N41j389J264K82j458J405n19p06J475j232k17J588j330N00
865C9L12j586J643M03j498J186r91k63J986j501j21R91j430J106K80j512J121
882A65K4p53J358j223m19J767j160K24N96j744J331M09j324J263p49o36J806j292
900c57N8J114j608Q08M73j562J628m6j150J112j040o1J525j062p6O43j526J371
$$ plain form
918 244 763 -684 275 -8 -701 870 -163 -619 793 -612 -184 584 -997 546 606 -725 428 -422
936 -422 -597 1135 -202 -614 324 -707 422 791 -819 261 27 -767 812 -84 -624 618 -475
953 -475 -136 705 -830 296 438 -887 303 42 -508 790 -315 -536 776 -687 36 735 -883
970 -883 50 206 -530 828 -168 -701 883 -164 -270 565 -547 169 373 -887 353 141 -612 633
988 633 -298 -634 612 -335 74 451 -1055 206 570 -677 249 -162 -533 876 -284 -494 549 -484
1006 -484 82 512 -726 373 173 -764 560 -87 -365 800 -474 -188 577 -743 167 415 -745 304
1024 304 72 -645 808 -181 -419 721 -323 -86 571 -462 267 167 -775 649 80 -689 640 -339
1042 -339 -179 513 -653 335 512 -828 174 145 -669 484 -17 -348 722 -562 -109 680 -507 257
$$ packed form
918B44N19j447R59k83o93J571j033m56J412j405M28P68j581J543O0j331J153q50
936d22j75J732j337m12R38j031J129L69j610J080k34p94J579q96n40J242j093
953d75L39Q41j535J126J42j325J190k61n50J298j105k21J312j463P23O99j618
970h83R33J56p36J358r96n33J584j047j06Q35j112P16K04j260J240k12p53J245
988F33r31l36J246r47M09L77j506J261L64j247R26m11l71J409j160k10J043j033
1006d84N66M30j238J099k00r37J324o47k78J165j274K86P65j320R10K48j160J049
1024C04k32p17J453r89k38J140j044K37O57j033P29j00r42J424n69p69J329r79
1042c39J60O92j166R88J77j340J002k9q14J153n01l31J070j284M53P89j187P64
$$ plain form
1060 257 303 -652 445 -1 -467 769 -446 -566 575 -353 -156 542 -659 344 97 -750 753 16
1078 16 -414 403 -532 -115 834 -553 -2 314 -775 590 283 -510 554 -286 -415 548 -623 -86 677
1097 677 -626 -4 206 -522 584 28 -654 314 -224 -187 762 -541 -165 448 -690 223 205 -484 624
1116 624 -188 -497 587 -353 -71 590 -681 140 269 -528 559 42 -735 543 -131 -257 616 -495
1134 -495 -112 427 -604 281 197 -599 584 110 -490 359 -280 -50 592 -581 13 418 -587 370 136
1153 136 -573 543 -185 -405 574 -415 -41 551 -610 74 223 -485 533 63 -617 469 -95 -172 433
1172 433 -473 35 361 -628 389 335 -606 471 -138 -515 616 -235 -158 422 -622 108 478 -533 296
1191 296 91 -560 353 -69 -253 534 -445 -176 425 -330 389 282 -573 354 -55 -390 653 -250 -268 561
$$ packed form
1060B57M6r55J097m46m66J236j215j20J141r28J97O98j201J003k47q47J503p37
1078A6m30Q17r35M17R49j387N51L16j089J365l07p93J064q40j29R63j171N37P63
1097F77j303O22K10p28J106n56o82R68n38L7R49j303L76O13j138R13j8o89J108
1116F24q12l09J084r40K82O61j271Q21J29p97J087n17p77J278o74j26Q73j111
1134d95L83N39j031Q85q4p96J183m74o00Q49o39K30O42j173N94M05j005R57k34
1153A36p09J116p28k20R79r89L74N92j161O84J49p08J018m70o80J086n64p7O05
1172D33r06N08L26r89J017n4r41J077o09l77J131q51P7N80j044P30L70j011Q29
1191B96k05o51R13m22j84P87r79K69O01p55P19j07q55R27m09l35J043r03j8Q29
$$ plain form
1211 561 -578 -6 502 -335 256 120 -573 523 9 -298 408 -396 -189 465 -450 180 257 -618 240 127
1231 127 -423 392 -194 -328 423 -361 46 415 -581 161 47 -543 355 -26 -272 301 -332 -241 532 -354
1251 -354 145 219 -747 131 118 -166 801 161 -598 488 -224 -42 461 -532 107 436 -428 427 23 -391
1271 -391 368 -151 -246 656 -462 -1 327 -512 346 206 -419 356 -61 -323 416 -256 -264 388 -475 16 438
1292 438 -280 272 78 -416 395 -110 -211 562 -367 -116 416 -291 294 157 -604 247 -89 -178 461 -236
1312 -236 -247 296 -159 62 395 -478 41 15 -300 370 -22 -290 450 -402 -130 387 -213 31 240 -408 190
1333 190 58 -317 498 -288 -395 323 -281 9 388 -485 57 35 -358 399 -51 -288 311 -271 -203 405 -182
1354 -182 47 169 -405 300 245 -267 411 -182 -251 349 -50 -50 285 -505 101 276 -344 220 11 -451 426
$$ packed form
1211E61j139N72N08q37N91j36o93J096n14l07P06q04K07O54r15O30P7q75Q58j13
1231A27n50Q15n86j34P51p84M07L69r96P42j14n90Q98l81k46N73o33R1P73q86
1251c54M99P4r66Q78j3k84R67o40p59J086p12J82N03r93O39L29q64Q55m04m14
1271c91P59n19r5R02j118M61L28q39Q58j40o25P75m17k62P39o72qO52q63M91M22
1292D38p18N52j94m94Q11n05j01P73r29K51N32p07N85j37p61Q51l36q9O39o97
1312b36j1N43m55K21L33q73N19k6l15O70l92k68P40q52K72N17o00K44K09o48N98
1333A90j32l75Q15p86j07P18o04K90L79q73N42k2l93P57m50k37N99n82O8O08n87
1354a82K29J22n74P05n5n12O78n93o9O00l99%L35p90O06J75o20N64k09m62Q77
$$ plain form
1375 426 -67 -213 319 -146 -59 247 -425 206 181 -349 254 -55 -150 380 -50 -74 295 -325 115 254 -429
1396 -429 177 48 -263 431 -70 -216 290 -334 -120 219 -321 105 134 -427 193 2 -276 428 -236 -113
1416 -113 286 -135 106 249 -440 165 224 -281 268 -149 -331 390 -14 -134 259 -353 91 304 -269 116
1436 116 23 -305 130 -80 -168 368 -208 -47 237 -349 215 192 -355 138 -109 -262 421 -140 -83 227 -218
1457 -218 44 280 -381 125 19 -371 -2 -120 -38 334 -311 -197 301 -347 174 228 -474 30 -36 -279 371
1478 371 -142 -295 185 -275 94 341 -342 -4 10 -315 347 98 -167 376 -244 -174 322 -136 73 51 -345
1499 -345 19 199 -195 290 -118 -237 261 -137 15 188 -350 75 89 -282 214 64 -251 278 -136 -147 253
1520 253 -249 -9 169 -360 47 95 -205 225 -99 -281 257 -142 -14 48 -277 0 -10 -183 148 -4 -273
$$ packed form
1375D26m93j46N32m65Q7L06o72O31k5n30O03l09r5N30m30k4L69o20M40J39o83
1396d29O06j29l11O94n01j46N06o24K14L39n40M26K9n61O20j91k78P04o64J23
1416a13L99m21K41J43o89O05N9n05N49m17j82P21m04j20L93o12M44K13n73L85
1436A16r3l28M35k10q8N36n76J61K84n86N64k3n47M93k47j53O83n61N7L10m45
1457b18K62K36o61N06j06l90L69j18Q2L72o45J14M98o48N21N4p02N04o6k43O50
1478C71n13j53M80m60L69K47o83L38J4l25O62k49k65N43o20P0M96m58K09k2l96
1499c45L64J80l94M85m08j19M98l98J52J73n38M25J4l71M96j50l15N29m14j1M00
1520B53n02K40J78n29M07M8l00M30l24j82N38l99J28O2l25K77j0j73L31j52k69
$$ plain form
1541 -273 236 36 -7 347 -94 -19 110 -231 103 168 -220 131 24 -185 302 -49 -84 183 -181 74 184
1562 184 -214 64 102 -164 105 -99 -240 124 -95 -90 156 -198 163 129 -235 213 82 -147 254 57 -216
1583 -216 269 -168 -107 149 -241 83 79 -160 125 9 -170 174 -16 -132 173 -307 -47 133 -13 213 57
1604 57 -325 171 45 -158 213 -64 -86 73 -225 -49 152 -226 95 31 -169 196 -37 -123 212 -145 34
1625 34 80 -237 154 10 -109 144 -30 -230 233 -98 -136 255 -78 -11 -2 -182 96 68 -202 -6 -92 -46 226
1648 226 -211 -173 190 -198 107 107 -261 122 -18 -189 217 -49 -2 207 -215 -100 180 -178 72 24 -218 243
1670 243 14 -147 140 -60 57 155 -220 -35 28 -104 109 4 -138 216 147 -112 107 -64 -99 135 -187
1691 -187 77 104 -189 102 12 -60 217 -163 -34 214 -53 -10 203 -233 166 137 -184 129 127 28 129 -128 -47
$$ packed form
1541b73N09k00m3L54m41P5J29l41L34O5l88L51j07k09M87l51l5K67l64K55J10
1562A84l98K78L8k66K69k04j41L64k19NK46l54L61l4l64M48j31k29M01j97k73
1583b16M85m37O1K56l90L24mk39K85j16j79L44j90j16L05m80K60J80j46K26j56
1604E7l82M96j26k03L71k77k2J59k98J76K01l78L21o4k00L65k33q6L35l57J79
1625C4M6l17L91j44j19K53j74k00M63l31l8L91l33O7Rj80K78k8k70J96q6M6K72
1648B26m37L8L63l88L05%l68L83j40j71M06k66M7K09m22J15K80l58K50m8k42M61
1670B43k29j61K87k00J17R8l75J85O3j32K13j05j42L54o9k59K19j71l5K34l22
1691a87K64K7k93K91r0p2K77l80J29K48k67M3K13m36L99k9l21L13kr9J01k57Q1
$$ plain form
1714 -47 203 -103 106 29 -112 132 0 -158 38 -56 -122 108 -201 -44 226 -45 -41 -91 -159 146 -90 -75 -17
1737 -17 -79 -30 174 -133 89 148 -152 67 87 -148 148 -48 -98 143 -57 52 45 -91 10 60 -58 121 95
1760 95 -34 81 -82 -125 259 -27 -85 87 -251 -36 102 -118 -36 24 -80 97 -60 -20 299 -18 17 51 -2
1783 -2 165 25 -199 109 -15 -21 117 -105 -47 125 -176 -36 148 -50 4 -49 -155 199 -61 -74 169 -157 53
1806 53 199 -143 -36 -27 15 81 27 -255 93 -84 -124 67 -180 24 171 -116 15 70 -153 7 -143 34 215
1829 215 25 -133 3 -75 92 69 -175 104 69 -33 -5 -147 -58 99 -53 47 125 -83 213 -64 -114 151
1851 151 63 -187 153 -99 -18 -19 268 574 228 -170 24 -110 -191 227 62 5 -14 -28 -16 128 -183 -134 22
1874 22 -83 32 -65 -138 129 -35 -95 0 -67 -31 124 -157 -2 113 -172 68 -23 -84 85 71 -63 112 -58
$$ packed form
1714d7K50l06K09p7j41K44j32j58J96r4o6K30l09J57K70k71Mn0o8L05k36J5N8
1737a7o2M9K04l07K22N9l00K19K0k35K96j96n0K41k00J09pj36J01N0j18J79k6
1760I5j29J15j63m3L84k86n8J72l38K15J38k20Q2O0j04J77j57M0L19l17L5L4n3
1783bJ67j40k24L08j24oJ38k22N8J72l01J40J84j98N4n3j06L54k60j3K43l26K10
1806E3J46l42J07RM2O6n4k82L48j77m0J91k47K04J47k87J31N5k23J60j50J77J81
1829B15j90j58J36p8J67k3k44K79l5j02K8j42Q9J57j52J00P8k08K96k77n0K65
1851A51q8k50L40k52Q1jK87L06l46l98J94j34q1M18j65n7j9j4J2J44l11M9J56
1874B2j05J15r7p3K67j64o0R5o7L6J55k81J55J15k85K40r1o1J69j4j34J75j70
$$ plain form
1897 -58 -2 16 -83 -32 179 -56 81 -69 -101 64 -161 -66 -23 -30 75 -11 -135 46 94 -48 60 10 -41 184 -44
1922 -44 -33 60 -40 13 6 -24 109 58 -109 50 -82 150 48 -204 -7 81 13 -14 6 -124 193 -98 -102 59 -59
1947 -59 16 13 -83 124 131 -22 73 34 -162 119 -36 -121 59 35 77 3 28 45 112 -136 52 61 -136 118 -102 -176
1973 -176 48 -100 -30 35 2 -115 77 -100 152 -53 16 80 -100 39 122 -1 -79 -41 -100 147 81 -88 -25 -5
1997 -5 23 28 -74 -5 148 -37 6 5 -109 87 27 -87 80 -127 107 16 -5 -4 48 -58 -53 -75 -189 221 5 -50
2023 -50 30 36 -62 38 -49 -4 82 -61 -61 53 -48 17 55 -85 -3 -123 -42 -26 4 103 8 -152 25 32 10 181 -33
2050 -33 -37 88 -59 -38 107 -77 109 85 -28 19 -31 -18 90 -109 -34 -19 11 -91 75 -25 62 42 -77 183
2074 183 7 58 111 -18 52 59 -39 2 -8 6 95 4 -143 64 -113 -42 79 -57 20 86 16 78 3 23 128 -93
$$ packed form
1897e8N6J8r9N1K11k35J37j50l2J65k25R5M3pJ05q6j24J81M8j42J08n0n1K25k28
1922d4J1R3j00N3pl0J33n1j67J59j32K32j02k52J97Q8o8k7K0j30L17k91mJ61j18
1947e9P5lr6K07Pj53R5l9j96K81j55q5J80k4M2p4K5J7O7k48J88Rj97K54k20p4
1973a76K24j48P0O5l3j17J92j77K52k05O9O4j80J39Q3j23p8L8n9K47o6j69O3K0
1997eK8Nj02O9J53j85M3jj14J96o0j14J67k07K34r1k1JN2j06Nk2j14M10k16n5
2023e0Q0Or8J00q7M5Q6j43%J14j01O5L8j40Q2j20Q1J6L0R9r5j60J77Pk2J71k14
2050c3mJ25j47K1J45j84J86k4j13M7n0J3J08j99P5J5L0j02J66j00Q7k0j19K60
2074A83j76N1N3j29P0Pr8M1j0J4Q9r1j47K07j77P1J21j36P7O6p0O2p5K0J05k21
$$ plain form
2100 -93 -127 93 -58 39 24 -158 7 95 -22 -16 84 -68 87 -115 -39 118 57 20 79 -73 -70 32 -78 74
2124 74 81 65 125 53 93 81 -24 -37 117 83 95 51 -52 100 -60 -83 95 -51 -29 111 -25 62 -54 -82 86
2149 86 -10 -97 67 84 -6 77 -184 119 82 -133 -31 26 -114 42 -64 7 113 7 -67 73 -54 -1 -44 -60
2173 -60 80 -19 55 -3 -4 -105 24 -125 -121 95 -65 99 189 -110 130 -89 -30 92 21 -70 -37 -78 -66 -35 -42 14
2199 14 86 21 -51 48 -74 41 -126 40 73 -107 -23 73 -114 -60 -37 -18 53 30 -86 91 -33 50 120 51 -70
2224 -70 56 -22 13 -74 9 306 -47 -378 191 -458 228 163 -233 -251 2 -26 222 84 82 59 -77 -41 1 -150
2248 -150 -23 140 -187 -45 62 -94 47 -52 110 105 -17 39 14 79 -2 -16 64 15 -100 -23 -53 18 17 164 -32
2273 -32 -11 83 -28 9 -4 -73 27 -37 -46 49 -8 -58 30 17 -91 21 34 -8 100 -74 85 68 -41 55 30 28 17
$$ packed form
2100i3l4K20j51R7j5j82J65Q8j17OJ00j52J55k02P6J57o1l7N9j52LJ02j10J52
2124G4Pj6O0p2M0j2j05j3J54l4J2m4j03J52j60k3J78j46K2J40j36Q7j16k8J68
2149H6r6q7J64J7r0Q3k61L03l7k15J02N7j40J56j06P1J06j06p4J40j27N3m3j6
2173f0J40r9P4n8jj01J29j49MK16j60J64R0k99K40k19N9J22p1r1L3m1J2L1pN6
2199A4P2o5p2R9j22J15j67J66L3j80Q4R6j87N4K3J9P1k3j16J77j24Q3P0o9j21
2224g0J26p8L5q7Q3K97l53l31N69o49O86o5l96j8K53k8K48j38kk3j36L6M2j51
2248a50J27J63l27J42J07j56J41r9J62nj22N6k5O5q1j4Q0m9j15P7l0P1jJ47j96
2273c2K1R4j11L7j3o9J00o4rR5n7n0Q8j3j08J12J3m2J08j74J59j7j09R6k5kj1
$$ plain form
2300 17 -58 15 212 -2 -44 57 7 33 -33 -107 83 0 -16 -100 -37 -23 87 -78 -40 -85 22 -73 -39 -81 118 14
2326 14 -73 37 16 20 86 76 31 53 -107 118 -33 -77 -100 -77 -20 -35 28 59 23 -87 75 11 17 149 -9 -67 59
2353 59 -91 -18 -3 -46 51 17 -89 -17 -17 -71 1 42 22 -39 -27 -62 -23 -34 81 -117 18 16 5 15 122 -2 38 -5
2381 -5 10 29 0 73 4 8 -8 51 -19 -26 -68 -83 71 1 -155 20 61 -108 24 11 -85 16 19 35 1 -128 12 39
2409 39 -120 37 -10 -63 32 -125 -53 86 16 -24 9 -25 -20 32 -84 -4 55 16 76 44 60 22 -94 58 52 54 -5 -59
2437 -59 13 19 29 10 99 -84 -53 79 -104 -10 -60 -45 -28 69 -30 -64 45 10 167 -63 29 65 -27 23 65 40 23 -26
2465 -26 -41 51 -71 -88 68 -59 -60 7 32 59 -59 -64 -25 67 66 1 82 -113 174 35 102 27 -65 56 -90 -60 56
2492 56 41 26 27 -40 13 -92 -28 14 -45 -112 107 37 55 93 59 -86 -6 70 -125 -19 -51 75 90 -28 -72 -18 3
$$ packed form
2300A7p5P3J97k14m2J01n0K6o6p4J90q3j6q4O3J4J10j65L8m5J07r5L4m2J99j04
2326A4q7J10k1MO6j0m5K2j60K25j51m4k3K3N7j5O3L1l6j10J62o4OJ32j58n8J26
2353E9j50P3J5m3R7l4j06P2%n4P2M1k0o1J2l5L9j1J15j98J35kj1J0J07j24M0m3
2381eJ5J9k9P3o9Mj6N9p0pm2j5J54p0j56J75M1j69J32j3r6J01LJ6l4j29J40K7
2409C9j59J57m7n3R5j57P2J39p0m0L3l4NN2j16Q0N9l9O0l2J6l8j16J52oKn9n4
2437e9P2OJ0j9Q9j83L1J32j83R4n0J5J7R7r9l4J09l5J57k30R2L6r2N0M2k5j7m9
2465b6j5R2j22j7J56j27jO7K5K7j18nL9R2jo5Q1j95K87j39O7p5r2J21j46L0J16
2492E6j5j5Jo7N3j05O4M2n9o7K19p0J8L8l4j45Q0P6j95J06l2J26J5j18m4N4K1
$$ plain form
2519 3 21 -10 29 -17 -24 14 12 60 -27 -55 -47 -6 -89 72 48 25 -91 -94 -95 -52 25 -39 114 55 -23 -13 -66 20 46 -89 197
2550 197 94 -88 -2 20 69 70 -37 -100 5 18 -77 -13 -97 28 50 -34 43 -7 5 35 19 -10 6 39 7 11 -40 28
2578 28 -45 46 -5 95 -74 73 -55 -83 109 -45 -77 83 15 -28 -89 14 117 -35 63 65 -57 -21 14 -25 63
2603 63 -66 -8 56 12 26 42 -82 -41 -10 -89 99 -27 9 81 206 -62 24 -38 51 22 -54 18 102 -69 73 -92
2629 -92 -39 4 11 -89 160 -72 171 250 -159 57 130 95 -71 61 -24 -12 -14 19 66 111 14 -38 37 14 6 44 -13 -114
2657 -114 -29 -18 -74 67 -131 93 -18 31 -86 -65 -48 -80 56 124 -76 95 -7 -70 144 -16 -7 24 3 114
2681 114 -23 -11 44 -32 -30 46 126 -54 -54 -3 22 -4 -47 73 88 -3 -64 31 -50 49 -15 -26 71 -35 -11 32 -17 52 71
2710 71 53 35 33 11 81 0 23 56 -58 65 -65 -40 100 -131 -43 71 -65 20 5 -18 5 105 55 34 16 -19 -98
$$ packed form
2519CJ8l1L9m6pL8kM8q7k8QM1q3J61k4k3j16ljM3P7o4J53n9p8J0n3Q6K6j35K86
2550A97j03j82Q6K2M9Jj07o3J05J3r5O4q4J25K2q4P7n0J2L0j6k9J6L3l2Mn1O8
2578B8p3R1n1J00j69J47j28k8J92j54l2J60o8m3o1J03J03j52R8Kj22L6L5l9Q8
2603F3j29N8O4m4J4J6j24M1L1p9J88j26L6P2J25k68Q6o2Q9k9p6P2Q4j71J42j65
2629i2N3M3Pj00K49k32K43P9m09K16P3l5j66J32q5J2kL3M7M5r7n2P5k3qL8n7j01
2657a14Q5J1n6J41j98K24j11M9j17K1J7l2J36O8k00J71j02o3K14j60RL1k1J11
2681A14j37J2N5p6KP6Q0j80%N1K5k6m3J20J5r1o1R5q1R9o4j1R7j06K4M3m9O9J9
2710G1j8j8kk2P0q1K3L3j14J23j30K5J40k31Q8J14j36Q5j5k3K3J00n0k1j8l5p9
$$ plain form
2737 -98 12 -110 -86 24 -74 14 -142 66 -141 -56 -8 6 0 17 -12 -31 -20 -31 17 -118 7 -92 16 83 25 -61
2763 -61 -17 -80 12 -41 25 -83 -53 -28 49 -37 -33 -50 36 -27 -28 -18 14 -61 -8 1 -52 -13 -151 6 99 19 172 -9 30
2792 30 -50 -25 41 15 -66 -104 11 -49 89 -67 -84 -26 -17 6 45 61 25 -87 20 -21 -2 -11 -38 -5 -76 -116 -31 92
2820 92 -74 43 -12 87 -39 -43 -12 -1 -46 38 26 -25 -29 -55 -25 59 -177 0 21 70 -47 176 -200 -131 3 194
2846 194 274 90 -229 -197 80 1 34 -24 -43 125 23 24 53 79 6 16 122 87 -89 -109 15 19 33 -48 -24 -1 -32
2873 -32 70 -72 -9 64 -60 48 38 28 58 -57 -21 -19 126 -82 37 48 -9 13 19 -75 43 -49 -13 120 21 66
2899 66 61 -43 59 86 -4 -3 5 38 10 -72 26 -1 -14 114 -83 48 32 129 -88 50 -13 -41 -7 -11 -32 -61 -33 -3 38
2928 38 -85 61 -159 -53 44 16 -44 109 -62 126 73 1 88 28 -40 37 30 -66 29 -27 -11 -16 -54 -125 16 -47 99
$$ packed form
2737i8J10j22K4J10r8Q8j56K08k07Q5M8J4oJ7k9j9J1j1M8j35J25r9J08O7n8q6
2763f1M4o3R2n3O6j08L0K5P7q6Mj7Q6o3jJ0L2p5N3Rn3L9j38J57R3q0J53j81L9
2792C0q0K5O6k6q1l8J15o0J38j56j7N8RK3L9J6l6j12J07m1J9rk7L3p1m0Q5J23
2820I2j66J17n5R9j26mL1J1m5Q4j2n1mk6L0Q4k36J77K1M9j17K23l76O9J34J91
2846A94Q0j84l19L2K77p9L3n8j9J68j02JK9K6p3J0J06l5j76k0J24MJ4q1K4K3l1
2873c2J02j42O3P3j24J08j0j0L0j15L6KJ45k08J19J1n7K2Or4J18r2L6J33r9M5
2899F6nj04J02K7r0JQL3k8q2R8k7j3J28j97J31j6R7k17J38o3k8L4mk1k9K8L0M1
2928C8j23J46k20J06R7k8o0J53j71J88n3p2Q7o0o8P7pr6R5n6J6nl8p1J41o3J46
$$ plain form
2955 99 16 17 122 32 33 18 -49 91 -21 15 -91 68 -25 12 145 5 134 131 84 45 73 91 31 47 -24 10 -94
2982 -94 -3 -13 18 -60 12 45 -51 13 -15 38 -13 3 41 -30 -84 -23 -27 64 -18 36 -10 14 -35 -127 -52 43 -61 -44 31 -33
3012 -33 -75 72 -30 -30 -15 -85 -83 61 30 -11 -11 -41 46 -167 17 44 11 59 -65 -106 92 81 44 117 -89 -34 1 30
3040 30 39 40 -204 -31 69 11 63 49 -76 9 -68 40 143 27 -4 165 -319 -19 -251 79 42 128 -83 -414
3064 -414 -339 2 10 -112 -39 81 -80 -124 70 -56 47 -107 -33 17 -78 -65 138 -25 94 0 14 -53 -44 -116 57
3089 57 -83 -86 19 -37 62 3 -47 10 -70 51 68 45 64 -30 -52 -22 -39 46 28 -25 -92 -51 -35 -10 27 -61 18 -30 -8
3118 -8 -46 91 -61 66 -105 61 -179 -143 -50 10 39 -10 31 87 61 41 95 -87 8 -31 21 47 -51 30 -43 18 -3
3145 -3 -72 51 -48 -79 18 -76 -41 14 -101 4 40 -57 83 47 -7 139 -64 9 -162 -19 20 12 -55 22 51 -18 -50
$$ packed form
2955I9q3JJ05r0Jj5o7J40j12L6j06J59r3L7J33j40J29lm7l9K8J8o0J6p1L4j04
2982i4R1j0L1p8P2L3r6O4k8N3n1J6L8p1n4O1mR1q2N4m6K4m9r2P5R5j04J7P5o4
3012c3m2J47j02%J5p0KJ44l1m1%l0Q7k13J84K7l3M8j24m1J98j1l7P3k06N5L5K9
3040C0RJk44J73J00n8N2j4j25Q5p7J08J03j16l1J69m84L00k32L30l7Q6k11l31
3064d14P5L41Qj22P3J20j61m4J94j26J03j54P4N0r5J3K03j63J19r4J4o7Rp2J73
3089E7j40lJ05n6R9n9n0N7q0J21J7k3J9r4k2L0j7Q5j8n3o7M1J6K5L7q8P9m8K2
3118hl8J37j52J27j71J66k40L6R3O0K9m9M1N6k6k0N4j82R5l9N2K6r8Q1p3O1k1
3145co9J23r9l1R7r4L5N5j15J05L6r7J40l6n4J46k03P3j71J43L9qo7P7K9o9l2
$$ plain form
3172 -50 19 -103 94 -48 -104 -56 19 41 -2 -39 1 -8 -91 -10 8 -47 102 -48 -99 5 32 2 -108 -31 -107 17 -123
3199 -123 65 -1 -101 -78 -64 95 22 -44 -11 11 8 29 40 77 96 66 -39 73 54 -32 -5 -114 -19 -7 15 -12 27
3226 27 -30 41 -38 -73 71 -20 -49 -107 -80 -29 10 -31 18 -72 -46 66 -18 56 78 -19 17 71 -20 -27 51 -77 51 11 -58
3255 -58 90 139 -12 -33 1 101 65 -50 191 -11 -55 130 -11 -46 47 -71 75 64 -81 57 60 -130 66 109
3279 109 -24 117 -61 -70 50 -47 -60 -21 -90 26 -34 64 73 75 -23 46 -15 43 109 -45 121 48 42 122 -30 52 66 41
3307 41 103 69 48 45 116 -3 75 98 -65 21 -13 -15 209 78 -2 -40 -85 0 73 -93 103 12 -18 -17 -125 45 -32 -54
3335 -54 -25 -64 -460 -167 55 -61 63 3 -81 17 -58 -41 40 5 48 124 -122 104 23 -29 73 -14 49 73 -162 52
3361 52 14 -48 4 -21 -60 133 -24 -92 124 -16 78 -20 -149 170 44 -120 -10 -37 -35 152 -10 82 61 -69 -22
$$ packed form
3172e0O9j22J97j42n6M8P5K2m3l7M0rq3Q1J8n5J49j50n1J04K7l0j10P7p6J24j40
3199a23J88o6j00K3J4J59p3o6L3K2lK1J1L7J9l0j05J12j9q6K7j09R5J2K2k7L9
3226B7n7P1p9l5J44r1k9n8K7N1L9m1M9r0K6J12q4P4K2r7L6N4r1pP8j28J28m0o9
3255e8J48M9j51k1L4J00l6j15K41k02m4J85j41l5R3j18J46j1j45J38Lj90J96M3
3279A09j33J41j78rJ20r7j3L9o9J16o0R8RKr8O9o1N8O6j54J66p3oQ0j52Q2J4k5
3307D1O2l4k1lP1j19P8K3j63Q6l4kK24j31q0l8m5Q5P3j66J96r1l0Jj08J70p7k2
3335e4K9l9l96K93K22j16J24o0q4R8p5J7Q1l5M3P6k46K26q1n2J02q7O3K4k35K14
3361E2l8o2N2k5l9J93j57o8K16j40R4r8j29L19j26j64J10k7KJ87j62R2k1j30M7
$$ plain form
3386 -22 47 6 79 -58 -85 175 14 -22 64 43 -20 -89 -163 4 -32 -3 39 6 -142 -51 122 -59 20 170 -78 48
3412 48 -30 23 -5 -10 3 10 27 50 -71 -56 112 -10 -33 112 20 4 78 -27 0 -34 -54 95 22 -24 -28 66 -42 -24
3440 -24 -71 125 65 -18 -37 -59 -96 64 -80 -84 20 92 -32 34 7 19 -32 -55 102 -38 -73 66 -41 -35 41 41 79
3467 79 160 20 3 12 -128 58 -62 7 8 45 34 -15 -1 -73 81 51 -40 -60 -28 -26 -93 63 161 -94 -22 12 -71 -6
3495 -6 71 -16 182 -44 -71 94 -4 1 36 -121 36 117 -22 27 40 25 42 -3 -62 101 -69 97 27 -105 34 -15
3521 -15 13 -32 -165 -134 42 -106 56 106 -149 60 -53 -68 115 -60 40 13 -59 64 185 -92 -60 41 -40
3544 -40 38 78 -87 9 30 -113 31 -16 54 22 -6 80 -37 -104 -62 47 -74 -43 4 54 61 -32 -2 -59 -29 -85 121
3571 121 -66 -113 -78 -76 167 -157 24 47 30 8 -6 -35 27 14 58 23 -12 -43 -15 -53 -115 -17 58 118 -14 -45 64
$$ packed form
3386b2O9m1P3j37k7K60j61l6Q6k1o3o9p4J67l6K9M2l3j48R1J73j81P9J50k48J26
3412D8p8N3k8nJ3PJ7K3j21J5J68j22k3J45r2j6P4j05K7l4k0J49p3m6mR4j08J8
3440b4m7J96o0q3j9k2l7J60j44mJ04P2j24O6k7J2n1k3J57j40l5J39j07OP6%L8
3467G9Q1j40j7Rj40J86j20O9JL7j1m9J4p2J54l0r1k0L2Ko7J56R8k55P2L4q3O5
3495fP7q7J98k26k7J65r8NL5j57J57Q1j39M9J3j5J7m5n9J63j70J66p0j32J39m9
3521a5K8m5j33L1J76j48J62N0k55K09j13j5J83j75J00k7p2J23J21k77L2J01q1
3544d0P8M0j65R6K1j43J44m7P0l2k8Q6j17o7M2J09j21L1M7N0Pr3L0n7L0n6K06
3571A21j87m7L5KK43l24J81K3j7k2j4k9O2j3M4l5l5l1K8l8o2R8P5O0j32l1J09
$$ plain form
3598 64 111 -74 59 -20 17 93 -96 87 78 -12 -14 146 -8 -39 -61 -26 147 -13 -35 22 -64 -92 -26 -64 17 49 -80
3625 -80 0 66 71 70 -22 -3 -21 -55 21 64 -94 26 24 -29 97 -61 40 91 -49 -42 -20 -83 -8 61 -107 129 33 -3
3653 -3 54 -4 -24 85 -26 10 99 -40 23 50 -78 144 41 -13 153 52 -32 73 -81 48 -1 -117 9 -59
3677 -59 52 17 -98 -32 84 -45 33 -60 90 68 34 -31 -31 0 36 39 -109 38 -1 -23 -9 -18 -55 83 28 -73 143
3704 143 191 -48 68 7 -6 63 -26 -17 -91 -29 135 -91 -3 95 -57 -29 47 -56 38 81 -30 11 -69 -41 66 -89
3730 -89 -2 13 20 -44 18 35 391 308 1113 840 -770 522 58 -318 53 -105 -38 -2 26 -525 -218 -124 101 132
3754 132 32 245 179 -35 54 -127 -737 -347 -289 -339 199 43 -51 123 -120 88 -44 -27 -31 110 32 -20 29 -44
3778 -44 -33 10 -28 -7 33 -27 70 -116 7 -27 -105 76 45 9 72 12 -101 58 9 83 104 4 13 -17 -25 67 183 2
$$ packed form
3598F4M7j85J33p9L7P6j89J83rr0kJ60j54l1k2L5J73j60k2N7q6k8O6l8Q1L2j29
3625h0Q0O6Njr2J9j8l4P6M3j58J20kn3J26j58J01N1j40PK2o3P5O9j68K36r6l6
3653cN7n8k0J09j11L6Q9j39O3K7j28K22j03n4J66j01q4J05j54J29m9j16J26o8
3677e9J11l5j15O6J16j29P8r3J50k2l4o5%L1L6Lj48J47l9k2J4rl7J38n5j01K16
3704A43M8k39J16o1j3O9q9Rp4O2J64k26Q8R8j52K8P6j03R4M3j11M1q0K8J07j55
3730h9Q7J5Po4O2J7L56q3Q05k73j610J292m64l76L71j58O7L6K8n51L07R4K25L1
3754A32j00K13o6k14Q9j81o10L90N8n0N38j56r4J74k43K08j32J7mJ41p8n2M9p3
3778d4J1M3l8K1M0o0R7j86J23l4p8J81l1l6O3o0j13J59m9P4K1j00Rl0qR2J16j81
$$ plain form
3806 2 64 17 73 89 -116 24 28 -49 63 -47 -27 31 156 -330 -211 98 292 139 3 -40 22 -76 42 47 -77
3831 -77 105 -65 50 46 -11 41 24 0 -34 -2 76 35 68 5 131 -101 -42 50 24 63 -6 -70 29 2 -103 81 -24
3858 -24 -1 37 28 -15 -27 -9 93 89 -8 11 71 -23 38 -153 -43 58 -105 -3 76 -132 -97 71 -91 78 -42 -24
3884 -24 145 -167 -82 -11 36 -8 23 -146 49 39 -30 48 55 -84 -5 -106 -23 44 -37 83 39 1 -32 76 -47 89
3910 89 -17 12 32 -43 100 22 -99 -46 24 85 -29 161 -32 85 23 -34 68 12 99 -33 -147 219 10 -76
3934 -76 -20 37 -33 93 200 -102 -46 74 -65 -28 -203 -38 21 -36 52 2 -4 -4 78 -6 -43 -35 43 -12 -72 43 27 -55
3962 -55 10 -141 71 84 69 88 -27 -97 19 -43 -9 55 -139 -109 111 -151 -36 -60 -24 13 79 -71 45 -24 108
3987 108 100 -72 53 -8 -10 -11 1 -31 -37 73 94 78 18 -121 -7 -42 -4 8 -90 112 83 -2 119 -5 50 62 6 -39
$$ packed form
3806BO2m7N6J6k05J40Mp7J12j10K0N8J25m86J19L09J94j53j36m3O2r8J18Nj24
3831g7J82j70J15mn7N2j7k4l4L2P8m1L3o3J26k32N9R2k6L9o9o4R9k7j05J84j05
3858b4K3L8rm3j2J8J02mr7J9O0r4O1j91J10J01j63J02P9k08L5J68j62J69j20J8
3884b4J69l12Q5P1M7m4L1j69J95j0o9P8Pj39P9j01Q3O7q1J20m4l8l3J08j23J36
3910H9j06K9K0p5J43p8j21N3P0O1j14J90j93J17o2n7J02n6Q7j32j14L66k09q6
3934g6N6N7p0J26J07l02N6J20j39L7j75J65N9n7Q8n0o%Q2q4l7QP8n5o0J15j6q2
3962e5O5j51K12J3j5J9j15p0J16o2L4O4j94L0K20k62J15k4L6L7O6j50J16o9J32
3987A08qj72J25o1kjJ2l2oJ10K1j6o0j39J14l5L8J2r8K02k9q5J21j24N5J2n6m5
$$ plain form
4015 -39 151 -75 -48 79 24 48 139 -76 139 40 -93 0 -42 -41 -3 -117 -43 41 -58 -24 -54 -216 19 10 -43 132
4041 132 69 72 -9 14 -37 68 -25 -24 130 21 23 35 -116 21 -139 26 -67 -5 43 -60 -2 115 52 -56 90 -112
4067 -112 13 17 -66 26 13 -100 20 41 -55 56 78 -84 159 -98 16 125 -27 80 -72 -80 -68 -1 -34 -72 -75
4092 -75 39 65 37 73 43 37 46 -5 8 14 -114 3 1 9 52 -11 11 63 -6 -15 24 -76 18 66 -68 -116 -21 47 -58 -4
4122 -4 -130 -104 56 16 47 -72 -75 162 -9 -62 108 57 -8 60 51 -48 8 105 90 21 -188 123 -59 42 -126 -57
4148 -57 -61 47 185 757 -10 -241 86 15 -60 -15 -125 -52 4 -91 88 24 23 45 -76 -28 -1 -24 -33 98 -47 -11
4174 -11 -2 -95 31 7 26 80 -79 83 -35 -46 -35 -59 -83 -35 -60 28 68 164 18 86 -95 42 117 -46 -63 -35 -90
4201 -90 68 -116 -26 10 -97 3 -49 -65 -57 66 -88 -39 34 -76 -10 -94 -55 -39 -9 14 -23 -108 -15 41 -40 102 36
$$ packed form
4015c9J90k26K7J27n5K4R1k15K15r9j33R3m2JL8j14P4Q4r9L4l0j62K35rn3J75
4041A32o3Lq1K3n1J05r3JJ54j09KJ2j51J37j60J65r3O2M8j03N8J17o3j08J46k02
4067a12J25Mq3R2j3j13J20K1r6J11K2j62K43k57J14J09j52J07j52qJ2O7l3l8l
4092g5J14K6k8L6l0oRn1J3Oj28J17kQM3o3K2N2o9rL9j00R4M8j34m8R5O8j05N4
4122dj26K6J60m0L1j19lK37j71n3J70n1o5O8rr9N6R7j5o9k09L11j82J01j68O9
4148e7mJ08J38N72p67k31L27p1p5M5j10P3N6r5J79o4jK2j21M8K7k3rJ31j45L6
4174a1Rr3J26k4J9N4j59J62j18j1J1k4k4M8k5Q8M0R6j46O8j81J37P5j63j7K8n5
4201i0J58j84R0L6j07J00n2j6QJ23j54M9P3j10O6q4L9J6L0K3l7q5R3N6q1J42o6
$$ plain form
4228 36 -19 5 -33 9 15 -105 -119 55 -51 -24 -87 32 -51 -87 -26 49 -76 -81 -22 42 33 48 -71 16 65 -15 49 -18 -50
4257 -50 191 -9 15 65 -96 40 96 -69 -21 94 -38 -70 15 -115 125 21 -55 91 -38 -8 62 -71 -59 2
4281 2 89 46 -58 69 -19 -105 -15 73 131 82 99 -130 31 79 -35 -70 126 -2 -5 -98 -77 -25 -22 6 103 47 -17 52
4309 52 -23 120 96 27 26 6 7 46 -163 -2 22 45 -56 36 -23 3 31 -156 11 -33 42 -4 -113 68 -13 -31 27
4336 27 25 -101 -9 2 14 -73 24 -18 -15 0 27 -90 -13 -71 -42 -103 -86 -12 -90 124 -80 -62 -47 68 118 -28 -50 50
4364 50 -53 -98 34 28 -10 -10 -104 143 -40 67 88 -81 9 156 -62 69 61 1 -24 -50 128 -2 91 -50 140
4389 140 -21 -14 27 15 14 25 -66 110 -8 40 93 -4 46 -21 -66 -122 46 -75 -73 22 -96 -23 -9 -26 -35 40 58 2 58
4418 58 47 -27 -76 120 -77 -21 -11 -9 -10 -85 -114 128 95 -127 -12 73 72 57 124 -60 13 -42 -34 -21 -76 -65 -1 -36 -52
$$ packed form
4228C6n5K4l8M2Oj20j4J74j06K7o3J19q3l6O1P5j25nN9O4rJ5j19Q7M9q0O4o7l2
4257e0K41k00K4N0j61J36N6j65M8J15j32l2Q5j30K40j04p6J46j29L0P0j33J2O1
4281BQ7m3j04J27q8q6R0Q8N8m9J7k29J61M8j14l5J96j28lr3K1N2LK8R7n6o4O9
4309E2p5J43k4o9jk0JL9k09J61K4K3j01R2n9K6K8j87J67m4P5m6j09J81q1j8N8
4336B7kj26R2J1J2q7R7m2LJ5K7j17P7n8K9o1J7P4p8K14k04J8J5J15N0j46k2J00
4364E0j03m5J32ol8%r4K47j83J07K1j69R0J47k18J31qo0k5k6J78j30R3j41J90
4389A40j61PM1j2jJ1r1J76j18M8N3r7N0o7m5n6J68j21KR5j18P3J4j7rP5J8n6N6
4418E8j1p4m9J96j97N6J0Kjp5k9K42l3k22J15Q5jj5O7j84P3n5QJ3n5J1O4l5j6
$$ plain form
4447 -52 -40 -37 -31 -52 -53 12 -43 -62 -139 -65 -90 1 -25 -76 50 -94 20 -91 66 87 -97 -47 73 53 36 -30 -21 12 57
4476 57 -92 23 61 36 119 -69 104 88 -94 63 -19 -194 51 76 -70 -20 2 -69 100 50 -26 21 67 -13 38
4501 38 18 57 -55 -24 -48 -2 45 69 -106 104 49 -1 30 -50 -35 214 -168 -15 32 -149 -2 -19 50 -94 28
4526 28 -45 -25 31 -93 20 27 -94 77 -27 -52 -19 13 118 -79 52 -8 15 -39 -48 -63 0 36 -46 169 -127 56
4552 56 18 76 -53 52 -98 -39 42 -112 -19 62 18 -2 11 12 -29 -50 -57 52 -20 -71 38 -61 11 2 -44 17 -16 26 -20
4581 -20 -70 -60 -67 3 7 -5 -19 14 -56 18 -38 29 17 64 -50 12 10 39 87 88 -184 -18 27 -26 76 14 73 -1 -73 -34
4611 -34 -4 -84 -25 24 -81 46 -115 -27 44 -80 -16 -143 -4 -50 -15 0 61 50 -97 18 81 -92 32 56 75
4636 75 85 -69 80 -17 32 -47 -66 -51 40 -79 -59 -30 -2 -16 -74 -61 145 -79 75 28 -141 -8 24 64 -50 76
$$ packed form
4447e2J2LOk1jO5n5j9p7P4k5R1k6n1J26j44J14j11J57K1j84N0J20k0j7o6RL3M5
4476E7j49J15L8k5Q3j88J73j6j82J57q2j75K45K5j46N0K2p1J69n0p6M7M6q0N1
4501C8k0L9j12L1k4M6M7K4j75K10n5n0L1q0J5K49l82J53M7j81J47j7O9j44J22
4526B8p3K0N6j24J13Pj21J71j04k5L3L2J05j97J31o0K3n4rj5O3L6q2K15k96J83
4552E6l8N8j29J05j50N9Q1j54R3Q1m4k0J3Jm1k1pJ09p2n1J09r9P2rm6O1l3M2m6
4581b0n0J0pP0Mj2j4L3p0P4n6O7j2M7j14O2kK9M8Jk72J66M5n3J02o2N9p4p2L9
4611c4L0q0N9M9j05J27j61Q8P1j24O4j27J39m6L5J5O1j1j47J15O3j73J24K4J9
4636G5J0j54J49r7M9p9j9J5R1j19K0K9K8j4n8J3K06k24J54m7j69J33L2M0j14J26
$$ plain form
4662 76 1 -77 40 88 104 -58 -9 15 -5 -124 31 45 -4 85 -17 71 38 -76 13 -57 22 75 -50 1 -60 77
4688 77 42 -13 31 18 -10 -9 52 -84 73 59 -61 17 -33 118 -16 104 68 79 37 -82 -58 -17 -119 38 19 -62
4714 -62 -56 36 -1 -46 -144 50 18 42 5 -57 -14 -21 -41 -44 132 -95 -24 31 -62 31 -55 160 -6 79 157 0 -51 -17 7
4743 7 -33 -62 45 -27 -50 69 -90 48 -90 150 47 83 44 20 41 -6 46 48 74 16 -84 2 51 47 17 -62 107
4770 107 -34 -16 -60 -12 -39 131 -27 28 10 2 -59 37 4 -113 78 81 140 12 63 25 27 73 46 -100 -38 34 -69
4797 -69 5 -31 -47 46 63 -5 -50 -23 132 -50 -1 -31 -22 4 -58 35 -66 67 -147 -19 95 2 124 -27 70 20
4823 20 -61 54 58 -153 86 40 -23 -65 45 54 -12 -9 -65 -2 -72 -113 -51 70 -5 -30 -52 139 25 -50 51 53 -61 49
4851 49 94 -25 -69 -113 28 7 79 30 4 -4 69 49 -14 1 27 16 -51 -94 95 32 -132 -43 66 66 -15 -38 25 -108
$$ packed form
4662G6p5p8J17M8J6j62M9K4k0j19J55J4m9Q9j02Q8l3j14Q9p0P9N3j25N1o1J37
4688G7l5n5M4j3k8JO1j36J57j4j20P8n0J51j34J20l6J1m2j19K4M1j02J57j9q1
4714f2OR2l7m5r8J94l2K4l7o2M3pk0lJ76k27P1N5r3R3q6K15j66Q5P8j57n1L4K4
4743Gm0k9J07p2k3J19j59J38j38K40j03L6l9k4K1m7N2KK6n8j00Q6M9ml0p9J69
4770A07j41J8m4M8k7J70j58N5j8qo1R6l3j17J91LN9j28N1l8KM6k7j46O2P2j03
4797f9P4l6j6R3J7o8m5K7J55j82M9l0RK6o2R3j01J33k14J28J14r3J22j51R7n0
4823B0q1J15Mk11K39m6o3m2J10Ro6Ln6O3p0m1O2J21p5k5k2J91j14p5J01Kj14J10
4851D9M5j19m4m4J41k1P2m9k6qP3k0o3J5K6j1o7m3J89o3j64Q9J09%q1k3O3j33
$$ plain form
4879 -108 60 -36 33 9 65 -23 63 28 58 -30 -37 -78 13 -24 -3 14 134 35 -24 8 -67 44 -15 -4 11 -19 -72 -35 -60
4908 -60 17 -142 8 42 106 6 17 -54 -3 -102 27 20 -4 -61 19 76 0 -49 -63 -64 54 -21 3 116 -73 -35 -33 40
4936 40 -44 8 -15 62 -31 -33 7 -18 11 82 -59 87 47 35 -36 -61 -84 -80 -54 44 10 -83 15 -9 -22 127 0 -30 28
4965 28 36 81 53 6 -53 22 73 44 -33 43 108 -53 16 38 -37 49 -18 33 -30 -21 -20 -9 119 -12 89 -27 22 28 36 -11
4995 -11 -9 6 93 51 -33 143 -19 -113 50 83 -90 -4 42 77 10 -164 -24 15 -40 67 -26 55 23 130 -2 -37
5021 -37 44 -27 132 33 138 19 69 70 37 -48 72 -45 -2 9 4 -157 -79 52 56 68 13 -4 -34 6 -26 -43 25 5
5049 5 -22 -123 39 0 73 -10 49 -7 10 -15 41 63 -37 58 83 85 68 -104 69 1 -13 13 -35 19 -46 -123 -8 -46
5077 -46 -11 42 -49 -25 -151 -86 82 69 57 7 -14 5 13 113 -111 -30 -110 22 124 -73 67 70 57 17 109 62 -48
$$ packed form
4879a08J68r6O9k4N6q8Q6l5L0q8pm1R1l7K1J7J20r9n9L2p5J11n9J1J5l0n3L7k5
4908f0P7j59J50L4O4j00J1p1N1r9J29pk4n7Q0N7p6m9j4jJ18p5K4J13j89L8KP3
4936D0q4N2k3P7r3kM0k5K9P1j41J46m0j2p1k5k3MK6R8l4r3R8k4j3J49j27l0N8
4965B8QM5k8m7n9P5N1k9p7P6O5j61O9K2p5Q6o7N1o3RJJ1J28j31J01j16M9OQm7
4995a1KJ5Q7m2q4J76j62r4J63L3j73Q6M6L5o7j74J40L9n5J07r3Q1l2J07j32l5
5021c7Q1p1J59r9J05j19N0Jl3q5J20j17M3J1nj61P8J31MJ2n5j7l0M0l2j7O8k0
5049Ek7j01J62l9P3q3N9n6J7k5N6K2j00R5K5Kj7j72J73o8j4K6m8N4o5p7J15l8
5077d6L5N3r1K4j26O5J68j3j2n0k1J9QJ00k24Q1q0J32J02j97J40Lj3m0R2m7j10
$$ plain form
5104 -48 -35 18 70 21 23 74 24 -6 -27 100 -83 -13 -79 3 -13 23 6 -50 16 -19 79 -3 94 111 -114 35 -102 18
5132 18 -34 -91 -22 -17 55 -13 51 101 90 -82 -12 23 3 114 29 24 -3 13 -1 26 -11 -81 -2 5 -23 99 -102 30 39 -21
5162 -21 -28 1 -43 -55 23 39 -11 -33 -19 -19 -86 -45 -37 -96 32 -126 -101 -19 -21 15 4 -25 52 67 -22 -49 8 -7 97 -75
5192 -75 -28 -84 50 40 -54 -75 15 -13 -176 -79 31 100 57 36 -71 3 3 93 -113 5 77 45 72 -29 -3 79 128
5219 128 107 98 23 89 95 31 -145 -72 62 -28 9 -28 20 18 8 38 49 8 -40 -158 36 29 -14 -22 47 -17 35 -45 -37 -41 50
5250 50 -6 -14 -75 -16 136 69 -28 -21 -27 33 -52 -39 -156 14 -7 48 44 24 -48 90 -49 2 167 39 79 -21 -78 36
5278 36 -11 128 -71 -8 0 -97 27 64 -47 81 91 -103 64 92 1 -83 -137 -11 -107 74 -37 79 21 -25 -19 44
5304 44 -33 -78 51 -23 20 79 22 3 -10 2 35 52 -11 52 -66 -21 23 17 87 12 -100 -70 -57 -95 98 45 10 -36 14
$$ packed form
5104d8J3N3N2m9KN1n0l0k1J27j83P0o6Q2j6L6j7n6O6l5R8q2R7J7k25J49j37J20
5132A8n2n7O9NP2o8O4N0j1j72P0L5k0J11q5nk7J6j4K7l7p0P9Pk8J22k01J32Ro0
5162b1pK9m4j2P8J6n0k2J4%o7M1Qn9J28j58K5Q2kL6j1k9P7J5q9k7N7j5J04j72
5192g5M7n6J34j0r4k1R0k8j63R7J10O9m3k1j07P4%R0k06J18P2l2K7j01K6Q2M9
5219A28k1rp5O6Oo4j76P3J34r0L7l7M8kj0L0J1m1m8j18J94pm3qO9o4N2q0QmR1
5250E0n6qo1N9J52o7r7PoO0q5J3j17J70k1N5mk0p2J38j39N1J65j28M0j00n7J14
5278C6m7J39j99O3Qr7J24L7j11J28J0j94J67K8r1q4n4J26r6J81j11J16n8m6OO3
5304D4p7m5J29p4M3N9n7j9j3J2L3J7o3O3j18M5M4oP0p5j12L0J3l8J93n3l5m6N0
$$ plain form
5333 14 -47 -40 58 -138 78 -114 -104 -26 31 -73 4 -39 -25 147 135 -36 -61 61 115 33 -8 -49 -106 62 2 -11 106
5360 106 -20 -144 5 -71 73 23 85 -7 40 16 -1 -9 -92 27 -44 68 36 4 -54 -97 -3 22 17 18 28 101 57 -2
5388 -2 5 66 -17 -31 -20 28 0 -26 31 20 17 12 -82 8 -33 65 -67 17 -1 86 0 4 78 0 -8 41 -172 92 32 -5 77 53
5420 53 5 51 -23 -14 -36 11 61 -122 89 -25 63 33 -3 89 -32 -157 -99 -115 -18 162 -27 -78 -6 -35 -14 61 61 20
5448 20 93 -64 64 -29 -120 -5 18 24 22 4 151 43 -57 47 7 -35 -75 2 55 24 66 -12 -135 99 87 66 107
5475 107 34 26 -22 -30 71 38 -13 -90 17 -23 31 23 53 81 -159 -19 -23 -76 -83 3 -15 -20 3 80 -80 -66 -20 -109 25 95
5505 95 31 35 55 12 83 -28 -31 -86 50 78 -77 93 -21 41 31 100 45 -71 -44 -24 -24 -13 -29 21 -36 4 58 -48
5533 -48 54 -55 -64 39 -18 -123 -47 23 84 -60 -6 -38 14 33 49 -48 -5 -101 39 -1 70 -42 64 -65 0 34
$$ packed form
5333A4o1PR8j96K16j92J0P8N7j04P7m3J4J72j2j71k5J22N4q2m1m1n7J68o0j3J17
5360A06j26j24J49p6J44n0O2r2M7k4j7qq3J19p1J12l2l2n8m3R4K5nJJ0P3m4n9
5388bPO1q3j4J1M8k8k6N7j1lnr4R0m1R8j32Q4j8Q7q6MP4p8qM9k13K64o0l7Q2k4
5420E3m8M6p4Rk2M7N0j83K11j14Q8l0l6R2j21j25N8j6R7J80j89n1P2k9K1P5%m1
5448B0P3j57J28r3r1J15K3Okj8J47j08j00J04m0m2m0P7N3l1M2p8j23K34j2k1M1
5475A07p3qm8qJ01l3n1p7J07m0N4qL0K8k40J40mn3pQ6j8nK3P7j60J4M6q9J34P0
5505I5o4MK0m3P1j11ln5J36K8j55J70j14O2j0O9n5j16K7K0%J1j6N0n7M0N4j06
5533d8J02j09rJ03n7j05P6P0O1j44N4l2N2J9J6r7M3r6J40m0P1j12J06j29O5L4
$$ plain form
5559 34 2 20 63 22 139 24 -23 57 34 9 -60 4 2 -90 13 19 -29 27 71 188 4 -36 -37 103 -39 -57 38 26
5587 26 8 -38 -87 -22 -27 36 -100 -97 -11 11 -12 45 -14 -136 35 11 2 -83 33 -44 5 -15 -87 -1 136 -1 -47 -21 -103
5616 -103 -13 49 -11 -85 -42 20 118 79 -12 -1 -4 23 -84 -52 61 -111 118 -26 -2 -28 70 -6 34 22 -47 -9 -11 -53
5644 -53 21 28 -8 54 8 -73 15 -101 49 56 76 -14 -16 -14 49 -60 59 83 55 21 84 -122 -33 -64 -18 59 -96 109 51
5673 51 -42 67 -45 -32 76 -88 -64 65 15 -38 -63 25 24 -26 -35 92 23 -42 -10 17 -38 30 49 -17 -72 85 1 58
5701 58 24 15 77 -102 4 58 -12 -48 7 27 -46 -13 -130 -3 -133 70 -114 59 32 -27 138 -44 78 -101 7
5726 7 95 51 -91 66 5 46 -43 1 -42 81 4 19 43 -69 -21 -79 67 58 -17 18 36 -95 21 25 -20 -6 114 41
5754 41 -55 9 33 5 0 70 96 53 67 21 21 106 40 -38 -36 34 -21 -39 -8 80 25 -3 59 82 -69 60 66 -119 110 -18
$$ packed form
5559C4l2J8M3m1J17j15m7Q0k3k5o9O4kr2J03Om8N6M4J17j84m0jJ40j42j8R5j2
5587B6j8m6m9O5nO3j36LQ6K2k3N7n9j22J71k4rq5J16p7M9k0p2Q6J37j37m6K6q2
5616a03R0O2o0p4M3O2R8l9r1J1lK7j07L2J13j72K29j44K4k6R8p6M0j2o9L8km2
5644e3P4Pl6O2m6q1Q8j16J50PK0r0kKO3j09J19K4k8l4O3k06Q9l1M6P7j55K05n8
5673E1r3J09j12J3J08j64K4J29n0n3k5Q8jn0rJ27o9o5L2K7n5O8J9o6n5J57q4N7
5701E8l4rO2j79J06N4p0l6N5K0p3L3j17J27j30K03j84J73k7n9J65j82J22j79J08
5726GQ8m4j42J57o1M1q9M4m3J23p7J5K4j12M8n8J46rp5L5J8j31J16Mm5J4J20p3
5754D1r6O4K4k8nP0K6m3J4m6%Q5o6p8KP0n5j8L1Q8n5k8O2K3j51J29Oj85K29j28
$$ plain form
5784 -18 30 38 -19 -17 -38 -48 -61 63 58 51 -60 33 61 -13 -17 42 -44 -68 -16 -66 136 65 107 -97 -137 -12 39 11 -69 109
5814 109 -37 -89 117 -2 14 5 -35 -69 -47 -84 13 97 41 -13 -42 16 -11 69 -20 30 57 -39 36 -32 -69 54 -1 -23
5842 -23 29 -18 14 -23 -66 20 208 -22 -64 -33 26 15 -30 47 91 81 114 141 -8 -9 -16 162 48 162 -12 108 -25
5869 -25 22 -54 -25 30 -30 38 -4 -13 -149 -22 -90 -51 18 -32 158 -29 6 -3 105 64 98 -16 -5 139 31 -54 38
5896 38 -1 20 79 -4 -74 -38 50 -4 -48 26 -80 -37 -18 84 4 75 14 -82 -8 55 -46 -77 -44 -123 76 -15 29 77
5924 77 70 -31 -41 -10 -150 24 -24 103 33 88 89 3 11 41 -13 69 4 -23 -24 -36 -87 47 -78 48 -103 -56 50 2
5952 2 -27 16 67 -74 -39 -111 -61 18 5 -8 -14 73 39 26 6 -67 -42 6 101 -36 -51 -48 46 -18 -71 47 69 -77 79
5981 79 -51 40 3 -77 -18 59 112 147 188 113 33 67 -63 -13 -11 -24 -34 58 121 17 8 18 -80 -65 108 -15 -34 -67 -149
$$ packed form
5784a8M8Qn7Kk1j0j3J24npj11R3K8p4mN9q6k4N2n0K02p1M2k04m0J25N1k8q0J78
5814A09j46n2K06j19J6rm0l4K2l7R7Q4n6n4k9N8k7Q0q9N0K7r6P5o8l7J23n5k2
5842b3N2m7L2l7m3Q6J88k30m2L1N9j1m5P7M4j0L3K7j49jpJ78j14J14j74J20j33
5869b5M7p6K9N5o0O8m2rj36J27o8L9O9n0J90j87L5rJ08m1L4j14J1J44j08q5R2
5896C8l9K1N9q3p0L6Q8n4m4P4j06M3J9J02q0P1o1r6P4O3j01l1L3p9J99r1M4M8
5924G7pj01j0L1j40J74m8J27p0N5Jq6QL0n4Q2o5k7jj2n1J34j25J26j51M7J06m8
5952Bk9M3N1j41L5p2N0P9j3j3oQ7l4j3k0p3K5M8R5j37j5LR4o4n3J18K2j46J56
5981G9j30R1l7q0N9P7N3L5M1p5q0L4j30N0Kj3j0R2O3j04rJ0r8J5J73j23j9l3q2
$$ plain form
6010 -149 -20 -59 -31 14 1 45 77 -28 -158 86 -37 2 -108 8 25 -95 -81 -22 105 99 -21 12 -96 11
6034 11 -50 -39 2 72 -90 -115 -25 23 25 119 -104 14 27 8 32 42 -83 80 -42 18 -39 -59 -94 170 -32 -41 5
6061 5 -136 -73 22 21 -14 67 -21 -53 5 106 -94 -19 -82 -4 -106 54 100 49 1 6 -10 112 65 -58 -14 -112 -1 -56
6089 -56 -30 12 -9 -116 128 -48 2 51 23 23 -65 39 44 47 57 -64 43 83 23 -5 48 -9 34 -108 23 -13 64 15
6117 15 111 -49 61 -70 -180 34 179 3 -7 60 -48 -13 -1 -117 36 28 -20 58 -77 40 38 -68 -49 33 -44
6142 -44 91 121 61 -27 -46 -33 29 -120 -79 81 -25 49 -74 -23 48 -11 29 29 9 -91 23 12 -19 17 16 6 35 34
6170 34 40 -35 -27 18 13 45 76 -58 -3 -64 24 53 3 -18 101 -100 42 91 -80 -18 44 -88 30 -4 19 -82 -86 31
6198 31 4 -13 -83 0 63 -56 41 -6 92 -25 52 -97 -55 -97 47 -21 -56 63 47 -16 -2 -77 -57 -20 80 -6 69
$$ packed form
6010a49J29l9K8M5j3M4L2j05j30K44j23L9j10J16J7j20J4N9J27oj20L3j08J07
6034A1o1J1M1P0j62k5R0M8KR4k23J18J3j9K4J0j25J63j22O0n7k0l5K64k02rM6
6061Ej41O3R5jl5Q1q8l2N8J01k00P5o3P8j02J60M6n1m8Nj6J22m7j23M4r8J11n5
6089e6K6M2k1j07K44j76N0M9k8%q8J04NLJ0j21J07M0o0k8N3n7M3j42J31l6P7m9
6117A5R6j60J10j31j10K14J45j76j0O7j08L5J2j16J53qm8P8j35J17kj06J9Q2p7
6142d4J35L0o0q8j9J3O2j49M1J60j06P4j23N1P1n9M0%k0j00J14j1l1L6jj0K9j
6170C4Op5QM5nL2L1j34N5o1Q8K9n0k1J19k01J42M9j71O2O2j32J18l4K3j01mJ17
6198C1k7j7p0Q3O3j19R7m7R8j17P7j49M2m2J44o8l5J19j6o3J4p5K0L7J00q6P5
$$ plain form
6225 69 -39 35 -142 -74 -60 21 -99 54 8 52 -32 -40 -78 -73 -41 10 -51 -95 70 -52 -98 -172 -47 26 23 -8 69 -12
6253 -12 -72 45 34 119 -70 45 29 -91 1 41 -2 -26 86 -42 -81 -139 -180 21 47 97 -89 -26 13 22 -7 -86 29
6280 29 3 -22 -1 -61 -8 21 31 18 77 41 -27 8 26 -122 44 49 -74 -52 82 -58 -29 15 24 27 -20 -94 13 120
6308 120 45 58 19 20 -6 -56 188 -39 -100 -28 34 143 89 -96 6 -64 -68 48 68 -20 -40 120 -36 48 99 -100
6334 -100 -88 -34 17 2 77 101 9 -91 -3 45 101 12 -34 74 -29 -55 66 -3 -16 36 -39 63 24 61 55 39 -19 -12
6362 -12 76 -43 -51 89 24 -52 77 19 27 9 -70 -20 -35 -26 18 65 55 -106 -47 8 -53 -14 14 -92 19 44 23 51 -17
6391 -17 -42 -5 98 -2 0 -61 67 -39 -61 64 -4 33 -65 60 -61 35 -48 -36 -16 12 -35 48 1 39 31 -3 -28 -26
6419 -26 60 22 -46 30 -26 -42 36 71 -9 -50 -117 36 39 69 81 -64 9 -8 154 24 -2 5 26 55 -4 -19 19 0 -41
$$ packed form
6225F9j08P4j77O8J4Q1j20J53m6M4q4ql8NL2N1o1m4J65j22m6p4J25P3ll1P7q1
6253a2o0J17j1Q5j89J15j6j20R2M0m3k4J12j28l9n8m1K01K6N0j86O3L9Rk9p9J15
6280B9k6k5K1o0N3K9J0j3N9l6o8L5J8j48J66Nj23K2J34j40K9M4RLm7p4J07J07
6308A20p5J3l9Jk6n0K44k27o1P2O2J09n4j85J02p0mJ16K0q8k0J60j56Q4N1j99
6334a00J2N4N1j5P5K4r2j00Q8M8N6q9m6J08j03k6J21o9j3N2p5J02l9L7oj6n8P
6362a2Q8j19qJ40o5p6J29n8Qj8p9N0j5RM4M7j0j61N9N5o1L9K8j06J11K5k1K8o8
6391a7k5L7J03j00Ko1J28j06k2J25o8L7r8J25j21R6q3J2K0K8m7Q3m7L8ql4k5K
6419b6Q6l8o8P6n6j6P8L5q0m1o7J53LL0J2j45P3j7J62j30k6PK1K9n9j5L8j9m1
$$ plain form
6448 -41 8 -107 -42 -64 124 9 -20 22 -13 43 17 -77 46 26 -22 -67 -82 -33 5 28 35 59 37 -51 57 152 45 -40
6476 -40 10 -13 11 42 58 50 62 57 18 100 -29 28 -37 -16 -53 -109 111 -59 -20 38 3 -69 48 -9 7 -80 36 -2 -81
6505 -81 48 -7 -73 -79 -82 -11 43 -9 53 -29 49 -67 -39 45 97 35 -8 16 70 -71 12 69 51 -98 97 -22 3 34
6533 34 85 70 -65 -132 147 50 -122 13 -21 -37 -39 -7 -18 -20 -79 13 -8 90 -20 -31 82 -87 -108 -19 -25 -48 2 -2 -34
6562 -34 55 83 -2 -10 -29 90 -51 -38 -38 50 21 -27 -27 -14 29 64 66 7 -43 -15 -77 -48 23 0 -38 9 -30 28 38 20 -8
6593 -8 -3 -13 -66 61 32 9 70 -52 -49 55 -53 3 20 31 127 -38 80 26 -1 -46 -25 -54 -12 35 18 -47 14 -16 8
6622 8 53 22 75 -69 5 -27 111 -34 70 0 -56 52 -8 -1 -47 55 5 3 24 21 91 -47 44 43 -19 39 20 -4 -12 62
6652 62 14 38 -55 1 -37 -76 141 116 2 57 -10 -47 129 -2 34 -48 49 15 26 -87 59 35 87 -20 -2 3 97
$$ packed form
6448d1M9j15O5k2J88j15k9M2l5N6k6r4J23k0m8m5j5M9L8K3PK4k2q8J08R5j07q5
6476d0N0k3K4L1J6qJ2nl9Q2j29N7o5K1l7n6K20j70L9N8l5p2J17n7J6q7J16l8p9
6505h1J29n5o6olP1N4n2O2q2P8j16K8Q4N2o2m3K4N4j41Q3N7j8j49J95j19K5L1
6533C4N1j5j35o7K79r7j72J35l4j6kL2j1kn9R2k1R8j10j1J13j69k1Q9ok3N0ml2
6562c4Q9K8q5qj9J19j41J3%Q8k9m8%J3M3L5Kn9n0K8o2K9P1k3l8M7l9N8J0j8k8
6593hNj0n3J27k9k3O1j22LJ04j08N6J7J1R6j65J18n4k7m5K1k9M2M7j7o5O1l0K4
6622HM5l1N3j44P4l2J38j45J04p0n6J08o0Pm6J02n0kK1lP0j38R1jo2N8j9k4qP4
6652F2m8K4r3N6l8l9K17k5j14N5o7l7J76j31L6q2R7l4J1j13J46k4N2j07J8NR4
$$ plain form
6679 97 -21 19 22 -41 17 -87 104 -40 -62 71 -38 -61 -6 -42 -32 3 -30 80 -67 31 83 -46 -32 61 2 -82
6705 -82 59 93 -2 7 16 -47 -97 62 24 -133 67 24 -57 71 9 -17 27 -1 -23 9 4 14 -38 -43 -80 58 39 -29 -58
6734 -58 110 60 -9 -66 -11 -42 -21 104 84 -38 129 47 -8 50 92 -64 -50 19 90 -57 -49 -125 -3 0 23 38 -31 -64
6762 -64 -69 8 -12 -139 -12 -49 74 -36 -84 -50 30 -5 21 -18 -31 172 -12 -22 -104 128 -28 -38 -59 -83 95 54
6788 54 -53 -30 -61 -74 -59 -6 19 39 112 38 -91 -31 146 -45 95 9 -26 71 57 -54 -60 16 29 -71 123 116 -59
6815 -59 20 -8 34 35 -63 -61 32 3 -27 -40 -46 64 7 9 0 -67 -87 69 34 -75 6 -19 -83 33 -39 30 22 -105 -10 -35 -44
6846 -44 -139 117 36 32 -2 -70 -56 0 -23 71 116 -53 13 -136 -24 5 -2 95 55 3 -73 45 -3 -20 -23 -86 46 32 -63
6875 -63 54 27 30 46 48 181 96 -39 -23 -60 -77 9 -35 -5 -57 119 -122 -114 -66 86 -112 -13 49 -15 68 -35 29 137
$$ packed form
6679I7j18M0Lo3N8j04J91j44k2J33j09k3N5l6J0L5l3J10j47R8N2j29J4R3n9q4
6705h2J41L4r5RRo3n0J59l8j57K00m3q1J28o2k6M4k8k2L2nJ0n2nl7J38j9o8k9
6734e8J68n0o9n7N5l1K1J25k0j22J67q2n5N8M2j56J4O9P1j47Qp6J22LK3J5o9l3
6762f4nP7k0j27J27l7J23j10m8L4Q0l5K6l9j3K03j84j0q2K32j56j0k1k4J78m1
6788E4j07K3l1j3J5N3K5K0P3p4j29O0J77j91J40q6l5R7j4j11oP6J3j00J94pj75
6815e9P9k8M2Jr8KR3k9l0j3oJ10n7Kro7k0J56l5j09Q1k5o4J16p2O9qj27R5k5r
6846d4r5K56q1ml4o8J4N6k3R4M5j69O6j49J12K9pR7m0n2p6J18m8j7lo3J32j4r5
6875f3J17k7LJ6KJ33q5j35J6l7j7Q6m4L0n2J76k41QM8J52j98R9O2o4Q3j03O4J08
$$ plain form
6903 137 -7 9 47 -130 -15 -59 -31 44 -72 -33 127 -34 24 -16 -25 -70 1 33 22 -26 -97 64 -78 67 -28 -53
6929 -53 -45 -32 32 -18 56 -6 3 42 -3 123 26 54 -34 28 16 8 -52 -3 39 -36 -58 6 -96 7 -2 13 15 9 14 69 -84 74
6961 74 84 -29 -68 -28 36 90 41 19 6 -2 -15 57 -75 -16 61 -37 -7 18 5 37 43 115 -35 -17 53 64 -96 -8 55
6990 55 -95 39 -45 56 8 37 -112 -19 -3 87 56 44 80 -8 -152 70 54 -57 1 -24 43 29 42 11 124 -6
7016 -6 106 56 6 -8 -5 30 10 -21 -33 5 14 -29 85 24 -44 -51 -12 -70 90 -77 -71 24 -31 15 -79 -3 2 -33 -104 -43 -23
7047 -23 -34 54 62 27 -48 -8 -20 -9 79 45 140 25 -85 -7 -48 -28 -3 -10 -37 116 15 52 82 25 114 -27 68 67 74 -28
7077 -28 23 -36 79 -14 16 -10 -61 -54 84 24 14 -4 -181 -161 -15 53 3 84 -34 64 103 -87 166 -264 -278 -72
7103 -72 -3 -2 2 -8 63 22 63 75 64 20 -69 16 4 -7 -43 52 12 48 110 25 -102 88 -91 -77 72 1 15 99 66
$$ packed form
6903A37j44J6L8j77J15m4K8P5j16L9J60j61N8m0rm5P1L2j1m8p1J61j42J45r5k5
6929e3QJ3O4n0P4o2RL9m5J26r7K8q8O2j2qo0M9M2p5k2O4j02J03rJ5KoNN5j53J58
6961G4J0j13l9M0O4N4m9k2j3qj3P2j32N9P7r8L0K5j3L2OP2j50J8P0J1j60Q8O3
6990E5j50J34q4J01m8K9j49R3J6R0l1j2L6q8j44K22j6j11N8k5O7j4J3l1J13j30
7016fJ12n0n0j4LL5k0l1j2L8Rm3J14o1o8pL9n8J60j67OR5n5M6r4P6Nl5p1O1K0
7047b3j1Q8Ql5p5M0j2J1Q8l4R5j15j10P8m1K0K5pk7J53j01L7L0n7Q9j41R5jPj02
7077b8N1n9J15r3L0k6n1PJ38o0j0j8j77K0J46O8n0Q1j18R8L9j90K53m30j4K06
7103g2O9JMj0P1m1M1J2j1m4q9Q5j2j1l6R5m0L6O2q5j27J90j79J4J49p1J4Q4l3
$$ plain form
7132 66 -91 -27 -45 -61 -36 -57 -1 4 2 -39 93 34 -6 25 -54 -10 7 -6 36 102 -80 -6 -112 26 39 -38 37 -68
7160 -68 -5 -32 91 -47 -120 -25 31 -86 29 42 -25 29 55 19 -96 9 94 -19 -41 4 -24 35 89 7 -53 -8 136
7187 136 -146 143 13 -67 -7 -39 69 -43 -35 -11 121 37 -25 -13 5 -53 53 89 42 27 -47 -62 -76 12 -84 10 -101
7214 -101 92 -57 -45 10 -12 71 51 44 -87 192 -117 -167 65 7 -43 14 24 66 -73 44 25 11 74 30 -27 101
7240 101 23 -73 -58 29 34 29 -43 -19 99 -36 -14 33 -36 -4 -70 -25 109 21 4 33 -24 -75 -12 -81 7 95 -101 -33 -61
7269 -61 -46 -20 43 -37 -5 -63 93 -7 -114 36 -13 3 -116 52 -56 8 51 -50 -52 -38 -1 18 48 -29 6 63 19
7296 19 43 -35 -122 53 39 -77 10 -66 9 -42 3 34 27 -115 -42 47 10 42 -25 132 -24 31 -72 -22 54 67 -104
7323 -104 -209 33 -95 95 36 75 -78 165 -29 36 2 -40 -35 -21 -68 81 83 -7 29 -39 51 -14 -81 68 2 -88
$$ packed form
7132F6j57O4j8j6K5k1N6Nkm1J32n9m0L1p9M4J7j3M2O6j82P4j06J38J3p7P5j05
7160f8O3k7J23j38p3R5N6j17J15J3o7N4K6l6j15J05Q5j13k2M5k8N9N4q2o0M5J44
7187A36k82K89j30q0O0l2J08j12QK4J32q4o2J2J8n8J06L6m7j5p4j5j4Q8r6R4j11
7214a01J93j49J2N5k2Q3k0pj31K79l09n0K32n8n0N7J0M2j39J17j9j4O3m4n7J28
7240A01p8r6J5Q7Nnp2K4J18j35K2M7o9L2o6M5J34q8j7K9n7n1O3o9Q8Q8j96O8k8
7269f1J5K6O3q0L2n8J56j00j07J50m9J6j19J68j08O4M3j01kJ4L7J9L0p7L5N7m4
7296A9K4p8q7J75j4j16Q7p6P5n1M5L1pj42P3Q9l7L2o7J57j56N5j03N0P6J3j71
7323a04j05K42j28J90n9L9j53K43j94O5l4m2NJ4m7J49Kr0L6o8R0o5o7J49o6r0
$$ plain form
7349 -88 40 -35 -69 35 -84 128 54 -7 -63 -14 -144 62 -29 60 -65 17 -21 -31 62 46 -5 42 65 -10 -59 -6 -38
7376 -38 81 58 -8 28 -20 25 47 -90 89 21 37 5 -55 -88 -59 -14 45 45 24 -44 93 51 53 -43 102 86 -16 -14 17
7405 17 31 70 -61 -39 -93 20 32 -27 26 86 -17 -32 113 -10 16 64 -16 58 7 -109 19 -12 -15 -32 -19 -86 86
7432 86 -54 -21 -81 32 -70 20 -52 -5 -43 -18 -91 -6 -1 29 -10 -25 -99 49 -47 -4 7 -38 -70 40 -31 37 -69 350
7460 350 67 -121 75 20 -78 21 -94 15 53 -50 37 20 -58 41 49 -30 -2 -3 20 33 42 -67 -48 -1 -21 63 70 -87
7488 -87 120 -46 -3 11 -115 -24 -17 75 22 -36 -14 -25 34 -31 -97 45 13 -67 18 -22 21 -3 16 -84 42 -30 -7 -123
7516 -123 52 -62 -17 -42 52 -102 -53 -75 -46 -61 40 -18 16 49 -8 25 -10 5 -61 22 -91 4 60 112 117 16 120
7543 120 18 -61 -1 125 -19 -42 99 -61 -156 27 -44 29 11 3 8 39 -93 11 178 28 55 -42 45 -18 -9 15
$$ packed form
7349h8J28p5l4J04j19K12p4o1n6M9j30K06r1Q9j25Q2l8j0R3j6n1M7K3p5m9N3l2
7376c8J19k3o6L6m8M5K2j37J79o8J6l2o0l3K9M5N9%k1o8J37m2Kr6J45j6j02KL1
7405A7J4L9j31K2n4J13J2n9N3O0j03j5J45j23K6M8q0P4n1j16J28l1lj7J3o7J72
7432H6j40L3o0J13j02R0p2M7l8K5p3Q5NL0l9j5p4J48r6M3J1m5l2J10p1O8j06M19
7460C50k83j88J96n5r8R9j15J09L8j03Q7j7p8R9Qp9K8jK3J3Rj09J9M7k0Q4Pj57
7488h7K07j66M3J4j26R1PR2n3n8K2j1N9o5o6J42l2q0Q5m0M3k4J9j00J26p2K3j16
7516a23J75j14M5k5R4j54M9k2K9j5J01n8L4L3n7L3l5J5o6Q3j13R5N6N2Nj01J04
7543A20j02p9O0J26j44k3J41j60r5J83p1P3j8qNL1j32J04J67j50K7r7Q7o3RK4
$$ plain form
7569 15 -20 65 75 47 -24 46 -1 -51 -15 -9 -78 10 -17 -150 24 50 95 43 45 -91 27 -19 13 -4 21 -81 -48 43 -120
7598 -120 10 35 61 31 -11 38 -22 -5 -27 10 -43 32 -69 7 -16 19 2 -16 -84 203 -31 -35 -83 104 -49 58 -7
7625 -7 -96 41 -27 -12 -44 -102 39 -153 12 41 -66 6 -39 -120 -104 82 -70 -8 26 -36 -27 -16 -42 41 -93 -51 141
7652 141 55 52 44 3 -32 4 27 -77 107 21 -31 10 32 -6 100 32 -47 75 74 95 -21 52 -60 -21 11 -147 -22
7679 -22 14 29 82 -58 44 -19 88 98 -27 118 93 -115 38 31 48 -31 -41 7 -23 -51 18 -66 11 24 -35 7 1 46
7707 46 -127 -47 -104 -26 102 105 108 -25 91 16 62 32 18 29 -98 -54 93 -33 50 -27 -52 -2 0 1 16 -43 45 -4 19
7736 19 31 -141 75 52 0 -11 7 -23 -45 -14 9 -68 15 -116 17 4 -34 12 36 -38 -66 21 48 -45 -101 -51 -52 64
7764 64 -128 -29 45 -57 -83 -9 30 33 57 35 115 83 -66 -51 -13 -69 61 -25 49 97 -28 -27 -27 5 27 13 155 -49
$$ packed form
7569A5l5Q5J0k8p1P0m7n0L6Oo9Q8k7j33J74K6M5n2Kj36J18m6L2j7K5j02L3R1j63
7598a20J30K5K6l0m2M9o0J7k2L7n3P5j01P6k3L5j7j8o8K87k34mm8J87j53J07o5
7625gq9J37o8J5l2n8J41j92J65K9j07P2m5q1J6J86j52O2L4o2RJ1k6Q3j34M2J92
7652A41q6lqm1l5L6K3j04J84q6n2M1K2l8J06o8p9J22jK1j16P3j12L9L2j58J25
7679b2L6J5N3j40J02o3J07J0j25J45k5k08J53pJ7p9j0M8l0k8O9q4P7J3n9M2oM5
7707D6j73Q0n7P8J28LLj33J16p5M6l0j4J1j27M4J47j26Q3p7k5N0KJJ5n9Q8m9K3
7736A9J2j72K16k3n2j1J8l0k2L1K3p7Q3j31J33j3l8M6K4p4k8Q7K7r3n6N0jJ16
7764F4j92R9P4j02k6P4L9LK4k2Q0l2j49J5L8n6J30q6P4M8j25J%L2K2j4J42k04
$$ plain form
7792 -49 -85 -57 -55 67 -1 -6 -60 10 -84 -82 -10 -73 83 -30 97 -24 -91 52 -101 60 10 -64 102 129 23 9 16
7819 16 -78 -72 41 72 -78 -2 48 -101 -62 -96 -202 26 -8 50 -10 -53 -54 28 98 45 -31 -20 95 46 -7 53 64 2
7847 2 64 9 -13 34 41 8 65 -57 -25 38 78 7 -40 -22 -39 9 -27 78 -58 -25 110 30 7 -12 -65 15 -45 25 42
7876 42 124 -93 78 15 -160 39 -45 50 -59 -36 24 61 -61 -11 133 -43 38 -2 -46 -18 -38 19 -57 64 14 48
7902 48 56 -36 -13 -86 7 2 -74 5 43 28 46 57 0 103 177 -20 228 -268 -181 881 -43 -62 61 -99 82 121
7928 121 12 17 -47 -33 -63 39 23 -17 76 25 -61 69 44 41 -89 1 49 -155 42 122 121 -76 -15 17 -20 -9 22 -49
7956 -49 40 -5 20 -39 109 32 50 11 -30 73 87 52 37 10 -25 -102 -95 134 42 98 -70 7 -56 28 -19 -22 -16 30 -31 11
7986 11 83 -100 -102 10 -119 -44 -48 -62 -35 -64 36 -39 20 -1 51 56 -21 50 -39 16 -97 -90 16 64 -120 52 -14 -24
$$ packed form
7792d9l6K8KJ22o8nn4P0r4KP2o3J56j13J27j21o7J43j53J61n0p4J66K7j06j4P
7819A6r4OJ13L1j50P6N0j49L9l4j06K28l4N8o0m3jQ2P0n3p6J1J15m9n3O0J1o2
7847BO2n5k2M7Pl3N7j22L2O3M0p1m7J8j7M8l6J05j36L3J35q0k3j9n3Q0o0P0J7
7876D2Q2k17J71o3j75J99q4R5j09K3O0L7j22N0J44j76Q1m0m4K8k0N7p6J21n0L4
7902D8Qr2K3p3R3np6P9L8j5J8J1n7J03P4j97K48m96Q7J062r24j9J23j60J81L9
7928A21j09No4J4l0J02j6m0R3n1q6J30k5lj30R0M8k04J97Q0jj97O1L2l7J1L1p1
7956d9Q9m5K5n9J48p7J8l9m1J03J4l5j5k7l5p7PK29r2N6j68P7o3Q4m7lOM6o1M2
7986A1P2j83kJ12j29P5mj4K7k9J00p5N9k1N2Np7P1q9N5j13PJ06M8j84J72o6j0
$$ plain form
8014 -24 -37 22 -78 -38 48 41 -28 -54 -92 -3 -33 11 112 -55 35 31 23 -41 -67 32 -56 -59 -29 17 -20 -65 -53 10 -69 38
8044 38 -65 -76 39 26 -13 -83 52 -2 -77 82 60 71 -59 39 10 -15 -69 -59 -101 58 -23 29 41 70 -24 15 77
8071 77 -32 -25 98 -20 -15 -63 55 -17 -38 -2 -50 -119 6 37 62 47 8 35 34 31 -111 -34 6 -108 -166 -26 -105 -9
8099 -9 8 67 41 -56 60 -12 -84 -41 -25 -53 51 224 61 15 3 -76 -99 36 35 42 -43 -33 -15 43 -34 -60 77 69 -27
8128 -27 -34 22 -30 37 117 1 -37 -16 58 43 -49 -66 -118 1 32 -92 52 -27 20 -12 -14 16 76 3 -6 -17 -124 75 -3
8157 -3 -1 41 59 -46 22 14 2 36 -32 36 18 109 17 -71 -39 8 58 84 -32 49 -15 35 -4 -18 43 -69 35 -69 70
8186 70 -24 -42 -108 -14 74
$$ packed form
8014b4j3N9j00M0Q6po9k6l8Q9l0M4J01j67R0mqo4k6R9q8lL0M6l7m5J2O3p9J07
8044C8j03j1J15j3l9p0J35n4p5J59k2J1j30R8k9k5n4J0m2J59q1N2J2K9r4L9O2
8071G7j09PJ23j18Nm8J18p2k1L6m8o9J25L1K5j5l9K7jlj42P7M0j14n8J40p9R6
8099iJ7N9k6r7J16p2p2M3J6k8J04J73j63m6j2p9k3J35jPq5J0J8N8p7k6J37qr6
8128b7pN6n2O7Q0j16l8K1P4j5r2j7n2J19L1j24J44p9M7l2kL0O0p3rj1j07J99p8
8157cKM2J8j05O8qj2L4o8O8j8R1r2q8L2M7N0K6j16Q1o4N0l9j4O1j12J04j04J39
8186G0r4j8o6R4Q8
8191G4
$$ Imaginary data points
##PAGE= N=2
##DATA TABLE= (X++(I..I)), XYDATA
$$ plain form
0 0 0 0 0 0 0 0 0 0 0 0 0 0 0 0 0 -2 8 -8 8 -8 8 -16 16 -16 24 -24 30 -32 40 -40 48 -56 64 -72 80 -89 104
37 104 -113 128 -144 160 -177 194 -217 241 -265 290 -321 353 -391 430 -473 523 -576 638 -706 784
57 784 -874 978 -1105 1256 -1442 1677 -1990 2420 -3058 4107 -6117 11403 -56777 -126380 -12723
72 -12723 60180 74214 30300 -5105 -33489 -51564 -42109 6763 39632 54377 31813 -27091
84 -27091 -68194 -47649 10685 55709 37083 2040 -5875 -18623 -39747 -30968 6182 47829 45938
97 45938 2627 -32595 -47100 -32986 15998 46615 35159 4214 -26753 -36786 -28200 -8164
109 -8164 30567 47913 19684 -18581 -44818 -39893 2519 37980 39358 8299 -30155 -30595 -8456
122 -8456 -1540 5886 18849 22356 9957 -21512 -35999 -14177 10924 27745 25188 -4990 -23816
$$ packed form
0@%%%%%%%%%%%%%%%kJ0j6J6j6J6k4L2l2M0m8N4o2P2q0Q8j04J20j36J52j69J93
37A04k17K41k72L04l37L71m11M58n06N55o11O74p44Q21r03R96j099J214j344J490
57G84j658J852k083K361k698L119l667M410n478P165j0224J7520o8180o9603J13657
72a2723P2903J4034m3914l5405k8384j8075R455M8872L2869J4745k2564n8904
84b7091m1103K0545N8334M5024j8626l5043p915j2748k1124Q779L7150M1647j891
97D5938m3311l5222j4505J4114M8984L0617j1456l0945l0967j0033Q586K0036
109h164L8731J7346k8229l8265k6237M925M2412L5461J378l1059l8454m40K2139
122h456O916P426J2963L507j2399l1469j4487K1822K5101J6821k557l0178j8826
$$ plain form
135 -23816 -16722 -5608 2041 3938 14694 26137 -150 -34688 -29269 -1423 21336 22230 5568
148 5568 -4272 -13916 -21507 -7112 8306 15295 19418 4892 -17347 -26807 -17101 13384 28645 10209
162 10209 -5486 -11348 -14874 -7850 2093 12609 15043 -1469 -9915 -6955 -10828 -5111 9023 14049
176 14049 10025 -5901 -16363 -7598 -1063 3848 9868 3485 -743 -1745 -9207 -9654 -3750 6700
190 6700 19171 8014 -13704 -15951 -8313 2750 10361 6895 5807 -446 -14070 -11718 -1096 7833
204 7833 15864 6100 -9799 -12680 -8223 3303 9232 1705 1594 2321 -5882 -6716 -3972 893 7936
219 7936 3286 -1631 -922 -6184 -5195 1215 2105 5553 4137 -2444 -2663 -6126 -6151 3444 5308 4653 3749
236 3749 -6403 -9878 -4782 2552 12144 6792 -6458 -6608 -4916 -2328 3855 3134 4044 3108 -6356 -6395
$$ packed form
135b3816P094J1114P649J897J0756J1443k6287l4538N419K7846K2759Q94j6662
148E568r840r644p591J4395J5418O989M123j4526k2239r460R706L0485J5261j8436
162A0209j5695n862l526P024R943J0516K434j6512q446K960l873N717J4134N026
176A4049m024j5926j0462Q765O535M911O020o383m228j002p462m47N904J0450
190F700J2471j1157k1718k247P638J1063P611l466j088o253j3624K352J0622Q929
204G833Q031r764j5899k881M457J1526N929p527j11P27q203q34K744M865P043
219G936m650m917P09n262R89O410Q90L448j416o581k19l463k5R595J864o55r04
236C749j0152l475N096P334R592n352j3250j50J692K588O183p21R10r36r464l9
$$ plain form
252 -6395 -1576 1235 7068 3241 -4496 -2466 -2102 -940 1250 -2808 1630 6274 -340 -3550 -3994 -3212
268 -3212 3246 2302 599 3107 -2123 -4646 -1645 -2037 3413 6294 366 -1717 -4586 -5131 1930 2995
284 2995 2452 3515 -3258 -5207 -1266 -132 4298 3206 -2895 -405 -466 -2829 22 -426 1680 4251
300 4251 -1899 -2918 -462 -1473 2354 1416 -2217 1896 1045 -2656 -1922 -2892 2130 5989 -770 -2555
316 -2555 -1101 -2134 1559 677 -1325 3282 834 -2604 -1524 -2801 1578 4847 -490 -1023 -934 -2511
332 -2511 1021 -97 -1067 3439 630 -2176 -763 -2079 1146 2525 -1452 996 784 -2374 81 -1029
348 -1029 -488 3481 65 -1503 208 -1839 704 1038 -1924 1812 1372 -2034 -417 -1761 24 3654
364 3654 -650 -1102 936 -1494 224 17 -1790 2694 1346 -1896 -250 -1978 256 3290 -1034 -592
$$ packed form
252f395M819K811N833l827p737K030L64J162K190m058M438M644o614l210m44P82
268c212O458r44j703K508n230k523L001l92N450K881n928k083k869n45P061J065
284B995n43J063o773j949L941J134M430j092o101K490o1k363K851m48K106K571
300D251o150j019K456j011L827r38l633M113q51l701P34r70N022L859o759j785
316b555J454j033L693q82k002M607k448l438J080j277M379L269n337n33Q9j577
332b511L532j118r70M506k809k806J413j316L225J379l977K448k12l158K455j110
348a029N41L969l416j568J711k047K543L34k962L736m40l406J617j344J785L630
364C654m304m52K038k430J718k07j807M484j348l242J646j728K234L034m324M42
$$ plain form
380 -592 1176 -1256 170 -903 -1888 2902 1179 -1469 210 -1713 33 2105 -1524 383 1527 -1384
396 -1384 194 -980 -1451 2739 548 -1088 859 -1356 118 1109 -2053 1096 1608 -1486 219 -851
412 -851 -821 2287 -639 -711 1463 -1093 102 545 -2086 1253 1296 -1260 837 -838 -989 1767 -1206
429 -1206 -201 2069 -905 -246 -476 -1954 2414 1186 -2033 541 -258 -67 1200 -1830 352 2149
445 2149 -1107 -120 -495 -1374 2425 209 -1809 750 -425 253 1216 -2310 -61 1916 -642 397
461 397 -997 -1567 2272 -8 -1520 1176 -273 321 566 -2298 472 1435 -935 831 -663 -1149 1606
478 1606 -639 -625 1500 -1264 -205 996 -1592 325 199 -904 1782 -502 -1454 1337 -781 -244
494 -244 1347 -1130 13 282 -1347 1461 127 -1941 1043 299 -302 398 -1979 540 2303 -1712
$$ packed form
380e92J768k432J426j073r85M790j723k648J679j923J746K072l629J907J144k911
396a384J578j174m71M190k191j636J947k215J474R91l162L149N12l094J705j070
412h51L0L108k926p2K174k556J195M43k631L339M3k556K097j675j51K756k973
429a206J005K270k974O59k30j478M368j228l219K574p99J91J267l030K182J797
445B149l256R87l75q79L799k216k018K559j175O78R63l526K249J977k558J039
461C97j394n70L839k280j512K696j449N94K45k864K770R63k370J766j494m86K755
478A606k245J4K125k764J059J201k588J917j26j103K686k284r52K791k118N37
494b44J591k477J143K69j629K808j334k068K984p44o01P00k377K519J763m015
$$ plain form
510 -1712 -631 576 -498 1213 -881 -1231 1809 -414 -620 957 -1498 -21 1261 -976 631 -319
526 -319 -1396 1770 -210 -1505 1021 -80 256 262 -2080 881 1398 -1846 92 441 -274 1162 -1211
543 -1211 -891 1667 -966 -201 919 -1190 379 -138 -1265 1680 25 -1472 757 -1193 -483 1745
559 1745 -686 -330 -498 -1564 2053 1056 -1962 -12 -336 169 1369 -1731 -302 1634 -1302 -338 226
576 226 -562 1492 -427 -1857 667 -488 65 1927 -1233 -1160 46 -662 1905 536 -2232 293 -244
593 -244 -579 1340 -430 -32 496 -2081 53 1406 -476 931 -780 -2014 845 423 789 1391 -2777
610 -2777 -1756 1421 788 1312 -863 -2765 979 854 -341 868 -1229 -514 1054 -1280 -79 1043
626 1043 -884 1007 -577 -2293 915 1211 441 315 -2794 -746 2241 145 97 -747 -1694 1193 296
$$ packed form
510a712J081J207j074J711k094l50L040k223k06J577k455J477J282k237J607r50
526c19j077L166j980j295K526j101L36Ok342K961N17l244J938L49p15J436k373
543a211L20K558k633P65J120k109J569n17j127K945j655j497K229j950P10K228
559A745k431L56j68j066L617r97l018J950l24N05J200l100J429J936k936R64N64
576B26p88K054j919j430K524j155N53J862l160P3J206p08K567j369k768K525n37
593b44l35J919j770L98N28k577K134J353j882J407j711j234K859m22L66O02m168
610b777J021L177o33N24k175j902L744j25j195J209k097P15J568k334J201J122
626A043j927J891j584j716L208K96p70j26l109K048K987k096m8q44r47K887q97
$$ plain form
643 296 -884 1144 -531 -682 437 -1300 364 1712 -672 -125 -1121 -1148 2174 709 -1297 -662 -1438
660 -1438 613 2209 -1025 -760 -164 -859 1554 263 -1869 662 -80 -239 899 -1576 -241 1493
676 1493 -567 36 -507 -1533 1486 779 -907 386 -1208 -184 1524 -966 -285 581 -944 689
692 689 -13 -1065 1357 87 -891 402 -986 162 1725 -982 -660 -184 -721 1651 244 -1656 430
709 430 -70 -115 793 -1248 -111 1447 -851 -176 -477 -1016 1885 791 -1217 -438 -1157 646 2255 -957
727 -957 -880 -263 -972 1376 827 -1119 298 -819 -644 1221 -426 164 716 -1615 -209 567 -304 1433
745 1433 -258 -1925 338 -205 293 1467 -1241 -691 357 -806 1102 604 -1301 681 -333 -1007
761 -1007 1017 -146 423 783 -1723 -510 712 -55 1651 -310 -2255 198 376 971 1444 -1775 -1307
$$ packed form
643B96j180K028j675j51J119j737J664J348k384N47r96k7L322j465k006O35p76
660a438K051J596l234K65N96o95K413j291k132K531p42j59J138k475J335J734
676A493k060O03n43j026L019p07j686J293j594J024J708k490O81Q66j525J633
692F89p02j052K422j270r78J293j388J148J563k707L22M76n37K372j407j900K086
709D30n00m5R08k041J137J558k298O75l01n39K901j094k008P79p19J803J609l212
727i57P7O17p09K348n49j946J417j117J75J865j647N90N52k331J406P76q71J737
745A433j691j667K263n43M98J174k708N50J048j163J908m98j905J982j014o74
761a007K024j163N69L60k506J213J222p67J706j961j945K453J78N95M73l219M68
$$ plain form
778 -1307 461 28 1295 410 -1517 287 -224 -525 1516 -153 -522 543 -1384 22 1267 -117
794 -117 638 -663 -1691 988 560 -52 664 -1397 -551 986 -347 561 463 -1198 503 -152 -777 1254
812 1254 52 -344 207 -1474 175 1668 -340 10 -707 -1431 1270 805 -166 306 -1463 -408 1531
829 1531 -369 108 89 -1301 670 440 -752 855 -403 -623 557 -831 18 1155 -971 -85 -118
846 -118 -1217 1189 358 -791 595 -612 -283 1175 -855 -26 623 -883 432 94 -847 1012 71
863 71 -524 562 -722 109 1391 -877 -166 134 -758 967 258 -976 656 -238 -160 919 -710 -203
881 -203 892 -632 313 71 -1037 941 280 -617 567 -612 -208 1084 -546 91 341 -1004 551
898 551 310 -718 745 -179 -663 801 -552 10 929 -890 1 282 -740 894 314 -717 489
$$ packed form
778a307J768m33J267q85j927J804n11l01K041j669l69J065j927J406J245j384
794a17P55j301j028K679m28o12P16k061Q46J537j333R08r8j661J701o55o25K031
812A254j202l96N51j681J649J493k008L50p17p24K701m65r71M72j769J055J939
829A531j900M77j9j390J971k30j192J607j258k20J180j388Q49J137k126Q86l3
846a18j099K406q31j149J386j207L29J458k030Q29O49j506J315l38r41J859r41
863G1n95J086j284Q31J282k268P11L00q92J725p09j234J632q94P8J079j629N07
881b03J095j524R45k42j108J978o61q97J184j179M04J292j630O37K50j345J555
898E51k41j028J463r24m84J464j353N62R19j819Q91K81j022J634n80j031J206
$$ plain form
915 489 -627 -228 1185 -623 -237 378 -764 690 370 -866 652 -59 -583 684 -460 -21 932
932 932 -742 -62 374 -655 895 184 -1097 402 -109 -90 878 -844 -326 649 -589 540 306 -824
950 -824 434 -3 -658 768 -294 -236 841 -693 -196 488 -594 575 175 -954 688 53 -345 934
968 934 -587 -423 754 -430 320 303 -917 736 329 -722 528 -245 -208 921 -783 -124 648 -615
986 -615 405 205 -760 707 33 -537 602 -656 -207 906 -585 -140 332 -554 713 169 -893 680
1004 680 -173 -360 637 -526 -41 699 -595 133 274 -699 585 78 -616 695 -253 -167 802 -713 33
1023 33 468 -631 440 326 -766 585 -93 -1181 740 -266 -139 509 -702 279 546 -905 383
1040 383 252 -652 532 -205 -135 845 -663 -297 641 -618 208 325 -634 492 -98 -568 800 -360
$$ packed form
915D89j116L99J413j808L86O15j142J454l20j236J518p11n24J267j144M39R53
932I32j674O80M36j029J550p11j281J499n11J9R68j722N18R75j238J129k34j130
950h24J258m37o55J426j062N8J077j534M97O84j082J169m00j129J642o35l98J279
968I34j521J64J177j184P50j7j220J653m07j051J250p73L7J129j704O59P72j263
986f15J020k00r65J467o74n70J139j258M49J113j491M45M72q86J267n44j062J573
1004F80q53j87R97j163M85P40j294P28J41r73J284n07o94J311r48Q6R69j515P46
1023C3M35j099J071j14j092J351o78j088J921j006J27O48j211R81K67j451J288
1040C83j31r04J184p37P0R80j508L66R38j259Q26J17r59J126n90m70J368j160
$$ plain form
1058 -360 -385 616 -506 62 403 -452 554 140 -766 682 47 -350 587 -404 -157 453 -800 273
1076 273 474 -850 255 65 -359 823 -238 -517 498 -412 74 703 -613 179 174 -575 490 -45
1094 -45 -410 740 -245 -356 612 -459 332 426 -878 208 181 -383 580 -214 -364 662 -412 -22 633
1113 633 -497 262 219 -630 665 53 -468 482 -359 -366 677 -343 77 367 -783 271 217 -417 434
1132 434 -208 -493 559 -354 2 671 -622 135 388 -481 324 98 -346 601 -249 -456 659 -365 38
1151 38 353 -666 166 301 -557 445 -50 -407 551 -320 -322 549 -422 31 400 -667 190 318 -497 583
1171 583 -57 -470 596 -478 25 587 -598 24 325 -586 477 178 -536 359 -235 -266 652 -320 -141
1190 -141 291 -601 210 242 -406 371 -145 -445 601 -166 -132 372 -589 -18 332 -540 533 101 -612 425
$$ packed form
1058c60k5J001j122N68L41q55J006m14r06J448o35l97R37r91K47O10j253J073
1076B73K01j324J105j90m24J182j061k79J015r10M86O29j316P92np49J065n35
1094d5l65J150r85j11R68j071P91R4j304J086k7n64R63p94j50J026j074L90O55
1113F33j130P59m3q49J295o12n21R50q41pJ043j020M20K90j150J054n4o34Q51
1132D34o42k85J052r13L56O69j293P57K53q69Q05k26m44R47q50k07J115j024M03
1151C8L15j019Q32J35q58J002m95l57R58q71kQ71r71M53L69j067Q57J28q15J080
1171E83o40m13J066j074N03N62j185O22L01r11J063k99p14Q95n94l1R18r72J79
1190a41M32q92Q11L2o48P77n16l00J046p67L4N04r61N71L50q72J073m32p13J037
$$ plain form
1210 425 -274 -283 604 -398 -64 422 -442 289 389 -510 321 62 -372 586 -164 -220 510 -409 49 423 -407
1231 -407 368 89 -471 452 -16 -286 525 -271 -201 454 -406 204 404 -600 216 62 -467 568 -234 -220
1251 -220 303 -278 -15 801 -364 -335 377 -715 561 36 -388 379 -246 -162 549 -345 53 217 -429 300
1271 300 225 -342 279 -123 -329 416 -284 -169 446 -382 158 194 -327 389 94 -390 381 -161 -337 510 -315
1292 -315 84 365 -428 235 292 -382 373 -127 -424 411 -157 -89 364 -421 18 337 -354 309 -57 -550 455
1313 455 99 -56 486 -411 -173 351 -328 196 202 -478 217 14 -278 538 -92 -229 383 -422 -30 431 -215
1334 -215 193 102 -436 435 100 -119 227 -314 -99 421 -331 133 378 -570 196 -44 -331 364 -41 -226
1354 -226 311 -406 -2 550 -322 25 94 -252 440 261 -344 298 -249 -73 590 -188 149 136 -368 286 203
$$ packed form
1210D25o99rQ87j002L34M86q64P31J00q99Q31k59m34R58p50n6P30r19M58L74q30
1231d07P75k79n60R23m68k70Q11p96P0O55q60O10K00j004Q16j54n29J035q02J4
1251b20N23n81K63Q16j165K9P12j092J276n25m24P67o25Q4P11q94L98J64o46P29
1271C00p5n67O21m02k06P45p00J15O15q28N40L6n21P16k95m84P71n42j76Q47q25
1292c15L99K81p93O63N7o74P55n00k97Q35n68O8M53p85M39L19o91O63l66m93J005
1313D55l56j55N42q97K38N24o79N24Oo80O95k03k92Q16o30j37O12q05L92M61o46
1334b15M08r1n38Q71l35k19L46n41K15N20p52M64K45r48P66k40k87O95m05j85
1354b26N37p17M04N52q72L47O9l46O92j79o05O42n47J76O63p78L37j3n04O54q3
$$ plain form
1375 203 -403 275 -84 -251 311 -207 2 421 -335 32 57 -408 294 89 -335 268 -224 -150 349 -281 -87
1396 -87 284 -384 246 269 -339 429 -59 -273 392 -164 -54 262 -253 19 205 -247 217 59 -500 351 18
1417 18 -132 210 -273 -117 403 -215 21 37 -296 382 95 -220 159 -211 -101 439 -140 51 165 -283 207
1438 207 103 -284 299 -55 -219 229 -76 -9 399 -358 -54 189 -233 294 142 -364 202 -7 -152 331
1458 331 -341 50 236 -275 26 137 -325 69 11 -327 375 -38 6 315 -281 -48 153 -231 245 1 -412
1479 -412 247 18 -110 437 -266 -126 206 -100 143 156 -216 251 -60 -206 322 -4 1 301 -128 14 315
1500 315 -189 111 28 -369 193 84 -230 263 -236 -142 245 -260 4 199 -184 83 -45 -324 196 0 -182
1521 -182 159 -145 -151 336 -117 103 144 -178 226 8 -219 194 -49 -172 343 -144 -8 178 -118 196 130
$$ packed form
1375B03o06O78l59j67N62n18K09M19p56L67K5m65P02k05m24O03m92P4M99o30J94
1396h7L71o68O30K3o08P68m88k14O65n56J10L16n15K72J86m52M64j58n59Q51l33
1417A8j50L42m83J56N20o18K36J6l33O78k87l15L79l70J10N40n79J91J14m48M90
1438B07j04l87N83l54j64M48l05O7M08p57L04K43m22N27j52n06N66k09j45M83
1458C31o72L91J86n11L01J11m62L94n8l38P02m13M4L09n96K33K01l84M76k44m13
1479d12O59k29j28N47p03J40L32l06K43J3l72M67l11j46N28l26NL00m29J42L01
1500C15n04L00q3l97N62j09l14M93m99R4L87n05K64J95l83K67j28k79N20j96j82
1521a82L41l04oM87m53K20M1l22M04k18k27M13k43j23N15m87J36J86k96L14o6
$$ plain form
1542 130 -286 164 -7 -120 195 -231 -30 230 -198 54 72 -278 200 81 -188 137 -138 -23 184 -197
1562 -197 -158 229 -200 -4 110 -226 241 104 -341 159 -86 -173 288 -173 -37 170 -284 102 177 -215 351
1583 351 -20 -152 265 -172 -157 212 -258 80 157 -235 136 -17 -187 274 -149 -73 348 -123 -74 207 -267
1604 -267 218 98 -206 177 154 -114 185 -134 -167 252 -51 -14 207 -227 161 115 -280 225 18 -195 189
1625 189 -127 -140 257 -221 -2 119 -282 150 73 -261 287 22 -110 186 -250 -122 242 -258 8 94 13
1646 13 226 -58 -213 214 -45 48 176 -100 88 288 -167 15 126 -110 173 76 -184 221 -127 -68 194
1667 194 -185 143 133 -100 199 -8 -176 193 -146 -41 180 -83 -38 45 -83 172 36 -141 131 113 -109
1688 -109 33 -112 -91 196 -125 -50 32 -35 70 -100 -212 191 -76 -48 238 17 51 124 -164 3 118 -56
$$ packed form
1542A30m16M50j71j13L15m26K01K60m28K52J8l50M78j19k69L25k75J15K07l81
1562a97L9L87m29J96J14l36M67j37m45N00k45q7M61m61J36K07m54L86P5l92N66
1583C51l71j32M17m37J5L69m70L38P7l92L71j53j70M61m23P6M21m71M9K81m74
1604b67M85j20l04L83k3k68K99l19l3M19l03L7K21m34L88m6l95N05k07k13L84
1625A89l16j3L97m78K19J21m01M32p7l34N48k65j32K96m36J28L64n00K66Q6q1
1646A3K13k84j55M27k59R3J28k76J88K00m55J82J11k36K83r7k60M05l48N9K62
1667A94l79L28j0k33K99k07j68L69l39J05K21k63M5Q3j28K55j36j77K72j8k22
1688a09J42j45K1K87l21P5Q2o7J05j70j12M03k67K8K86k21L4P3k88J67J15j74
$$ plain form
1710 -56 93 -68 -115 204 29 -223 40 -119 63 117 -178 115 170 -154 110 -26 -127 141 -96 -187 107 -168
1732 -168 65 42 -168 85 92 -108 141 -23 -103 199 -137 -72 160 -45 60 33 -215 95 89 -56 164 -147 -13
1755 -13 91 -202 18 81 -114 -99 -89 -45 82 -19 -235 94 -58 66 179 -118 25 148 -75 89 -88 -180
1777 -180 146 16 -162 89 3 -6 5 -174 63 120 -98 -44 2 -47 42 -146 -179 173 -49 93 132 -92 98 175
1801 175 -43 19 -102 -109 126 -55 38 155 -2 51 47 -191 -10 -5 -81 -59 25 -58 83 -119 19 178 -114 6
1825 6 52 -20 111 -48 -236 136 39 32 224 -223 47 258 -108 78 3 -134 165 63 -92 9 14 -55 96 -106
1849 -106 73 143 -136 -13 -59 -101 64 -173 234 569 137 77 25 -8 42 154 -198 39 -47 -79 175 -96 -104 73
1873 73 47 71 70 -122 -69 29 -133 60 -37 -65 76 -136 -94 146 -114 -145 -16 -63 137 65 -197 5 -8 11 28
$$ packed form
1710e6J49j61m7L19j75k52K63j59J82N4k95K93N5l24K64j36j01K68k37r1K94k75
1732a68K33k3k10K53Pk00K49j64q0L02l36O5K32k05J05k7k48L10oj45K20l11J34
1755a3J04k93K20O3j95J5J0M4J27j01k16L29j52J24J13k97J43J23k23J64j77r2
1777a80L26j30j78K51q6rJ1j79K37N7k18N4M6m9Q9j88l3L52k22J42L9k24J90P7
1801A75k18O2j21pK35j81R3J17j57N3mk38J81Np6K2Q4q3J41k02J38J59k92J20
1825FM6p2J31j59j88L72r7pJ92m47K70K11l66J86p5j37K99j02j55J01No9J51k02
1849a06J79P0k79J23m6m2J65k37M07L35m32o0n2l3N0J12l52K37q6l2K54k71qJ77
1873G3k6K4jj92N3R8j62J93r7k8J41k12M2K40k60l1J29m7K00p2k62K02j3J9J7
$$ plain form
1898 28 -98 -23 228 24 45 20 -5 199 -35 -118 206 5 45 -12 -194 66 130 -70 -43 -34 29 168 -101 -116 148
1923 148 -72 -59 0 -202 5 103 -88 80 33 -26 113 -217 -70 187 -77 -39 55 -145 60 89 -106 121 137
1946 137 5 -30 -154 -52 99 -42 -21 38 -104 87 44 -165 157 73 -73 82 -66 24 109 -118 -101 120 -68
1969 -68 33 34 15 155 13 -2 28 -44 0 102 28 74 -82 -24 101 12 -121 98 -70 -40 82 -77 35 113 -64
1994 -64 53 25 -14 75 -63 -81 144 14 -74 110 -31 47 -40 -89 45 55 -16 71 -62 -30 148 18 150 28
2018 28 -107 13 69 -106 104 -60 -176 -27 -90 133 153 -196 -145 91 -29 -41 24 -101 104 49 -9 2 -42 31
2042 31 51 -74 -25 76 -57 156 -38 8 148 6 62 73 -15 82 127 -202 9 -25 -88 72 -33 -79 77 -56
2066 -56 -48 -11 5 51 10 -33 4 87 -73 79 -21 -77 168 -157 55 95 -25 48 105 -151 42 18 2 -80 -79 -46 35
$$ packed form
1898B8j26P5K51k04K1k5k5K04k34q3L24k01M0n7j82K60O4k00K7RO3J39k69j5K64
1923A48k20J3N9k02K07R8j91J68m7n9J39l30J47K57k64L8R4k00K05K9j95K27J6
1946A37j32l5j24J02J51j41K1N9j42J91m3k09L22q4j46J55j48R0Q5k27J7K21j88
1969f8J01Jj9J40j42j5L0p2M4J02p4M6j56N8J25q9j33K19j68L0J22j59J12P8j77
1994f4J17k8l9Q9j38j8K25j30q8J84j41P8q7m9J34J0p1Q7j33L2J78j30J32j22
2018B8j35J20N6j75K10j64j16J49o3K23K0l49N1K36j20j2O5j25K05n5n8J1m4P3
2042C1K0j25M9J01j33K13j94M6J40j42N6J1q8R7M5l29K11l4o3J60j05m6J56j33
2066e6QL7J6M6m1m3L7Q3j60J52j00n6K45l25K12M0j20P3N7k56J93k4j6q2JL3Q1
$$ plain form
2093 35 89 -54 46 19 -101 -73 -98 135 152 -35 11 53 -24 3 -8 -44 183 -55 52 -18 -89 129 -7 -101 91
2118 91 -35 -15 63 -154 2 -43 -74 73 -67 -79 66 -50 59 122 7 57 -12 -68 48 169 -115 69 -2 -27
2142 -27 120 -84 -38 143 5 17 53 -153 49 98 -51 5 108 48 59 -46 -44 205 31 -12 43 -111 -4 -20
2166 -20 -186 -45 14 -53 13 32 63 87 -69 -48 -27 -98 -26 128 -160 69 -37 57 2 -119 66 95 -89 52 85
2191 85 -44 42 -74 25 -14 62 -35 11 -72 28 191 -91 -1 -33 -60 154 -68 -114 157 18 14 36 -100 52 173
2216 173 -163 6 61 -28 138 -60 -163 63 57 11 263 43 -43 -124 409 555 -9 302 147 37 177 -66
2238 -66 452 -352 -375 52 -130 37 -173 5 -103 50 57 -7 -52 -16 -49 -31 -30 2 113 -47 -106 84 -143 -79 44
2263 44 -65 27 67 -22 -37 126 1 66 23 20 4 35 60 138 -79 30 67 47 46 152 98 37 -24 -51 88 15 -137
$$ packed form
2093C5N4j43J00k7j20K8k5K33J7j87M6M2p7K7j1l6K27k38J07p0p1K18j36r4J92
2118I1j26K0P8k17J56m5l1J47j40j2J45j16J09O3j15N0o9n6J16J21k84J84p1k5
2142b7J47k04M6J81j38J2L6k06K02M9j49N6J03o0J1j05KK49j74m3N5j54J07j6
2166b0j66J41N9o7O6J9L1K4j56K1K1p1P2J54k88K29j06R4n5j21J85K9j84J41L3
2191H5j29Q6j16R9l9P6r7M6q3J00J63k82R0l2k7K14k22m6K71j39mK2j36J52J21
2216A73l36J69N5q9J66j98j03K26om6K52k20q6q1N33J46n64L11j55j10J40k43
2238f6N18q04k3M27j82J67k10J78j08J53Po4m5L6l3J8JL2J11j60n9J90k27O4J23
2263D4j09R2M0q9j5J63j25O5m3lj6L1K5P8k17J09L7k0jJ06n4o1o1k7J39p3j52
$$ plain form
2290 -137 87 -3 -12 -23 -116 25 114 -79 215 -27 9 99 -3 141 -108 64 -60 -41 -150 -6 -125 -98 25
2313 25 -87 -24 -15 6 8 15 -38 30 -39 -86 101 49 -25 78 35 39 156 -68 -11 -35 -46 95 21 -67 -23 -67 23 53 -78
2342 -78 -5 -30 -15 -4 104 -61 -12 -128 17 -27 -52 -123 92 18 16 -46 -23 92 -36 -16 -71 7 -30 109 71 52 -76
2369 -76 -72 39 31 35 25 -1 -82 84 36 57 81 48 -2 37 -58 167 -32 -50 60 -20 -41 -2 -40 -75 8 -18 -10 -5 -32 -72
2399 -72 -87 8 86 4 -39 28 -43 -91 -38 -40 -75 -1 -67 24 8 -5 3 -66 -42 55 -18 49 -2 -21 82 -106 -203 84 -63
2428 -63 -92 -18 -16 -27 -38 -128 -107 70 45 -48 -43 68 56 39 31 79 -19 50 37 -81 20 19 -82 23 -50 -123 23 6 -48
2457 -48 56 -73 110 79 -89 -37 9 -1 70 -130 25 -115 44 -65 80 50 -42 37 1 -24 33 29 -4 78 -20 65
2483 65 6 81 -15 -58 -55 58 38 27 68 -15 5 -86 -42 54 -5 24 3 -84 -5 -51 -11 11 -59 12 21 9 -77 65 -6 -7 4
$$ packed form
2290a37K24r0rj1r3J41Q9j93K94k42L6R0j02J44k49J72j24J9j09J44j19K7J23
2313B5j12O3RK1KPn3O8o9m7J87n2p4J03m3MJ17k24N7k4j1J41p4q8M4m4R0L0j31
2342g8P3k5J5J1J08j65M9j16J45m4k5p1K15p4ko2K3J15j28K0n5P8l7J39l8j9j28
2369g6MJ11qMj0k6q1J66m8K1K4l3n0L9r5K25j99j8J10q0k1L9l8l5Q3k6QNk7m0
2399g2j5R5P8q2m3O7p1m8N3kl5P4o6R1j6j3Qo9K4R7p3O7n1j9J03j88r7K87j47
2428f3k9P4Kj1j1r0K1J77k5r3NJ11j2j7qM8r8O9j3j18J01jj01J05p3p3J46j7n4
2457d8J04j29J83l1j68N2M6j0P1k00J55j40J59j09J45l0r2P9l6k5N7ml3Q2r8Q5
2483F5n9P5r6m3LJ13k0j1M1q3K0r1M4R6n9K9k1q7P9m6M0K2p0P1Rj2q6J42p1jJ1
$$ plain form
2514 4 49 -109 81 -1 178 33 -43 35 -108 39 -24 24 7 77 -67 13 -122 2 14 77 90 80 -100 -7 172
2539 172 81 -46 -9 -103 -29 -42 -79 -21 -77 42 -171 -165 100 10 43 -28 -29 -27 139 121 -48 21 8 -57 69 -16 69 88
2567 88 -57 -6 34 85 103 1 -17 -27 -10 -82 105 21 5 8 -79 113 97 39 112 -17 90 71 -20 -20 -8 69 125 -99
2595 -99 -130 -3 -59 -28 -42 42 57 -20 40 21 9 40 80 -9 52 107 -1 31 55 47 -36 -26 -33 -29 33 -124 -6 -23 -67 12
2625 12 -34 -68 3 21 67 12 -2 68 -54 50 -190 -29 -20 19 145 -33 -49 -62 48 27 82 -30 -67 -18 71 72 89
2652 89 34 8 41 136 -83 -68 108 -25 -1 54 -59 88 53 17 -33 10 -51 136 -11 -51 27 -1 61 181 11 -59
2678 -59 5 38 58 -33 34 -105 40 63 78 -1 -115 -1 1 28 -35 52 52 -188 -6 -7 -127 -8 59 -102 -38 -52 -76
2705 -76 20 -96 10 -24 69 47 53 -35 -69 -68 -10 37 -14 -30 32 -21 -42 48 -13 -56 22 -81 -79 -66 39 91 -20 -12 58 -9
$$ packed form
2514DM5j58J90q2J79j45p6P8j43J47o3M8j7P0j44Q0j35J24J2O3J3j0j80R3J79
2539A72r1j27L7r4P4j3l7N8n6J19k13OK65r0L3p1jKJ66j8j69O9j3o5J26q5Q5J9
2567H8j45N1M0N1J8j02j8j0J7p2J87q4j6Lq7J92j6n8P3j29J07j9r1%J2P7N6k24
2595i9l1J27n6L1j4Q4J5p7O0j9j2L1M0q9O1N5j08L2K4qq3J0pMO2j57J18j7m4P9
2625A2m6l4P1J8M6n5j4P0j22J04k40J61RL9J26j78j6j3J10k1N5j12l7M9Q9JJ7
2652H9n5k6L3R5k19J5J76j33K4N5j13J47l5l6n0M3o1J87j47m0P8k8O2J20j70p0
2678e9O4L3K0r1O7j39J45K3J5p9j14J14KK7o3Q7%k40J82jj20J19O7j61O4j4k4
2705g6R6j16J06l4R3k2Oq8l4JN8M7n1j6O2n3k1R0o1m3P8j03KJ3J05N2j11QP0o7
$$ plain form
2735 -9 4 133 -78 59 59 20 24 60 -20 5 47 13 9 -91 -64 42 -1 92 -70 -27 35 -62 -16 97 1 -93 39 -87
2763 -87 -21 -55 -25 -35 73 89 47 60 -66 30 -71 154 1 138 109 41 34 10 8 77 26 -2 -57 43 50 -49 4 -46
2791 -46 -19 -37 -70 180 7 -51 -17 -33 18 57 55 -15 -8 27 18 44 42 -54 -40 -76 49 3 -31 -53 -4 84 123 93 39 37 106
2822 106 30 16 -50 88 29 -49 127 16 79 108 78 14 -52 -59 133 -97 -70 -142 90 -5 60 189 82 -161 -120 20
2848 20 -37 148 -38 132 75 -18 47 -64 -109 -108 -136 18 27 87 -13 -57 57 16 -16 80 -27 -5 18 99 31 0 -39
2875 -39 -32 71 56 29 27 -101 8 -101 -36 -91 68 -7 -72 -91 73 -6 -36 -54 -31 9 -73 -37 -63 -91 -88 94 61 -65
2903 -65 -5 -146 -80 0 -31 -37 87 23 23 49 43 53 -53 31 -51 91 -121 34 -72 -19 -43 -93 123 74 -28 30 61
2930 61 -14 -21 -89 12 81 13 22 120 -24 23 -14 -65 -68 6 -98 42 -72 67 37 -32 34 -19 -102 -29 -36 -40 74 20 -90
$$ packed form
2735iJ3J29k11J37%l9ML6q0K5M2l4mj00K7J06m3R3j62M3O2r7M6J13r6r4J32j26
2763h7O6l4L0j0J08J6m2J3j26R6j01K25j53J37k9o8pk4kO9n1k8n5J00Pr9N3n0
2791d6K7j8l3K50j73n8L4j6N1L9kp0PL5rK6kr6J4l6J25m6l4k2M9Q8L9l0n4kO9
2822A06p6j4o6J38n9p8J76j11O3K9l0o4o6pJ92k30K7p2K32r5O5J29j07k43M1J40
2848B0n7J85j86J70n7r3O5j11m5Jk8J54RO0j00m4J14m1l2R6j07K2K3Q1o8l1l9
2875c9PJ03j5k7kj28J09j09O5n5J59p5o5j9J64p9l0j8K3M0q2L6k6k8LJ82l3j26
2903f5O0j41O6Q0l1oJ24o4%K6oJ0j06Q4q2J42k12J55j06N3k4n0K16m9j02N8L1
2930F1p5po8J01O9o8RR8j44M7l7n1lP4j04J40j14J39l0o9O6n3q3P3pmJ14n4j10
$$ plain form
2959 -90 69 -43 -36 50 -11 41 21 -65 -16 1 -30 10 -43 -80 17 46 -42 -116 -20 59 2 -89 -124 -53 -57 -38 12 58 76 -56
2989 -56 23 7 -46 -7 -35 -8 -2 -22 -30 -75 -96 63 49 -15 75 34 -10 -97 -16 20 18 -35 -115 79 7 19 33 -102 -51 98
3019 98 -46 72 24 30 12 -9 13 65 -2 -40 -52 -55 18 -30 1 -14 1 120 144 -32 -110 94 -47 1 102 -89 7
3046 7 -60 41 22 69 -77 120 -171 3 111 -100 112 391 22 73 115 -898 437 -316 343 4 -136 23
3068 23 36 44 -6 -80 -25 -12 36 -67 137 -71 150 8 -107 79 63 43 110 46 -72 -5 13 44 -26 4 13 -27 90
3095 90 17 -11 -36 -13 -4 18 28 -14 15 4 15 13 66 39 51 91 -75 -25 -22 -88 -40 4 -65 77 -67 -60 -14 27 32 21 -74
3126 -74 124 -44 -53 -13 10 -14 -25 -140 105 17 -77 -25 -64 -60 31 8 -38 -29 33 110 -9 107 15 78 -29 85 22 83
3154 83 -20 12 -49 61 -97 3 -9 -70 59 63 -106 30 80 33 144 78 7 -1 105 -55 15 -99 43 6 -93
$$ packed form
2959i0J59j12PQ6o1N2k0q6M9J7l1M0n3l7R7K9q8p4R6P9n7r1l5P1mJ9N0M6J8j32
2989e6P9j6n3L9k8K7Ok0qm5k1J59j4o4R0m1m4q7Q1L6kn3q0J94p2J2J4j35N1J49
3019I8j44J18m8Oj8k1K2N2o7l8j2lP3m8L1j5J5J19K4j76p8K04j41M8J01j91R6
3046Go7J01j9M7j46J97k91J74J08k11K12K79l69N1M2j013J335p53O59l39j40J59
3068B3J3Qn0p4N5J3M8j03K04k08K21j42j15J86j6k0O7o4j18O7J8L1p0L0Rm0J17
3095I0p3k8k5K3RK2J0m2K9j1J1kN3k7J2M0j66N0Lo6M8M4o9J42j44PM6M1Nj1r5
3126g4J98j68rM0K3k4j1j15K45q8r4N2l9MR1k3m6RO2P7j19J16r2O3j07J14o3O1
3154H3j03L2o1J10j58J00j2o1J29Mj69J36N0m7J11o6p1qJ06j60P0j14J42l7r9
$$ plain form
3179 -93 -95 30 -36 4 -72 -2 86 -111 -69 137 -102 34 54 -13 139 -27 54 97 -40 62 73 -9 65 -36 -33 89
3205 89 -92 50 -72 13 10 29 -25 -61 -41 68 69 71 -92 49 -33 0 94 -45 -49 28 -132 49 -1 -25 -70 -64 -45 23
3233 23 43 -7 112 -4 31 64 -70 -72 -10 -44 82 79 -44 13 -67 -34 -51 -90 -103 -5 -40 -26 -55 19 51 -34 151 -79
3261 -79 -66 -7 91 -52 129 -30 15 71 -78 36 94 -55 -56 -11 111 -24 -12 -1 -6 -57 -29 22 -9 -10 19 -62 -21 37
3289 37 -28 75 -64 -40 139 30 36 98 -34 -24 63 -140 -59 68 -15 29 26 -25 59 -4 35 17 -12 0 -30 21 51 -9
3317 -9 -20 39 105 -28 161 -17 135 94 -76 -4 101 -63 107 -196 11 -34 90 -207 142 -515 -417 309 -357
3340 -357 37 30 -102 -1 198 -78 46 -104 110 -6 20 22 63 -76 -3 53 -34 -6 47 41 86 -103 10 -16 85
3365 85 -34 106 38 58 -33 -25 -26 19 -23 36 93 92 13 -122 12 -12 -6 35 7 78 102 -50 -108 31 -52 137 33 -2
$$ packed form
3179i3kJ25o6M0p6P0Q8j97M2K06k39J36K0o7J52j66Q1M3j37J02J1q2P4j01LJ22
3205H9j81J42j22Q5lJ9n4l6K0J09JKj63J41q2L3R4j39mP7j60J81n0k4m5OJ9O8
3233B3K0n0J19j16L5L3j34kO2l4J26lj23N7q0L3j7l9j3R8l5J4k9P4L2q5J85k30
3261g9J3N9R8j43J81j59M5N6j49J14N8j49jM5J22j35J2J1nn1K8N1l1jK9q1M1N8
3289C7o5J03j39K4J79j09OO2j32J0Q7k03Q1J27q3M4ln1Q4o3L9j8k9J2l0N1L0o0
3317ij1N9O6j33J89j78J52m1j70P2J05j64J70l03K07m5J24k97L49o57R8P26o66
3340c57L94pj32J01J99k76J24j50K14j16K6KM1j39P3N6q7K8N3oM5j89J13k6J01
3365H5j19J40o8K0r1QjM5m2N9N7jp9j35J34k4OM1k8P1K4j52n8J39q3J89j04l5
$$ plain form
3393 -2 51 88 11 21 -41 -85 119 -52 64 215 -35 -43 25 -108 30 22 -102 -7 19 -93 14 -109 2 -60 -80 142
3419 142 -66 -89 -67 59 140 -55 14 87 36 -42 84 -12 -129 91 79 -99 82 -102 -23 55 -4 15 22 69 -29 71
3445 71 15 10 -41 -56 105 42 38 147 -60 -73 -28 -28 73 115 -63 -35 43 17 31 -167 -40 63 43 48 163 -34 54
3472 54 82 -17 46 -11 -101 -39 -7 -156 -13 -142 33 52 -51 63 -49 26 76 -9 42 -52 -78 66 -27 -135 29
3497 29 74 -11 44 16 102 12 -41 -20 208 -144 -46 79 -29 93 92 -62 -60 -29 38 23 -51 46 141 -69 -50 26 -57 -22
3525 -22 119 -197 74 29 -40 -113 -125 44 102 -52 46 27 18 51 -47 13 169 -6 72 78 -77 29 114 -135 63 43
3551 43 -92 88 -11 -139 18 -162 39 -74 46 23 23 -75 107 -22 58 13 11 9 49 2 48 -10 26 -33 -122 -71 70
3578 70 -38 -136 23 10 9 94 -40 -40 -31 -34 84 -29 11 94 -115 3 56 -59 84 1 -97 -47 -11 -43 56 -53 -68
$$ packed form
3393bN3L7p7J0o2m4K04j71J16J51k50qO8j33J38qj24R5K6j12J07j23J11o2k0K22
3419A42k08k3K2J26Q1j95O9P3n1p8J26r6j17K20j2j78J81j84P9P8n9J9PM7r8J00
3445G1n6nn1j5J61o3mJ09k07j3M5%J01M2j78K8P8k6J4j98J27J03k0NJ15j97Q8
3472E4K8r9O3n7r0O2L2j49J43j29J75J9j03J14j12P5N0q5N1r4k6J44r3j08J64
3497B9M5q5N5k8Q6r0n3K1K28l52R8J25j08J22jj54KL1O7j5p4R7R5k10J9P6q3L5
3525b2J41l16K71m5o9p3j2J69N8j54R8j9rL3r8O0J56j75P8Oj55J06Q5k49J98k0
3551D3j35J80r9j28J57j80K01j13J20k3%r8J82j29Q0m5kkM0m7M6n8L6n9q9N1J41
3578G0j08r8J59j3jQ5j34%RlJ18j13M0Q3k09J18N3j15J43q3r8N0L6l2R9j09j5
$$ plain form
3605 -68 -39 3 -3 65 -52 84 51 -23 141 -63 -91 -72 -194 -137 -16 67 -6 -14 -66 -18 37 -2 -7 4 -22 126 34 -42
3633 -42 44 -50 78 67 -94 56 11 29 63 41 -43 -57 -27 -76 135 -49 86 126 -24 -13 5 -12 51 -94 63 -20
3659 -20 -27 -38 -26 10 -3 -7 -10 46 -20 -86 84 -51 -23 -40 -147 64 -83 15 85 -17 -72 31 72 -113 63 -62 -22
3686 -22 142 19 -24 -94 -53 2 -44 14 59 -49 29 -31 15 -40 68 16 67 0 -67 30 -52 0 86 26 -20 13 21 -16 108
3715 108 -10 12 59 -38 92 -49 -40 39 3 35 52 11 -63 15 -97 45 -103 14 -11 34 291 334 75 -171 -500
3740 -500 -453 -318 183 -30 222 364 -252 -83 -36 -64 -272 64 -27 202 -228 234 189 -170 -394 -370 455 -688
3762 -688 -139 375 35 -1 48 -6 -94 -2 50 -2 33 -90 -18 -32 8 -25 33 -34 20 -14 -56 45 19 -49 54 29 10
3789 10 55 -111 -45 -81 -58 83 -49 -111 162 17 7 -25 -53 -46 75 -31 -9 -57 -23 -67 -8 -110 28 64 13 117
$$ packed form
3605f8K9M2oO8j17J36l3p4J64k04k8J9j22N7J21Q3p3qn2M8N5l9nJ1k6J48r2p6
3633d2Q6r4J28j1j61J50m5J8L4k2q4j4L0m9K11j84J35M0j50J1J8j7O3j45J57q3
3659b0pj1J2L6j3mlN6o6o6J70j35K8j7j07K11j47R8P0j02n5J03M1j85J76j25M0
3686b2J64j23m3p0M1N5m6N8M5j08P8o0M6n5J08n2N1o7o7R7q2N2Q6o0m6L3Ql7J24
3715A08j18K2M7r7J30j41RP9l6L2J7m1p4P8j12J42j48J17k5M5K57M3k59k46l29
3740e00M7J35N01k13K52J42o16J69M7k8k08L36r1K29m30M62m5l59k24K4Q25j143
3762f88N49N14l40l6M9n4q8R2N2n2L5j23P2j4M0l3N8o7N4l4m2J01k6o8J03k5j9
3789A0M5j66O6l6K3J41j32o2K73j45j0l2k8PJ21j06K2m8L4m4N9j02J38L6n1J04
$$ plain form
3815 117 -115 -12 -5 48 -121 -116 423 -149 -104 -66 77 16 -37 4 -120 154 -20 -75 39 -37 2 99 -100 17 5
3840 5 -30 -27 31 0 19 28 -78 31 -61 -119 77 -11 -60 76 -99 -67 92 78 12 -19 -8 57 -105 -72 58 -86 -150
3867 -150 53 -1 99 -33 -127 128 64 -77 162 3 -125 70 -51 51 62 -78 89 -96 -76 19 5 90 90
3890 90 1 -20 61 31 51 16 -33 -19 64 -67 136 0 74 -4 6 -15 113 -79 62 5 -80 -38 -8 -12 48 44 -133 -70
3918 -70 -51 -3 -51 15 67 -89 33 104 -133 -93 92 -22 -153 147 -66 45 64 -55 -19 -37 -16 93 -64 -116
3942 -116 81 -58 49 195 -38 47 -65 -57 76 13 -135 118 -44 -48 59 -3 35 84 -68 20 -3 32 -23 66 -21
3967 -21 139 33 49 105 -49 42 -47 -43 19 63 -6 14 -88 -4 39 -120 50 117 -50 181 25 -32 33 -48 33 124
3993 124 31 -96 38 -151 26 29 -3 -25 -63 -46 1 -56 -41 -48 -145 91 79 -124 61 -40 -117 -68 -77 -30 76 -47
$$ packed form
3815A17k32J03PN3j69NN39n72M5L8J43o1n3M1j24K74j74n5J14p6L9R7j99J17j2
3840El5LN8l1J9Rj06J09r2n8J96q8m9J36j75L2J59j4o6l1J1O5j62L3J30j44o4
3867a50K03n4J00j32r4K55o4j41K39j59j28J95j21J02J1j40J67j85K0R5j4Q5%
3890I0q9k1Q1l0K0l5m9J4Q3j31K03j36P4p8J0k1J28j92J41n7q5M2L0mO0mj77O3
3918g0J9M8m8O6N2j56J22P1k37M0J85j14j31L00k13J11J9j19L6j8K1J09j57n2
3942a16J97j39J07J46k33Q5j12QJ33o3j48K53j62mJ07o2L8M9j52Q8k3L5n5Q9q7
3967b1J60j06J6N6j54R1q9MO2M4o9K0j02Q4M3j59J70O7j67K31j56n7O5q1Q1R1
3993A24r3j27J34j89J77Ll2k2l8J7M7n7J5pr7K36j2k03J85j01p7M9rM7J06j23
$$ plain form
4019 -47 -43 28 -33 87 137 -63 129 0 -135 -29 -94 -39 33 8 -94 86 -41 156 -20 -163 -21 55 -43 -63
4043 -63 31 -54 122 -138 -64 155 -42 -64 52 95 25 -118 -79 30 -47 -32 58 94 102 9 -65 88 67 -118 29 76
4069 76 -43 25 -71 -14 115 -120 63 48 -33 -39 23 -11 139 -18 -115 106 -23 41 55 -54 15 1 32 -77 26
4094 26 -123 65 -88 3 104 -121 12 142 -90 -78 20 -39 -63 -1 12 124 -129 18 79 -141 79 134 -47
4117 -47 21 51 -41 105 -60 6 22 -75 -23 85 -4 14 51 -24 -11 56 -164 2 -133 42 42 16 -34 7 -47 -43 -91 -64
4145 -64 55 30 -130 17 -232 -254 -38 -436 -207 58 31 58 85 -8 151 -47 -100 -19 -98 28 184 -79 94
4168 94 6 -47 6 -22 14 -11 -7 56 -4 -50 -36 -46 -5 -37 19 58 55 -30 11 -9 41 -31 41 -120 69 -39 -41 93 9 -42
4198 -42 74 -4 1 85 -90 4 30 -18 103 -82 -102 183 50 -32 87 65 6 -3 -34 -92 45 -141 30 50 -31 22
$$ packed form
4019d7MP1o1J20N0k00J92j29j35J06o5N5P2k5j02J80j27J97j76j43J42P6r8k0
4043f3R4q5J76k60P4K19j97k2J16M3p0j43L9J09p7J5R0L6Qr3p4J53k1j85J47M7
4069G6j19O8r6N7J29k35J83j5q1oO2l4J50j57r7K21j29O4J4j09O9j4L1j09J03
4094B6j49J88j53R1J01k25J33J30k32J2R8n9k4O2J3J12k53J47O1k20K20N5j81
4117d7O8L0r2J46j65O6J6r7N2J08q9J8L7p5J3O7k20J66j35J75%k6n0M1n4Mm8K7
4145f4J19k5j60J47k49k2K16l98K29K65k7K7K7r3J59j98n3Q1p9J26J56k63J73
4168I4q8n3N3k8L6k5MO3o0m6J4j0M1l2N6L9lq5M1k0N0p2P2j61J89j08kJ34q4n1
4198d2J16p8NQ4j75R4K6m8J21j85k0K85j33q2J19k2n9rl1n8J37j86J71K0q1N3
$$ plain form
4224 22 30 -147 103 -4 -82 -44 -67 34 -2 -72 63 -27 -11 45 -99 -19 121 29 12 174 31 64 -37 73 19
4249 19 -126 38 29 9 69 64 -98 -12 -105 -125 -35 -124 30 68 -93 57 68 -97 -99 171 -76 -21 -55 -182 145 -60
4275 -60 3 125 -7 9 51 -15 24 102 -200 66 -17 -50 37 -199 -92 60 -18 25 -63 35 22 3 9 194 -57 109
4301 109 40 -46 -3 4 -31 7 60 -29 -45 -87 -53 96 44 54 -37 -139 2 38 -102 -24 -3 -29 57 -53 -54 8 33 8
4329 8 85 -64 30 89 6 80 9 -78 23 56 27 55 -69 35 89 -14 115 66 -27 2 -63 24 96 -101 -34 41 5
4356 5 -1 95 -31 103 9 -21 64 23 -18 56 61 -156 13 -9 -13 -31 -51 -16 -6 -73 31 6 106 123 125 -19 -45 27 -46
4385 -46 14 -66 -7 10 -2 99 18 -148 82 -44 -1 -81 -1 35 71 -62 112 87 61 62 45 -28 73 -96 -55 223
4411 223 -55 31 3 -99 20 -12 14 -60 -43 4 78 20 -111 62 -112 9 -40 -78 167 -50 67 118 18 71
$$ packed form
4224B2Qj77K50j07p8L8k3J01l6p0J35r0J6N6j44Q0J40r2j7J62j43L3j01J10n4
4249A9j45J64rk0O0nj62Q6r3k0R0q9J54L8j61J50J1j65kK70k47N5l4j27L27k05
4275f0O3J22j32J6M2o6L9P8l02K66q3l3Q7k36J07J52p8M3q8R8j3j9OJ85k51J66
4301A09o9q6M3Pl5L8N3q9j6m2L4J49n2J0r1j02J41L6j40P8K1k6Q6j10jO2K5k5
4329HP7j49R4N9q3P4p1q7J01L3k9K8j24J04N4j03J29m9r3K9o5Q7P2j97O7P5l6
4356EoR6j26J34r4l0Q5m1m1P4Nk17J69k2mj8k0L5J0o7J04k5J00J7Kj44k6P2p3
4385d6O0q0N9J7j2J01q1j66K30j26M3q0Q0L6L6j33J74k5k6Jj7p3J01j69M1K78
4411B23k78Q6k8j02J19l2K6p4J7M7P4n8j31J73j74J21m9l8K45k17J17N1j00N3
$$ plain form
4435 71 11 71 -1 -28 -67 45 83 -88 34 -94 -64 84 -44 36 -52 52 39 11 71 9 -5 -46 44 13 26 101 36
4462 36 15 -82 -37 110 -47 10 19 -137 -63 -29 -94 52 52 28 32 -44 -11 -40 51 -57 35 -43 5 116 -97 -46 45 -22
4490 -22 44 32 55 158 -5 -15 86 18 -28 131 -28 139 70 26 48 105 -5 -74 -13 14 26 -29 -29 -25 -24 36 30 -53 116
4519 116 -65 -52 56 29 -144 11 -25 134 12 58 -53 34 13 -41 -92 77 61 77 -22 134 -68 -74 55 -109
4543 -109 23 -7 -5 4 -19 -19 81 -90 15 35 -69 21 45 -88 62 45 9 -13 -79 -42 -55 1 -130 -98 -48 -19 -32
4570 -32 -47 -74 74 63 115 -62 -41 -77 -13 61 -34 17 -27 -7 -147 4 -89 4 -99 10 4 -17 -28 -46 42 -69 59
4597 59 3 23 54 -46 -59 -15 -69 118 -1 122 -5 125 10 0 41 -28 80 -97 52 12 35 76 35 112 55
4622 55 -105 -52 19 -164 10 107 -46 -112 -66 -25 30 14 10 49 -74 97 40 41 -25 41 -90 -3 55 143 -12 -13 -64 -33
$$ packed form
4435G1o0O0p2k7l9J12L8j71J22j28L0J48j28Q0q8J04j3k8O0o2j4m1R0l1J3P5o5
4462C6k1r7M5J47j57N7Rj56P4L4o5J46%k4Mp6L3k9R1j08R2p8M8J11k13N1R1o7
4490b2O6j2K3J03j63j0J01o8m6J59j59J67o9m4K2N7j10o9O1K7J2n5%MJO0oq3J69
4519A16j81J3J08k7j73J55l6J59j22M6j11Q7k1n4n1J69j6J6r9J56k02oJ29j64
4543a09J32l0KRk3%J00j71J05K0j04R0K4j33J50j7l6k2o6L7j3N6j31L2N0K9j3
4570c2j5k7J48j1N2j77K1l6O4P4r5N1m4K0j40J51r3R3j03J09ok1j1j8Q8j11J28
4597E9n6K0L1j00j3M4n4J87j19J23j27J30j15j0M1o9J08j77J49m0K3M1m1P7n7
4622E5j60N3P1j83J74R7j53o6M6M1N5j6mL9j23J71n7Jo6O6j31Q7N8Q8j55jn1L1
$$ plain form
4650 -33 -41 -84 -22 78 -8 62 -33 -2 -57 -97 96 50 121 -55 -130 12 44 -19 3 60 -8 43 17 -15 -90 -105 43 77
4678 77 59 -39 -32 67 0 -92 -10 78 46 -50 77 46 -77 -17 -47 13 -23 41 -33 22 -58 54 -74 -5 115 -69 -36 16
4706 16 -29 -79 -82 44 56 57 -65 4 -109 -7 -76 -141 96 5 56 9 40 10 41 -69 41 -48 20 -17 22 -17 -99 89
4734 89 -114 26 36 -67 41 -61 -66 -50 -37 -56 -92 -30 4 -41 -27 133 52 -53 -7 12 -66 91 -89 -29 -207 2
4760 2 -48 -26 -50 24 -97 -5 32 38 40 -20 -49 44 25 -13 -55 -66 -16 -113 -54 50 2 -107 -43 7 63 -68 -44 -35 43 -85
4790 -85 46 17 4 -63 17 -49 59 -57 -30 46 -76 -107 47 -38 -8 89 -43 -24 -83 -15 -48 -42 34 -29 -61 -30 138
4817 138 -20 20 82 -79 -9 -67 -50 36 18 -31 72 26 -128 19 86 60 72 -57 -105 -81 -28 30 61 52 -40 -40 -10 30
4845 30 -50 -7 30 72 -70 14 57 -43 -19 -221 -15 -87 119 146 53 20 5 107 76 -15 84 -16 -31 -160 -18 34
$$ packed form
4650c3qm3O2J00q6P0r5L1n5m0J93m6P1j76p5J42L2o3K2N7o8N1k6l2p5j5J48L4
4678G7j8r8PR9o7r2Q2Q8l2r6J27l1j23O0l0O0l6O4p4N5q0J12j28O9J20j84L3N2
4706A6m5n0lJ26J2Jj22O9j13J02o9o5K37r1N1m7L1l0L1j10J10q9O8l7L9l9q2J88
4734H9k03J40J0j03J08j02nJ6J3j9l6O2L4m5J4J60q1j05M6J9p8J57j80O0j78K09
4760Bn0K2k4P4j21R2L7OKo0k9R3j9l8m2j1N0r7N9J04m8j09O4N0N6j31K4RP8j28
4790h5J31k9j3o7Q0o6J08j16K7P6j22l1J54q5L0R7j32J9n9O8l3OP6o3l2L1J68
4817A38j58M0O2j61P0n8J7Q6j8m9J03m6j54J47O7k6J2j29m8K4N3N8L1rr2%L0M0
4845C0q0M3L7M2j42Q4M3j00K4k02K06p2K06K7r3l3j5J02l1r1R9j00j5j29J42N2
$$ plain form
4871 34 141 -70 63 17 -22 -94 -48 -56 -8 -38 -30 42 9 25 -46 -89 -77 22 20 32 -35 -50 -23 12 -81 -31 -35 -117 52 -29
4901 -29 -133 58 31 -24 -52 59 -5 -26 -75 -46 27 -14 13 -43 32 -38 17 65 -2 -7 -20 28 103 12 -65 -28 -95 -73 112
4930 112 -101 -20 -35 87 53 56 -37 71 -6 -89 -39 4 58 13 -78 -63 26 -5 31 41 -31 -8 27 -16 -10 -85 65 -8 88
4959 88 -48 -55 -3 59 -25 42 58 41 16 -22 9 36 -36 -70 -64 28 -73 -56 15 44 15 5 -113 -121 -144 -98 -41 60 4 15
4989 15 40 -103 57 11 -115 39 28 -62 -17 -38 112 99 -47 -38 -117 -35 -31 64 -25 20 -21 7 24 14 20 51 -132 2
5017 2 8 -70 21 -31 43 -3 -55 -65 -36 88 77 24 47 -12 -74 -15 51 12 -51 -33 47 -40 60 -95 -2 52 -68 -12 66
5046 66 -67 -3 35 -110 -60 31 55 45 -133 200 51 4 11 36 -110 110 -5 16 27 -63 54 44 -133 -132 -127 22
5072 22 40 -114 -165 27 -109 32 55 -7 -31 -9 -15 -34 45 107 56 -19 41 44 -17 48 -12 -37 3 -53 49 94 5 38 128
$$ packed form
4871C4J07k11J33m6l9p2M6qM8l0QP2l3J6p1m3J2R9kJ2o7j5K7L5r3N0mq2J69q1
4901b9j04J91k7n5k8J11o4k1m9K9P3m1K7n6P5p0N5M8o7nj3M8P5r1p7L7o7K2J85
4930A12k13Q1j5J22l4Lr3J08p7q3N0M3N4m5r1J5Q9l1L6J0p2K3L5m3Op5J50p3R6
4959H8j36pN2O2q4O7J6j7k5l8L1K7p2l4OR2j01J7P1K9k9j0j18qk3M6N7J01n6J1
4989A5K5j43J60m6j26J54j1r0M5k1J50j3j46Rp9Q2MR5q9M5m1K8J7j0OL1j83J34
5017BOp8R1n2P4m6n2j0K9J24j1n3K3n9o2N9O6l9o3J8Q0q7J00j55R3N4j20N6P8
5046F6j33O4L8j45N0R1K4j0j78L33j49m7PK5j46K20j15K1J1r0J17j0j77JNJ49
5072B2J8j54n1J92j36J41K3o2k4K2oj9P9O2n1p5O0Lo1O5o0k5M0n6J02M5q9L3R0
$$ plain form
5101 128 -55 94 -37 96 -73 5 21 51 141 53 -49 -38 -46 -9 -1 50 31 12 62 -7 34 136 -9 2 108 -53
5127 -53 -78 80 -35 -51 -4 33 14 104 -51 -49 -109 40 18 -4 -30 -101 28 -128 -16 -27 -9 54 -52 -30 -33 61 -31
5154 -31 -30 28 33 -90 -46 2 3 -34 -40 10 3 -83 104 47 -57 83 -20 -58 -62 38 -141 -109 -7 14 30 -69 -60 -61 17 29
$$ packed form
5101A28j83J49j31J33j69P8J6L0R0q8j02J1qL7QN1j9j9N0o9M1J02j45J1J06j61
5127e3k5J58j15j6M7L7j9R0j55Ko0J49k2k2k6p1J29j56J12j1J8O3j06K2lR4r2
5154c1JN8Nj23M4M8Jl7oN0pq6J87n7j04J40j03l8mJ00j79L2J02K1J6r9RjP8J2
$$ [...]
8191g
##END NTUPLES=NMR FID
##END=
