##TITLE=1H_DE-80H_X3
 200.13MHz, d2o
 8 sc
 
 19ns.26.2.2025
##JCAMPDX= 6.0         $$ Bruker NMR JCAMP-DX V2.0
##DATA TYPE= NMR FID
##DATA CLASS= NTUPLES
##ORIGIN= UXNMR, Bruker Analytische Messtechnik GmbH
##OWNER= pz
$$ XWIN-NMR		Version 3.5
$$ Mon Jul 20 15:28:37 2026 Russian Standard Time (UT+4h)  Yarkov@DPX200
##.OBSERVE FREQUENCY= 200.1313
##.OBSERVE NUCLEUS= ^1H
##.DELAY= (6, 6)
##.ACQUISITION MODE= SIMULTANEOUS
##.ACQUISITION SCHEME= undefined
##.AVERAGES= 8
##.DIGITISER RES= 18
##SPECTROMETER/DATA SYSTEM= spect
##.PULSE SEQUENCE= zg30
##.SOLVENT NAME= CDCl3
##.SHIFT REFERENCE= (INTERNAL, CDCl3, 0, 14.3821)
##AUDIT TRAIL= $$ (NUMBER, WHEN, WHO, WHERE, WHAT)
$$ ##TITLE= Audit trail, XWIN-NMR		Version 3.5
$$ ##JCAMPDX= 5.01
$$ ##ORIGIN= Bruker BioSpin GmbH
$$ ##OWNER= Yarkov
$$ C:/Bruker/XWIN-NMR/data/yarkov2/nmr/H-C/1/audita.txt
$$ ##AUDIT TRAIL=  $$ (NUMBER, WHEN, WHO, WHERE, WHAT)
(   1,<2026-07-20 15:27:07.37 +0400>,<Yarkov>,<DPX200>,
      <created by zg, POWCHK disabled, PULCHK disabled
       configuration hash MD5:
       00 E9 B6 7A A2 85 ED C7 34 08 36 98 17 FE 4E 26
       data hash MD5: 16K
       E5 00 63 A2 B5 1E B6 21 E4 34 E5 E6 DB 07 7F F8>)
$$ ##END=
$$ 
$$ hash MD5
$$ 90 39 2A 7D F6 97 BD D8 C7 45 97 01 92 2A C5 43
##$RELAX= 
##$RELAX= 
##$RELAX= 
##$RELAX= 
##$RELAX= 
##$RELAX= 
$$ Bruker specific parameters
$$ --------------------------
##$DU= <C:/Bruker/XWIN-NMR>
##$EXPNO= 1
##$NAME= <H-C>
##$PROCNO= 1
##$TYPE= <nmr>
##$USER= <yarkov2>
##$AMP= (0..31)
100 100 100 100 100 100 100 100 100 100 100 100 100 100 100 100 100 100 
100 100 100 100 100 100 100 100 100 100 100 100 100 100 
##$AQSEQ= 0
##$AQ_mod= 1
##$AUNM= <au_zg>
##$AUTOPOS= <>
##$BF1= 200.13
##$BF2= 200.13
##$BF3= 200.13
##$BF4= 200.13
##$BF5= 200.13
##$BF6= 200.13
##$BF7= 200.13
##$BF8= 200.13
##$BYTORDA= 1
##$CFDGTYP= 0
##$CFRGTYP= 5
##$CHEMSTR= <none>
##$CNST= (0..31)
1 1 145 1 1 1 1 1 1 1 1 1 1 1 1 1 1 1 1 1 1 1 1 1 1 1 1 1 1 1 1 1 
##$CPDPRG= <>
##$CPDPRG1= <>
##$CPDPRG2= <>
##$CPDPRG3= <>
##$CPDPRG4= <mlev>
##$CPDPRG5= <mlev>
##$CPDPRG6= <mlev>
##$CPDPRG7= <mlev>
##$CPDPRG8= <mlev>
##$CPDPRGB= <>
##$CPDPRGT= <>
##$D= (0..31)
0 0.7 0 0 0 0 0 0 0 0 0 0.03 0 0 0 0 0 0 0 0 0 0 0 0 0 0 0 0 0 0 0 0 
##$DATE= 1784546826
##$DBL= (0..7)
120 120 120 120 120 120 120 120 
##$DBP= (0..7)
150 150 150 150 150 150 150 150 
##$DBP07= 0
##$DBPNAM0= <>
##$DBPNAM1= <>
##$DBPNAM2= <>
##$DBPNAM3= <>
##$DBPNAM4= <>
##$DBPNAM5= <>
##$DBPNAM6= <>
##$DBPNAM7= <>
##$DBPOAL= (0..7)
0.5 0.5 0.5 0.5 0.5 0.5 0.5 0.5 
##$DBPOFFS= (0..7)
0 0 0 0 0 0 0 0 
##$DE= 6
##$DECBNUC= <off>
##$DECIM= 32
##$DECNUC= <off>
##$DECSTAT= 4
##$DIGMOD= 1
##$DIGTYP= 9
##$DL= (0..7)
0 120 120 120 120 120 120 120 
##$DP= (0..7)
150 150 150 150 150 150 150 150 
##$DP07= 0
##$DPNAME0= <>
##$DPNAME1= <>
##$DPNAME2= <>
##$DPNAME3= <>
##$DPNAME4= <>
##$DPNAME5= <>
##$DPNAME6= <>
##$DPNAME7= <>
##$DPOAL= (0..7)
0.5 0.5 0.5 0.5 0.5 0.5 0.5 0.5 
##$DPOFFS= (0..7)
0 0 0 0 0 0 0 0 
##$DQDMODE= 0
##$DR= 18
##$DS= 0
$$ [...]
##$SUBNAM2= <"">
##$SUBNAM3= <"">
##$SUBNAM4= <"">
##$SUBNAM5= <"">
##$SUBNAM6= <"">
##$SUBNAM7= <"">
##$SUBNAM8= <"">
##$SUBNAM9= <"">
##$SW= 18.0517328524113
##$SWIBOX= (0..15)
0 0 2 0 0 0 0 0 0 0 0 0 0 0 0 0 
##$SW_h= 3612.71676300578
##$TD= 16384
##$TD0= 1
##$TE= 0
##$TE2= 300
##$TE3= 300
##$TEG= 300
##$TL= (0..7)
0 120 120 120 120 120 120 120 
##$TP= (0..7)
150 150 150 150 150 150 150 150 
##$TP07= 0
##$TPNAME0= <>
##$TPNAME1= <>
##$TPNAME2= <>
##$TPNAME3= <>
##$TPNAME4= <>
##$TPNAME5= <>
##$TPNAME6= <>
##$TPNAME7= <>
##$TPOAL= (0..7)
0.5 0.5 0.5 0.5 0.5 0.5 0.5 0.5 
##$TPOFFS= (0..7)
0 0 0 0 0 0 0 0 
##$TUNHIN= 0
##$TUNHOUT= 0
##$TUNXOUT= 0
##$USERA1= <user>
##$USERA2= <user>
##$USERA3= <user>
##$USERA4= <user>
##$USERA5= <user>
##$V9= 5
##$VALIST= <valist>
##$VCLIST= <CCCCCCCCCCCCCCC>
##$VD= 0
##$VDLIST= <DDDDDDDDDDDDDDD>
##$VPLIST= <PPPPPPPPPPPPPPP>
##$VTLIST= <TTTTTTTTTTTTTTT>
##$WBST= 1024
##$WBSW= 4
##$XGAIN= (0..3)
0 0 0 0 
##$XL= 0
##$YL= 0
##$YMAX_a= 48185
##$YMIN_a= -72340
##$ZGOPTNS= <>
##$ZL1= 120
##$ZL2= 120
##$ZL3= 120
##$ZL4= 120
##$ABSF1= 10
##$ABSF2= 0
##$ABSG= 5
##$ABSL= 3
##$ALPHA= 0
##$AQORDER= 0
##$ASSFAC= 0
##$ASSFACI= 0
##$ASSFACX= 0
##$ASSWID= 0
##$AUNMP= <proc_1d>
##$AZFE= 0.1
##$AZFW= 0.1
##$BCFW= 1
##$BC_mod= 2
##$BYTORDP= 1
##$COROFFS= 0
##$CY= 83.5205535888672
##$DATMOD= 1
##$DC= 2
##$DFILT= <>
##$DTYPP= 0
##$F1P= 10.8118882576601
##$F2P= -7.23987719738617
##$FCOR= 0.5
##$FTSIZE= 0
##$FT_mod= 4
##$GAMMA= 1
##$GB= 0.15
##$INTBC= 1
##$INTSCL= 1
##$ISEN= 128
##$LB= 0.25
##$LEV0= 0
##$LPBIN= 0
##$MAXI= 10000
##$MC2= 0
##$MEAN= 0
##$ME_mod= 0
##$MI= 1.114404
##$NCOEF= 0
##$NC_proc= 0
##$NLEV= 6
##$NOISF1= 3.799351
##$NOISF2= 2.8
##$NSP= 1
##$NTH_PI= 0
##$NZP= 0
##$OFFSET= 14.38212
##$PC= 1
##$PHC0= -7261.524
##$PHC1= 15.42198
##$PH_mod= 1
##$PKNL= yes
##$PPARMOD= 0
##$PSCAL= 0
##$PSIGN= 0
##$REVERSE= no
##$SF= 200.129724274929
##$SI= 16384
##$SIGF1= 3
##$SIGF2= 2
##$SINO= 400
##$SIOLD= 16384
##$SREGLST= <1H.CDCl3>
##$SSB= 0
##$STSI= 0
##$STSR= 0
##$SW_p= 3205.1282051282
##$SYMM= 0
##$S_DEV= 0
##$TDeff= 0
##$TDoff= 0
##$TI= <>
##$TILT= no
##$TM1= 0
##$TM2= 0
##$TOPLEV= 0
##$USERP1= <user>
##$USERP2= <user>
##$USERP3= <user>
##$USERP4= <user>
##$USERP5= <user>
##$WDW= 1
##$XDIM= 8192
##$YMAX_p= 0
##$YMIN_p= 0
$$ End of Bruker specific parameters
$$ ---------------------------------
##NTUPLES= NMR FID
##VAR_NAME=  TIME,          FID/REAL,        FID/IMAG
##SYMBOL=    X,             R,               I
##VAR_TYPE=  INDEPENDENT,   DEPENDENT,       DEPENDENT
##VAR_FORM=  AFFN,          ASDF,            ASDF
##VAR_DIM=   8192,          8192,            8192
##UNITS=     SECONDS,       ARBITRARY UNITS, ARBITRARY UNITS
##FACTOR=    0.0002768,     1,               1
##FIRST=     0,             0,               0
##LAST=      2.2672688,     0,               0
##MIN=       0,             -72340,          0
##MAX=       2.2672688,     48185,           0
$$ Real data points
##PAGE= N=1
##DATA TABLE= (X++(R..R)), XYDATA
$$ [...]
913Gn38L51j26j59J053n73OO25l75K42P7p31M04p8l70M80m96l10O35m91K66O3
935c8p60O22K39l62L70k3k89P92k87j53K82m22J31M83p48K78q3n62O86o0o58L89
957a73j16J31M23n76K4K79j20L62J0n59P37j1m03M58n23P9L36m49J08po49O15
979b4J48o73K48j68O6Q81p89k75R04p1J75j79k68O30l16l33M51k55k95L38l50
1000a55j73L62q32N14Q4m03L37R3Q8M09l87J23P10l81j64K26k97K52j59o43M39
1021D3k0m40P9k58P0N24m90L37J83k98O01q0k33N18j54j08N00m71m44J93p4K07
1043A85l40o71M58K15m36M22l01L1P30l21l6M67k98K89J99l17J52j94l39M71m91
1064a25l82M85l16j40M16m93J46K73k83N28m3j01M20j79n7L94m97K01K75n81K90
$$ plain form
913 7 -531 -180 -306 -465 588 15 21 646 271 513 590 -141 263 185 -185 295 -201 -511 124 -367 -101 -38
935 -38 -798 -176 63 -299 71 48 -241 551 264 111 393 -29 102 585 -163 115 32 -530 156 96 -562 -173
957 -173 -289 -158 265 -311 -287 -8 -128 234 244 -315 422 411 8 466 -57 22 358 -91 17 10 -639 -24
979 -24 124 -549 -301 -469 -403 478 -311 -586 318 247 422 243 -25 605 289 -44 407 152 -143 195 -155
1000 -155 -328 34 -798 -284 -200 -603 -266 -173 -85 324 -63 60 770 389 225 451 154 406 247 -396 43
1021 43 23 -417 -338 -596 -526 -2 -492 -155 28 -270 331 251 18 536 382 274 774 303 -141 52 -22 185
1043 185 -155 -826 -368 -153 -589 -167 -468 -437 293 -28 -64 403 105 394 593 276 428 234 -105 366 -125
1064 -125 -507 -22 -338 -478 -62 -555 -409 -136 -419 109 66 -35 385 206 149 543 46 247 522 -59 231
1085B31j85m74J32J10k49J91k84K51L70l87L01L26m13L48K75n21M59k52j31M09
1105E07l76k03J33j28J30k09n83M83K62l45K27j16m2N65l39N1L23k86K73M3l86
1126a6K44j96j93L64l32k35L90k41J27J65n08J95K00k18M38j92k82O58k59r8L40
1147C51l81J24R9j48K55k55j90K30j21k53M37j64k42K04l28L29J76n27M42K67
1167C05l70L32r2r8K73l22Q9J75m34P0J72l75K38j46k47L90j01j54L50j95mL71
1189B27k34K06R6l18L11o7l10M29l11j99K22l03K5J58m63L52P1k29L60q8q6L89
1211B38j17L6J96j52J14J18l98J59J26l95J07k07j22K17j43j90L33k34K19J40
1231D5j87K74J34l28L85Oj67J98k15p1K14m44j3K85m09J41r0j22M13j86o2L58
$$ plain form
1085 231 46 -428 -296 -186 -435 -244 -528 -277 93 -294 7 333 -80 268 543 22 481 229 98 507
1105 507 131 -72 61 -67 63 -146 -729 -246 16 -329 -102 -218 -260 305 -34 17 340 54 327 370 -16
1126 -16 228 32 -161 203 -129 -364 26 -215 -88 77 -431 -236 -36 -254 184 -8 -290 368 109 11 351
1147 351 -30 94 193 45 300 45 -145 85 -36 -289 148 -16 -258 -54 -382 -53 123 -404 38 305
1167 305 -65 267 175 77 350 28 117 292 -142 -72 100 -275 -37 -183 -430 -40 -141 -295 55 -140 -144 227
1189 227 -7 199 295 -23 288 221 -89 340 29 -170 52 -251 -226 -68 -531 -179 -108 -337 23 -65 -151 238
1211 238 121 157 353 201 315 433 35 194 320 -75 32 -175 -297 -80 -223 -413 -80 -314 -95 45
1231 45 -142 132 266 -62 323 329 162 360 145 74 288 -156 -169 116 -293 -152 -242 -364 49 -137 -199 159
1253A59l24J13M83m19J87K63l28K15k33o7J72k94j29K05k93n8K06k54K36J19k23
1274b64K65J82j46K18j22p1L55l27N5J07l17J33j07j85K04k05m1K69k55n9M42
1295A31m10K39K10j29K17k0l3R0j87j18J57j67n8J08k06Q8N5k51J79K5k18K86
1317a2j66J02K45j35j5K19k88J52O2k41L11j26j57J32j71j23L35k12j74K57r6
1338a01P5Ok20K27Nj59L02j77J29J55l25K37l3j13J25R9m42K26M6j95J37j60k10
1361c66M78l37J79J41j64K37N3k36J41o2j81M59k60l2J5j04Q8K5l40L13j82j4
1383a49J38m4j01N8K3RN9rJ51P4j51L25k28k08L01k86p2J62j56O6J3k25J02mj3
1408a65J70j24k2K46j11o9K82j27q6J94l18K87N8k56J70l22j28K63j36r0K66j26
$$ plain form
1253 159 -165 -52 431 12 199 462 134 349 116 49 221 -73 -202 3 -290 -348 -142 -396 -160 -41 -264
1274 -264 1 183 37 255 133 62 417 90 145 252 -65 68 -39 -224 -20 -225 -266 3 -252 -311 131
1295 131 -279 -40 170 41 258 238 205 295 108 -10 147 -20 -78 30 -176 -88 -33 -284 -105 -80 -298 -12
1317 -12 -178 -76 169 34 19 238 -50 102 164 -77 234 108 -49 83 -88 -211 124 -88 -262 -5 -101
1338 -101 -26 -20 -240 -13 -8 -167 135 -42 87 242 -83 154 121 8 133 232 -210 16 62 -133 4 -156 -366
1361 -366 112 -225 -46 95 -69 168 221 -15 126 64 -117 342 82 50 65 -39 49 74 -266 47 -135 -149
1383 -149 -11 -55 -156 -98 -75 -66 -7 -16 135 209 58 383 155 -53 248 -38 -110 52 -104 -38 -25 -250 -148 -152 -165
1408 -165 5 -119 -141 105 -6 -75 207 80 -6 188 -130 157 215 -41 129 -193 -321 -58 -194 -284 -18 -144
1430a44J27N5r9K55nn1L3m3M1J96l58J2J49j81q5J80k22N6r0PJ56j18M9J61j03
1455b2R0O6o1Q6Ll0N6j64j78K21j46J48L7k24q1O1o9K11j7k06K92L5j02K2N9k8
1481E9K14q7j86K18j86j2L9j91J13r8L2J26M8k20P6q1R0J14r3O0O2k0K11k88L9
1506C9J85k09lJ28r2mqj89Q5j16O3J01J8N9J87k99j8K47j10Ll3KL3L4j34J70j30
1533IJ6J6p9j04K44k14J7Q1p7J47j24Q2L8O3j15K30k52L3J14k12K30l7j13P3r9
1558c3M9J61k00M9j14o8O7L0R0k4J0q0J49p7L5R2p0j2lj00O7L0j11P3J3j57J0
1585a24M2j21J65p6K1J61j19K87o9r3OJ51j31j07J39p5P1k93J69K6j49M0J9p9
1609a39N1M3j03J53J14L1J3k08O1J04j19J24j40j03N6J90j48p6J6L8j4j8p4J14
$$ plain form
1430 -144 -17 38 -61 194 189 138 171 128 169 365 7 19 168 -13 -98 82 -140 -84 -174 -167 -11 -129 -80 81 -22
1455 -22 68 134 73 159 162 132 188 24 -154 67 -79 69 106 -118 -199 -138 -207 4 -13 -219 73 108 6 28 87 59
1481 59 273 186 0 218 32 20 59 -132 -19 -117 -85 41 89 -131 -55 -136 -46 68 -25 35 97 77 288 0 39
1506 39 224 15 12 140 48 44 36 -153 -68 -184 -121 -20 -2 57 244 -55 -73 174 64 67 34 36 69 103 -31 139 9
1533 9 25 41 -38 -142 102 -112 -95 -14 -91 56 -68 14 52 115 0 230 -22 11 125 -87 143 106 -7 66 -33
1558 -33 16 177 -23 26 -88 -156 -89 -59 31 7 17 -63 86 9 44 136 66 54 51 -49 18 48 -63 10 23 -134 -124
1585 -124 -82 -203 -38 -114 -93 68 -51 236 167 74 80 231 100 -7 132 57 128 -165 4 30 -119 -79 -60 -139
1609 -139 -88 -45 -148 5 119 150 163 -45 16 120 1 125 -15 -118 -62 128 -20 -96 -80 -42 -56 -74 -148 -34
1633c4l6J52m3p2K07Nj62o4J71m3L6k16J2J82k69J47M7j68J16OJ9K6%J38j08K2
1659G1R6l1p4n3P8j03N8j68J03j6n8K1R2j20n3K05j81J71j4P6J2J1pj6j20N4L4
1686F8j33Q4J32l19P6qjJ06j8o9O8l9R3l1j5J43n4p5J34j48QO4r3J0N4m8j2q3
1714a06J3J81j60k5Q1J74j52J11q4L8p5j0K2O7m5nj38J59K2m5m5Q9j00j23J53
1739cm3n2J00q7Q0l5N5qN2k7k7L4p0J21j02P5m1p1N8n8l5P2K3Q9q3j8r3N8K0j03
1769a19J01N6nm3R0l7m9n1J60j44J7Q1j03j00R0Ok1J6j3R1n2L2O9j57N2J88r7
1796E8NM6j03l1Q6p2mj20nP3j42N7J01k1j5J65L2k9Om8N5j26Q4m0l3O0J19j93
1824c5l7J81j91N5M2o7kpq3J77j9j6J1M0j16P4J06p2l8J6MPR2q0o4J5kq1M0J14
$$ plain form
1633 -34 -70 82 39 -33 174 179 17 -47 124 81 117 -99 -87 95 -174 -27 20 -148 -32 -26 -7 19 19 157 49 71
1659 71 167 136 62 9 87 -16 42 -126 -23 -39 -97 -76 16 -104 -157 48 -133 38 24 100 112 123 116 100 -20 34 68
1686 68 -65 19 151 -168 -92 -100 -101 5 -13 -82 -14 -53 40 9 -6 137 83 8 142 -6 2 66 -27 -17 37 -11 -23 -106
1714 -106 -93 88 -72 -97 -16 158 6 117 33 71 -4 -14 8 75 30 25 -113 46 68 23 -22 67 -33 -156 -3
1739 -3 -46 -98 2 -85 -5 -40 15 7 59 32 5 39 -31 90 -12 63 22 -49 9 -49 -84 -12 11 100 17 -1 -94 -36 -16 -119
1769 -119 -18 38 33 -10 80 43 -6 -57 103 -41 -24 57 -46 -146 -56 -50 -71 -55 -68 23 -29 3 72 -85 -33 155 58
1796 58 63 109 6 -25 61 -11 -15 -135 -140 -67 -209 -152 -51 -72 -87 78 110 81 87 39 94 -32 52 12 -21 39 158 -35
1824 -35 -72 109 -82 -27 15 -52 -54 -61 -144 33 14 -2 9 49 -67 7 113 41 3 19 23 30 122 42 -22 -7 -9 -90 -50 64
1854F4j38R7m2l7J10n8P1L2no1n5O4N0k02oN3N1k8k0L6N3M9j24M9O0j28J36Oj07
1883c0Q8m5N6j9M2j13J3k6N6O9j56J28q4m5M8M5%O1j01n1J13p8K8k8j1J89r7m3
1911IO6o3j59K07o2J0k8j11J12M6p7O3J3j16J32j86J73Lq0k0J02r7P7J0k3n8O5
1938Hj23Q1J4PqN3Q8j69l1N0K5j9L1OM2q0P4o7O6j16K3L2j8K7n6M1k6m0R3k8n7
1969g7J07Q1o8l1kk2O9n3j14J53k6k9l6QJj01J83L5p7q%P2m6N1m0k8J04q4k8J11
1999A05k27J60j03J39M3j06Pn2N5O6r9j77J93l7K7OJ08p6K8mom1O6p0j6K9k03
2026a85J58K6O9m6Rj0kl4j2K2m8j6J35Qm3K3O4j33J0%n1J7m2lK0J42j28J2R1p7
2056b4P4j9l8Pm3J04j1l5q1O6n7j9N2q7J0N2pJ69j57o3J79q1J8m0J04Qo3N7N0
$$ plain form
1854 64 -74 23 -19 -56 54 -4 67 99 94 33 -22 42 92 -110 -116 -63 -12 -40 -60 -24 29 78 -46 3 63 -65 71 77 -30
1883 -30 58 13 69 50 92 -21 -8 -34 22 91 -65 63 -21 -66 -18 27 27 88 -13 -64 49 -29 -1 -29 -40 149 52 9
1911 9 75 12 -147 60 -2 8 -20 -131 -19 27 -50 13 26 -90 42 -144 29 32 -48 -68 34 -63 14 24 1 -57 8
1938 8 -115 -34 -20 -13 -21 32 120 -49 -80 -30 -5 -24 7 13 55 -25 49 -18 48 -68 -45 -13 -31 -4 -60 -19 -45 -85 8 -20 -77
1969 -77 30 111 43 12 10 -12 57 4 -110 43 17 -12 -48 -40 -39 -140 43 78 1 -7 -7 65 19 70 30 2 106 22 -6 105
1999 105 -122 38 -65 74 117 11 18 -34 21 87 -12 -189 4 -33 -6 0 108 32 60 56 50 9 75 5 -11 18 -185
2026 -185 -27 -1 68 22 31 21 19 -15 -27 -5 -53 -69 66 74 31 54 118 -15 -5 -5 -56 -39 -81 -84 -64 78 -50 -38 53 -24
2056 -24 50 31 -7 0 -43 61 50 15 -66 0 -57 -76 -24 -111 -101 -49 -56 113 -44 -107 72 -9 9 -31 73 81 18 75 125
2085A25k0j88J57r4j6j8Rk8J9p8J24L5Mn9J4jJ1n7J64r1K0r8P4j8M1K7m1mq4L0
2115d1PQ0m6n7J1M2j4L8p6P9mL8k1m2M5j5Kj61J52J22jj32M0j18p2J53j14L2Q0
2144Gm4k7J50j72J60K4r9P8K0j6j13j9J24o0j47J62q6Q7k6n9l0J24j13j9J24N3
2170H3R8j75j5n8J56q8K6l1m2P9n4k9J29m3q2J28r0ql0M7NJ17j69M9k4m1J52j05
2198a5K2K6o0O1j4k6O6n8m8p0R5R2j03%j04J62j8L3K4l0K1l9Mm5N3nM7q8J25j54
2228d6N2l8N2j34J50n9p8J94j31RJ6j2%n4M7o8J31n2l0R5q0J36j01lP6m4J7j50
2256a05J88J2m6m3K6j6j30J59j26J38l7j16R3l5j02M3R3m3N0j06O0N4q3Q2M7o5
2282hJ16r5K3o3Q2q9Qo0m1J18L8o8M7J40r8j20J01K1N4r5l7J74k76Q0J12j05%
$$ plain form
2085 125 105 -83 74 -20 -36 -54 -45 -73 -54 -132 -8 27 31 -28 -14 -15 -4 -61 103 12 32 -66 8 -10 31 58 17 13 -71 -41
2115 -41 -34 46 0 -57 -46 -4 -18 20 -56 23 19 57 36 -6 39 24 26 -135 17 139 138 6 46 -72 -144 9 -105 -73 7
2144 7 -37 -64 86 -86 74 98 -1 77 97 81 -32 -51 73 13 -134 28 -58 29 3 -56 -86 38 -75 -94 30 83
2170 83 181 6 -9 -67 89 1 27 -4 -46 33 -21 -50 79 36 -46 82 -8 -16 -46 1 6 123 -46 3 -21 -62 90 -15
2198 -15 7 33 -27 34 20 -6 60 2 -46 -116 -21 71 -32 -32 -136 26 8 41 65 35 56 17 21 -24 29 24 71 -17 108 -46
2228 -46 6 -32 20 -114 36 -23 -101 93 -38 -29 -13 -25 -25 -79 -32 -100 31 -21 -51 44 -36 100 -1 -4 72 28 45 -105
2256 -105 83 95 49 6 32 16 -114 45 -81 57 20 -96 -3 -38 -140 -97 -4 -47 3 -103 -43 11 -72 10 57 -8
2282 -8 108 13 36 -27 55 -34 -26 -86 -127 -9 29 -39 8 148 50 -70 31 52 106 11 -26 148 -128 -48 64 -41 -41
2309d1K87k73J5L7P9r8K4N4m1p5Q6j82J39j1J51j80J33k19J58n1J4M5l0K1K3p8
2335a3L6j12M2J26j9p7P0j2j62J89k6j49J24k7KK3J0J65k10j2J9o5J10n7qk2K6
2362b9j13J54L2j12j05J45QMQ0l0k11Q3K80k38J39k19L36k19j28K59k39K70k45
2385i8RJJ68m8j10j71l2J48J83j07j34R5n9n8J60M6k85J53j00L02J55k04m2j10
2409a38J77K0l6P3j60R7Q9j47O6j1n8J9Q4p8M8n3j2M4n8J01k41J32Km5K61r2r1
2436gK0n4L1J11j35J3OR8n6l3j9O3j22N3q7J26m2R4j46k7J68M6L1k65J81l0J9
2463C7k7j06J86j70rJ30r1j9R2jj2o5Q0j11Q6jK4N3j29N1Pl5l9JQ1j20L6L0p7
2492a18R7M3M4o1N8j40J37n6L5n8j0n6R4L6j33K13o2j11M5M5j24N7l9L1m3m4J86
$$ plain form
2309 -41 246 -27 -12 25 104 6 30 84 43 -32 54 -128 11 0 151 -29 104 -115 43 -8 6 51 21 42 65 -13
2335 -13 23 -89 -47 79 60 -17 53 41 -121 68 42 -107 17 -10 -8 15 25 190 -20 -32 -13 -78 32 -25 -33 -55 -29
2362 -29 -142 12 44 -68 -173 -28 -20 -16 64 34 -177 -94 186 -52 87 -132 204 -15 -143 116 -123 147 -98
2385 -98 -89 -88 80 32 -78 -249 -281 -133 50 -57 -191 -96 -155 -213 -53 -7 -292 -139 -239 63 218 14 -28 -138
2409 -138 39 59 23 96 -64 33 122 -25 41 30 -28 -9 75 -3 45 -8 -20 24 -34 67 -174 -42 -40 -85 176 84 -7
2436 -7 13 -41 -10 101 -34 -21 -15 83 27 -6 -25 38 -84 -31 -118 8 -34 60 -86 -113 55 101 132 -133 48 18 37
2463 37 10 -96 90 -80 -89 41 -50 -69 23 22 10 -55 25 -86 0 -1 23 76 -53 -2 5 -30 -69 -68 13 -107 -71 -41 -118
2492 -118 -21 22 66 5 63 -77 60 4 39 -19 -29 -85 9 45 -88 125 63 -48 -3 42 -82 -25 -64 -33 -76 -120 66
2519F6j40J31q0j24K52r1k2k9Q2j5jK8n9O3j46N9L2o6J55j31j4R2L1q9P1j27J08
2546C6Kj30J09pk1M2Jm0O0q4O7r1N8M9N7j03M7r3P4P0j08O9j58K28j96rR1m3l
2575b6P9j2n4o7K8J25o9K2j28M9L6j6N5R2o7L4r1J4K1q9J23M3p9n7J36r9m3R2
2603E2j25M2J26j22K5J4PR1k01L9J20p6rn3M3j24L10m33l5L12j43J34Kr0lO9j3
2630d1L8r0J22jL6j56J8L0M6J1L3po2j02J41l0N6lL1l4JP6j08P9o3k4m3J29j44
2659f1R9K7j01o2J38o0O8q6O9j1o1q4P0K6P1p1P4r4K1LM2j31J26l0p7Q7j1J31
2687A12q8J9j26K7J16o3L2O1n9o6J51J0j05M7p0M8j03J45j61Q9p1O4n9l7J69j29
2713d7P4l3m6J19j40J25K5k05P6ON4n1N8Jo0M2m0J9R0n3Q1q7J0q1J87r5k4j48
$$ plain form
2519 66 -74 57 -23 -147 105 14 -8 -37 45 30 29 57 -2 61 -85 -26 6 -60 95 -36 -50 42 73 -16 55 -72 36
2546 36 38 -92 17 10 -11 31 32 -8 52 -32 35 -56 2 51 108 5 52 -41 33 103 -5 64 -94 134 -62 -71 20 -23 -26
2575 -26 53 41 -13 -80 -52 73 4 26 -102 -53 -17 -33 22 114 47 81 -10 4 25 -64 59 102 23 -34 102 3 -40 52
2603 52 -73 -31 95 -27 -2 12 19 110 -91 -52 68 -8 -17 -70 -27 -151 159 -274 -309 3 -140 -6 -4 -94 -97 -28 -41
2630 -41 -3 -93 29 28 64 -92 -74 -44 2 13 46 39 -23 -125 16 -14 42 39 70 36 37 113 5 84 21 -3 -46 83 -61
2659 -61 38 65 -36 -98 40 -20 48 -38 31 20 -41 -125 -55 -29 42 -29 45 -49 -28 -25 17 -114 12 -18 -95 -8 -19 112
2687 112 24 43 -83 -56 60 -3 29 90 31 -35 116 126 21 68 -2 46 -57 88 -73 16 -55 9 -50 -87 82 -47
2713 -47 27 -6 -52 67 -73 52 77 -128 -52 -46 8 -43 15 16 -44 -2 -42 -23 67 14 95 8 18 -63 124 29 5 -143
2741a43J66Nj59K06j74J50m4m6L7n0nJ60q8j25J43o5j7Q1l7O3K1p8j8j3J77k40
2767i3Q8J1N0J1k6L9m3L1k0j0Pj17J3k1J66j47R1j6j6kjR1j71K7R6K8n2J1p9M3
2797a1R2j17jM8Rk2on6J16l2j12J48Q2j03m4J22q2M6r1O1o3K4K5Pj45J27k2l4
2825c4M4K8q2J06m4lL1K9q5M8P7O0o5q1j9k6k0K4L7n5m3l9R1j4P2p5P7ln0m0J02
2856D8lm4O0k7m6J6J23k3n7j11J40r7J29j24p5R9o6M4J19j09K9P0J6q7k3K2j2
2883A1l2K4n3J3M6Lr5l7L7J15J4j86J79m3R9j01N6j28J37m0q7M2MR6o6Q7n6k0
2911A9%k5p7J91j98j3K53j52n8J3q1J32J09j31N4p7J6rj8N1j5N0LL1j04m2j3O7
2939b4r5K10q4J14j36L0L8K2m5O2j65J69q2MQ9j08LM1m4m8NjO5m0Rlj8p4J87m3
$$ plain form
2741 -143 23 28 -131 75 -99 51 7 -39 -2 -52 -57 103 15 -110 33 -32 -49 32 -5 58 79 1 -17 -30 147 -93
2767 -93 -5 6 56 67 41 80 37 68 48 38 45 -72 -59 -80 86 -61 30 14 -2 -4 -5 86 -85 -58 38 66 14 25 -54 -11
2797 -11 81 -36 -37 11 20 -2 -8 -64 52 20 -92 56 138 35 -9 113 31 77 -14 47 -16 8 33 40 -105 22 0 -34
2825 -34 10 38 -44 62 18 15 46 75 -10 38 115 175 110 29 10 -16 -36 -12 25 -30 -73 -112 -21 -35 37 -38 39 36 -14 -54 48
2856 48 45 1 61 34 -12 4 127 104 47 -64 76 -21 108 -16 -91 8 -58 -14 105 -4 25 95 111 24 1 23 11
2883 11 -21 3 -50 -37 9 12 -83 -120 -83 32 46 -140 39 -4 95 -6 50 -78 59 19 -68 -26 -22 74 8 95 39 19
2911 19 19 -6 -83 108 -90 -103 150 -2 -60 -47 -128 4 113 -18 36 -41 -25 -34 -52 -1 -16 34 37 68 -36 -78 -91 -24
2939 -24 -119 91 7 121 -15 15 53 75 30 92 -73 96 14 18 107 -1 2 43 -1 -49 -44 -45 20 -20 -11 -14 -32 -106 81 38
2969C8J14r0j16Q1k9LO0J3q1K9n8J3O3p4o4L2J7Q3j2j27R7j8m0J31L5q7l5J02
2997H0j1Nr7J03j10O4q1J8K7N7p7k7N3o5Q2p9O0J4P5n0j18L9RM8j01M4%P6r9m
3027f5J27r4M5p1M1J00j12Q6k5Q5Qj91O7Nj1j03J36rJ7j50P2N4K1q4Q1j03R8j52
3055a27J05L3N5p6J06J3j37L2m4L5Q6n2qm1Q7p4k8onM9RN2k08O3ON6KM1o4J6n4
3086g8QN6L4j11J39Qj88J09j2p0Q8JR3n7j4J22m4m9l1Mo0L2N5m5N4o7j0KJ40j60
3116e1J24j15N4Q3j53qR6k6J6K8l2M7k5Om1L6j4j36J26J52j04q8PL6p3O9n6j5
3144e7J3J09Q2j75J19o7K2L1o9rK4m3N3n3M1l3k6RN8L7j76J46n7m6J40j10Q1o6
3172b2j7J26j05O9N3p4r6J09m0k3P%J1j14Q7m1J09n1KO6r8J01P3j86R2n5J9K4
$$ plain form
2969 38 152 62 -54 27 -2 1 61 74 -7 22 -36 -23 40 -34 -98 -66 -49 34 22 -105 -8 -26 -66 65 100 13 -22 80
2997 80 69 74 -23 80 -30 34 -47 -29 -2 55 -22 -49 4 -61 21 -58 2 16 91 41 -77 -38 -29 19 -82 -38 -38 38 -61 -65
3027 -65 62 -32 13 -58 -17 83 -29 57 32 117 125 -66 1 6 -5 -108 28 19 36 -114 -42 12 33 -51 30 -73 25 -127
3055 -127 -22 11 66 -10 96 109 -28 4 -40 -5 81 29 21 -20 67 -7 -35 -41 -46 3 12 64 -144 -81 -75 -19 -17 24 -40 -24 -78
3086 -78 -70 -14 20 -91 48 56 -132 -23 -35 -105 -17 -16 77 20 6 128 84 35 4 8 -52 -20 35 -10 44 -23 -33 -31 109 -51
3116 -51 73 -42 12 95 -58 -66 30 4 20 48 16 63 38 44 3 39 25 -111 15 167 63 -25 -18 18 -55 14 -42 -57
3144 -57 -44 65 147 -28 91 24 46 77 8 -1 23 -20 33 -20 21 -12 -38 -29 29 66 -110 36 -21 -67 73 -37 44 -22
3172 -22 -39 87 -18 51 104 30 -66 43 3 -20 -13 -13 -2 -116 -29 -70 39 -12 -10 56 -42 59 132 -54 38 -17 2 26
3200B6p8R6j43J75j58R1kj0l4J5pj5Q0N5j41L2P0L8j79J00m0J51r0J1jn9oL5J22
3229A34j43j5Mo7P3j5Q6k7o1N6j4l6J51j59J28q1l1m6N5R6l6r2j9K2K1M1j17k7
3257a19K13n3m9L9K4m6M9L7j59P2l4L9N6j18Q8Q3j11oP3j50J39j05LL7q8R9K4
3284C7L3j20p9J22J3m8J76j63Q1j7j34N7l0J37r0N6j7n3M5j9m3N8J3M3J2j18M7
3311aq6Q8N6p7m3r0J85q9M8m9nJ64n0n7N0p9L1kj6M4k1N1l4l1P2n1k3O9j3r3k8
3342h0Q9K4J9m9o1Q2p7L0L7O7k7on2p5J13j2o5r7J54R8j4j16J69r1j03J22j1j38
3370g0O5r1J97m3p0Or5P2N0j01O7M2J6L3j21M4o7K4j5J17j42Q8J03j30N7L2L8
3397A06l2r0R4Rl3o4j8M0J6j25Q7P9J9r8N7j39R8M4k6l5k5N3N3j6o7R8j23J8l7
$$ plain form
3200 26 -52 44 -99 76 -82 9 7 -3 -37 -22 -29 -44 36 91 -50 -18 52 90 -89 11 -29 122 32 43 42 -17 -23 12 134
3229 134 -9 -24 -20 -87 -14 -29 57 30 -31 25 11 -25 126 -33 95 14 -17 -63 -8 88 52 -40 -59 -37 -16 25 -92 -119
3257 -119 94 41 -8 31 55 9 58 95 -64 8 -26 13 69 -49 39 122 11 5 78 -72 67 -38 -35 2 -86 13 37
3284 37 70 -50 -129 -7 6 -42 134 -29 52 35 -99 -42 -72 65 -25 31 14 -39 6 -13 -56 2 15 58 70 -48 -1
3311 -1 -87 1 57 -20 -63 -153 32 -57 -9 -58 -63 101 51 -6 44 -35 -4 -6 -22 22 1 52 18 -13 59 8 -15 54 41 -52 -80
3342 -80 9 33 52 3 -58 24 -53 -23 14 81 54 48 -4 -79 34 22 -43 -140 14 112 98 -18 151 60 -43 79 68 -70
3370 -70 -5 -96 101 58 -12 -6 -101 -29 21 -80 -13 29 45 78 -43 1 -66 -42 -57 60 -82 6 109 -21 36 68 106
3397 106 74 -16 78 87 54 -10 -28 12 28 -97 -10 69 88 -10 47 -92 6 50 24 -11 -36 17 70 54 -13 85 -38 -20 -57
3426e7M0N0l9N6m3j22P5K5O4j7K6n2J5N6p5n0J08j10O5r2K36j06j17PJ43j08j24
3453a46J42L4k3Q1j57o8J59M5M9o1q7lJ9j6RJ33j54J8K8N3Pj20J08j15N6r2j0
3480a11J18OK3j2nj1k6L3j3j8N8K2r3l1M5J60j47o4K6j0k4J44p6P2K5j79J09q3
3508f2J14o5j16J12o4K3Q7j57R5R2j10k9k6J07Q6j04L8M0k0l0m4l0Q2n0N4po2
3535d6P0J4j5LK9q0M7K0l3q4J06r1kJ17o4J3l7O2mjJl4k1NJ8Q%K5l3r0K57k18
3567e8Q4m5jRq1P2Q8l2l0R5r8pk8L2j9P5j06J21k32J44J24j56J23p4j52J34o7
3594h5O4l1k2P2J17r2q4j0P4N9j32N5p6P3km6J48p0N4p2qP2O4m5n7N9j00J03r3
3623a1M7j13M1O0jj05J76j88O4O0p3L5l1L4O5N5J8j19O4r0j14J18K0l1K3M8ol4
$$ plain form
3426 -57 -17 33 -6 50 7 -115 -40 -15 49 32 58 6 21 77 2 -48 60 -50 15 -77 159 53 -64 -57 86 -22 -146
3453 -146 -4 30 7 88 -69 -137 22 67 116 55 -32 -35 -16 -32 -23 110 -44 -26 2 55 62 -58 50 -65 -9 -101 -111
3480 -111 7 13 36 24 19 8 -18 15 2 -16 42 64 -29 -60 -15 145 -2 -66 -40 -50 -74 70 -6 66 91 -88 21 -62
3508 -62 52 -13 -129 -17 -81 -58 29 -128 -33 59 -51 -80 -106 1 87 -17 21 61 41 11 -33 -63 19 -31 23 16 -46
3535 -46 24 38 23 26 55 -25 22 42 9 -75 31 -60 -62 55 -9 4 -33 29 25 24 25 -9 -30 -25 -7 1 1 26 -7 -97 160 -58
3567 -58 26 -19 -20 -11 -92 -20 68 36 6 101 3 -4 -32 0 -19 56 -50 71 -161 -17 107 -49 74 0 -152 -18 -85
3594 -85 -21 -52 -74 -2 115 23 -61 -71 3 62 -70 -15 -91 -18 -20 -66 82 12 66 -6 -14 58 122 77 20 79 -21 82 -11
3623 -11 36 -77 -36 24 23 -82 94 -94 -30 30 -43 -8 -39 -5 60 115 133 14 78 -12 -126 -8 12 -19 4 52 46 12
3651A2P8j30oJJ05o7J30j39K9q1J6M0M6L4p9R3j86J73o6m4r5J37q1N7j5J17k9
3678E0r5O1p3N0J08j65N1O5q1m7q2J67j4J30j59N3J7q2J09j04J4R8k4L5j61J37
3704E8j03P2j68J47n1K3N8q4Q4q7n3J50j71J73q7l8j5N9P4k09K04%q4O2j6L1o5
3731c6J94j72N4j4J7N1m1j4n5OO9m3M7m5L3k8l2prNO6p6QqO6k9j9olJ24o4j12
3763g3M2J12j9k06M8R5j38J34o3L9j3O6q9m4N0J3J72j27j9l1n7L1J38j10M0j8
3789b7j6Q0m1K8j7J02p8J3N3n8N4o6o8K5kMM1J1m9j27J29L7NM6k9q1M5m0OK7K
3820IK4O0j22l0R1r9P7o1M9l2L1p9R7n1R1O5m3MPk2j18J9Q1J8p1K2j11J18L5p9
3850b0K5n1k7K0l1J37o1j2J43j36Q7m1l5j8O2r3J9N5m5O8m2l8R1m7j07J23N5j35
$$ plain form
3651 12 90 -40 -46 -45 60 -7 123 -16 13 -68 -52 -12 34 68 -11 82 -104 69 3 -41 -136 1 -80 -23 -38 79 50
3678 50 -45 16 -57 -7 101 -64 -13 52 -29 -76 -158 9 -5 125 -34 19 36 -46 63 -41 -27 71 47 82 -79 58
3704 58 -45 27 -141 6 -45 -22 36 -48 36 -51 -104 46 -125 48 -39 -77 -92 -33 41 -168 36 36 -48 14 -2 29 -36
3731 -36 158 -14 40 26 43 94 53 39 -16 -10 59 16 63 18 51 23 -9 -16 -25 -20 46 -30 -22 -30 36 7 -12 -18 -21 103 39 -73
3763 -73 -31 81 62 -144 -96 -1 -139 -5 -68 -29 -42 24 -65 -109 -59 -46 126 -1 -20 -51 -108 -77 61 -49 -9 -27
3789 -27 -43 37 -4 24 7 109 31 44 97 39 93 27 -41 -16 -18 -14 27 38 -11 -138 -9 28 33 79 50 -31 14 -26 -20 7 9
3820 9 33 93 -29 -59 32 -67 10 -51 -2 -34 -3 -82 15 -36 55 120 77 81 88 66 -52 -33 48 66 -5 17 -94 24 59 -20
3850 -20 5 -46 -73 -53 -84 53 -8 -20 123 -13 74 33 -2 -20 42 -51 -32 23 -22 46 4 -34 57 10 -97 26 81 -54
3878e4N9p4j7P2mJM5p9PQk1K1j1J20n4m5K7n7J6P2K3k24J94j38J65k8j34R4O1
3907D5p0L3L8q%K5r8N2l5O9j19k3J12ko8m8K37j92QRL4j01Q7k8JJ49j10m6Q7j9
3937A9n3N1k6L7j1l6Q4j44P6qK2N2p0o1k3p8K10j05KkM7L1j35O3O0O3p3M3j02
3966f7J34j38J45l1m9N1p2jM1M8j48O6J47q2J9m8K1K1o4n9J45j05oO5n4P7j15
3993e9J32j00RM9n2P6l1O7j05j13J27J43j50ol0J7M7J7J31j91M3q0J90j02MN4
4019H7r0K5j03J06LO6m1o1M5L7L2j18R2%j03Q2J0p5L5m6L5j13n7K75l7n1p4J02
4047F3k9o8J02p8lj19L4J35l3m4L7N5J0O7q2q9Q4k6pp4P8q1PN9L5m9%J40k3n7
4077D4M1m9n5P9j18J58N3r5r6RK5N1k9KOJ3o3M0p3R9J6j9Jn6O1K7K2n1n1L8K0
$$ plain form
3878 -54 5 -69 -86 -14 -18 -17 28 -51 -44 -36 -57 -36 -47 73 19 -26 1 -56 -40 32 55 -169 25 -113 52 24 -110 -16 45
3907 45 -25 8 46 38 38 63 -35 17 -18 51 -68 -91 21 19 -49 -97 140 -52 -44 -35 -1 -102 -15 -43 -42 107 -3 -49 38 19
3937 19 -34 17 -9 28 17 -19 65 -79 -3 -11 11 63 -7 -68 -91 -169 41 -64 -62 -64 -17 14 -121 -58 2 65 -8 35 -67
3966 -67 67 -71 74 43 -6 45 -27 -28 13 61 -87 -21 126 44 63 15 36 57 -7 -66 79 -26 -32 33 -21 56 -59
3993 -59 73 -27 -18 31 -21 55 24 91 -14 -127 0 143 -7 -13 -43 -26 21 38 169 -22 21 -59 131 29 33 87
4019 87 -3 22 -81 25 28 94 53 -8 37 74 106 -12 80 80 -23 59 69 -6 29 -17 18 -95 -152 123 86 35 -39 63
4047 63 34 -34 68 -10 -13 -132 -98 37 4 -40 -3 52 62 129 47 -42 42 16 9 -65 13 -68 -61 -2 33 -16 -16 124 101 44
4077 44 85 36 -19 60 -58 100 153 58 -38 -29 -4 47 18 20 26 39 -24 16 -57 42 58 39 40 -16 45 72 94 43 -8 30 50
4108E0m7O2m4ML8l5K7o0J8P5m4m6m0PK9K5K2J4j06K5K7K8O5p7rq9J07K5L1m8n7
4139b3K4N7q6J94j92R1k4k8m0L1j3j4L6k1k1l9K4Q4k0j96J67J4j7K7L5Ql4j58
4167a34Q7P1K2m3J09j77o9O6J8Q8q1Nk3Q1J2q2Q6m0M5n9p0R6k0O7o1l9Q6k1m1
4196b1M9j3j4J0o0L6J0K4o4J3J8J59j91o3M8J63j42K9p2Q2O7q4L0Q4m5n7Rk1l1
4225d7pQ3kK8jj18J55j03N2m2l1J6K0l8K2OL7l1m5N4J19j23L3m8R5j60J45j48
4253g9Q9j4l9R3o1J0q7J06o2R8j64j6Q6j3O8j4L9R1j30M3l4l2l0N6R5j33on4r
4282a03K16j53O2k0N9m5o6qP1L9j7r7J54p4L3l2m3M1N7m4jr6Q2J20n9k1p1j8j5
4311d9J84j74NN1OJ0nl2L9k1K3j1m9J17r7j8j1l8J18j5K7r1K5J9p7J67p1j06j5
$$ plain form
4108 50 3 65 21 25 63 28 55 -5 13 88 44 -2 -42 -35 -6 19 41 55 -51 -26 1 29 94 17 8 -81 26 51 82 34 -23
4139 -23 1 58 -28 166 -26 65 41 13 -27 4 -9 -23 13 -8 -29 -68 -44 40 20 -176 -9 5 -12 15 50 58 24 -134
4167 -134 -47 24 46 3 112 -65 -134 -68 -50 38 -43 -38 -61 20 32 -50 36 -4 41 -18 -88 8 -12 55 -6 -45 41 20 -21
4196 -21 28 15 1 11 -49 -13 -3 21 -43 -30 -12 147 -44 -107 -59 104 -38 -9 -81 1 68 -16 14 98 53 -4 5 -16 -47
4225 -47 -54 29 27 55 54 -64 91 -12 40 -2 -33 -17 3 -35 -13 -7 30 -1 -46 8 127 4 37 -11 84 -76 69 -79
4253 -79 10 -4 -43 50 -11 -1 -88 18 -44 54 -110 -126 -40 -53 15 1 40 131 1 44 10 -22 -52 4 99 -34 -40 -94 -103
4282 -103 113 -40 22 2 61 16 -50 -58 13 52 35 -62 92 18 51 19 -24 17 74 30 29 -67 15 135 76 55 -16 -34 -49
4311 -49 135 -39 -34 17 23 33 28 -4 35 14 37 26 -23 94 -3 -21 -32 -70 48 33 60 -31 -6 13 -64 103 32 -74 -89
4340h9K00j58Qj0O0L1k4k6k6j6k0O2j4n3rJ42kj06R0J4j2K1l6P9j29J00j34Q8
4368C1q0n0J20r2P1q3N5Q0o4O5k0rj44J38N1j79l9J62M8j1n3m6P4j4j6K3K8j9
4396B7Qm3q7P0M6j48J15%k0J3k3n2j3J01j7pm9P6K8N5j02Q1q6J16j62P0o8J26
4424E5q3M2O8j32P9Q2j48p2O7O4O9p7M4j7p3k0Q8op0R6j0o3O4q9P8p8J17j30K06
4453A51j29j07k7N2M1n0k6j65O83l53K68m67n1r2K89k11L12j35j0l1O3%lj16J61
4478D7l8K3l3k9M6j5j2k3J40j12L5L8r2J4J41q0L0j72K06j74kQ5l3m7J2L0J01
4505H6l5l5N2j31J35j06l0J1R5n5o3J33j23O4j14O2R8K2K2k04J87j33P4N0q1M
4531a5L3l9m0J43j62nJ33p1j13K06k9j05J66j47R1j04Q2N3o3Kq2Q8k5M9K3j81
$$ plain form
4340 -89 111 -47 -39 -49 11 42 18 -8 -34 -50 -70 -8 -22 -75 -84 58 56 -50 40 54 42 63 27 106 -23 77 -57 31
4368 31 -49 -99 21 -71 0 -83 -28 52 -12 53 33 24 -120 18 69 -110 -149 13 61 50 -3 -49 25 11 -5 18 46 27
4396 27 35 -8 -95 -25 21 -127 -12 -12 -32 -19 -42 -94 -107 -6 -23 -30 -79 -3 25 80 -22 59 -27 89 -73 -3 -71 55
4424 55 -28 14 82 -50 29 111 -37 -109 -42 22 91 14 58 41 -32 -52 36 30 -40 56 46 -17 47 -42 36 -42 75 -55 151
4453 151 22 -85 -112 -60 -19 -69 -95 -260 423 70 338 -129 -180 -272 17 -194 118 -17 -27 -58 5 5 2 -114 47
4478 47 9 32 -1 -30 16 1 -11 -34 106 -6 29 67 -25 -11 130 50 80 -92 114 -60 -62 23 -10 -57 -45 -15 86
4505 86 51 16 68 -63 72 -34 -64 -53 42 -13 -76 57 -66 -2 -116 -54 44 66 88 -116 71 -62 12 62 -19 -15
4531 -15 18 -21 -61 82 -80 -85 48 -23 -136 70 41 -64 102 -45 46 -58 24 77 14 16 -66 22 -3 46 69 -112
4557a12J07l0P5p0M8K6l0M8pm7Q1m3j50O5o8J98q0j0kQL5q0N5Q1j42R7Oo4o7K61
4587A89j53k0Lq1J11m8M2n7Q8n1j28J66m0n6M2j07J67k6o4J07q1J05l8r6N9k09
4613a76K32m9k8K3j09J26J1K4l9l1j01J22J11j64N3o7J58j36R4q2q2J03J4j6J39
4638A30j33k8J14r8q0J06J1J4n4M6M0q4m4L9L3J46j44L8J8j65Q8kQ4K8n4L2l6
4665D5j23k5M3P3j14L7Q0j11R4K0kMj7O6j11J10r3OJ53j65l2N7M0LJ0rQ6o8j8
4694C9p6n2JL3J44m0Jj33P7J39j14M8K0L7j64J3p3J52J4n1l1K4J7J3n8J3j8K9
4722Dk1QL3L0j49R2P9j50k1J19n6J75j19o9P6M4K0j00L1k2m0j15K10K0j21J8L5
4749A1n2K2j0N9r4J4L2JmN2L2p2L8K2j23R5n6L4K7j53J79q1p3J81j63PJ37j33
$$ plain form
4557 -112 -5 -35 40 -30 18 44 14 62 55 8 89 46 -104 -39 -107 91 11 1 -1 7 42 -38 17 98 -44 53 59 -5 -72 189
4587 189 36 16 19 -62 49 1 43 -14 74 23 -105 61 21 -35 7 -100 67 41 -23 84 3 108 70 -26 33 -176
4613 -176 56 7 -21 2 -107 19 30 54 15 -16 -117 5 116 -48 5 -62 96 -40 54 -28 -110 -7 7 -9 130
4638 130 -3 -31 83 -15 -95 11 22 36 -18 28 68 -16 -60 -21 12 158 14 52 70 -95 -7 -9 75 103 49 81 45
4665 45 -78 -103 -60 13 -101 -64 16 -95 -1 19 17 21 4 70 -41 69 -24 -18 135 -30 -62 -5 35 38 48 39 125 57 39
4694 39 -37 -89 -88 -55 89 49 50 -83 -6 133 19 67 87 124 -40 -27 -100 52 66 15 -16 8 25 38 -20 -7 -25 4
4722 4 -17 -9 24 54 -95 -3 76 -74 -95 24 -32 143 24 -45 31 75 95 -5 26 4 -36 -151 59 79 -42 -24 11
4749 11 -41 -19 -29 30 -64 -50 -18 -17 -21 31 63 -9 29 51 -72 23 -33 1 28 -125 54 -27 -100 81 -82 -75 62 -71
4777g1J37o2m3N5K9r0j7j1N2%R2j25L8R1j22O5N2j9m9N1J9j21LRMJ24k6j18N5
4806Bl2P1j3J3j18J18L6j17KO1L3n8LL3l8q4Q9M6k3j01J08Mk6K1r4K2J20rj51
4835h2N3Q7nj30J01j15M2J41k24J08O3n7p3J7J18n0m4K8J19o5J32j96N1J08q0
4860D7K2K9n9mr9LM3L2J5q8J5R4l4o7J15l9m0K1R2k06K43j77j00P3l7M8K39O61
4888H42o68k85j64oN46l16j78m3K65n9J73J77m43J64j95K13J09j27P1l2n0J8M2
4911E4p7q4l7K09q4Q1n0K6j07M9oJ8l0J16j07L5o1O4j3K3r5J57j36J36l3m5n3
4938e0R4K3n4r3K00j46R0j8rk0kj1Q7o0k3J9j4kj5j51J51l0J8J84j55L5j0p3P1
4967C6K3p6J10j99J12RJ05q1j22M8k9Q6m0l5N4Qj14K20j03rm%m3O8j76O7J35k7
$$ plain form
4777 -71 66 4 -39 16 45 -45 -62 -73 -21 -21 71 -54 -16 75 -47 18 70 51 2 53 72 -49 -46 -37 -33 91 65 -53 2
4806 2 -30 41 28 41 -77 41 77 -40 -38 23 56 -2 1 34 -4 -88 1 47 24 -77 31 35 9 30 -64 -42 78 69 -82
4835 -82 -29 58 53 -77 24 -91 -49 92 -132 -24 39 -18 -91 -74 44 -6 -50 -22 97 32 164 -32 19 127 47
4860 47 69 98 39 35 -64 -61 -18 14 29 -59 -44 50 16 -51 64 25 -15 6 98 -108 135 -42 -142 -69 -106 -58 181 842
4888 842 174 -111 -275 -281 265 -51 -229 -272 -7 -66 107 284 -159 5 -190 23 132 5 76 44 -6 12 54
4911 54 -23 -107 -144 65 -19 62 12 38 -69 -20 -26 -8 -38 78 -29 6 -55 9 -4 19 -76 81 -55 81 48 3 -50
4938 -50 44 67 13 -80 120 -26 64 46 37 17 15 4 91 31 8 27 13 11 -4 -155 -4 -34 -16 168 13 48 38 -35 36
4967 36 59 -17 93 -106 6 15 120 39 -83 -35 -64 22 -18 -53 1 9 -105 115 12 3 -1 -1 -44 24 -152 -85 50 23
4995B3j9q8M6JK2Nn8p1J23L3j89Q1J06M8n4m5K5Ln1N3Kl4j5L9M1N8j73J17p6J44
5025I7q2Rk38J44J1K2L0q4N7L7J1p5Q7%m0O2j52J80k45J37L2q8J50j65J47j10
5051f6J16j40N5O1rJ7k09R7J73q7J9m8JP4j03J98k14OJ5MN9m8q5K01N1K4k22L
5079e7M2N5r1J54j03N5Ll9ln3l4j07K88l4j64J36k1j06J38m0q1P1L0L1l9J0L8
5106G9j01Qj08R4J35j42J61o7o5J5j75K23j2j99K57q6M5q1j5m0l0P4R2l2J9n0
5132aJ7N3j73J83j62M7n8lK21j42j06Q6N2k8L9j8kjl5O7q0J02j08R6n9N7r4J33
5160H3o8LQ2l2n9nq8J75j79J08L5j4j41J32ll8%Mj04J33k3p0%J38l0j24J02J1
5188B8km5q8J93j48NJ47j00J8l8N4j8K1n1R9j3p4p7J29j23K10p7j2j8Q3j26L6
$$ plain form
4995 23 4 -84 -38 -37 -15 -10 -68 -139 -16 17 -172 -91 15 63 9 -36 -11 -8 -59 -6 -4 -38 -53 -14 27 85 -88 29 -47 97
5025 97 15 24 -214 -70 -59 -37 -7 -91 -34 3 14 -61 26 26 -14 48 -104 76 -169 -32 0 -88 62 -103 44 -66
5051 -66 50 -90 -35 26 17 34 -175 -78 95 8 27 -21 -20 54 -49 149 -65 -59 -44 -40 19 -29 -114 87 138 162 -60 -57
5079 -57 -15 40 -51 103 0 55 58 19 16 -37 -71 -178 110 76 -88 48 27 -79 59 19 -62 9 39 70 31 41 79
5106 79 -22 -14 -122 -28 107 -35 126 59 -6 9 -166 57 45 -154 103 17 62 -19 -34 -74 -104 -30 62 30 49 -1
5132 -1 16 69 -104 79 -83 -36 -94 -97 124 -18 -124 -38 14 -14 25 7 5 4 -31 36 -44 58 -50 46 -13 44 -50 83
5160 83 15 18 100 68 9 4 -84 91 -88 20 55 41 -100 32 29 -9 -9 -5 -109 24 1 -69 -69 69 39 -85 17 28
5188 28 26 -19 -107 86 -62 -57 90 -10 8 -30 24 6 27 -24 75 62 -12 -89 40 -83 127 50 38 20 103 -23 13
5215A3K5j79J15l0P9n4J18m2j1n3L3k9J06j09mL7Lo2M0Q7q4l8J11r9J25j56K1
5242c7MP0o8J04Jj29J1rk3J01j8p6J04o7l9P6jR5o7r9M0k5L3l8M3p2K26k12O0
5271a2R9j31K48k37m4J42q0J6j0n2J14qj67J13R1j12M1O5Oj53Q2n4R7Np1Q5o6
5298Gm0j3N2n6J22m9L9o1j3K4p8OP8n2j1J52j30L9J1J5r9O6l2q2J31q4K7jl1J1
5328e2J15j28m8J21k7o2Nj7J84j28P8l6j18R5o4J08O4n1j11KJ26j35R3r0Q2J49
5354A55j88m0N5o8J17L0j9j06K03j70j20M5J63jo3N0q4L1K0K6k7rL6LJ8j2L0m7
5382B8m8N0j3L4r9N9k6j30m0J21J54q3L6k9J4k6J0K3l0j0oM8m1j00J21J03n0J1
5410H1n9L9M3Kj71Q2l7O3rN9n5q4J9J4j3r0J94j01L9j00Q2M7o6Q6p9pL0m8Q0r5
$$ plain form
5215 13 38 -141 -26 -56 23 -31 87 45 34 -19 14 -15 91 -18 -22 15 18 -44 -4 83 -1 -39 72 -27 98 -58 -37
5242 -37 -33 37 -31 73 74 -55 -44 -53 -76 25 7 -69 35 -32 -71 5 4 99 32 -67 -27 -52 -19 -57 -14 -86 140 -72 -12
5271 -12 87 -44 204 -33 -77 65 -15 1 -9 -61 53 45 -122 -9 82 -30 11 76 82 -71 11 -43 54 59 -12 73 7
5298 7 -33 -46 6 -50 72 23 62 1 -12 12 -66 -60 18 -34 -45 107 -23 16 27 42 -57 9 -23 -105 26 -58 -31 -32 -63 -52
5328 -52 63 -65 -113 8 -19 -81 -76 -93 91 -37 41 5 -113 -18 -82 26 90 39 -72 -70 56 -79 14 -76 6 155
5354 155 -33 -73 -18 -86 31 61 42 -64 139 -31 -151 -106 57 56 -7 43 -41 -10 10 36 9 0 36 39 57 45 75 28
5382 28 -20 30 17 51 -48 11 -15 -145 -185 -64 90 7 43 14 28 2 12 35 5 -5 -11 37 -4 -104 17 120 70 81
5410 81 22 61 104 106 -65 17 -20 43 34 93 38 -46 -27 -13 -26 -116 78 -23 16 -84 -2 45 -21 65 -14 -21 9 -39 41 -54
5440e4J03K4j38j3J13n8o3J45q2J1M5j04N6J8J10j06k8J1m0R2k1j60J18O3k8n5
5466d1R6q3J43p1j2j1M3Qj32R1q9j1M4p2Q2J2j31KJ82j0o4Lm3O6J0Q2o9l4R8m8
5496D1J5j18M4J05p3p8J6J14l0l4m4M7oM4LJ38j67Oj65J42j93L14q9Kk78J34M08
5523B98k08n60K70l6k56M52m43K42K57j00j42k44K61j24O39M30q25j74J060j053
5543b56K62k13N21m07k33L63J37J49m86L40j45q3K5K07j80Q4n5No4J08j40J17
5565E6Q1l6j68oN4nJ1J2P1m2J1r4l1Q9j17J81p1J01j47Pm8J24r2M0J27j74J73
5592A07n7j27n1O5m1J38N6j0k3m6M1p7q2J49J18j82olP5O4j48J00m2j0p7MM1j5
5620c9N0j99J64O1m4J1p5O4P3k5n9Nj7j0L8jP5r7J39j68M1o1j4M5P5j04j7M1k
$$ plain form
5440 -54 49 73 -65 -78 35 -23 -86 59 -23 -12 33 -71 -15 3 113 7 -21 -10 -50 42 21 -139 -21 42 14 -41
5466 -41 55 -28 115 44 32 21 64 72 -60 31 -58 -69 -25 -97 -15 -3 -134 -132 50 40 -24 -21 -64 2 12 94 25 -9 89 41
5496 41 56 -62 -18 87 14 -64 -48 66 36 2 -42 5 -1 43 46 184 17 23 -142 0 -193 121 32 34 -244 -110 298
5523 298 90 -470 -200 -236 -492 -40 -483 -241 16 -84 -226 -470 -209 -333 306 736 -89 -263 797 -256
5543 -256 6 -207 314 -93 -326 37 174 323 -163 177 32 -51 -26 181 1 85 30 35 -29 79 -61 56
5565 56 137 101 -67 -73 -19 -24 -13 -1 70 28 39 -55 -86 3 -114 67 -4 97 -50 -43 -91 33 -59 -19 108 -66 107
5592 107 50 -77 -128 -63 -104 34 90 80 57 11 52 -25 -107 42 160 -22 -28 -31 44 108 -40 60 18 8 -69 -65 -24 -39
5620 -39 11 -188 -24 37 -7 4 -71 -7 66 41 -18 -13 -30 -40 -2 -3 72 -25 114 -54 -13 -74 -88 -43 32 -72 -89 -48 -50
5649e0oK2K7k0qLm6LJ44o1J14n6Jr1m0K33j99j4J13j10J01k6J62k27L4n6J29m3
5677C3m7O7Q7q1j55L2R3r8O1l8k4O4n8K8J27j01M5j2o4M9J1P0j99J70p2j02K8
5704h6J21K1o0QL6o7Q8j03K47p5q6J23j60K7n0n6R8kq2J05j39JJ71j43k1J97n5
5731E8j48Q2J4J4m0K0ml1O5p1M3K3J14k03J30Kq6o4J38q5O5L8j15J7ro4J47%m5
5760Em0q1J5N2p9J47qo5J5l3J90j48P5M5j5K0j07K5O8m0j4j5K3p6J3L4n0k4N1
5789a7%j15O9J48r2RQ3j10L9K4q4m1O0M2p8J75%r7n1J75j61R8j03K36k37qPm0
5817f9J03o2K5n1J46p7j9KL4n4N1j02J92j59Q3p8p2J42j53J86J5j13K4M1j71K24
5843H8Np1m8p0O4O9J7o2J00k3j01R2K5r8J09j40O9l8K6j68J54K5O8j93J06k0M7
$$ plain form
5649 -50 -56 -34 -7 -27 -35 -32 -78 -75 69 8 122 66 67 -24 -64 169 -30 -44 69 -41 60 34 196 -31 3 -53 76 33
5677 33 -14 53 140 59 -96 -64 29 -69 -8 -46 -70 -6 -64 -36 91 -10 35 23 -41 8 19 89 -110 60 -12 -114 -86
5704 -86 35 56 -4 4 40 -27 61 -42 205 130 44 167 7 34 -16 -72 26 24 -58 47 -92 -91 80 -63 -84 113 58
5731 58 -90 -8 6 20 -20 0 -4 -35 30 -41 2 25 139 -64 66 68 -18 -82 56 -29 36 74 -41 -24 -33 -97 50 50 5
5760 5 -35 -116 -101 -49 -128 19 11 -54 -39 -72 118 -30 45 90 75 95 -12 13 81 41 27 12 35 -41 -28 6 -44 -68 -17
5789 -17 -17 -132 -63 85 -7 2 85 -25 14 38 -46 -87 -27 15 -63 112 112 15 -36 139 -22 76 -27 209 -28 -36 -29 -69
5817 -69 34 -28 -3 -54 92 15 -4 -2 32 -22 29 -73 119 -40 43 -35 -107 35 -118 68 83 -30 -6 35 -136 88
5843 88 93 22 -26 -96 -32 37 54 -8 92 69 -32 60 85 -13 96 -44 25 -13 13 -155 -1 24 92 -101 5 -15 32
5870C2n6l9R0j7%Nj25M7J02l1k4L1L3j48J43m7K8q7J83j10%n4M3J16n4l3n3N5
5898C0n1P3J9j39R3k6Q6q8Lj6J4L6J19k20J81j11m5P3l4L5l4n4L2n7J11OJ15j69
5926a8m7K0J95k10J04K26j31k38R6J21j24K86n61K42k58L87j93J45j02Q6m2J6
5948@j1n2L2j0pJ85j70o5K17j93O2M4r2L6K9N4j14lK2J3K1J16o6K6k9nl9j30R1
5977c8P9o1Q7k1r5j12J42Q9l9n8o0R8J44j46j7J29o1lK2k9q9N3L7l2R1j80M5M3
6005A8N2r0O1r1J4o1J20L7p6R3k5n3Q1m2Qm3n9J03l6p9K6N7q5N1o7J46p4L6R9
6034A21o1K7n7r2J49j31%K1L3j0K7j08m8J42j20O5L8n6J24r3p5R2N3L9r7o3R8
6061A8R1j8m2m2o3O7l1j06K01j10Q4l9j42K08km2O1n5j24J50r3L0Q7r2%Rn9J02
$$ plain form
5870 32 -24 -63 27 10 10 15 -110 -63 39 8 -16 15 48 -100 43 -4 24 -63 120 10 10 -44 -1 115 61 28 -25 30
5898 30 -21 52 71 -68 25 -1 85 -3 0 -16 -2 34 153 -67 114 3 -42 31 -3 32 -2 -56 -24 -81 30 36 151 -18
5926 -18 -65 -45 150 -60 44 270 139 -99 -3 118 -6 280 -281 -39 -297 90 -103 42 -60 26 -16 0
5948 0 -11 -63 -31 -41 -48 137 -33 -98 119 -74 -12 32 -60 -24 5 59 -55 -58 -36 -23 -2 114 48 74 45 40 1 -129 -38
5977 -38 41 -20 67 46 -49 -161 -19 70 31 -27 -87 11 155 9 -8 121 60 57 79 50 -39 14 51 19 110 -70 -25 18
6005 18 70 -20 41 -50 -36 -97 23 60 -16 77 52 -1 80 38 46 3 -56 47 11 -68 -42 15 -70 -19 -86 60 -14 22 121
6034 121 60 87 30 -62 87 -44 -44 -23 10 0 27 -81 -129 13 -107 -42 -4 -60 64 -29 -104 -12 41 80 -17 -80 18
6061 18 109 91 49 7 -56 11 -20 -126 75 -35 49 10 -132 76 74 32 93 38 -86 64 -29 1 88 -4 -4 5 -54 48
6089D8k0l6R9o0n6o8P8m9N1J10p9N8k1j9Qp3J6K9J0qm8P1j62J52r3R1N6j06Kl0
6119d9N6N9r5L0R0j34J61j45j7kLJ11k3k5j2rmk6K1mJM2k1n0K7rO3j00j04J62
6149cM1r1K5mK6n7K8O7NlJ4%j55J87r4l0P3o0j0R1j50J08n3J6J6K1Q0o3Kj89J80
6180A8M2N8j58J00j14p0j5K75rk23J27j10o0K6K20o8J3P0j16k2O6k8o0Q3j17J42
6206G0p2q9J46k7j12mOR4nLNn5m5M1K8M5j99J39J05j28K15j99J16r3j54K72j16
6233a3l7OJ37p4j28J27jj2J2k6L9r2O4mk3M2M8j4Q3q0o5Q0l1l0k3j13P6O8L0j60
6263a14J92o4J7j0m3P2kj04O9M6K6j11O5n9R3j04J69j08k12J26J15Ll2Oj05J83
6289A14k27Q3L8k0J54q7q7KM8J4K1Ro2K9l6K7Mj01N3P0o3M3j28J87L2l0j22P5
$$ plain form
6089 48 28 -8 91 31 -25 -93 -15 -64 -13 97 18 76 55 36 44 -29 -13 16 26 18 -30 41 -121 31 -62 29 85 -21 -19 -49
6119 -49 7 66 -29 1 91 -43 118 -27 -44 -46 -43 68 45 20 8 -1 -5 -31 -10 -14 -13 29 8 -42 -15 -24 39 -61 -165 -3
6149 -3 38 -53 -28 -32 -6 -63 -35 32 37 34 48 48 -107 80 -14 -44 29 -31 -41 50 -100 8 -45 -29 -13 8 88 25 27 -162 18
6180 18 60 118 -40 60 -54 -124 -139 136 127 -96 31 -79 -139 -113 107 39 52 122 6 -16 50 22 -38 45 -72 70
6206 70 -2 -91 55 28 -84 -88 -82 12 7 10 15 -40 -85 -44 -16 29 -170 -31 74 -54 161 -38 78 -15 -169 103 -13
6233 -13 -50 -44 93 19 -109 18 17 5 17 -9 30 -62 2 -2 -25 17 65 51 134 54 -11 69 38 8 -15 -128 -52 16 46 -114
6263 -114 78 14 31 21 -22 50 48 -56 13 59 85 -26 39 -20 73 -31 138 30 -182 -56 59 62 30 36 -69 114
6289 114 -113 -30 8 -12 142 55 -32 -30 18 32 53 62 0 29 -7 20 24 -77 -24 46 -17 26 -102 85 117 87 -35 40
6317D0L2j10K7K6Or2Q3j2Q2j47k9K2J03p4R0q0J58j35J7k1m1Q6n5p2Q5R9m1L0
6345G7m3R2j24j3O1N0l9q0N5M1p9m6M0N5n7j48J78n2Q1j2n4Q8k2l6j01R9p3O7
6373EL1j50J30k8n3J13j28J51m8M0L6j6j38l0NL5P1k8j0j32J28Pl5K7J0MJ48j49
6401dn4J34k5L8m7n3m9nmN6No5J55j77J15k8P6k40J23R9n7m2M7L8j03Q9j8j24
6429a20J89j14M6j38R8J4j23J68p9O0r3M8L3n1J10p2n3J38j31J22j26l8K63o0
6453I1j41J05r3o6R5k3m3J8JQ6p0j07K13l1J2rp8K8J03j33J0L9m8N3J11j42J17
6480I8j03M7m4M7l3o5J02rL1N6k52R1K4j8K1j9N4o5M9rrr4Q1J0j2K8j11J53p2
6509b3k8J22j22P7P0l3Pp5R5j55RJ19j2J8m2J2q0m9OjJ07N5o3k6M2mk5P3j67J10
$$ plain form
6317 40 72 -38 -11 15 21 -71 12 0 82 -65 -94 -72 31 -43 47 -33 125 -10 7 -14 -55 31 -24 -96 -11 88 47 77
6345 77 34 126 2 -11 50 100 61 -19 36 77 -2 -48 -8 47 -10 -158 20 -32 49 37 -17 71 49 13 -88 11 -62 5
6373 5 36 -114 16 -12 -65 48 -80 71 23 63 99 83 -55 -85 -80 -45 26 -2 -12 -144 -16 -9 -44 -17 -7 -3 145 -4
6401 -4 -58 76 51 89 42 -11 -60 -65 -69 -13 -8 -73 82 -95 20 -8 68 -172 -49 50 -7 -49 -2 36 -67 22 4 -120
6429 -120 69 -45 1 -137 -39 -25 -148 20 -59 1 -92 -44 -11 -62 48 -24 -77 61 -70 52 -74 -112 151 91
6453 91 -50 55 -38 -104 -9 -32 -75 -57 -56 30 -40 -147 66 35 47 38 -40 -12 91 -42 -32 7 -41 12 123 -19 98
6480 98 -5 42 -2 45 12 -53 49 40 71 127 -125 -34 -10 -28 -7 -26 28 -37 12 3 -6 -100 -19 -9 -21 7 -104 49 -23
6509 -23 -51 71 -51 26 96 63 70 -5 90 -65 -56 63 51 69 27 39 -41 -90 -84 -85 22 77 14 -12 30 26 1 74 -93 17
6539A7q3J74p5m8l1J14r4L1J3p6R6P3k17R6M6p6kj7mJ04l2r5P3P4q7M2o8QR0K4
6569G0j82J96j01j4J06p7Nm2P0k6N2O5n5r2jJ45j00R9j45J98o4q3l4qP6q5JL1
6597Eo5Q1O0r1K0k2j07Q9o6Q2l5R2M39o72K12M2l9o%L7q2K3N3j58lR3J21l0n2
6626B1l2m7j1M8J7M1jQj40P7l1K8j0R3p0j0j31K07P9k25Q8M4L7jj39M8N0j12J28
6655E4j39l0J59J7M9n4m2K5k6l1M6j33J89r8mj4J82j32k5r0J54j25o6J85j35J35
6681E1p1K8P8k3j12k6R1p9K8N4jm9k6L7nJ4p7PJ16jn9M0k3j18R0K0R0L6j22pJ01
6712H2q6j9l7J31j47K16j33J0Jp6N2M2L3j28N2p3O6J4K2M2j28J3O6Lj13J6R8n1
6740c2Q4p7N9j7KJ9k8L4L8k1j5m3k8Pk4M0n9N4L4J8n5j7M1R0j20J1q7QJ32J3K8
$$ plain form
6539 17 -66 108 33 -15 -46 68 -26 5 18 -58 38 111 -106 -10 36 -40 -42 -59 -63 41 9 -86 -13 61 -26 16 -52 -44 46 70
6569 70 -112 84 -17 -31 75 -2 3 -39 31 5 57 122 67 -25 -26 119 19 118 -27 171 107 24 -10 -18 58 -27 -26 5
6597 5 -60 21 81 -10 10 -12 -119 -30 -96 -14 -49 43 482 -190 22 64 25 19 19 56 -26 -3 50 -108 -111 -18 103 73 21
6626 21 -11 -58 -69 -21 -4 37 36 44 -96 -19 -50 -22 -32 61 -9 -19 -150 57 136 -89 -1 43 80 79 -60 -12 38 -74 54
6655 54 -85 -115 44 61 110 56 14 39 13 -18 28 -105 84 -14 -18 -32 150 18 -7 -97 57 -68 -134 51 -84 51
6681 51 -20 8 86 63 -49 -75 16 -63 -35 19 18 -31 -57 -20 -25 -11 -88 -81 35 34 -25 15 -8 -126 -36 -16 74 110 -12 -19 82
6712 82 -4 -23 -60 71 -76 140 7 17 18 -58 -6 36 69 -59 -7 -80 -14 0 22 64 -64 -51 15 18 -95 -79 19 -32
6740 -32 52 -25 34 17 19 38 10 44 82 61 46 3 -25 -18 -42 -2 -61 -7 27 45 -10 -27 14 104 -16 -5 -92 -84 48 61 89
6771H9q7O1q8j16J98O7j64k9J13q5J06K8j09L5J43k10M2Pp6N2p1J59n8q3J10m8
6797a4J23n3q1LK5n3JM3l9L7M2o5K1P5o3k4m9Q7Q7q7l0L0j67Q4K6K4J04q0K7O
6827D0n5P7j20J10o8N3L3j05J12j32J24r0l4J24p4m2J1J22j25J01n5p1J5L3j04
6852a20J31j37Q1q5J79j27J20OlK0j15l9JJ52j72M8N2K0n3RPrM5K1q5JN9K7r3
6881e9J6J62r1q5QP4r9J65q4O1q6p4NO6O9j5Q4j17j26J72Oj09K0n7J6J16p5O7
6909C0j7n8L8o6M9J53j52m0Q6qL3n9N8j0ro1L0J3kJ7pj02Q5O1j15P3k4K3o1J23
6939H1qj11J06m6q4p8J23J7k0n0M4KO2J9o3k9O7j3o9K7pN9p9O7k6l2K5j00J23
6968Gn3L4R2j07Q5n5o1L5M0R1p3m2P0j74K8Q9m5k3J30o9M2K5q2p1M5JP9j42J65
$$ plain form
6771 89 2 63 -25 -141 57 124 -40 -69 44 -41 65 93 -16 19 162 -48 -6 1 -75 -23 -94 65 7 -76 34 -14
6797 -14 109 56 -25 -22 3 -50 -49 -6 -45 -8 34 -31 -10 65 2 -22 -71 16 103 16 -14 16 -151 -67 -41 -17 87 7 34 40
6827 40 -15 62 -58 52 -16 37 70 -35 77 -55 69 -21 -55 69 -5 -47 -36 86 -39 62 7 -64 -49 -16 -120
6852 -120 11 -126 -45 -130 49 -78 42 48 45 65 -50 -89 -88 64 -108 -60 -8 12 -41 -32 -25 -34 11 32 -53 -52 7 34 -59
6881 -59 -43 119 28 -57 -49 25 -74 91 7 68 -18 -92 -87 -21 48 33 117 0 -126 46 52 -57 -37 -94 -78 38 -37 30
6909 30 13 -45 -7 -73 -24 129 -23 -63 23 15 48 -11 47 37 28 -33 -3 10 8 25 18 -84 1 62 -53 20 -4 19 -42 81
6939 81 73 -38 68 22 -62 -140 -17 0 -20 -70 -26 -24 38 57 -6 -35 32 19 -50 -23 -30 29 -50 17 -9 -41 -16 -116 7
6968 7 -46 -12 80 -27 58 3 -58 -23 17 108 35 -7 63 -111 -83 6 -39 -62 68 -1 41 66 -16 -87 -42 -41 38 -104 61
6997F1n3r6J38q8J39m1k5L8j03O4j34J77l0mj8R4j39O6l4j9Q5j56O7K2M2k5l7
7024ij7K1Q9q8j4p8J14M3n3N2n4n2O3m0M5j14Q0Q5q6N9J4m2N5n4j94Q1Q2J7P4
7053G9j67Q2M5N3j24K7Ol3jM4K9m7o6P1M2n5J1m0P1n1M3m6mo5J00N5q8M1Q1p1
7083B2m1N9l3M2o6%K4o7NK7J21l8l9L5j64K27j15K5ml1J1J4O1P6k32L8J85n9j59
7112g6J78k04O6J18j80NJ93l1oj0l6j35J38J2j28L4J33m1%p6lJ19n4o9m7R8l6
7139c8O2J7l5K8q0Q7l8J31q4l3l3J4O0n3jq3J59q5%p0R1J9m2LO2j07MQ7n2P9K2
7170I1k2k42J88n0K9N0r8J3M3R7j60Q8K8j11R2o5L1K3J5p3NO0J4k4m4J37j29L
7198a1J85j45m5M5O8j01rM6n6L9J60r1R1j97Q6o9q1Q5m0N5l6J74j83N2Q2k6m3
$$ plain form
6997 61 8 -88 50 -38 101 60 35 73 -30 34 -100 77 47 43 25 119 -20 46 12 -7 78 -78 -11 11 53 28 -9
7024 -9 -26 -5 84 -4 -18 -96 18 61 8 60 6 -46 17 -23 22 -92 -12 73 -13 46 60 18 73 19 -175 -94 -12 5 79
7053 79 -88 -6 39 92 -32 -5 1 -32 -33 11 40 -7 -73 -2 40 -15 -4 -44 27 -24 19 -27 -31 -96 4 59 -29 12 93 22
7083 22 -19 40 7 49 -17 -17 7 -60 -55 -28 93 55 16 51 -113 114 -1 24 20 -11 0 14 75 151 -81 -43 142 83 -76
7112 -76 102 -102 -36 82 -98 -93 100 69 63 53 17 -118 20 32 -96 -62 71 30 30 -46 -49 70 16 -53 -100 -2 -38
7139 -38 24 41 6 34 -46 41 3 134 50 17 -16 -2 58 5 4 -79 80 -5 -5 -75 16 35 -7 -4 58 -49 -45 42 -10 69 91
7170 91 69 -173 15 -35 -6 44 -54 -41 2 99 -61 27 55 -56 36 -29 2 25 40 -33 -28 32 46 22 -22 115 -14 -11
7198 -11 174 29 -16 29 97 -4 -13 33 -23 16 176 85 176 -21 65 -4 -85 0 -40 15 -21 153 -30 22 104 78 35
7225C5M3o5o9J04p4k5M5r3J69m3j38P5N0L0n3O2j31Q5q4Q2j6pl5O2K4j06OL0R8
7254F1m0L4N8j54K2n5J32J9p2j1J13k22jK21k12J17R3q2M9o9M1kq8j57M15k20
7280a0m57K71P42l72L95p99P8J27O3n9J84j55J15j70N4n6J64p5m0RJ7m7n2M2r
7305d0P5n0O1j01K19j74l2K5J76j98m5M5m1J22o5K12k70Q0O2j27J74o4l3j09P9
7330a9Q1Nq8K3J02k15M8RRP7Rrj4LJ2m3m8J06m4K0j4k9r6Q3O9k6r0l1Q7j9K5N5
7362C8J5p0K2o0qN6k3P4K3J07k01P9k0LK4r0L9k4N8l5K9k8K6P1m2l1p1k5Q1O5
7392H2j95Q7J02j18m4K8J6O3l7L1L4j80J97jj48J43rr0P7p5L5Q6o8J30j82L5o9
7419g0m2J39ok7N4j23N2O4p1M7o5M7P8j67k0J39k2p6L3J26o0j2k9MO2j32O6R9
$$ plain form
7225 35 78 13 -56 48 -26 -51 -6 -99 70 27 -111 -36 14 44 -9 53 -78 7 -77 5 -11 -18 -53 9 33 -73 -67 -37 61
7254 61 21 55 113 -41 -19 -74 58 77 5 -6 107 -115 -116 105 -107 10 103 21 70 1 42 40 -48 -205 210 -10
7280 -10 -467 -196 546 174 569 -230 -152 -25 38 -21 163 8 123 -47 7 -49 115 40 0 9 26 -21 -73 -31 -40
7305 -40 35 -15 46 -55 164 -10 -42 -17 159 -39 -84 -39 -80 42 -23 189 -81 -1 61 -66 108 44 11 -98 -19
7330 -19 62 67 -21 2 104 -111 -63 -54 -45 32 41 32 18 21 33 -10 -58 48 4 24 10 -19 -115 -32 37 11 -79 -110 -23 -42 -17 38
7362 38 53 -17 5 -55 -63 -7 -30 44 67 174 -27 52 32 35 59 -31 8 -16 42 7 36 8 34 105 63 32 -39 -64 17 82
7392 82 -113 -26 76 -42 -86 -58 -42 21 -16 15 49 -131 66 65 -83 60 51 -39 38 -37 -2 84 16 146 -36 -1 -70
7419 -70 -112 27 21 -6 48 -75 -23 41 -30 17 -48 -1 77 -90 -110 29 7 -69 -36 90 30 18 -11 -7 55 -77 -11 88
7447H8k09K5Q6o7K1Q1j31J02o7J5Q3l8J28k19N7J14n9l8K9J7r7J08m2nO0j05k8
7474i1N7K0o3J52j37J30j17J14j16J20Lj82J50j46J30J4l5m8J31q7k6o9N0J0n8
7499i4K09r9J8N1q1L0lj05o1J68l4m7PP2O1j02O1q5O0Ror2J2N0Q4j36O1p4R0j4
7529A0p0M3j2L8r1R4l6K7N1q0M4k1j5R8j37J53L0k63J96p1M2Jp2nn0J17q0NL6
7558a8j13O6Q4mj3j03J64k16M2J75N0j65J8J41k19L8J29p4M9k0n0N9o3N9pK3K4
7585E6j09Q7j07J7R5N6k15M3R3j8l9JN5j34J35rj00O0N7%R9j28n1R5r5j6P3jo1
7614f1K7N7R3n5qj29J74j97J32j30R4j1jk8PR3j05K6MM4r3K9kJ0M5M7j34N9%J6
7644Cj06J54j85K59j0k64J62k7m6J01O0r5N0l3m3R1p4k4J5M5J4%p5m6J64m9L6
$$ plain form
7447 88 -121 -96 -10 -77 -56 25 -106 -4 -71 -56 27 -11 117 -102 -45 69 10 -28 1 18 -79 29 -13 -18 42 -63 -91
7474 -91 -34 -14 -77 75 -62 68 -49 65 -51 69 72 -110 40 -106 24 38 3 -45 86 -1 -27 -96 -46 -36 -94
7499 -94 115 16 34 85 4 34 31 -74 -135 33 -1 -48 -41 31 92 -10 51 -34 26 35 29 -63 -51 -1 83 -53 8 -66 24 10
7529 10 -60 -17 -29 9 -82 12 -24 3 54 -26 18 -3 -18 80 -57 96 126 -137 59 -12 30 31 -41 -46 -96 21 -59 -54 -18
7558 -18 -131 -65 19 15 2 -101 63 -153 -111 64 114 -51 -33 108 -111 -73 56 -18 31 11 -39 20 -43 16 9 32 56
7585 56 -53 34 -73 -56 39 95 -120 -77 16 -2 -41 -40 15 -119 16 7 -93 -33 24 24 123 -5 -56 39 -56 -72 1 0 -61
7614 -61 -34 23 116 61 53 -76 98 -99 33 -97 -3 -14 -15 -43 -36 57 -48 -22 -18 26 -67 -38 -40 -30 15 62 -72 -13 -13 3
7644 3 -103 51 -134 125 115 -149 13 -14 -60 41 101 6 56 23 -20 71 -3 -27 -12 33 47 47 -28 -74 90 41 77
7671G7r1J41r5q3N7K6L1o5j5K2q8J30n5n2l6J81p9J49k14K8O1o7N5p0L2J2j9n7
7699h4J24k2K5m3Q6r6j44J60P9j21M7m8J29j21K%n8L3j9m8J71r0J08o2k1k9n2
7726i4J00P4p5oK7j22Q3N0J1p4L8j15o3P1J11k9m2J06P2q3Jp7l9R9j14K8J42r7
7754a7M4j10l1R8m0J90j21n7O1j07K3J05k5j9Qk5k9Q9K2n5m8j18J03KJ72j82O8
7781Aq3P6lj0M4n2O2n5N3n4m5Q4n3J04j78J41J8j05pOO5n6O5M7r0o3O7m6N2J0
7811eO9j09J9J4O6L9j93J00lJ4j9m0j6kJ28k8j8qp4R8r1K6nl1J5Mp5Q3L9m5J82
7842A34j32j20J15j11J06L3p9N2K0j0O1O1k12K62j53j32K11m6q0J1m0N5q9M6p9
7867a16L5O4R1r6oQ8o4q2J26N9j57J61j47M7M7L4j03N3m5Q8O6j33n4n6J42j5q6
$$ plain form
7671 77 -14 127 32 -51 6 32 63 -2 -17 5 -83 47 -8 -60 -96 85 6 155 -59 -31 30 -37 18 -52 -20 -8 -27 -84
7699 -84 40 18 43 0 86 -10 -154 6 85 -36 11 -37 92 -29 -27 -27 -85 -52 -71 -119 52 -38 70 8 -13 -42 -94
7726 -94 6 80 5 -1 26 -96 -13 37 48 -26 12 -103 -166 -95 16 -13 -55 51 123 40 41 -36 -75 24 -90 -62 80 -17
7754 -17 27 -83 -114 -16 -56 134 13 -44 17 -90 -67 38 13 -6 2 -23 -52 37 59 4 -44 -162 -59 -57 115 -67 1
7781 1 -82 -6 -9 -19 25 -27 35 -20 33 -21 -66 18 -35 69 -109 32 50 -55 -62 -56 9 -47 18 65 -25 -88 -21 -67 -15 -5
7811 -5 64 -45 -26 -12 54 93 -100 0 -3 11 -8 -48 -64 -66 62 34 16 8 -66 32 -59 -33 -38 -69 -54 -50 -125 -42 -3 -48 134
7842 134 2 -118 -3 -114 -8 25 -54 -2 18 8 69 130 -82 180 27 -105 106 60 -20 -9 -49 6 -83 -37 -116
7867 -116 -81 -17 74 -22 -28 60 -4 -86 40 99 -58 103 -44 3 50 84 -19 34 -11 77 143 10 -44 -100 42 27 -59
7894e9K4J4j02J01J03o0M9q2oL6j06P5P3r1Q5O9L2k41O1J0K6k5L3j7n4N8l6k1
7922e1O0p1P0K9k4j01J48r4PrmP6jk6j6r2N8J00m8j6q5j4J29j44R2M2L9j00R8
7951E2j3q4R9L8j71P1m5j9L2O6R3j28P1j42l9J03l2Q3Nk1J29r9j11J59p8lr8J71
7979H9j38R8n8k3L0j36J06J45r8m0o4N7L6N4k4l4M6n0P3k9K1k4P3j0j0p8Q2j39
8007d5L6M4r9oQJ23r3j02L4Q2n9OR8O6p8r9Q8r6J79j16k1J00j44J43l2P5j55k0
8035h3J07j22Q4J38P9j31j01P5J2q1J50j90R2M7Nm8j21J72j05O1j41j2J01o6J
8060g7J14P0l8j08R1n8O9m0k9O1L4j88J38M5j28K5O7j26J43j42J26n4L1Lj16J02
8086A5N5j62JR3Ko3P3n7J08k0J30k36Q3Q7j81J05o0P7r6R8r8M5j21J67O1j42Q1
$$ plain form
7894 -59 -35 -21 -123 -22 81 21 70 -12 -18 18 -88 -13 60 -31 54 123 155 -86 -25 -15 11 -14 19 2 -52 6 -30 -51
7922 -51 9 -62 8 37 13 -88 60 -34 -27 -36 -40 36 35 9 -7 -99 -41 59 11 -5 -90 -104 25 -119 -27 15 54 -46 52
7951 52 39 -45 54 92 -79 -8 -53 -72 -40 26 119 -9 62 -80 -119 -16 -48 35 40 19 148 49 -62 97 19 16 -82 89
7979 89 -49 49 -9 -32 -2 -138 -32 113 15 -25 -89 -32 4 58 34 0 46 -4 69 40 61 37 110 100 90 12 94 -45
8007 -45 -9 35 -64 -70 -62 61 -32 -134 -100 -18 -77 -71 27 93 15 -84 4 -92 87 -29 -50 50 -94 49 17 92 -63 -83
8035 -83 24 -98 -14 124 203 72 -29 46 58 -23 127 -63 29 76 81 33 -88 84 -21 40 -101 -113 -12 -78 -77
8060 -77 37 107 69 -39 52 -6 63 23 -6 55 89 -99 39 84 -44 -19 48 -78 65 -77 49 -5 26 29 -87 15
8086 15 70 -92 -91 2 4 -59 14 -43 65 45 175 -61 22 109 -72 33 -27 50 -46 52 -46 -1 -122 45 106 -36 45
8113D5N4rp5L4j05J53k08J8R3l5P0o1K9q8J46Kn9J2J1l2OK8K9k4l3%Q1p9P7j51
8143g1J9PJ4R0n1l6m7M9l2R5j3nr4K3J29k4n9m3M6o0k2M6Q2j74K34p9l1l2Q2N6
8173I9j92J16J0pk9O2K8r0J19j43j04J48o4Q8k3m6J35l2
$$ plain form
8113 45 99 90 15 49 -56 97 -111 -93 0 -35 35 -26 3 -85 61 63 4 16 27 -5 1 29 58 34 1 1 82 3 80 -71
8143 -71 -52 -45 -31 59 8 -28 -75 -26 -58 37 24 19 -75 -52 77 53 -6 -49 -3 -63 -85 -39 43 -131 103 24 -7 -39 43 99
8173 99 -93 23 33 26 -3 59 87 -3 116 -27 -131 17 -47 41 18 -28 107 75
8191G5
$$ Imaginary data points
##PAGE= N=2
##DATA TABLE= (X++(I..I)), XYDATA
0@%%%%%%%%%%%%%%%%%qJ6j6J6j6J6k4L2l2L5m3M8n6O4p2Q6r5J05j20J36j52J70
39I0j90K12k35K61k91L22l55L92m32M75n24N79o37P02p75Q56r48J051j169J307
59F91j471J664j899K198k586L111l867N052p202J2302m8020l2313J01328J9197
73D8185n6766l1576M2250K9073j2002j6733j877j4577M074K3725r28l4664j0321
86c2137L7735L4318k8246l8404J4093K9333p201k0460m328R560O461Q402P361
99A6487j6732j7021K3129K1848k1196k7306P534K1720k699j6919L360J0376p78
112A803M802L499j3623j0162R581J4168o829j7791Q854K1704o665j6982M989J3782
126A1130l045j6156O87J3529p139j3502R621J3043l250q970J821R881k988j1328
$$ plain form
0 0 0 0 0 0 0 0 0 0 0 0 0 0 0 0 0 0 0 -8 8 -8 8 -8 8 -16 16 -16 19 -24 24 -32 32 -40 46 -49 56 -64 72 -80 90
39 90 -100 112 -123 138 -153 169 -186 206 -226 249 -275 304 -333 369 -406 450 -498 553 -616 691
59 691 -780 884 -1015 1183 -1403 1708 -2159 2893 -4309 7993 -40027 -72340 28988 48185
73 48185 -8581 -40157 2093 31166 19164 2431 554 -14023 -9949 13776 12848 -21816 -32137
86 -32137 5598 39916 11670 -26734 -12641 16692 9491 -10969 -15297 -5737 724 9126 16487
99 16487 -245 -17266 5863 27711 6515 -20791 -13257 8463 5764 -11155 -7795 2581 1803
112 1803 6605 10104 -3519 -13681 -4100 10068 3239 -14552 -5698 16006 9341 -7641 -2652 11130
126 11130 8085 -8071 -7384 6145 -994 -14496 -4875 8168 4918 -4052 -2231 7650 4662 -6666
140f666J603M416l58L547O21m372k41N314M517o709r283P142P057r283p568M305
156e958Q531L334o146j638N571o13l271j501j536J003J606K775L171n903m453
171e028Q821N153o258p660p70P208J836p748k639L554N679N943m018q038j61M298
187A72N002k507j0831J002J3020M551q781j0236N589J4327l625j3887j732N764
201b172M347k022n781J686N151K810J365n402n172M085L963j020l041k082M595
216A310L765l617j158O19j508J588M25l216l205j607N661M938n444j683O360K077
232E305l108m235L5M505j137k286K545j056r31K524o28j900j083K08K264l598
248b576m160N041K775k333O52K919K383j958m830K933K684m677p39K756N29j147
$$ plain form
140 -6666 -5063 -647 -1005 2542 3163 -1209 -1450 3864 8381 1672 -7611 -469 6588 -2695 -10263 -5958
156 -5958 2573 5907 -239 -1877 3694 3081 -190 -1691 -3227 -2224 -618 2157 5328 -575 -5028
171 -5028 3793 8946 2688 -4972 -5742 1466 3302 -4446 -7085 -3531 2148 8091 4073 -3965 -4126 172
187 172 5174 2667 -8164 -7162 5858 10409 1628 -8608 -3019 11308 7683 -6204 -7936 -2172
201 -2172 2175 153 -5628 -3942 1209 4019 5384 -18 -5190 -1105 2858 1838 -1203 -3285 1310
216 1310 5075 1458 300 919 -589 999 1424 -1792 -4997 -6604 -943 3995 -1449 -3132 3228 5305
232 5305 2197 -2038 -2003 2502 1365 -921 1624 568 -363 2161 1533 -367 -1450 -1242 1022 -2576
248 -2576 -6736 -1695 1080 -1253 -601 2318 4701 2743 -2087 846 3530 -1147 -1886 870 1399 252
264B52k063J419K144l072k72K050l035j040K223N32K95j88K924L467l711k941
280a016L356J9k874j151M34K751j626k930L068P02k310J287P81j276r79r02K807
297A41R14k527L007K694j806r46k20p16j42k046Q55J478k889L14K685j179n94
314i77K27R17J803l010k025L385J78q07J348K91J163j41k059O42j319j651K110
331G5m96j863R58N31P90Q6j628K227J020k494K51R3m00J245l60O58J755j394j66
350H88N16j952r6K20r91J078o30m25J936r65l88K030q14j4Q1j577J029J48r81
369i07K131K35p62J258j063o95R0j692O29R89j694N72J71n81J865m33o20J378
387H71r79J12O60j920P95J403k04J312p39j350J118o23r79K81j723L13J567q70
$$ plain form
264 252 -1811 -392 1752 -1320 -1592 458 -2577 -3617 -1394 -862 -567 -755 2169 5636 1925 -1016
280 -1016 2340 2359 -515 -1666 -1232 1519 -107 -3037 31 733 -1577 -290 491 -785 -1764 -2666 141
297 141 1055 -1472 1535 4229 2423 1477 1257 541 399 -1647 -792 686 -2203 -1889 796 -383 -977
314 -977 -750 167 1970 -1040 -3065 320 498 -309 1039 1330 2493 2352 293 935 -384 -2035 75
331 75 -421 -2284 -1326 -795 -5 81 -1547 680 1700 -794 -543 -450 -850 395 35 693 2448 1054 888
350 888 1404 -548 -644 -424 -1415 -337 -967 -1392 544 -421 -809 1221 407 393 474 -1103 -74 74 -907
369 -907 1224 1459 697 1955 892 197 287 -1405 -776 213 -1481 -909 -738 -1319 546 113 -507 871
387 871 -108 4 664 -1256 -461 942 738 2050 1311 -39 1079 456 -523 -242 -1965 -1652 -85 -955
405i55L80l30o08K298R01j642pp25J011J580k055k57J577m3J017j010k793N44
423a117Q06j12L8k308J66K916j23m24j69o58K943O94k601j63J92N77J265j531
441C91l81R62j020M26k15k239N58M98o04J416o32o66J803M90M52k8q55J571m1
460A886k704Q82R75r72O2p18L64J198k240j173J332N58L65j545o76L543M45j808
478b26J094K13l2J032o68r18j173q97K575L81k858j61Q43J186P35l391p45L345
496C35R16j080r93j08K517R0j143J317j075r85J479n50j288m66p64J908R89k258
514a159k43N63R41R59k125o80K599P8p37L04j34Q59l02j051J485k53j981Lm81
533a355Q06J576k029q37J724O95p6j333o99K088o0p37J103j110k39K066l04r55
$$ plain form
405 -955 -575 -905 -1513 785 1686 44 37 -688 323 1903 -152 -409 1168 1125 2142 1132 -1661 -1117
423 -1117 -311 -423 -385 -2693 -2527 389 266 -158 -327 -985 1958 2652 51 -112 80 657 1922 391
441 391 10 972 -48 378 163 -2076 -1518 -1020 -1624 -208 -840 -1506 297 787 1239 1211 356 1927 1886
460 1886 -818 64 1039 67 129 -589 -225 973 -1267 -2440 -1108 -550 -185 -1730 -2406 1137 1582 -226
478 -226 868 1081 1049 2081 1413 495 -678 -1575 1000 1381 -1477 -1638 -795 391 1126 -2265 -3010 335
496 335 1251 171 -822 -930 1587 1677 534 1851 776 -209 1270 720 -568 -1034 -1798 110 1099 -1159
514 -1159 -1402 -839 102 1061 -1064 -1744 855 933 196 500 366 1225 923 -128 1357 1104 -877 -874 -1355
533 -1355 -549 1027 -1002 -1839 -115 580 504 -829 -1528 560 500 -237 866 -244 -483 1583 1279 324
551C24j42n50J278k50j752j60l5J283J481k508q05K466o8o84j07n42J142N57m90
570D38N2r62N65J743j046l05m4j762R80J684j948j266R24J392L20k128L33K080
588A050r86q17R46J53Q96p59j663K037J138j633q39P3J396j33k824K08J656n07
606f08L87J12j291R99O44Q7K96j204m5J818J11l48j144p91K319O66k245r14J89
625i62P67N99j774n26J209L8R82M59j739M43J325N65N3j994J92K352o32j555j40
644c38j9J316l44k330L67P22O5L86r79J79J320J31L22k22q67J464M55j601L55
663C82L15o05M3l64M6P7j262Q61N08j464L11Q40j54P18m10P4J245m08m09M87l70
684D61L75j87j080O28m14n10J093q65j208J612K43p39k69p3J506n0r94J176L44
$$ plain form
551 324 182 -368 910 660 -1092 -1252 -1287 -4 1477 -1031 -1836 630 562 -122 -229 -771 371 928 438
570 438 490 -472 93 1836 790 485 441 -1321 -341 1343 -605 -1871 -947 445 765 -1363 -1030 1050
588 1050 64 -753 193 346 1242 483 -1180 857 1995 362 -477 -404 992 859 -1965 -1757 -101 -608
606 -608 -221 -109 -1400 -401 243 330 626 -578 -623 1195 1306 958 -186 -977 1342 2008 -237 -1151 -962
625 -962 -195 404 -1370 -1896 -687 -649 333 792 -947 -504 821 1386 1439 -555 -363 1989 1357 -198 -338
644 -338 -357 959 615 -1715 -1348 -626 -561 -175 -1154 -975 345 476 798 576 -291 1173 1628 27 382
663 382 697 92 135 -229 -183 -106 -1368 -507 1 -1463 -1152 -312 -466 252 -158 -84 1161 753 344 831 461
684 461 836 649 -431 197 -217 -727 366 -499 -1707 -95 148 -591 -860 -933 573 523 -471 705 1049
703A049p10N83l00l29M60p67Q9K31j061J81N23p10N66J8l23N14o44K04J359j129
723a96k06J297j44%n28l26J071n07j129R22n63k69M91n85L12J64o05Q17k2r18
743i24J041O2l68N54k55L35L27p39M35L27j184L78L09n09J89o41J44R54q84k99
763g48Q34k62J97Qo65Q67J83l64P82o76j48J078p79l36L95n42N69k92r74P64m5
784a54o61P08m41Q4O02n97L22N85p22M92M35m23N52l44l65O65o26k43L41q32K09
805d13L22q82M10J85l54Q84k88j29P10k05m8M98o90O61J75q43N78j59n59M38o32
826c41m11O57p28P1N40n80M62L21k62P79m2m11O94j46k80O06n74n3L21p64K7j3
848a27n71N18l14n82P47k30P9P25n39M39O83n58L81Q6n26M90k05n80N77p69o3
$$ plain form
703 1049 339 922 622 293 753 -14 75 306 -755 -574 -51 -761 -195 -177 -500 14 -630 -426 933 -196
723 -196 -402 895 751 751 223 -103 968 461 -668 254 -309 -578 -87 -672 -360 -196 -801 16 -6 -924
743 -924 117 179 -189 365 110 445 772 33 468 795 -389 -11 298 -211 -22 -663 -519 435 -449 -748
763 -748 86 -176 21 29 -636 231 414 50 832 156 8 1086 307 -29 366 -176 393 101 -873 -109 -154
784 -154 -815 -107 -548 -464 138 -459 -137 448 -274 218 653 230 782 438 73 738 112 -131 210 -622 -413
805 -413 -91 -973 -563 -378 -732 152 -136 -265 445 240 192 690 0 661 836 -7 571 412 -147 291 -341
826 -341 -752 -95 -823 -752 -212 -792 -330 -9 -271 508 466 55 749 603 323 929 355 302 623 -141 -114 -127
848 -127 -698 -180 -494 -1076 -329 -559 -480 245 -294 145 828 270 651 737 211 701 496 -84 493 -276 -339
869c39L58p40R7M06o50M42J43m21P20q9p1Q04j72P1J97n28K95R3p75L54j33m98
891d36N14n69k78O88l79N9L98n60M88L70l33N04K5m17P49l10l81L05p51K79M41
912D06p35K6J08l86O30l01n69Q12m1o6N96o79J99M54l50K62N2m03N36k41l50K18
934A78n04MN56n35k35M51l69L76Q5l39K66K9l9N25m43M3L93n42L93K05o53J81
956B6R2k27K44m68q5M82m14K43Q3o30M60L81m64L12J19l41O65j61j45K91m19K49
978B93K16o75o0J64k94P09n30q15Q57J72k66J38l39N49K02n31M42K61m92N01n3
999D49l72L88n70M6L21o71o2K40k91L50l20j35R00l73l87O24q8K07K64m44K91
1020C67L22o16L46k14k86K96n46k38N08l62L6K13m76M30K60k54O23k11k28M54
$$ plain form
869 -339 19 -721 -624 -218 -868 -426 -283 -704 16 -73 -144 660 488 559 756 228 523 616 -159 195 62 -436
891 -436 78 -491 -769 -81 -460 -401 -3 -563 -75 295 -38 466 491 74 823 513 132 437 -314 -35 406
912 406 -329 -303 -195 -581 49 -252 -821 -9 -50 -116 480 -199 0 454 104 366 418 15 551 310 -40 178
934 178 -326 -322 234 -301 -536 -85 -454 -78 7 -332 -66 -37 -76 449 6 49 442 -100 293 498 -155 26
956 26 118 -109 135 -333 -418 64 -350 -107 -24 -654 -194 187 -277 35 154 -187 478 317 172 463 44 293
978 293 509 -166 -226 -62 -356 353 -177 -992 -135 37 -229 -91 -430 119 321 -210 232 493 1 502 449
999 449 77 465 -105 -59 262 -409 -471 -231 -522 -172 -492 -627 273 -100 -487 137 49 256 520 76 367
1020 367 689 73 419 205 -81 215 -331 -569 -61 -423 -387 -174 -650 -220 40 -214 409 198 -30 424
1040D24JJ86n5p67M76L66n66k32K9l39L18j79m22O39j87m0N15k51N5L40j33M57
1062F35j09n61O16k29l39K65m28p9J94l48j6J76m08L78M0j85N46k15q3O22k29
1083B43j11L80m22K24J52l27r4k07r6K82l71k12N69m53J17L26m07K63K49k96N25
1104C34r1j82L77j78j1O3l73L03J13o15J2J36k14K57p7l30M57k04J38K66m08K54
1126B7L71m65L44m8j81K39ml96J89j80j1K56m17J82N0m34M47l7k14M41j48l34
1148c23N18l19J78K44m09M03O9l93K93j82j98K74l89K8K22m17J26L56l74J52L00
1169A59l71L26Lj95M38k47m4L14k30O6p4l00K61O2m35J89l9j63K11j39L1L13m45
1192c09L05K27k49K07J26l48M64j13k71K55k62o0K37l92j3J38l19J35mj38M13
$$ plain form
1040 424 425 611 556 -211 265 631 65 -167 -138 -477 -159 -338 -760 -121 -308 -348 167 -84 -29 311 178 635
1062 635 526 -35 581 352 13 278 -150 -229 -35 -383 -399 -223 -631 -253 -213 -398 148 -67 -150 472 243
1083 243 132 512 90 314 466 139 45 -162 -258 24 -347 -559 10 -443 -326 0 -407 -144 105 -191 334
1104 334 243 61 438 260 249 312 -61 242 355 -260 -248 -112 -326 -69 -146 -476 -19 -223 -85 181 -227 27
1126 27 398 -67 277 229 48 287 283 -113 76 -104 -115 141 -276 -94 -44 -478 -31 -68 -282 159 11 -323
1148 -323 195 -124 54 298 -111 292 361 -32 261 79 -119 155 -234 -206 16 -401 -275 81 -293 -141 159
1169 159 -212 114 117 -78 360 113 69 383 153 219 145 -155 106 168 -267 -78 -117 -280 -69 -208 -177 136 -309
1192 -309 -4 223 -26 181 307 -41 423 310 39 294 32 -28 209 -183 -196 -58 -377 -242 -246 -384 29
1213B9k18m6M36j16m1K93k83K40J4l28L45m4l45K19k45k35K35k93K2K31k94K26
1235a98J88k47L84O9j00L17j05j33K35j44j02J23m04O4J8k61K33k25m3K21j24
1256b34kK89j43J86K10k44K02J45l21K13n4k45Q4j12o2J43m84L25o7l13L13K7
1278a44j98L53j16o1L15JK2J53k04j5Q9j48P8n3l80K93o6l54K74r4L6J92k11K57
1302A9O1j72L13m8j21L52m44K00L9k42J08R4k38l3J26k12J98k09k9L19j33j48
1324b00L77j65k0J86j78J30o1m4J59j52j72K81j2j79K8j86Q3J69l46L32Lk12K07
1347B8j50R4L8j22J72K24l61K27K2k64K36p9j79J56k07R1J25j66m5R2k7PJ01j88
1371a75L00k7j90L04j91J10J64k37R9R8k80J18K7l27J97Jj40L5M7j41J69p1M1
$$ plain form
1213 29 -189 -235 201 85 44 337 54 294 308 -20 325 281 -64 155 -90 -325 -90 -383 -361 -130 -424 -198
1235 -198 -10 -257 127 196 96 413 308 175 410 266 164 287 -117 -53 -35 -296 -63 -288 -331 -110 -234
1256 -234 -236 53 -90 96 306 62 264 409 88 301 247 2 86 -26 -88 55 -429 -104 -171 -484 -171 -144
1278 -144 -342 11 -105 -166 149 150 172 325 121 106 195 47 125 72 -308 -15 -81 -435 -161 -255 -219 -27 -238 19
1302 19 80 -92 221 173 52 404 -40 160 199 -43 65 159 -79 -112 14 -198 0 -209 -238 81 -52 -200
1324 -200 177 12 -8 178 0 130 69 25 184 32 -140 141 129 -50 -22 -208 -125 44 -302 30 33 -179 28
1347 28 -122 -28 10 -112 60 284 -77 150 172 -92 144 65 -114 42 -165 -74 51 -115 -160 -68 -95 -88 13 -175
1371 -175 125 98 -92 212 21 131 295 58 157 255 -25 93 120 -207 -10 -9 -149 -114 -67 -208 -39 -110 -69
1394f9J23j46J34K02j74J23q4J8J52l35j0J81k14o2K68l70K07j41p3K74k2o4Q3
1417Ao4J26Q0q2M8R0k47K44M3k55j7J2j88Q6j17J8J11j36J78J04j10J15O8OJ10
1442B24r2K3J8j41P9Pj99Q3pl39K58q0j63L97k29m0L32j31JK01k17J56J24k07
1466E8K63k14p5J29j99o0l0l8N7M7j49R8M8j67K67j06P5J71j31J03Q1k17R7N8
1490A66q7r1L5j82kN5q3J37j50P0K04k25R7Q5j01K16k2pMl9j5J2o8N4P2k09j0
1517h4O3j41K42n0k06J18PJ9O4j80J66L1q9J81j8j34K05j47J6K8m9o8l0j03Q4
1542g5K0j04J29p3nO8j8r6K56q8L2J26k23O5J73k42R2l8o9R3J5q9K4j15O1j3j9
1569a13N5J18j47J73j00PJ12j96R8K94k17j9n5q2J25L7j99Q7rj73K09j62P9R5
$$ plain form
1394 -69 54 -92 42 244 70 193 109 127 279 -56 -66 115 -99 -161 107 -263 -56 -197 -270 4 -18 -82 1
1417 1 -63 63 143 61 109 199 -48 196 239 -16 -33 -21 -209 -123 -240 -222 -111 -247 -69 35 -75 40 108 114 224
1442 224 132 155 173 32 111 118 -81 2 -5 -344 -86 -166 -329 68 -161 -201 131 0 1 202 -15 141 265 58
1466 58 321 107 32 161 -38 -98 -128 -166 -109 -62 -211 -113 -65 -232 35 -71 4 175 44 147 228 11 108 166
1490 166 79 -12 23 -159 -161 -106 -189 -52 -202 -132 72 -153 -56 29 -72 144 122 115 119 80 65 77 9 63 135 -74 -84
1517 -84 -21 -162 80 30 -176 -58 -51 -32 32 -148 18 49 -40 141 123 -11 194 47 63 91 42 -26 -56 -159 -75
1542 -75 -55 -159 -30 -103 -108 -40 -58 -154 102 14 46 172 -51 14 187 -55 37 -1 -70 23 38 -51 -27 -142 -81 -94 -113
1569 -113 -58 60 -87 86 -14 -7 105 -91 7 301 84 65 10 -72 53 90 -109 -22 -31 -204 5 -157 -78 17
1593A7J6o0J87mj56J39K9L8o1j79J12o7m2l2j6ro6J27l4j1j36K52k76J36K81k26
1619d1lJ68n6n2Q4l1n8P9p3p0q2l9J57k21J67j5p4J1J81j78J28J94k36J91o0k5
1645D6Q1l1J0r3j9K8J00l61P7L5mmM0R5%j5OJ32q2K3Q4r3M6l9k8Q9j81J25o4j20
1675a17L9O9j41J36Mj47J52K5m4J46k14K40p5l0k9jj07J10L5k3o5K6q4K8J2j07
1701a62R2K6O9Lj55K51J1n2J5j28J23qj20Q1j7m9p0l2l5J78Qj43K04r0l3PL1O7
1729G2l8o8J03mj04Q0O4j28N8oM6p8m5J4K9j20N2J60j71L6J20j98J19O5k6K3L
1756E8j8J30j09j25J55p5O5M5k80N6l6J41O0j09L2n3l3R0J1K9K4m7K0L0j30J18
1782D9m3r4J89j5l48K45n3K0P8m2n9j1O7O2n8n6K21j09m9l3J25j56K43r8j29Q5
$$ plain form
1593 17 33 -27 160 156 0 139 168 206 145 -34 78 11 -31 -63 -79 -88 -154 -27 -61 -72 -208 44 -232 -96 185 -41
1619 -41 -44 124 68 16 100 69 11 90 17 -53 -135 -174 -17 -238 -71 -86 -160 -149 32 -146 -18 176 -60 131 71 46
1645 46 127 96 106 13 -6 22 122 -239 -162 -127 -131 -135 -95 0 0 -15 -9 123 41 64 148 55 101 62 34 123 -58 67 3 -117
1675 -117 -78 -9 -150 -14 -10 -157 -5 20 -24 122 -92 148 73 43 14 13 -94 16 51 28 -37 -11 -95 -67 -55 -162
1701 -162 -70 -44 25 28 -127 124 135 83 98 -30 93 85 -35 46 29 -20 -90 -122 -157 21 29 -114 90 0 -33 -26 5 72
1729 72 34 -34 69 65 -39 41 105 -23 35 29 75 -3 -48 -34 -5 -125 -73 87 -84 -48 72 -126 -7 58 32 55 58
1756 58 40 170 61 -64 91 16 81 126 -154 -98 -134 7 67 -42 -10 -63 -96 -6 5 34 58 11 31 61 -69 49
1782 49 6 -88 101 86 -262 -17 -70 -50 28 -14 -73 -84 -17 45 -13 -69 152 43 -6 -39 86 -70 173 75 -54 31
1808C1j11M0N2r9mJ6l3J82q0l6L9J93o2n6O0j23Q2j83J62k1n9R8r0j9j4j71J57
1835d9K8j08J61j08M5K0J06j54J14R5j51J46j05o5m2j6l8J36p8M3o6mN6L7o0n
1861f2O8m6R2j31J21L1l7M9j53J45O6j65l9J60j74n8J73j85R4l3LJ65o7PL1J3
1887F8o9J2k7J6l9N2P5n8m1l6nk2N4l1poJ27m7P3q2Q7q8o4L8L3k7L9J7n5p8J1
1918h0M5j4j05L58k06j11K17j27l5P5l7m1J92j85P3N5ko9M6k7O7q6OO3r7k3J80
1945A32j80j4O0l9p0J29l6O1m5NJ49j84K6q0R1j19J35k3j6qR8j57N9Ppj0l6J42
1973G0p1OkJ8j04R6KMJ5l1N0k0l3j3Km5rk5K9pl7J21m5j7J15j2J3k9j1J4J01j39
2005Fr3J55r5M7j4k0jR3l9K3j64J68l8p3R4o3N4L1j08K4J44j08oN8j56M4K6q4
$$ plain form
1808 31 -80 -40 12 -87 -91 -75 -108 74 -6 -42 -3 190 128 72 132 9 91 -92 70 49 -10 88 -2 -21 -35 -206 -49
1835 -49 -21 -129 32 -76 -31 -11 95 -59 55 150 -1 145 40 -25 -67 -83 -121 15 -63 -20 -86 -90 -34 3 -57 -62
1861 -62 6 -40 52 -79 42 73 36 85 -68 77 143 -22 -61 99 -75 -133 40 -145 -51 -84 -81 84 17 24 55 68
1887 68 -1 11 -16 0 -39 13 88 30 -11 -47 -52 -74 -20 -51 -58 -64 63 16 89 7 94 6 -58 -20 13 -14 25 42 -13 -91 -80
1918 -80 -35 -49 -154 204 -2 -113 104 -23 -58 17 -20 -61 131 -54 19 74 72 3 49 22 89 3 9 72 -25 -48 132
1945 132 -48 -62 -2 -41 -111 18 -18 43 -2 3 152 -32 -6 -86 5 -114 21 -2 -18 -26 72 -85 -26 -19 -26 -36 -72 70
1973 70 -1 5 3 21 -83 13 15 19 34 3 53 33 0 -13 -11 -56 -65 -90 -61 -68 -105 16 -29 -46 69 57 70 41 30 44 145 6
2005 6 -87 68 -27 20 6 -14 -15 78 39 62 -102 66 28 -45 49 -14 40 71 -37 -13 131 23 17 75 -81 -37 -11 -95
2033i5J08j28Q5K5K1p3J9mk3P6p8J7N8lQ2j9r6N3M2r6o6jJ22lj22J73M8j32J02
2062I2p0lN0q2n4J00N8n5o4j9k8K33j98MN1rJ0q6L8P1N7o6ML3j0J3m7O6j16Q0
2092E3j70N1J99j10N1p6l7RN5J6M4j11J6j5M9k8o8R0j13M9J43q0qj51J45K4%k9
2120bK7p1k3R7j65J83m0j07J62k7n4J39j04J8%m8L1M5k02J60l8n5J45p4J6o4L5
2147a6J7PR7j55P8k5j8P5r7J12j17M5pL3N8j39Q1l5O1j14J35l5l2M9M3r3N8K1
2175H7k23J67o9J16j8l8m3l9J60p4o8j0Q0n8o3J01o0Q7Oj61J37J19k06J02ol8
2201a2O7K9p0n8O2m1M4nn6n5M0J0j19J07Q6j00O7J20j31l3J05J4j28J17q1N0j02
2228g3K1P7q9m7R6Nm5J40j24K1J01n8J20j24n0K2k6P6k1o9K8P3j33J02o1P3m5
$$ plain form
2033 -95 13 -115 -30 -5 16 -57 -38 -42 -65 11 -67 -50 8 5 87 68 -28 25 67 -29 -95 -96 26 23 -99 74 122 -10 92
2062 92 22 19 69 -13 -67 33 91 36 -28 -47 -75 158 -40 -36 15 6 16 -70 -32 39 96 30 34 67 57 70 23 89 -27 53
2092 53 -117 -66 133 23 74 -2 -39 -30 25 41 85 -26 -10 -25 24 -4 -72 18 -95 -46 97 17 9 -142 3 27 27 -2
2120 -2 25 -46 -69 28 -137 46 6 -101 61 34 -20 119 15 33 33 -15 16 61 -141 19 -19 -74 71 -3 13 -51 -16
2147 -16 1 8 105 -50 28 3 -15 60 -37 75 -42 3 -4 29 87 -52 29 -6 55 -59 76 41 9 58 101 8 66 87
2175 87 -136 31 -38 78 60 22 -21 -60 100 26 -42 -52 28 -30 -93 8 -52 35 41 -120 17 136 -70 32 26 -12
2201 -12 55 84 14 -44 18 -23 21 16 -40 -95 -55 -45 -164 -57 29 -71 -4 116 -15 -48 57 71 -57 60 -21 29 -73
2228 -73 -52 25 -64 -111 -15 -10 -55 85 -39 -18 83 25 145 21 -29 -7 -33 43 22 -47 -19 54 -79 23 -38 35 -10
2255a0k2N5j22K0P0Q9p8j3l4L4J67r8m9prQm2N3j36m5K05j32P2j3R6j09N3P1j03
2284b9j01P0J04o1J83j36j27P4J6R6k23L8J00m4L0J83k91O4P8j57J90j30J22j04
2308e5j2p2J5J83j23M5O0q7L9O6l0m9j35R5P7nn0O1J14j79P5K3R2p3R6q4r8N7
2336D6j04%O2n0K32p5j33L4J1l7Nm4J1L7o7O0J8J1Ko6r0Q4K3J17j57J96k25J59
2364F0k02K00J73l67J41k8R6j58J31k3J4jq7J5J1Q4rj18R0k3j93J47k00K07j18
2389a58J11J67n3p5J59m0k0Jk7J22k56J98m6K5q6R1k67K91j08jl07K81p5J72j28
2414b9k9m2l6J96R6k78J27N9j10o9L5k2P0kL6Q5j15Qk6O2j24J54j8j79K07j33
2440g7J24Jo0q0K25j27Q9Po8J59j95pK1k8j11R2J34j11P8p3Q8m2n4J74j96J88
$$ plain form
2255 -10 -32 23 -99 -79 -9 80 2 -11 -45 -11 156 58 9 2 -7 1 -41 12 -124 -169 36 -96 -24 -37 59 -50 3 74 -29
2284 -29 -130 -60 44 -17 166 30 -97 -23 -7 89 -134 -96 4 -40 -10 173 -118 -54 24 -133 57 -73 49 -55
2308 -55 -67 -139 -124 59 -64 -19 41 -46 -7 59 29 -20 -155 -60 17 12 -38 23 137 -42 33 56 148 75 171 87 -11 46
2336 46 -58 -58 4 -46 186 111 -22 12 23 -14 -9 -53 -42 -5 -72 -12 6 17 19 -47 -137 -53 -30 87 -70 126 -99 60
2364 60 -142 58 231 -136 5 -23 73 -85 46 23 37 36 -51 -36 -25 59 50 -68 22 -1 -194 -47 -247 -40 -158
2389 -158 -47 120 67 -8 151 111 91 92 65 187 -69 129 83 108 22 113 -154 137 29 28 -279 2 -73 99 -29
2414 -29 -58 -100 -136 60 156 -122 5 64 -46 -115 -80 -102 -32 -34 2 87 -28 -20 -46 16 -108 46 28 -151 56 -77
2440 -77 47 48 -12 -92 133 6 95 102 34 193 -2 -9 12 -16 -127 -35 99 -12 66 -7 81 39 -15 159 -37 151
2466A51k97O7M6N4O3p5L4l6K5n5N7j11L3L2oP1r3L3l1Q6J5j06N7L8p6O9j69J51
2494B7J5p2M8j4j67J66jj40J49m8j4M8o7J89j76j4P5Q4n4N0j05q8J72j04rP3j0
2521A3p4O0M8o6p6N9J03j52J58j4j46J56r5L7j7l3n8N6K1o9oJ95j39P4r1O7k2
2548a1k3j28K10k3n8R4j32J21j28P9oR0j57R8l5K3r4K1J45p4O6j41J46k13J47
2573A7L4o1nL1Jn8j2R8J7k7n5l6o5P4J01j10L8k5N8J0kn3Q3n5j9m2k9K28j55J23
2603A04j00Rj70K15q0J3O9M4j63N8j46J66k3J02j14L7K6R8O33q79J24Q1l6j92
2627a24J48N1L0k16P1o8M7P4M5j38K4P5l9l0J01m6k7N3pQ8j00n1J18oNj63Q7j2
2655a0P8Pj29J18q0Jk2J46o3q5L5j2RM8r4j0L5pN5p6L9po0J37k8j6j6M6J38k45
$$ plain form
2466 151 -146 -79 -33 21 84 9 43 7 32 -23 34 -77 -44 -12 -18 53 -40 -7 -38 48 63 -43 14 52 -24 45 -124 27
2494 27 42 -30 18 4 -163 3 2 -138 11 -37 -51 -3 -70 119 -57 -71 4 88 34 84 -21 -109 63 -41 -50 23 13
2521 13 -61 -1 47 -19 -95 -36 67 -85 73 59 -87 69 -26 11 -6 -39 -97 -41 -20 -89 -95 100 -39 35 -56 11 -11
2548 -11 -34 -162 48 25 -33 61 -71 50 -78 1 -5 85 -72 26 -9 14 -80 -59 86 12 78 -63 83 -130 17
2573 17 51 -10 -15 16 17 -41 -53 45 62 35 -20 -56 -121 -47 54 -56 -18 -43 15 25 23 -30 53 -2 -21 -63 -92 136 -19 104
2603 104 4 13 -157 58 -22 -9 60 104 -59 -1 -147 19 -4 98 -16 21 47 145 778 -101 23 104 68 -124
2627 -124 24 75 105 -111 -40 -108 -61 13 58 -80 -56 19 -20 -50 51 5 -22 31 24 112 12 -39 79 73 78 -85 2 -10
2655 -10 68 75 -54 64 -16 -15 -37 109 46 -39 -4 -16 -7 41 -53 -63 -28 -35 20 -56 -17 -24 -84 53 25 9 -7 39 177 -68
2685f8O3j7q4J18o5O0J4o8O0m1oJ79k11Q3m5L2Qn1J55j30j22J26J04o8o2Q2lr1
2713d8Rj04J80j15J4LP0R6j48qO3K3RO1q2m6m7l3O1J08p6N7k2j42K08j33J42p8
2741B2N4n8Rj3p4O1j1p5J23j25J5J58j68J2J28l9pR2j76Q4J38l18J60jj0r0L4
2768g5P3m8j0M8J16n6r5J15k2n8RP3l8o8J5kp3J82j08Mr7P8M7nm7k8J5j1QN7r
2799a0J96r4q6J4L3n2o3jJ00j02K0pL5jP7l3j3N1j94J33L7j06J35Oq1Q0j24K0
2827c0N4j22R0O6j08o3J09n3K8J01j85J6R4K2k7O1p0M6q8l6L3R6o4M4m1O5q9L1
2855b0Jj12J91k7L3l9q7K7N5j52J30Q4j00pl8j1R7n4Q5m5q1M9N9n4j2P4K2r7N5
2884B6j14K2M0J1P6m7j5j4m2L1kK9PK8o0P2o6N5K4P8o9j6k8o9n8J19m6K9l7l8
$$ plain form
2685 -68 -5 -22 -106 12 -53 7 21 -47 13 -28 -34 145 -66 17 -28 4 12 -39 116 -14 -136 -10 94 26 -36 46 43 -48
2713 -48 -39 -143 37 -78 -64 -61 9 105 -43 -51 12 35 44 105 23 -23 -70 -103 -42 66 -10 47 25 -117 91 -42 100 22
2741 22 76 18 27 14 -60 1 -10 -85 38 -87 -72 86 -82 -70 58 19 12 104 -72 12 150 -168 -8 -9 -19 -109 -75
2768 -75 -2 -50 -60 -12 104 48 -47 68 46 -12 -3 70 32 -36 -21 -23 -96 86 -22 -18 -115 -37 10 5 -42 -70 -55 -66 -58 -1 -10
2799 -10 186 92 6 20 53 1 -62 -63 37 -65 -45 -52 -17 -18 59 26 13 64 -130 3 40 -66 69 75 -6 74 -50 -30
2827 -30 24 -98 -8 58 -50 -113 -4 -57 -29 72 -113 -97 -3 19 -8 53 -17 29 -59 -95 -62 34 -30 14 -27 38 -51 -20
2855 -20 -19 -131 60 33 66 27 -60 -33 22 -130 0 84 -16 -23 -61 -72 25 -29 56 11 -70 -21 38 -16 -28 46 68 -29 26
2884 26 -88 -66 -26 -15 61 14 -1 -15 -57 -26 -28 1 8 36 -24 48 -18 37 61 139 70 54 26 -43 -101 18 -28 1 -36 -74
2914g4J04l1r5K00j70L9N4Qn2J35o5j26m4J08ql1O0J9k3l9n4J97n5p5N2J5j77
2941a28J37J15j77J0Q9l2q1K18k25J87k4M0j23k4J39p9o4L4P0j86J29q3JN5J0
2966Hj04Q4M7j52O4mJ07q0K3J3p2Q8K4o2P2o2Om8N2J2Koq4k2K2N6lM1m4J43j02
2997A9J4m0N5Qj83O5J24j59J51or5P3mj17J47j82K06j3m9J04j70R7j34K50n0n0
3023F1pj17m1J82M1j96k1L4R9Nj12J41o1r2O2n0J01k1Q2rnp6r3K38j70J9J26j58
3051c8O1o8N0J9m9R4j05j3J5M8M6L3J2m3p6O1J6n4j3k2r9J13J14k12L0J44m7p9
3079f2K84j77J1M1q5K5r2J9O9K9r8P4j03O3lk5J10p8j0nk9o3J0Q0NP5k5Ln4n9
3109g0J35n6L5l7j1mK2j3J1j13Q7n4K0P3j7J8O7p3L6j54M0O1Or0N3O7p5R2p8m2
$$ plain form
2914 -74 30 -1 -96 104 -66 -27 27 35 -17 118 53 -73 -117 -9 -17 -48 12 31 8 -31 -85 112 57 -18 34 49 -128
2941 -128 9 124 -53 -43 46 14 -67 151 -74 113 89 129 6 -18 121 42 -22 12 82 -104 25 -58 -57 -2 8
2966 8 -96 -12 35 -117 -53 -57 50 -30 -7 6 -66 22 46 -16 56 -6 0 -48 4 16 18 12 -72 -94 -72 -16 -19 22 -22 121 19
2997 19 33 -7 48 56 -127 -62 62 -97 54 48 -47 26 22 -95 52 -130 76 63 14 118 -52 45 -89 161 111 61
3023 61 54 -63 -104 78 119 -77 -98 -64 35 40 -72 69 8 -84 -22 -72 29 8 90 81 76 0 -93 145 -25 -6 120 -38
3051 -38 23 -45 5 24 -25 69 -36 -49 -34 14 60 93 105 62 -14 47 63 9 -4 -26 -125 -12 102 -110 -80 64 17 -62
3079 -62 222 45 56 97 12 37 -55 -36 33 62 -36 38 -65 -2 -5 -30 80 2 -8 -13 -42 -105 -95 -15 -10 65 40 43 -11 -70
3109 -70 65 9 44 7 -4 -8 14 1 12 -101 -14 -68 -48 25 8 26 93 20 56 -98 -58 3 9 -81 -28 39 -36 56 -22 -64
3139f4J14Op0NM2k4r2J50k8j0o8J3Q4j76J48M6k2o0L4N1q9L6j24J24p1pJ52n5
3167D5l8Pn8L5q1P5ql8QJ10R0j62J32r3nn5rL9l1kmJ06K7k3k7n9L0m8j1J66k3
3198I5o8L5j2J3Ol2Mj00o0R9M5m8N7j24K5M8r1J48J02o8l0m5o1P4p9L6J49p4K0
3227F4K4j36J20r4PM4o2J8P6l2j05J31r2J72j20J07j47J8o2J59q0j09J14k5l4
3252d4J15n9J2o4Mo1k3J08Q1j14J5J33n9L2M3j47j5O6l2J9j7K3o2LJ56q7O0j34
3280d8m3L4P8M0m9Q7j44mJ7k4J61j55r8K07j22J5N4k6L9N4j58M4R3j12Q0J9q2
3307d3l8J60j20J44m2J3r4l8M0J15n8K9J03j97R6q2o1J15l9P0M2p6q9J42n8L8
3333G2j12K8o6J57m5n7j0ll5L1q4J49j97L9N5K6M4r0K21j40J2Q4j08M4m4J72p2
$$ plain form
3139 -64 50 56 -14 -9 33 9 -83 67 39 29 -39 -26 58 -118 30 76 54 -6 28 79 -10 26 -98 26 -45 -52 100 45
3167 45 7 14 -44 -9 -90 -15 -23 -61 -53 57 147 -15 117 24 19 -36 -45 -6 -37 -39 -43 63 90 67 40 -19 11 -37 -48 118 95
3198 95 27 62 50 63 69 37 41 -59 -119 -20 25 -23 34 -90 -65 -17 -108 40 142 74 44 -1 -62 12 -67 -31 118 44 64
3227 64 88 -48 72 -22 -15 29 -33 -15 61 29 -76 55 -37 135 15 122 -25 -7 -69 90 10 -99 15 -10 -44
3252 -44 71 12 24 -40 -36 -97 -120 -12 69 -45 -30 103 44 76 119 -28 -43 23 -9 10 -7 16 -46 -43 113 26 86 -48
3280 -48 -91 -57 21 61 12 99 -45 -49 -32 -56 105 -50 -148 59 -63 -48 6 -20 19 73 -85 -41 52 -60 20 39 -43
3307 -43 -81 79 -41 103 61 74 -20 -58 -18 97 39 68 171 -26 70 -12 -73 42 3 73 115 39 -50 92 34 72
3333 72 -40 -12 -78 79 34 -23 -33 -36 -71 -40 -124 25 -172 -133 -78 -52 -8 -98 123 -17 -5 79 -29 15 -29 143 71
3360G1On8mO4j35L3K9Q4p8L0R2j39J6o3J16j23N7k0Q9p7M1K8L1l7j09J9j5M9q8
3389i1J51o7k0M4l4J4M8J1k4M2j36J29m7N9j06o0Pl1P1Q2j20m1J05N5j11K6m6
3416i0J78j28L8m1N9N4j80Q9L9M4k7J4mk8mJ19j45K5k7l1R1j48J3K57k38R4k6
3443co5J39r8L9m5k9R5K5p8m4P3j75J34J23Pn4m8qJ92j91K9n6J50j11M7rl1j0
3471bM4j12J36m4K9j35J81o8L3k5j03R1J8M3q8l6M1J13j5j09N4p9N1j11Q0KJ39
3498A28r4j84K31r6P9r2NJ5J04r2n0N2O1j27N4m8L0kM9r4N0J7Q3n4L7J8J1l4m3
3527A4K9q5L0M3Mp4J9Q7j02l9K2R3R0j57O0r7Q2j31J80j67J2J32n3J26k38J14
3553fKm2K7%L8O0mO6j50J22n1l9o9k7M7Q9p5PR6o9p8J12q4M5Q5j56K7p5J80j30
$$ plain form
3360 71 77 19 15 79 -56 -23 6 90 12 42 134 -5 11 -52 64 -59 -2 -22 67 -10 31 59 90 53 -56 -37 -52 -3 -91
3389 -91 60 -7 -27 17 -17 -3 45 56 32 74 -62 67 20 79 -27 -87 -80 -111 -40 42 -78 -119 -14 41 -70 -44 -90
3416 -90 88 -40 -2 -43 16 70 -110 -21 18 62 35 49 45 17 13 132 -13 12 -15 -46 45 -103 -90 167 -71 23 -3
3443 -3 -68 71 -27 12 -33 -62 33 58 -20 -64 9 -166 -32 91 98 44 -4 -12 180 -11 18 -38 112 1 48 39 8 -2
3471 -2 42 -70 66 22 51 -84 97 29 62 37 -66 25 43 86 -2 -38 3 116 101 -8 46 -33 18 -93 -13 -11 128
3498 128 34 -150 81 -15 64 -28 -23 -8 96 4 -46 6 67 -60 -6 -54 -24 -26 23 -71 -21 -4 79 25 62 80 91 57 14
3527 14 43 -42 -12 31 35 -39 -20 67 -35 -74 -52 41 131 -26 34 -63 19 -112 68 -99 -87 45 -8 118 -120 -6
3553 -6 -4 -46 -19 -19 19 79 75 141 -9 113 62 23 -46 -73 -26 63 -12 -5 91 22 -56 56 -28 17 102 -54 -27 -102 78 -52
3583e2P0m3Q2m6n7J6J14k65J51J49j50K6m1K0k8K5J01J1m9k9J06q6N3j55R3p3
3609e7J19Koj24N7l6l2J69p9m4J19r8l6nP1j17J22j36J15m4N2q4r5Q1J10j7l0
3636b3P2j34M4Q7q1p6P1J17o6P4Ol2J0j47O7j8oJ7LP2q5n2L0J5nL4O8J6p3q5K08
3667A28j24p4P8q0O5O0n2Mlj1j45K50l9q0J16k05J53o6rR6J7j85J79p4Q7j7r9
3694c0m8J62n3N4O1k56J42LK7o7L0p8L5Q8j10L2M2j41O6M1m6K1O7n0J9MJ7l1l9
3723c8l7J71m2j3l7J05j44P3L8PJL7n9r9M8j3n4K01j40r4J29k6J9j01K5n3R1j45
3751a50J43Mm4J10l5m8M6J5j9oj8j7k6K2M2o3J1L0q0J17j61J81j75L5J26j13O0
3778a3P9p0L3J30j80l4J49j78O3k6P9L7j34J01Rj4p6K5J3P9p3J00j04O7n4O9m4
$$ plain form
3583 -52 18 -25 57 11 -46 -30 84 -181 -30 119 -31 -5 -46 -26 -54 -29 72 83 34 5 111 25 78 -77 16 -57
3609 -57 62 64 58 -66 -9 -45 -77 92 13 -31 88 -10 -46 -51 20 -97 25 -111 4 -40 12 -72 -167 -86 24 7 -23
3636 -23 49 -85 -41 46 -35 -111 -40 77 11 85 91 59 69 -78 -11 -29 -35 -18 -15 57 -28 -80 -50 -35 -40 -6 62 78 5 -80 128
3667 128 4 -70 8 -72 -7 53 1 5 2 -9 -154 96 57 -23 93 -112 41 -25 -34 62 79 -106 73 -1 86 69 -30
3694 -30 -78 84 31 85 146 -110 32 35 62 -5 25 -53 -18 70 -40 -8 34 -107 -41 0 -46 -25 42 -8 11 15 32 1 -38
3723 -38 -75 96 54 41 4 109 -35 38 76 83 84 121 62 -37 11 -2 -56 145 5 -89 40 14 33 -68 -43 -96 -5 -150
3751 -150 -7 -3 -47 63 28 -20 26 41 22 16 -2 -19 -45 -23 19 -44 -33 -3 -83 34 -127 54 -121 -86 40 -73 -13
3778 -13 66 -4 29 159 -21 -55 94 -84 -21 -47 32 69 -65 36 45 31 -45 -20 -7 72 -1 99 -5 62 8 77 33
3805C3L9k0j24R5qM3M5K1j73N0J9lK5j26J8l2J22Q7j30J38j45l7J61j63J4M0q1
3832i2N2J26o5q1O9K4j6P0o0j19rJ36L6q7J9M1n7l9N0P4o6P9j07M8j25M6J13j41
3860h1J44p2R2r2j01J04q0J55m0M8RJ4l5k08J91j19L1OLJO6m7j8J5J08j26K7m4
3888d9L5J4J2J3p0P5n6mJ28p2N0l8j19N4k6J64j15oJ56j76L2j2K9r8J13J6j47
3915i7J52j5Q9k14J45l0j62J27K6jj4j6N2j11J1Q0j9RJ2Lr2J5Pj4J23j54P3n4
3943f9J13m3O%LO0p3P1j21l3J10ml7M2o9j1L6o5O4p0k6N4k8K28j98J14n0K1jP3
3973I7o5n3l4j3K9J14n5p7R5k2L5j0J5r5J19n8M1N3j22n2J17j08R0o0N6Q9j14
4000A2l4l1l3L5J71k01M5R3j61J23K5l2j49K04o7K6k4q4K3J23n1m9J5Q3J4m3O7
$$ plain form
3805 33 72 52 -72 23 15 58 103 124 -49 1 20 17 42 -84 -66 -98 24 111 -19 119 -26 -63 98 -65 -51 -11 -92
3832 -92 -40 86 21 -60 9 33 17 87 27 -92 -101 35 71 -16 3 44 -13 -52 -2 72 6 85 -22 26 -99 -53 60 -81
3860 -81 63 -9 83 -9 -110 -6 -86 69 29 77 86 100 65 -143 48 -71 -40 -34 -31 -30 36 -11 -29 -14 94 -32 -5 -49
3888 -49 -14 0 12 25 -45 30 -26 -30 98 26 76 38 -81 -27 -53 111 -4 -10 146 -30 2 -10 19 -79 34 50 -97
3915 -97 55 40 129 -85 60 30 -132 -5 21 20 6 -10 42 -69 -58 22 3 12 24 27 -65 -50 -43 -57 66 -88 -15 -69
3943 -69 44 1 7 7 10 70 -3 68 -53 -86 24 20 -17 25 -44 -55 -19 -84 -20 -90 -116 -62 -90 138 -60 54 4 25 24 97
3973 97 32 -21 -55 -68 -39 75 20 -57 38 16 51 41 56 -39 80 22 63 116 -6 -58 59 -49 41 -19 37 126 12
4000 12 -22 -53 -86 -51 120 -81 -36 57 -104 19 44 12 -137 67 0 26 2 -82 -59 64 13 -36 -21 62 76 33 100
4027A00j12Q5j56J19l4J05o6Pjj23O1k6P6n3k4K2o5Q7Mj3M0m4Q3q3kM6r4Q8J5
4056D2O0j39KJ37m8m3O6j59P5k0M7o9O5Jj50J14J41j74J16j53J06J07j11J7j03
4081g3O7P3j2Oo6Q4no1L3Nj22J19p5L6M6J3j09p6J24o7R3j5N3j62N6O6K8mj02
4110d7J7J24j33J02q8O4o4OJ2J9q2P0j6L8j8j5qm7J27q5p0N3MJ34r1q4J02J06
4138A30j81O6j2k1J5m7P0J41j71Q6j77J47j37J36o1J17m1l4j4k4n2J10j43R7Q
4163Hk1J09j11N6o2j4j8O9k9n8J12n4J8Q7r0Rl0J17j09Q9q4L1q4j41K01P3L9n6
4191E7k2N0q4Q5m6q3J9J33j32Jn6J18k1k8O0r4P9l3o2L5J1Q9l8N6j03M3M1l7l5
4220CM0r0N2K1n3N3O0j17M8J9m4l2N7J11j53K6K6k7N1p1N9K8p4L5l3M4j17J37
$$ plain form
4027 100 -12 73 -83 36 2 107 41 48 47 -76 -15 -41 35 -18 -42 -20 -85 2 6 -7 33 -11 72 -11 -13 33 -61 27 42
4056 42 102 -37 -35 102 54 11 77 -82 -7 -27 20 -49 16 17 -133 -19 122 -52 64 -89 17 124 13 30 -73
4081 -73 -6 67 55 61 -5 79 74 13 46 51 -71 48 -27 9 55 68 -41 -117 7 -60 33 18 71 -91 -35 31 59 55 -47
4110 -47 -30 94 -39 63 -25 39 -25 -19 -7 12 -70 0 -16 22 4 -11 -19 -66 61 -24 -94 -41 -37 97 6 -78 24 130
4138 130 -51 15 3 -18 -3 -50 20 161 -10 76 -101 46 -91 45 -16 101 60 26 12 -12 -64 46 -97 0 8
4163 8 -13 96 -15 41 -21 -35 -53 16 -13 -71 41 -13 5 92 2 11 -19 98 -11 78 -6 25 -59 -200 1 74 113 57
4191 57 35 85 1 86 40 -43 -24 109 -23 -22 -78 40 19 -9 51 -43 36 3 -59 -24 -13 76 38 94 -9 34 75 38 3
4220 3 43 -47 5 26 -27 26 86 -31 17 36 -8 -40 17 128 -25 1 27 0 51 -20 39 67 -7 28 -5 39 -78 59
4248E9n8n0M1n7N9n4P2o1O9j05J18O4k1k9om1j5R3L8o2p4K9N1j14L5N3k8L6n6
4277a4m2K5L3K9l9k9J15j78J25K0J9j8k8OmJ02r0O4p7K6o1j0K9MK8m1Q4j0j29
4306f1Q5j9Oj1L8P2j00L0o7k5j3J17M9M0q5j99J71o4J0M9p5J21j51K8M2O2r4L2
4334a2j11J50L6j16J26o0L6Q6j72j1K6N6q8N7l1M9n4%J09p7n3R9j42J16j0j2j9
4361b2l7Q8oN6L6k3j47O1Kj8j7K7Q3r9L1mn4j8NJ14j03M0r0J25k9n1K2O3j08J01
4391B8l9J3n2Q3m2rQL0J43r8r7N6k1J24l9r2j08J01q1N0L5Q1rp2mL5P8j63Q0M
4421B3m2K2n5L7m8J75o4m3J4O1j0j34M5l7R3n2j6l1L7K2K2j1j3r5K72k11n2J57
4449F6N1j3q3N1j1q5J73L85m85Ll74L00j89L69n07J06N8k15N56l49K56k08K97
$$ plain form
4248 59 1 -49 -8 -65 -6 -60 12 -49 20 -85 33 97 76 47 41 0 -15 78 116 54 -20 9 60 -54 -19 34 6 42 -14
4277 -14 -56 -31 2 31 -8 -37 78 -100 25 45 64 46 18 24 20 122 32 96 19 45 -16 -26 3 7 35 -6 78 68 -61
4306 -61 24 5 11 0 38 110 10 40 -27 -52 -65 52 101 141 56 -143 28 -36 -26 23 -52 69 -82 -54 -12 50 -44 -12
4334 -12 -123 27 63 -53 73 13 49 135 -37 -48 -22 34 -54 3 -28 21 -33 -33 76 -1 -54 45 -97 19 9 -3 -22
4361 -22 -59 29 23 79 115 92 -55 6 8 -10 -27 0 83 -16 15 11 -43 -61 -56 58 -45 -5 -95 30 1 -50 -28 35 -73 28
4391 28 -11 2 -50 33 -9 -18 -10 20 163 65 -32 24 3 127 88 -4 -112 -11 -92 -42 -7 74 65 -7 -11 24 102 -61 19 23
4421 23 -19 3 -52 -15 -63 112 48 5 19 80 70 -64 -19 -56 37 -15 -31 -62 -25 -3 19 8 -5 -100 172 -39 -91 66
4449 66 117 104 21 72 61 -24 149 534 49 52 -322 -22 -211 158 -349 -243 -185 -400 156 -193 63 -145 152
4472A52k01N9%l6L9%p0Q1o5Mr3J15K2l8J40j50J36r7p0P0J4Q7o0J03k25R1p5P2
4500Eo6R9M9r5m7O2m5N4N2r8j09J15M9o1J35mj35Q8q1L0M2P4j30n5N4O1J4l1N5
4529H1N4o7m5N7n4jN7j24P1O6k21J62J3q7PJ8J3M4m3j01M5j2J33j99J32m7Km6
4557i2rP9p7J75r2OO3l7kL4q9R5p9R4q3Jl7QM8R8r1l7R9q7kl9J16o1p2J0lJ59
4589I6p3k4K8k4N0j34L9q2K57j14l6m2O8k7N9K6J7p3Q2r5J5m5M9J27j80J06j04
4616c4NJ53k7q4K0m7J35m6j23m3J58n2l3K2L4l4o2K4m3K49r7j44J66j25L8k6O1
4643D5m5n5R8k6njJ0n5J33r1L3j06P7Lj3L5L1o9J6j5J3%O4J5n8oJ0O2K2j58L4
4674bj9O5q7Q8j38Q1N0p0L7m8N9m7j4o1J33k6M8j14R6M3k1l3k6J0J8n2N9NN7j51
$$ plain form
4472 152 -49 10 10 -26 13 13 -57 24 -41 -37 -130 -15 7 -31 109 -41 95 -2 -72 -2 12 99 39 142 -83 8 -67 5
4500 5 -61 38 87 -8 -55 7 -38 16 68 -30 -139 -24 25 -36 99 95 -40 48 -33 -3 39 113 -17 -72 -18 43 57 26 81
4529 81 135 68 23 80 26 25 82 -42 29 95 -126 36 49 -38 -31 -13 0 44 1 -100 -55 -67 66 -133 -1 -48 -46 -92
4557 -92 -101 -22 -99 76 -16 -10 53 16 14 48 -41 54 -25 69 -14 -13 -50 -42 6 104 13 -24 75 -12 -14 -53 63 2 -70 -60 -63 96
4589 96 23 -1 27 3 53 -81 -42 -124 133 19 -17 -59 9 -18 41 67 84 11 93 -2 13 -32 17 144 -36 70 -34
4616 -34 -29 124 97 13 33 -14 121 75 -48 -91 67 15 -18 4 38 4 -58 -34 -77 172 75 -69 97 -28 10 -16 45
4643 45 0 -55 43 17 12 11 21 -34 99 8 41 -65 12 15 2 37 68 -1 15 0 13 13 77 92 34 28 38 100 122 -36 -2
4674 -2 -21 44 -43 45 -93 -12 38 -32 5 -43 16 -31 -45 -106 27 1 49 -65 31 74 53 20 -6 4 22 -30 29 34 91 -60
4704f0R1l4Lk5p0K07j26O5o2Q6j25K4kN3O7oj25Q0k0Qo1m6m7J72j21M4N9j0n3
4733c4N9N2j06M3J08n4l0L8P6j54Nj01J44j21J22k5rP2o0l0j10K46Kj72R3l9k8
4760a3O8j41J7J25k4o1L2P8r5l3p9R4L7LJ05j30m6P6R4j86R6q0O6qjpQ5j65L0
4789f3R2%Q7n0o5l9J34r1k9J11j31R8m5P2j62L3K2rR2j23J88j00k5r5J54p6j5
4816c5J79j70M6k3NQ7j43J51n1n7M3m8j6m7J55j50R2K0j65J96j44Q2j3L4k6j2
4842a0K7Rj67J05kM5%p0p3K63j37q0K2k4R4L2P9j33p0J04k7K3j8P1J0m2j69L0
4870a08J10Qr1J7Q3J5k5j7Q7m1mJ30l30K66j19j04m4o4Qq4M32j69l28K87L4n46
4896e97P75L4n15J94L89l50L77k83J13k22j31J94J72k05J06k8KN5o5l2j7N7R5
$$ plain form
4704 -60 31 -3 0 -25 -95 112 -14 51 -11 75 -50 -26 -28 25 92 86 -39 41 21 29 -32 -78 -125 47 -74 -30 29 19 -34
4733 -34 25 77 -29 14 122 68 38 76 152 -2 3 -98 46 -75 47 22 13 85 25 -5 -115 131 133 -39 54 15 -13
4760 -13 55 -86 -69 56 32 -29 3 81 -14 -47 -126 -32 5 8 113 -17 -63 13 107 -79 17 -63 3 -5 -6 -13 72 -93 -63
4789 -63 29 29 116 66 1 -38 96 5 -24 87 -44 54 9 81 -81 -48 -26 -35 57 -66 122 22 -3 -98 56 -20 -35
4816 -35 144 -26 20 -3 2 89 -54 97 46 -11 32 -16 -32 -79 76 -74 18 38 -127 69 -75 7 -6 28 2 -10
4842 -10 17 26 -141 -36 -38 7 7 -63 -136 127 -10 -90 -68 -92 2 34 113 -20 -90 14 -13 10 -8 63 73 31 -138 -108
4870 -108 2 10 -81 -64 19 34 9 -8 79 38 34 164 -166 100 -19 -123 -167 -231 -223 -307 125 -44 -372 -85 -51 -597
4896 -597 178 212 -303 -109 280 -70 307 24 137 -85 -216 -22 150 -55 51 23 25 80 15 -17 -34 23 118
4919A18j4q6o7J3R2r4J6K8rP4j9qn5L2k5Q7p7j7J18j34M4ln5P2j65J59o7J10j76
4948a08N2K2J64j60R8Nk1M4k3j15KL3p7P2L4l8M0m5JO0j91K06j04j3j0J4R7%l5
4977Dl5O7p9J6J26k35J71M1n1o3P2n6K1Q5p8k6j27J79m9J22j93N4o3O3l1J07j11
5004f9nK0P6lr8L4O6p8N5m1L6O0m0N4j32Q4m0l6N9R5j09M8k3N5k32J74M0Lj22
5033f9L4Q2K7n4K3O4j48J0j1L2J23j24K8j02J67r4o5P5p0L5N4p9k6J28q9Q6l1
5060Fk3K2k1Q2p2k4M6p9M7j8M3J11q5j0k7k3N4m2L1R7p3r4J5J48j47j00J53P7
5088I4k27J17M9j66Q6l1m3K46j85R1o8N1k3RNj7l7O8n4om3J14l5JJ21k27J80j28
5116e8J31j07n9J16j09R7j7K5p4QJ26j78Q2j2K2N7k1kj22J09p5P8p6K5M5M9j08
$$ plain form
4919 118 104 18 -49 -36 56 -38 -22 6 -3 71 52 44 -11 21 -4 83 6 -11 107 -27 17 14 -41 31 -134 25 -42 68 -108
4948 -108 -56 -34 130 -30 68 73 52 96 73 -42 -40 -7 -84 -12 22 -16 24 -21 -20 40 -151 55 -49 -62 -72 -58 39 39 4
4977 4 -31 36 -43 -27 99 -136 35 76 25 -38 34 -22 -1 84 6 -20 -147 32 -17 105 -88 -34 -97 -34 -65 42 -69
5004 -69 -74 -54 22 19 -79 -45 21 -57 -2 -43 -7 53 13 67 -65 19 -21 -57 2 97 -12 36 13 68 -164 10 50 53 -69
5033 -69 -35 47 74 20 43 107 -41 -31 -42 -10 113 -11 17 -85 82 -12 -77 -2 -72 -37 17 -62 -88 40 -49 37 6
5060 6 -17 5 -16 66 -6 -30 16 -63 -16 -34 9 120 35 25 -2 -25 29 -13 18 115 42 -52 -37 111 -36 -136 17 94
5088 94 -133 -16 33 -133 -47 -78 -121 125 -60 31 -37 14 -9 0 5 -12 -49 19 -35 -41 -84 30 -5 -4 117 -110 70 -58
5116 -58 73 -34 -93 23 -86 11 -6 19 -55 -47 79 -99 -17 -29 -7 50 29 27 -95 14 -61 17 -59 -34 11 60 -48
5143d8P6k0J14j17K9j07R1N5r5L5l2J31j09k4O7l3kN7j8j25L6L4p4P6l5k3J5L6
5171a0k8N2k6N4r0L9k5K08k93J47r6j9P6l6N5M7l9r3K10r9kq8O8L4q1J1rJ40j38
5200c1K0r8J19l2L3J0q4P6k8j6R6n9k2K1n9L5lJ48p1j8lp9Q1J1o6P2q3n2K17j13
5230B2o2L3l4Ol4J03j5k9k7O3lM2o5K7j7J9n0oL0O3j40P1j19J92j51P9k7N9R3
5259A23k04o6J18j2pn2J20r7M5P6k1j19J39roj2p3J91k53P2O1k0K7r8K04o2ll4
5287B8K7m9m6M6j87J62Q6j32l8K01j01m4L3j23Q2M4N9n6n6M5M1jj05P3L6j2j07
5314i4J71J9J0r4M7p1L3j9J05r3m8L8J09l5L4l1N4p0o8LJ1J03j75J3P3p8M8J02
5342I7j09m6PJ66q4p2j2mJ40j18K3l3J78q4L0k5n3J4L9N7Qr8oK4n0q7P9n5k4J10
$$ plain form
5143 -48 28 8 122 5 34 -73 18 73 -22 13 -19 112 3 -21 46 13 11 68 50 -75 -39 -5 -79 -3 -38 -61 -46 -10
5171 -10 -38 14 -12 42 -48 -9 -34 174 -119 28 -68 -87 -11 -47 8 55 16 -77 133 34 32 -56 12 46 -35 -24 -33 107 -31
5200 -31 -11 -109 10 -22 11 21 -63 13 -15 -31 65 6 -16 5 -54 -19 -22 126 55 37 34 -45 36 47 -19 53 -30 -82 135 22
5230 22 -40 -7 -41 -35 -69 34 19 -10 -37 26 23 65 0 27 10 29 -21 -27 3 66 -74 -3 -122 70 -81 -2 -29 30 123
5259 123 -81 -147 -29 -41 -48 -100 20 -77 -32 44 23 -96 43 34 28 16 -57 134 -119 -47 14 -6 21 -77 127 65 62 28
5287 28 55 6 -40 6 -181 -19 67 -65 -103 98 -3 -47 -14 -137 -55 -11 48 -8 -64 -19 22 21 -84 -11 25 13 -94
5314 -94 77 96 106 12 59 -12 21 2 107 14 -34 4 113 78 112 81 135 65 -3 0 11 114 -61 -48 25 -53 -5 97
5342 97 -12 -58 -51 115 31 -41 -53 -57 83 -35 -12 -45 133 49 79 54 1 15 54 111 119 21 15 39 -11 -98 -19 -74 -98 12
5372A2j07J51j13L9O2n2K1j95K18j19J71j09k3j9M2j73J66PM3j5m1N0QQ4l4j66
5398i2P0Q8p1O5p0N8m8P1n7j2M4p0N2mpM9J3q4M3J3K3q6j46J10J24j89J74q6Q
5427a7R5p1j8k8P9j35M0kQ1l4p5J32p7N6O9j01j24J54rk0K2r1J24j3q7J18l2k1
5455A5j57K05k12Q3Q1k6R5j41L3LK2Mo4R9M0j67J38M2l3Rp6L9J7O3j79J8Q2l4
5483al6N9j2L2k4q1L7N5K7j09J19j54L0J09n9l3OJ03j14K2J9n3l2K32k23P2N7
5510D8K4q1o3J37l25N49o5m72M43j13n0k07M93m13J84p80J585p98k26K9K71J79
5532C49r23J046o57L69k30j10L8L79r13M83J247j388K15M3R1m5j40P5j08N9K1
5553i9l9J16O0j47P3R1l0N4p6J05rj96J19p2N2L6l6kn0N9k1m7JL3m4J57pm6k7
$$ plain form
5372 12 -95 56 -57 -18 44 -8 13 -182 36 -83 88 -21 -44 -63 -21 -194 -28 -21 22 7 -34 16 24 108 74 -92
5398 -92 -22 66 -5 60 -10 48 0 71 14 2 46 -24 28 24 17 66 79 -5 38 51 74 -12 -158 -48 76 -113 61 -25 -17
5427 -17 78 7 -11 -39 40 -95 -55 -57 24 -10 -85 47 -30 26 95 -6 -130 24 15 -5 17 -74 50 37 -50 68 36 15
5455 15 -142 63 -149 -66 15 -11 84 -57 -24 -21 1 5 -59 40 80 -87 51 93 60 69 -7 32 49 112 -67 -49 33 -1
5483 -1 -37 22 10 42 18 -63 -26 29 56 -53 66 -88 -58 51 -8 -41 -35 68 -46 -24 -5 -58 -90 142 -81 -9 48
5510 48 72 -9 -72 65 -260 289 224 -248 195 82 32 -175 318 -95 89 -691 894 96 -130 -101 170 349
5532 349 -574 472 -185 184 -46 -156 -118 261 -652 -169 1078 -310 -95 -52 39 -6 -146 -71 -179 -120 -99
5553 -99 -138 -22 38 -109 -36 55 25 79 3 108 99 -97 22 -50 2 38 2 0 -50 9 -12 -59 -58 -25 -69 88 81 35 8
5582Hl3j5K6L7N8j29R2K3j29J06m1k0Q2l6q0Q7m2M4p4N7j7J17p2j4Jm1m4N3K9
5611C3J0L6Kk18K33j11O1j41J16oj49K84k08k7M8J31q5P3j29p3J54r9JQ3n0K4
5637gJ22j87mO9nM8q5nn5J03J7j62J67O7q5J37k51N5J22k1j00M0k3Q4o7O1j2M
5665B7j42J15p2N8K8K8m0j45J59m4l0O4M5m7n8J26n6m7j9pN6Q1m7n3K4l3J5%l
5694a7Q6k9r5N6J5j1l8K9K4n4N2J9q3RJ5O2j4k5O4l7r9K29j71K1J0Kn8N1J6j45
5724a16J14P0p7J1n5J41j21k1L4J16n5Jn5J9Q6m1k4k5KJM3n8L7j62pR1N3j7M1
5753B6r7J03p0J15n7M7j03J7n5R9p9M5l4M4Q5n8q9Q8K5lq1Oo0K7J01J18q8j09
5781c7R1j14N1O0j34J05o8O4l1k1J12p1M5o7JK2r3o9J62m7K9J8J0L2n5Q5j26J3
$$ plain form
5582 8 -25 -40 -14 23 81 -48 44 67 -62 44 3 -17 65 29 -51 36 -6 38 -36 21 4 121 49 35 36 -5 -49 4 33
5611 33 43 79 81 -137 96 -15 46 -95 21 15 -134 150 -58 -85 -37 94 9 82 -47 -120 34 -65 -64 19 -31 -7
5637 -7 115 -72 -76 -7 -12 36 -49 -54 -109 -6 11 -151 16 83 -2 135 -116 -61 61 40 -60 -20 -43 41 -26 35 23 27
5665 27 -115 0 -72 -14 14 42 2 -143 16 -28 -58 6 51 4 -54 72 16 -31 -50 -57 -1 80 33 -20 4 -29 -14 -14 -17
5694 -17 69 40 -55 1 16 5 -33 -4 20 -34 18 37 -46 -37 -22 40 26 1 65 28 -71 158 -13 8 18 20 -38 13 29 -116
5724 -116 -2 68 -9 2 -53 88 -33 -54 -20 96 41 42 -13 6 92 51 27 2 4 5 48 -10 27 -135 -142 -51 2 -15 26
5753 26 -71 32 -38 77 20 67 -36 -19 -74 25 -54 -9 -43 1 86 28 -61 27 52 49 -32 -26 -86 -59 42 160 72 -37
5781 -37 54 -60 -9 51 -83 22 -46 18 -13 -34 78 7 52 -15 -14 8 -85 -154 8 -39 -10 8 18 50 -5 80 -46 -33
5809c3Q2J0m8r7m3J61j9j2L2n3l7P7O3j63J22lQ4j98J26q1K9J47j67j7k9Q6n3
5836c4L4J4O8l8p1l2k4J02p1K2J5%j3O1j06J46o4J1N2j19L6k6J26n5p7k4K43k51
5864g5j05K61l5L4M6j36M1L4o8J7l6O6p7R9j8j02nm9Q3m5J7M3M3Lk9k7J24j59
5892e5p2J15m0J1J36n7o4m4O0K5l3J31j78R1J0k7Oq0R4M2j1k9L1k9J21k05R6q2
5920c7J70j60ON0K4j03K5N2P2l07K05j81Q7K90J9j52j27L69o5k66R4r4k16L22
5944G7k03K61j62Jj26J62m6J50j80J65n7K2m4Qj31K31j22K8P8j20oM5j6M8n7l2
5970b6P6n6nJ9l4PP3j16rJ04k9j3J6P6m7p3NK8K8M4K2j00J36j10r0N3j7m8J10
5999B4m9%J25j34J34j55NK5L3L9m3oO7K2m2j31O0N7Pn5K9Mj02K5M3l7P8Ro2P7
$$ plain form
5809 -33 49 59 11 -86 -129 32 13 1 33 -20 -57 20 83 -80 42 39 123 -75 51 -30 -1 146 -21 -38 -67 19 -34
5836 -34 0 14 82 44 -27 -59 -83 19 -52 -30 -15 -15 -28 33 -73 73 9 20 72 -47 -11 -37 89 34 -43 -67 176 -75
5864 -75 -180 81 46 80 126 -10 31 65 -3 14 -22 44 -33 66 48 -54 -59 -108 -25 -70 -53 -10 33 36 7 -20 104 -55
5892 -55 -127 -12 -52 -41 95 38 -26 -70 -10 15 -18 113 -65 26 36 9 15 -65 29 71 60 31 62 33 154 -51 45 -37
5920 -37 133 -27 -21 29 53 -50 -25 27 99 -208 -3 -184 -97 193 212 60 -67 302 237 -29 65 -29 -245 77
5944 77 -126 135 -27 -26 -152 10 -36 114 -66 99 42 64 20 28 -103 128 6 34 112 -8 -14 31 15 63 6 -26
5970 -26 50 -6 -11 8 -26 -19 54 -62 -71 33 4 -9 7 83 36 -37 -32 -4 24 68 90 -10 126 16 -74 -21 -38 -86 24
5999 24 -25 -25 100 -34 100 -55 -50 -25 8 47 4 -2 65 87 45 -86 -26 31 38 -17 12 16 -86 -61 -18 -55 23 32 -30 47
6029D7P5j31J38j86J08j03P4l5oO6q4k1K23q3j32M5L5j29J91j61Q7j38L5J91j71
6054f5mJ15m1L8j02R1k5lP8O9j40l6lJ3%j3R0l6o8P6J47k11P5r1J14K6p0p8J13
6083E9k4n5P7m3l3L3k9K2p4J60j14nN7jo3Pj1J3kL3K2K3j64J11N8n7n8J49j11
6112b0j28K27j24K4RJ0O5n5M0J4J5ll4L3J00j53K8j07J03o6J6M8o2J08p0k4rR5
6140H0j94J41k7O8j34J42q9O6r3k0J61j41nO3K8o7Q6k3M6o2oj3N4j8j40J47q2
6167c2L1m7Q1L4j42J44q7J9N3o9N8J5j0O4j20q2J79n5J9o4o7K34l8j65O3p8J05
6194D3j5j1q8O8Jn9J63j84J52j44L7K0K3pj36K70p5m0PN5j79RJ51r3K8L2l8l8
6222d8j25R9J83j50J6Q7p5J01m2j13R0l6N4p9nJ11j35J45p3o2N9M3k2m5L4MOJ02
$$ plain form
6029 47 122 -9 129 -57 51 -52 22 -13 -19 47 -37 -58 165 82 -50 -5 30 -99 92 -69 18 -120 -85 106 -65
6054 -65 -69 46 5 43 -59 32 7 4 82 151 11 -25 -28 -15 -15 -28 62 26 -42 34 181 -30 45 -46 68 94 24 -54 59
6083 59 35 -20 57 14 -19 14 -15 7 -67 93 -21 -26 31 30 -33 -26 -37 -24 -26 7 29 52 -112 -1 57 0 -58 91 -20
6112 -20 -148 79 -45 -21 -12 -2 63 8 48 62 77 74 40 73 173 20 48 -59 44 -22 -6 42 -20 88 18 -6 -15 80
6140 80 -114 27 0 68 -66 76 -13 53 -40 -60 101 -40 -45 18 46 -21 65 42 88 26 20 7 61 43 -97 50 -32
6167 -32 -1 -48 33 67 -75 69 -18 1 54 -15 43 58 48 112 -8 -90 89 34 53 -11 -78 156 118 -47 16 -62 43
6194 43 28 17 -71 -3 -2 -61 102 -82 70 -74 -37 -17 6 -1 -137 133 58 18 25 80 -99 -90 61 -32 -4 28 -10 -48
6222 -48 -173 -74 109 -41 -25 62 -13 88 46 -67 23 -13 41 -38 -43 68 -67 78 5 -57 2 45 23 -22 12 16 22 124
6250A24j14P9r9Kj34Q2K02j80J35o0j39J21j4NJ8n8Q9j24Q5j07J39o5L5M6R6k00
6276c6rK5J55o1kn6o5J05r9RN0n2M4%Qm3R2j34J10ljj45J01M0j0N2m1j07P9on3
6307e3R1J2M7j65KM2M2J4j11J29J4k13J68o7J16j48R8r5J28n8K5J2j03M1J9J59
6333A46j35m4l7P4n1N1j5J4K4l0k8N8m8O8r1n5J69l8K4n0k9l3%O7j52K05j1j11
6361e8L1O0Qj76J91L4j15L8k3P1j16N2J5J4r2O0R8j13J35o3J2j8j69k9J98j23
6387g8K06j18K1k2J6p3l0Q3j26Q1K5OKQ3mp2J7L0r8M4n7J18j19J11j0K2n8p1M2
6416b9J15o9Rl1M8k6N6j31M3K4l3Q4j18J03m9OQ1o3j9J0M1j01P9kl1J4JO2j86
6445a12J54k1j39J27j19J26r6J00j3l9N1L5j07J03m8k0J47j51N4nj9k2nJ8j12
$$ plain form
6250 124 10 89 -10 -8 -142 -60 142 -38 97 37 -102 19 5 10 28 -30 59 -65 20 -87 52 -13 22 68 164 -36
6276 -36 -45 -20 135 74 72 16 -49 56 -43 -34 16 -36 8 8 16 -27 65 -69 41 38 37 -108 -7 33 23 75 34 -73 6 0 -53
6307 -53 38 50 97 -68 -66 -24 18 32 -79 50 64 -149 19 -48 68 -80 18 -77 51 -7 18 30 -73 -32 -13 146
6333 146 11 -33 -70 4 -47 4 -11 3 27 -3 -31 27 -21 47 -44 -99 70 32 56 6 -23 -56 -56 11 -141 64 53 -58
6361 -58 -27 33 41 -135 56 90 -25 13 -10 61 -55 -3 12 26 -66 -6 92 -21 114 51 63 45 -124 -153 45 -78
6387 -78 128 10 31 9 25 -48 -78 5 -121 -40 -15 -9 -7 76 72 0 17 47 -51 -7 -64 54 -65 46 36 58 0 -71 -29
6416 -29 86 17 26 -5 43 17 73 -58 -15 9 -24 60 -58 45 -4 2 83 20 1 11 52 -49 30 28 -3 11 12 74 -112
6445 -112 42 21 -118 9 -110 16 -80 20 7 -32 19 54 -53 50 2 -18 129 -22 32 27 8 -14 -19 -1 -113
6470a13J33q5R3l7J30J3j90J84j54l1KM2J3Kj3m5O6K0JL7n8J5n0R3j12j7p7K02
6498F4k3q6m0Q1N2L1l8p4M9o8Q8n7J07j38P2q6J30j27P7mmo2j7M8M2m5J17M2j15
6527A6K3r6Q6n7R1m1N0j38l0m2J71k1l0P4n4N9l3J4M0o5MOrm5N1O6j95J51j09
6556f3K3K3J1o2O6l6O3M7J7j40K5J37j56qM4M9o1L0q4J35n1j2Q3q5M9j64J94k9
6584D5pr4m1J10K7o5j32K22L0r0KJ2L0j02R8Pj73J1J62N9k30M9J53m9j39m69O35
6611F1j19J15j48J97o4n1L7l8r8M6P2O9j52N9O8j7l4L8q4K3O0Rl7PN1O4k53J07
6639a2K3m1O6p5M1Ok3P3n7l7j7j8M7K2J4m5J04m3o2NJ56j39K3o8J0MJ52L6j06
6668C9k8o0Q8l2l1J14o5r4K6n6P2L3n0J02k8l5Q8j32J30Qo3m7L8L1Mr5o9J91L2
$$ plain form
6470 -113 20 -65 28 -9 121 134 -56 128 -26 -57 -55 -13 0 2 -11 -56 10 30 31 68 10 25 -25 68 -44 -61 -138 64
6498 64 41 -45 -85 -4 48 79 41 -33 16 -52 36 -21 86 -52 20 -66 64 -63 14 10 6 -56 -73 -25 17 -28 89 131 16
6527 16 39 -57 29 -28 63 22 72 -66 -96 -138 33 12 -18 56 2 61 28 42 82 17 21 27 18 -27 24 90 -105 46 -63
6556 -63 -40 -17 -6 -68 -2 -38 25 72 89 -51 -26 111 -45 -53 -9 40 -21 9 -75 60 9 -3 80 -5 44 -120 74 45
6584 45 38 -56 -97 13 40 -25 -157 65 95 5 7 19 49 -53 45 52 -121 -110 52 111 -119 -70 83 34 -105 -574 61
6611 61 -58 57 -91 106 42 -9 28 -10 -108 -62 10 79 -73 -14 54 37 3 41 -43 -20 40 49 12 19 70 134 -119 -12
6639 -12 11 -30 36 -39 2 8 -15 58 1 -36 -53 -71 -24 -2 12 -33 71 28 -34 -29 127 -12 11 -57 -47 -43 109 145 39
6668 39 11 -49 39 7 -24 90 25 -69 -43 -99 -27 6 -44 58 30 -5 83 -49 81 89 26 -21 17 48 52 -43 -112 79 111
6697A11j47KO9j1p7L6OR7k0p4J8J05r5mNj23J98j38q4P0OP7k2o2J47j23N8Ol1
6726@L9j1Lj05R6r4M6R7p1mK1j2p3R0Om0P7j5k06J75O1m0r5N5J6jJ2m7K5Jn8n3
6758a05K27p4j42J65m9p0R4j94K18j13J8M9l7pj5n9L8P1j14J23k2k4J1r9J8Q7
6784eK4Q1j12qmM6J5l%j03l5J11lQ8n4j9n4M9m0Q5N7k21K9R7M2j58R5j7J5K2j96
6815a76K72j09Pqn4J22rK1Rj41J22r6j2j6q2Q2J1O2q0O3rk7Q1j3J1pM6j82O4M4
6845dQl9K3J41r3j09J11r6Q0N1%j16L3L7Lq8Q0o3o7J72q8j7N2N7p6R2l8j4k2K6
6875C6k7n4l6J43j33M8J02m6k2l5R4q9j06J57rqn2KJ1k0J58j61P8j29J37o5j8
6902d4j8j5J54p1j29K21J8j18Qm1Q9m6j9q8K6P3Qj31J83l0r7l1J31O8O3j17j53
$$ plain form
6697 111 -36 -34 35 24 -53 -17 -11 86 66 -8 10 115 20 16 21 -102 96 -42 -126 -56 -50 27 5 -57 90 -33 25 31 0
6726 0 39 28 31 -74 22 -72 -26 71 0 -4 17 5 -68 22 28 -12 65 50 -156 19 80 40 -55 0 16 15 27 -20 5 6 -52 -105
6758 -105 122 48 -94 71 22 -48 46 -148 70 -43 -25 24 -13 -20 -35 -94 -56 15 -99 24 2 -22 -11 -110 -92 -5
6784 -5 19 100 -12 -20 -24 22 37 34 34 -69 -104 7 4 92 38 19 -35 14 -26 59 116 -105 -76 21 63 -95 0 -17 -2 20 -176
6815 -176 96 -13 -6 -14 -68 54 45 66 75 -66 56 -40 -52 -68 -150 -68 -57 5 -75 -12 -21 -48 33 20 31 24 70 -112 -48 -4
6845 -4 4 -35 -12 129 36 -73 38 -58 22 73 73 -43 -10 27 30 -58 22 -41 -108 64 -24 -41 11 68 -8 84 46 32 10 36
6875 36 9 -45 -81 62 -71 -23 79 33 11 -24 70 -19 -125 32 23 15 -37 -35 -24 -44 114 -47 31 -98 39 -26 -44
6902 -44 -62 -77 77 6 -123 98 116 -2 6 -35 54 8 -11 -99 -73 0 8 -123 60 30 -67 -98 33 101 164 47 -106
6929a06J03r0Q2M1p0P1j21N6J73k64J68L7P2j33o1R3O1k4n2Q0j74M3N4J2j53P0
6955c2Q1O1j46NL8j08Ro2J37p7J59P8j48Jo6J05l2j26O2Q5J0j57L8JJ58l2n1L1
6983B2om6O4j5j8q8J19l0M5K2p2K9J0n6n8Q5Q1L7q4r7Nq0J02J05l4J6Q8j95K6
7012b3J0J21j74J00j07J39k2p2q4N8L7K1j43K15q7O8j32qJ89p7lMM7Oj51O5Q0
7039G7r9PK7Mj8P8j41O8o2P3l6p3%J50o4K0o9MJ6P3K2N1j15l4j1k7N0KN0j2m6
7070c5N7nM5k9m4m2OO9J8l0o8Q1N6l9LJ17r1k9j7j67J28L2j34J69n5n3o8M7Q1
7099CKm2J4no7J14J3K8j74J56r9J40k9J53j97k2J9qRj1j26J05n6J50r9pJ03m8
$$ plain form
6929 -106 -3 -93 -11 30 -40 31 -90 -34 139 -125 43 80 152 19 -42 51 112 88 36 116 -58 -15 39 51 -102 -32
6955 -32 49 110 -36 -31 7 -101 -92 -154 -17 -94 65 143 -5 -4 -70 35 3 -123 -61 24 34 -123 -85 -84 74 42 -9 22
6983 22 16 -30 34 19 1 -87 32 2 47 69 -3 26 36 -20 -78 7 88 125 41 -56 -51 -131 -29 76 42 58 146 -49 -23
7012 -23 -13 108 -66 34 -73 66 44 -28 -112 -54 -17 4 -139 76 -11 57 -75 -83 106 29 26 30 77 83 -68 -3 77
7039 77 -22 -15 12 16 -2 76 -65 3 -59 14 -22 -95 -95 55 -9 11 -58 -54 -38 35 57 108 -7 -41 -52 -79 -29 -27 23 11 -35
7070 -35 22 17 62 33 -11 -53 -47 22 40 10 -58 23 79 40 43 160 69 40 23 -144 -16 16 -118 51 -4 -57 -125 -78 3
7099 3 5 -37 -23 -28 -95 19 32 60 -114 42 -57 83 54 207 10 -12 7 -1 8 -3 -129 -24 -80 70 -29 -36 67 19
$$ [...]
8191a5
##END NTUPLES=NMR FID
##END=
