##TITLE=1H_DE-80H_X3
 200.13MHz, d2o
 8 sc
 
 19ns.26.2.2025
##JCAMPDX= 6.0         $$ Bruker NMR JCAMP-DX V2.0
##DATA TYPE= NMR FID
##DATA CLASS= NTUPLES
##ORIGIN= UXNMR, Bruker Analytische Messtechnik GmbH
##OWNER= pz
$$ XWIN-NMR		Version 3.5
$$ Thu Jul 23 16:24:11 2026 Russian Standard Time (UT+4h)  Yarkov@DPX200
##.OBSERVE FREQUENCY= 200.1313
##.OBSERVE NUCLEUS= ^1H
##.DELAY= (6, 6)
##.ACQUISITION MODE= SIMULTANEOUS
##.ACQUISITION SCHEME= undefined
##.AVERAGES= 8
##.DIGITISER RES= 18
##SPECTROMETER/DATA SYSTEM= spect
##.PULSE SEQUENCE= zg30
##.SOLVENT NAME= CDCl3
##.SHIFT REFERENCE= (INTERNAL, CDCl3, 0, 14.3821)
##AUDIT TRAIL= $$ (NUMBER, WHEN, WHO, WHERE, WHAT)
$$ ##TITLE= Audit trail, XWIN-NMR		Version 3.5
$$ ##JCAMPDX= 5.01
$$ ##ORIGIN= Bruker BioSpin GmbH
$$ ##OWNER= Yarkov
$$ C:/Bruker/XWIN-NMR/data/yarkov2/nmr/H-C/1/audita.txt
$$ ##AUDIT TRAIL=  $$ (NUMBER, WHEN, WHO, WHERE, WHAT)
(   1,<2026-07-23 16:23:29.81 +0400>,<Yarkov>,<DPX200>,
      <created by zg, POWCHK disabled, PULCHK disabled
       configuration hash MD5:
       00 E9 B6 7A A2 85 ED C7 34 08 36 98 17 FE 4E 26
       data hash MD5: 16K
       F2 50 39 37 92 E1 52 F1 64 BD 06 B0 2A B1 EA 15>)
$$ ##END=
$$ 
$$ hash MD5
$$ 5A 45 A4 98 0F 26 F1 55 8D 1A 98 10 C7 A9 59 55
##$RELAX= 
##$RELAX= 
##$RELAX= 
##$RELAX= 
##$RELAX= 
##$RELAX= 
$$ Bruker specific parameters
$$ --------------------------
##$DU= <C:/Bruker/XWIN-NMR>
##$EXPNO= 1
##$NAME= <H-C>
##$PROCNO= 1
##$TYPE= <nmr>
##$USER= <yarkov2>
##$AMP= (0..31)
100 100 100 100 100 100 100 100 100 100 100 100 100 100 100 100 100 100 
100 100 100 100 100 100 100 100 100 100 100 100 100 100 
##$AQSEQ= 0
##$AQ_mod= 1
##$AUNM= <au_zg>
##$AUTOPOS= <>
##$BF1= 200.13
##$BF2= 200.13
##$BF3= 200.13
##$BF4= 200.13
##$BF5= 200.13
##$BF6= 200.13
##$BF7= 200.13
##$BF8= 200.13
##$BYTORDA= 1
##$CFDGTYP= 0
##$CFRGTYP= 5
##$CHEMSTR= <none>
##$CNST= (0..31)
1 1 145 1 1 1 1 1 1 1 1 1 1 1 1 1 1 1 1 1 1 1 1 1 1 1 1 1 1 1 1 1 
##$CPDPRG= <>
##$CPDPRG1= <>
##$CPDPRG2= <>
##$CPDPRG3= <>
##$CPDPRG4= <mlev>
##$CPDPRG5= <mlev>
##$CPDPRG6= <mlev>
##$CPDPRG7= <mlev>
##$CPDPRG8= <mlev>
##$CPDPRGB= <>
##$CPDPRGT= <>
##$D= (0..31)
0 0.7 0 0 0 0 0 0 0 0 0 0.03 0 0 0 0 0 0 0 0 0 0 0 0 0 0 0 0 0 0 0 0 
##$DATE= 1784809409
##$DBL= (0..7)
120 120 120 120 120 120 120 120 
##$DBP= (0..7)
150 150 150 150 150 150 150 150 
##$DBP07= 0
##$DBPNAM0= <>
##$DBPNAM1= <>
##$DBPNAM2= <>
##$DBPNAM3= <>
##$DBPNAM4= <>
##$DBPNAM5= <>
##$DBPNAM6= <>
##$DBPNAM7= <>
##$DBPOAL= (0..7)
0.5 0.5 0.5 0.5 0.5 0.5 0.5 0.5 
##$DBPOFFS= (0..7)
0 0 0 0 0 0 0 0 
##$DE= 6
##$DECBNUC= <off>
##$DECIM= 32
##$DECNUC= <off>
##$DECSTAT= 4
##$DIGMOD= 1
##$DIGTYP= 9
##$DL= (0..7)
0 120 120 120 120 120 120 120 
##$DP= (0..7)
150 150 150 150 150 150 150 150 
##$DP07= 0
##$DPNAME0= <>
##$DPNAME1= <>
##$DPNAME2= <>
##$DPNAME3= <>
##$DPNAME4= <>
##$DPNAME5= <>
##$DPNAME6= <>
##$DPNAME7= <>
##$DPOAL= (0..7)
0.5 0.5 0.5 0.5 0.5 0.5 0.5 0.5 
##$DPOFFS= (0..7)
0 0 0 0 0 0 0 0 
##$DQDMODE= 0
##$DR= 18
##$DS= 0
$$ [...]
##$SUBNAM2= <"">
##$SUBNAM3= <"">
##$SUBNAM4= <"">
##$SUBNAM5= <"">
##$SUBNAM6= <"">
##$SUBNAM7= <"">
##$SUBNAM8= <"">
##$SUBNAM9= <"">
##$SW= 18.0517328524113
##$SWIBOX= (0..15)
0 0 2 0 0 0 0 0 0 0 0 0 0 0 0 0 
##$SW_h= 3612.71676300578
##$TD= 16384
##$TD0= 1
##$TE= 0
##$TE2= 300
##$TE3= 300
##$TEG= 300
##$TL= (0..7)
0 120 120 120 120 120 120 120 
##$TP= (0..7)
150 150 150 150 150 150 150 150 
##$TP07= 0
##$TPNAME0= <>
##$TPNAME1= <>
##$TPNAME2= <>
##$TPNAME3= <>
##$TPNAME4= <>
##$TPNAME5= <>
##$TPNAME6= <>
##$TPNAME7= <>
##$TPOAL= (0..7)
0.5 0.5 0.5 0.5 0.5 0.5 0.5 0.5 
##$TPOFFS= (0..7)
0 0 0 0 0 0 0 0 
##$TUNHIN= 0
##$TUNHOUT= 0
##$TUNXOUT= 0
##$USERA1= <user>
##$USERA2= <user>
##$USERA3= <user>
##$USERA4= <user>
##$USERA5= <user>
##$V9= 5
##$VALIST= <valist>
##$VCLIST= <CCCCCCCCCCCCCCC>
##$VD= 0
##$VDLIST= <DDDDDDDDDDDDDDD>
##$VPLIST= <PPPPPPPPPPPPPPP>
##$VTLIST= <TTTTTTTTTTTTTTT>
##$WBST= 1024
##$WBSW= 4
##$XGAIN= (0..3)
0 0 0 0 
##$XL= 0
##$YL= 0
##$YMAX_a= 81830
##$YMIN_a= -98347
##$ZGOPTNS= <>
##$ZL1= 120
##$ZL2= 120
##$ZL3= 120
##$ZL4= 120
##$ABSF1= 10
##$ABSF2= 0
##$ABSG= 5
##$ABSL= 3
##$ALPHA= 0
##$AQORDER= 0
##$ASSFAC= 0
##$ASSFACI= 0
##$ASSFACX= 0
##$ASSWID= 0
##$AUNMP= <proc_1d>
##$AZFE= 0.1
##$AZFW= 0.1
##$BCFW= 1
##$BC_mod= 2
##$BYTORDP= 1
##$COROFFS= 0
##$CY= 83.5205535888672
##$DATMOD= 1
##$DC= 2
##$DFILT= <>
##$DTYPP= 0
##$F1P= 10.8118882576601
##$F2P= -7.23987719738617
##$FCOR= 0.5
##$FTSIZE= 0
##$FT_mod= 4
##$GAMMA= 1
##$GB= 0.15
##$INTBC= 1
##$INTSCL= 1
##$ISEN= 128
##$LB= 0.25
##$LEV0= 0
##$LPBIN= 0
##$MAXI= 10000
##$MC2= 0
##$MEAN= 0
##$ME_mod= 0
##$MI= 1.114404
##$NCOEF= 0
##$NC_proc= 0
##$NLEV= 6
##$NOISF1= 3.799351
##$NOISF2= 2.8
##$NSP= 1
##$NTH_PI= 0
##$NZP= 0
##$OFFSET= 14.38212
##$PC= 1
##$PHC0= -7254.183
##$PHC1= 2.82197
##$PH_mod= 1
##$PKNL= yes
##$PPARMOD= 0
##$PSCAL= 0
##$PSIGN= 0
##$REVERSE= no
##$SF= 200.129724274929
##$SI= 16384
##$SIGF1= 3
##$SIGF2= 2
##$SINO= 400
##$SIOLD= 16384
##$SREGLST= <1H.CDCl3>
##$SSB= 0
##$STSI= 0
##$STSR= 0
##$SW_p= 3205.1282051282
##$SYMM= 0
##$S_DEV= 0
##$TDeff= 0
##$TDoff= 0
##$TI= <>
##$TILT= no
##$TM1= 0
##$TM2= 0
##$TOPLEV= 0
##$USERP1= <user>
##$USERP2= <user>
##$USERP3= <user>
##$USERP4= <user>
##$USERP5= <user>
##$WDW= 1
##$XDIM= 8192
##$YMAX_p= 0
##$YMIN_p= 0
$$ End of Bruker specific parameters
$$ ---------------------------------
##NTUPLES= NMR FID
##VAR_NAME=  TIME,          FID/REAL,        FID/IMAG
##SYMBOL=    X,             R,               I
##VAR_TYPE=  INDEPENDENT,   DEPENDENT,       DEPENDENT
##VAR_FORM=  AFFN,          ASDF,            ASDF
##VAR_DIM=   8192,          8192,            8192
##UNITS=     SECONDS,       ARBITRARY UNITS, ARBITRARY UNITS
##FACTOR=    0.0002768,     1,               1
##FIRST=     0,             0,               0
##LAST=      2.2672688,     0,               0
##MIN=       0,             -98347,          0
##MAX=       2.2672688,     81830,           0
$$ Real data points
##PAGE= N=1
##DATA TABLE= (X++(R..R)), XYDATA
$$ [...]
1037e94R72L49m97k47k09K68o94J98J508j057k326J483K475l23l128o78M116J446
$$ -594 378 727 230 -17 -226 42 -652 -454 1054 -3 -2329 -846 1629 1306 -1822 -2500 1616 3062
1055C062l949j529L409J486k257j823J701J610k385n81K485o05k753Q04K911j60
$$ 3062 -887 -2416 993 2479 222 -1601 100 1710 -675 -1256 1229 624 -2129 -1325 1586 1426
1071A426l597l33M242O10l809m84L020R38j884j551J928J020j942l08J623o25
$$ 1426 -2171 -2504 1738 2348 -1461 -1945 1075 2013 129 -1422 506 1526 -416 -724 899 274
1087B74j384N77J151l12j681M64J847p76j217J067M77l74q0K98K99m21m00J167
$$ 274 -1110 -533 618 306 -1375 -911 936 160 -1057 10 487 113 33 331 630 209 -191 976
1105I76m49j313Q54P07r16q45O08J227j040j764J598J898j679j592J666J634r30
$$ 976 527 -786 68 775 -141 -986 -378 849 -191 -1955 -357 1541 -138 -1730 -64 1570 640
1122F40k021J261K057j437j711J714Q42j612q06J368Q60k079r95K520Q33k511
$$ 640 -1381 -120 1937 500 -1211 503 1345 -267 -1073 295 1155 -924 -1919 601 1434 -1077
1138a077o61K111J011j706j045J970R29j797m35J686N6j382p1J253J1j994K58
$$ -1077 -1738 373 1384 -322 -1367 603 1532 -265 -700 986 1042 -340 -411 842 853 -1141 -883
1155h83J828o26j669P04J316m22j381O13J421p48q57R50P78j032l91R64M66j255
$$ -883 945 319 -1350 -646 670 248 -1133 -520 901 153 -704 246 1024 -8 -399 565 1031 -224
1173b24n13J406K35j702k43J522K21j610k38J589K42j571M6J627k3j437M22J342
$$ -224 -737 669 904 -798 -1041 481 702 -908 -1146 443 685 -886 -840 787 764 -673 -251 1091
1191A091n15j209P37R62q38j276J028J077j231j097J003R45j013q59J085R09j055
$$ 1091 576 -633 104 1066 228 -1048 -20 1057 -174 -1271 -268 677 -336 -1195 -110 799 -256
1208b56p30J403P73j536m45J453N54j467o19J535M23j603k56J283j23j253J60
$$ -256 -986 417 1190 -346 -791 662 1216 -251 -870 665 1088 -515 -771 512 389 -864 -704
1225g04R93J5j197L24J375m98j138O80J083m13q00K75R05n13j091J014N42j069
$$ -704 289 304 -893 -569 806 308 -830 -150 933 520 -280 -5 900 387 -704 310 852 -217
1243b17n69P50N07r43o60J166O73j244j87J043L21p48k79P88M03j022j03J271
$$ -217 -786 -36 471 -472 -1132 34 707 -537 -724 319 640 -108 -387 401 804 -218 -321 950
1261I50l91j143M23O91k41r75P5J111m14j220Q21Q68o19m90M27P94k95r47P80
$$ 950 559 -584 -161 530 289 -686 -611 500 86 -1134 -313 555 -64 -554 -127 667 372 -575 205
1280B05R31j083l74P49J21m75o58N85N11r56l61J038p0q54J92N82L60r15j24J142
$$ 205 1136 53 -321 428 549 74 -584 1 512 -444 -805 233 163 -691 -499 83 443 -472 -596 546
1300E46J01j013L23P22l33m55o8P37j00j173L87P79o06m94L89L62k10n51L97P10
$$ 546 647 -366 -43 679 346 -109 -177 560 460 -713 -326 453 -153 -647 -258 104 -106 -657 -260 450
1320D50n80k79O61J86l70LJ90L07m36m56O33Rq26K45L68j68k98k14O95J78q85
$$ 450 -130 -409 252 438 68 71 261 568 132 -324 309 318 -508 -263 105 -63 -361 -575 120 298 -587
1341e87L17P05l56k32K93K75L5n96K63M96n53l19N81k1n41k90J28P11o25m56P96
$$ -587 -270 435 79 -153 140 415 450 -146 117 613 60 -259 322 301 -240 -530 -402 309 -316 -772 24
1362B4K47l28k73M86K38j75l89L36M94p04m3M93rl81k05J30K36n01j8K48j87o5
$$ 24 271 -57 -330 156 394 219 -170 166 660 -44 -87 406 397 16 -189 -59 177 -324 -342 -94 -281 -346
1384c46K73l3n3J16q5M52L0m93J74K15o7Ql6m8j52j34L27p9m03l8M47j40j52j13
$$ -346 -73 -106 -159 -43 -128 324 354 -139 35 250 183 191 155 107 -45 -179 148 69 -334 -372 75 -65 -217 -330
1408c30L83K70m62r7M42M7j30J33j14J20l26M0J67Qm82p0L65J24k69j74K01L41
$$ -330 53 323 -139 -236 206 253 123 256 142 262 -64 -24 143 151 -331 -401 -36 88 -181 -355 -154 187
1430A87j69k74J33K66l0NN7J7O4k53L9P1p0k44L5K17Q0m30k65M10L07k89j99J60
$$ 187 18 -256 -123 143 113 118 175 192 256 3 42 113 43 -201 -166 51 131 -299 -564 -154 153 -136 -335 -175
1454a75J34L35k63j05K14Q6j37N0R6Mk17k50L68N1n75K5K19K19j36k86K82L12
$$ -175 -41 294 31 -74 140 226 89 139 235 239 22 -228 140 191 -384 -359 -140 79 -57 -343 -61 251
1476B51r9k92O2M29Q2k72j62K28L1k43j29L45j28k97j90L45J48l56k35M57K24
$$ 251 152 -140 -78 351 433 161 -1 227 258 15 -114 231 103 -194 -384 -39 109 -247 -482 -25 199
1497A99k34n05Q33K76n17l12L38L53k08m18J57M68k71m68K41K95k72k34q8L57
$$ 199 -35 -540 293 569 52 -260 78 431 223 -195 -38 430 159 -309 -68 227 -45 -279 -367 -10
1517a0J17l86M9L83Q0k43j4J98K65j56l92L75M8l53p0J21K04q4n46K56L78m12
$$ -10 107 -279 -230 153 233 -10 -24 174 439 283 -109 266 314 -39 -109 12 216 132 -414 -158 220 -192
1539a92L2j31K27K75k59j71L38K81m26Q8j08L69j71l48L32K13n13o0K16J09j75
$$ -192 -160 -291 -64 211 -48 -219 119 400 -26 62 -46 323 152 -196 136 349 -164 -224 -8 101 -74
1560g4l73K48M97l44l70L37L23M9l31j07N40j38m61K27J89n4k58q7K74J4n17J96
$$ -74 -447 -199 298 -46 -416 -79 244 293 -38 -145 395 257 -204 23 212 158 -100 -187 87 101 -416 -220
1582b20K74r1j82O4K06O8q8j91L66J4r7k2n9J60r3j83J16Pj51K6j5j11J98r9k10
$$ -220 54 -37 -219 -155 51 119 31 -160 206 220 123 101 42 202 109 -74 42 49 -102 -76 -91 -202 -4 -103 -313
1607c13K49J26M3j49J9J49Q1l05K64K9q6j32R8m91N95m5k65K21k13n6q5K35N7
$$ -313 -64 62 105 -44 -25 124 205 -100 164 193 107 -25 73 -418 177 132 -133 88 -125 -181 -266 -31 26
1630B6r6k21M69k3k60R2K19J9j88o7K29N2k56j47L33j31j67K1nJ30k11j1K39J5
$$ 26 -70 -291 178 155 -105 -13 206 225 37 -30 199 251 -5 -152 181 50 -117 -96 -101 29 -182 -193 46 61
1654F1j59J92j01j2J03k6K03j17k0j3p1j29Q8or2q1O9J6J0p3M3K30j58k9J23O4
$$ 61 -98 94 -7 -19 84 58 261 144 124 111 40 -89 -1 -7 -99 -180 -111 -95 -85 -158 -115 115 -43 -72 51 115
1680A15N8k23J22P7L5k26m0K76j13k16jJ70p4k77J05K53p8k16J15L17j42j5K4
$$ 115 173 -50 72 149 184 -42 -82 194 81 -135 -136 34 -40 -317 -212 41 -37 -253 -138 179 37 22 46
1703D6J72j11j81J23J93k04j77O3J66j08j56L0P7r9M9P1L4n2J62q3R9N6k29K00
$$ 46 218 107 -74 49 242 38 -139 -76 90 -18 -174 -144 -67 -166 -117 -46 -12 -64 98 15 114 170 -59 141
1727A41Mj76J29n5q8J01j79J21p3q2M2J33k34N9J90oj0o5K14o1q2R3M5j06j6l4
$$ 141 145 -31 98 43 -45 56 -123 -2 -75 -157 -115 18 -216 -157 33 27 17 -48 166 105 23 116 161 55 39 5
1753Eq5J79j58p5k5J95k25J23p2L1M6j32K81J23k10M2O3J2J52j52q7J23k29J64
$$ 5 -80 99 -59 -134 -159 36 -189 -66 -138 -107 -61 -193 88 211 1 43 106 118 270 118 31 154 -75 89
1777H9K0j46QL4j33p3J47o8J85p3j28J59l2kJ7k3P7N4j47K34m1k32J61mj24J10
$$ 89 109 -37 -29 5 -128 -201 -54 -122 63 -10 -138 21 -11 -13 4 -19 58 112 -35 199 158 -74 87 83 -41 69
1803F9q9mj01l6J14J95k07K4O8mJ22j03j04J82q8l0J14j11Q7o4k17Q8J03j59N4
$$ 69 -20 -24 -125 -161 -47 148 -59 -35 33 29 151 48 -56 126 38 8 122 11 98 34 -183 -95 8 -151 -97
1828i7qM7K0j30J43R5l6o4Q1O2j21J39j65Q8N9o6m0p9J12N8k33l4K64j01j22J7
$$ -97 -105 -58 -38 -168 -25 70 34 -30 51 113 -8 131 -34 54 113 47 7 -72 40 98 -135 -169 95 -6 -128 -111
1854a11J67j4o6j50J78m1J65q1rJ46p2j24m9M4Kj76J89m2RM8j68J89J54l44R4
$$ -111 56 42 -24 -174 4 -37 128 47 38 184 112 -12 -61 -17 -15 -191 -2 -44 -35 13 -155 34 188 -156 -62
1879f2J21Qk2q6J42K09k86m1PJ0O2n5j40J66j23n3J05m9Q3m1K1J48j3j07j1M4
$$ -62 59 67 45 -41 101 310 24 -17 -10 0 62 7 -133 33 -90 -143 -38 -87 -4 -45 -24 124 111 4 -7 37
1905C7J1M0j51O6J15n0j30M3k0j08J58j17J18j7o6n6J69O7j09rP2R0m6j66R5J56
$$ 37 48 88 -63 3 118 68 -62 -19 -39 -147 11 -106 12 -5 -71 -127 42 109 0 -9 63 153 107 -59 36 192
1931A92p3k36Q6J60j4j97j4J61j07p3R6%k0R3j23K55o0k01j8J23J69k32pL0R6
$$ 192 119 -117 -31 129 115 -82 -96 65 -42 -115 -19 -19 -39 54 -69 186 126 -75 -93 30 199 -33 -40 -10 86
1956H6j40p4P9O1j8j31R5k6J1kJ68q9L4j1n1M7R5j97J5J33k4q0P9n3M3j35n9J54
$$ 86 -54 -128 -49 12 -6 -137 -42 -68 -57 -59 109 20 54 43 -8 39 134 -63 -48 85 61 -19 60 7 50 -85 -144 10
1984A0mMj2l8J25l9Lp4J27o3P7j66m4K12p4k40K17j15N9o5J5J64j22j42J28J65
$$ 10 6 10 -2 -40 85 46 49 -25 102 39 116 -50 -94 118 44 -196 21 -94 -35 -100 -85 79 -43 -185 -57 108
2010A08rj39O5j3Q0l7nJ07q3l7j54J76Jj14p7K30j07j45J39q9J71p8r3Q9J22k4
$$ 108 99 -40 25 12 92 55 50 157 74 37 -117 59 60 -54 -131 99 -8 -153 -14 -103 68 -10 -103 -14 108 84
2036H4j02J54k1n2j16j7Q1J28k67J45j82L1J72k06J18O8qKo9P7P5r8K5J68j60
$$ 84 -18 136 115 63 -53 -70 11 139 -128 17 -165 -134 38 -168 -50 18 10 12 -57 20 95 -3 22 190 30
2061C0Ro0K01p0q0j80J52%m2k8J7J20j25P3n0M5p2M0RK51k45l3J48J6l22J55R7
$$ 30 39 -21 180 110 30 -150 2 2 -40 -68 -51 69 -56 17 -33 12 -60 -20 -11 240 -5 -38 110 126 -196 -41 56
2088E6o7K9K2q8PP5k02J55K0k2J27j22l1j6J36j1p3L0l0K42k21j38K82j41r0O
$$ 56 -11 18 40 -48 -41 34 -168 -13 7 -15 112 -10 -41 -57 79 68 -5 25 -5 237 16 -122 160 19 -71 -65
2114f5Q3Nj00k8J54j08K7k8J85j46R1q4J95j39q3O1J00q9j81J68N3j20j80K09
$$ -65 18 23 -77 -105 49 -59 -32 -60 125 -21 70 -14 181 42 -41 20 120 31 -150 18 71 -49 -229 -20
2138b0J41k04K0J18r2l0M6L2Q5l7p7J82q6j15L4N1m6K8p3J14m4k24k5L11j80Q8
$$ -20 121 -83 -63 55 -37 -67 -21 11 96 59 -18 164 78 -37 -3 48 2 30 -43 71 27 -197 -222 89 -91 -3
2164cp0J42p0j19J31J50k38qK51mj39j04J22mk57J92O5r8j25R6J38J09l12P1K28
$$ -3 -73 69 -1 -120 11 161 -77 -85 166 162 23 -81 41 37 -220 -28 37 -61 -186 -90 48 157 -155 -84 144
2189A44M3j93j6K29k18mnJ84k0k69k5K53p7j88J0K49k3j37m1J89k21L4J20J20
$$ 144 187 -6 -22 207 -11 -15 -20 164 144 -125 -150 103 26 -162 -152 97 74 -63 -104 85 -136 -102 18 138
2213A38j47p1Q6O9k6m3N0L9k51J93L1j57j7M2J39j24o8P4J20k8k64K06J24q8j79
$$ 138 -9 -80 6 75 49 6 56 95 -156 37 68 -89 -106 -64 75 -49 -117 -43 77 49 -215 -9 115 27 -152
2238a52J73J14j30j8m4K37k32k0N1J17q9j56J07M9k1j42K78Nk88J76J4J33q6j40
$$ -152 21 135 5 -13 -57 180 -52 -72 -21 96 7 -149 -42 7 -14 -156 122 127 -161 15 29 162 76 -64
2262f4J77Jj34M3N6m7k0q3O5k1m6k0K1L0j23K34n3J2k4M7J94j70p3J03j47j2N7
$$ -64 113 114 -20 23 79 32 12 -71 -6 -27 -73 -93 -72 -42 -165 69 16 28 4 51 245 75 2 105 -42 -54 3
2289CK7j9j03O1Q2J14l57J35J68j02j45J41O4L5j42J32P4j38m6K6J75j55p5l0
$$ 3 30 11 -92 -31 51 165 -192 -57 111 9 -136 5 69 104 -38 94 168 30 -16 10 185 30 -45 -75
2313g5K58j84j44P5J49k30J16o4J06O8o9M5N6p3qL5N4j54jrJ68j60L9j6j8r4N6
$$ -75 183 -1 -145 -70 79 -151 -35 -99 7 75 6 51 107 34 26 61 115 -39 -40 -49 119 -41 -2 -18 -36 -130 -74
2340g4N7O2j75R1J11kp7Q3Pk2o0o3J52p9j57k7K88j56l2o0J12K0j08L9J80j14
$$ -74 -17 45 -130 -39 72 70 -7 76 83 61 1 -62 90 11 -146 -173 115 -41 -73 -133 -21 -1 -109 -70 110 -4
2366dj77J74J27j82J29N0n0j31K7J34p8j20J51j3l7P5q2nN7r7j4J52j73Q5k6N3
$$ -4 -181 -7 120 -62 67 117 67 -64 -37 97 19 -101 50 37 0 75 -7 -12 45 -52 -66 86 -87 -2 -28 25
2392B5J5J9Rj8n1q4P1L3o9kR0o5m3L8K1M2r2K2J48j47Q6m9M9pk2J5L4j22j6K6
$$ 25 40 59 68 50 -1 -85 -14 19 -50 -52 38 -27 -70 -32 -11 31 -61 -39 109 -38 48 -1 48 41 19 34 68 -54 -70 -44
2422d4K01k50M1rR9m6p5j0J05L8L5j60J28K9nM8q1o8JJ21nr4M9O3j17k1j0N0j22
$$ -44 157 -93 -52 -61 38 -8 -83 -93 12 50 85 -75 53 82 77 125 44 -24 -23 98 93 -1 48 111 -6 -27 -37 13 -109
2451a09L1K2P0O7j64k5J88j07L4J47j85Q3M0K8o2j86J13P4R7o9j29R1j05p7P8
$$ -109 -78 -56 14 81 -83 -108 80 -27 7 154 -31 52 92 120 58 -128 -15 59 156 87 -42 49 -56 -133 -55
2476e5J60Pj19L6O6M6r7k6O6o9Q9k32J98Pj57N7O4r1m9J10j40P0J65k01J19n7
$$ -55 105 112 -7 29 95 141 44 18 84 15 104 -128 70 77 -80 -23 41 -50 -99 11 -129 -59 106 -95 24 -33
2502c3pK3L8j8J43j57J7o7P6L2n3J6m1pq4J50qk1K6q0J17r8N7j3L8j45K25j08
$$ -33 -40 -17 21 3 146 -11 6 -61 15 47 -6 10 -31 -38 -122 28 20 -1 25 -55 62 -36 21 8 46 -99 126 18
2530A8m6Q9m7m4J02j20M0m4L9p9M2o4K27o7L3o9j0K9P4j47J13J8r3M7Oo7RQ6l7
$$ 18 -28 61 14 -30 72 -48 -8 -52 -13 -92 -50 -114 113 46 79 10 0 29 103 -44 69 87 -6 41 47 -20 -11 75 38
2559C8nj13Q5j00K00n8p7J36M9j83J89j54M5q2J52j23J3q3Q7m4M3J8l4o0R0m3
$$ 38 33 -80 5 -95 105 47 -30 106 155 -28 161 7 52 -30 122 -1 12 -71 16 -28 15 33 -1 -61 29 -14
2585a4j01m3J85l5kL5O5k14J42q2J54L6j80R8J8j3j78J31j25J88j30o8J31j14
$$ -14 -115 -158 27 -8 -10 25 90 -124 18 -64 90 126 -54 44 62 49 -129 2 -123 65 -65 -133 -2 -116
2609a16M2J53k19K37j07M6l9Q5j13J06k2l4l8L9m4N2J2r4N1Jj17K74m15L40J61
$$ -116 -74 79 -140 97 -10 36 -3 82 -31 75 53 19 -19 20 -24 28 40 -54 -3 -2 -119 155 -260 80 241
2634B41r1J94k76J06q4j12j1J38n2p5NQ9l6j1l7L9l3N9j70J00K9l3lM7Jn4O1Q1
$$ 241 150 344 68 174 90 -22 -33 105 53 -22 -17 72 36 25 -12 27 -6 53 -117 -17 12 -21 -24 23 24 -30 31 112
2662A12o4r6L6L2O2l0j12J31j38j1Q2l8M1k5o0O6Q0J6j27J73j14j42J52p5P0J30
$$ 112 48 -48 -12 20 82 52 -60 71 -67 -78 4 -34 7 -18 -78 -12 68 84 -43 130 16 -126 26 -49 21 151
2688A51j72L5j20N9K6L2p3J26p4N0j06L8K04j83J16n2l9m5l1K6l5J82m2p5k5K5
$$ 151 -21 14 -106 -47 -21 11 -62 64 -10 40 -66 -28 176 -7 109 57 18 -27 -58 -32 -67 115 73 -2 -27 -2
2714bkj10J37k5l0K2LM9j91K00O7n9p4P6o9J37j77J26j0K0j66j4K00j10o4n1J53
$$ -2 -4 -114 23 -2 -32 -10 -7 42 -149 51 118 59 -15 61 -8 129 -48 78 68 88 -78 -92 108 -2 -66 -117 36
2741C6o2m9q0J41p6Q4k6M2m9l8N7R5m3O8j9j4n4qK2K4k0j52K6J62j06J11p6O8
$$ 36 -26 -75 -155 -14 -90 -6 -32 10 -39 -77 -20 75 32 100 81 67 13 5 27 51 31 -121 -95 67 -39 72 -4 64
2769F4M6j36N4o6JR9j6j7l9ll7Q5j38Q4M9l1p3J4Q9%J6l7O5n1n9O4J1m9k1O0L5
$$ 64 110 -26 28 -38 -37 62 46 29 -10 -13 -50 35 -103 -19 30 -1 -74 -60 29 29 45 8 73 22 -37 27 38 -11 -32 28 63
2800F3M6r1N0o5j6K4p7J91j93J6O4K5j43R0Q4l4j2j33J04J67j30o2P2J7o0n5J45
$$ 63 109 18 68 3 -13 11 -66 125 -68 -52 12 37 -106 -16 68 34 22 -111 -7 160 30 -32 40 57 -3 -58 87
2827H7j29P6k2M9j20K2k1N7j06L3J23K3o6r3J85j4j06M0j3n1J66j56L5Q1p1J3
$$ 87 -42 34 12 61 -59 -37 -58 -1 -107 -74 49 72 6 -87 98 84 -22 18 5 -46 120 -36 -1 80 9 22
2853B2n9M0p4J47J6k6j95J04K2M5j06P4Q7l2r1M2o3J05j83P5j3J8m3J15m8l0N8
$$ 22 -37 3 -71 76 92 66 -129 -25 -3 42 -64 10 97 65 -26 16 -47 58 -125 -50 -63 -45 -88 27 -21 -51 7
2880GL1m7O8j25P3Q3j1m2J0m5J8k6m8J3p0J22q9lJ17o4N3k12J66lJ0K7N2o1Qj08
$$ 7 38 -9 59 -66 7 90 79 37 47 2 20 -6 -54 -41 -111 11 -78 -81 36 -28 25 -187 -21 -24 -14 13 65 4 12 -96
2910i6J57L2q1NK9r8n1M3O4Rp2M1j07J70k7l6P6Q1j05J09q6M3k3o1P4j64l2M5
$$ -96 61 93 12 17 46 -52 -103 -60 4 13 -59 -18 -125 45 18 -18 58 139 34 143 57 100 77 16 90 -74 -106 -61
2938f1R5o2L1n3m7P5J22l2m3k7J11L1j05L8M8j22j34Q4L1p2O9j6O2p0L4R7j14
$$ -61 34 -28 3 -50 -97 -22 100 68 25 -2 109 140 35 73 121 -1 -135 -51 -20 -92 -23 -39 23 -47 -13 84 -30
2965c0L2n1J08j00L1Q0M0j24K8K4Qr2K8P3k3j02J22r6m9R0j19J89j44NJ17o8o6
$$ -30 2 -49 59 -41 -10 70 110 -14 14 38 46 -46 -18 55 32 -70 52 -44 -93 -3 -122 67 -77 -72 45 -23 -89
2992h9MJ19q4M5m2J40j63J17r7Q3Nm7K9r7O5L1j6m1L7L5k1km6k8J33j8q0J21j12
$$ -89 -85 34 -50 -5 -47 93 -70 47 -50 33 38 -9 20 -77 -12 19 3 -38 -1 34 13 11 -35 -63 70 52 -28 93 -19
3021a9P2k6k6K2Pj50J65n7L4%l5N4k04J49L7k4l8P1M7o0J9K4k6p1L4j1j5k8QL2
$$ -19 53 27 1 23 30 -120 45 -12 22 22 -13 41 -163 -14 23 -1 -39 32 79 19 38 62 36 -35 -1 -12 -27 -55 -47 -15
3051a5l3N0j15J20l3M1q5J58n1P1j41O6N1r4J9l6K3K8K0j3r0N6P6q4j61J93L9
$$ -15 -48 2 -113 7 -26 15 -70 88 37 108 -33 33 84 -10 9 -27 -4 24 44 31 -59 -3 73 -11 -172 21 60
3078F0p9O6q6M0%J7M0Lj32J89j19p5J50l9O3k5j62O4m5j0P6M7n8J65j05l9L9j10
$$ 60 -19 47 -39 1 1 18 58 61 -71 118 -1 -76 74 35 98 73 -89 -25 -70 -80 -4 43 -15 150 45 6 45 -65
3106f5O8J18j44N4Rj7k8L4j8m5L8M6l0j17O9N9q6J2P1rn6l0O4O0k2KM3Jn4Nn5
$$ -65 3 121 -23 31 40 23 -5 29 11 -34 4 50 20 -97 -28 31 -55 -43 28 19 -37 -67 -3 57 35 37 80 81 27 32 -23
3137b3J2M8n6J8l5m5J30q4p0J28O1J9p6p7J06k4lo7K1jN5k1q8mp5J00QJ9n2mR2
$$ -23 -11 37 -19 -1 -36 -81 49 -35 -105 23 84 103 27 -50 56 32 29 -38 -17 -18 37 16 -72 -76 -151 -51 -43 -24 -76 -80 12
3168A2l5q5Q5M7nL6j46J82j31j8J51m4L9j57J01r1N4J8o9J06M8j34N8m3j1J22
$$ 12 -23 -108 -23 24 19 55 -91 91 -40 -58 93 49 88 -69 32 -59 -5 13 -56 50 98 -36 22 -21 -32 90
3194I0M8j43J4j1J09k7l3j39O8j7J40j76P6p0J42j8r9lm7J83l0J2q4R3j01k7L7
$$ 90 138 -5 9 -2 107 80 47 -92 -24 -41 99 -77 -1 -71 71 53 -46 -49 -96 87 57 69 -15 78 -23 -50 -13
3221a3J32l8L7j26j15K22j45j2O2N1j05N3O6k4j33J16p2J06j0M5j11J08l7o2J37
$$ -13 119 81 118 -8 -123 99 -46 -58 4 55 -50 3 69 45 -88 28 -44 62 52 97 -14 94 57 -5 132
3246A32j75nK7L9j34J03n4M8Q9l2j46J08K0P0J6j47l1Q4k2J83k19P7p1J19o4J7
$$ 132 -43 -48 -21 18 -116 -13 -67 -19 70 38 -108 0 20 90 106 -41 -72 12 -10 173 -46 31 -40 79 15 32
3272C2J04j29m9r3K42j05L8r5M2M3j1pQ0j05j04M2M6q9Q8P5j27J22j38J00N6m7
$$ 32 136 7 -42 -135 107 2 40 -55 -13 30 19 12 92 -13 -117 -75 -29 -118 -30 45 -82 40 -98 2 58 11
3298A1q3J29N5p4r9J28j12j6P4L9J01j75R4M1j79J6k7L8M4p1l5J75oj77m3J93
$$ 11 -72 57 112 38 -61 67 -45 -61 13 52 153 -22 72 113 -66 -50 -77 -39 5 -66 -101 74 68 -109 -152 41
3324D1j7O1p7R6j35l3J13n4P8j84L4O0K5p5Q8l4m5NO7N0Mj05J17qk2r6J07J3j17
$$ 41 24 85 8 104 -31 -64 49 -5 73 -111 -77 -17 8 -67 21 -13 -58 -53 14 64 68 -37 80 72 50 -46 61 74 -43
3353d3J91r5l0m1j9O3k3pOO5j49k3J64j19J6RP3Ok6j04J76m8M4l5J1m1p6J02j29
$$ -43 148 53 23 -18 -37 26 3 -4 2 67 -82 -105 59 -60 -44 -35 38 44 18 -86 90 42 86 51 62 21 -55 47 -82
3382h2RJ41j20n3J75o0M3j43N4L7R2Om2j9r0J98j67N6m7j12M2K5L5Kj6P0j42J60
$$ -82 -73 68 -52 -105 70 10 53 -90 -36 1 93 99 57 38 -52 146 -21 35 -12 -124 -82 -57 -22 -20 -36 34 -108 52
3410E2m7j20J54k0k6o5J49J6j46n0J50r7j40J54l1J34m0l1m1J20q3m6N0O2o2j24
$$ 52 5 -115 39 19 -7 -72 77 93 -53 -103 47 -50 -190 -36 -67 67 27 -4 -45 75 -8 -54 -4 58 -4 -128
3436a28J77j9L0q0J15j61J05q8Q6j6j9M9j21J04kJ5o8j37K44j29L0o9M5O7l1O9
$$ -128 49 30 60 -20 95 -66 39 -49 37 21 2 51 -70 34 32 47 -21 -158 86 -43 -13 -82 -37 30 -1 68
3462F8n5L0m0P3K5o6j35J93l2r4J44j42m7J40j58k8K23Pj17m6M0K8J8j54R6P7
$$ 68 13 43 3 76 101 35 -100 93 61 -33 111 -31 -78 62 -96 -124 99 106 -11 -57 -17 11 29 -125 -29 48
3488D8L7r8K4OJ5o4P5n1j65L6J62j63J35%P5r9oP9O3j43K4K0J20j17k4m7M4K6
$$ 48 85 -13 11 17 32 -32 43 -8 -173 -137 25 -138 -3 -3 72 -27 -33 46 109 -34 -10 10 130 13 -11 -58 -14 12
3516A2j81K42j77J57p8J12n7j2oM1rjj24R0J9q9J79j81J81j95N4K9j15N8Q5nr
$$ 12 -169 73 -104 53 -25 87 30 18 12 53 44 43 -81 9 28 -61 118 -63 118 -77 -23 6 -109 -51 34 29 20
3543B0j95R9J06K6p3P9j4o5No3J30kj25R5M5n6n8MQ1L0j75Q8k7N2l7l6P5j6o3
$$ 20 -175 -76 30 56 -17 62 48 -17 -12 -75 55 53 -72 23 68 12 -46 -42 39 69 -106 -18 -45 7 -30 -66 9 -7 -70
3572g0M6M2LrM7j0q9P0j67J97q7L8q2J17k7m3J3J6J16Mj17J09j86J53k9J1r3Q4
$$ -70 -24 18 21 12 59 49 -40 30 -137 60 -27 11 -71 46 19 -24 -11 5 121 125 8 117 -69 84 55 66 -27 57
3600E7j1Pn4R6o4m9q6Q4O1j37R7p4J14m1j4KK0Q6p0Q7j19J22j26jN3k0o5J26j18
$$ 57 46 53 -1 95 31 -18 -104 -20 41 -96 1 -73 41 0 -14 -12 8 94 24 111 -8 114 -12 -13 40 20 -45 81 -37
3629c7J30j46R6j7o6J%O0N9j1%p6nJ10j57R2lj00J82m9L2j44k5n6Q9J27k01J27
$$ -37 93 -53 43 26 -40 -39 -39 21 80 69 69 -7 -12 98 -59 33 30 -70 112 63 95 -49 -74 -130 -41 86 -115 12
3657A2J2j59M1J16m0k9k8Q6K6l2N0j37J20j65K11j05K8J6j16Q3lK6m8J24o2pj1
$$ 12 24 -135 -94 22 -18 -47 -75 11 37 5 55 -82 38 -127 84 -21 7 23 -93 -10 -13 13 -35 89 27 20 9
3684IL6m4R9j50R6j3j4m4J24j27L8o2k5K2p4K37j05M6m6P3j27M7j7K1P6k2q5J29
$$ 9 45 1 100 -50 46 33 19 -25 99 -28 10 -52 -77 -55 -129 108 3 49 3 76 -51 -4 -21 0 76 54 -31 98
3712I8j50J06Qj1j08M4L7l7l5K0N0om7J00m2L5n3m0N2l9p2O6J01L0r8O5j55Qr6
$$ 98 -52 54 62 51 -57 -13 24 -13 -48 -28 22 16 -31 69 27 62 9 -31 21 -18 -90 -24 77 107 9 74 -81 -73 -169
3741a69J30O4J4r5J4J16j09l2R8mj36K2J47l7L8J2j78J50j14L5N2qo1O7N0m1K4
$$ -169 -39 25 39 -56 -42 74 -35 -67 31 27 -109 -87 60 23 61 73 -105 45 -69 -34 18 10 -51 16 66 25 49
3768D9j5rN4q0O1j08J09j55J29p0l4O4nkr1O4R4L5j17r1K0J63j65O2PR9K3k03
$$ 49 34 25 79 -1 60 -48 61 -94 35 -35 -69 -5 -10 -12 -103 -39 55 90 -27 -118 -98 65 -100 -38 -31 68 91 -112
3796a12J06P0m5M7pn7O0l8j03J43n6m6M7l5J16j36m3N2k3J2j6k8M1P1J0l9O4l2
$$ -112 -6 64 19 66 59 2 62 24 -79 64 8 -38 9 -26 90 -46 -89 -37 -60 -48 -64 -92 -51 20 30 -9 55 23
3824B3m4M7j64O5J03j16P6j1J7N3o7J5mk9J11j1L1l1Jk6q2L6q8K02k45R1l9qK8
$$ 23 -21 26 -138 -73 30 -86 -10 -21 -4 49 -18 -3 -7 -36 75 64 95 64 65 39 -43 -7 -95 107 -138 -47 -86 -94 -66
3853f6RM2l0M2m0K5M4J6l5K3J1K0r1m7J83k71P2K5J2J92j85j06R5J08M0Jp2k0
$$ -66 -57 -15 -45 -3 -43 -18 26 42 7 30 41 61 -30 -77 106 -165 -93 -68 -56 136 -49 -155 -60 48 88 89 17 -3
3881cKj6R9q2L1K0L3p3Q5p1K1Pq7q5J25n2ml3P5l9l5M2P9q1J8J05j11nQ8j3q2
$$ -3 -1 -17 82 0 31 51 84 11 96 25 46 53 -34 -119 6 -46 -50 -83 -8 -47 -82 -40 39 -42 -24 81 -30 -35 53 40 -42
3912d2J17o8nj06Q7L4Ok1P0K2j40j07J16J05j52N64m87O4l9J6rj9J5j69J37o9
$$ -42 75 7 2 -104 -17 17 23 2 72 94 -46 -153 -37 68 -84 480 -7 57 18 34 25 6 21 -148 -11 -80
3938h0O5n5L1rJ1J13Qp5J8p6N5qj34J27O8j29O6l4KpR9n6J3MJ2N2q8rk0K5k2M9
$$ -80 -15 -70 -39 -48 -37 76 84 9 27 -49 6 -2 -136 -9 59 -70 -4 -38 -36 -43 56 0 13 17 29 81 -7 -16 -36 -11 -33 16
3970A6o8J56j77J45j49L1P7mo6o9J11Mk4RLj39K15m8o6J7n5Q1m5O0K8l0O3r9M0
$$ 16 -52 104 -73 72 -77 -46 31 27 -39 -108 3 7 -17 -8 -5 -144 71 23 -43 -26 -81 0 -45 15 43 13 76 -23 17
3999A7M4L9q9nk1R1j71K23m6j23J51k15J07j7M1o8N2j02J06n7l9J36q6Q6o9%J21
$$ 17 61 100 11 6 -15 76 -95 128 82 -41 110 -105 2 -15 26 -42 10 -92 14 -43 -82 54 -32 54 -15 -15 106
4026A06j14l1M3P5o0j19RJ58l1j65Q5N1ML5p9K9j6lJ6L3j31J14n3J8L1L1r2N1
$$ 106 -8 -39 4 79 19 -100 -91 67 36 -129 -44 7 11 46 -33 -4 -20 -23 -7 26 -105 9 -44 -26 5 36 -56 -5
4054eM7r9N3j48J30OL8%p7M9j8pO7J4q7l2J54r9N9m8o2nM1j36J44M6j1j0L3j1
$$ -5 42 -57 -4 -152 -22 -16 22 22 -55 -6 -24 -31 36 50 -37 -69 85 -14 45 -3 -65 -70 -29 -165 -21 25 14 4 37 26
4084B6J6q0N2N6p0R7n0L0k7K2o2j0P8j08k1M8K1K6p6J01Nj13N2M9j32J10j4O2
$$ 26 42 -38 14 70 0 97 47 77 50 72 10 0 78 -30 -51 -3 18 44 -32 69 74 -39 13 62 -70 40 26 88
4112H8P0k03L2j9k4PKL2L2n0M7NRp9J41N7j51j1jR6Q1o4j17J13Jj15l3P0L2p0
$$ 88 158 -45 -13 -32 -56 -49 -47 -15 17 -33 14 19 28 -51 90 147 -4 -15 -16 80 161 97 -20 93 94 -21 -54 16 48 -22
4142b2j3K3ML8n3O7r2N8L4j37O4R1o0o8J07ol2j2m7J05n9lo9L5nJ50j04q9Q9n8
$$ -22 -35 -12 -8 30 -23 44 -48 10 44 -93 -29 62 2 -66 41 35 3 -9 -56 49 -10 -13 -82 -47 -52 98 -6 -95 -6 -64
4172f4R2j4R1j28K3N8q4Q2N0J8j06m6j15Q3K0L1M0l8L8j9k9NJ04l1m8M7n7k7N7
$$ -64 28 14 105 -23 0 58 -26 56 106 124 18 -28 -143 -60 -40 -9 31 -7 31 12 -17 -12 92 61 13 60 3 -24 33
4201C3j14O3J02r5o7J06jj62J86p5L6nj3j5l9J35r4l9Q9J5l9O1o9l2P8n8l3N2
$$ 33 -81 -18 84 -11 -78 28 27 -135 51 -24 12 7 -6 -21 -60 75 -19 -58 31 46 7 68 -1 -33 45 -13 -46 6
4229Fq0J52p7k9k9MQ7Mk0q2lK0L1j1J9R9n6L7j72Q7J17k37K04j47Q4R1j21J69
$$ 6 -74 78 1 -28 -57 -53 34 38 18 -64 -67 -47 -16 -27 -8 91 35 72 -100 -13 104 -133 71 -76 8 99 -22 147
4257A47j79l9P7%j20O6O2K1J7j33J07k2k7J01k9m0l7P2o4K2Rl0M3q4K1P8l2j03
$$ 147 -32 -71 6 6 -114 -48 14 35 52 -81 26 4 -23 78 49 9 -28 44 -20 2 11 -19 24 -60 -39 39 7 -96
4285i6O1J1L1l8J30o9r4Q3j2l6R1k1j13qJ52L8j47J3l3J03j56J27j9Oj9Q0K4j12
$$ -96 -35 -24 7 -31 99 30 -64 19 7 -29 62 41 -72 -80 72 110 -37 -24 -57 46 -110 17 -2 4 -15 65 89 -23
4313b3P1p7P5k3k4m8O7Qm9Lk8P0o5QK2l1P5j30P3Qj8N1m8R4n7q9l1K8J20j03K6
$$ -23 48 -29 46 23 -1 -49 18 26 -23 -20 -48 22 -43 -35 -13 -44 31 -99 -26 -18 -36 15 -33 61 4 -85 -116 -88 32 -71 -45
4344d5J30k4j25j5Q1k3O2M7o6N3n8P8k7r6OmL9N6p7L7l4l0P5j0n2n5J11q0j34
$$ -45 85 61 -64 -79 2 -21 41 88 22 75 17 95 68 -28 -22 -26 13 69 -8 29 -5 -35 40 30 -22 -77 34 -46 -180
4373a80J43m3L1l4J40M7l8p9j2l4P5j1P7j03N1q9J14l0q3O4J3K3m7K4m5j0M5L6
$$ -180 -37 -80 -49 -83 57 104 66 -13 -25 -59 16 5 82 -21 30 -59 55 25 -58 6 19 42 -5 19 -26 -36 9 45
4401D5K0j79P9m0N4k4M3l1N0j1j30J58j02n1J02N0j70J74k2j00P5O4o0PM8n8J15
$$ 45 65 -114 -35 -75 -21 -45 -2 -33 17 6 -124 34 -68 -119 -17 33 -137 37 15 -85 -10 54 -6 1 49 -9 106
4428A06p1r8K9J35n3k1m2M7l9j1k2J18j44j4Q1L2q7K1l3N9N0j37J21n4K7lKM8
$$ 106 35 -63 -34 101 48 27 -15 32 -7 -18 -40 78 -66 -80 1 33 -54 -33 -66 -7 43 -94 27 -27 0 -3 -1 47
4456D7m9M8pr2R7J0mp7j2O6P6j12J0m6L0M1OJQn0j18J20O3j7n5R2j19J2J09p4
$$ 47 -2 46 39 -53 44 54 50 -27 -39 27 103 -9 1 -45 -15 26 32 33 41 -9 -127 -7 56 39 -16 76 -43 -31 78 4
4486DP9p3N1N6j52m8O4j0P1n5J1n9J23Oj43J01j61J61LOj6n2l9N3P2N0nq0L0J06
$$ 4 83 10 61 117 -35 -83 -19 -29 42 -13 -2 -61 62 68 -75 26 -135 26 29 35 19 -33 -72 -19 53 103 98 18 48 154
4516A54j09Qp3j9p4N9O8j5j21K2q8J87j3l1J44Jj67J00o1Q5j50R7J5J6r6O3j16
$$ 154 45 53 -20 -39 -113 -54 14 -1 -122 -100 -188 -1 -14 -45 99 100 -67 33 -28 57 -93 4 19 35 -61 2 -114
4543a14M1L3P3r1k1P3p1J6O4j00n1K94j39j43q2J78K3O3j79J78q0J29on7o1j07
$$ -114 -73 -40 33 -58 -79 -6 -77 -61 3 -97 -148 146 7 -136 -218 -40 -17 46 -133 45 -35 94 88 31 -30 -137
4569a37J45rj17J04l66K54J21k14J13q1J26q4j52L91N3j14N5n6J76j84m15L21
$$ -137 8 -1 -118 -14 -380 -126 -5 -219 -106 -187 -61 -145 -297 94 147 33 88 32 208 24 -391 -70
4591g0J26k92J46J03J45k73P8k78M62Oj22Q7j4m3j92J67N5j60J05j56K56k34j3
$$ -70 56 -236 -90 13 158 -115 -37 -315 147 153 31 118 104 61 -131 36 91 -69 36 -120 136 -98 -111
4614a11K95j02j68J11K0M4l9J7j1j12QJ24p7qL6P6J1o0p1oJ14o1p7J6K5k0M3l3
$$ -111 184 82 -86 25 45 89 50 67 56 -56 -48 76 -1 -9 27 103 114 54 -17 -23 91 30 -47 -31 -6 -26 17 -16
4642a6k9L6L9q6J0N6J24j48RP5n2j70P2J13k4J8p3n4J23j3M7p7M3p9J73q4l5M5
$$ -16 -45 -9 30 -56 -46 10 134 -14 -5 70 18 -152 -80 33 9 27 -46 -100 23 10 57 -20 23 -56 117 33 -2 43
4670D3O5O7j08q5J8R3k6j02r1J49j73J32R5j68N6R9j35J37r8%j0J63o1k9o6n2
$$ 43 108 175 67 -18 0 93 67 -35 -126 23 -150 -18 77 -91 -35 64 -71 66 -32 -32 -42 121 60 31 -35 -87
4696h7J3p4K59j61Q7jl4L7j7k69J41k2K35k19kQ2p7J18J49j16k25L42M1r3O7j64
$$ -87 -74 -148 111 -50 37 36 2 39 22 -247 -106 -128 107 -112 -114 -32 -109 9 158 42 -183 159 200 107 174 10
4722A0Rk03J96nL53k52l69K55j42O43o23n5l8m3O03k71O7L06m60K49l0k42K73
$$ 10 19 -184 12 7 360 108 -261 -6 -148 495 -128 -183 -221 -264 339 68 135 441 -19 230 200 -42 231
4745B31m11K0K20K99l06qj1M9k86M33n48L87j28M45n43N17j07K31K01r55n27L58
$$ 231 -180 -160 60 359 53 45 34 83 -203 230 -318 69 -59 386 -157 360 253 484 685 -270 -797 -439
4767d39O46j38K59k80M07j032R38p50N47K69m38L27k65k67m0j52J78J84L85j18
$$ -439 207 69 328 48 455 -577 361 -389 158 427 -11 316 51 -216 -256 -408 -230 -46 339 221
4787B21q49P44q73Q64N84q93O9o68M23n2P5l55L71M21L94r9M35j270N02q23R87
$$ 221 -628 116 -757 107 691 -202 -133 -801 -378 -430 -355 -710 -339 82 476 377 812 -458 44 -779 208
4808B08k5k83N26p32M80j19J52o7J20J15n88l30j4J124o80l24k8j24L81O19K5
$$ 208 183 -100 426 -306 174 55 207 140 260 375 -213 -543 -557 567 -113 -437 -465 -589 -208 411 436
4829D36o20L5R8m12M74k62K75j08J69j81J51m2J93n21K15N60n15l46N81N9j30
$$ 436 -184 -149 -51 -463 11 -251 24 -84 85 -96 55 13 206 -315 -100 460 -55 -401 180 239 109
4850A09m22K13P1p8p7O10L2k85L8o9L9Kl11j82O45rn63J82N2K00k63J94k64K56
$$ 109 -313 -100 -29 -107 -184 426 458 173 211 142 181 183 -128 -310 335 326 -237 -55 -3 197 -66 128 -136 120
4874A20j93r4J55P4qq3P4l8m9R7n4n6J47j27O8j37O6N0M2l9n8N9k3n6J48j57J32
$$ 120 -73 -167 -12 62 54 -29 45 7 -42 55 1 -55 92 -35 33 -104 -38 12 54 15 -43 16 -7 -63 85 -72 60
4901F0m4k8n4P8k2l2M4n3K5OQ8m4jl1j03K34p5LP2o0n5p9O8j0o6R0O4q3K8J1l2
$$ 60 16 -12 -66 12 -10 -42 2 -51 -26 -20 68 24 23 -8 -111 123 48 51 123 63 8 -71 -3 -13 -79 11 75 -8 20 31 -1
4932aK0pKj6OO1j41L8Q1l4R3r5n0R3mk5J06j20jJ52j94O9m0K8j2j04J76j1rK8
$$ -1 19 12 14 -2 4 65 -76 -38 43 9 102 7 -43 50 46 21 127 7 6 158 -36 33 -7 21 9 -95 81 70 61 89
4962H9q4N6NJ9r4J4O7k19O5P1M1M6q5k0n1J62p2JMj3j38J49N1m0j7K6K4oL0j16
$$ 89 5 61 66 85 -9 5 72 -147 -82 -11 30 76 -9 -29 -80 82 10 11 15 2 -136 13 64 24 7 33 57 51 81 -35
4992c5N1rr2Q1L0N2j27j5M3O2J4j05K0mP2n2J21j31N5p4p6L4N5O7n7M2n4Q0r0
$$ -35 16 7 -85 -4 26 78 -49 -64 -21 41 55 -50 -30 -34 38 -14 107 -24 31 -43 -119 -85 -30 37 -20 22 -32 48 -42
5021d2K3NN9n3J9l1m9N2o6O9k0L1J7p8J64j28K7L0n9O1N4k1r5P2jj04R4o3q4J17
$$ -42 -19 -14 45 -8 11 -20 -69 -17 -83 -14 -34 -3 14 -64 100 -28 -1 29 -30 31 85 64 -31 41 40 -64 30 -33 -117 0
5051@o6N9M1mK9m5qK0r0M1j46P5K8%J66j10ML6Rq1J20L8j63N2N6k5J7J8j61J84
$$ 0 -66 -7 34 30 59 14 6 26 -64 -23 -169 -94 -66 -66 100 -10 -6 30 39 -42 78 116 -47 5 61 36 53 71 -90 94
5081I4r2mj0JK0jo7j2K06j54N8K5Q4j0j55k8J37k5r9O6k3l6rj0R4n0q1J18k1K0
$$ 94 2 -2 -12 -11 9 8 -59 -71 135 -19 39 64 148 138 -17 -45 92 67 -32 34 11 -25 -34 -44 50 0 -81 37 16 36
5111C6j20NJ41r6M6r0J47N0j87J42jn6p0O8kJ1K7j13J15m7o2K1J08j21J10j6j5
$$ 36 -84 -79 62 -34 12 -78 69 119 -68 74 73 17 -53 15 13 24 51 -62 53 6 -56 -35 73 -48 62 46 31
5138C1j14J06Q1j05jM4p8R1j08L78j25l86K12j7J3j9nk3p7J61o9L1j61K49k6k2
$$ 31 -83 23 104 -1 -2 42 -36 55 -53 325 200 -186 26 9 22 3 -2 -25 -102 59 -10 21 -140 109 83 61
5164F1j08K6p3L8L7p2J8J01o8l2O6p9J16n6rJ3O2mj16O4K6K8q3M5J52k15j7O5
$$ 61 -47 -21 -94 -56 -19 -91 -73 28 -40 -72 -6 -85 31 -25 -34 -21 41 37 -79 -15 11 39 -44 1 153 -62 -79 -14
5192a4J7l1j6Q0O8j74J80m0j48J5j0L0kJ0L2k7j6P5l7%L1j2kJ4k6J5n5N8j4OJ
$$ -14 3 -28 -44 36 104 -70 110 70 -78 -63 -73 -43 -45 -35 -3 -30 -46 29 -8 -8 23 11 9 23 -3 12 -43 15 1 7 8
5223HKOP0k8l6j68P6R3p2N8l1L2k3L9m9N5j17O8J9n6J6L3QN4j16R6K8j10n3K6
$$ 8 10 16 86 58 22 -146 -70 23 -49 9 -22 10 -13 26 -23 32 -85 -17 2 -54 -38 -5 3 57 -59 37 65 -45 -98 -72
5253g2J29o9p6M8R6Kj2p2J19j68J68j20j7j3J00M5n0n1M6n5MP9q1P9n8n7j00K05
$$ -72 57 -12 -88 -40 56 58 46 -26 93 -75 93 -27 -44 -57 43 88 38 -13 33 -22 -18 61 -20 59 1 -56 -156 49
5281D9j31jO5r1O8nl8m7K36n1m9L5r3J0R5j07R2l3j2k1J21j94O0RO3l5k5J6j8
$$ 49 -82 -83 -18 -109 -41 -46 -84 -131 105 54 5 40 -53 -43 52 -55 37 4 -8 -29 92 -102 -42 -33 30 -5 -30 -14 -32
5310c2l4J4J05R9j73QOK8r2o4K35p6k5q4M9Q3p5N7Jo0o6P4O3j28J08q0J14M7j5
$$ -32 -66 -52 53 152 -21 -13 -7 21 -71 -135 100 24 -1 -85 -36 47 -28 29 30 -30 -96 -22 41 -87 21 -59 55 102 87
5339H7j31O5j1j3r1M2J19n2r4R6r4O3M2j38J83j79P4J7k3j3j5J01J7%j19J3J76
$$ 87 -44 21 10 -3 -94 -52 67 15 -79 17 -77 -14 28 -110 73 -106 -32 -15 -38 -51 -66 35 52 52 -67 -54 122
5366A22j27K9r2K8L7L7oOl1J10q2L3j17J38l4n4P6mN2m2P1k32J17LO3q7J9j3j12
$$ 122 -5 24 -68 -40 -3 34 28 34 3 113 31 64 -53 85 51 -3 73 69 121 79 150 -82 35 38 101 14 33 20 -92
5395i2P2%rm5M5Q0m8Plq1J46pj09j7P2mk1p1J4m9J24j6L7J5k8j3n7R9n5K17j24
$$ -92 -20 -20 -29 -74 -29 51 3 10 7 -74 72 65 -44 -61 11 7 -14 -85 -71 -120 4 -12 25 40 12 -1 -58 41 -14 203 79
5426G9j10J17k3j02M6J86k21K0M0L8j26PJ09j1r2O8j07J10j30J53j02J16j70P6
$$ 79 -31 86 63 -39 7 193 -28 -8 32 70 -56 -49 60 49 -43 25 -82 28 -102 51 -51 65 -105 -29
5450b9k5M3J29q2l5j9J6L5Qo2M7l2m8Q3J1k0p4M3lM6j7mp3j6PP9J8j2o5M6J10
$$ -29 -54 -11 118 36 1 -18 -2 33 41 -21 26 -6 -54 29 40 20 -54 -11 -14 32 15 11 -62 -78 -71 8 26 14 -51 -5 105
5481A05Oq9j37L4R4o0P7p5P0j9n6R8j08J9lj0K5l9LM8K9L3p2k0J50j24k4O0k5
$$ 105 111 22 -115 -81 13 -47 30 -45 25 6 -50 48 -60 -41 -44 -54 -29 -68 -65 -17 12 45 -27 -47 103 -21 -45 15 -10
5510a0Q0k11K71j59l4%J93k51O4J28j2p5k9L8K3N5j05p2O8J01j70j8K29o9p8L1
$$ -10 70 -141 130 -29 -63 -63 130 -121 -57 71 59 -16 -45 -7 16 71 -34 -106 -38 63 -107 -125 104 35 -43 -12
5536a2K7j45J19R8n4k1j3K9O5o7M1n3p5J21o5l5J03L9j39M6j6k0O5j6o0O9L9r1
$$ -12 15 -130 -11 87 33 12 -1 28 93 26 67 14 -61 60 -5 -40 63 102 -37 9 -7 -27 38 22 -38 31 70 -21
5564b1L0L5l8J5J0K6j38J41q2mj2K9J4jO5p1k1qR8r0Q9j28P5P6r0J15q7PJ5N3
$$ -21 9 44 6 21 31 57 -81 60 -22 -26 -38 -9 5 4 69 -2 -23 -31 67 -23 66 -62 13 89 -1 114 27 34 49 102
5594A02j19R7n8k5M8l5N4j5P6j00n2k3O0J2L1n0J7p8K4J5J5K0J0l6q3NQ4o5J00
$$ 102 -17 80 22 -3 45 10 64 49 125 25 -27 -50 10 22 53 3 20 -58 -34 -19 -4 16 26 -10 -93 -88 -4 -69 31
5623C1Q7j02n9O4j6O0j35J76j66J9rPJ40r8m9J22j13NJ2m9K8O6L6j01R7j97J32
$$ 31 118 16 -43 21 5 65 -70 106 -60 -41 -50 -43 97 -1 -50 72 -41 -36 -24 -73 -45 21 57 -44 53 -144 -12
5650a2l8P9jj0m7j6J8rL3m0M0n5K5o1L6J66p3j30J26%p7J7N8J1N2j98O6R3n2K9
$$ -12 -50 29 28 18 -29 -45 -27 -36 -3 -43 -3 -58 -33 -94 -58 108 35 -95 31 31 -46 -29 29 40 92 -106 -40 53 1 30
5680C0n1O1Lo3K2j2L6l4j37J09K8o3l8J90j63P0rJ53j72O0o7nJ35j19%K6P9m0
$$ 30 -21 40 43 -20 2 -10 26 -8 -145 -36 -8 -71 -109 81 -82 -12 -21 132 -40 20 -47 -52 83 -36 -36 -10 69 29
5708B9j15J49j2p1P4j08R5n3RJ19j24k5N4j9N8l9J5r0kR1j17J47j39J29M9j57
$$ 29 -86 63 51 -20 54 -54 41 -12 -3 116 -8 -33 21 2 60 21 36 -54 -56 35 -82 65 -74 55 104 -53
5734e3m3L7K3j29J34o7J45l4ml2p1J09rN3m9Jj2M6K7l9O7j77N6J3P6p9N1o1L2
$$ -53 -96 -59 -36 -165 -31 -98 47 13 9 -23 -94 15 6 59 10 11 -1 45 72 33 100 -77 -21 -8 68 -11 40 -21 11
5763A1L7Kj3J9j47MK9N9lqj0K5M5j9n0J36j84J03qj18L6M4J6j3J4RjM9p7j38K50
$$ 11 48 50 37 56 -91 -87 -58 1 -2 -10 -20 5 50 31 -19 117 -67 36 28 -90 -54 -10 6 -7 7 16 15 64 -13 -151 99
5794I9n9q3J5m1j8O2n8P6l2O8j2K2k9L8k5r2L1m0J52p3L0k8o4lkO4R3j53P7J0
$$ 99 40 -43 -28 -69 -87 -25 -83 -7 -39 29 17 39 10 48 23 -69 -38 -78 74 1 31 3 -61 -64 -66 -2 91 -62 15 25
5824B5j30L4Q8J4rp3J01j08L9O1q4J1K8Q0oj06j11J55L8m4j11P8M2J9k5j9J5j9
$$ 25 -105 -71 17 31 22 -51 50 -58 -19 42 -42 -31 -3 77 71 -35 -146 9 47 3 -108 -30 12 31 6 -13 2 -17
5852a7K7N0j42N0K1L1M6q8l2j4K4L7P6r8MP6o3m5L9P2j7M8j19mnlM1J09j92j4
$$ -17 10 60 -82 -32 -11 20 66 -22 -54 -68 -44 -7 69 -29 -25 51 -12 -57 -18 54 37 85 -34 -38 -43 -46 -5 104 -88 -102
5882a02j9R4j2R3q9j1rJ33q7q4Q8k5L7r6J10K4J0m5QmQ3r9JJ36q24J030L8l37
$$ -102 -121 -27 -39 54 -35 -46 -55 78 -9 -93 -5 -30 7 -89 21 45 55 10 18 14 97 -2 -1 135 -689 341 379 42
5910D2o0K7K4M1k07J49r2l5J33K1K3Ko7P9l4n0KL5R4k11L2J0J19n3J22k04J05
$$ 42 -18 9 33 74 -133 16 -76 -111 22 43 66 68 1 80 46 -4 -2 33 127 -84 -52 -42 77 24 146 -58 47
5937D7j6Q1j12j52J83k7mR3r5l6m2J46l6l7N1K8j22j5K22k63J89m5n8j3P3J07
$$ 47 31 112 0 -152 31 4 0 93 -2 -38 -80 66 30 -7 44 72 -50 -65 157 -106 83 38 -20 -33 40 147
5963A47r8n9QQ3k33J04J72p6q1J11j62P9J2l1N9q7N6k0n4n3J08k7j5J55j12j2
$$ 147 49 -10 -2 81 -152 -48 124 48 -33 78 -84 -5 7 -24 35 -52 4 -16 -70 -123 -15 -42 -57 98 -14 -26
5989b6J1l0K1K0r5O4M0m7R5j75J75l8J3J1kj03Q8Q6j12P3q2qJ36j44MmL4j6m6
$$ -26 -15 -45 -24 -4 -99 -35 5 -42 53 -122 53 15 28 39 37 -66 22 108 -4 69 -13 -21 115 -29 -25 -29 5 -11 -57
6018e7M6p7M3m1P6Q5m7m1Q4j5J3j14JMQ7rq4N1K6q4N8j9J14k1j87R7J0k1NM2j14
$$ -57 -11 -88 -45 -86 -10 75 28 -13 71 56 69 -45 -44 -40 47 38 -46 5 31 -53 5 -14 100 79 -108 -11 -1 -22 -17 25 -89
6049h9J51r3L7QO4o3%J4m0O7r5O2kJ43k62R2j8J0M5J3rj25N0Jr0J05J6j6pj9P
$$ -89 62 -31 6 14 78 15 15 29 -11 56 -39 23 21 164 -98 -6 -24 -14 31 44 35 -90 -40 -39 -129 -24 -8 -24 -31 -50 -43
6080d3j13J24J01o2M3j28P4J38j50J3m8J26j15M2n2J27j51P3N8R6r3J4n8O0o4
$$ -43 -156 -32 69 7 50 -78 -4 134 -16 -3 -51 75 -40 2 -50 77 -74 -1 57 153 60 74 16 76 12
6105A2R1o8J00n1l3n9j0j2L9M2n6J7o9JRK1O7o2n6J92j09J5j2k0qO7n6m9Q0q4
$$ 12 103 35 135 84 51 -8 -18 -30 9 51 -5 12 -57 -56 -47 -26 41 -21 -77 115 6 21 9 -11 -19 48 -8 -57 23 -61
6135f1J14M0j13Jp9J50q7J3J3Pl9N3j9Jr2J32n1J1qK2k5L6m0j5N7K2L2j37J40
$$ -61 53 93 -20 -19 -98 52 -35 -22 -9 -2 -41 12 -7 -6 -98 34 -17 -6 -14 8 -17 19 -21 -36 21 43 75 -62 78
6164G8j66O4N6j16J0n0Q4Q1j9J7JL5k6P7j95J8R7p9J1l7R5j05K3J4N2n1m4M8Q
$$ 78 -88 -24 32 -84 -74 -124 -40 41 22 39 40 75 49 126 -69 -51 46 -33 -22 -59 36 -69 -46 -32 20 -31 -75 -27 -19
6193a9J6J9o9J38j59PN1n2J52q6J3o8P0R6q2l3j4K6K7J2j2Jpqj02J5J08n3j4K5
$$ -19 -3 16 -53 85 -74 -67 -16 -68 84 -2 11 -57 13 109 27 -6 -20 6 33 45 33 34 27 19 -83 -68 40 -13 -27 -2
6223bj03J00O3j71J59r3rQ4r7R1N0k2j06lJ33q2J2K6lk5q0M5NP7k1j80R2M4O7
$$ -2 -105 -5 58 -113 46 -47 -56 28 -69 22 72 50 -56 -59 74 -8 4 30 27 2 -78 -33 -28 49 28 -152 -60 -16 51
6252E1L9r9L5K8o1k3qLl0Q8k8K0l6mn0M4QJ35k1m7j35P7N3j15M7N5m0q5J59n7
$$ 51 90 -9 26 54 -7 -30 -38 -35 -65 23 -5 15 -21 -25 -75 -31 -23 112 91 44 -91 -14 39 -76 -29 26 -14 -99 60 3
6282CL3r0Qk8J01p1m1J16n4N0j51%J36J2j32Q5L5j2Q6j42J22j7j00qQ1n3m%R3
$$ 3 36 -54 -46 -74 27 -44 -85 31 -23 27 -124 -124 12 24 -108 -23 12 0 86 -56 66 49 -51 -59 22 -31 -35 -35 58
6311E8j62O4K4%J36n7q1NL1o7M4k0j88K26o6M8qR8j02mJM9M8j00m9K4O3J32q5
$$ 58 -104 -40 -16 -16 120 63 -18 -13 18 -49 -5 -25 -213 13 -53 -5 -13 85 -17 -21 -20 29 77 -23 -72 -48 15 147 62
6340F2m0j08J77k8j2j86J06k1J25l0l2j06P3k4K1N1j31P2O6j18Q1O7j56L8R7j50
$$ 62 22 -86 91 63 51 -135 -29 -50 75 45 13 -93 -20 -44 -23 28 -103 -31 35 -83 -2 65 -91 -53 44 -106
6366a06ll7J66L1n4k3Q9nn5J7k8O4po9O2j58J61M8j13o2Q4O3L1l6o7L6m7O2k6
$$ -106 -109 -146 20 51 -3 -26 63 58 3 20 -8 56 49 -20 42 -116 45 93 -20 -82 2 65 96 60 -7 29 -18 44 18
6395A8J11q6j31P9oK8NQ5j29qMk7J3N3K6j10L6L0O9j31N6J15j12K9j78J43K2j66
$$ 18 129 43 -88 -9 -15 13 18 103 -26 -34 -30 -57 -44 9 35 -75 -39 -9 60 -71 -15 100 -12 17 -161 -18 4 -162
6423a62R7NQ7Q7j65J44j20m4R2K6l4m9R6j25J23l7k4J14j21o8M9N8l8n5K5N1l4
$$ -162 -65 -60 27 114 -51 93 -27 -71 21 47 13 -36 60 -65 58 21 -3 111 -10 -78 -29 29 -9 -64 -39 12 -22
6450b2O2j41J9L2%K4Q9L3o8l7J04j63J51j4O4k51q6K04k38J66K4R3j45J43n3K2
$$ -22 40 -101 -82 -50 -50 -26 63 96 28 -9 95 -68 83 69 133 -118 -204 0 -238 -72 -48 45 -100 43 -10 12
6476A2Ol9J8l8M1q6J2P5o0j0P7m4J01p9k9R6n4K1r8Q6m4M4m2P1RNl7j0L2M2r3
$$ 12 18 -21 -3 -41 0 -86 -74 1 -59 -69 8 -36 65 -14 -43 53 -1 20 -78 8 -36 8 -34 37 46 51 14 4 36 78 -15
6507a5L0n2O5l4K1p6J36p5Oo4Q2L8r6J46p0l0n2Q4o1NK3k2o0P8q9MO2k1J02j33
$$ -15 15 -37 28 -6 15 -61 75 0 6 -58 24 62 -34 112 42 12 -40 44 -17 -12 11 -11 -71 7 -82 -78 -16 -37 65 -68
6537f8J10k3m2Rl1K8k4MJ31j57J10q8O3n7l2O2Q7o1N4j26Np9K39q2n0O4j11L1
$$ -68 42 19 -23 -14 -45 -17 -41 -37 94 -63 47 -41 22 -35 -67 -5 82 21 75 -51 -46 -125 114 32 -18 46 -65 -34
6565c4j18J65q0N4l7NQ6n2j08P6q9J30Q4O8j21m6j0n5J20L5j9Km3KN7nj55O0j1
$$ -34 -152 13 -67 -13 -50 -45 41 -11 -119 -43 -132 -2 82 150 29 -17 -27 -82 38 73 54 56 13 15 72 67 -88 -28 -39
6594c9K4J7K5P6j67Q6m0K4l5N0J6nJ5R0j96P7o4JJ8J02n6m8j9j8j5P3J3p9P7%
$$ -39 -15 2 27 103 -64 22 -18 6 -29 21 37 32 47 137 -59 18 -46 -45 -27 75 19 -29 -48 -66 -81 -8 5 -74 3 3
6624CM1m2j70R8Q6M9j5j0k8n4nL9l2K3J31n8n0nmq4J61j24N7J7j08J25p4o4j0
$$ 3 44 2 -168 -70 16 65 50 40 12 -42 -47 -8 -40 -17 114 56 6 1 -3 -87 74 -50 7 24 -84 41 -33 -97 -107
6653a07K3K6N1r3J58j02J04p3K2j7OK0Q1j54j5J29j53J7N4P3m4M5n9K7l6M6j03
$$ -107 -84 -58 -7 -100 58 -44 60 -13 9 -8 -2 18 99 -55 -70 59 -94 -77 -23 50 6 51 -8 19 -17 29 -74
6680g4O6M6o6L2j8O8L7r9L6p4M2n3J35l9n4L7n5J00Nn9qk5q6N5J09q4j0m8J47
$$ -74 -8 38 -28 4 -14 54 91 -8 28 -46 -4 -57 78 39 -15 22 -33 67 72 13 5 -20 -106 -51 58 -26 -36 -84 63
6709F3m2pr9L7P7N1j4j46Q9L4M7r6q3J61qm8j39%J80o8q1R2l3Q3j01N4p2N1o0
$$ 63 21 14 -85 -48 29 80 66 -80 9 43 90 -6 -89 72 64 16 -123 -123 57 -11 -92 0 -33 50 -51 3 -69 -18 -78
6738g8O6J8k9l5J5O1p3K2k4L6K7J62p9p4K6m9n9n6R5j7J66M6j88j32J76M8p2n0
$$ -78 -12 6 -23 -58 -43 18 -55 -33 -57 -21 6 168 89 15 41 -8 -67 -123 -28 -45 121 167 -21 -153 23 71 -1 -51
6766e1Q4k2q4L5P1j30J35m5M5q0NN4j36J44p0J1o6J11q7R7j2km8J09q1K8p9J28
$$ -51 33 11 -73 -38 33 -97 38 -7 38 -42 -37 17 -119 25 -45 -34 -100 11 -76 21 9 7 -41 68 -13 15 -64 64
6794F4k6j10J01k3mJ12n5m4l1OL9m0N0j0l0J9L9o8jK1nkk3j3N8k3K5J33j80n4
$$ 64 38 -72 29 6 2 114 59 15 -16 -10 29 -11 39 29 -1 18 57 -11 -12 9 4 2 -21 -34 24 1 26 159 -21 -75
6824g5J00m6K6L3L5q0J5P3m6n5Q3j04O7l1L2k9j6R6m5j9QL6j27J03l9%k1rl1M2
$$ -75 25 -21 5 38 73 -7 8 81 35 -20 63 -41 26 -5 27 -2 -18 78 33 14 22 58 -69 34 -5 -5 -26 -35 -66 -24
6854b4QN9q7J01k2l3o4J01m6Nj17J68j03J27n4j0K0M8Kj39P5k0j05Q8KK3Pk6J1
$$ -24 -16 43 -44 57 35 2 -62 39 -7 -2 -119 49 -54 73 19 9 29 77 79 -60 15 -5 -110 -22 -20 3 10 -16 -5
6883eJ5lpj0l2m0M3J43q9J5p2J69q1m6p5n8r3J62J04l8o3O2j29J56J3K3o4l2J7
$$ -5 10 7 0 -10 -42 -82 -39 104 15 30 -42 127 46 0 -75 -133 -226 -64 40 2 -61 1 -128 28 41 64 0 -32 -15
6912a5K1k0Q5l0k8l1Q3ol2r%m7O2R6j22L9K4j10M1j8jM3m9L9o6K3p4L9J9O4m2
$$ -15 6 -14 71 41 13 -18 65 59 27 18 18 -29 33 129 7 46 70 -40 1 -17 -18 25 -24 15 -51 -28 -102 -63 -44 20 -22
6943b2j3j02M3L5J67j06p9L9rK4k2N4rk5P5O5j41J6J00K7r0m1j1Q8M0j50N3QJ10
$$ -22 -35 -137 -94 -59 108 2 -77 -38 -47 -23 -45 9 0 -25 50 115 -26 -10 90 117 27 -14 -25 63 103 -47 6 14 124
6972A24j16K7j02N9Q0p4Ml4P4K0k10J74n3k7N8k7L2Ll4k0m2OP4L5k7j7l9K3R9
$$ 124 8 35 -67 -8 72 -2 2 -32 42 62 -148 26 -27 -54 4 -23 9 12 -22 -42 -84 -78 -4 31 4 -13 -52 -29 70
7001G0%o4q1M1J35j8r1m8j8J30n6J8M0L0J0n5m9p4J50j42nJ53j17L7P3j16L0K
$$ 70 70 6 -75 -34 101 83 -8 -56 -74 56 0 18 58 88 98 43 -6 -80 70 -72 -77 76 -41 -4 69 -47 -17 -15
7029a5J04k18O6Q2p8P9J8q1QL9J4o2P8Rp1qrR8j58J55pj80J68o7m9P2nK6j28J03
$$ -15 89 -129 -63 19 -59 20 38 -43 -35 4 18 -44 34 43 -28 -36 -45 53 -105 50 43 -137 31 -36 -85 -13 -18 8 -120 -17
7059a7L8j0j05J36r9pJ8J12j68P3L4P8j78N2m3J3R7J7j3p0J1P6L9j67J50q0Kj8
$$ -17 21 11 -94 42 -57 -64 -46 66 -102 -29 5 83 -95 -43 -86 -73 24 41 28 -42 -31 45 84 -83 67 -13 -11 -29
7087b9m6k7J68l3J8%j30J10q0M8J08r4J27j53K8L2q7O9N1r6K5K9o8Oj3l4M8o8
$$ -29 -75 -102 66 33 51 51 -79 31 -49 -1 107 13 140 -13 15 47 -40 29 80 -16 9 38 -30 -24 -37 -71 -23 -91
7115i1J8J04q2oQ8LMj35J46p8J19q8N6j50K6J21M7o1n0j3k4m9P7P4m3N1k8q7p9
$$ -91 -73 31 -51 -57 31 34 38 -97 49 -29 90 2 58 -92 -66 55 102 41 -9 -22 -46 -95 -18 56 13 64 36 -51 -130
7144a30K6N91m11j90K06j09J27j29k7l9J94j45P6j17P2j12J63j69K45J17j78O0
$$ -130 -104 487 76 -114 92 -17 110 -19 -46 -85 109 -36 40 -77 -5 -117 46 -123 122 239 61 121
7166A21j77l9N9RjJ9J40q6Jj7R1m8l7L5p4N2n3Nm1J72k12K7J35q8j77O6J29J8
$$ 121 -56 -95 -36 -27 -28 -9 131 45 46 29 120 72 35 70 -4 48 -5 0 -41 131 -81 -54 81 -7 -184 -118 11 29
7194B9Rj12K3Q6K3r8J24n2M1j78R7K9j22J35j46J36M6L0%m8j1M4j17O9J2j35M0
$$ 29 38 -74 -51 35 58 -40 84 32 73 -105 -8 21 -101 34 -112 24 70 100 100 52 41 85 -32 37 49 -86 -46
7221d6J50j07k4J53j68Kk8N0J16j53J19l3j08N4L5nj6n4M3K9L2o6K7rj04K16o5
$$ -46 104 -3 -27 126 -42 -40 -68 -18 98 -55 64 31 -77 -23 12 7 -9 -63 -20 9 41 -25 2 -7 -111 105 40
7248D0j00J31j3n6M7P5j13K3m8nPN3p4m2J21J01p3r0K3m7K1p8Q4kk6J08j25j8
$$ 40 -60 71 58 2 49 124 11 34 -14 -19 -12 41 -33 -75 46 147 74 -16 7 -40 -19 -97 -13 -15 -41 67 -58 -76
7276g6nO4m4J25O5k3n9j9j28J04j4N2r5J4o7J36r7J13J70k89j1R9J0j07J39o6
$$ -76 -81 -17 -61 64 129 106 47 28 -100 4 -10 42 -53 -39 -106 30 -67 46 216 -73 -84 15 25 -82 57 -9
7302iJ38j95P4k28K15p4L6%L8k4N8Q4j18r8J40o1j3K5j15J82m0k1k0R7k1j28J95
$$ -9 129 -66 8 -220 -5 -79 -43 -43 -5 -29 29 113 -5 -103 37 -24 -37 -12 -127 55 15 -6 -26 71 50 -78 117
7329A17k2k6q9Pj7K7N9j12JQ7m0k8R0j50J55m0l9J82j19r9O1j32O5L8O6l8Q0P9
$$ 117 95 69 -20 -13 -30 -3 56 -56 -55 32 -8 -36 54 -96 59 19 -20 162 43 -56 5 -127 -62 -24 42 4 84 163
7357A63j76O9r4k9P1J1l8Q5L2j02p6P0Qm8J74j33J09o9L9r0P1j29N3K4J7L2m7
$$ 163 -13 56 -38 -67 4 15 -23 62 94 -8 -84 -14 -6 -54 120 -13 96 27 66 -24 47 -82 -29 -5 12 44 -3
7384cj18J63o8j7R2oo0O6j20%J30jj92J08Kl6J16J6n3q9P6%j0M7l8n0P0l1o7O9
$$ -3 -121 42 -26 -43 49 43 -17 49 -71 -71 59 58 -134 -26 -24 -60 56 72 19 -70 6 6 -4 43 5 -45 25 -6 -73 -4
7414dK4j15J26m3pM9l2Kj02N4kN9R8r7J7N5j32j07K15q3J5J7n7l8Q2n7l0k8L5
$$ -4 20 -95 31 -12 -19 30 -2 0 -102 -48 -50 9 107 10 27 82 -50 -157 58 -25 -10 7 -50 -88 -6 -63 -93 -121 -86
7443h6Q4O9j00K1J8k4Jl3J23qr4nNO1j6O1n6r1K6R2o1M6N1q2o8P0m0O9j1k2m1
$$ -86 -2 67 -33 -12 6 -18 -17 -50 73 65 -29 -34 -29 32 16 77 21 -70 -44 48 -13 33 84 2 -66 4 -36 33 22 0 -41
7474d1L2NL6p8q2J48j2m7M6m4M3Q4j22L1m6n5M5J32j17j7L7M3J6j08j7P8m9J8
$$ -41 -9 -4 32 -46 -128 20 8 -39 7 -37 6 90 -32 -1 -47 -102 -57 75 -42 -59 -22 21 37 -71 -88 -10 -59 -41
7502d1L2J8N1m8o2m2N9J8K7O3j26O0L3n2K5M9K9j06qO8q0oQ6j8j08J18j90Q6R2
$$ -41 -9 9 60 12 -50 -92 -33 -15 12 75 -51 9 42 -10 15 64 93 -13 -21 47 -33 -39 47 29 -79 39 -151 -65 27
7531B7J5j2Po4r8K52q8m4j3J30n4p9O7p5Q1m1j0K9LLk4P0o5k6j0O6q4O8p3L8j5
$$ 27 42 30 37 -27 -125 127 39 -5 -18 112 58 -21 46 -29 52 11 1 30 33 36 12 82 17 -9 -19 47 -37 31 -42 -4 -19
7562a9P2q0Q3n2JJ3J12j84P0p1pN7OL0p4J24j11k7mN9L8r0R5l6k1M7q2J08k0j06
$$ -19 53 -27 56 4 5 18 130 -54 16 -55 -62 -5 1 31 -43 81 -30 -57 -61 -2 36 -54 41 5 -16 31 -51 57 37 -69
7592f9R6ln8J5R9J1j49R0q4O6m6LP7q9N1o5Q1p8J09j2M1j15M1O1r6r8K08j83J33
$$ -69 27 24 -34 -19 80 91 -58 32 -52 14 -32 -29 48 -41 10 -55 26 -52 57 45 86 -29 12 73 -23 -121 87 -96 37
7621C7O7m2o3R5k24J12j0K1N0K0K1j12L9J0O5j03m9R3J5n4qJ1Mj7K8p3Rk9J68
$$ 37 104 62 -1 94 -130 -18 -28 -7 43 63 84 -28 11 21 86 -17 -66 27 42 -12 -20 -9 -5 -22 6 -67 -58 -87 81
7650H1%j76O1K4p8O5m1P4o2j6k2J42J4q2K9P3o0k1J5j20J65j9m2O1l0L1r4j4j5
$$ 81 81 -95 -34 -10 -88 -23 -64 10 -52 -68 -90 52 66 -16 13 86 26 5 20 -100 65 46 4 65 35 66 -28 -42 -57
7679e7Q9l0M4p0K8J5q9J71j6q3k4K6J36j79k9J04j05qN9P8n4K1Jq0J17q3l9Q3
$$ -57 32 2 46 -24 4 19 -70 101 85 2 -22 4 140 -39 -68 36 -69 -77 -18 60 6 27 28 -52 65 -18 -57 26
7707B6k5P6l6K7q5m3p4R0P2n1J28j20L0j71K03j12J30j59P5R6j67Q8lp5qO8Q1
$$ 26 1 77 41 68 -17 -60 -134 -44 28 -23 105 -15 15 -156 47 -65 65 -94 -19 77 -90 -2 -5 -80 -88 -20 61
7734F1n5p6O8n1J61o3r8R4n3j09O4J0J04j6jo0Ro1J28n1j46J66o7N7J2O4j00l5
$$ 61 6 -70 -2 -53 108 45 -53 41 -12 -121 -57 -47 57 41 40 -20 -11 -72 56 5 -141 25 -42 15 27 91 -9 -44
7762d4M1q7J99k5j03M3p8Mq7J34j23J83n8J8N2Rj06L6ok9qO1p5N3k6J07l5l1N
$$ -44 -3 -90 109 84 -19 24 -54 -50 -137 -3 -126 57 -1 17 69 78 -28 8 2 -27 -35 26 -49 4 -22 85 50 19 24
7791B4L8l9J7m3m1l5m0J39k1l4N0J02k2L1m5J5o0q5J57p3L7o7pm0pL8O0o7J3J04
$$ 24 62 23 40 -3 -44 -79 -119 20 -1 -35 15 117 95 126 81 96 36 -49 108 35 72 5 -2 -42 -49 -11 49 -18 -5 99
7821I9j44J9N2Qn1pK0k2O1O6j35O1j05L8L2P8r3Q6q1N3o8K3nK0O8o1p6J78j23
$$ 99 -45 -26 26 34 -17 -24 -4 -26 35 101 -34 27 -78 -40 -8 70 -23 63 -18 35 -33 -10 -15 5 73 12 -64 114 -9
7850iql5%q5J22Jm3R9j8jL4k7r0J41k23J84n9m5R7j6m3o3J11p7M8k0j5K4L2N6
$$ -9 -17 -52 -52 -137 -15 -14 -57 42 24 23 57 30 -60 81 -142 42 -17 -62 35 19 -24 -87 24 -53 -5 -25 -40 -16 16 72
7880G2k1Rm8M7q9L9j3J07j89M8J05r7N4O3l2Rj38J53m3m0K9Rk6k5J5j43K34j02
$$ 72 51 60 12 59 -30 9 -4 103 -86 -38 67 -30 24 87 55 64 -74 79 36 -4 25 34 8 -17 -2 -145 89 -13
7908a3l2K6L7J10j30k2K2P2L3p1j03J07q8J2P9j52J05PO2K0p5N9o9O9j81J2K73
$$ -13 -45 -19 18 128 -2 -24 -2 70 103 32 -71 36 -52 -40 39 -113 -8 -1 61 81 6 65 -4 65 -116 -104 169
7935A69k46J02O1m4o8M8k4k5jjR0o4N0Q4j08j06N5K2M0K1p2RM1j01O3L2j17J20
$$ 169 -77 25 86 42 -26 22 -2 -27 -28 -29 61 -3 47 131 23 -83 -28 -6 34 55 -17 -8 33 -68 -5 27 -90 30
7963C0J5m9o7PM1N5N8j5j08O9L2mp5j9K6j6J07L2m9q8J7m0K7j7J4P8q2M0R2N3
$$ 30 45 -4 -71 -64 -23 32 90 75 -33 36 68 64 -11 -30 -4 -20 87 119 70 -18 -1 -41 -14 -31 -17 61 -21 19 111 164
7993A64j63p0J50k6n6J38m0L09p62M87J30m92J91p5L6j47L87j43R9P6%j55j40
$$ 164 1 -69 81 55 -1 137 97 406 -356 131 261 -231 -40 -115 -79 -226 161 18 117 193 193 38 -102
8016a02J23p3p8p3L00J5n9j85K15j00L9Q5r6j83K42K0mJ34l20K87q1l90N50k68
$$ -102 21 -52 -130 -203 97 112 53 -132 83 -17 22 107 11 -172 70 90 86 220 -100 187 106 -284 266 -2
8040bL35j01m35J22r4K95m86P81k98j81o9K73n5k29P45k03M90p28l93L69K12r71
$$ -2 333 232 -203 -81 -175 120 -366 415 117 -64 -133 140 85 -144 601 398 888 160 -233 136 348 -623
8062f23R93j17k22o05K59j71Q61L46j066M21n59J058k17m36n46L32M65k45j09
$$ -623 370 253 31 -574 -315 -486 375 721 -345 76 -483 575 358 -78 -624 -292 173 -72 -181
8081a81K19J49q39M24r3N78Ol21K35J14l95N54n10k72K48K37K96o96R8N76k93
$$ -181 38 187 -652 -228 -321 257 263 -58 177 291 -104 450 -60 -332 -84 153 449 -247 -149 427 134
8102A34l64N25n81M52l22Q0q5K90j66O8p6N6q1J52j29j4M4j9P1r3J00q7O9l2P9
$$ 134 -230 295 -286 166 -156 -76 -161 129 -37 31 -45 11 -70 82 -47 -61 -17 -36 35 -58 42 -45 24 -8 71
8127G1j42pl4J18J09q7P0j12K8N2LL5n4k1o8J36l5j13n0j5O9j15P1J07o6L7j6
$$ 71 -71 -78 -112 6 115 28 98 -14 14 66 69 104 50 29 -39 97 62 -51 -101 -116 -47 -162 -91 16 -50 -13 -29
8154b9J59j40jm4M6k3J00Ml8l3L2j12K8R8Mj16j8l2J26q8P8J09j08qK9o1M1Qj8
$$ -29 130 -10 -11 -55 -9 -32 68 72 34 1 33 -79 -51 47 51 -65 -83 -115 11 -77 1 110 2 -6 23 -38 3 11 -7
8183gM8J6j24N6R1q7N7o3
$$ -7 41 57 -67 -11 80 -7 50 -13
8191a3
$$ Imaginary data points
##PAGE= N=2
##DATA TABLE= (X++(I..I)), XYDATA
0@%%%%%%%%%%%%%%%%Qj6J6j6J6j7K5l2L2m0M8n6O5p3Q8r9J09j23J40j61J82k02
$$ 0 0 0 0 0 0 0 0 0 0 0 0 0 0 0 0 0 8 -8 8 -8 8 -9 16 -16 16 -24 24 -32 33 -40 48 -51 58 -65 75 -86 96 -106
38a06K26k51K78l10L45l84M25m67N15n70O29o92P62q41R25j020J129j248J384
$$ -106 120 -131 147 -163 182 -202 223 -244 271 -299 330 -362 400 -441 484 -536 593 -655 729
57G29j542J724j939K195k509K904l414M109n112O689r553J6354o2671m6311J45858
$$ 729 -813 911 -1028 1167 -1342 1562 -1852 2257 -2855 3834 -5719 10635 -52036 -98347 47511
72D7511L4319q8919n6280O5505M4205m0309m2240K6961K5708r77n306n953k5122
$$ 47511 81830 -7089 -63369 2136 46341 6032 -36208 -9247 16461 15484 10178 4225 -20897
85b0897r910L2753L8054k3639m3800O302L0702k856j4636M748J0761l876j737
$$ -20897 -30807 1946 40000 16361 -27439 -21137 9565 6709 -7927 -3179 7582 3706 1969
98A969O672j5076k2736K8728M4805k0811n6865k02M9448J1347l7633q137K9704
$$ 1969 8641 -6435 -29171 -443 44362 23551 -33314 -33516 15932 27279 -10354 -18491 11213
111A1213K811k4068m785J1887M421J286R611j307k5246q672L0875J5009k5284
$$ 11213 14024 -10044 -14829 -2942 1479 2765 12376 11069 -14177 -22849 8026 23035 -2249
124b249r957K3989L548l4198o327M3552J1445m4639j1316M1037O523m3738r144
$$ -2249 -12206 11783 15331 -18867 -25194 18358 29803 -14836 -26152 14885 21408 -22330 -31474
137c1474M8388K0157m2625k5068K8612J8376j6485o110J5581O55j8286K02J6806
$$ -31474 16914 37071 -5554 -30622 -2010 16366 -119 -6229 9352 10007 -8279 -8077 8729
150H729o304j6547J4969K2015j8018l1310R448L3406q93k6747K175J9709o564
$$ 8729 2425 -14122 847 22862 4844 -26466 -17018 16388 15495 -11252 -9077 10632 4068
163D068j6676P130J5001k829p381L649n24j1082K286J5621l10j3487L82Q393n852
$$ 4068 -12608 -5478 9523 6694 -687 2962 2438 -8644 -6358 9263 8953 -4534 -4152 4241 -1611
178a611j0828R215J6615p546j7690O193J4175q747j1855J4878J6385j6112k1285
$$ -1611 -12439 -3224 13391 5845 -11845 -5652 8523 -224 -12079 2799 19184 3072 -18213
191a8213J4573K1508j5469j9870J7992K1824j8307k7662J0533K7943j685k1000
$$ -18213 -3640 17868 2399 -17471 521 22345 4038 -23624 -13091 14852 13167 -7833
203g833k608J1772L368m803l557k67M813Q481M52j5441j1492J6286K1505j0783
$$ -7833 -10441 1331 4699 -104 -3661 -3928 885 9366 9818 -5623 -17115 -829 20676 9893
217I893k4946L609K2640r07k2303p09K1929K308j7980k490J0535m06o234O574
$$ 9893 -15053 -11444 11196 10289 -12014 -12723 9206 11514 -6466 -8956 1579 1173 -5061 1513
231A513R353q290j3438O543J3346l307r265Q51O581L59o635l007K726K806M335
$$ 1513 10866 2576 -10862 -4319 9027 5720 -3545 -2694 3887 4246 -2389 -5396 -2670 136 4471
246D471J166j0337p446R760J2812m831j4641K970J6827l179j7509K480J6090J174
$$ 4471 5637 -4700 -12146 -2386 10426 5595 -9046 -6076 10751 7572 -9937 -7457 8633 9807
260I807j2113l662P830L60p279L616P245m766o652J910N214l05m863K450O334
$$ 9807 -2306 -5968 1862 2222 -5057 -1441 5804 1038 -5614 -3704 1510 1205 -3658 -1208 5126
275E126l102n453K001K611J37O74J693j195o614k51Q991p05r048J977P686j876
$$ 5126 2024 -3429 -1428 1183 1320 1994 3687 2492 -4122 -4373 4618 3913 -5135 -3158 4528 2652
291B652q700r91R628K817p115o03L680j960j024K813K404j520l914K246L843n507
$$ 2652 -6048 -7039 2589 5406 -1709 -2312 1368 -592 -1616 1197 3601 2081 -1833 413 4256 -1251
307a251m145O152M907l822p437N18P567r29n197L100K874k664j072Q45J018n0
$$ -1251 -5396 756 5663 1841 -5596 -5078 2489 1560 -3637 -537 2337 -327 -1399 -554 464 414
323D14O25K913j999n430K432L903k082j409P18P13j133l471J785M228k302k425
$$ 414 1039 3952 1953 -3477 -1045 2858 776 -633 85 798 -335 -3806 -2021 2207 -95 -2520
339b520K602J503j905l192K597O477k339o488K469M122j993k885O71L445m54m385
$$ -2520 82 1585 -320 -3512 -915 5562 3223 -3265 -796 3326 1333 -1552 -881 2564 2110 -2275
355b275j00J628j35J476k81k125Q74Q60j45r6l81K110J964k882k048J467J716
$$ -2275 -2375 -747 -882 594 313 -1812 -938 -78 -223 -319 -700 1410 3374 492 -1556 -89 1627
372A627M93k043q15K295j969k892K835K103k262k016J500L015j857l844K518M611
$$ 1627 2120 77 -738 1557 -412 -3304 -469 1634 -628 -2644 -1144 1871 14 -3830 -1312 3299
388C299j84k747k694R83M265P07l728j964J391L260o12m741j284L771L312j221
$$ 3299 3115 368 -2326 -1343 2922 3629 -99 -2063 -672 2588 1976 -2765 -4049 -278 3034 1813
404A813n218j717N282L234k389k347K12J789J426m78j273j451O95L585J57n025
$$ 1813 -3405 -5122 160 3394 1005 -1342 -1130 659 2085 1607 334 -1117 -422 3163 3320 -1705
420a705k409K826L946J06m857k913L906L933j752l876K88M282J300l181j206J417
$$ -1705 -4114 -1288 2658 2764 -2093 -5006 -1100 2833 1081 -2795 -2507 1775 3075 -106 -1312 105
436A05J115M88j10q43p30j185O0K355O26l034k461K071L526q40m223K02M106R94
$$ 105 1220 1708 1598 755 25 -1160 -1100 1255 1881 -1153 -3614 -1543 1983 1143 -3080 -2878 1228 2222
454B222j792j089k80P74J775J547p90m376j824N141M417m034p655K85R283L331
$$ 2222 430 -659 -939 -165 1610 3157 2367 -2009 -3833 1308 5725 1691 -5964 -5679 3604 6935
470F935r637o688P134Q911j759q605k789O606N395j604m597l101K587N572N91
$$ 6935 -2702 -9390 -2256 6655 4896 -3709 -6498 108 5503 3899 -698 -3799 -1212 4360 4951
485D951n474m822J822Q159J970r279o789O399R733r27j0872l040R429N399m762
$$ 4951 -523 -5345 -3523 4636 6606 -2673 -9462 -3063 6670 5743 -5129 -8169 1260 6659 1897
500A897n693N36N607K683l850k940L44J161K146Q46k625l360q18N361L642o496
$$ 1897 -3796 -3260 2347 5030 1180 -1760 -1416 -255 1891 2737 112 -3248 -4066 1295 4937 -1559
516a559n212N492O289k588o886M04Q096R10p353o40O276J056o173k785P489M179
$$ -1559 -6771 -1279 5010 2422 -4464 -4060 4036 4946 -2407 -3047 3229 4285 -1888 -4673 2816 6995
532F995r205o016Q224P033n638q946K688R900p35p795o10M258K527l51k058p82
$$ 6995 -2210 -8226 -2 7031 1393 -7553 -4865 5035 4300 -3495 -4105 153 2680 2329 271 -511
548e11o48K47M605J210p166l811N838O934l216j0751k60J1484L236q282o399L325
$$ -511 -1159 -912 3693 4903 -2263 -6074 -236 6698 3482 -7269 -7529 3955 7191 -1091 -7490 -4165
564d165Q762J308p266l334L513M609J053m294l150J785K573K130j139o190j469
$$ -4165 4597 5905 -1361 -4695 -1182 3427 4480 186 -2964 -1179 1394 3524 2385 -3805 -5274
579e274O392M457m207q168R81J0267J767r095l628O358O391l620p443K783O902
$$ -5274 1118 5575 1368 -6800 -5819 4448 6215 -2880 -6508 -150 6241 2621 -4822 -2039 4863
594D863k283n002J666L636j557m828J867N356k873n277K194M214o22l117o32L006
$$ 4863 2580 -2422 -756 2880 1323 -3505 -1638 3718 845 -4432 -2238 1976 1354 -1763 -2395 611
610F11Q54k133J149J294k322p54K709K298k784m922K256O014j413n852j290L986
$$ 611 1465 -668 481 1775 -547 -1301 1408 3706 922 -4000 -1744 4270 2857 -2995 -4285 -299
626b99L665k250m635L68L476K382r43l994o00M053K238j406k852j536K373L205
$$ -299 3366 1116 -3519 -3151 325 2707 1764 -2230 -2830 1223 3461 2055 -797 -2333 40 3245
642C245q52l336l109K545N464j364n914j987M966N221k752p230Q61P307J717n382
$$ 3245 2393 -943 -4052 -1507 3957 2593 -3321 -5308 -342 4879 2127 -5103 -4242 3065 4782 -600
658f00l088L338M101j681l019o8Q98Q23P05j246k048j6J923J317j728k170J424
$$ -600 -3688 -350 3751 2070 -949 -1017 -119 704 1409 163 -1885 -1901 22 1339 -389 -2559 -1135
675a135K649q04j380j73J359P50n87k23M34p88m43J526K15j904j002J317J191
$$ -1135 1514 710 -670 -843 516 1266 679 456 890 102 -341 1185 1400 -504 -1506 -189 1002
692A002j409j615J282J309p50n66J10L60Q75N4n64O5L40M06m1j000J81O65l06
$$ 1002 -407 -2022 -740 569 -181 -747 -637 -277 598 652 88 153 493 899 858 -142 39 704 398
711C98q54j85N30M04j063q00J451N43j369k00J383O78q82q33J388J233j332p86
$$ 398 -456 -641 -111 293 -770 -1570 -119 424 -945 -1145 238 916 34 -799 589 1822 490 -296
729b96P46L50O4q58q43N68M56j59l85r01N36J197o54o86R4P80J432p06j786J118
$$ -296 450 800 864 6 -837 -269 187 28 -357 -1258 -722 475 -179 -865 -771 9 1441 735 -1051 67
749F7J488n63q89l69Q24L96j251j39M30m78J39M13q54N9L07RO11j93k32O78j99
$$ 67 1555 992 103 -266 558 954 -297 -436 -6 -484 -345 68 -786 -727 -420 -411 200 7 -225 453 254
770B54R5O34o57J11P3k34M59l96j319P54N55o79k87k48N55M10q92M32P03p04M85
$$ 254 349 983 326 437 510 276 735 339 -980 -226 329 -350 -637 -885 -330 80 -812 -380 323 -381 104
791A04P83o91J88N6q4P40q28o21P67l63k59K11q59M05J42n22P12n0r17J141N39
$$ 104 887 196 384 440 356 1096 268 -353 414 51 -208 3 -856 -451 -309 -831 -119 -169 -1086 55 594
812E94o31r0k7R56O84j683q8J173k96k93m48n30Q59o9n67j47n37P62R93j141l57
$$ 594 -37 -127 -154 802 1486 -197 -285 888 592 299 -149 -679 180 111 -456 -603 -1140 -378 615 -526 -883
833h83O45N39N95q62q53J576P05j167l77k6N18J82r85n7L34r02P33O17j200n1
$$ -883 -238 301 896 34 -819 757 1462 295 -82 -108 410 592 -393 -450 -116 -1018 -285 332 -868 -919
853i19N98L41M54j027r1J242N6k50J18n21L59M91n47j02n41m05J268k10j402M2
$$ -919 -321 20 474 -553 -644 598 654 404 522 1 360 851 304 202 -339 -744 524 314 -1088 -1046
873a046O66N80l85p49P64O90q92M97P86n97m53L46Q48j11j478j29J338p3r53l00
$$ -1046 -380 200 -185 -934 -170 520 -372 125 911 314 -139 207 1055 944 -534 -663 675 602 -351 -651
893f51j49P08R0l31j9l07k07J547L63j414m86J114J362p58j508M39J160l73m44
$$ -651 -800 -92 -2 -333 -352 -659 -866 681 1044 -370 -856 258 1620 862 -646 -207 953 580 136
912A36k66o15J74Q51J28j077j108J248J680q79j697P40J674P5j183k25J210n3
$$ 136 -130 -745 -571 280 408 -669 -1777 -529 1151 272 -1425 -685 989 1064 -119 -344 866 813
930H13j185Q24Q24j465j078J362J285j283k050J020J933r10j580Q66J261n86o08
$$ 813 -372 452 1276 -189 -1267 95 1380 97 -1953 -933 1000 90 -1490 -624 637 51 -557
947e57R30P50j250p45J784J102j888j592J259J731m86k299k18J560N86p56p58
$$ -557 373 1123 -127 -872 912 2014 126 -1466 -207 1524 1038 -1261 -1479 81 667 -89 -847
964h47l33N41J474j1j220q17J191J711o99j572L69N20L26M49o95j539j34J906
$$ -847 -1180 -639 835 824 -396 -1213 -22 1689 990 -582 -213 307 633 1082 387 -1152 -1286 620
982F20J323k428k926K425L571j367l769j38M216R99l187j080K909M25j860J11
$$ 620 1943 -485 -3411 -986 2585 1218 -2551 -2689 1527 2526 -661 -1741 1168 1593 -267 -156
998a56J372o17k156R65L031j826l822J744L608j052l312q2L530O35l093j87K717
$$ -156 1216 599 -1557 -592 2439 613 -3209 -1465 2143 1091 -2221 -2303 1227 1862 -1231 -1418 1299
1015A299r4j598j4J507J39j979K9K090l55j974O0J026L60o77p86L15L97J73N91
$$ 1299 1205 -393 -407 1100 1239 -740 -711 1379 1024 -950 -890 136 496 -181 -967 -652 -255 -82 509
1034E09p56q18J415M66m40k25J2K22j35j12R47p63k130J210K492j155k936l3L532
$$ 509 -247 -1065 350 816 376 151 163 385 250 138 1085 322 -1808 -598 1894 739 -2197 -2230 1302
1053A302J167m062j447L871J613k813j418K061J656j869j090K577l02k746O40
$$ 1302 2469 -1593 -3040 831 2444 -369 -1787 274 1930 61 -1029 1548 1246 -1500 -860
1068h60K749n79l288k65L855M61m085o27L459R41k290j310J831J681j932m58J810
$$ -860 1889 1310 -1978 -2243 1612 2073 -2012 -2639 820 1761 -529 -1839 -8 1673 -259 -717 1093
1085A093l03j288N88Q66l54j411P8J829q53j511Q73P15o84k01L47L53l84j71R03
$$ 1093 790 -498 90 956 602 -809 -731 1098 245 -1266 -393 322 -362 -563 -216 137 -247 -418 485
1104D85Q0j217Q23J031r92p35P92Q63p70j775J275J705j804j846J725J684j203
$$ 485 565 -652 171 1202 210 -525 267 1130 360 -1415 -140 1565 -239 -2085 -360 1324 121
1121A21j862J020K245j198j878J765J164j574n85J412Q32j752j046K313O87k623
$$ 121 -1741 -721 1524 326 -1552 213 1377 -197 -782 630 1462 -290 -1336 977 1664 -959
1137i59o20K137P00k018r94J756J261j938n45J827K47j416K9J488Qj571O6J986
$$ -959 -1579 558 1258 -760 -1754 2 1263 -675 -1220 607 854 -562 -533 955 963 -608 -542 1444
1155A444n95j883N39J431n32j531N11J271o02j288R50R27j025m28R90N73q66m25
$$ 1444 849 -1034 -495 936 404 -1127 -616 655 53 -1235 -285 642 -383 -811 179 752 -114 -539
1173e39J237L63j414l30J498K58j613l25J543J77j674k16J351R2j427L02J394
$$ -539 698 1061 -353 -683 815 1073 -540 -865 678 855 -819 -1035 316 408 -1019 -717 677
1190F77n17r75P64J091o10j161Q53J209r80j201J117R09j246q78Q23J003j266
$$ 677 160 -815 -51 1040 430 -731 122 1331 351 -850 267 1176 -70 -948 -125 878 -388
1207c88r40J328O78j324m17J326N93j227n20J491O46j491l69J479r2j305J89R38
$$ -388 -1328 0 678 -646 -1063 263 856 -371 -891 600 1246 -245 -614 865 773 -532 -343 595
1225E95j06j281K41J168m67j301N89J246o06p24J84J194k26j066O32R39r19n79
$$ 595 489 -792 -551 617 150 -1151 -562 684 78 -646 -462 732 506 -560 72 1011 92 -487
1243d87Q58M77r26o67R38O55j330m62J189J83j009j58R27J79q07j35J135j08j004
$$ -487 371 848 -78 -745 193 848 -482 -944 245 428 -581 -739 188 367 -440 -575 560 452 -552
1262e52N47P29l41o59J14R49k24j333N23R06p11q06O07O80m34r84N95J162q83
$$ -552 -5 724 383 -276 -162 787 563 -770 -247 659 -52 -858 -251 429 -5 -989 -394 768 -115
1281a15n44J087K79o77k53M89M88o64n30R41K3r84Q5O06o9p28k38J051K00j228
$$ -115 -659 428 707 30 -223 266 754 90 -440 501 524 -460 -375 231 162 -566 -804 247 447 -781
1301g81K73R16j64n14P1P60L5r60L40R40p42o17M75M63m87n16J36P07m29o88Q38
$$ -781 -508 408 244 -270 -199 561 596 -364 -24 916 174 -443 32 495 8 -508 -372 335 -94 -782 56
1322E6J28m63J00K00J98j0n18P51K00q17J53N43l80k98o1M04J64r58J04P89m94
$$ 56 184 -279 -179 21 219 209 -309 442 642 -175 -22 521 141 -157 -218 186 350 -608 -504 285 -209
1343b09l93L81K75n4k85K32N60l25n34Q36J61o98q9K76L83m58o65O12M90q56r7
$$ -209 -602 -221 54 0 -285 -53 507 182 -352 484 645 -53 -142 134 517 59 -606 6 496 -360 -457
1364d57L49J54j87m20N42M69o88p0N90R3l15m4J74L16m28k28L80j10l29Q3O1j24
$$ -457 -108 46 -141 -561 -19 450 -238 -308 282 375 60 16 190 506 78 -150 230 120 -209 -126 -65 -189
1386a89m4K2J98L1k82R0L17j36J18L6mJ5kJ07N5m51P5M31k39l59l8K87jk54j98
$$ -189 -233 -211 -13 18 -264 -174 143 7 125 161 157 172 170 277 332 -119 -44 387 148 -211 -249 38 37 -217 -415
1411d15K32Q8n2J1L17n4o6N5J79P6l29o3L56n3k77l12K69R8j25l49J52J19O6k11
$$ -415 -183 -95 -147 -136 181 127 61 116 295 371 42 -21 335 282 5 -307 -38 60 -65 -414 -262 -143 -77 -288
1435b88J26K19j5l2Q4K15K3l72J23J68J59n04j6J53J41j84j51l8J43l1j57j4K74
$$ -288 -162 57 42 10 94 309 332 -40 83 251 410 -94 -110 43 184 0 -151 -189 -46 -77 -234 -248 26
1458B6j0q2J65lO9j46jL29P2l95q0K72K5l94k21K36M15m28l31J52L36J02j78k59
$$ 26 16 -66 99 96 165 19 18 347 419 24 -56 216 241 -153 -374 -138 277 -151 -482 -330 6 108 -70 -329
1482c29N11Lk30j9M16n9k46j61M12J55p29k2L84J73n09j70K52L73k8p39N06L51
$$ -329 182 185 -45 -64 352 293 47 -114 298 453 -276 -298 86 259 -250 -420 -168 205 177 -562 -56 295
1504B95k36k43K94K90j12m65L10L26k53m19K01K46j25l95K7M36j68k99J2K35L3
$$ 295 59 -184 110 400 288 -177 133 459 206 -213 -12 234 109 -286 -259 177 9 -290 -278 -43 -10
1525a0M6k96L98K03l14q4K63p0jk49J97L84m20l24K2J46J94k11l25N43J4l13n
$$ -10 36 -260 138 341 27 -57 206 136 135 -114 83 467 47 -277 -255 -109 85 -126 -451 92 106 -207 -212
1548b12K85J02j42j81J71L95n00J7L42o0k11l11J14M24j33n47L25J97j25j88m7
$$ -212 73 175 33 -148 23 418 -82 -65 277 217 6 -305 -191 233 100 -447 -122 75 -50 -238 -285
1569b85N17j37k86L1N14l11q1J13R5J09m12J46J71k54k1l7K8J82k55m0O3K64k27
$$ -285 232 95 -191 -160 354 43 -38 75 170 279 -133 13 184 -70 -91 -128 -100 82 -173 -213 -150 114 -113
1592a13J9J06J65q4r6J50L3o9q9J11j45J07p3j30P6J18k14k2n5J38Nj49Q6K99
$$ -113 -94 12 177 93 -3 147 180 111 22 133 -12 95 22 -108 -32 86 -128 -150 -205 -67 -62 -211 -125 174
1616A74j21j07O5J61j59m3J15j44K79m30J35lK07k94r3K35J47m19R1K19K8k4k6
$$ 174 53 -54 11 172 13 -30 85 -59 220 -210 -75 -78 129 -165 -258 -23 124 -295 -204 15 43 19 -7
1639gM2J47j64M1K06k9k39PN2rj10l3K13j54l46K93J4o3J19j26J05R9j72K6K47
$$ -7 35 182 18 59 265 236 -3 4 56 47 -63 -96 117 -37 -383 -90 -76 -139 -20 -146 -41 58 -114 -88 159
1664A59j18J17J6j58J7k9M5j2l36K75ok6j64N4J46j32L6Q2M0J84k39J16K07j82
$$ 159 41 158 174 16 33 4 49 37 -299 -24 -30 -56 -220 -166 -20 -152 -116 -34 6 190 -49 67 274 92
1688I2j36J25J83j21k31N2J46o0k45P6K01j51j53J12J05k2j25K15J14j06JO2p0
$$ 92 -44 81 264 143 -88 -36 110 50 -195 -119 82 -69 -222 -110 -5 -27 -152 63 177 71 72 134 64
1711F4%l9J1J04m9q5m7qp1k8O7J09j30k4J26j0n0J93j22J08m0J32r1l5l1mL5j86
$$ 64 64 25 36 140 91 6 -41 -49 -120 -148 -81 28 -102 -126 0 -10 -60 133 11 119 79 211 120 85 54 50 85 -101
1739a01P9J57k19o1j12J66N8j19p6K91Rj48N0J52L4j28j5N7J41k58%J39l9n6l1
$$ -101 -22 135 -84 -145 -257 -91 -33 -152 -228 63 72 -76 -26 126 160 32 17 74 215 -43 -43 96 57 1 -30
1764c0o0J46j82n8K34j8N3k22J30K8R7j90L34q5j88J12m6K2k5j44J25j51l0J34
$$ -30 -90 56 -126 -184 50 32 85 -137 -7 21 118 -72 262 177 -11 101 55 77 52 -92 33 -118 -148 -14
1788a4Pj9n0m1Q5L1k7J33J18k47O3J54k06o2J55j79J58q5q8J21l4k38J54KM3L4
$$ -14 -7 -26 -76 -117 -32 -1 -28 105 223 -24 39 193 -13 -75 80 -99 59 -26 -114 7 -27 -265 -111 -109 -66 -32
1814c2k49K60Q9m2J3N3O5r6r9J64J8j25o3M1r7M8n6q6J76N7o5j1p2J14J7o2L5
$$ -32 -281 -21 68 26 39 92 157 61 -38 126 144 19 -44 -3 -100 -52 -108 -194 -18 39 -26 -37 -109 5 22 -40 -5
1841eL6j07K20l3j26J62m2n2Q0j22q9j9j2K03k6j86P2J21j32M7p9L34j03j89L9
$$ -5 31 -76 144 111 -15 147 105 53 133 11 -78 -97 -109 94 68 -118 -46 75 -57 -10 -89 245 142 -47 -8
1866hJ65o6j72Q1k3P5o6j06J83k8n6j20J18l1Oj04K31K2r7q7J24J11j14q2R3j4
$$ -8 157 91 -81 0 -23 52 -14 -120 63 35 -21 -141 -23 -54 -48 -152 79 101 4 -83 41 152 38 -44 49 35
1892C5p5qO2J7n9J9j02J15m8p9l8J23M1r0K3J03L1m5k9M4l4L4m3J1j26J70n0o9
$$ 35 -40 -48 14 31 -28 -9 -111 4 -44 -123 -161 -38 3 -87 -64 39 70 25 -4 40 6 40 -3 8 -118 52 2 -67
1920f7J25q0j12K3O0Q3j18l4J92J02r4q0P2Q2j06k5%O2K8k09N9J20j76M1j5P1
$$ -67 58 -22 -134 -111 -51 32 -86 -120 72 174 80 0 72 154 48 23 23 85 113 -96 -37 83 -93 -52 -67 4
1946DOj38J9J22k9M4j54J42M3L2j65R6P5p2o2k0P8Mp5J0lL6J9j23O1J13j14N3
$$ 4 10 -128 -109 13 -16 28 -126 16 59 91 -74 22 97 25 -37 -57 21 25 -50 -40 -43 -7 12 -111 -50 63 -51 2
1974BM7O0j44J56j30N3l7p4PJ07j19n7jQ5J06k05M4L7J64k28J26L0P2jj08OJ35
$$ 2 49 109 -35 121 -9 44 7 -67 -60 47 -72 -129 -130 -45 61 -144 -100 -63 101 -127 -1 29 101 100 -8 -2 133
2001A33j73M3nM3Q3j07n5J70q9j11o4R9pm1Q6M3j0n9O2P8n7L9j9KM8j59j26J69
$$ 133 -40 3 -2 41 124 17 -38 132 43 -68 -132 -33 -40 -81 5 48 38 -21 41 119 62 101 82 84 132 -27 -153 16
2029A6p3J3P1q6J4j8l8J11Q5n7O1k53J74J13n7Mk8n6J19j17o6KJ10n5K6Jk7j86
$$ 16 -57 -44 27 -59 -45 -63 -101 10 95 38 99 -154 20 133 76 80 52 -4 115 -2 -68 -66 44 -11 15 16 -11 -197
2057a97J0J59J5j13J59O2r1J19j32P4J77k83rJ63r2n4L1pK2k06NJ94n4j19J45
$$ -197 -187 -28 -13 -126 33 95 4 123 -9 65 242 -41 -50 113 21 -33 -2 -9 13 -193 -188 6 -48 -167 -22
2082b2JR0m6p7K60j29j2Q5j53qlQ5j1m6n3n7J17j35R3q6R6n4R2m5J31o5kP2l1
$$ -22 -21 69 23 -54 206 77 65 150 -3 -11 -14 71 60 14 -39 -96 21 -114 -21 -107 -11 -65 27 -18 113 48 46 118 87
2111H7j06Q2n5N8j73jJ92j43j13O0J26l4j56K89j12p7L9O9J04p0q7L7J36r0j26
$$ 87 -19 63 8 66 -107 -108 84 -59 -172 -112 14 -20 -176 113 1 -76 -37 32 136 66 -21 16 152 62 -64
2136f4N1J29j90m0J4J75j81n2J86L0o1m3M9P3j82N2K08m4j74O4M0m3l5J01n2j0
$$ -64 -13 116 -74 -114 -100 75 -106 -158 28 58 -3 -46 3 76 -106 -54 154 110 -64 0 40 -3 -38 63 11 1
2162Aj78J38R0p3L5r9J20r8o9R0J50j61NN7J38j80lJ88o7j75RJ54n8j80L2J83
$$ 1 -177 -39 51 -22 13 -86 34 -64 -133 -43 107 -54 -49 8 146 -34 -37 151 84 -91 -82 72 14 -166 -134 49
2188D9J0j01r1K20r3p7rK60p3p3j07K07K0l31J70J41j14q0L4O1r0q6K0K83j63
$$ 49 59 -42 -133 87 -6 -83 -92 168 95 22 -85 122 142 -189 -19 122 8 -72 -38 23 -67 -153 -133 150 -13
2213a3j26P8N2q8j1J50L6j09pK44k27J8O2Q2l7j05j35K10j00j11j3J90m8p8J05
$$ -13 -139 -61 -9 -97 -108 42 78 -31 -38 206 -21 -3 59 141 104 -1 -136 74 -26 -137 -150 40 -8 -86 19
2238A9Q3p8r0J22R4k2k47J74J14k47J4NJ19j24m7L4Q2o7j52L05k3j73kJ04R3o5
$$ 19 102 24 -66 56 150 128 -119 55 169 -78 -64 -59 60 -64 -111 -77 5 -62 -214 91 68 -105 -107 -3 90 25
2264B5j34K56j35J8n6J14k8j33j9Q7j5j93J30N7k6n1J07O2l0j39J13J92k08l6
$$ 25 -109 147 12 30 -26 88 60 -73 -92 -5 -20 -213 -83 -26 -52 -103 4 66 36 -103 10 202 -6 -42
2288d2N0P8J9j42O8k9Nk31L07J8j76NJ53j36j2M1J35j53p9J17N0l6J3j4M3J64
$$ -42 8 86 105 -37 31 2 7 -224 83 101 -75 -70 83 -53 -65 -24 111 -42 -121 -4 46 10 23 9 52 216
2314B16j73j3o3r7kJ37l7J8o8M1R3j60O5J13j17J35q3J0P6k2j8O5j08l6M8N1k06
$$ 216 43 30 -33 -130 -132 5 -32 -14 -82 -41 52 -108 -43 70 -47 88 5 15 91 69 51 116 8 -28 20 71 -135
2341a35K3M1K6J2j49J69J3Rp5Q7J1Q9k94L40oj14OOR8k01k02K75Qj69l4J66J6
$$ -135 -112 -71 -45 -33 -182 -13 0 9 -66 21 32 121 -173 167 161 47 53 59 157 -44 -246 29 37 -132 -166 0 16
2368A6K5j04Q4M6j2j1qP2p1K4ok4mJ3k3j71J60P7m5j7m4q2J39j58J17JN7j08q5
$$ 16 41 -63 21 67 55 44 36 108 37 61 55 31 27 40 17 -154 6 83 38 21 -23 -105 34 -124 -7 -6 51 -57 -142
2397a42L26j98n9J10J02j9j08k26K15M1j03p0K15n8j58O0R9n4l8J2P4k9j8O5J77
$$ -142 184 -14 -73 37 139 120 12 -214 1 42 -61 -131 84 26 -132 -72 27 -27 -65 -53 21 -8 -26 39 216
2422B16q6j18l7J55p9j49J19k1Mj45J43Pk4o7O4P7o2J5m5M9j08N9N3N7k8N5j32
$$ 216 130 12 -25 130 51 -98 21 0 4 -141 2 9 -15 -82 -18 59 -3 12 -33 16 -92 -33 20 77 49 104 -28
2449b8J6P5q4ll7J7O2N8j08l2q7K23j46J85r2J11k12J49L2q1r8J32k6J02m5j75
$$ -28 -12 63 -21 -24 -61 -44 18 76 -32 -64 -151 72 -74 111 19 130 -82 67 99 18 -80 52 26 128 83 -92
2475i2J57m4j33J39j05J45O6k50J92n2k5j12R2K4J2q2J49J3o9k7k6Q1j04on0O8
$$ -92 65 21 -112 27 -78 67 133 -117 75 23 -2 -114 -22 2 14 -68 81 94 25 -2 -28 53 -51 -57 -107 -39
2501c9n2P5l9l3J40j31M6L5L2L8p5O4J9j9j92J41n4J3rN1p0P6j09J21o5N2Q5m3
$$ -39 -91 -16 -55 -88 52 -79 -33 2 34 72 -3 61 80 61 -131 10 -44 -31 -40 11 -59 17 -92 29 -36 16 101 58
2529E8l0N4j21L0N2j0j34J58j69R5J6rn2J91k35Q0Q1k28O3O7J13r1j2J2J34l2
$$ 58 28 82 -39 -9 43 33 -101 57 -112 -17 -1 -10 -62 129 -106 -26 55 -173 -110 -43 70 -21 -33 -21 113 81
2555H1N5j13J39j60N2j9k3k5N4j51J07n11N24M2j25K38k82J78j15Q8M7j5KNo6
$$ 81 136 23 162 2 54 35 12 -13 41 -110 -3 -514 10 52 -73 165 -117 61 -54 34 81 66 68 73 7
2580Go0L2M8l6l4k5J25q6l0k0O7O2j0k9M8k3K5m4O8o2q3Q0K6L8j9J6m8j58j6J50
$$ 7 -53 -21 27 -9 -43 -68 57 -29 -59 -79 -12 50 40 11 59 36 61 17 85 23 -60 20 46 84 65 81 33 -125 -141 9
2610Ip8M2L2j24J81j09l4J15m7J9N5Oj11J27K5Lp1j03J8O3M5j57R9q8J62M8r7
$$ 9 -69 -27 5 -119 62 -47 -81 34 -13 6 61 67 -44 83 108 111 40 -63 -45 18 63 -94 5 -83 79 127 30
2637C0P4j00R2j22J87l74K03k9l5J96j45j4K8O8j00j1O6k07J85n2J26N2k49P0
$$ 30 104 4 96 -26 161 -213 -10 -39 -74 122 -23 -37 -9 59 -41 -52 14 -193 -8 -60 66 118 -131 -61
2661f1qO8n3J4P7M1k36K50j5r2M4m7J4O9j47J67j68R5q9M9N9j08P6M7o0rJ8O5
$$ -61 -69 -1 -54 -40 37 78 -158 92 77 -15 29 -18 -4 65 -82 85 -83 12 -77 -28 31 -77 -1 46 -14 -23 -5 60
2689F0j02L9J9l6L0n8M2O8r2lM7l5K2Rj2J1m7pJ9P1jj30J20L7q8P8o6O1j0q3m7
$$ 60 -42 -3 16 -20 10 -48 -6 62 -30 -33 14 -21 1 10 -2 9 -38 -45 -26 45 44 -86 34 71 -17 61 -5 56 46 -37 -84
2720h4J18j28R9L9p2k3J49k5P5j41M6J07L5l34J07J52j10j05j4J73l4o2LM7jj7
$$ -84 34 -94 5 44 -28 -51 98 73 148 7 53 160 195 -139 -32 120 10 -95 -109 64 30 -32 -29 18 17 0
2746@o9L0k5P6nJ6l6O3lO4o5k1m0L5O3p1%M4q7J2K6L7M4j62J51j02m5P9l5lJ00
$$ 0 -69 -39 -64 12 7 23 -13 50 47 111 46 25 -15 20 83 12 12 56 -31 -19 7 44 88 -74 77 -25 -70 9 -26 -29 71
2777G1q8k2Q2o9j3L6lrl2J52r1L8P8j16r2Q9j1M7m6l2K3J01K5k04R9J33k6k48
$$ 71 -17 -39 43 -26 -39 -3 -6 -15 -47 105 14 52 130 14 -78 11 0 47 1 -31 -8 93 118 -86 13 146 120 -128
2805a28J21n4P4j11L2O0o5p5J23rl5L4jJ10o0m8N9L1p2J8o1R2o6o9J24k4j22J06
$$ -128 -7 -61 13 -98 -66 -6 -71 -146 -23 -32 -67 -33 -34 76 16 -32 27 58 -14 4 -57 35 -31 -100 24 0 -122 -16
2833a6j6k0m5J0K8N7j2k2j5L9J13j8n1N3k38J96n3l7M4K1j42L5J85j31k6J06q9
$$ -16 -32 -52 -97 -87 -59 -2 -14 -36 -51 -12 101 83 32 85 -153 43 -10 -47 -3 18 -124 -89 96 -35 -61 45 -44
2860d4R9Mj73R4J04o2nO3m4o4Q2J8n5K2k5j07M6R2j51P4NO4k1j27R7N7N4j48P6
$$ -44 55 59 -114 -20 84 22 17 80 36 -28 54 72 17 39 14 -93 -47 45 -106 -32 -27 37 16 -111 -14 43 97 -51 25
2889B5n2n2J93n4j36R7R6j23l5N2Q2j05j31K48j80k5J49p5J18j34N5R6k7o8K6
$$ 25 -27 -79 114 60 -76 21 117 -6 -41 11 93 -12 -143 105 -75 -100 49 -26 92 -42 13 109 82 14 40
2914D0O9m5q7J0P7L1j24%k1P2j53OJ00M7m5Lk6P7j2j05M7n9J03P3n4J4k1M3n9
$$ 40 109 64 -23 -13 64 95 -29 -29 -50 22 -131 -125 -25 22 -23 -20 -46 31 19 -86 -39 -98 5 78 24 38 17 60 1
2943AJ5p7Q6l5N3Jl5l0P5J4K7j6m4J1j40J68o9m5J36j38K0J7j8N6q7R9J1q5N3
$$ 1 16 -61 25 -10 43 44 9 -21 54 68 95 79 35 46 -94 74 5 -40 96 -42 -22 -5 -23 33 -54 45 56 -29 24
2972B4p3J65k36J78J1m3m4K7o1J56k17R4O0o2j6R7p0l8L8j87K15P0j09J6l1l1
$$ 24 -49 116 -120 58 69 26 -18 9 -52 104 -113 -19 41 -21 -37 60 -10 -48 -10 -197 18 88 -21 -5 -36 -67
2998f7OJ0J85j98n2J91o2M0j24J13o2L4j13J30j15Q7M4q2R9N5l4j04P8N7o8j1
$$ -67 -61 -51 134 -64 -116 75 13 53 -71 42 -20 14 -99 31 -84 3 47 -35 64 119 85 -19 59 116 48 37
3024C7P0o9L8j42J09J4j06j3mP2p8r0K85j98J35K4j4l2o4Rk8J11m4O5J5p6K0L5
$$ 37 107 38 76 -66 43 57 -49 -62 -66 6 -72 -162 123 -75 60 84 70 38 -26 -17 -45 66 22 87 102 26 46 81
3052H1k31R5N2J8O4j45j6J17rK5k6p5J18J0o6j3j0M1o3Q2m6O4j23P6l0o0M7O3
$$ 81 -150 -55 -3 15 79 -66 -82 35 26 51 25 -50 68 78 12 -1 -11 30 -33 49 3 67 -56 20 -10 -70 -23 40
3080D0l6J7K3o5P0k9M8N5j31Q2m7m3l3q4J22R3q5p9O8q4M6J8P4j02J03k6Pqm0
$$ 40 4 21 44 -21 49 20 68 123 -8 74 27 -16 -49 -133 -11 82 -3 -82 -14 -98 -52 -34 40 -62 41 15 22 14 -26
3109b6R1q6M9o2J09N0j38K2n0M6n0P4O8k61L56j72p4O0r0J94j07r6P2p2R6Rl3
$$ -26 65 -21 28 -34 75 125 -13 9 -41 5 -45 29 97 -164 192 20 -54 6 -84 110 3 -93 -21 -93 3 12 -21
3136b1l2J00j43J00oJ18j43KO5klr3p5lJ22L8J02j37J01o7m2O5q2R3j28j1Q5l7
$$ -21 -53 47 -96 4 -2 116 -27 -25 40 38 35 -58 -133 -136 -14 24 126 -11 90 23 -19 46 -36 57 -71 -82 3 -34
3164c4m4P9L5j03J24q7R0j30j2J03P2o8K4r3J31o0k6nO5j63O4J7L7p2K8l5J08
$$ -34 -78 1 36 -67 57 -30 60 -70 -82 21 93 25 49 -44 87 27 1 -4 61 -102 -38 -21 16 -56 -28 -63 45
3191D5p5J5N0m5N3k1l2P7j41q7K76r6o2K1PRr3O5M1k6MKl2L2n5P3M1k8m6QO2p2
$$ 45 -30 -15 35 -10 43 22 -10 67 -74 -161 115 19 -43 -22 -15 -6 -99 -34 7 -19 -15 -13 -45 -13 -68 5 46 18 -28 -20 42 -30
3223c0j2N4K9j50J87r6l1Q7p3K9J51j86n6J68p7j0k4RL5p2J9J85r7p1p5J38k0
$$ -30 -42 12 41 -109 78 -18 -49 38 -35 -6 145 -41 -97 71 -6 -16 -40 -31 4 -68 -49 136 39 -32 -107 31 11
3250A1k3K9k0j04J41L3J9p9kl3K3J3Mm0R8r6J58Jj43k2J33o9O8o5j08l5Q9L8Q
$$ 11 -12 17 -3 -107 34 67 86 7 5 -28 -5 8 12 -28 70 -26 132 133 -10 -32 101 32 100 35 -73 -108 -19 19 27
3279B7j0j57K26j43J37j59J27r5R9p6lJ53j0j60N8nR0k7m2o7J07j61O9K8lj46
$$ 27 17 -140 86 -57 80 -79 48 -47 52 -24 -27 126 116 -44 14 9 99 72 30 -37 70 -91 -22 6 3 -143
3305a43J17N3K2L7m3L0r8J8l6O1L3K1j32o5J87qq3N9p2K2n4N5m0K0J14m0m8j7
$$ -143 -26 27 49 86 43 73 -25 -7 -43 18 51 72 -60 -125 62 54 -29 30 -42 -20 -74 -19 -59 -39 75 35 -13 -30
3333c0R9k43J23L4L1M0j27P8k4J24j43L3M9M5j53J7k3K9r1P5J25J8q0l7P5k9J5
$$ -30 69 -174 -51 -17 14 54 -73 5 -19 105 -38 -5 44 89 -64 -47 -70 -41 -132 -57 68 86 6 -31 44 15 30
3360C0n1J24r6M4JK3j15ooM3o9l8J95j04R2j02M4M1j05J1R8R2k20R8j05J06l7
$$ 30 -21 103 7 51 52 75 -40 -46 -52 -9 -78 -116 79 -25 67 -35 9 50 -55 -44 54 146 -74 24 -81 25 -12
3387a2lK9r0l0M2M3J10j98J62j18J11m5p1J38k6Q1l9j20L8o7J46Kk84J36j4J29
$$ -12 -15 14 -76 -106 -64 -21 89 -109 53 -65 46 1 -70 68 42 123 84 -36 2 -65 81 83 -201 -65 -79 50
3413E0j06P2J34j52j27J49l1p5o5J51J28o5o7jkL3j0q9O8J6r5m6J67k1K0J1q2
$$ 50 -56 16 150 -2 -129 20 -11 -86 -151 0 128 63 -4 -5 -7 26 16 -73 -5 11 -84 -130 37 16 36 47 -35
3440c5J04j17N0L7J06k33M6mJ56r8j10K4M2j57L68n2k70J58Qr4j8J25r3J55n8
$$ -35 69 -48 2 39 145 -88 -42 -46 110 12 -98 -74 -32 -189 179 127 -143 15 23 -71 -89 36 -57 98 40
3465D0J5k8K9k5j9P3q5nO4Omn5N2J7m3K5M2r1J9k04J78O6k5j1j4M6k8p4J9O0m8
$$ 40 55 27 56 31 12 85 0 -5 59 65 61 6 58 75 32 57 99 8 27 -177 1 67 42 31 17 63 35 -39 -20 40 -8
3496hq0J09N3p9K4n1K6Q1j79KK2J9J01LR3j05j7L5n0l8J09k7oq8J12J9j13M5j0
$$ -8 -88 21 74 -5 19 -32 -6 75 -104 -102 -80 -61 40 43 136 31 14 49 -1 -39 70 43 37 -51 61 80 -33 12 2
3525Bq0j6Q0Jj24O1J52j86J17nL3m9J52j57J06o8r4M3q1J42j29rJ87p1j74J48
$$ 2 -78 -94 -14 -13 -137 -76 76 -110 7 2 35 -14 138 -19 87 19 -75 -32 -113 29 -100 -109 78 7 -167 -19
3551a9n2J48K6j27J31j40N0L4L0n7J16r7n2o4J07Km%r1R7n7L3P0j17J45r1n3J04
$$ -19 -71 77 103 -24 107 -33 17 51 81 24 140 43 -9 -73 34 36 32 32 -59 38 -19 14 84 -33 112 21 -32 72
3579G2j09Q5p9L2m9J05m0L7n0LM6q1mN8j67J33n8lM3K09j23k8K3R9j09n1K4O4
$$ 72 -37 48 -31 1 -48 57 17 54 4 7 53 -28 -32 26 -141 -8 -66 -69 -26 183 60 32 55 154 45 -6 18 82
3607H2q3%lj21J39j0l5J04j81P4M7q2J28k57K26m8Q7q5M7l3N4N6j17O5n7k8k0
$$ 82 -1 -1 -4 -125 14 4 -31 73 -108 -34 13 -69 59 -198 28 -20 67 -18 29 -4 50 106 -11 54 -3 -31 -51
3634e1Q5nj9r1J05j53J82l5L7r7o5L5N3oj5L7N8P1j52pL5N8J9j30LJ75q5Ml9N0
$$ -51 34 29 10 -81 24 -129 53 18 55 -42 -107 -72 -19 -25 -40 -3 55 126 -26 -33 2 60 79 -51 -48 127 42 46 7 57
3664E7m5o4l5M3J30n2J1J3J2o5k0Q4k1k8o2n2J24n1j2L2p7j8J36J1L5m8k7J38
$$ 57 12 -52 -87 -44 86 34 45 58 70 5 -15 69 48 20 -42 -94 30 -21 -33 -1 -78 -96 40 51 86 38 11 149
3692A49q5L0K9j87Q7j4J4J8j25Q7nk7k0P6n5Q6n9N9j04J4N1k3L2j3j02K01r1p3
$$ 149 64 94 123 -64 23 9 23 41 -84 3 -2 -29 -49 27 -28 58 -1 58 -46 -32 19 -4 28 15 -87 114 23 -50
3720e0n5J50j10J85j68J9qN8J37k52L1L9r8O3J05q7j01J96q5K9l8n2L3LpP2K0
$$ -50 -105 45 -65 120 -48 -29 -37 21 158 -94 -63 -24 -122 -59 46 -41 -142 54 -31 -2 -40 -92 -59 -56 -63 9 29
3747B9j1n4J15K1q5m4L6j5rJ03m4O3j01O1J4p7m7K8J06q6k4K5n1N5l2jJ07j98
$$ 29 18 -36 79 100 15 -29 7 -8 -17 86 42 105 4 65 79 2 -45 -17 89 3 -21 4 -47 8 -24 -25 82 -116
3775a16J35N0oK8j35P0M8j60J80nj86J20l1j08J26Mj82J21J82q8o3q4R1o7J60
$$ -116 19 69 63 91 -44 26 74 -86 94 89 -97 23 -8 -116 10 14 -168 -47 135 47 -16 -100 -9 -76 84
3800H4j0l0rR1Rj28l2M9n6Q3p7J9O6r0r3J67j45J72nj64J66j55J62m2m6p3Q7J0
$$ 84 74 44 35 126 135 7 -25 24 -32 51 -26 -7 59 -31 -124 43 -102 70 65 -99 67 -88 74 32 -14 -87 0 10
3828A0o5N0Q6q4K4k2J8ro3m1J40p4J9L5j39J20O1j59J07K3K9p1rR2j12Q3Ll7m6
$$ 10 -55 -5 81 -3 21 -1 17 8 -55 -96 44 -30 -11 24 -115 5 66 -93 14 37 66 -5 -14 78 -34 49 52 15 -31
3857c1O4j18mj6J3R5K6k0m5rO0M4Rn6K3m2oQ0k1j05R3j01Q2Nr2J27o0L1R4p8q
$$ -31 33 -85 -89 -105 -92 3 29 9 -36 -45 15 59 68 12 35 -7 -13 67 46 -59 34 -67 15 20 -72 55 -5 26 120 42 34
3888C4o9QoQ9l7p4P8k7J04l7L2jm5K7q4j02J41n2M0j07L9J03j09J9M3L7k6k4J21
$$ 34 -35 -27 -33 56 19 -55 23 -4 100 63 95 94 49 76 -8 -110 31 -21 19 -88 -49 54 -55 -36 7 44 18 -6 115
3917A15k9M6j77R2o5N1r9R9qK49k13K7K7j39p0J28m7r0J97r1N3j18N2p5J55m3
$$ 115 86 132 -45 47 -18 33 -66 33 25 274 61 88 115 -24 -94 34 -13 -103 94 3 56 -62 -10 -85 70 27
3943B7k8J0j02J50m4q0L4P9m6j9R5j12J37j16K3M0j0q9K7K3l7J32j49q0Q1J14
$$ 27 -1 9 -93 57 13 -67 -33 46 0 -19 76 -36 101 -15 8 48 38 -51 -24 -1 -38 94 -55 -135 -54 60
3969F0j06M4om4R6%n7P0q6o1J56o7P8r1O5j77J81J3K4nj42O6%n8N3K2Q5j04O4
$$ 60 -46 -2 -8 -52 44 44 -13 57 -29 -90 66 -1 77 -14 51 -126 55 68 92 87 -55 11 11 -47 6 28 113 9 73
3998G3n5J03k23R7j5q4J70Rp5J36j7j60J0j1kO6o7n9N8R3J6J7k1p3M2J1kj1L2
$$ 73 18 121 -102 -5 -20 -104 66 75 0 136 119 -41 -31 -42 -44 22 -45 -104 -46 47 63 80 59 -14 28 39 37 26 58
4027E8m4J8ml8P3j61J2J15r8JK0R2j70J81Kp3l0N2L1rR4J0l5j10O1J16o3m3r2
$$ 58 14 32 28 -10 63 -98 -86 29 -69 -68 -48 44 -126 55 57 -16 -46 6 37 28 122 132 97 -13 48 164 101 58 -34
4056c4K0Q7k5j19L7M3q8O9j02J56J8l4P2q5r0k0J01N9j5N7L4j03K9j38R7k1N6
$$ -34 -14 73 48 -71 -34 9 -79 -10 -112 44 62 28 100 15 -75 -95 6 65 50 107 141 38 67 -71 26 5 61
4083F1j46J18n8j7R7j44J15j03J64j30J52l2l9P3m2j27Q6o1RM4m2m8M6R1j00M0
$$ 61 -85 33 -25 -42 55 -89 26 -77 87 -43 109 77 38 111 69 -58 28 -33 -24 20 -22 -70 -24 67 -33 7
4109Gk5j7j8J17j71J6L4j3K9J0M4M1k5j34J68j2l2l4J9k1N7j23O6o3L3O4k5J8
$$ 7 -18 -35 -53 64 -107 -91 -57 -70 -41 -31 13 54 29 -105 63 51 19 -15 4 -17 40 -83 -17 -80 -47 17 -8 10
4137A0m9M4j3J69j69J00j94J88j22J19o5q4j0O5M1O5r4j7L3Qj5P4l5J1q2N4K6
$$ 10 -39 5 -8 161 -8 92 -102 86 -36 83 18 -66 -76 -11 30 95 1 -16 17 25 10 84 49 60 -22 32 58
4164E8n5m1j2j37K24q0Q1J2m3l4m2j2J24J3j42J12l5M2l6L0%j9kRK8J4m3j01L5
$$ 58 3 -38 -50 -187 37 -43 38 50 7 -27 -69 -81 43 56 -86 26 -9 33 -3 27 27 8 6 15 43 57 14 -87 -52
4193e2K6P7j38oQ9m8J09M7j30O0n5M3K7l6J8q2p9J37k3N4o5k8J01j34k6J43P3
$$ -52 -26 51 -87 -93 -4 -52 57 104 -26 34 -21 22 49 13 31 -51 -130 7 -16 38 -27 -55 46 -88 -114 29 102
4220A02o6l6J0K3r2M8j9J22k4n7n1Q3%l8k4N4j20J3J61m9M5j80O3N1mk6P4j18
$$ 102 36 0 10 33 -59 -11 -30 92 68 11 -40 43 43 5 -19 35 -85 -72 89 40 85 -95 -32 19 15 -11 63 -55
4248e5J38m7M9Qj73P0K2j7l7M9j1M5p4q1M0N8j0K4m4N2j12Q3j2P1m0Kl2P6Qqo8
$$ -55 83 36 85 93 -80 -10 12 -5 -42 7 -4 41 -33 -114 -74 -16 -26 -2 -46 6 -106 -23 -35 36 -4 -2 -34 42 50 42 -26
4279b6J1p7O5L3ON2q2l3Q3j58J00N7k4o2K3J09k7m1j8j1JN8l5m2N2P8q0m3OJ9
$$ -26 -15 -92 -27 6 12 64 -18 -51 32 -126 -26 31 7 -55 -32 77 50 9 -9 -20 -19 39 4 -38 14 92 12 -31 -25 -6
4309fJ4l6J16n0m4M6k2QN2j47R0j0j4p0j7J22j36Q9ql0p9J26K9o1O6J8r1pJ40
$$ -6 8 -28 88 38 -6 40 18 26 78 -69 21 11 -3 -73 -90 32 -104 -15 -23 -53 -132 -6 23 -38 28 46 -45 -52 88
4338H8j14L4j4K2p5Q1lj1R0r6%J2q7lLJKJ42p2j3K1M6m0q0J48j65P6Q1PnJ4j10
$$ 88 -26 8 -6 16 -59 22 19 8 98 2 2 14 -73 -76 -73 -72 -70 72 0 -13 8 54 14 -66 82 -83 -7 74 81 76 90 -20
4370b0o4N0lP6K3j37J80l7r3J01q3J02p8O6l2k8M4j2o8P7lq9j07J37O7j36P9j09
$$ -20 -84 -34 -37 39 62 -75 105 68 -25 76 -7 95 17 83 51 23 67 55 -13 64 61 -28 -135 2 69 -67 12 -97
4398i7P7J2k7Q7op8M1O8j15j0P6P4j9j08J6l7j7R8j01k4M7j7M4ll3j12J89n2n2
$$ -97 -20 -8 -35 52 46 -32 9 77 -38 -48 28 102 83 -25 -9 -46 -63 35 -66 -90 -43 -60 -16 -19 -52 -164 25 -27 -79
4427g9J27l1l2L9J7n5J05l1q2qM4J07p4Qq6K7j55J31NQ8o1j37K0L0J73k9j7m3
$$ -79 48 17 -15 24 41 -14 91 60 -22 -30 14 121 47 55 -31 -4 -159 -28 -23 65 4 -133 -113 -83 90 61 44 1
4455Aj6Q0j9j63J32n5N9O3l7k1l3Nm4n5R1j6PoJ47m9J2n5L6l9m1j25J15Q4j53
$$ 1 -15 65 46 -117 15 -40 19 82 45 24 -9 -4 -48 -103 -12 -28 -21 -27 120 71 83 28 64 25 -16 -141 -26 58 -95
4484i5K4N4J27j27P6r1j11Q5L6k9rO1mRq3J21m5O6R5j31k6J3j6qm9mP7n7M9jQ
$$ -95 -71 -17 110 -17 59 -32 -143 -58 -22 -51 -60 1 -3 6 -77 44 -1 65 160 29 3 16 0 -8 -57 -61 16 -41 8 7 15
4515A5JO6j44k9J62m0km3O6m2J4k9P7O2k19J8M2M6N7j38J65j12J9j03J09jM7k6
$$ 15 16 82 -62 -91 71 31 29 -14 52 10 24 -5 72 134 -85 -67 -25 21 78 -60 105 -7 12 -91 18 17 64 38
4543C8l7J9n0P2k05N8K30o7l9j14L7M6N1j14J76j21q5J14j69Q5J36k46L23o5m2
$$ 38 1 20 -30 42 -163 -105 125 58 19 -95 -58 -12 39 -75 101 -20 -105 9 -160 -75 61 -185 138 73 31
4568C1j0k31K03l17K50pK9K16j98l3k9J68l6l08L08P6J71P5n08K57j49L03l80
$$ 31 21 -210 -7 -324 -74 -81 -52 164 -34 -67 -96 72 36 -272 36 112 283 358 -150 107 -42 261 -119
4591a19J11K77j61m9k11M2L91k09j4K1k28L21l71J98j19r6M82k77j34J64R7n9
$$ -119 -8 269 108 59 -152 -110 281 72 58 79 -149 172 -199 -1 -120 -216 266 -11 -145 19 116 57
4613E7l6r7PM5J76j44K4K5j21J23j22q1J14M0m3O0o1pM8Q2k8j4p1LJ26l5n9p3
$$ 57 21 -76 -69 -24 152 8 32 57 -64 59 -63 -144 -30 10 -33 27 -34 -41 7 89 61 47 -24 -21 105 70 11 -62
4641f2N9m0k1J31j12O7k0N0n0kj07P8K9p8K96j13r2P6J7q6o1J13p3R0n8j16P1
$$ -62 -3 -43 -64 67 -45 22 2 52 2 0 -107 -29 0 -78 218 105 13 89 106 20 -41 72 -1 89 31 -85 -14
4668a4j03J97M1m2o2N2j44K30k50K16j72q5J93j66J28o3L0J18j09J4p4J73l1N0
$$ -14 -117 80 121 79 17 69 -75 155 -95 121 -51 -136 57 -109 19 -44 -14 104 -5 9 -65 108 77 127
4692A27jo4j44J19k1J29j02M0j7q5K21k20oj83K26r5p4j6K85k70J28j53L88l4
$$ 127 126 62 -82 37 16 145 43 83 66 -19 202 -18 -24 -207 19 -76 -150 -166 119 -151 -23 -176 212 178
4716A78k14o9P0j89k54M03P5l8l09M27k28Q3l26P21l39l34p7N87J21l8l13L18
$$ 178 -36 -105 -35 -224 -478 -75 0 -38 -347 80 -148 -65 -391 330 -9 -343 -420 167 288 250 -63 255
4738B55r5j48J53K03n46r6L93M2o2N02n61m14N13j90N5k0n22O74l65k66L77o4
$$ 255 160 12 165 368 -178 -274 119 161 99 601 40 -374 139 -51 4 -16 -538 136 -229 -495 -118 -182
4760a82K48k89o20J011o28M65N68m04J20m75M16l75P98n46n03L74k26p3J3N01
$$ -182 66 -223 -843 168 -460 5 573 169 289 -186 230 -145 653 107 -396 -22 -248 -321 -308 193
4780A93p64K82j21n64J272J59J57l29K95l15k0P08j220M9l12K23q8M51lj64n11
$$ 193 -571 -289 -410 -974 298 457 614 285 580 265 245 953 -267 -218 -530 -307 -395 56 53 -111 -622
4801f22J043O3k96j51l6mj97N28N26j174N0O61k57m80R95j283L37O59o27N52q07
$$ -622 421 484 188 37 1 -3 -200 328 854 -320 -270 391 134 -346 649 -634 -297 362 -265 287 -520
4822e20L29L53m91N39o61R19j076N64J046p27j16j05l35L82m9j51rj96o0L34R4
$$ -520 -191 162 -329 210 -451 468 -608 -44 1002 275 159 54 -281 101 52 -99 -108 -304 -364 -30 64
4843F4n4J4K67l89m0r1J52L60k50K38p07N48J83L7n33L60j2K06j47m12Q4J65L05
$$ 64 10 24 291 -98 -138 -229 -77 283 33 271 -436 112 295 332 -201 159 147 353 206 -206 -122 43 348
4866C48n82K15j94J17L0n9j27K82j05n0K54j33m2J00j8j26J29q8Q8j3K6p3J17
$$ 348 -234 -19 -213 -96 -66 -125 -252 30 -75 -125 129 -4 -46 54 36 -90 39 -49 39 26 52 -21 96
4889I6j52P1l5KNO6p7j7N2l7NJ22j17j8M7j00J12j4Jj17Q1N5N5o3o1J07l9j3p8
$$ 96 -56 15 -20 -18 -13 53 -24 -41 11 -26 -21 101 -16 -34 13 -87 25 11 12 -105 -24 31 86 23 -38 69 30 17 -61
4918f1M9ML1N9r6o0P1m2J40J0o2N3j98Q3Q8o7p7%J43r0K8J69j65l1QOJ9j1l5Q
$$ -61 -12 -8 23 82 -14 -74 -3 -45 95 105 43 96 -102 -19 69 2 -75 -75 68 -22 6 175 10 -21 -13 -7 12 1 -34 -26
4948b6J9k1O6l0K8j16J10O7j4j72J22M6r8r8J75J4n1kK3J00O4j18n6n8m2J40r0
$$ -26 -7 -28 38 8 36 -80 30 97 83 -89 33 79 -19 -117 58 72 21 19 42 142 206 88 32 -26 -68 72 -18
4975a8L0k1N9j67R1m6K0P0p1M8m8K2J12n3N3j35M2M8ll9oJ5J3m7J2okP9l1n5k4
$$ -18 12 -9 50 -117 -26 -72 -52 18 -53 -5 -53 -31 81 28 81 -54 -12 36 33 -6 -12 3 16 -31 -19 -25 -27 52 21 -34 -58
5006e8N8J6j21J32k8M6o4L5j3jJ05j24m7N8j5O1j2l4m7k6M0M3k3j2J04j67J65
$$ -58 0 16 -105 27 -1 45 -19 16 3 2 107 -17 -64 -6 -21 40 28 -6 -53 -79 -39 4 -19 -31 73 -94 71
5033G1p9O1L0j2j02m4O1L5q9O6j2j1N2n1L5q9J35k9K7j15N8Q8p8J1Q1j27O9j85
$$ 71 -8 53 83 71 -31 -75 -14 21 -68 -2 -14 -25 27 -24 11 -78 57 28 55 -60 -2 86 8 19 100 -27 42 -143
5061a43O8J79j97R6K0O4j11o7M4M5l0N3r3K06j95k9J00k2J13j05M7m2o6J7l2R0
$$ -143 -75 104 -93 3 23 87 -24 -91 -47 -2 -32 21 -72 134 -61 -90 10 -12 101 -4 43 1 -65 -48 -80 10
5087A0m4l1K5RK1q1J55No1k1m0J12j19M1O6J4j2M0Pm1p7O2O2j1q8J6l3qJ1k3k7
$$ 10 -34 -65 -40 -31 -10 -91 64 69 8 -13 -53 59 -60 -19 47 61 49 89 96 55 -22 40 102 91 3 19 -14 -22 -11 -34 -61
5118f1K2J21j6L9j51O8P3o5r0J43l5j43L6k1J13j1k4kJ50j47J5m3l6P0k9jj92
$$ -61 -39 82 66 105 -46 22 95 30 -60 83 48 -95 -59 -80 33 22 -2 -4 146 -1 14 -29 -65 5 -24 -25 -217
5145b17K11j22k4P8N3J04k6l7K0l7K1k5p8J00q4M2m8J44j02K2K7R4q8p6J56k13
$$ -217 -6 -128 -152 -74 -21 83 57 20 40 3 24 -1 -79 21 -63 -21 -69 75 -27 -5 22 116 28 -48 108 -105
5171a05J09JP5j53J78j92O9l9J03o6o0L4R4j42K0J56j31k5Q5Rj10J15J03j29R
$$ -105 4 5 80 -73 105 -87 -18 -57 46 -20 -80 -46 48 -94 -74 82 -49 -74 11 20 -90 25 128 -1 8
5196HQ8j24k3J07N8j09j15J92p2m0J28k8K3j15RO6q8q8J13N8l4j1k8O1j30Q5M6
$$ 8 96 -28 -51 56 114 5 -110 82 10 -30 98 70 93 -22 -13 53 -35 -123 -10 48 14 3 -25 36 -94 -9 37
5223C7m7K0m7l9J60j40L8R0J3p5N0m1M3j12M9l0N9j3M0n1n2J0L6l6k7L0J8K8M3
$$ 37 -10 10 -37 -76 84 -56 -18 72 85 10 60 19 62 -50 -1 -31 28 15 55 4 -48 -38 -2 -38 -65 -35 -17 11 54
5252E4n8J50j51n4O7J08p2j10J41j27M8J1J8n9P5k3J4j0k4Jj54J18j1N2j7o2M0
$$ 54 -4 146 -5 -59 8 116 44 -66 75 -52 -4 7 25 -34 41 18 32 22 -2 -1 -155 -37 -48 4 -13 -75 -35
5279c5J7q6J07J4L8j3q2k1R2l4L9l9j5kl2J03Q1j89P2p5L7J1L5j1p6J07L1n7j9
$$ -35 -18 -104 3 17 55 42 -40 -61 31 -3 36 -3 -18 -20 -52 51 132 -57 15 -60 -23 -12 23 12 -64 43 74 17 -2
5308bL9j14Q2n1J32l4j28N0K1N7j13O4J66j83j9J12m3n3n9M0j8q2J18q9J93n0
$$ -2 37 -77 5 -46 86 52 -76 -26 -5 52 -61 3 169 -14 -33 79 36 -17 -76 -36 -54 -136 -18 -107 86 36
5334C6k7N3k06J72l9m3M8j08J17l4MK1N7j16J17j23J08k0m7k9J67m5m9n2K2p2
$$ 36 9 62 -144 28 -11 -54 -6 -114 3 -31 -27 -6 51 -65 52 -71 37 17 -30 -59 108 63 14 -38 -16 -88
5360h8J01n0JN7P7j46L6lj6j0q6J59n8K5jj4L8p4j9J27j09L4p0Q1j13J17K5l9
$$ -88 13 -37 -36 21 98 -48 -12 -15 -31 -41 -127 32 -26 -1 -2 -16 22 -52 -71 56 -53 -19 -89 -8 -121 -4 21 -18
5388a8Rj34K09j35n8J94j26j6O7m5O7j06J20j07J07M5Lk09K5P7J84j22q2O0N5
$$ -18 -9 -143 66 -69 -127 67 -59 -75 -8 -53 14 -92 28 -79 28 73 76 -133 -108 -31 153 31 -51 9 64
5413F4n6M0m9L3Rj9O8n9o6N5m4N9j02Q6k4k4N5J9k1K3n1K4pm3J37j17oO6Qj4j02
$$ 64 8 48 -1 32 41 22 90 31 -35 20 -24 35 -67 19 -5 -29 26 45 24 47 -4 20 13 -30 107 -10 -16 50 58 44 -58
5444e8K7K1p7Q0J6k4O5q4NO3o5lJ31l9j76J88m3k0k8R3l0J9k8o4O8j4K1j86Q6
$$ -58 -31 -10 -87 -7 9 -15 50 -34 -29 34 -31 -34 97 58 -118 70 27 7 -21 72 42 61 33 -31 37 23 44 -142 -56
5473e6J28j14n8L03k01j4m0L6Ol1O9L5J7j68K6J38J2j61kPJ65l0j59L4M0M2P3
$$ -56 72 -42 -100 203 2 -12 -52 -16 -10 -41 28 63 80 -88 -62 76 88 -73 -75 -68 97 67 -92 -58 -18 24 97
5500I7j8q8J1m6P3Q6j23P0L5k12R6k1N7j4m1K0l5J28q5L3L1o7L1Q1r5K9r8K6j2
$$ 97 79 -9 2 -44 29 115 -8 62 97 -115 -19 -40 17 3 -38 -18 -53 75 -10 23 54 -13 18 99 4 33 -65 -39 -51
5529e1O3j09L9R1o1NLm5J48j01r7J55q1J3P7j7%q4P2p9J54j00K9Q2J8k07J79l9
$$ -51 12 -97 -58 33 -28 -23 -20 -65 83 -18 -115 40 -41 -28 49 32 32 -52 20 -59 95 -5 24 106 124 -83 96 57
5557E7J8or8J87j13K0L9l0j08O8l8k6l4L2P0M7j10Q6o9o2O7l8KR6l3M5j41J77
$$ 57 75 69 -29 158 45 65 104 74 -34 34 -4 -30 -64 -32 38 85 -25 61 -8 -70 -3 -41 -39 57 24 69 -72 105
5585A05q3j65J40l9J02Q4j16k9m7J16j46J64p3n8K7q1J43o3K3j1J01q7L7P2j70
$$ 105 22 -143 -3 -42 60 144 28 -1 -48 68 -78 86 13 -45 -18 -99 44 -19 4 -7 94 7 44 116 -54
5610e4J92m3j13l9k1J39Q1j8m8l0j29L7PK8m9J81q9O0j58J64k04J13O8r9K4J2
$$ -54 138 95 -18 -57 -78 61 142 124 76 46 -83 -46 -39 -11 -60 121 32 92 -66 98 -106 7 75 -24 0 12
5636A2n7N4K8M5n4o5n7J36QQ6j00j06K10j07M0j35L4lk2L9K7K1j49J5j0J30rl
$$ 12 -45 9 37 82 28 -37 -94 42 50 136 36 -70 140 33 73 -62 -28 -31 -53 -14 13 34 -115 -100 -110 20 11 8
5664Hl0l9J21l9k0l2P0Q1j29m7N8mJ47j13K9k9q6K30j95LK3%j0O4j7q1J73j79
$$ 8 -22 -61 60 21 1 -31 39 120 -9 -56 2 -2 145 32 61 32 -54 176 -19 -16 7 7 -3 61 44 -37 136 -43
5692d3Q9j44J32l9P2j1k13J48j24J75J9n0K1j76R3M1rK2N1k4O1j38J01q0r3J05
$$ -43 46 -98 34 -5 67 56 -157 -9 -133 42 61 11 32 -144 -51 -10 -19 3 54 30 91 -47 54 -26 -119 -14
5718a4nN5p3J03p6J0lO4n1J3n1P5o0J3k0o2K7P6k2j3J2%l4J5O4o0Q4j7r5J2K1
$$ -14 -19 36 -37 66 -10 0 -3 61 10 23 -28 47 -13 0 -20 -82 -55 21 -1 -14 -2 -2 -36 -21 43 -17 67 50 -45 -33 -12
5749a2J5j9J9j0pL7J9Ko9k6N8n8J08j01nQK9L9q0J21j7j38J70j46J63q2m5l0J11
$$ -12 3 -16 3 -7 -14 23 42 44 -25 -51 7 -51 57 -44 -49 -41 -12 27 -53 68 51 -87 83 -63 100 18 -27 -57 54
5778E4lo7N7J6j20N9J39j86J1J6l7J65j73K3P6j0p7KM2K3m0P9Q0q8j01L3J41j47
$$ 54 51 -16 41 57 -63 -4 135 -51 -40 -24 -61 104 -69 -46 30 20 -57 -55 -13 10 -30 49 129 41 -60 -27 114 -33
5806c3J4J03l3l8K9mn8o3M8qN2j0R0K7j85J01NL2l4k6j1P6p0l1k4L8rP6l8pn8
$$ -33 -19 84 51 13 42 38 -20 -83 -35 -43 9 -1 89 116 -69 32 37 69 35 9 -2 74 4 -27 -51 -13 -22 54 16 9 -49
5837d9L3L9qJ11j23LQ5k4p0PL2nk2N9n8oL8j05L0k0J05j25R1n0L0p8J21j34Q7
$$ -49 -16 23 15 126 3 6 91 67 -3 4 36 31 9 68 10 4 42 -63 -33 -53 52 -73 18 -32 -2 -80 41 -93 -6
5866fj1n3O7OQ9O5j50Lj7l8N9q1J09n5Qm4O0lr3J63j12O2P2j05m9LJ18m9p4J74
$$ -6 -17 -70 -3 3 92 157 7 10 -7 -45 14 -67 42 -13 -5 -49 11 8 -85 78 -34 28 100 -5 -54 -51 67 18 -56 118
5896A18p2k6q5J26r0M1p5N0k98K64L45n09M42l93K07n1R3j09J57j27N2j10R8l6
$$ 118 46 20 -65 61 -29 12 -63 -13 -311 -47 298 -211 231 -162 45 -6 87 -22 135 8 60 -50 48 12
5920A2o6K5J1J05j37J00q8N5L5K0L2j52L3J2m4J22n9q7O4K8O3q5moL1R3j27Q1
$$ 12 -54 -29 -18 87 -50 50 -38 17 52 72 104 -48 -15 -3 -47 75 16 -71 -7 21 84 -1 -5 -11 20 113 -14 67
5948F7m7m5k5K5m5J33q7m3J18n9j09J10J66j29M4J9q4k3M8j18J04m9K00k60J97
$$ 67 20 -25 -50 -25 -70 63 -24 -67 51 -8 -117 -7 159 30 74 93 9 -14 34 -84 20 -29 171 -89 108
5973A08k18J33L0k1m3M3L1k1r7K5K3pj02J32m6l7P3q4M5L6N6q1J18j29M9k2R0
$$ 108 -110 23 53 32 -11 32 63 42 -55 -30 -7 -14 -116 16 -30 -67 6 -78 -33 3 59 -22 96 -33 16 -6 84
6000H4o2m9n2Q8r0J08J5m3n3J31p2o0K5J6N9l5N4N3r2j20J68m6r4O5O5p3PK3l1
$$ 84 22 -27 -79 9 -81 27 42 -1 -54 77 5 -55 -30 -14 45 10 64 117 25 -95 73 27 -67 -2 63 -10 -3 20 -11
6029a1Q7rr3J83j16n0K1r9P1P3K5n0l1J9j05O9j9l0J86r2o8K10j77lM5l7k3m0
$$ -11 76 67 -26 157 41 -9 12 -87 -16 57 82 32 1 20 -85 -16 -35 -65 121 29 -39 171 -6 -9 36 -1 -24 -64
6057f4J16p8M7O6p6J02j57Q7J1m0NK4K2j40J01q3J81o5j22kPR4J01j54P1K2o7
$$ -64 52 -26 21 87 11 113 -44 43 54 14 19 43 65 -75 26 -57 124 59 -63 -65 -58 36 137 -17 54 76 9
6084IK3Q8p1j54J74m9M4k5k0o8J76j36o7J12o3J2J4KJ00k14J0N7O8l8l1M9P2k
$$ 9 32 120 49 -105 69 20 64 39 19 -49 127 -9 -76 36 -27 -15 -1 1 101 -113 -103 -46 22 -16 -47 2 74 72
6112G2j29R2j07J31q1oM4l9J03j9k6j46J46j16J35N3j51o1L7R8J7Po6J7k6P5j05
$$ 72 -57 35 -72 59 -22 -28 16 -23 80 61 35 -111 35 -81 54 107 -44 -105 -68 30 47 54 -12 5 -21 54 -51
6139e1Q8j55K25k04J37K1j1m5m3n8O6J0J30j45J6L2L2L8q9R9p3k4Q0n8l1P3J0
$$ -51 37 -118 107 -97 40 61 50 5 -38 -96 -30 -20 110 -35 -19 13 45 83 -6 93 20 -4 76 18 -13 60 70
6166G0j25k6J5J11j4l6P6j13P6pK7M9j14L8J5m3n2M4M7n8k6J0J5J36j28q3J22
$$ 70 -55 -81 -66 45 31 -5 71 -42 34 27 54 103 -11 27 42 -1 -53 -9 38 -20 -46 -36 -21 115 -13 -96 26
6193B6m1j02l1J10R8Kn5j6P9m7o4R7q9JM3l7O0J10j44Q9j12N5K0k8j8J8P3j67
$$ 26 -15 -117 -148 -38 60 62 7 -9 70 23 -41 56 -33 -32 11 -26 34 144 0 89 -23 32 52 24 6 24 97 -70
6221g0J4Q7P2j37j2l9N6l4O0N9o9j1L8p6k1P2O8p9M2KM0j09N0K1j00N6P5j86J02
$$ -70 -56 31 103 -34 -46 -85 -29 -63 -3 56 -13 -24 14 -62 -83 -11 57 -22 20 22 62 -47 3 24 -76 -20 55 -131 -29
6250b9LO1l5J0j3j5K4N7k7p7L6kl8KL2O5%q4M8n5R2L5j75J6R2q2N7r9P0M4m7M7
$$ -29 -26 35 0 10 -3 -18 6 63 36 -41 -5 -7 -45 -43 -11 54 54 -30 18 -37 55 90 -85 -69 23 -59 -2 -101 -31 13 -34 13
6282A3N1q7Om4PL1J2N9m1P8lm8M3k2m9N6l7m7K7M4q6q0N2J32r4M4k8J5j5N7kp1
$$ 13 64 -23 -17 -61 -54 -23 -11 48 7 85 82 34 77 55 6 62 25 -22 5 49 -37 -117 -65 67 -27 17 -11 4 -11 46 44 -27
6314b7Q9j11K6J6q0O8r4OJ16J4k1o0R0m5rL6L7l7j2n3MqO5q9L5N3O4r7j3L9l4
$$ -27 62 -49 -23 -7 -87 -19 -113 -107 9 23 2 -58 32 -13 -22 14 51 14 2 -51 -47 -55 10 -79 -44 9 73 -24 -37 2 -32
6345c2KOM3m6P5n1l7K12k19J8j1pO7j29L6mo5J22L4J3j87J95j09j7K01q4J9j17
$$ -32 -30 -24 19 -27 48 -3 -40 172 -47 -29 -40 -47 20 -109 -73 -77 -142 -20 14 27 -160 35 -74 -91 110 26 45 -72
6373g2J31J5l8K2%K3j28K6J0P7j07o1N6J05Kk0N4j14NPM6j41K06q8M6k5m6j8P9
$$ -72 59 74 36 58 58 81 -47 -21 -11 66 -41 -102 -46 59 61 41 95 -19 -14 -7 39 -102 104 16 62 37 -9 -27 52
6402E2j07J2P8l8o8P3j9j7j6j9L8M4l9L5j17j3J01N3N5k7m6K5o5O1mo7Q1j8j23
$$ 52 -55 -43 35 -3 -71 2 -17 -34 -50 -69 -31 13 -26 9 -108 -121 -20 33 88 61 15 40 -25 36 32 -35 46 28 -95
6431i5P1Kl3L8j2J02j22M0M3rJ5R5j18K7j16K1j3N2Q1n9L0p0OJ49n9O3j36J2k0
$$ -95 -24 -22 -55 -17 -29 73 -49 -9 34 25 40 135 17 44 -72 -51 -64 -12 69 10 40 -30 -24 125 66 129 -7 5 -15
6460a5lkK4%J3j6M77o73j72M21j43J86o2l8K8k3J0QN4p8n5J20m6j7JR9r7Rp2K0
$$ -15 -18 -20 4 4 17 1 478 -195 -367 54 -89 97 35 -3 25 2 12 20 74 -4 -59 61 15 -2 -1 98 1 10 -62 -42
6490d2n9J2J15J2j44J15l2jn2J5J4L3K4m1k4J07Mm8N3o2j0R1m0m1N7p7O3p9K0
$$ -42 -101 -89 26 38 -106 9 -23 -24 -76 -61 -47 -14 10 -31 -55 52 56 8 61 -1 -11 80 40 -1 56 -21 42 -37 -17
6519a7j0P7j48J75q1n0O7q2J41k6p5K5L4k9JJ8r9J22L1rr4J03k8k3k4O7p1pJ0
$$ -17 -27 50 -98 77 -4 -54 13 -69 72 46 -29 -4 30 1 2 20 -79 43 74 65 -29 74 46 23 -1 66 -5 -12 -2
6548bP6q1lM2m0k6R3p6m3K4M8m9rq0J62Pj01J02r1L9O7ok3kR1p6Pq1l0J00j19
$$ -2 74 -7 -10 32 -8 -34 59 -17 -60 -36 12 -37 -46 -126 36 43 -58 44 -47 -8 59 53 30 28 119 43 50 -31 -61 39 -80
6579h0J14j57J73m3K0m6p2K10r7j05O0NJ06r6o5R8k6k5p2K9N8l3K8K0K6m6J6R
$$ -80 34 -123 50 7 27 -19 -91 119 22 -83 -23 -18 88 -8 -73 25 -1 -26 -98 -69 -11 -44 -16 4 30 -16 0 9
6607In3N9O8l5kp2Q0j90J71M3p8Ml6m2O1J05o7k6p1K7J11m0j7o7J20j51M2j9J16
$$ 9 -44 15 83 48 46 -26 54 -136 35 78 0 4 -32 -74 -13 92 25 -1 -72 -45 66 26 9 -58 62 -89 -47 -66 50
6636E0J3jN5m0P1j97Q8o4K7J14j44J34p0M5j40J2N2N7k9p3k1J4P7O4q2l4J02m4
$$ 50 63 62 117 77 148 -49 39 -25 2 116 -28 106 36 81 -59 -47 5 62 33 -40 -61 -47 30 94 12 -22 80 36
6664C6q9O9M3k9l3m2r8J69Lj17J39n9J7p0O0J3j15M9p8R2N6j17J96r6K5Pp7J0
$$ 36 -53 16 59 30 -3 -45 -143 26 29 -88 51 -8 9 -61 -1 12 -103 -54 -132 -40 16 -101 95 -1 24 31 -46 -36
6692c6j01K1N6J15m4M1p3m9J03J4k6r4K2K5LN4N4j05L6pK3j02n3Q0M3k2J8k7l0
$$ -36 -137 -116 -60 55 11 52 -21 -70 33 47 21 -73 -51 -26 -23 31 85 -20 16 9 32 -70 -123 -43 0 -22 -4 -31 -61
6721f1P3o0Q3j1l5rN2J4m5K3M9q9O0j05P3O6o1J6K6N5j57R9q8j10R3P2o6O5N7
$$ -61 12 -48 35 24 -11 -20 32 46 1 24 73 -16 44 -61 12 78 17 33 59 114 -43 56 -32 -142 -49 23 -43 22 79
6750G9n1n3Q9j3L7l7%l0P8k36O9J49nk5K6r9m2Q2o0O1K9q8N0qM4J3K5n7Q4j61
$$ 79 28 -25 64 51 88 51 51 21 99 -137 -68 81 76 51 77 -22 -64 18 -42 19 48 -40 10 2 46 59 84 27 111 -50
6780e0J02k05J25R2n2Kj55K47r0o3k3MNJ15kj9k6n4J91k84Q8N7m1J2L6p2J01o1
$$ -50 52 -153 -28 64 12 14 -141 106 16 -47 -70 -66 -61 54 52 33 7 -47 144 -140 -52 5 -36 -24 12 -60 41 -20
$$ [...]
8191G4
##END NTUPLES=NMR FID
##END=
