##TITLE=1H_DE-80H_X3
 200.13MHz, d2o
 8 sc
 
 19ns.26.2.2025
##JCAMPDX= 6.0         $$ Bruker NMR JCAMP-DX V2.0
##DATA TYPE= NMR FID
##DATA CLASS= NTUPLES
##ORIGIN= UXNMR, Bruker Analytische Messtechnik GmbH
##OWNER= pz
$$ XWIN-NMR		Version 3.5
$$ Tue Oct 21 11:57:55 2025 Russian Standard Time (UT+4h)  Yarkov@DPX200
##.OBSERVE FREQUENCY= 200.1313
##.OBSERVE NUCLEUS= ^1H
##.DELAY= (6, 6)
##.ACQUISITION MODE= SIMULTANEOUS
##.ACQUISITION SCHEME= undefined
##.AVERAGES= 8
##.DIGITISER RES= 18
##SPECTROMETER/DATA SYSTEM= spect
##.PULSE SEQUENCE= zg30
##.SOLVENT NAME= CDCl3
##.SHIFT REFERENCE= (INTERNAL, CDCl3, 0, 14.3821)
##AUDIT TRAIL= $$ (NUMBER, WHEN, WHO, WHERE, WHAT)
$$ ##TITLE= Audit trail, XWIN-NMR		Version 3.5
$$ ##JCAMPDX= 5.01
$$ ##ORIGIN= Bruker BioSpin GmbH
$$ ##OWNER= Yarkov
$$ C:/Bruker/XWIN-NMR/data/yarkov2/nmr/H-C/1/audita.txt
$$ ##AUDIT TRAIL=  $$ (NUMBER, WHEN, WHO, WHERE, WHAT)
(   1,<2025-10-21 11:56:55.53 +0400>,<Yarkov>,<DPX200>,
      <created by zg, POWCHK disabled, PULCHK disabled
       configuration hash MD5:
       00 E9 B6 7A A2 85 ED C7 34 08 36 98 17 FE 4E 26
       data hash MD5: 16K
       95 32 D4 5E EC 82 98 5A 91 62 7A 50 A5 60 1D 96>)
$$ ##END=
$$ 
$$ hash MD5
$$ B0 C1 FA E9 37 65 42 81 2F 6C D0 38 F1 92 88 9D
##$RELAX= 
##$RELAX= 
##$RELAX= 
##$RELAX= 
##$RELAX= 
##$RELAX= 
$$ Bruker specific parameters
$$ --------------------------
##$DU= <C:/Bruker/XWIN-NMR>
##$EXPNO= 1
##$NAME= <H-C>
##$PROCNO= 1
##$TYPE= <nmr>
##$USER= <yarkov2>
##$AMP= (0..31)
100 100 100 100 100 100 100 100 100 100 100 100 100 100 100 100 100 100 
100 100 100 100 100 100 100 100 100 100 100 100 100 100 
##$AQSEQ= 0
##$AQ_mod= 1
##$AUNM= <au_zg>
##$AUTOPOS= <>
##$BF1= 200.13
##$BF2= 200.13
##$BF3= 200.13
##$BF4= 200.13
##$BF5= 200.13
##$BF6= 200.13
##$BF7= 200.13
##$BF8= 200.13
##$BYTORDA= 1
##$CFDGTYP= 0
##$CFRGTYP= 5
##$CHEMSTR= <none>
##$CNST= (0..31)
1 1 145 1 1 1 1 1 1 1 1 1 1 1 1 1 1 1 1 1 1 1 1 1 1 1 1 1 1 1 1 1 
##$CPDPRG= <>
##$CPDPRG1= <>
##$CPDPRG2= <>
##$CPDPRG3= <>
##$CPDPRG4= <mlev>
##$CPDPRG5= <mlev>
##$CPDPRG6= <mlev>
##$CPDPRG7= <mlev>
##$CPDPRG8= <mlev>
##$CPDPRGB= <>
##$CPDPRGT= <>
##$D= (0..31)
0 0.7 0 0 0 0 0 0 0 0 0 0.03 0 0 0 0 0 0 0 0 0 0 0 0 0 0 0 0 0 0 0 0 
##$DATE= 1761033415
##$DBL= (0..7)
120 120 120 120 120 120 120 120 
##$DBP= (0..7)
150 150 150 150 150 150 150 150 
##$DBP07= 0
##$DBPNAM0= <>
##$DBPNAM1= <>
##$DBPNAM2= <>
##$DBPNAM3= <>
##$DBPNAM4= <>
##$DBPNAM5= <>
##$DBPNAM6= <>
##$DBPNAM7= <>
##$DBPOAL= (0..7)
0.5 0.5 0.5 0.5 0.5 0.5 0.5 0.5 
##$DBPOFFS= (0..7)
0 0 0 0 0 0 0 0 
##$DE= 6
##$DECBNUC= <off>
##$DECIM= 32
##$DECNUC= <off>
##$DECSTAT= 4
##$DIGMOD= 1
##$DIGTYP= 9
##$DL= (0..7)
0 120 120 120 120 120 120 120 
##$DP= (0..7)
150 150 150 150 150 150 150 150 
##$DP07= 0
##$DPNAME0= <>
##$DPNAME1= <>
##$DPNAME2= <>
##$DPNAME3= <>
##$DPNAME4= <>
##$DPNAME5= <>
##$DPNAME6= <>
##$DPNAME7= <>
##$DPOAL= (0..7)
0.5 0.5 0.5 0.5 0.5 0.5 0.5 0.5 
##$DPOFFS= (0..7)
0 0 0 0 0 0 0 0 
##$DQDMODE= 0
##$DR= 18
##$DS= 0
$$ [...]
##$SUBNAM2= <"">
##$SUBNAM3= <"">
##$SUBNAM4= <"">
##$SUBNAM5= <"">
##$SUBNAM6= <"">
##$SUBNAM7= <"">
##$SUBNAM8= <"">
##$SUBNAM9= <"">
##$SW= 18.0517328524113
##$SWIBOX= (0..15)
0 0 2 0 0 0 0 0 0 0 0 0 0 0 0 0 
##$SW_h= 3612.71676300578
##$TD= 16384
##$TD0= 1
##$TE= 0
##$TE2= 300
##$TE3= 300
##$TEG= 300
##$TL= (0..7)
0 120 120 120 120 120 120 120 
##$TP= (0..7)
150 150 150 150 150 150 150 150 
##$TP07= 0
##$TPNAME0= <>
##$TPNAME1= <>
##$TPNAME2= <>
##$TPNAME3= <>
##$TPNAME4= <>
##$TPNAME5= <>
##$TPNAME6= <>
##$TPNAME7= <>
##$TPOAL= (0..7)
0.5 0.5 0.5 0.5 0.5 0.5 0.5 0.5 
##$TPOFFS= (0..7)
0 0 0 0 0 0 0 0 
##$TUNHIN= 0
##$TUNHOUT= 0
##$TUNXOUT= 0
##$USERA1= <user>
##$USERA2= <user>
##$USERA3= <user>
##$USERA4= <user>
##$USERA5= <user>
##$V9= 5
##$VALIST= <valist>
##$VCLIST= <CCCCCCCCCCCCCCC>
##$VD= 0
##$VDLIST= <DDDDDDDDDDDDDDD>
##$VPLIST= <PPPPPPPPPPPPPPP>
##$VTLIST= <TTTTTTTTTTTTTTT>
##$WBST= 1024
##$WBSW= 4
##$XGAIN= (0..3)
0 0 0 0 
##$XL= 0
##$YL= 0
##$YMAX_a= 39572
##$YMIN_a= -49263
##$ZGOPTNS= <>
##$ZL1= 120
##$ZL2= 120
##$ZL3= 120
##$ZL4= 120
##$ABSF1= 10
##$ABSF2= 0
##$ABSG= 5
##$ABSL= 3
##$ALPHA= 0
##$AQORDER= 0
##$ASSFAC= 0
##$ASSFACI= 0
##$ASSFACX= 0
##$ASSWID= 0
##$AUNMP= <proc_1d>
##$AZFE= 0.1
##$AZFW= 0.1
##$BCFW= 1
##$BC_mod= 2
##$BYTORDP= 1
##$COROFFS= 0
##$CY= 83.5205535888672
##$DATMOD= 1
##$DC= 2
##$DFILT= <>
##$DTYPP= 0
##$F1P= 10.8118882576601
##$F2P= -7.23987719738617
##$FCOR= 0.5
##$FTSIZE= 0
##$FT_mod= 4
##$GAMMA= 1
##$GB= 0.15
##$INTBC= 1
##$INTSCL= 1
##$ISEN= 128
##$LB= 0.25
##$LEV0= 0
##$LPBIN= 0
##$MAXI= 10000
##$MC2= 0
##$MEAN= 0
##$ME_mod= 0
##$MI= 1.114404
##$NCOEF= 0
##$NC_proc= 0
##$NLEV= 6
##$NOISF1= 3.799351
##$NOISF2= 2.8
##$NSP= 1
##$NTH_PI= 0
##$NZP= 0
##$OFFSET= 14.38212
##$PC= 1
##$PHC0= -4079.816
##$PHC1= 14.22191
##$PH_mod= 1
##$PKNL= yes
##$PPARMOD= 0
##$PSCAL= 0
##$PSIGN= 0
##$REVERSE= no
##$SF= 200.129724274929
##$SI= 16384
##$SIGF1= 3
##$SIGF2= 2
##$SINO= 400
##$SIOLD= 16384
##$SREGLST= <1H.CDCl3>
##$SSB= 0
##$STSI= 0
##$STSR= 0
##$SW_p= 3205.1282051282
##$SYMM= 0
##$S_DEV= 0
##$TDeff= 0
##$TDoff= 0
##$TI= <>
##$TILT= no
##$TM1= 0
##$TM2= 0
##$TOPLEV= 0
##$USERP1= <user>
##$USERP2= <user>
##$USERP3= <user>
##$USERP4= <user>
##$USERP5= <user>
##$WDW= 1
##$XDIM= 8192
##$YMAX_p= 0
##$YMIN_p= 0
$$ End of Bruker specific parameters
$$ ---------------------------------
##NTUPLES= NMR FID
##VAR_NAME=  TIME,          FID/REAL,        FID/IMAG
##SYMBOL=    X,             R,               I
##VAR_TYPE=  INDEPENDENT,   DEPENDENT,       DEPENDENT
##VAR_FORM=  AFFN,          ASDF,            ASDF
##VAR_DIM=   8192,          8192,            8192
##UNITS=     SECONDS,       ARBITRARY UNITS, ARBITRARY UNITS
##FACTOR=    0.0002768,     1,               1
##FIRST=     0,             0,               0
##LAST=      2.2672688,     0,               0
##MIN=       0,             -49263,          0
##MAX=       2.2672688,     39572,           0
$$ Real data points
##PAGE= N=1
##DATA TABLE= (X++(R..R)), XYDATA
$$ [...]
1390c2J60j68K50J5r7J01j48K03k25j04nk12J98j53NQ3J04k36K08M0R4j58j1Q
1414h0J97N8N2j10M1P5o9q3j43pK6n9j71J59R4j66N1J25k25K21L7R2j9m6J82m2
1440A90j32K7J70k11J62j93k8kp0J6r1J62K5k25J63M4n2J8L1J42K05k69L5Kj2
1465A07J14k02O3j71r4J95k02K4p8J54p9J79k04J59J01m6J5J3o5K65p8m3L4P3
1489B34k34n6J7m6j89K9r7J89R6j61J38J9J02m4P2K7nM9K7j5J5k08l2J57j77j8
1515a11k4r5J22k7j3n3L46k34J94Pj13J71N9r8q3J19O8N4l55J53jk3j0j67q2J0
1541a86J54l84K85O9p7J66p0N3J14j24Q8o4J50n5J77l23L1m5j18O4r9J64j52O4
1565a18Q7n9R9p8J91r5J46j38P3o1j45J65J55j86j72m3J12J22n3j24J2O2o7k49
$$ plain form
1390 -32 128 -40 210 225 128 229 81 284 59 -45 -50 -262 -64 -217 -212 -129 -25 -261 -53 -13 81 -77 -88 -80
1414 -80 117 175 227 117 158 233 164 81 -62 -69 -43 -102 -273 -114 -20 -186 -135 -10 -235 -14 23 115 96 50 232 190
1440 190 58 85 255 44 206 13 -15 -17 -87 -71 -162 0 25 -200 -37 7 -45 -27 4 146 351 82 117 119 107
1465 107 221 19 82 -89 -183 12 -190 -166 -244 -90 -169 10 -194 -35 66 20 35 48 -17 248 170 127 161 234
1489 234 0 -56 -39 -85 -274 -245 -342 -153 -57 -218 -80 -61 41 -3 69 96 91 140 167 152 167 -41 -73 84 -93 -111
1515 -111 -135 -230 -108 -135 -148 -201 145 -89 105 112 -1 170 229 131 48 167 235 289 -66 87 86 63 53 -114 -196 -186
1541 -186 -32 -416 -131 -62 -139 27 -43 10 124 0 88 24 174 119 296 -27 4 -41 -159 -95 -194 -30 -182 -118
1565 -118 -31 -90 9 -69 122 27 173 35 108 47 -98 67 222 36 -136 -179 -67 55 2 -122 -110 -48 -115 -364
1589c64M22kN6Q3j48nQ0O4j65J90j37P5j93kRj63N4J26j11J01j30JJ71j3q3R9
1615A5M4qR1j46P5K63l98K65k83J28l9j05lO8j63O9O7rN9j12J17J53j38K09j10
1640A09OJ34k36J74j04J8o2j84R5o8j00L0j03j7J69j16J69J4J52p8P4q4J54oO2
1665B02o8q6O4o4j66J07j21KJ02j55P8k9MM0P3N2j9p5J76nJ73k42K3J41k83K98
1691B22k73N3m2j69K21k10L02k29M2p5O3J46J0n1m1J09K2J06kj22n5Q2j44L9r7
1716i3j94K18j32P7j93L32n2p3J23J29kj76N6OP0r3J1P9O8j77J43j19j07RK41
1741A51k61o8j32J59p4K52K2oj42J99L5p7J09M1M1q3p9j10K2mr8K7k7m8k3p0J71
1768g3j84J37J74j8j58J55K8M9l6J2J67j07j86n2J85l31L3J2OJ08k9j3pJ75j71
$$ plain form
1589 -364 58 56 112 195 47 42 122 186 21 211 74 149 -44 -46 -37 -200 -146 -20 -131 -30 -160 -159 12 -1 -84 15
1615 15 59 51 142 -4 71 334 -64 201 -82 46 7 -98 -101 -33 -196 -127 -60 -69 -10 -122 -5 148 10 219 109
1640 109 115 249 13 187 83 101 39 -145 -50 -118 -218 -188 -291 -308 -139 -255 -86 -72 80 2 76 -8 146 140 202
1665 202 134 48 112 48 -118 -11 -132 -130 -28 -183 -105 -134 -130 -90 -17 35 16 -59 117 112 285 43 66 207 -76 222
1691 222 -51 2 -40 -209 12 -198 104 -125 -83 -158 -95 51 61 10 -31 78 100 206 204 82 27 109 -35 4 -93
1716 -93 -287 -69 -201 -124 -317 15 -37 -110 13 142 140 -36 20 26 96 3 14 93 161 -16 127 8 -99 -90 151
1741 151 -110 -178 -310 -151 -225 27 49 43 -99 100 135 58 167 208 249 166 87 -23 -1 -5 -103 -76 -103 -151 -174 -244 -73
1768 -73 -257 -120 54 36 -122 33 61 110 74 86 253 146 -40 -92 93 -238 -205 -193 -187 -79 -108 -121 -128 47 -124
1793a24J57J42q0j8Mj26J68k22M0J41J33j43k87K25j3J22l18r1J15L15j74j81
1815b15J40L1j6J90M1j9J7j9k97J45MO3P7k59M0m1o5P6j27K00Q3o1jj1J53r3M2
1842G8n7J87j50j5K6q0q5J69j28j29J64o3O0p5J37r2R2n4J61p6j88K56k05K89
1866B22j74J07j44J15l28K38P0j35n0p4R3J1j67M6M9J56kJ4j27Q9P0k31K43k30
1890a39J30N3QjL9j31K3j21J38r9k0J14p4l9Q3Q5k7J13Q0Rj88k2j8J90j62M2j70
1917a04R2m7j67K6J83k03R6O5n6L8JJ01M8LK19k44l4P2j27k3oQ5r4j4J19m0j44
1944a55J02N6pj13r6J30K10j07J43j42M4J80j89j37N3P0Ml1k49J26M6K1J06j11
1968d6P3j92k7K30n5J47k8j07L3p8Q3J07k98K57j52J4J18j53K3o3l3j44K69NL2
$$ plain form
1793 -124 33 175 95 77 81 -45 123 -99 -59 82 215 72 -215 10 -3 119 -199 -290 -175 140 -34 -215
1815 -215 -75 -44 -60 130 171 152 169 150 -147 -2 2 65 142 -117 -77 -118 -183 -107 -234 -34 49 -12 -13 -24 129 36 78
1842 78 21 208 58 43 69 -11 -96 73 -55 -184 -20 -83 -23 -98 39 -53 39 -15 146 70 -118 138 -67 222
1866 222 48 155 11 126 -202 36 106 -29 -79 -153 -60 -49 -216 -170 -121 35 33 47 -80 9 79 -152 91 -139
1890 -139 -9 44 52 51 90 -41 -18 -139 -1 -100 -120 -6 -80 -119 -36 49 22 135 215 224 36 14 -4 186 24 66 -104
1917 -104 -12 -59 -226 -200 -17 -220 -124 -59 -115 -77 -76 25 73 76 295 51 17 89 -38 -61 -67 18 -76 -90 29 -11 -155
1944 -155 -53 3 -4 -117 -213 -83 127 20 163 21 65 245 56 -81 -28 42 46 15 -234 -108 -62 -41 65 -46
1968 -46 27 -165 -192 38 -17 130 102 -5 28 -50 33 140 -158 99 -53 -39 79 -74 -51 -114 -147 -291 -22 -17 15
1993A5J1j9mJ4J1j52J22qJ34q8j79J81j26j12K48j8n3J5k5KN6j29J7J00J22k5
2019A10M3o4M4j03K2N5j61j10Q3P4k9j3n4K1j14J05j9Q7L3m1J33m5j65J52Q1N0
2045A75j35J73k33K2R6L0j02j40j60K05O9K7k92J62L2j13K74j48j33J90M9K66
2067C14l42J88l7j39J10j47l4K1n1m4J50lm2O4pL9k5k2K32j94O7J8M2j90m7K18
2093A39j48J80j47M9k08Q9J13j72J40N8k12J77j26J94p0J20j0M2o2j32n9K23k11
2116c3k4J11o2n2Q2j52J7m2J75q5M6m3J10k6m0NK05j27J9J50j47p9o0Q1j08r5
2142a74K30K0j50J52j83P0r0L7J83j17J40j68p5L91k23q0J48m4J40r0k07J49m
2165E5m5j82K59k4j82M0O3r3M8L5J57n4j15J1K11j11m8J46k8k59K30j33p5J14
$$ plain form
1993 15 26 7 3 17 28 -124 -2 -10 124 36 -143 38 -88 -200 48 30 -23 -8 -33 -31 25 -104 -87 13 135 110
2019 110 153 89 133 30 52 107 -54 -164 -81 -7 -36 -49 -103 -82 -196 -91 -110 -23 10 -31 102 57 -108 44 125 175
2045 175 40 213 -20 2 98 128 26 -114 -274 -69 0 27 -265 -103 -71 -184 90 -58 -191 -1 48 314
2067 314 -28 160 123 -16 94 -53 -87 -66 -117 -161 -11 -14 -56 8 1 40 15 -7 225 31 98 116 158 -32 -79 139
2093 139 -9 171 24 73 -135 -46 67 -105 35 93 -119 58 -68 126 56 176 166 208 146 14 -45 178 -33
2116 -33 -57 54 -8 -60 22 -130 -113 -155 20 -65 -19 -62 48 22 -18 -13 192 65 84 234 87 8 -52 29 -79 -174
2142 -174 56 76 -74 78 -105 -35 -125 -88 95 -22 118 -50 -125 266 43 -37 111 67 207 117 -90 59 55
2165 55 10 -172 87 63 -119 -79 -16 -109 -61 -26 131 77 -38 -27 184 73 25 171 143 -116 114 -19 -94 20
2189B0j80n1K06j25K92m0n6k5r1K46k44K10j51j10R5Mo2J25j78N5oN9o4L1P8m8
2215a0r6O0K15j61J1M1o8R0m0J10k02N4Nj58O1mP6pO8j32L4%K5r7J07p1K67o3
2243A15j43l3J02n0L5O8L4o1j39j8L8l8J02j68J27PkK20l8j81j8J37M8j09K3P2
2269A30k88J22J14Q2k79J77k08M24l27J1mJ06j81nJ4K49k8JRL2j48J04L9j21K1
2294D6l2Pq6j45L60j85q3j7p2N2k3K05J06j84n3N0j0K07r9l9J51j06p6M6j99L08
2320A29k48K68j39j43Q4O9K5j11J34j06J34j02J20q7J16j27Q8j00J09j39P7k7
2342B4N5j44q5K22j01o2K42q7l7l8O7J01j04j42L82k66o7K38k17J07j03L2o0J15
2366G2j55J38J8n5j11jR3j10K50m9o9K9J6jL8L9k05M4Q4ko7M3r5J51k77RN2K1
$$ plain form
2189 20 -160 -211 -5 -130 162 122 66 41 -50 196 -48 162 11 -99 -4 0 -62 63 -115 -60 -66 -7 -71 -40 38 -10
2215 -10 -106 -46 169 8 19 60 -8 82 42 152 -50 4 9 -149 -88 -92 -16 -23 45 -87 -53 -53 -28 -125 -18 -89 178 115
2243 115 -28 -61 41 -9 26 94 128 67 -72 -90 -52 -90 12 -156 -29 -22 -24 196 158 -23 -41 96 144 35 58 130
2269 130 -158 -36 78 160 -119 58 -150 274 -53 -42 -46 60 -121 -126 -112 137 109 110 119 151 3 107 146 25 46
2294 46 14 21 -65 -210 150 -35 -118 -135 -207 -155 -178 27 133 -51 -104 -54 -64 143 44 5 156 50 -26 20 -179 129
2320 129 -119 149 10 -133 -49 20 45 -66 68 -38 96 -6 114 27 143 16 104 4 113 -26 51 24
2342 24 79 -65 -150 72 -29 -91 151 64 27 -11 56 157 53 -89 293 27 -40 198 -19 88 -15 17 -43 72
2366 72 -83 55 73 18 -93 -94 -1 -111 139 90 21 50 66 65 103 142 -63 -19 65 63 -4 39 -56 95 -182 -173 -121 -100
2394a00P2P5m7pQ8M8j45J06k12K00k20K90j03n2N6p3K19l77J45Jk9L8j33J67j13
2419a06J47Pk0P6L3j97K86k64R4k2n7k9q9J14j9j44J41p6K11j12q5P9j46J60Q3
2444F5j9J37r0k09K38j05K12j07k52O1J13j32l5L8N0LJ45m3k59K60L3J2lj02j18
2469a07P5J19o4K8j22Q1p9J25j84km8K02J6p0R5j23J9J49Jk28K24o3m9K3N9j2
2495F5Kl1j30j32J00PN9K17k53l1Q1Q7K05l85J81P1l1r4Q8J1m3P3j88J08j05j
2521f9L8mR8k01K33j20J4nN4L2k5j8n6J38M2j39o7J8O7Pj00R5p7K47k57q5O4J43
2549F7J29j80j47L9Q4N9L8j31J87j29J11j09j39L09k44J66j30J68m1j53Kk3K32
2572A65k46K7L3J09rj46m5K18p1m0L9J6j74J8K07k02K6N5J20l59J76Qo5K0R6k2
$$ plain form
2394 -100 -28 47 0 -7 81 129 -16 90 -122 78 -142 148 45 -7 49 -24 195 -182 -37 -36 -65 -27 -160 7 -106
2419 -106 41 48 28 104 137 -60 226 -38 56 34 -23 -52 -141 -27 -46 -190 -49 -125 86 -26 -111 -32 -178 -18 65
2444 65 46 183 93 -116 122 17 229 122 -130 -69 44 -88 -123 -85 -35 -32 113 70 -189 71 104 116 113 11 -107
2469 -107 -32 87 23 51 -71 10 -69 56 -128 -130 -178 24 40 -30 65 -58 -39 110 111 -117 107 44 -5 18 77 65
2495 65 67 36 -94 -226 -126 -119 -60 157 -96 -127 -46 41 246 -139 42 113 82 -12 76 87 44 117 -71 37 -68 -69
2521 -69 -31 -35 63 -138 95 -25 -11 -16 38 70 45 27 -29 109 151 12 -55 -37 30 37 -63 32 -45 202 -55 -140 -76 67
2549 67 196 16 -131 -92 -8 51 89 -42 145 16 127 18 -121 188 -56 110 -20 148 107 -46 -44 -67 165
2572 165 -81 -54 -21 88 79 -67 -112 106 35 -5 34 50 -124 -106 101 -101 -75 -20 100 -259 -83 -75 -140 -120 -24 -46
2598d6l4J73j8N7j71Q9k0l8J7m0m3M1L3j26J79j62J34j8m1j13Q3K3l8L5MJ18R9
2625A77j89M1jJ76k39R4k44K34j66Q0N1l3J95k55P7o4O4l6J13m5q4J12o8J85K5
2650B00l88K10J03j58J07l3J2j35N1J6r1m0K14j36K7j04J70l7R9m4J21N2j16M5
2674A45j18M7q2L1j33J64j19j42J85j30J48m2J02k1q9J33M0o1J24k13J47j93Q3
2697FK16j54k16J08q6J08l4J54j47L5N0oj4P1j01K88k39N8M8j15L7j73K30n6l9
2722B9j46L0P6M4j82J38j60R0M5K0M3j35Q4O2n2K0P0m1j04n0J13k9J7o5J40j00
2748d3M2j02l9J36Np4J72m5j67K6J79K1j07n6K20j55j09K71k45RL3r4l1L9N4j1
2774g1N3J32k71K96k35M5J47o8J77j73M1J14j04mj08Mj33J01M4Q7j15pQ2r4P6
$$ plain form
2598 -46 -80 93 75 132 -39 50 30 -8 9 -31 -74 -33 0 -126 53 -109 25 7 -34 -147 -64 -41 -79 -44 -40 78 177
2625 177 -12 29 28 204 -35 59 -185 49 -117 -37 14 -19 176 -79 -2 -66 -2 -38 75 30 -54 58 -10 175 200
2650 200 -188 22 125 -33 74 41 53 -82 -31 -15 -106 -146 68 -68 -41 -145 25 -12 87 43 164 216 100 145
2674 145 27 74 -8 23 -110 54 -65 -207 -22 -152 -4 -46 56 35 -54 79 119 58 182 -31 116 -77 6
2697 6 222 68 -148 -40 -126 -18 -52 102 -45 -10 40 34 20 91 -10 278 39 97 145 30 67 -106 124 68 29
2722 29 -117 -87 -11 33 -149 -11 -171 -81 -36 -16 27 -108 -24 38 -14 6 76 35 -69 -119 -6 -35 -18 -83 57 -43
2748 -43 -1 -103 -142 -6 -1 -75 97 52 -115 -89 90 111 4 -52 168 13 -96 175 -70 -61 -28 -122 -153 -114 -60 -71
2774 -71 -18 114 -157 139 -96 -51 96 28 205 32 73 187 83 79 -29 -25 -158 -57 -13 74 -41 -48 34 -60 16
2799A6J1O4o4J50j61P1j07j3OJ46j55L8k1M3j26l2J13J1k8j81R0J03j03J37N5
2824F3k07K75J7r0p6K53j26k64J85j6r5RK68j87k90L26q8Q4j8k2k19K96l5m7k0
2849b4M2J1ll3j37J57k7O1K4P6l08J60j35J86j25k5J08j47O0J85n7K09j73l4J8
2874F9J34j44j47l0P4N4J04l59K33J7O8k19O2j17K28Q7k23J82J45k54j2J6Q2n1
2898aJ03j49n8J26n2J7M3j04N6r2P1N4N0k6N4j58K0R2j34J12j00K80k58J4J93
2923A53k39M4l7m7J59n7J5pj17P8J1P4m4nM8k2m1J25j58L4L7J06j73L6j4M7J30
2950A36k81Q5M0o2L6j5L7Q7q6k0K03j85Q7j69J27L7o9Q2j25J6J08j9K8j88K19
2975A09n5n1j6j34R7J44p5j91L56lk72j14J95J30k13J52k23J02J9l0P4k23R7M5
$$ plain form
2799 16 27 91 27 177 16 87 -20 -33 -27 119 -36 2 -19 24 -102 -134 -21 -10 -38 -219 -129 -26 -129 8 63
2824 63 -144 131 148 58 -18 235 109 -155 30 14 -81 -72 196 9 -281 45 -43 41 23 1 -218 78 43 -4 -24
2849 -24 18 29 26 -7 -144 13 -14 47 71 147 -161 -1 -136 50 -75 -100 8 -139 -79 106 49 258 85 51 69
2874 69 203 59 -88 -118 -44 10 114 -245 -12 5 73 -146 -84 -201 27 114 -109 73 218 -36 -48 -32 50 -1
2898 -1 102 -47 -105 21 -31 -14 29 -75 -19 -111 -40 14 64 38 92 -66 -46 46 -88 24 -76 204 -54 -40 153
2923 153 -86 -42 -79 -126 33 -24 -9 -16 -133 -55 -44 30 -14 -19 29 7 -34 91 -67 -33 4 110 -63 -27 -41 6 136
2950 136 -145 -60 -20 -82 -46 -61 -24 63 -23 -43 160 -25 62 -107 20 57 -12 70 -55 -39 69 50 78 -110 109
2975 109 54 3 -13 -147 -50 94 19 -172 184 181 -91 -205 -10 120 -93 59 -164 -62 -43 -73 1 -222 -125 -80
2999h0J60j16KQ1J11j42m2PN9P4J6K0j26l9n2N5N5q8J14k39J05j6R1o9k5R4j2
3026bJ5p1N2J79l0J4k86J53J01kk57n7J93j66J82k50J97j04J97k19J44r1J21l7
3050b4k0P4J6n5M8m9J4q2q1R4J43j16KO6r7J50n9l4j68N5J08oQ3q7L6J35j67o
3078b7R0P6k54Qj9J78j93J40j14Mo1J21O6j8R6j58K01j51Q0Jl1M7j62J82j92q0
3104a70J34J04k9r4Q4j22K07p7J1r7Q7N2k5m3l7O0O0k82J17O3N1j47L2j35K34
3129C8j84J60m2J29k22J33K51l49K19q4j19P7J43r5or9J74k62J09K5R0j58Np5
3153a42P1J22O3k40p7J86J43k15K72r2j13R6m4J4k3j50K6J38n4Jq2L06k03p5P6
3178DJ5k1j38J15J32j03n0pN4N9j43J55K5n3J4mJ7j51lP4O8o7k4l4L1q2K26j11
$$ plain form
2999 -80 80 -36 -34 47 158 16 -26 -19 40 114 130 150 24 -15 -67 -12 43 -45 69 -170 -65 -81 10 -59 -84 10 -2
3026 -2 13 -58 -6 173 143 157 -129 24 125 123 -134 -191 2 -164 18 -232 -35 -139 58 -161 -17 -108 13 -24
3050 -24 -44 30 46 -9 39 -10 4 -78 -159 -65 78 -38 -36 30 -67 83 24 -10 -178 -123 -15 -21 62 -25 11 146 -21 -27
3078 -27 63 139 -115 -107 -126 52 -141 -1 -115 -111 -172 -51 15 -3 93 -65 136 -15 65 66 35 82 -80 102 -90 -170
3104 -170 -36 68 39 -55 29 -93 114 37 48 -49 38 90 65 22 -15 45 105 -177 -60 3 54 -93 -61 -196 38
3129 38 -146 14 -28 101 -121 12 263 -86 133 49 -70 7 150 55 49 -50 124 -138 -29 -4 86 -72 -67 -142
3153 -142 -71 51 114 -126 -203 -17 126 -89 183 91 -22 74 30 44 21 -129 -103 35 -19 -18 -100 206 3 -72 4
3178 4 19 -2 -140 -25 107 4 -46 -53 1 60 -83 72 97 44 58 54 71 -80 -83 -9 59 -8 -32 -66 -35 -117 109 -2
3206bL0J30k90K12j49P6JP9L9k38J8J0k0J21j58J31j73J28N5R3m2p6J53j66J77
3231A39o0j75O2J6k6Pj5lK7N6O1k28J66N3j13l4K9m6R4L1J24k54J52j28K16j96
3257d5j5P4Qj16Jp1Q5O6k5n3J30n9MK32k08K14k01j0O1r3N1L8j34K6p2J42j67
3284a37L1P5n3%J04j12L7K0J30K4l31K02j2j4L1R3J4l8j10Qk2m6O2J03k11K55
3310A03r8Kq4J53j44R0rk5J37j30l1j25K56p1K9J24k23J6j72Q4O8J74j2k07K78
3335A83j52q9Q2P7m1L9l39K99OM1J13l35J86j44K1J29j23J54p5m5l2m7n6K01j15
3360f2J84j95K13kq0J23k55J77q1m0q9JJ70Kp6l0K6o9N3K5r5J57j15r3J2J45k1
3387a5JM0J1m4o6J8J39n8Q8j04j2k1N5R9j00M4j11J90k01L8j56K61p0k4J16k47
$$ plain form
3206 -2 28 158 -132 80 -69 7 8 87 126 -112 -94 -84 -104 17 -141 -10 -183 -55 0 93 51 -25 128 -38 139
3231 139 79 -96 -34 -18 -44 -37 -52 -55 -28 28 89 -139 27 80 -33 -67 -38 -84 10 41 165 -89 63 -65 151 -45
3257 -45 -60 14 22 -94 -93 -164 -79 -13 -38 -91 39 -20 -16 216 8 222 21 11 72 -21 30 68 -66 -40 -112 30 -137
3284 -137 -106 -31 -84 -84 20 -92 -55 -35 95 119 -212 -10 -22 -36 -5 88 102 64 -46 -38 -60 -106 -44 59 -152 103
3310 103 5 7 -77 76 -68 22 13 -12 125 -5 -36 -161 95 24 53 177 -46 -30 -202 -118 -50 124 112 -95 183
3335 183 31 -58 24 101 60 99 -240 59 65 106 219 -116 70 -74 -53 76 -47 107 32 -13 -45 -92 -148 53 -62
3360 -62 122 -73 140 138 58 181 -74 103 22 -18 -107 -106 64 66 -10 -40 -14 -83 -30 -5 -100 57 -58 -151 -139 6 -15
3387 -15 -14 26 37 -7 -73 -55 84 26 114 10 -2 -23 32 131 31 75 -36 154 -47 -9 -165 96 26 2 118 -129
3413a29J00j07K6K32j35kj47M9K77j87J29m4k24J05J57l3j00o0J50j21P0M2R3
3436A41K3k06N2J0j09r5K14l3RN6L1j84J39j1KNK8k4R0O7k48J86j33o9J91k16
3462h4L7k1Q8o7q9J69j9l0l7J5J15R8k33J06J12k03J25j98J74j8j29N2j48J35
3486e0M5j57J12m9K03q2k6Pn6J37K3j04J05N9k61J35n9N0j39J24m5k2r1J59qj78
3512a68L07k38L0K6O0o2J06qk2k3n5J03p3K72k61Nk8J02j54J62p9k1R2j58K25
3537A40k7p8J18o4Lp8k5l1j07J72r0o8J22J9j32J25R0J9k93J88k3mP1N8K6ll9
3564H9O0j84M2N2MO9j32j65Jl0J93Q5r9k8o1J8q5K83j89J34L1r4j00L86k54j72
3590a46J27R8j53J77k38K23o2j49J23Q3j33N7N5J1q9N6R7n5J24j74o9n5K47j7
$$ plain form
3413 -129 -29 -136 -110 122 -13 -15 -162 -113 164 -23 106 62 -162 -57 100 67 -33 -93 57 -64 6 48 141
3436 141 164 -42 10 20 -89 -184 30 -3 6 62 93 -91 48 37 39 44 72 48 138 205 -43 143 10 -59 132 -84
3462 -84 -47 -68 20 -47 -136 33 14 -16 -53 -38 77 175 -58 48 160 -43 82 -116 58 40 -89 -37 -185 -50
3486 -50 -5 -162 -50 -99 104 22 -4 3 -53 84 107 3 108 167 -94 41 -18 32 -107 17 -28 -50 -141 18 10 -168
3512 -168 139 -99 -69 -43 17 -45 61 53 31 8 -47 56 -17 255 -6 -1 -29 73 -81 81 2 -19 73 -85 140
3537 140 113 35 153 89 92 14 -11 -42 -149 23 -67 -135 -13 6 -126 -1 89 108 -185 3 -20 -24 47 105 131 128 89
3564 89 149 -35 7 59 63 132 0 -165 -164 -194 -1 84 -15 -43 -104 -86 -171 112 -77 57 88 -6 -106 280 26 -146
3590 -146 -19 79 -74 103 -135 88 26 -123 0 83 -50 7 62 73 -16 40 137 82 206 32 -37 -92 155 138
3614A38o1j7o7P2q4kk0j0J6l5J05Om6L6N4o4L2q7l8L6J20J14j74j6O0jmJ7k22
3643a42J40L5J52j65j90M10l51mJ69J33j88k1k4m1L8R1M5n2j06J97j56p7O0j42
3667a89J96k7O1j33R8J47l0K2Qj05Q5j7j58O3m0P0j02lJ7O2m9j6N3M4j69J21j1
3694bN0k8P4m4QJ2k01J70kL8k04P9K8J55k76K0K05P1j34l3j8k2J2J49j04j43L37
3721A97l09Q7j3Q8J18M8k22q9OJ80M7j27m0K3J03j22J34p9K9M8o9O4K12k66j26
3746g8R6m5M8m4N3j05J34j31Q2k25J57N3j88K00j32Q9p5J51J54p1rL8J1k09J19
3771G3R9j71J1L5j17J8k4K5J88j43j4j38K66k38K91j92j73J51pJ8r3J34j54J23
3795c2l8l5O7M4L4l9O1m5R9j15r3J18n1J22o7J9m8l6L4j30K4j10K37j64N2R2M
$$ plain form
3614 138 77 60 -7 65 -19 -21 -41 -51 -35 -70 35 41 -5 31 85 21 53 -34 -72 -36 84 198 24 8 68 67 63 80 -142
3643 -142 -2 33 185 20 -170 240 -111 -115 54 187 -1 -22 -46 -87 -49 42 87 35 -71 126 -30 -107 -47 -189
3667 -189 7 -20 41 -92 6 153 123 145 153 48 133 116 -42 21 -19 51 -51 -54 -37 25 -24 -40 13 57 -112 9 -2
3694 -2 48 20 94 50 58 70 -131 39 37 75 -129 -50 -22 133 -143 -123 82 153 19 -14 -32 -54 -42 107 3 -140 197
3721 197 -112 -25 -38 50 168 216 -6 -95 -89 91 138 11 -29 -6 97 -25 109 30 59 107 38 102 314 48 -78
3746 -78 18 -27 21 -23 30 -75 59 -72 10 -215 -58 -5 -193 7 -125 -36 -111 40 194 123 114 152 163 -46 73
3771 73 172 1 12 47 -70 -52 -76 -51 137 -6 -20 -158 108 -130 161 -31 -204 -53 -60 -42 -135 -1 -155 -32
3795 -32 -70 -105 -38 6 40 1 62 17 116 1 -92 26 -25 97 30 49 1 -35 -1 -131 -107 -217 20 -144 -92 0 4
3822DJ08q3o1J9n3j0J14p4J6J6N2j61K24P9k48R8j77m0J98p4K9j9NL9l7n2K4J17
3850E3L2q5j53pK98n6o1K9j08N1M8k9n8j63L03k02J42J45j72r9k4M4n1K42q8j21
3876i0P6J34m5j77J16q8J8m8J43j00k1J02k31J34J02n5J03j21J30j08q4K33l18
3899a95K19m7j6J07j49Q8p4ORl6Ro9R8J1N1j71R4J5N2N7q8J34qk7Pl5m3P4Nj20
3929d2j10J94j27j55J25OJ32j0j19J43Q8j11o3J68K6o6Kn1k7J35j00q8J18n5m4
3954c1Rnp3L1JK03o9L2J6J7m2qj69J40o6nK01l13J41o8j04K04j23Q6k1j61L80
3981B03j84NJ69l41J13M0j70K03j62J45l5o5K01Jp4l7o6J64k86J29N3o7Rk7P6
4006cJ83r8j24m1K11k04n6J12mN6n1K0J2q3lj1NJ66k5j14P2r7M3J20jj10K8J60
$$ plain form
3822 4 112 29 -32 -13 -66 -76 38 -36 -20 -4 48 -113 111 190 -58 40 -137 -177 21 -53 -24 -43 -38 1 -36 -88 -64 53
3850 53 85 0 -153 -160 138 82 21 50 -58 -7 41 12 -46 -209 94 -108 34 179 7 -92 -116 -72 -123 119 31 -90
3876 -90 -14 120 75 -102 14 -74 -56 -104 39 -61 -82 20 -211 -77 25 -30 73 -48 82 -26 -110 123 -195
3899 -195 24 -23 -39 68 -81 7 -67 -61 -52 -88 -79 -148 -50 -39 12 -159 -65 -50 2 59 -29 105 97 70 77 42 -1 73 78 -42
3929 -42 -152 42 -85 -240 -115 -109 23 13 -106 37 125 14 -49 119 145 79 81 30 3 138 38 -50 68 13 -31
3954 -31 -22 -27 -100 -69 -68 135 66 98 114 131 89 81 -88 52 -14 -19 182 -131 10 -58 -162 42 -81 5 -16 -177 203
3981 203 19 24 193 -148 -35 5 -165 38 -124 21 -14 -79 122 123 49 12 -54 110 -176 -47 6 -61 -52 -79 -3
4006 -3 180 82 -42 -83 128 -76 -132 -20 -24 32 -19 1 13 -70 -73 -84 -79 87 62 -52 20 -77 -34 86 85 -25 3 163
4034A63j9L4j41l7j30J32j2K9o8J48j3q7J3O7k7q2J21R1k45J08KJQ4j37J35j11
4060A9j17J05J6j32J77nj40J15n9j18J42o9L2j9J16k14K91q7L9j8j15l7J35j99
4084a42K2L6J52j96J61j08k5o5QK83l16K07j20P5J57j46p7J30q8J34n8L4k30J82
4108A0N4m4R5k15Q9o5J30L4o3L3r9J13k4J32k18K46j19j02J06n5L1o9J09o4j46
4133a01J38j27J62m5q1K40r8kr7J58k64K04oK4r2n4M1j39J94q0j4R2R2k83K11
4158G3o9M3Q2p8l9N4q2R6j15j0J5J15j10r4l8J53m4m6J09M0n6j71J55LJ94k67
4184h7R1M2j04L0Q2L0L2q3K2qk34J29J99j7k64J95r1M3M1R9q0J0n2Q9k05K34j61
4211a8m2moJ94k39P7J24k6Q9j0l7k93K78j10K4J42j73P9K5j87j1N4m8N7J19L1
$$ plain form
4034 163 144 178 37 0 -130 2 -10 19 -49 99 86 -1 12 79 52 -30 91 182 -63 45 47 48 132 -5 130 19
4060 19 -98 7 23 -109 68 63 -77 38 -21 -139 3 -66 -34 -53 63 -151 140 53 92 74 -41 -78 57 -142
4084 -142 -120 -84 68 -128 33 -75 -100 -165 -157 126 -190 17 -103 -28 129 -17 -94 36 -52 82 24 58 -172 10
4108 10 64 20 115 -100 -11 -76 54 88 25 58 -41 72 48 180 -38 208 89 -13 93 38 69 0 109 45 -101
4133 -101 37 -90 72 27 -54 186 88 86 -11 147 -117 87 81 105 13 -41 0 -139 55 -25 -39 53 145 -138 73
4158 73 4 47 129 51 12 66 -16 80 -35 -45 -30 85 -25 -119 -157 -4 -48 -94 15 55 -1 -172 -17 -14 180 -87
4184 -87 4 46 -58 -28 54 84 116 33 55 47 -187 -58 141 124 -140 55 -36 7 48 147 67 77 25 114 -91 143 -18
4211 -18 -60 -64 -70 124 -115 -38 86 60 149 139 102 -191 87 -23 1 143 -30 49 74 -113 -124 -70 -118 -61 58 89
4237H9j99J43j48l6N6J60Rj41J23L5l50K84Q6j85k5R6j31Q4p7K37l8r0K07n72
4261c83N19k62O1J2k4M2j4K6Q6j24K1l4l0J23k15J34q1J97j14J05Q0j13q3M8R7
4286G4j09j00J4J39j11J18l7P8r3O6J3n4J37p3J3j99K03j04On4J21J14l12o8K61
4311D3j56RR0r6p3J46L2k5P8j48J29N3l8P5j84O6O5J04k84K20j19J03j19j31K60
4336A00l5q2J54j78j24J33k3lk5O0l0O9O0Mp0q7K64k54J95j20O2o7k7j94L16k00
4362a02kQ3L9K0j04Qp1L6Q6mK5j2M5l8q8P9Q7l3j52P2N3Nk65J91k3K34j39J27
4390A57j52O7m8K4m0k4M8mj48N8J02k05L06k25q0K98j49m4J04Nm1j10L9J18j49
4415i3R6r3J27J06j33k49L87j58j05J68M2j29Q2j9J2M9j61J03o8L2r2Q4jJ32j86
$$ plain form
4237 89 -110 33 -115 -151 -95 65 74 -67 56 91 -259 25 111 -74 -99 -3 -134 -50 -127 110 72 -18 189 -383
4261 -383 136 -126 -65 -53 -77 -35 -49 -23 63 -61 -40 -74 -104 19 -196 -62 -143 54 -60 45 125 12 -71 -23 74
4286 74 -35 -135 -121 18 -93 25 -12 66 -27 39 52 -2 135 62 75 -124 79 -25 -19 -73 48 162 -150 -218 43
4311 43 -113 -104 -14 -110 -183 -37 -5 -30 48 -100 29 82 44 119 -65 1 66 170 -114 106 -13 90 -29 -160 100
4336 100 65 -17 137 -41 -165 -32 -55 -58 -83 -23 -53 16 76 80 10 -77 187 -67 128 8 70 3 -24 -218 98 -102
4362 -102 -104 -21 18 38 -66 -58 -129 -93 -7 -11 14 2 47 9 -79 0 87 54 -98 -26 27 32 -233 -42 -65 169 30 157
4390 157 5 72 24 48 8 -16 32 28 -120 -62 40 -165 141 -84 -164 134 -15 -59 45 50 9 -101 -62 56 -93
4415 -93 3 -90 37 143 10 -239 148 -10 -115 53 95 -34 48 29 41 90 -71 32 -36 -4 -96 -12 -13 119 -67
4440f7L6R6q3j6J03j66K9m2K26p9j22J43j90J68p2R6N1k28O4M1O4K1j11J01k62
4465a99J60J20j75O1p2p2J45q8K4O4K3J04j00J87j39j7k09J30J76j54J19p3l0
4488a5l7Q8q3J74q8q3l9J20p4L6p6J18J1j23O8J72j29J19k21J06j72J28j00L9
4512f1J76k08K63p1l1n0P8q7j6Q6L9p0J7j05r8J02J12M8l4j01N8P0j52M2n7l0
4538h0J40r9P5J10j69J07j18N4Kj81K77j72J1J42k24L2J81Nn0L9l03J89M5k2j22
4563a31Q3L9K1N1mj20Q9J3q5l1K8L5p7K9J24j25J8K27j89P7j74p0K75r6J60ml3
4590A30j66J41k8o2o2L1K4l6K8R5l1j15K14j50J04j94K71k08j2Q9n9m5K31l18
4614a28J39l2J8j46P6J9J29Oj06q8Kl6J38J3k0k8NK21j45o6O6n0O5K5n3O0l3j04
$$ plain form
4440 -67 -31 65 -18 -34 69 -97 -68 -110 116 37 -85 58 -132 36 -36 60 111 -117 -53 -12 52 73 -38 63 -199
4465 -199 -39 81 -94 -33 -105 -177 -32 -120 -96 -32 -9 95 -5 182 43 26 -183 -53 123 -31 88 15 -15
4488 -15 -52 36 -47 127 39 -44 -83 37 -37 -1 -77 41 52 -71 -3 169 40 159 -62 44 -128 0 -100 -61
4512 -61 115 -93 170 99 68 18 96 9 -7 79 118 48 65 -40 -138 -36 76 124 90 -11 47 117 -35 7 -50 -80
4538 -80 60 -39 36 146 -23 84 -34 20 22 -159 118 -54 -43 99 -125 -93 88 93 43 82 -221 -32 13 -9 -131
4563 -131 -48 -9 12 63 59 -61 28 41 -44 -75 -47 -12 -89 -60 64 -61 -43 184 -5 72 -102 -172 103 7 167 163 130
4590 130 -36 105 77 15 -47 -16 8 -28 0 95 64 -51 163 13 117 -77 194 -14 -26 63 4 -41 190 -128
4614 -128 11 -21 -3 -149 -73 -54 75 81 -25 -113 -111 -147 -9 4 -16 -44 -39 182 37 -29 37 -13 52 77 24 84 51 -53
4642e3m7L4J9J98k55K8J03q7J01j48J07K7J07j93J19j27P4l7N4K5o4p2J76j20
4666c1L4J39j09rJ5R1m5j0j05l2J03N5j29j1J13P0j00m8N2q9J47k00OJ48j25p8
4692a48JJ99R8n3j87N5J69r2k9M4K6j58MJ35k5n3L0j5r1J93Q7k10K2J8p8Q9L2
4719F3j73J30J48k53Lj12J62lJ51l00K29j48n1K40j39p2J7J16L8q0M2N8r5J35
4743A06j49oj4P0O7K4j43r2N5J43L0k56Q1J95m2O7k24J97r0J8N3r6j34J38J82
4768A80j73J4lL3k0J4P2o4k39J50Q6Q2j79lJ11P7j81J20p5m0J91j77Q6j58N1M
4794d1JPJ56l4p0K8k8K5R0q7p8O3M7L2k08LK00j03j90K42j87R0J03q3k52K07J19
4821E2L4kq2j0j0L9m9J13j91Q8J63j92Mo8K54j08j41N0O4k7R5j3j57O8p0M5%O5
$$ plain form
4642 -53 -100 -66 -47 151 -104 -76 27 -60 41 -107 0 27 134 -59 60 -67 7 -30 24 49 -15 -87 89 -31
4666 -31 3 142 33 24 39 130 85 75 -30 -62 41 96 -33 -44 69 139 39 -9 43 -46 101 -99 -93 55 -70 -148
4692 -148 -147 52 150 97 -90 -35 134 42 13 57 83 -75 -71 64 39 -14 16 1 -90 103 190 -20 2 20 -58 31 63
4719 63 -110 20 168 -85 -82 -194 -32 -35 116 -184 45 -103 -154 86 -53 -125 -108 8 46 -34 8 66 -29 106
4743 106 -43 -49 -63 7 74 98 -45 -137 -82 61 91 -165 -84 111 69 136 -88 109 19 37 90 -6 -140 -2 180
4768 180 7 21 18 51 31 45 117 53 -186 -36 50 132 -47 -50 61 138 -43 77 2 -38 153 -24 62 -96 -45 -41
4794 -41 -40 -33 123 89 19 47 19 44 134 47 -31 32 79 111 -97 -94 106 3 -187 55 -132 -42 61 -22 -274 -67 52
4821 52 86 84 2 -8 -18 21 -28 85 -106 -18 145 -47 -43 -111 143 35 -106 -56 8 -19 76 63 -94 -26 -96 -51 -51 14
4849A4J35q1j57J37p6J0J27l36K92j80rJ33l1j23J59O2O0l0j28k4L1J58k49J58
4873E2N2k29J53lm0j27J13p3J00kj06P0L1O0k7n3J01j52J45j69r9K65j58J52N1
4898A07j06K9J08k31P1Q1p5j34R3R0K3k71K48j37J32j19J28m0kj21JJ38j83K93
4922A23J3j0j80K13l17J66R0p3l2O1m6O4j94J51P2j67l8J25j1N2J25j32j31r6
4946a72K87k1k1j1j91J86P1j21J08j9N3j27q6J19o8l1l0l8lL1O1k4J08j07O3r2
4972g5n6KLJ78j44K16l6j7j51L0M3J1J3PJ2J67l16P7n2Pj9L8J04O8M3j14q9J7
5000c3O8j43K25k57K54j41m1m0nlP8J68l2j50j7J35j08n5o2J48K7qj94J70Q2k6
5026D0j10j38K29N3k6P2j43l%n0N4J56j58jJ35m9k41Q8P3M1kJ08j17j25l5J65
$$ plain form
4849 14 149 68 -89 48 -28 -18 109 -227 65 -115 -124 9 -22 -145 14 76 136 106 -22 -46 -15 143 -106 52
4873 52 104 -125 28 25 -15 -142 -29 -102 -2 -4 -110 -40 -9 51 24 -29 72 -80 65 -104 -203 62 -96 56 107
4898 107 1 30 138 -93 -22 59 -16 -150 -57 33 56 -215 33 -104 28 -91 37 -3 -5 -126 -125 13 -170 123
4922 123 136 126 -54 159 -158 8 98 25 -7 54 8 72 -122 29 101 -66 -104 21 10 62 187 55 -76 -172
4946 -172 115 94 73 62 -129 57 128 7 115 96 149 22 -64 55 -13 -44 -74 -112 -115 -84 -23 -47 61 -46 17 -75
4972 -75 -131 -129 -126 52 -92 124 88 71 -80 -50 -7 4 17 24 36 203 -113 -36 -88 -81 -100 -62 42 110 153 39 -50 -33
5000 -33 35 -108 117 -140 114 -27 -68 -108 -113 -116 -38 130 98 -52 -69 66 -42 -97 -159 -11 16 8 -186 -16 66 40
5026 40 -70 -208 21 74 48 120 -23 -26 -26 -76 -22 134 -24 -25 110 61 -180 -92 -19 22 20 128 11 -114 -149 16
5052A6o3j6m5K11j64J77k52J82J07k34J07L2j77K62k46L1o4M7J37m3j89N1K53
5075A20j50Q8j50J69j3k85K58q6K27j28lj47L2J61m9j29k6K16M7j41J27j6k41
5098a19N3J01j98O1R5Oq5J04r2K4M2j70L21j24O8p7k00O2P3P6j59L60j44j91m9
5123a62J88p6L9L5N0j26J31J44k34J3Q3k50J87K7k6q3J56j43Q3K6K8j48J31j6
5147E7j21q6K24r2p4J83j51O3j1J35l3K3L3j32r8j6P8J9O0n3p0Rj7K4K9oQ4N5
5175A16j71ROJ46o0r8j25J90Q2j20oK3J10q8O8j47J32j50q5P0R5J36j10j14k7
5200a18J59k15L11K68m84O9n0k9J60p9k7m0J11L9k79J41M1k6R5j44N2R4J55k38
5224c4M2n7J01k09K42p7l1m0J36j03J93j17j81J44R9k32K21j89J92M2j11Jj0j16
$$ plain form
5052 16 -47 -63 -108 103 -61 116 -136 46 153 -81 26 58 -119 143 -103 -72 -136 -89 48 5 -184 -133 120
5075 120 -30 58 -92 77 64 -221 37 -49 178 50 47 -100 -68 93 44 -85 -111 105 152 11 138 122 -119
5098 -119 -66 35 -163 -102 -7 -1 -86 18 -74 -50 -8 -178 143 19 87 10 -190 -128 -55 21 -138 222 78 -113 -162
5123 -162 26 -50 -11 24 74 -52 79 223 -11 2 85 -165 22 49 23 -60 96 -47 36 62 90 -58 73 57
5147 57 -64 -150 74 -18 -92 91 -60 3 -8 127 94 117 150 18 -80 -96 -18 1 61 8 -62 -53 -70 -46 -17 -23 61 116
5175 116 -55 -46 -40 106 46 -52 -177 13 95 -25 -31 -8 102 14 82 -65 67 -83 -168 -98 -3 133 23 -91 -118
5200 -118 41 -174 137 405 -79 -10 -60 -89 71 -8 -35 -75 36 75 -204 -63 -22 -48 47 -97 -45 49 204 -34
5224 -34 8 -49 52 -157 85 8 -23 -63 73 -30 163 46 -135 9 108 -124 97 -92 100 142 31 32 22 -94
5248i4J93m6l8pj6O8pj04Q7Nj58J77m5Ko2K54k07j35K87j66J11q6l3O5k09J16
5274d8O3m8J81j47m8j2J32J3j04o8Q1l1Q5j58J08k0n1J00k4J4r5J26kj28J81j47
5300d7q6K72N0k87n9J52j4K0k1L2no8J67j65R3o1l1K1k0k7R8j26J64Q2j27m7m3
5327h3J58j6k23l6K62j11n9J79m9n3J39j90J89p9n1P6n9l7K26k13q7J80j10j09
5351a56J55R4j94P5P8J55k00o5j12K71q5J33j23k3J25j07j43J69j50P7pj69J14
5374h8K13o6l4r6J63J43n6j51oK68k65l3pJ0N1J39k10k9R6j3j54K03L9k02J99
5399A14j48K1k2J14k74L51j59Jj91M12k16J39j39M2rr2N9j70J49m4o4K26K3j70
5423d7J77j92M4J2j06P5J00j67K12l32J25L57k36j0q8p4R2R8k6p7J23j20J06l8
$$ plain form
5248 -94 99 53 15 8 -8 60 53 -51 36 41 -117 60 15 17 -45 209 2 -133 154 -12 99 13 -20 45 -164 -48
5274 -48 15 -33 148 1 -47 -59 73 86 -18 -86 -5 -36 49 -109 -1 -21 -72 28 4 18 -77 49 47 -81 100 -47
5300 -47 -133 139 189 -98 -157 -5 -19 1 -20 12 7 -61 106 -59 34 -27 -58 -37 -57 -84 14 -112 52 134 7 -40 -83
5327 -83 75 59 -164 -200 62 -49 -108 71 22 -31 108 -82 107 28 -23 53 -6 -43 183 -30 -117 63 -47 -156
5351 -156 -1 93 -101 -26 52 207 7 -58 -170 101 16 149 26 3 128 21 -122 47 -103 -26 -33 -202 -88
5374 -88 125 59 25 -71 92 235 179 28 22 290 25 -8 -15 -5 46 185 -25 -54 42 29 -125 78 117 -85 114
5399 114 -34 -13 -35 79 -195 156 -3 -2 -193 219 3 142 3 45 36 -56 3 -167 -18 -62 -126 100 123 -47
5423 -47 130 -62 -18 -6 -112 -37 63 -104 108 -224 -99 258 22 12 -76 -150 -58 40 14 -63 60 -60 46 8
5447HL8m1J2P9J7j14r4O3j33L16r5L1j64J21j06J2P3j47NJ17O9qj91K24J19j56
5473E5j94K15j93J49j42J68lj00q2J43r7J48j86J96J4j85j08K77M7j12J37k09
5495f2J05kn9n2J93o2p9L2k3J11j28N7l3L7J04j70k9L4J18j13O5k5m5J8n7K6N1
5522A2O8j41QJ75r1j5n6J26k2k8j43N9Q4L6j03P3L4r2mM6o1n9j5l7J46j03P1J53
5550A21j12l0q9J30L4j15J21j41J7n6K24o9r5j5M4N4l0j86J38J67k8j27J85K8
5574A70j95K0q2J08l1j0R5q0NJ1j03J08J05p1n2J68j65N8m5lL3N9l0N9j58K2Q5
5601H1n7P7n3k29l0P8O2R6ol3q3N2J6M0j18J74n8q6J54j18m0R7JO7q5p2J75n6
5629D6M9j07J07pL2p4k12L28j31j90l9J12L4kP5q3J5P1J72j14j32P8j26R1J01
$$ plain form
5447 8 46 5 17 96 113 -1 -95 -32 -165 151 56 87 -77 44 -62 -50 23 -124 -119 -2 67 59 -132 92 211 55
5473 55 -139 76 -117 32 -110 58 55 -45 -127 16 -81 67 -119 77 91 -94 -202 75 122 10 147 -62
5495 -62 43 41 -18 -70 123 61 -18 14 -9 102 -26 31 -2 35 139 -31 -60 -26 92 -21 44 19 -26 -8 -65 -39 12
5522 12 80 -61 -53 122 31 16 -40 86 64 36 -107 -48 36 72 -31 42 76 -16 -20 26 -35 -94 -109 -146 0 -103 -32 121
5550 121 9 -21 -110 20 54 -61 60 -81 -64 -120 104 35 -60 -75 -31 23 -7 -193 -55 112 84 -43 142 170
5574 170 -25 -5 -87 21 -10 -20 75 -5 0 11 -92 16 121 50 -2 166 1 59 14 11 44 103 73 132 -26 -4 81
5601 81 24 101 48 -181 -211 -133 -71 25 19 -14 -97 -45 -29 11 -107 67 9 -77 77 -41 -81 16 17 84 -1 -73 102 46
5629 46 95 -12 95 88 120 46 -166 162 31 -159 -198 -86 -52 -54 21 -62 -47 24 196 82 -50 28 -98 -7 94
5654I4j78K34k37J22Q1k13P0r4K10q6n7%K39j30j63N2q4K33q1J66j71o7o4O1J12
5679D9M9n7j03j10l5J91M5k4j7J57k46K64j53j11l0L4J28j16J15k36K40%r8J70
5703A06p3j04k2J20nQ8P8j28q8L4j03K03p1O4j92J43j0j56OK25k42M3J09j22K0
5728g7J74j30j1L9j75J41q9J13J52j30J17o3j1o4j0j5O6n9p9R5N2j67K27l28K77
5753D5P1l12K11Po0J32j59J62n7r0o2K55j11n7K7P5J4j62pm1R7j00n6J12J68k66
5779a64K96l3j28l3p6K69j01jl6j17J55k9j32J55Lr4m4k7K69p5Lk5o1Mk0l4P1
5806eJ40j35ll1J24j04J63j10j58O0lm4K45j41j5j14J11L8N0r5m9M7m2Q3P3Q7
5832A72l28K57j13QR7J18k79J8R5Pj62R6j67K8K23q4N1r1o4J36k2q2k0Rr9J97
$$ plain form
5654 94 -84 150 -87 35 116 -97 -27 -121 89 3 -54 -54 185 55 -108 -56 -140 93 12 178 7 -60 -124 -63 49
5679 49 98 41 -62 -172 -207 -16 29 5 -12 145 -101 163 10 -101 -131 -97 31 -85 30 -206 34 34 -64 106
5703 106 33 -71 -93 27 22 110 188 60 -28 6 -97 106 35 99 -93 50 40 -116 -110 115 -127 -84 25 -97 -77
5728 -77 97 -33 -44 -5 -180 -39 -128 -15 137 7 124 61 50 -14 -24 -39 27 -32 -111 -16 36 -131 96 -232 45
5753 45 116 -196 15 22 -38 94 -65 97 40 -50 -112 143 32 -25 2 77 91 -71 -78 -119 -22 -122 -178 -66 102 -164
5779 -164 132 99 -29 -62 -138 131 30 29 -7 -124 31 2 -130 25 28 -66 -110 -137 132 57 60 35 -26 -22 -42 -76 -5
5806 -5 135 0 -3 -34 90 -14 149 39 -119 -59 -62 -106 139 -2 -17 -131 -20 18 68 -27 -76 -29 -71 12 85 172
5832 172 -156 101 -12 -4 93 211 -68 -50 45 52 -110 -14 -181 -153 70 -14 37 -54 -118 18 -4 -86 -106 -97 -196 1
5858AP0Pj6R6q5J6j40K17k31k6J02p6MJ33o5j2P3l8M1k50L37L5j64N6J5j16P3
5885E7j36m8K23O1q9j42M9Q5k32J88m6O7q3O7L4r7j48j3M71k28J9l7m3k7k9K8
5911d9P1M6j78J32n3R5k07L2J4K46j58o2O9lJ16k07L4MJ91n7k7q2q0K68r2l6K4
5938E1j72J62k3p9K9J01j75P1O2j60K27j46M1K18p4j09j11K13k38P2o5J70k4L8
5962G9j65J9j01L60q9n2n4j1J59k14P1N6j05O7j18K26r2j85K09n9L2P5K8j34o
5987dr1N4J56j87LOj55J59L2J66j3o3O3J9k32R1L8K4j36M6K40k48M8J00q0o0P5
6014E1N3p9L8p6O0m7J28k37J46n4o8J18m9J12J6j8k07J87j1p4j81R7J08k02K13
6039B4m2P9j13J37Nn3j84N2K60n9r5%Q5n9ro2N4O5l14K46n7r6M3J15l6J54j63
$$ plain form
5858 1 71 78 62 158 73 89 -51 166 -65 -91 11 -65 -61 72 7 -5 68 30 71 -179 158 193 29 85 100 -16 57
5885 57 -79 -127 96 157 68 -74 -25 60 -172 16 -30 37 -46 21 55 -42 -190 -203 268 40 59 22 -21 -48 -77 -49
5911 -49 22 68 -110 22 -31 64 -143 -111 -97 149 -9 -71 -2 -5 111 -96 -62 -58 133 76 49 -33 -113 155 63 27 51
5938 51 -121 41 18 -61 -32 69 -106 -35 27 -133 94 -52 -11 207 133 24 -87 126 -112 -40 -105 65 41 79
5962 79 -86 -67 -168 192 103 51 -3 -14 145 -69 2 58 -47 20 -98 128 36 -149 60 1 33 108 136 2 -4
5987 -4 -95 -41 115 -72 -69 -63 -218 -59 -27 139 126 63 126 145 -87 4 42 66 -70 -24 216 -32 16 116 36 -24 51
6014 51 104 25 63 -13 47 0 128 -109 37 -17 -85 33 -16 96 112 94 -113 74 63 -11 -192 -95 13 -189 24
6039 24 -18 61 -52 85 90 37 -147 -95 165 106 11 11 96 37 28 -34 20 85 -229 17 -40 -136 -93 22 -14 140 -23
6066b3oP0R2k29J48K5o5J08j83J48p6r2m1O1k5J75j45J79l6k48jK05j5o8j77J53
6092f6j0O3l6j5J76l2k37L05j76k1J04m0j4M8j31L52k61J80j26l4L4j5j64O1o3
6117a18J67r0p5L67l38M7q3Q5M2N5q1p3K68o2p5n6R8j60M5p5J36mpK82k60n8N5
6144C2K6o8j00M5O7M5n9rl4NJ46k11J82j43K21n7j89J99R5k32O7j09RLJ58j21
6170c2J51m2j8j14O0koO8j35r6OJ69J29o9J15k92J97l94M86k39L6Kj21O5P1J15
6196A10k37K23m1j23J52k41K79j65J0K2P1K4k00J78m5J9n2J45o4o7M2j31J50p6
6220a7p0J78j37K39j08r7L0L5o0j00N6J3J75j66K7J2j02J17O1j59O2j18j1K46
6244A06rj47R4j61O8j67L22l5k54K07n9J9J23k76J07J82j35K5J02j07O3j54J08
$$ plain form
6066 -23 -29 41 133 -96 52 77 12 120 -63 85 9 -83 -124 -63 -88 87 -58 121 85 -163 -164 41 26 -42 -219 -66
6092 -66 -76 -13 -49 -64 112 80 -157 148 -28 -49 55 15 1 49 -82 270 9 189 63 29 63 48 -116 -55 -118
6117 -118 49 -41 -116 251 -87 -40 -123 -38 4 59 -22 -95 173 111 36 -20 78 -82 -37 -112 24 20 13 295 35 -23 32
6144 32 58 -10 -110 -65 2 47 -12 -21 -55 -50 96 -115 67 -76 145 88 -101 98 193 -39 28 -81 -72 -69 89 -32
6170 -32 119 77 59 -55 5 3 -3 65 -70 -166 -160 9 138 69 184 -108 89 -305 181 -58 -22 -20 -141 -76 -5 110
6196 110 -127 96 55 -68 84 -157 122 -43 -33 -11 60 84 -116 62 17 36 -16 129 65 -2 40 -91 59 -17
6220 -17 -87 91 -46 193 85 -12 18 53 -7 -107 -51 -38 137 -29 -2 10 -92 25 86 -73 -11 -129 -140 106
6244 106 97 -50 44 -117 -49 -216 106 71 -183 24 -35 -16 107 -169 -62 120 -15 10 112 5 68 -86 22
6267B2R3j04o6K7K6J67j90K30j05j95J94j06L1j52M9k1K32r5j47O3j17O6J88k1
6291F9j42o0R3K29k45P0J31k02Q2j04nJ22k9n1J53p8K3r6KK31j74n0N6p8K3j28
6317a58R5O1L6L6k6n2M0m7N0p6J4mk8m2l6K12r8q5M9Q9L7l6j21J08l9p4R5j9j1
6346c0l4J62r2r8J13m2n6j3N7Q1k4j66J93lp6kJ42q4j50K4J18m9L1m1L25m35R1
6373e8J78mo9l7j74K20m5L2P5k56Q3J27j43j0J83j38L3L5Q1j35J18q2j52p6J61
6398e3Q7q9Q4J09l8j20j37K8J62j32K7J99o6n4K14l77P9J9Kk6J23r3Q5k8k6j8
6424c9m3K05k73RL3K09p0r3K66k58J9rM3o5J03j4pm9R8m6p8l3P5N5j3J35j95L2
6452cnM6q7J34L2j89J57j64J57j80J64N7j30N3m3l4J79k09R3R3p1j46k2R6P2q3
$$ plain form
6267 22 115 11 -55 -28 -2 165 -25 205 100 -95 99 -7 24 -128 -79 -100 132 37 -110 -47 -164 -98 90 69
6291 69 -73 -133 -40 189 -56 14 145 -57 25 -79 -84 38 9 -42 111 33 56 -40 -38 193 19 -31 25 -53 -30 -158
6317 -158 -63 -2 34 70 44 -8 32 -15 35 -41 -27 -31 -59 -101 -137 75 -23 -108 -59 30 67 31 -90 18 -21 -95 0 -19 -30
6346 -30 -64 98 6 -92 21 -21 -77 -90 -33 48 24 -142 51 48 -28 -30 112 28 -122 -98 20 -29 2 -39 286 -149 -58
6373 -58 120 116 47 10 -164 56 11 43 118 -138 -55 72 -71 -81 102 -36 -3 32 113 -22 96 14 -138 -214 -53
6398 -53 34 -55 29 138 100 -20 -157 -129 33 -99 -72 127 61 7 221 -156 -77 -58 -56 -82 41 -52 33 5 -21 -39
6424 -39 -82 123 -150 -141 -108 101 31 -62 204 -54 -35 -44 -1 -66 37 23 16 -33 65 19 -59 -92 -17 38 25 160 -35 -3
6452 -3 -8 38 -49 85 117 -72 85 -79 78 -102 62 119 -11 42 -1 -35 144 -65 28 121 50 -96 -118 -22 50 -33
6478c3P2j8l2k8q1O7J91j70jR9J61p9j15j19J04QQl7J77j62R0l27J42j5R9L1j89
6505a57J11J1J38j33j21P8K06j13R2k24J59K5j73R9On5j8K8m0Q8k6J8J88j46p3
6530c2j1R1o5Q9j66P8k3p7K63j89J71m8J7k29J4J41lq5j36J69J53r5j37K02j80
6555h8j4J07O1j2r9j04J52RP0L8k10R9J73r8nj3j11J56q1M3J8q9Qk8j97J34P7
6582dm7o4J57O9j72L6Q3j69JK37q4j43J34J29k68P7J23l9K8j20J5k1L3J85j60
6607A6kp5p1O1J49Rp7NJ3k90J88J2J93j76j21J03j23J36R7J6Q9l11K00j73K21
6632H9j79K28j87L6P2o4J14J2N5j79j23J62J49j67J0j53J70j43J03K5Mj35J43
6655D2p4j67J72J44j67J81k6j06P2m9n9lR2q8r8K03k04J98l2k06K46%K8R7k25
$$ plain form
6478 -33 39 21 -11 -39 -120 -53 138 -32 -33 66 227 148 33 -86 18 26 34 -3 174 12 102 -225 -83 -98 1 32 -157
6505 -157 -46 -35 103 -30 -151 -73 133 20 112 -112 47 72 -101 -2 4 -51 -69 -41 -81 7 -19 -1 187 41 -32
6530 -32 -43 48 -17 72 -94 -16 -39 -116 147 -42 129 81 98 -131 -117 24 21 -64 -200 -31 122 27 -110 92 -88
6555 -88 -102 5 66 54 -45 -149 3 12 82 120 -90 9 182 84 79 66 -45 111 30 73 91 2 10 -18 -215 -81 -4
6582 -4 -51 -115 42 111 -61 -25 58 -111 -110 127 43 -100 34 163 -105 -28 95 56 84 -36 -21 -42 -9 176 16
6607 16 14 -61 -132 -71 78 87 10 15 28 -262 -74 -62 131 -45 -166 -63 -186 -50 47 63 152 -159 41 -132 89
6632 89 -90 138 -49 -13 59 -5 109 121 176 -3 -126 36 185 18 28 -125 45 -98 5 30 34 -101 42
6655 42 -32 -199 -27 117 -50 131 105 -1 71 22 -37 -40 52 -36 -134 69 -135 63 31 -175 71 71 99 196 -29
6680b9L3J7l2jJ13k19J26L0j22Q3l2p2K39j20M1P0l8k29J64K0N5j91K07k59O3
6705h3J8M5q0N8K08j35R6j58k7J75l04J94J19k02J45j37J02m3Q0o8NN2p3j25J15
6730b3J62j61R7m9o0j04K04n0j3k3p8J10j08J07q8J24j61J55J41q0k73K41K6p0
6754B6j02K43j47qj27J12J04l11K91Lm8J9k20K4J30L5m7j52J21O2J60j02N2j15
6778ClPj52J0P9RJ48j11k7R0j23N6J2K0P7p6o9J6L4k0LNn5K1K12j31k1J13k63
6807a36K15m1j73N7M4Q3QR5p3n4j34K74r7k21K9K41j33m7J27l1j27n5M4K47j76
6832c4J25k25J69j95jJ97j01J02r7j3k8O3J37j66O3M9q2J65j06j3P3j7K2L3n3
6857F7l7P3N0j90K7N4K4K8j85K42j30j15J16O8j40J6J31m0j93J77o1o2O3J47j53
$$ plain form
6680 -29 4 21 -11 -12 101 -118 8 38 -84 -1 -33 -105 134 14 55 125 87 -142 22 42 97 -94 113 -146 -83
6705 -83 -65 -20 -100 -42 166 31 127 -31 -58 117 -187 7 126 -76 69 -68 34 -9 71 3 8 60 -13 -138 -23
6730 -23 139 -22 75 26 -34 -138 66 16 3 -20 -98 12 -96 11 -77 47 -114 41 182 102 -171 70 96 26
6754 26 -76 167 20 12 -115 -3 101 -210 81 84 36 55 -165 -141 -11 24 -23 -175 -54 8 168 66 118 3
6778 3 0 7 -145 -135 -56 -47 101 -10 -37 53 -70 -14 -2 18 95 19 -50 -34 0 -20 -17 -12 -67 -46 166 35 14 127 -136
6807 -136 79 38 -135 -78 -34 49 57 152 79 25 -109 165 68 -153 -124 117 -16 -63 64 33 -94 -149 -105 142 -34
6832 -34 91 -134 35 -160 -161 36 -65 37 -60 -73 -101 -38 99 -67 -4 45 -37 128 22 9 82 65 87 120 67
6857 67 30 103 153 -37 -10 44 68 96 -89 153 23 -92 24 92 -48 -32 99 59 -134 43 -18 -80 -17 130 -23
6882b3N9m8r5L20l11J43J4l0o3J89rp5J15j56L9k42K48p9OOr9P3j7N5J44j85J2
6909ij21J1K15p2r0J00m6j63R7L0K8m8j7K54k95J02K8j57J07p9J02R8J06l55Q4
6934i0J29N0P3k28P4j13J3O9MN0J42l12R4J0n4M5j61K20j35J14k1J8J30l0k60
6959a69Q3J92l4P0j69j1P3k66K38J04k66K93q0k9j22J31j73R9L2m4KJ02j56j0
6983a10O8M9k9m2L0j88L17k01K7o9K55j73n8O7K43k43M6l5M2j27J79j0k7K01j09
7008A03q1K1m7K5j59J60r0J53j05j27L5J73J0K5M3j62k5J33l2l21K59q0m2O3N3
7033a5k9J08L0m0r4j9k8Q2j0j18J35M0j11O6nj18O1j56L59k36K5J14j16pj0O5
7059b7J45j98N3J12l29K42J39j75O7j00J38j5J09j59J70j45j28K7O8n6j04L53
$$ plain form
6882 -23 36 -12 -107 213 -98 45 59 29 -34 155 146 71 186 30 69 -173 75 -4 2 8 -91 -18 -35 20 164 -21 -9
6909 -9 -130 -119 96 24 -66 34 -12 -175 -78 -48 -20 -68 -85 169 -126 -24 4 -153 -46 -125 -23 75 181 -174 -90
6934 -90 39 89 162 -66 8 -105 -92 -23 -19 31 173 -139 -45 -35 -89 -44 -205 15 -120 -6 -27 -9 121 91 -169
6959 -169 -86 106 72 142 -27 -38 35 -231 7 111 -155 138 58 29 -93 38 -135 -36 -4 -48 -46 56 -100 -110
6983 -110 -42 7 -22 -64 -34 -222 95 -106 -79 -148 107 -66 -124 -57 186 -57 -11 -46 -4 -131 48 38 11 212 103
7008 103 22 43 -4 21 -138 22 -68 85 -20 -147 -112 61 71 96 139 -23 -48 85 53 -268 -9 -89 -131 -68 -15
7033 -15 -44 64 94 54 -40 -59 -87 -5 -15 -133 2 42 -69 -3 -8 -126 -65 -221 138 -98 -73 41 -75 -82 -92 -27
7059 -27 118 -80 -27 85 -244 -2 137 -38 29 -71 67 52 161 2 172 27 -101 -74 -6 -62 -166 187
7081A87k09j57J58r5J17O6l7J50p3k21Q6J00j03P9L4q2O6JPq3Q0j15J58j62j8
7106f6J03l8J06m1k9j67K71k61J11j01J12J6m5J41j43lJ62k74j7K94n7k4n4l8
7130d2m9J10o2J5O6P2m7k3M9j22Q2n8J65j42j07j3j4J21j28l1N3J7J53N4j78r6
7156a55J75J50l38K57j17Q0j18J27j3O7p6j46M9P7q8K0K1R9L6k44k6J14K27j56
7180B2p9k6K69k01j19J78o5o5N6J42j51P1l10J63J39J9j54P2P0Q4m4Oj04J56j31
7205bK3mM6r2LJ8j44K55m1L3LK23l58j1J34M8o4N8k14K28L1Qj77R4r5m2O6o6J21
7234H2mk11J33l7p0O1K1p8m3L8O9L6O7k6J23n4j48n0M7P2n0Om3J8O8k49L13L0
7262A21j30N8o6M5j44L15j24k04R9J63p7M5J12j68N8j14n1J68k07J9J05J42j05
$$ plain form
7081 187 -22 -179 -21 -116 1 67 30 180 107 -114 -28 72 -31 48 82 0 66 67 74 -9 71 -44 114 -48 -66
7106 -66 37 -1 105 64 35 -132 139 -122 -11 -112 0 16 -29 112 -31 -34 128 -146 -163 131 74 50 -4 -42
7130 -42 -91 19 -43 -28 38 110 63 40 89 -33 49 -9 156 14 -93 -106 -120 1 -127 -158 -105 -88 65 119 -59 -155
7156 -155 20 170 -168 89 -28 52 -66 61 48 115 39 -107 -58 19 -69 -49 -28 71 107 -137 -163 -49 178 22
7180 22 -57 -83 186 -15 -134 44 -21 -86 -30 112 -39 32 -278 -115 24 43 -111 -39 31 115 71 77 -27 129 -2
7205 -2 21 17 63 -29 -26 -8 -152 103 62 95 98 321 -37 -48 86 134 70 128 -86 142 173 181 4 98 3 -39 27 -39 82
7234 82 78 -133 0 -37 -107 -46 -25 -103 -146 -108 -39 -3 64 38 161 107 -41 -91 -44 28 -22 -16 -59 -41 27 -222 91 121
7262 121 -9 49 -17 28 -116 199 75 -129 -30 133 56 101 213 45 103 -11 -62 106 -101 -82 23 165 60
7285F0j61k4J88Np5o7q4J80j7J06K3j16L2o8%J1j47J6J37n9j2lp3K8K15j62K36
7312A69j52J19j32J12j10K3n4rQ3j06Q5L1J04k14O3p7K7N5P5m4l10L65k7q5p4
7337h3LJ12M1N1nj94QJ65q0n4q6J36p2J44j08J38k15J80n6K2L0lR5k12P9k51L01
7364H6k94K35o0k9J2M2Pl1J7k00J94JK60l36J27o6L3L4l0p1Q5j19K21o2J1o0R2
7391I9p7q4J45j74J14j30K49j72J21j28J46j17R6j34l9Q6Q4k06J36N8j41j7rJ28
7415C4M9j02m1J90q1o9q5L8J15mo4k8P5j25R9J05o4r4J15j57qJ54j81J01J84k70
7441a14J16m4N7p1l9J24n9K23r1m3l7Lk5J29j78J18J03k01j4rO6j80K86k51M3
7466h8J14N9p5K54j89l5o4R8o5j75J32L9r9J52j20O8L4k17K04l4K2j01l6J01j9
$$ plain form
7285 60 -101 -125 63 68 -7 -74 -158 22 5 111 134 18 50 -18 -18 -7 -154 -138 -1 -60 -72 -75 -148 -120 95 -67 169
7312 169 17 136 4 116 6 29 -25 -34 49 -57 28 59 163 -51 12 -65 -38 17 92 48 -262 103 76 -9 -83
7337 -83 -80 32 73 124 119 -75 -67 98 18 -36 -122 14 -58 86 -22 116 -99 81 25 47 77 74 169 -43 36 -215 86
7364 86 -208 27 -33 -62 -50 -8 -1 -32 -15 -215 -21 -20 240 -96 31 -35 -2 32 2 -69 16 -103 118 56 67 7 99
7391 99 22 -62 83 -91 23 -107 142 -30 91 -37 109 -8 88 -46 -85 1 85 -121 15 73 -68 -85 -94 34
7415 34 83 -19 -60 130 49 -20 -105 -67 48 44 -20 -48 27 -98 1 106 42 -52 63 -94 -102 52 -129 -28 156 -114
7441 -114 2 -42 15 -56 -95 29 -30 193 102 59 22 25 0 129 -49 69 172 -29 -43 -52 14 -166 120 -131 -88
7466 -88 26 85 10 264 75 40 -24 74 9 -166 -34 5 -94 58 -62 6 40 -177 27 -7 15 -86 -122 -21 -40
7491d0M1P2o6qj34K05j62m8K26O5j56R1J2j59Q0J83j91N7k1j70J39K5L8k3j08
7516e2J34j85K20q1q5J42k09K19q2j15L19k31O0O7K7k5k8k22N9PJ03p4j08K08
7540F8Om8J05n6j18OK2k7J08j36MM3N9j60m4K58j73P9K8j68J23J00O3J0o4j10
7566b2j27K81j70K0m1L3j7P9m2MN4O4O6j15m5K4r6J3Q6k05R9p7R2o4K05r8Lj55
7594a51K34k01J44j74K22l1NJ7K1j45N2l4k1J46OM0j46l2J12n0N7n7PK8M0p6p3
7621f0J21J9j7k16M1J13J3L2l6n1J23j33j8O6j69m9J50j8K22j75M6j78J44K17
7645A87j45l6l2P3J09k66J37j21L7J43k24J62j61K32j22j96K45L0m1r3J22L1o7
7668Do9J23n2J4J04n3j18m4K8k02J41K12Q8o8r5J41k40K25n8qP6k25Q1j2J40j06
$$ plain form
7491 -40 1 73 7 -1 -135 70 -92 -140 86 151 -5 86 98 -61 19 202 11 68 47 -123 16 41 79 56 -52
7516 -52 82 -103 117 36 -49 93 -116 103 21 -94 225 -6 54 121 148 123 95 -127 -68 -61 42 -32 -140 68
7540 68 74 26 131 75 -43 -37 -15 -42 66 -70 -66 -23 36 -124 -168 90 -83 -4 24 -144 -21 79 142 152 88 -22
7566 -22 -149 132 -38 -18 -59 -26 -43 36 -6 -2 52 116 182 67 22 46 -50 -37 49 -156 -57 -134 -42 -106 99 1 4 -151
7594 -151 83 -118 26 -148 74 43 48 65 86 -59 -7 -41 -62 84 90 130 -16 -48 64 14 71 14 21 49 89 13 -60
7621 -60 61 80 63 -153 -112 1 14 46 10 -41 82 -51 -69 -3 -172 -221 -71 -89 133 -42 4 -174 -30 187
7645 187 42 6 -26 47 156 -110 27 -94 -57 86 -138 24 -137 95 -27 -223 22 52 11 -82 40 71 4
7668 4 -65 58 6 20 124 71 -47 -91 -63 -265 -124 88 176 108 13 154 -86 139 81 73 149 -76 5 -7 133 27
7694B7J1J04rj22r3NJ26L5k72L71j33j43J03l2q2Q2k6J26j67J20l5M2O8j09j8
7719b1p7J20O1n8P1j8O8J2o7n3j39K39j29l5j19J52J02o5q0j7K52j18O0q2j05
7744d6o9Q1l0lR5J06j6n9r9R6o9k24L53k44J0J94l05K32m9K10k27J13K6j7l8K5
7770D6pNp6O8p0o5R9k2P3lQ7j18k01K14M1l09L52j12q9j39J46J18J6kj33J50M6
7797A15j74R5j21Q0P5j66mJ98j86J50jj60r1O0J67j93K77k21J08m8O5j94J94k4
7821Aq7J27k8r4P1P8J3j73J15j01L3J03j5Pj20oP5p6K4lR0Q6k34J16J12j30p3
7848h9Q9J41j33J13Q1k8j97J08q1j4j8n4J63j57K29j95m5K49k29m3K21j03m5J72
7872A35q9m2p0PR5K0k45Q7O8J09k33K07q8j10R1J15K2j98J49N3l9j33J22R3q4
$$ plain form
7694 27 38 142 133 11 -82 -77 49 84 -188 183 50 -93 10 -22 -104 -22 -48 78 -89 31 -4 38 106 -3 -21
7719 -21 -98 22 83 25 96 78 146 158 91 38 -101 138 9 -26 -145 7 109 44 -36 -53 199 81 141 59 -46
7744 -46 -115 -34 -64 -67 28 134 118 59 -40 56 -13 -237 116 -128 -118 76 -229 3 -46 164 -63 50 76 59 21 46
7770 46 39 44 -32 36 -34 -99 0 -22 51 48 135 17 -184 30 71 -238 114 2 -87 -226 -80 38 54 52 -81 69 115
7797 115 -59 36 -85 -5 70 -96 -100 98 -88 62 61 -99 -190 -130 37 -156 121 -100 8 -40 25 -169 25 1
7821 1 -86 41 13 -81 -10 68 81 -92 23 -78 -45 58 43 50 -70 -76 -1 -77 -53 -56 34 120 -114 2 114 -16 -89
7848 -89 0 141 8 121 202 174 -23 85 4 -10 -28 -82 81 -76 153 -42 -87 162 -67 -110 111 8 -37 135
7872 135 46 4 -66 -59 36 56 -189 -102 -34 75 -158 49 -39 -149 -58 57 79 -119 30 83 44 -89 33 126 42
7897D2l13N22k9j89q5L6Qk4J1p9L32j75j16K9j57J62J01k28K53j04J6k16K49k58
7921b12K72r9l5j8o7J99qj1j02p5J2K19n6j6kp2K0M1M5O0k9j35j87K84Q2q9q0
7948e9J17rj48M5K9JJ33k4l52K55j13P5J54j41J46j41r6Q3l2o7J51j13M6j50J22
7973h8J22j08nk6J32P5k19j61K24O9l6J07j17N2q5j5p2L15j79k6M6Q7j92L6R6
7998C2Koo8Q8N2j92J30R4j40j8P2m6M3LJ52o7l1q6J0Nj28L8J06j01O6J6j43K20
8026A03q0l5k04K75j26P7K6l3o6J38j37K9M3j52K21j31K8o2K22n8L3j39Q1l1o9
8051d7q9j2L43k02M5j83J82o5P1j00M0j28P3N8nj84L76j56p0O6J43j43P8r8P9
8076G2l5j0j10q9Q1J27Q0k45mL61j33n7j5Oj6Mj6j43J59M4m4m0l1J32j30J0q4
$$ plain form
7897 42 -271 251 222 33 -52 -16 -8 -32 -21 -100 232 57 -59 -30 -187 -25 76 -152 101 -3 13 -203 46 -212
7921 -212 60 -39 -74 -92 -159 40 32 21 -81 -156 -144 75 19 3 1 -71 -51 -10 35 95 66 -69 -256 28 110 21 -59
7948 -59 58 49 -99 -54 -25 -24 109 85 -267 -12 -125 -50 104 -37 109 -32 -128 -45 -77 -144 7 -106 -60 -210 -88
7973 -88 34 -74 -79 -105 27 102 -117 -278 -54 15 -21 86 -31 21 -64 -79 -151 164 -15 -41 5 92 -100 -64 32
7998 32 34 28 -40 48 100 -92 38 132 -8 -26 46 0 43 46 198 131 100 14 24 29 -99 -61 45 -56 10 26 -117 103
8026 103 23 -12 -216 59 -67 10 36 3 -63 75 -62 -33 10 -142 79 -52 -24 -86 136 78 111 -28 53 22 -47
8051 -47 -136 -148 195 -7 38 -145 37 -28 43 -57 -17 -145 -72 -14 -19 -203 173 17 -53 13 156 13 91 -7 72
8076 72 37 27 -83 -172 -91 36 116 -129 -133 228 95 38 23 29 13 17 1 -142 17 61 17 -23 -54 78 -52 -42 -126
8103a26N5Q9j0j26KJ22J12j22P3q9O1j17K9n1J24j43J69Kl0J7k11R1P9K5r2R0
8129B3j89P1K5J16K2J09j92J36r5k62J32K73k91K7J32L0j16J57n9O8r8j72K51
8152I8P6k24M9jJ4K1K6J9k07Q2k3L0R9J6Q0o3j9q1k5J08k16K57j06N0M0q8Q6j
8180I7J5j29J4k6j52L6J59j6O9n3K7
$$ plain form
8103 -126 -71 18 8 -118 -116 6 118 -4 69 -20 41 -76 -47 -98 26 -117 52 54 24 41 -170 -79 0 25 -67 23
8129 23 -166 -95 -70 46 68 177 -15 121 26 -236 -104 169 -122 -95 37 67 -49 108 49 117 19 -153 98
8152 98 174 -50 -1 -2 12 33 59 78 -129 -47 -70 -40 59 75 155 92 73 -8 -33 75 -141 116 10 60 100 12 98 97
8180 97 112 -17 -3 -29 -181 -145 14 -2 67 14 41
8191D1
$$ Imaginary data points
##PAGE= N=2
##DATA TABLE= (X++(I..I)), XYDATA
0@%%%%%%%%%%%%%%%%%%Qj6J6j6J6j6K4l2L2l4M2m8N6o5P3q2R1j05J20j35J51j69
40h9J87k07K31k55K80l10L43l79M18m61N08n57O14o80P49q26R16j020J141j279
60f76J442j644J894k213K640l246M173n793R450l6049J7593N2001l0521k8029
74a8978Q189K2413r066o989O132M953r367L250R144m856j7061L869J9533K890
88A4056k0220o616J3456P952r991o178M115K208k585M098M423m290n297N605O284
103G020k956m188J375K38j605J388R33n520k595P022L965p096n293N690O712l117
119A973o519O01M640L91r91K468M19m340r29O662K302p511l643P379K884q451
135b665n672N560N485l682l096K972J694k168J082L575p64l929J184M100l80m013
$$ plain form
0 0 0 0 0 0 0 0 0 0 0 0 0 0 0 0 0 0 0 0 8 -8 8 -8 8 -8 16 -16 16 -18 24 -24 32 -33 40 -42 49 -56 64 -71 80 -89
40 -89 98 -109 122 -133 147 -163 180 -199 219 -242 266 -291 323 -357 392 -434 482 -538 603 -676
60 -676 766 -878 1016 -1197 1443 -1803 2370 -3423 6027 -30022 -12429 39572 9051 -18978
74 -18978 -10789 11624 2558 -4431 1701 6654 -2713 537 9681 4825 -12236 -8367 11166 14056
88 14056 -6164 -12780 676 8628 -1363 -7541 -3426 -1218 -3803 295 4718 428 -4869 736 7020
103 7020 4064 -124 1251 1489 -116 1272 2205 -3315 -5910 1112 5077 -2019 -7312 -1622 5090 1973
119 1973 -4546 -3945 695 1086 95 2563 2982 -1358 -2287 4375 6677 -834 -4477 2902 5786 -2665
135 -2665 -8337 -2777 2708 -974 -4070 -1098 596 -1572 -490 3085 2321 -1608 -424 3676 3296 -717
151g17l70L261P0l094o81K461j5k919l76K230j036k944J403L877k06k109J014
168a51K204j66q05J277N51j434r67K75q21j409j9J280j76j451l20J286M71q44
186a219k22J394R54o88n17J024Q16l2k17L95p53l48Q40l27k472j138J470J192
204A52j586r51J023N19Q8L98Q37N1K65O96J35q23q32Q41Q44k73j683n95J025K50
224C81j255k01O35n99r27P43J154n12q55J367J554n13n99J016J86m00m8k59n79
243B89n63L27J3p10j060j61J207O74j035n95Q22J402m72l69P12L51l34M78P14
262A690o01n34M30J86j280j061M96O07n11o72m55L28O3M32Q46L85L4k60O10K11
282I44J2p7K63M60r22r49K42J50n54k57J19l10o90K09R25o8j73N10K39J51J73
$$ plain form
151 -717 -1087 2174 2244 -850 -1531 930 915 -2004 -2380 -150 -1186 -4130 -2727 1150 944 -1165 -151
168 -151 2053 1887 1082 2359 2910 1476 509 784 -37 -1446 -1465 -185 -361 -1812 -2132 -846 -375 -1219
186 -1219 -1441 -47 907 219 -298 726 1542 1510 1293 1688 935 587 1427 1100 -1372 -2510 -1040 152
204 152 -1434 -2385 -1362 -843 -755 -357 480 531 796 1492 1627 804 -28 813 1657 1384 -299 -894 131 381
224 381 -874 -1075 -440 -1039 -1966 -1223 -69 -581 -1436 -69 1485 972 373 1389 1575 1175 1127 868 289
243 289 -274 53 66 -644 -1704 -1865 -658 16 -1019 -1614 -792 610 138 -231 481 832 498 976 1690
262 1690 1089 555 985 1171 -109 -1170 -674 -67 -578 -1250 -1705 -1377 -1314 -882 -36 349 383 123 733 944
282 944 956 879 1142 1602 680 -269 -27 123 -431 -688 -569 -879 -1569 -1360 -435 -503 -676 -166 73 224 397
303C97N72L60j88P3j40m85k93p7K3l25n26l52O4J46m46J35O22L64j4n0K89L26
325D75j13L66O79k29n98o7R4n95j86J71j30m48m97J2P6rL98J65P2P7L05J75M04
348E97L32m6R5j35k45j44L13k45n41m85K77k82q58L81N16q0k03L00J37R1L79N77
370G31N5K82k37R2k41k6n9n26J82k89m11l82J00q4k02K82J52K4j31O15L86K04
392E17J15M21j28j00J10j49j65j59j15k74m86k21k15J21nJ2r0J88L39K20M7L63
414C46N22o9j36K39k5k78J7J04n85l52k12j37o9K0k90P4J67K47l2p6N22L66J40
437E03J86J65k00o8K54J25l40o19k21oLk04k44j35J69K38j51q6L78L53K5L31L30
460G86j95j60L54L75n69n26RN9m2m16k42k00K59j44pj11M84j19oM67M36j49m6
$$ plain form
303 397 969 1329 1141 1214 1074 589 296 219 242 -83 -609 -961 -897 -751 -1197 -1062 -440 -76 -90 -140 149 475
325 475 362 728 1407 1178 580 513 607 12 -174 -3 -133 -581 -1078 -1066 -990 -999 -601 -436 -364 -287 18 193 597
348 597 929 883 978 843 598 454 767 522 -19 -504 -227 -509 -1367 -986 -470 -550 -753 -453 -316 -225 154 731
370 731 786 1068 831 923 682 656 597 71 253 -36 -447 -829 -729 -813 -1015 -733 -581 -557 -688 -73 313 517
392 517 632 1053 925 825 935 786 621 462 347 73 -413 -634 -849 -728 -733 -721 -811 -623 -284 -64 -17 346
414 346 868 799 663 902 877 599 616 720 135 -217 -429 -566 -635 -615 -905 -831 -664 -417 -449 -525 -3 363 503
437 503 689 854 654 586 840 965 625 6 -215 -221 -218 -422 -666 -801 -632 -394 -545 -631 -253 100 125 456 786
460 786 591 431 785 1160 591 65 74 133 91 -325 -567 -767 -508 -652 -659 -770 -286 -405 -411 56 492 343 297
483B97M48M09o44j01K41j63J1n47l61k20K44p2k23o3P1m0J44M74J99k77K76O66
505G69J31m66m1L09J25l93k68l98J30k28k09j62J58k48O7M07L40k37l58N13Q60
526H01k41l86L03L10j28j56l10J03l56j1m7p8k42l17JK88O7l31J92N90K96j1j19
549B18J21J66q2J18K79k49m01k36R2q1n51j8p7M56j01k43J7K17L83j28J53M48
571E01p0L04j96K13l07k71J23Rol99m62N6O4J16n24Q1N82j33L7J42L26R2r9M18
595E97j7J67l36M5jl20Mm22K91j02m08m80M44K06j54Q8K93R4J9n7M33J48k32K41
619E41K24j65j41l09P4m6l20k80r9J44L9k27rJ65R3N9L56K14j64O9J43L78k33
642E06j25k9Kk44K34l29m84J14j63j84J86K89k74L29J47O4m2lM55J31m2J7j53
$$ plain form
483 297 745 1154 510 409 650 487 498 -49 -410 -630 -386 -458 -681 -744 -673 -713 -569 -95 104 -173 103 769
505 769 900 434 393 702 827 434 166 -232 -102 -330 -539 -701 -543 -791 -724 -317 23 -214 -572 -59 801
526 801 560 174 477 787 659 503 193 296 -60 -71 -118 -196 -438 -755 -754 -466 -399 -730 -538 52 348 337 218
549 218 339 505 423 541 820 571 170 -66 26 -55 -606 -624 -701 -245 -346 -589 -572 -355 28 -100 53 501
571 501 431 735 539 752 445 174 297 306 300 -99 -561 -505 -441 -325 -849 -768 -186 -319 -282 -140 186 278 179 597
595 597 580 747 411 456 455 135 139 -283 8 -94 -502 -982 -538 -332 -486 -398 -105 -11 8 -49 384 532 300 541
619 541 765 600 459 150 224 178 -142 -422 -521 -377 -338 -565 -574 -409 -316 -257 99 313 149 218 361 739 506
642 506 381 352 354 110 344 15 -469 -355 -518 -702 -516 -227 -501 -172 -25 39 -3 -6 449 580 538 555 402
665D02L9p7k7l18j27j3j13r1k35L9K26m4NK11P6J72M0K19j75J73j6J28j11k2j19
690B42m5k00j18k53N0Oj92k7J4J63O2J20L83j7k59M02N3K5J28n3j73j61j40L4
714D4k15j54LJ40k68K8j40N3J38K49J37m2R2J13OK81p4nJ1J11k97j95j32r0j54
739c60j57J4J54n5n1Q1K09L3J27k2K38L12k02j0K07j16j08j48j15Q2j38j78j81
762c84q4J60k5m2O0jL71j03K46R6J5J77j51K60j94k09J02p4k08M6k13k27J76k14
786d20j08Q1J4K05J52P0K39j78J38J94J20j46r8j2l7j18j69J64p7l62k6K8K0p7
810d03J00m2J21Q8l1J99J36J88k90M91j21r4l2J07j60k86k11K8n0mk14N3J34L5
834b58r1o7O31j50J68j30J73J07m4J1K3j07k56q6N4k22k83K48j01m0K3J05R3J71
$$ plain form
665 402 441 364 337 19 -108 -121 -234 -325 -560 -521 -295 -339 -334 -123 -47 125 165 384 209 382 366 494 383 361 242
690 242 197 -3 -121 -374 -324 -318 -510 -537 -523 -360 -298 -178 205 188 -71 331 384 409 537 484 311 150 10 44
714 44 -171 -325 -322 -182 -450 -422 -562 -509 -371 -122 15 -27 65 178 184 465 391 386 397 508 211 16 -116 -206 -360
739 -360 -517 -503 -349 -404 -455 -374 -165 -132 -5 -27 211 523 321 311 518 402 294 146 31 113 -25 -203 -384
762 -384 -468 -308 -333 -375 -315 -316 55 -48 198 294 309 486 335 595 401 192 294 220 12 58 -155 -382 -206 -420
786 -420 -528 -447 -433 -228 -76 -6 233 55 193 387 507 361 263 251 214 96 -73 91 14 -348 -374 -346 -326 -403
810 -403 -303 -345 -224 -136 -167 32 168 356 66 557 436 342 310 417 257 -29 -240 -212 -262 -266 -480 -427 -293 -258
834 -258 -349 -416 215 65 233 103 276 383 339 350 373 266 10 -76 -22 -244 -527 -279 -380 -420 -397 -292 -199 -28
858b8p5K58J03J50k12m5J78L7p8j9J2j72j71k39R5n3j38K11M8j56M4m5J83K19
882A07K90k81K4J94K56k63k6pK7k17m9j65o4l75L6K88j47J39l8J11J99J59j76
905B2j36N92k54nJ42L2j02q1k15Qj17j49J79n4k51n2J08K38J20k15K33R5M3J21
929C02j41P8M9r7N8L3k1l35J24k09q1p4k01K11%J52No7Q6J97r5J51K04j39J16
954C06K23j50k04j10K05k49j13k32J30R7j31q1rJ25o6J00K04K0J73L6k22K46O8
977C66l1k9o2n9j30k30L6K8o1j39k3o2P5N3K35l0J11P0L9J23o8P1j19P5m5m9j11
1004C4j14k9k01M1l5m3jQ2J06N6l4J18L5J37R7o1j04J42K10k62J2Pj62j15k8r1
1030b03q0o9J18K27j56j71R3J88J02J32L5J13J44k68K44j15k64k01N9m1j15Q1
$$ plain form
858 -28 -103 155 258 408 196 151 329 366 288 269 281 109 -62 -301 -206 -259 -397 -186 -138 -294 -250 -295 -112 107
882 107 397 116 140 334 590 327 301 294 321 104 55 -110 -174 -549 -513 -225 -372 -233 -271 -160 39 198 22
905 22 -114 478 224 219 361 393 291 210 -5 3 -114 -263 -84 -138 -389 -441 -333 -95 25 -190 43 138 181 302
929 302 161 239 288 191 249 282 261 -74 50 -159 -240 -314 -515 -304 -304 -152 -147 -214 -128 69 -26 125 329 190 306
954 306 529 379 175 65 270 21 -92 -324 -194 -97 -228 -309 -318 -193 -259 -159 45 65 238 274 52 298 366
977 366 335 306 244 185 55 -175 -139 -111 -172 -311 -334 -396 -321 -268 -33 -63 48 118 157 280 212 283 164 239 194 145 34
1004 34 -80 -109 -310 -269 -304 -347 -348 -266 -160 -104 -138 -20 15 152 249 188 84 226 436 174 186 193 31 -84 -112 -203
1030 -203 -283 -352 -234 -7 -163 -334 -241 -53 49 181 216 329 473 205 449 334 70 -131 -72 -113 -228 -147
1052a47j40Q3k8o1M9O0K39q5J78j84J23K21j68l7Q9K06j47n2k9j47j95j1J11j56
1076b28O7j89J92j74J35L41k1k29K60N2k17K76q2N1P7l93K27j25j67Q0l40rK32
1099a84l7n7J02M8P1J38p3j2J70O6R5j93J90r5r3P4k07m8j11j93J86k0k7%N3n4
1125b11J66P9J60o1j74J52J50m6j5j75J06j35J00p1J0k85J0kP7L7j44M4J75j07
1149a60j09J94K49J71r1n0J2q1o2kmj81J1j07k6J43j91J14L0O7n7q1K13nJ41R7
1175B35K7j10Q5L1k56K8K2o0J9j1j55p1r2O3k04K17J10p7K50M4P2K6m6j02L67
1200D12k41j9j5o8J10j91r9M4q5j31J48qN5n0Q4j8N3J73K7jk6o6R6J02j22j03
1226F1k16K5J09j15q4l1j30K80qm8q1J50J00P7J3P9p8Q1nPk45J23Rk2o6j94R8
$$ plain form
1052 -147 -287 -204 -232 -293 -244 -184 55 -30 148 -36 87 308 140 103 192 398 251 199 170 23 -172 -183 -72 -228
1076 -228 -161 -350 -158 -332 -197 144 123 -106 154 206 -11 265 183 234 311 -82 145 20 -147 -67 -407 -416 -184
1099 -184 -221 -278 -176 -128 -57 81 8 -4 166 232 327 134 324 229 136 210 3 -45 -156 -349 -163 -183 -210 -210 -157 -211
1125 -211 -45 34 194 133 -41 111 261 215 200 25 131 -4 96 25 35 -250 -240 -242 -165 -128 -272 -228 -53 -160
1149 -160 -269 -75 174 345 254 204 216 135 73 71 67 -114 -103 -210 -236 -93 -284 -170 -140 -73 -130 -211 2 -3 138 235
1175 235 262 152 237 268 12 40 62 2 21 10 -145 -216 -308 -245 -449 -232 -122 -199 51 95 167 193 147 45 412
1200 412 171 152 137 69 179 -12 -111 -67 -152 -283 -135 -143 -88 -138 -54 -72 -19 154 181 180 154 88 184 286 164 61
1226 61 -155 -130 -21 -136 -220 -251 -381 -101 -109 -157 -238 -88 12 89 102 181 103 184 179 186 -59 64 73 51 -15 -209 -111
1253a11Jj43J89k24J6J04m0K02o3K98j24J40j23j9J55j52M1j35q0j2P4r7j64m2
1277c09M4M4K3L6J16P4K0q7Q6J62J2J49j06k7qj97J28J8k22j0j61O9K08k99M3
1302a94J77p1j32O5K80l1J29j10n8P1j13L9P6j43O6r9k7K8l4j07r1K24pk8L1k1
1328h0L5J44n7J06J71M4k11J4q6O8k96J30K1r6k66L33j09p3L1o2J87o7J27n0K23
1353A81K7j1K7l8q4J42P4k46r9K0j70J1K01j40lj21P5L7J12M5J6J1lR3O7r7R4
1380B21o4j64R0j64n5J38j85kk7k6J79j45J57M1k9K03l4J12r7j04K99l51K2O6
1404H1J4j61J10j59N0j13Q4k28J56J18j9J11l3O3P6p3p0J8K06j25l3J25n7j75
1428c4J69j94j25J28n6J8j45P2K4J8J79k2l9r9J89N7J34J7j51o7l0Mj39K33l36
$$ plain form
1253 -111 -110 -253 -64 -288 -272 -168 -208 -6 -69 229 105 245 122 103 258 106 147 12 -68 -80 -6 -103 -267 -309
1277 -309 -265 -221 -198 -162 -46 28 48 -39 47 209 221 370 264 237 229 32 160 178 -44 -54 -215 -146 62 -237 -194
1302 -194 -17 -88 -220 -155 125 94 223 113 55 126 13 52 128 -15 51 -48 -75 -47 -81 -188 -279 -55 -62 -90 -59 -80
1328 -80 -45 99 42 148 319 363 152 166 80 148 -148 -18 3 -93 -359 -26 -135 -208 -177 -239 -52 -119 8 -42 181
1353 181 208 197 224 186 102 244 318 72 -27 -7 -177 -166 35 -105 -108 -229 -154 -117 -5 40 56 67 64 157 224 127 221
1380 221 157 -7 83 -81 -136 2 -183 -185 -212 -238 -59 -204 -47 -6 -35 168 134 246 149 45 344 -7 15 81
1404 81 95 -66 44 -115 -65 -178 -94 -322 -166 -48 -67 44 11 74 150 77 7 25 231 106 73 198 141 -34
1428 -34 135 -59 -184 -56 -112 -94 -239 -167 -143 -125 54 32 -7 -106 83 140 274 291 140 73 43 47 -92 141 -195
1453a95N1M8q9k2N3q2K41j35J04J5K31k61K66lk0m2J46j79q3k06j17J43r6O8K11
1478D7k61Q4M8l1j2l4N3R2L2O4J54Oo5Pr8j20n8L9O9k8l0j37J23j11pM7p5q3L15
1507C0K37j66p8l2m5L08L7j63k5K1q4k2o6m8j05p2l7R4q5O1L41o1L1n0k4O3N5
1534A15P6J21n5m4j76p3J51m7j45J3m0J10j43j51L58J46l85J33J52M0jj03K06
1557B58j74O0L9j08j1J39n5j59J38k52J4L5N2%j3j4J82p1K6n9J1L6K9J01r6J12
1583B20k11K7j51J35j06j04P5q1K66n0K5j38J02j26R1R4pm5J33j76N6M7j02O2
1607C6J2j45N2j3m1j4r3K35l08L79p7J91k47p5L10o3n3J60r1q6n6k4J61k2j19
1632Im6j46o3Q4k1J94q2k8Q3P8j09L54k39L7j5J03j18p7q4K72k98J18o5M3n0J6
$$ plain form
1453 -195 -144 -96 -185 -207 -154 -236 5 -130 -26 -11 220 -41 225 222 202 160 306 127 44 -162 -279 -136 -232 -164 47
1478 47 -214 -130 -82 -113 -125 -159 -106 -14 18 82 236 242 177 184 86 -34 -92 -53 16 -12 -42 -179 -56 -167 -174 -127 -202 -285 30
1507 30 267 101 23 -9 -54 254 291 128 103 124 40 18 -48 -96 -201 -273 -310 -216 -301 -240 101 40 71 21 -3 60 115
1534 115 191 312 257 213 37 -36 115 68 -77 -64 -104 6 -137 -288 70 216 -169 -36 116 156 155 52 258
1557 258 84 144 183 75 64 203 148 -11 127 -125 -111 -76 -24 -24 -37 -51 131 60 86 27 38 74 103 204 108 220
1583 220 9 36 -115 20 -86 -190 -115 -196 70 20 45 -93 9 -117 -26 68 61 16 149 -27 29 76 -26 36
1607 36 48 -97 -45 -58 -99 -113 -206 29 -279 100 23 214 -33 -108 202 139 86 246 155 69 13 -11 150 128 9
1632 9 -37 -183 -246 -162 -183 11 -71 -99 -16 62 -47 307 68 105 90 193 75 -2 -86 186 -112 6 -59 -16 -66 -50
1658e0l2R2j27K7L3j7J50L9j35J96o4O0r5N9j39J04j28l6J0k03J58j08J98j1j81
1683b00K87q4K3N4j18K42k2j51J04L5j15K1Q5n2j20j18O8l5j59K06j93J65J20
1706D3q0k4R6m4OJ75j03RJ39o7K9k36J00M0l7m7o5o4J58j29Qq1R1J14l8om1j59
1734b13L86l6J20j59p1qJ8p0J61k82m2J85o7j67O9K24K4j39Q9R1j84P3M5K20k60
1759GOK27k46O1L8n9K2m2j16k8O8j91J94j74P4J13j08K68j08Q6J7L9j1O9n2j40
1785A4J11k9k5k02j31P3O6j89L46r6J8K2J17m3K7Kl9J60j27j97K41J14k91P3j56
1810a41J38N0j99L1Q6n3Nj08N3K50j13n5L03j81m8J78k49K88j61j9o3K0r6l5l9
1835a58J95q7l0JJ35j62k5J25j17K2J55m2m9K11qJ43l15J6n0m5M5k43J92mm0j53
$$ plain form
1658 -50 -82 10 -117 -90 -57 -74 76 115 -20 176 112 172 77 136 -3 101 -27 -63 -53 -256 -98 -206 -8 -19 -200
1683 -200 87 3 26 80 -38 204 182 31 135 170 55 76 161 109 -11 -129 -61 -96 -255 -49 -242 -77 43
1706 43 -37 -61 35 -9 -3 172 69 78 217 150 179 -57 43 83 46 -1 -66 -130 28 -101 -93 -174 -83 31 -7 -13 -54 -213
1734 -213 173 137 257 98 27 19 37 -33 128 -154 -196 -11 -78 -245 -176 48 72 -67 22 113 -71 2 47 267 7
1759 7 13 240 -6 55 93 34 56 14 -102 -130 -62 -253 -59 -233 -159 -46 -154 114 6 92 109 148 137 206 154 14
1785 14 125 96 71 -131 -262 -189 -123 -312 34 -62 -44 -22 95 52 79 81 42 202 75 -122 119 233 -58 15 -141
1810 -141 -3 47 -152 -121 -35 -88 -83 -191 -138 112 -1 -56 247 66 18 196 -53 235 74 55 -8 12 -84 -119 -158
1835 -158 37 -50 -80 -79 56 -106 -131 -6 -123 -101 54 12 -37 174 166 309 -6 10 -40 -85 -40 -283 -91 -95 -135 -288
1861b88K39m2P0J38j25o9J53o9O8N1J59k48p7L49k91O7j78L6O8oJ1k31Q3Q3J05
1886E6k49K98o8j22J47k23K54P8j80J65J2j51O5m5m7m9q2Q6J68k90j12P8K3J76
1910a2J20q8N9L1J17j87j8m9K13j36l5J01k47J69j28N3j8k27J87k3J7L3l9K42
1934A35l3qJ72r9P0k12J13j18jL5o1j65J32O6j61K81k25K7p6J71j18R9Q0j96J72
1959H0P1j07J82j73p7K9j45J53l1J6JJ4M6j28M6L4Nr3J38P0j91J61n9P9p8n2L8
1986B9KK0j14J75j74n5J40o2q4J95j0j75m1J49K68k37J61j14pJ17j61r6Q4j37
2010a27J88N5p5j79l0K69k90R2J31k0J19j63n8K8O7N5J9J36p3j94J31j57J56j12
2034c2M3o4o1K1k9N4N2j57J34qN8j24K64J9J8j71K08l43K05m5O5n8j1j21J3K04
$$ plain form
1861 -288 -49 -91 -21 117 -8 -77 76 7 75 126 285 37 -40 309 18 85 -93 -57 11 5 16 -215 -132 -49 56
1886 56 -193 105 37 -85 62 -161 93 171 -9 156 168 17 82 37 -10 -59 -141 -55 113 -177 -289 -211 -188 -12
1910 -12 108 20 79 110 227 40 22 -27 186 50 15 116 -131 38 -90 -37 -55 -282 -95 -118 -101 -68 -107 135
1934 135 102 94 266 167 237 25 138 20 19 54 -7 -172 -40 26 -135 146 -79 -52 -128 43 -75 24 104 -92 80
1959 80 151 44 226 53 -24 5 -140 13 -18 -2 -1 13 59 -69 -23 11 16 -77 61 131 -60 101 42 121 43 -9 29
1986 29 31 51 -63 112 -62 -117 23 -39 -123 72 62 -113 -154 -5 263 26 187 73 66 183 22 -74 10 -127
2010 -127 61 116 41 -138 -168 101 -189 -97 34 14 133 -30 -88 -60 7 62 81 217 144 -50 81 -76 80 -32
2034 -32 11 -53 -114 -93 -122 -68 -16 -173 -39 -47 11 -113 151 170 188 17 225 -118 87 42 107 49 38 -83 -70 134
2060A34j02n5r7J18j74J06r6J94j15J34j03m1J13R0m6m0o6J36k51K45j16J4k88
2083c06K02m0r4K95r3O8n2l7lL02pk66P6J08J49j36l32L5K79l15j40K53j1J6%
2108d9m1J60k43N2K46j29l2M8L0j02K18J1jj28j31Q7Jj00R7K2o7L9J03j78O4J21
2134I8j19O3o4J06j1j22K39o9n3R1k63P8J13k43K67k81J71j56Q5O1J33k12K31
2157A43r6o5P2j40J33P1n8O1j60L1k39J65K30j97j05J39J30k78K32m7j28J51J15
2180A60j91M1J7k04K97j0J17%j94L1j06o2J17j20Q7L2j50K24k5m0p9J56j46K42
2204A94j92j29J27J02n0%J3q9k0m9N0%j63L3N7K27q5j61J14K22k09q9K04J65l06
2229c4K36p1r7Pr4M4n0kJ05%j87Q1k7j73J32K08q3j0Q7K1p2K7j75J72J0j88K78
$$ plain form
2060 134 32 -23 -120 -2 -176 -70 -166 28 -87 47 -56 -97 16 106 60 20 -46 90 -161 84 -32 -18 -306
2083 -306 -104 -144 -238 57 -36 32 -20 -57 -60 242 235 -31 45 153 302 166 -166 -131 148 -167 -307 -54 -65 -49 -49
2108 -49 -90 70 -173 -121 125 -4 -36 12 42 -60 158 169 168 40 -91 -4 -3 -103 -6 16 -51 -12 91 -87 -23 98
2134 98 -21 42 -22 84 73 -49 190 121 68 159 -104 -26 87 -156 111 -170 1 -155 -70 -9 124 -88 143
2157 143 47 -18 54 -86 47 118 60 121 -39 -8 -247 -82 148 -49 -154 -15 115 -163 69 22 -106 45 160
2180 160 -31 10 27 -177 120 110 227 227 33 64 -42 -104 13 -107 -20 12 -138 86 61 21 -58 98 -48 194
2204 194 2 -127 0 102 52 52 65 -24 -44 -93 -43 -43 -206 -173 -116 111 26 -135 -21 201 -8 -97 107 272 -34
2229 -34 202 131 34 41 -53 -9 -59 -61 44 44 -143 -62 -89 -262 -130 78 -5 -15 72 93 21 48 -127 45 55 -133 145
2256A45j74kQ7j76J92k23J74p4P6J56k41K4QJ34j52J25kk98K44J8o5J4kL7k26
2281b01J87Pj05J23j43J48j48k3Q1P7o1jJ50n6m6K4K09k33O0J18j59q8k4J55k08
2306a57n5K03M8mk84L1K49O5p1R4m9J24lk31O1P2o8oJ0n7M5j26L3N7JQ3n6n3J9
2335b5k6J82k47K2mJ30Q1k09R6P8j87P5O3j61J51j23J2m3N2l0N2R9J2K8QJ9mn7
2363D4Q0L1n4m9q0J9n9RR9l57L89j47j8R5m9m0P9j10K11j33J49n1J54k99J12J01
2389A26r4J44k56J46j28j01J41m7o4R5M3j95L16k77J06L5lr1J93lj67J81j05J45
2413A40j75J59j31K8q6p4J07L0N4j06k08L56o6P1j03K5OM7l9k5J13k93K94K4k42
2438i4K2Pk4O8L2k0j24K77j00M4j86J12j03J72l5j05K43p3o5j37J44k13J8Q9O1
$$ plain form
2256 145 -29 -31 56 -120 72 -151 23 -51 25 181 -60 -36 -28 106 -46 79 77 -221 23 41 -24 -10 -12 25 -201
2281 -201 -14 -7 -112 11 -132 16 -132 -155 -74 3 -58 -59 91 35 -11 13 222 -11 49 167 8 -80 -104 51 -157
2306 -157 -212 -9 39 35 -249 -218 31 96 25 119 70 194 191 -40 21 93 25 19 29 -28 17 -109 -76 -19 -18 65 9 -44 -25
2335 -25 -51 131 -116 -94 -98 32 113 -96 0 78 -109 -34 29 -132 19 -104 -92 -135 -83 -113 -61 38 50 78 86 105 101 44
2363 44 124 155 101 52 -28 -9 -68 -59 40 -317 72 -75 -93 2 -47 -87 -8 -118 93 -40 109 58 212 -87 25 126
2389 126 32 176 -80 66 -62 -163 -22 -69 -133 -38 5 -190 126 -151 -45 -10 -13 -104 89 86 -81 100 -5 140
2413 140 -35 124 -7 21 -65 -139 -32 -2 52 -54 -262 94 28 99 -4 21 27 74 35 10 123 -170 124 148 -94
2438 -94 -72 -65 -89 -21 11 -9 -133 144 44 88 -98 14 -89 83 48 -57 186 113 48 -89 55 -158 -140 -51 10
2463A0q4l9j1N2l3O6l8R7j61J89j5O4j33J31l3%l3O4l9Qj04k20L4J26J51j58m1
2490a50J35j06Q7K1l4pJ27J13o2q1J78j47o3n1Q9q2q5K10m2L6j28J12l3k1r1R2
2516A7l2J40L3l6k5j5j24Q2l9P9k02K01j48J11k6k82J81L9J63Pp7%j44N5K34j87
2542EPn4no4L8J34j2j68J0J2O3L9K3QK4p8j28j3L62j29q3k1L2N2oM3m2j93N1L7
2572e6m3JN3L4R8k33K05j75J4J61n0RK2J88p7o1j15o5J70l2J35k07p4K5P8k18
2598b13K39p4nJ0J23o0n5L11j10j87J55k21J84J04j08k85J49k4M2J43k20J90j64
2621g6m2J3K02j47K2l9O4O8P5j2m6k45K87r3o5K3J2P0j62J19N4j05n0L5r2J1K53
2648A34j68o2K37k32J04J15o0j1j28J30jK2l4L1j24nJ4p9m1L0L6K39k1o7k42J13
$$ plain form
2463 10 -74 -113 -124 -72 -105 -39 -77 20 -141 48 33 97 -36 95 62 62 29 93 54 62 -42 -262 -228 -102 49 -109 -150
2490 -150 -15 -121 -34 -13 -47 -54 73 186 124 43 221 74 11 -40 49 -33 -118 92 50 86 -42 70 37 16 -75 17
2516 17 -15 125 158 122 97 82 -42 40 1 80 -122 79 -69 42 16 -266 -85 -46 117 124 47 47 -97 -42 192 5
2542 5 12 -42 -47 -111 -73 61 49 -119 -109 -97 -34 5 28 36 60 -18 -146 -159 203 74 -9 -30 2 54 48 91 49 -144 -93 -56
2572 -56 -99 -98 -45 -11 87 -146 59 -116 -102 59 9 18 40 228 151 90 -25 -90 80 48 183 -24 -98 -73 5 -213
2598 -213 26 -48 -53 -43 80 20 -35 276 166 -21 134 -87 97 201 93 -192 -43 -67 -25 118 -102 88 -76
2621 -76 -118 -105 97 -50 -28 -67 -3 65 140 128 82 -163 124 31 -34 -11 1 71 -91 28 82 -23 -73 -38 -130 -119 134
2648 134 -34 -96 141 -91 13 128 68 57 -71 59 58 80 46 77 -47 -52 -38 -117 -158 -128 -92 147 126 59 -183 -70
2674g0J17O3PO5r8l8p4k9J41k3j56J6L7P2j35J07j33J8J23m2K5j92J15K68k88
2699a04J94r7l7P6N8p0J6R7n7p3j02K3LJ09j3n7J03n2J0J00k24L79j04m6L1n8
2725A05r5L3o2j06N0k4n9r7R6J10l4R3PN6p0K06k55R1No5K06j88J14k67J65l8
2751b3j65R0qJ03j08O9m0l7J7J08N4K79k19k64L05O5j68l6q8O6r8K96j80j04j7
2776a03O7R7j31R0r2Q1K01j96K3J49l10Q0J59p7J3jj45L48k63R5k2j21OJ4j1P9
2802C0l5K6J56k10OL8mM1pQ2q4O4k88J69n9J15j66K14p7J68j13j70J45j21NJ51
2828G6q9Mm1J38K6N9o1jj84J72j25N6J44l05J0R6R6j64J4mR2jP9j41P0J79j26
2855F9p9k1J31P4J9k58L2K5r1N0Rj59K23j19K6J24qk20J94ML5o5r1K10j01J85
$$ plain form
2674 -70 47 110 117 182 84 46 -28 -57 84 61 -95 -79 -42 30 -105 2 -131 -113 10 -32 -7 -199 -84 184 -104
2699 -104 90 -7 -44 32 90 20 36 133 76 3 -99 -76 -73 36 23 -34 69 17 27 127 -97 282 178 132 163 105
2725 105 10 43 -19 -125 -75 -99 -158 -255 -159 -49 -83 10 17 73 3 209 -46 45 50 -15 191 3 117 -150 15 -23
2751 -23 -188 -98 -106 -3 -111 -42 -82 -119 -102 6 60 339 120 -144 161 226 58 22 -66 0 -98 198 18 -86 -103
2776 -103 -36 61 -70 20 -72 9 210 14 37 186 -124 -44 115 38 51 50 -95 253 -10 85 63 -58 -52 -38 -49 30
2802 30 -5 21 177 -33 -27 11 7 48 41 123 39 103 -185 -16 -75 40 -126 88 11 179 66 -104 41 -80 -75 76
2828 76 -13 -9 -50 88 114 173 112 111 -73 99 -26 30 174 -131 -121 -25 71 -93 -79 -83 9 8 87 -54 16 195 69
2855 69 -10 -31 100 174 193 -65 -33 -8 -99 -49 -40 -199 24 -95 -69 55 47 -173 21 25 60 -5 -96 114 13 198
2881A98k68J14l1J77k45K37p0j36k35K33J51j42k1M5N7j14N6o4R6L0o0j20J17
2904En8n0Q9J33j41o4J33j48P8J16k35K90j68M3m7QR4o5k5J85k79J41j05J38L8
2929A06j82J29j46Q1oooj41K07j17J45j44m2L8K13l1r4J19o4J3j26P2k0P8j66
2954i0qjJ04j33r2K33mJ21p0kQ3j68J78qq7j09Q0j00M8j13J68P7j42p0P6n3j03
2981a85K28L1r8J56j10k5j85K96j40L3K05k31R5j64L57l79k9J55o6M8n5nM8r8
3005a18pK26J61l23J2J20M2r4P6j0n7P5j82J01j44O0j0nO8k01J31K29l01J54J3
3030A6j15J09%L2J32j35J4q3R1O0k32J60J10l47J32P8j4N8p0n3P9L7Lm5J22m8
3056I1j63J79k9k81J49J27j65JJ39k62J53O8K09k71N0k3k1L0j69P9J31k6O4J05
$$ plain form
2881 198 -70 44 13 190 -55 182 112 -24 -259 -26 125 -17 -38 7 64 -50 6 -58 38 68 8 -112 5
2904 5 -53 -103 -14 119 -22 -86 47 -101 -23 93 -142 148 -20 23 -24 -16 78 13 -12 173 -106 35 -70 68 106
2929 106 -76 53 -93 -12 -18 -24 -30 -171 36 -81 64 -80 -122 -84 129 98 4 123 59 72 -54 18 -2 76 -90
2954 -90 -98 -99 5 -128 -220 13 9 130 60 58 141 -27 151 143 56 -53 27 -73 -25 -138 30 107 -35 -105 -29 -82 -185
2981 -185 43 74 -24 132 22 -3 -188 108 -32 1 206 -25 70 -94 263 -116 -145 10 -56 -8 -63 -68 -20 -118
3005 -118 -125 101 262 -61 -49 71 113 19 95 85 28 103 -79 22 -122 -62 -72 -77 -9 -210 -79 150 -151 3 16
3030 16 -99 10 10 42 174 39 53 -30 61 121 -111 49 159 -188 -56 22 8 66 -4 -57 22 59 62 17 139 91
3056 91 -72 107 78 -203 -54 73 -92 -91 48 -214 -61 7 216 -55 -5 -28 -49 -19 -188 -109 22 -4 60 165
3080A65k21Q9P9m7n8J8n2j1R6k7Mn1l1J14m6k2k2N2m7P8j42J40L1k6J9j19J7J46
3108A26j94mK3J2M9j40l7K24j48L9O7p0J68r5p9J87j34m9N4M6n4j32J00J98k28
3133g1j3J01j86J30LM2J5j19nJ09K20j67po0J18q1j68O3L5K37j2l13Q9rj71K13
3159gR5O1r2j3km1L2j9mk4P7l4l2N4j09K9m1J53j66p8J7J74J14jl1n3j8J45k55
3188f9J0Q8O3k3J6K4p3j94J02j11K93j95K6P2q7o9J60M1l38K71Q0M4j72O9K86
3213C14k47n6L4l2K7n1n2J29j67J03o0J33l2k20J14J0n8K49m4m6k7P6j17J40q6
3238C4R2j22n0J14o6M5m0M3j49j3J60%j36J03q5j25K82o6J39j70J43m8r1J7J12
3263A23p7j14J00j31Jj4k1K18r7j72R5O2J32j28L6K3r1M2j4N4r5K5p5N0Q0K78
$$ plain form
3080 165 -56 33 112 65 7 25 -27 -38 58 31 35 -16 -47 67 21 -1 -23 29 -18 60 -82 58 89 63 82 -37 -20 126
3108 126 -68 -72 -49 -37 12 -128 -165 59 -89 -50 17 -53 115 20 -59 128 -6 -55 -1 45 -9 -141 -41 157 -71
3133 -71 -84 17 -169 -39 -36 6 21 -98 -103 6 226 59 52 -8 110 29 -139 -76 -41 196 184 -129 -40 -49 -220 -7
3159 -7 88 149 57 44 42 1 33 14 10 -14 63 29 -3 51 -58 -29 -70 83 -83 -161 -144 30 144 143 112 59 41 186 -69
3188 -69 -59 29 92 69 85 109 36 -158 -56 -167 126 -69 -43 29 -58 -127 33 74 -264 7 87 131 -41 28 314
3213 314 67 11 45 13 40 -11 -63 66 -101 2 -58 75 43 -177 -63 -53 -111 138 94 48 21 97 -20 120 34
3238 34 126 4 -46 68 2 47 7 50 -99 -112 48 48 -88 15 -70 -195 87 21 160 -10 133 85 -6 11 123
3263 123 46 -68 32 -99 -98 -112 -133 85 -12 -184 -89 -27 105 -23 13 36 -55 -13 -27 27 -68 -43 -118 -68 12 290
3289B90k49m8j6p8N7R7j8Jm7J73n1j86J11M3n2n1nN4n4j03J78k80J82J27k35K45
3315H5j85L4J39j9J8q4J5O5j25n5J02J64q6j62K31k95J40L5P7k11L1N9l4j6N4
3340b3o6K21j89J66j95R2P4k03K9o0Q2P1N9j08jM1L1n3O8k40J71l1J25q8K9M2
3366D4kj5n0L9n4r9J58j35J28J8o2LK6n6QOj7L4mJ12kK0o3N4O8l6o2J2l72K11
3396h8N1k2M3Ml0Jm0L1J2J7J49j48J24j45P1N6j75K14k08K01o6n1m3L1J25j05
3422Ir1q0L9M5N8j48L8K18o2L9L5N4k69J93R6j15j96J46J3q7Q2j11J64j52J58
3447G6j23jJ6n3K24j50j6P7j03J42k28K88j52k3O7k22L21o8L2Jqj90pN3R0m0K3
3474B6m6K04j10n3O5j84J87j40j13J85O3J1j60jL6l0j21K74j37k5p5R2O5p9J23
$$ plain form
3289 290 41 -7 -23 -101 -44 53 35 36 -11 162 111 -75 36 79 27 -24 -29 25 -29 -132 46 -234 -52 75 -160 85
3315 85 -100 -66 73 54 72 -12 3 68 -57 -112 -10 154 68 -94 137 -158 -18 17 94 -117 -86 -27 -61 -77 -23
3340 -23 -89 132 -57 109 -86 6 80 -123 -94 -154 -72 -1 58 -50 -51 -10 21 -32 36 -204 -33 -64 61 -27 2 44
3366 44 42 27 -23 16 -38 -137 21 -114 14 32 -30 -27 -1 -57 -49 -43 -60 -26 -30 82 80 100 37 91 159 123 61 73 -299 -88
3396 -88 -37 -59 -16 -12 -42 -41 -81 -50 -38 -21 128 -20 104 -41 30 86 -89 125 -83 118 52 1 -42 -11 114 9
3422 9 -82 -162 -123 -78 -20 -168 -130 88 26 65 100 154 -115 78 174 59 -137 9 22 -65 17 -94 70 -82 76
3447 76 -47 -48 -32 -85 139 -11 -27 50 -53 89 -139 149 -3 -26 41 -181 140 72 104 105 97 -93 -100 -47 43 3 26
3474 26 -20 184 74 21 86 -98 89 -51 -164 21 84 95 -65 -66 -30 -60 -181 93 -44 -69 -144 -52 13 -66 57
3499E7L0j86M7M4R6m5J13r7j56O1j49K42l3l8J9J39l33J21J7J16j58o3K24j27
3523e9J44rO2l4j67p7R9M2NJ12j70Q3j48p5R2j9J21k3J24k78J20J58m1j1P3J3
3549A37j01J7j40J8J68j70M2QN6%j13P3J06p1K4j60O2J47j20J94j43j54J01j84
3573b03K94j6n4j7P4j38p7j28J84p2J56J4q0pM8L9L1r9J50o0O9o8q7K6Pk6m5M7
3601c8J2O7j1l2M6j78J63m5J97j46j03L61j27q1J30k21q4K04j75K8l9J11j57M8
3625g0M9p1%j4K04r3nq5J44P4o9j95J67k13J51K7l7J04o5j44J26k8M3J4j88K43
3651F9l7k27J87J33r6K4n9l0J6K8J0n8J60k00j97J91p3lJ43L3o4j7K50j47j84
3676a48L2J52K5P9m5j46J12M7rn8K2k38J45j49K2k7J38O9k48J22J40k49J73O8
$$ plain form
3499 57 87 -99 -52 -8 88 43 156 59 -97 -36 -185 57 24 -14 5 144 -189 -68 -51 65 -93 -156 68 -59
3523 -59 85 76 138 104 -63 -140 -41 1 6 118 -52 31 -117 -192 -100 -119 2 -21 103 -175 -55 103 62 51 124 137
3549 137 36 53 -87 -69 99 -71 -29 -21 35 35 -78 -5 101 30 54 -106 -44 103 -17 177 34 -120 -19 -203
3573 -203 91 75 21 4 78 -60 -137 -265 -81 -153 3 17 -63 -70 -22 17 48 -51 99 39 108 40 -47 -21 -14 -40 -85 -38
3601 -38 -26 41 30 -2 44 -134 29 -16 181 35 -68 293 166 85 215 -6 -90 114 -61 -33 -72 39 -118 -70
3625 -70 -21 -92 -92 -106 98 5 0 -85 59 133 64 -131 36 -177 -26 1 -36 68 3 -141 -15 -43 0 14 -174 69
3651 69 32 -195 -8 125 29 53 -6 -36 -20 8 18 -40 120 -80 -277 -86 -159 -162 -19 14 -50 -67 183 36 -148
3676 -148 -116 36 61 140 95 -51 61 108 99 41 63 -175 -30 -179 -157 -184 -46 23 -225 -103 37 -212 -39 29
3700B9o2P9R4j41j8q9J2K19p4j94K53J99m62J01K4P2r3N2J7k6K1r4K42k66O5K41
3726B01j56l0j13M7Q6PQK1j17LR0j36o9J61p0j67K81J17q4p2p5N8M1QP7j27M2
3753C2m8n1J25j59R2l5N3Pn7J40j07q6J51Q6j67M2N3j26J83k5k3j17K2M7J30j10
3779E2O1k69Q3j46P5K77j08L3n7R8j82m7O8J18q7rJ28j6j80P5J00k40L6o7K21
3804A7p8L0j5j01J59P5j88J22Q2l9Rq8J21k68K55j0j47m0N4k7J05J61k76j6rr2
3830b04K25n4Q6K0r5m6K5K1J84k68J11n8K61k00M8k01K31j15n9l0j9J74j37P3
3854b7q8K97k83J27K5j08J95j58l4K65o3k25Q5N4J08j69l1p2QP2M7j27J25r5L9
3879c3pJ4K8N0j35J89m5j33O7N5j45N0J82j90K64l25oJ11J83k80J68L4j12R6j15
$$ plain form
3700 29 -33 46 140 -1 -19 -108 -96 123 49 -145 108 307 -155 -54 -30 42 -51 1 18 -8 13 -81 161 -105 -40 201
3726 201 45 15 -98 -51 35 42 50 71 -46 -43 47 -89 -158 3 -67 -234 47 164 80 8 -67 -9 32 40 117 -10 32
3753 32 -16 -67 58 -101 -9 -44 9 16 -41 99 -8 -94 57 143 -24 18 71 -55 128 103 80 -37 -15 32 162 52
3779 52 113 -156 -73 -219 -144 133 25 58 1 99 -83 -130 -62 56 -31 -40 88 72 -108 -33 67 -173 -137 -204 17
3804 17 -61 -31 -46 -147 12 87 -101 21 103 64 73 -15 106 -162 93 83 -64 -104 -50 -77 28 189 -87 -103 -112 -204
3830 -204 21 -33 53 73 -22 -68 -43 -22 162 -106 5 -53 208 8 56 -145 86 -29 -88 -118 -137 37 -100 -27
3854 -27 -115 182 -101 26 51 -57 138 -20 -54 211 148 -77 8 62 170 1 -30 -102 -94 -22 25 -102 23 -72 -33
3879 -33 -40 -26 2 52 -83 106 61 -72 -5 50 -95 -45 137 -53 211 -114 -120 -9 174 -106 62 96 -16 80 -35
3904c5j0k4J49q2j36J51l6Q0L6k49P8k9L39j67m4m8L7J66k94J34J29j59k0q1m0
3929a55N9J12O0K8k96K01R3k63L5K57q9j20P2J43j03Q4j04K14j12j81N6Q2n8l2
3953a7M8o6m5j1J49k69J02N3o0P5R6q3J59j49p6k3O8Q3j36J57J49j49j94R9Q2
3978D2j39J5N4J1O7k27R5j1K02o6j20J19j17J01r8J11L4k15l6J30J30OM4k26R
4003h5P8J08o2k69J35J9R0k14L03k64K23P0p1j1n7N2n6p1J54p8J17k5j87J01j04
4028a04l4K03j19j4J35%r9j02J50L7m0j39K39l6mQ2k98K03j34n0N3k6N6K1q2R8
4054dj28O9R7jj0j9Mj35J22j9L2P5j09J06j4r9k0j6J67j98J90j23L7K0J5j23J60
4081G6J58j42j23m0J58k83J49k4N5n5J02k2j51l0L5M4j6J30k2N6K9j35J62j26
$$ plain form
3904 -35 -45 -69 80 -2 -138 13 -23 57 93 -156 -78 -107 232 65 21 -27 10 176 -118 16 145 -14 -34 -115 -155
3929 -155 -96 16 76 104 -192 9 102 -161 -126 131 42 -78 -6 137 34 118 14 228 116 -65 -9 73 15 -17
3953 -17 31 -35 -80 -91 58 -211 -109 -56 -116 -41 55 -28 131 -18 -94 -117 -49 34 -102 55 204 55 -139 -40 42
3978 42 -97 -82 -28 -17 50 -177 -82 -93 109 43 -77 42 -75 26 -72 39 73 -142 -178 -48 82 88 132 -94 -85
4003 -85 -7 101 39 -230 -95 -76 14 -200 103 -161 62 132 61 50 -7 45 -11 -82 72 -6 111 86 -101 0 -104
4028 -104 -138 65 -54 -68 67 67 -32 -134 16 53 13 -126 113 77 73 155 -143 60 -74 -124 -71 -97 -41 -20 -102 -4
4054 -4 -132 -63 34 33 23 4 8 -127 -5 -24 8 83 -26 80 66 -33 -53 -69 98 -100 90 -33 4 24 39 -84 76
4081 76 234 92 -31 -71 87 -196 -47 -71 -16 -71 31 9 -142 -172 -137 -93 -109 21 -1 55 84 -51 111 -15
4105a5P1J30k54J51J5j23j9n4J9j10J30K16j31r4jN8K1j15J32nJ04j76n4J91k16
4130a29L16j22p4M5j08N9m0K4J47j87J1k4N2J08lj59j29K26L7J40j42O1L9j04
4154D4L2p6j0L1j40J85l8j92R4J8j06Q3q5R3Q4l1j62J71P5n6L7r2Q8j25K37k26
4180f7KQ1o9J9j01R3l7M2J3L3K4mP5n4J97k38n0L0J6n3R1j08L6J83j02j47J56
4207F1j05M9j6J19jp1m7m0J62m9j51J27O8j06J51k05K10k40P2m6O9q5O4r6J87
4232H1j31K35l03J58rP6k0N1j45k6O5m9J96p2l03J62Jj29J30pR8J22k64R2O4q8
4258a5nL1M0q6J32J5j7l2r9J38j19P7l5M7j9o0j8J9R1j95P0M6J06p5OK8j30K04
4286A45j83o2K2p4J51R0j60J64J08k03M2j87K53k82R8P0P9K4jk0j15MJ30j56J46
$$ plain form
4105 -15 56 186 -68 83 98 -25 -44 -98 -79 -189 -59 157 26 -68 -69 -11 10 -105 27 22 126 -50 -104 87 -129
4130 -129 187 65 -9 36 -72 -13 -53 -29 118 -69 -58 -82 -30 78 75 -84 -213 13 50 190 48 109 148 44
4154 44 76 0 -10 21 -119 66 28 -164 -70 -52 -158 -75 -160 -67 17 -14 -176 -5 70 14 51 -41 47 -78 159 -67
4180 -67 -65 16 -53 -34 -135 -42 -79 -37 -24 9 33 29 104 50 247 9 -41 -11 5 -48 43 -65 -29 154 52 -95 61
4207 61 -44 5 -11 108 107 36 -11 -51 111 62 -89 38 106 0 151 -54 156 -84 -12 -58 11 -74 -10 -106 81
4232 81 -50 185 -118 40 31 107 87 138 -7 -33 32 -17 179 107 -196 -34 -33 -162 -32 -39 59 181 -83 9 73 -15
4258 -15 -20 11 51 -35 97 112 95 63 -36 102 -17 60 25 72 53 -7 -25 -6 85 -110 -40 6 112 37 43 71 -59 145
4286 145 -38 -100 -78 -152 -1 89 -71 93 201 -2 40 -147 106 -176 -78 -8 71 95 94 74 -41 -37 93 -63 83
4311H3j24j14K18j68J25o6p7J40N9p4J09j20M5K9k9j04o4J87j24P1J42k59K8J8
4335f9K6J4Kl2L6j3p6J90r7j53J30j12L07Nk31J94j23M0k5l8j9N8N5o9m1k1NR9
4363D2m4l9P7oj24R3P4j22J68k08O7j5J23j12jl8R7L0p0j02J53n3o0j4M3O1J49
4390A69j81M0j8r9N2J44O6j03j97J18J70j78L8No6R3n4M0n8l8k0P6o5K07j40o0
4416e9o4J40M3Km9n2q5J05K04k60J31N1j85L8J7K33j44j60O4n3j14J95K8o0j9
4441e3m4LR2o0J19j72K48j48PK00j16l33N6J14j2lJ44K11j99n8n3J99n1r5l7N8
4467A7r0J03R8k77J34j25M8Q3M5q2M0l6N4k9J90j16m8L1l8M4q7K0K48j00k33J03
4493cO0J8l2j70J25k10K03N8j16J55j76R2l1po6J28j91J64j03PQ8J6rJ18j22q4
$$ plain form
4311 83 -41 -155 63 -105 20 -46 -123 17 76 2 111 -9 36 65 36 -68 -132 55 -69 2 144 -115 -87 -69
4335 -69 -43 -29 -27 -59 -23 -36 -112 78 -19 -172 -42 -154 153 158 -73 121 -2 38 13 -25 -44 14 69 0 -41 -62 -57 42
4363 42 -2 -41 36 30 -94 -1 73 -49 119 -89 -22 -37 86 -26 -27 -65 32 62 -8 -110 43 -10 -70 -84 -41 20 169
4390 169 -12 28 10 -89 -37 107 173 70 -127 -9 161 -17 21 26 -40 53 -1 39 -19 -57 -77 -1 -66 141 1 -59
4416 -59 -123 17 60 62 13 -39 -124 -19 185 -75 56 107 -78 -40 -23 210 66 -94 -30 -83 -197 -2 26 -34 -53
4441 -53 -97 -94 -2 -62 57 -115 133 -15 -8 192 76 -257 -201 -87 -99 -102 42 253 54 -4 -57 142 91 -4 -41 17
4467 17 -73 30 128 -149 -15 -140 -92 -9 36 -46 -6 -42 12 -17 173 57 9 40 2 46 -41 -21 227 127 -106 -3
4493 -3 57 75 43 -127 -2 -212 -9 49 -67 88 -88 4 -27 -34 -100 28 -163 1 -102 -95 -7 9 0 118 -4 -88
4519h8J18M3j69J7N7L3L6j4n3l2J6p8N7jJ3Q8J39j19r4M3j4N0j39RP7o9J89k80
4547a65N5J48l9Rq9K10j53R7P9j74o4Q7L6j64L2K25n0n0l0l0n3P9R5j22K1L0N
4574B5j31J76j38J86n9j7j76O5J49j04Pj15J26K22j87k5j98J69M6O0J14k75J60
4597H0k60J85O1p1kR5n1m0P0p4j69J27J63j45N8O6k12nJ37J39l5JL7M2l86Q7L0
4624g2J11l0j1m5L7j8m9J01j39J46j77J78P2j00m8J09Q4m9l83J83J48pl0j1o6
4649f6P0k3m0kJ84j70J64q0n0J82l53K30Oj17L7K1R7Mr2R3j58J55j22m2j8o1J05
4676d6n5Q0q5K71k04J16mj40K9O9q8j35K11l1M7j64J33N5r3j38J29p4K65k00J7
4701c5N7N4j9j27J01k24J80Q0J6j14O4l8j07J02J29k41J49k08K47M5r2M7R5m1
$$ plain form
4519 -88 30 73 -96 -79 -22 11 47 33 -20 -52 -36 -114 -57 -58 -45 43 182 63 -31 12 -2 48 -91 -82 -5 -74 115 -165
4547 -165 -110 38 -1 8 -81 129 -24 73 152 -22 -86 1 37 -127 -95 130 80 30 0 -30 -83 -4 91 -31 -10 20 25
4574 25 -106 70 -68 118 59 42 -134 -69 80 -24 -17 -132 -6 216 29 4 -194 -25 21 81 195 -80 80
4597 80 -180 5 66 -5 -7 88 37 -3 67 -7 -176 -49 114 -31 27 93 -119 -124 13 152 117 118 155 197 -189 -102 -72
4624 -72 39 9 -2 -47 -10 -28 -77 24 -115 31 -146 32 104 4 -44 65 149 100 -283 -100 48 41 11 0 -66
4649 -66 4 -19 -59 -61 123 -47 117 37 -13 169 -184 46 52 -65 -28 -7 90 94 2 95 -63 92 -30 -72 -90 -151 -46
4676 -46 -101 -21 -106 165 -39 77 73 -67 -38 31 -57 -192 19 -12 35 -129 4 59 -34 -172 -43 -117 148 -52 -35
4701 -35 22 76 57 -70 31 -193 -13 67 83 -31 33 -5 -112 -10 119 -122 27 -181 66 111 19 66 161 120
4725A20j60J1J51q6J24k8jk0q3Q0j10j48J71l8J0r2lP5j59L15n7P4j16M0k5L8
4751H3k4j48Q9N8oj06P2k2L8j77K14j37j13J34n0J0K12j02P0j27L4l9J72j23K
4776A4N6q1L6M7K4p1n7q1J8K23q3j33O2P0l2L0Mr9K4J17Q1j78j23O5K10q5q4P1
4804D5r5O4j02K48Qk6o9k66K22J9r2J86k00K11k24J6q1M0P5K2m8M9n1Q2J10k59
4830a16K61k52J60lq6J8N6q8R1j46O9P0M3J46k95o2K28N2k33J28j40qJ03N3o5
4855a6M7m9k07K43l7j14J0K19j29J15j01K3J23j37p2L3J30Q4j89pO1p9J12j09
4879d6R4j04J1P1j20J43j81R9j2o4L14k67PN6k2jj97K31Q0p7j47K91m6j38J59
4904A34Q8q5n6K3k93O9K00k47J14J92j73M0j3mp6K29j97OPJ2r2K13l5N7j86R0
$$ plain form
4725 120 -40 -29 122 36 160 132 131 111 28 108 -2 -150 21 -17 -7 -99 -102 -27 -186 129 72 146 30 70 45 83
4751 83 59 -89 0 58 52 -54 18 -4 34 -143 71 -66 -179 -45 -95 -85 127 25 95 -32 2 -37 135 12 14
4776 14 70 -11 25 72 96 25 -32 -113 -95 128 45 -88 -26 44 12 42 46 -53 -29 88 169 -9 -132 -67 143 58 -26 45
4804 45 -50 14 -88 160 168 142 73 -193 29 48 -44 142 -58 153 -71 -55 -136 -96 -21 1 -47 2 -49 33 143 -116
4830 -116 145 -107 53 50 -36 -18 38 -50 41 -105 -36 34 77 223 -72 -134 94 146 -87 41 -99 -107 -4 49 -16
4855 -16 31 -18 -225 18 -19 -133 -123 96 -33 82 -19 4 127 -10 -82 -49 81 165 -24 -31 30 -49 63 -46
4879 -46 48 -56 -45 26 -94 49 -132 -33 -45 -109 205 -62 -55 1 -21 -22 -219 12 92 15 -132 159 113 -25 134
4904 134 222 137 81 104 -189 -120 80 -167 -53 139 -34 6 -7 -11 -87 142 -55 -49 -42 -30 -122 91 56 113 -73 17
4930A7%k1J89j21J03k26O8j41J65lj0kp4R1rl2j20K26j50l7Q6J13o6j00R1J1j63
4957a15K59k10J11j44P7m8o6K41j76Q4L0j23J1o9J49j78K89j29r0J23r9J70j07
4980a0K5j61J40J7p0P1j3NK34k43p0j4k4K8o5J70O8j18J38m2j07J86j05n4K7n7
5006d4n0K05j23K10l30J08j6p8K6j05K25j53J77n6k7K3r0P4J15j3j64P8m8P5J87
5031B06j72j21M9P8J0J2m1J29k22j19M21l33R3m9P5l5N3p5ll7K3J69j76K91l45
5056a19O1J62j00n2R6K0J60j60j29j16K07R8j53l8J0j8R1K1k8k3j69J88m7j35
5080a73J21K3r6K30j2j55O1J18j70j23J04J80j81nJ34j3q9J33k37l0R6K57k67
5103i4M4J61K3j67j73L16k90L19R4j73j15O8J77l03J43K0J7M0j59L3J81k44O1
$$ plain form
4930 17 17 -4 185 64 167 -59 9 -132 33 30 20 18 -56 35 26 -6 -126 100 -50 -87 -1 112 46 -54 37 48 -115
4957 -115 144 -66 45 -99 -22 -70 -136 105 -71 13 43 -80 -69 -138 11 -167 122 -7 -97 26 -73 97 -10
4980 -10 15 -146 -6 11 -59 12 -1 4 238 -5 -75 -89 -113 -85 -150 20 88 -30 108 66 -41 145 40 -14 13 -44
5006 -44 -94 111 -12 198 -132 -24 -40 -118 -92 -197 28 -125 52 -4 -31 -8 -98 -24 91 78 -86 -8 -56 19 206
5031 206 34 -87 -38 40 50 62 21 150 -72 -191 230 -103 -10 -59 16 -19 34 -41 -44 -81 -58 111 -65 226 -119
5056 -119 -58 104 4 -48 48 68 228 68 -61 -177 30 128 -25 -63 -53 -71 20 41 13 -10 -179 9 -38 -173
5080 -173 -52 -29 -125 105 93 -62 -1 117 -53 -176 -72 108 -73 -78 56 43 -46 87 -150 -180 -84 173 -94
5103 -94 -50 111 134 -33 -206 110 -180 139 233 60 -55 13 190 -113 30 50 67 107 -52 -19 162 -82 -21
5126b1J87j88J47k14n6j3R3P5m4j9j06K49qk70J79k4J9J18j60K3J39k67l7J72
5150b6J38l3j02lJ87j70J58j97J33p7P7j89K44k54J45j60N3J92j79j16O0M7k9
5173a01J17Nm9J14j29K06j71nq2QJ52j08jQ9k06K21q7M0K11k11Q2j91J22N5l7
5198D4O4k05N0L6l6l3K1N1j61O9R0Q6N9l00J29OK05p7j19l1L6k8nK9J31k15P4
5225c0J25k0q3n0J71j57M8RK3O7Oj18km3J43j00Lj13P1L5J03j12j35K15J65l18
5251i7J14m0J14k70K42j67K6o8J52J62j76K5K4J7R0k05q9J77o9L2P2j79j23K21
5275a5q1J23k31J80j20K58qp5j04J45j69QJ33R9j22R8j51k9Q2J03K2k02oK01q7
5300E2m6mQ7J7q2j47Q6O1Lj02q1K4L4N1L0J38j63J21m4j85O7J76K0j29K0J51r5
$$ plain form
5126 -21 166 -22 125 -89 -145 -158 -65 10 -34 -53 -159 90 82 -188 -9 -33 -14 104 -56 -33 106 -161 -198 -26
5150 -26 112 79 -23 -26 161 -9 149 -48 85 8 85 -104 140 -114 31 -129 -76 116 -63 -179 -119 -72 -101
5173 -101 16 21 -28 86 -43 163 -8 -13 -95 -87 65 -43 -44 45 -161 60 -27 13 224 13 95 -96 26 81 44
5198 44 108 -97 -47 -11 -47 -80 -59 -8 -169 -100 -10 76 135 -165 -36 -30 175 98 -21 -52 -16 -44 -49 -20 111 -104 -30
5225 -30 95 75 -8 -58 113 -44 4 13 36 103 109 -9 -11 -54 89 -11 -8 -121 -50 -15 88 -24 -159 56 221 -97
5251 -97 17 -23 91 -179 63 -104 -78 -146 6 168 -8 17 41 58 148 -57 -146 31 -38 -6 66 -113 -236 -15
5275 -15 -96 27 -204 -24 -144 114 106 31 -73 72 -97 -89 44 143 21 119 -32 -61 21 124 146 -56 -62 139 52
5300 52 6 2 89 106 24 -123 -37 24 27 -75 -156 -132 -98 -47 -17 121 -42 79 35 -150 -83 93 113 -16 4 155 60
5327F0r6m6K6nQ6K38l01O1j07j9N6P3K16k77j03J07J35j74K1K24k07J01k50L1
5351a50J88L9p3L9p5J11P9k62J49q7J25j58K8m5n0M6J75n5p8LJ63k36K23Ok09
5376a04K31q5j54O4o6R0K7J3n2N7L3L0j07k0Q8p2P7r9K46j96lL7p7J69j53M2N9
5403G5K1j58j2J14l2R5nk48J90J9r4P6L7j17P8j53o3K39j59J01p6M0J04j03RP9
5429E7l25K10j71J40J69n2K4k1j10M00k71N9j76j8R3j12K06j95J18k4J38j84M3
5452bK8j89K37j25n2K12r7N0j10p0K5J54M4j39M0J40r0m8J07j99O0Q6k56L29P1
5477B06k43O3o5M3Q5j93K16l18J24O1l1N2J93k03m5j4K41L1j50N5p3J3j35Q6j24
5502a25K71k59P8K22j71O5j46O3m9n4J44j55mR7R2m6q2LJ77r6j16J02m1P1p3K8
$$ plain form
5327 60 -36 -82 -56 -61 25 263 -38 23 -84 -103 -47 26 242 -35 -138 -31 104 -70 -49 175 -32 69 -181 -150
5351 -150 38 77 4 43 -32 79 158 -104 45 -42 83 -75 -47 -92 -142 -96 79 24 -54 -51 112 -124 99 105 -104
5376 -104 127 42 -112 -48 -114 -24 3 16 -36 21 54 84 -23 -43 45 -27 50 -49 197 1 -2 35 -42 127 -26 16 75
5403 75 96 -62 -74 40 8 103 98 -150 40 59 -35 41 78 -39 39 -114 -177 62 -97 4 -72 -32 72 -31 -22 57
5429 57 -268 -58 -229 -89 80 28 52 31 -79 321 50 109 -67 -85 8 -104 102 -93 25 1 139 -45 -2
5452 -2 26 -163 74 -51 -103 109 12 62 -48 -118 -93 61 105 -34 6 146 56 8 115 -84 -24 62 -194 135 206
5477 206 -37 26 -39 4 89 -104 112 -206 -82 -21 -52 0 193 -10 -55 -69 172 203 53 108 35 48 -87 -1 -125
5502 -125 146 -113 -35 187 16 81 -65 -2 -51 -105 39 -116 -120 -23 69 23 -59 -56 121 25 -91 11 -30 41 -32 -4
5528dm3J05j9j83K9J66lQ3j58Q8K3n6j22L0J22j65J43r7K07Q4k07j72J79k2l3
5553b5R9r4jJ61j88J76j99j73K44n5k05K63j70K32J2j55j00P8J07k1j07J01j9
5576c9n6J34L9m2L1k73K38J09k11K87j66j38LL1j87K20J58k46L5n3P2O7L4J0j9
5601C8k03L19j12j28K04j13k3k57K55N8r0k2P5m5J72j82J27n0J35k52Q9k8Or7
5625a24K91j92K6p3J33j00M2q7k2m0N4J96L8k00p4K14j46m8N2j9l1J56L9j72J57
5650G0j11p5O1j0O6J1l5L5k52L57k41Q6m6P4p0M9J82j30m4k7L6Oj20J91p4q3J31
5677C7n3m8K6P9j01N1j5p2O3J49k53R2k0J05o0j21J68l3j36J07l0J10o7K32k81
5702g1J49k00K55j20j58k1L08j98j25K09O7p2M8q0q1qL6j2O2J61j39k27K50j32
$$ plain form
5528 -4 -47 58 39 -144 -115 51 48 131 -27 61 84 28 -94 -64 58 -107 36 -61 146 230 23 -149 30 8 -25
5553 -25 74 -20 -21 140 -48 128 -71 -244 0 -55 -260 3 -167 65 77 -78 -178 -100 7 -14 -121 -20 -39
5576 -39 -95 39 78 36 67 -206 32 141 -70 217 51 -87 -84 -53 -240 -20 138 -108 -73 -126 -54 13 47 57 38
5601 38 -165 154 42 -86 118 5 -18 -275 -20 38 -52 -74 1 -44 128 -54 73 23 158 -94 -5 -33 -27 -124
5625 -124 167 -25 1 -72 61 -39 3 -84 -106 -146 -92 104 142 -58 -132 82 -64 -112 -60 -79 -110 46 85 -87 70
5650 70 -41 -116 -55 -65 1 12 -23 12 -240 117 -124 -38 -84 -10 -80 -31 151 21 -23 -50 -14 -8 -128 63 -11 -94 37
5677 37 -16 -64 -38 41 -60 -9 -24 -96 -33 116 -137 -45 -65 40 -20 -141 27 -6 -142 -35 -65 45 -22 210 -71
5702 -71 78 -122 133 13 -145 -166 142 -56 -181 28 95 23 71 -9 -90 -98 -62 -74 -12 149 10 -217 33 -99
5726i9J25n8j69J67q4O0l0m7J70Kn8J6O9k34J21J47j18j43J06L0O2k1Pm5K2P5
5752G3n6J7N8lq7m4q3J32l4P6n6L8p7J07m3p3J06j0m3n7Q7j16K3J11r8K99k79
5779c2l0o8K90r7j1n9K02j38j65QP7p4O1J10L8p0j28P8j8l1P1oj53J13n0Q7k15
5806b10M24k51J91j11o8J92o2j22Q2k4lo3o1J33l3j39L0N2K0p0M9j6nK6J17r4
5832a6q9j3J07p5J99k1j26l0J33q9j82K95o4j5l8J45l3m9q6kP9J7m2jl3rk8LN8
5861ej4QJ07n0j27J76j41O6O6k18R2L4N5N1j55K5o5J5L3N3M4j02l9mK09j8j86
5888i0J97k35J81M3j03J75j28j87R7J55j22J0O7N4O6j38k2r2QJ10P5j89Q4m6Q9
5913E9M0o9j52J43j20j5PJ73M2q1l5J39j44l6n3J1J02p7k3%J31L1j61J37k02J80
$$ plain form
5726 -99 26 -32 -201 -34 -118 -58 -88 -135 35 37 -21 -5 64 -170 -49 98 -20 -163 -57 -27 35 14 21 -24 -2 73
5752 73 17 34 92 89 2 -42 -125 7 -27 49 -7 31 -46 61 18 -55 51 41 -2 -59 28 -88 -65 46 -52 247 -32
5779 -32 -62 -130 160 63 52 -7 195 57 -108 -100 -23 -97 -36 74 112 42 -86 -8 -26 -57 14 8 -145 -32 -82 5 -210
5806 -210 214 -37 154 43 -25 167 105 -17 65 41 38 -25 -86 47 14 -125 -95 -43 -23 -93 -44 -60 -65 -39 78 -16
5832 -16 -105 -118 -11 -86 113 92 -34 -64 69 -20 -202 93 29 14 -24 121 88 39 -47 -49 30 47 5 4 -29 -38 -66 -63 -5
5861 -5 -19 -11 96 46 -81 95 -46 20 86 -132 -40 -6 49 100 -55 -30 -95 -80 -47 6 50 -52 -91 -95 114 96 -90
5888 -90 107 -128 53 96 -7 168 40 -147 -50 105 -17 -7 60 114 180 42 20 -72 -64 46 121 -68 16 -30 59
5913 59 99 30 -122 21 -99 -114 -107 66 108 27 -8 131 -13 -49 -102 -91 11 -66 -89 -89 42 73 -88 49 -153 27
5939B7J29j98o2O9R4R1j25j59J57j13J37q6kJ41j0r1R1j21L6j19K6o0K22j05q9
5964a20PJ16L1m0j9n8K23j20Mr2m1P1k8O1r5O2q9R8l6j71K33m5pQ9Oj33L8Q7K4
5993E6j44j50K77j13J14k4M4j98L0L9l5L8J24O5Pk35j0J18J9M1j35J55o2P2k44
6018a51J46l3L5k08M1J46J7J44k78m9J71J77j93J10r1p9J10R8j16M3j04n6o1K41
6042F0j54J20J4j05J97j78r0K16j07J9p4J99k16K1j0kK29j32J36l09J28m7j05
6065a90O8K16j39O5Jlo9K21j78K54o1j76J4K4l3L0j88q0L73j41j07P8J06r3P0
6090F2k19J06N4%oJ30l18Q8Q2R7o1p0J05pr8R0n5K1l4Nn1J63J25l39o6K44J9p3
6118fJ3J10l1j99j7J30l1M0RQ7j10n5k8K2J49l9n1j10R1J6N0k23J76p6M4m6M2
$$ plain form
5939 27 156 -42 -104 -35 59 150 25 -134 23 -90 47 -39 -41 100 90 -1 90 -31 5 -114 -88 -148 74 -31 -120
5964 -120 -113 3 34 -6 -25 -83 140 20 24 -68 -109 -38 -66 -5 -100 -38 -127 -29 -65 -236 -3 -48 -55 34 40 -93 -55 32 56
5993 56 -88 -238 39 -74 40 16 60 -138 -108 -69 -104 -66 58 123 130 -105 -115 3 22 63 -72 83 21 93 -151
6018 -151 -5 -38 -3 -211 -170 -24 -7 137 -141 -190 -19 158 -35 75 -16 -95 15 113 -3 40 -64 -120 -181 60
6042 60 -94 26 40 -65 132 -46 -136 80 -27 -8 -82 117 -99 -78 -88 -90 139 7 143 -166 -38 -85 -190
6065 -190 -122 94 -45 20 21 18 -51 170 -8 246 185 9 23 47 14 44 -144 -224 149 8 -99 -21 85 -8 62
6090 62 -157 -51 3 3 -3 127 -191 -103 -21 76 15 -55 50 43 -55 35 -20 1 -33 -28 -79 84 209 -130 -196 48 67 -6
6118 -6 7 117 86 -113 -130 0 -31 9 18 105 -5 -60 -88 -66 83 44 -7 -117 -26 -10 40 -183 -7 -83 -39 -85 -43
6145d3n4J13J1O2Q6l97L07r8J26r4k5K48m17J67MJ08j96K13J3k74M31j07k20j3
6169d9p9l7LK26K8j26Q4k01J31J51k48J11o7J00j42M5M5J4L0J1j46J03J51j09
6193B9J17j35q4L9J42l1Q0k76K0J65j88M8q8P7J13K0n1j8J14j34NJ06L4j07j24
6218a27N7N8p4n2l7J50QK0P6P9l07J56m3o7K7L3J46j64j04K08o6n3M9O8ON2J0
6245A09m2j05Q5p4J04j83LJ52k98K63J1M5l8k16R4J16p1L4K3j68L37o5o5J70l05
6270h4Q8l4J50N5j52j41L26k85k1P5M5l6%j49L3K30j39N5J08j58j31J12j04J02
6294e5o2J08O3k6j44Q8k1p0R4J38j21P2m2M2j67J16R6j77J57O1p2RL1k21J73j37
6320f7l6MM4J5j7Q2j1P3p8L5l3j7L8J63l20Q0j44K8K05r9P2j13L6N2n8J22Q6j68
$$ plain form
6145 -43 -97 16 27 89 175 -222 85 -13 113 19 -6 242 -175 -8 -4 104 -92 121 134 -140 291 184 -36 -49
6169 -49 -128 -165 -162 64 92 -34 50 -151 -20 131 -117 -6 -73 27 -115 -70 -25 -11 19 30 -116 -13 138 29
6193 29 146 11 -73 -34 108 77 157 -119 -99 66 -122 -74 -162 -85 28 48 -3 -21 93 -41 -36 70 104 -3 -127
6218 -127 -70 -12 -86 -138 -175 -25 -17 3 79 158 -149 7 -36 -103 -76 -43 103 -61 -165 43 -23 -76 -27 41 47 99 109
6245 109 67 -38 47 -27 77 -106 -103 49 -249 14 25 70 32 -184 -90 26 -45 -11 12 -156 181 116 51 221 -84
6270 -84 4 -30 120 175 23 -118 208 -77 -98 -23 22 -14 -14 -163 -130 100 -39 16 124 -34 -165 -53 -157 -55
6294 -55 -117 -9 54 28 -116 -28 -49 -119 -25 113 -8 64 22 64 -103 13 109 -68 89 150 78 87 118 -103 70 -67
6320 -67 -103 -99 -55 -40 -57 25 14 87 9 44 11 -6 32 195 -125 -45 -189 -161 44 -55 17 -96 -60 -8 -66 56 142 -26
6348b6P2J23j74R1p3N8j12j36K18l1n0nK10j66l4qK5Kl8l5N3K1J00k34L02p0j22
6375c9N5j06J85j55JJ9pO7r7M8J22l7j36m0n6Q9O3J4J9q7J98r2m3N8j42J32k7
6402Fj45M7O2nk9N3L6N4p5k1pm6J16L5j17K9J31j25l1k4L3Q9n8k2K1j33N1O4J02
6431I1j42j9o5Q4j8R5q9l3J79j59p5N9J4L5J60j00p0M1o5N9%j6J18m0N4j09ln9
6459g3J17o2K93k29O1q8J8K17k73KM5l0Q8j36Q2j19N9r5R0J73j39j26J56N3j05
6484b1j1J37J7k43M2pK0J92p5o7j09J16P9j22K3J54j22k8m5n4K75k79J27N3j5
6509C7j53J43L9k1K7l5o7N6Rj31K25J4j56j33J80n4j3o8N6K35k60P0J19k0k65
6534a66M4J53jj3N0j03M5NJ35j77J61j61M7n7R7M2j54J65j46J5K03k24J14J04
$$ plain form
6348 -26 46 169 -5 86 13 71 -41 -177 41 10 -40 -45 165 -1 -35 -43 -18 -16 -54 -89 -36 -15 85 -149 153 83 -39
6375 -39 16 -90 95 -60 -59 -40 -47 20 -77 -29 93 56 -80 -120 -176 -87 -24 -10 9 -78 120 28 -15 43 -99 33 6
6402 6 -139 -92 -30 -35 -64 -11 25 79 4 -17 -24 -70 46 81 -36 -7 124 -1 -32 -56 -23 66 8 -14 7 -126 -75 -11 91
6431 91 -51 -70 -135 -51 -69 26 -63 -96 83 -76 -151 -92 -78 -43 117 17 -53 -12 -77 -18 -18 -34 84 44 98 -11 -14 -73
6459 -73 44 -18 275 46 107 19 37 254 -19 -17 28 -2 86 -50 32 -87 -28 -123 -33 140 1 -125 31 84 -21
6484 -21 -32 105 122 -121 -79 -86 -66 126 51 -16 -125 -9 70 -52 -29 125 3 -25 -70 -124 151 -128 -1 52 37
6509 37 -116 27 66 45 72 37 -30 26 35 -96 129 143 -13 -146 34 -20 -33 -101 -45 190 -70 0 119 99 -166
6534 -166 -122 31 30 17 67 -36 9 14 149 -28 133 -28 19 -38 59 101 -53 112 -34 -19 184 -40 74 178
6558A78q5j6l2l1j9m7m0%J42j9k53K28j65J1R0K44j17p6J91j71Ol0k8K8m1K49
6584A97j58P0o6J4j40J5Q4J17j1q8j13Q8p2k8J33j43J0J04j86K46m3rN6q5o0m8
6610a16K02j2j03k6K0R8L3l9kNK3j32M2P9j40K70q5j01j16L27k46L4Mm5J8nJ03
6637I0j14k5Q5r1J28n0q9K48o8r5J69k5j06j06J27j64o2J45l4J59j10j41J29J39
6661A39j99J81q6n6N6j0j46J02j3M9J20j17N1n4j07Q9j09J3J14m1Jj01M2K03j09
6686A2K0K5n0L2n3o8N4J48j43l4K03j07O4R7q5k12O2j34K00O7k5j02K24k46L3
6711a8M0P2p9mm4j58P3J55k20J24Q2m4m8J1J78k42Q8R9Np0j4Lj07J22J7m3J8Q
6739Dl2L3N4q3o1j00K5K02O3j65k4Q9p7J80k15K55k92J63K13k00j5Q0o8m3J34
$$ plain form
6558 178 93 77 45 14 -5 -52 -92 -92 50 31 -222 6 -159 -148 -58 186 69 -7 184 13 19 -11 -39 -11 -52 197
6584 197 39 109 43 57 -83 -68 16 133 122 34 -79 9 -63 -91 42 -101 -91 13 -173 73 30 21 77 -8 -68 -116
6610 -116 86 74 -29 -55 -35 63 96 57 55 60 83 -49 -7 72 -68 202 117 16 -100 227 -19 15 19 -26 -8 -13 90
6637 90 -24 -49 36 -55 73 23 -66 182 114 19 188 163 57 -49 78 -86 -148 -3 -37 122 12 -129 0 139
6661 139 -60 121 35 -21 35 25 -121 -19 -32 17 137 20 71 17 -90 -1 -110 -97 17 -24 -23 -124 -82 121 12
6686 12 32 57 7 39 -14 -82 -28 120 -23 -57 146 39 103 200 115 -97 -35 -169 31 98 73 -29 195 -51 -18
6711 -18 22 94 15 11 -33 -191 -118 37 -183 -59 23 -21 -69 -58 120 -122 -34 65 70 0 -14 -11 -118 4 21 -22 -4 4
6739 4 -28 5 59 -24 -85 -185 -160 42 105 -60 -84 5 -72 108 -107 148 -144 19 232 32 17 97 29 -14 120
6764A20l37K15j3m9J41k35K0K26K8p1K7j42P3n2R9j16J64r9mJ2Klo0J94q8r7m2
6791h7j6Q4l3P9J15J1j40rR5j39J99j07L9m3n5o6J80j15J8n5n6J36Jk30K65j71
6817a00mN2J6P1j13J1j10J95r5J51J7j56J05j29J19O5L3n3j37m4J8M0P8J04j53
6842a9J26p3M7J9q5M5l9m5Q5j29J95j00r9r6R6K83l73J77K08l56J48r3J74j17
6866b1P0R4r6Rm2m4O8j28L4J22R3n4j78K3N2k7J76j51kk1J88k3o6Qk0p8J98j68
6894A6J01j68Q8j80j8K63j62j15J86M4p9M5J21k48J80j55o0J03J46k8j73J43p8
6917b8J71j44J08q1O6o3o1N9j23N4k5K02j00j8j18P0J38j02J12k10N5O1j88J39
$$ plain form
6764 120 -217 -2 -15 -64 77 -158 -138 88 116 45 72 -70 3 -49 50 -66 98 -1 -5 7 9 6 -54 140 52 -45 -87
6791 -87 -103 -19 -52 27 142 153 13 4 99 -40 159 52 91 48 -7 -73 107 -8 10 -45 -101 35 36 -194 71 -100
6817 -100 -104 -52 -36 35 -78 -67 -177 18 -77 74 91 -65 40 -89 30 95 128 75 -62 -106 -88 -48 30 134 -19
6842 -19 107 34 81 100 15 60 21 -24 61 -68 127 27 -72 -168 -72 211 -162 15 223 -133 15 -78 96 -21
6866 -21 49 143 47 56 14 -30 38 -90 -56 66 159 105 -73 -50 2 -25 151 0 -2 -23 165 142 76 84 64 -14 184 16
6894 16 117 -51 37 -143 -161 102 -60 -175 11 55 -24 21 142 -106 74 -81 -141 -38 108 80 -93 50 -28
6917 -28 143 -1 107 26 92 29 -32 27 -96 -42 -67 135 35 17 -101 -31 107 5 117 -93 -38 23 -165 -26
$$ [...]
8191c
##END NTUPLES=NMR FID
##END=
