##TITLE=1H_DE-80H_X3
 200.13MHz, d2o
 8 sc
 
 19ns.26.2.2025
##JCAMPDX= 6.0         $$ Bruker NMR JCAMP-DX V2.0
##DATA TYPE= NMR FID
##DATA CLASS= NTUPLES
##ORIGIN= UXNMR, Bruker Analytische Messtechnik GmbH
##OWNER= pz
$$ XWIN-NMR		Version 3.5
$$ Thu Apr 16 14:44:34 2026 Russian Standard Time (UT+4h)  Yarkov@DPX200
##.OBSERVE FREQUENCY= 200.1313
##.OBSERVE NUCLEUS= ^1H
##.DELAY= (6, 6)
##.ACQUISITION MODE= SIMULTANEOUS
##.ACQUISITION SCHEME= undefined
##.AVERAGES= 8
##.DIGITISER RES= 18
##SPECTROMETER/DATA SYSTEM= spect
##.PULSE SEQUENCE= zg30
##.SOLVENT NAME= CDCl3
##.SHIFT REFERENCE= (INTERNAL, CDCl3, 0, 14.3821)
##AUDIT TRAIL= $$ (NUMBER, WHEN, WHO, WHERE, WHAT)
$$ ##TITLE= Audit trail, XWIN-NMR		Version 3.5
$$ ##JCAMPDX= 5.01
$$ ##ORIGIN= Bruker BioSpin GmbH
$$ ##OWNER= Yarkov
$$ C:/Bruker/XWIN-NMR/data/yarkov2/nmr/H-C/1/audita.txt
$$ ##AUDIT TRAIL=  $$ (NUMBER, WHEN, WHO, WHERE, WHAT)
(   1,<2026-04-16 14:43:46.00 +0400>,<Yarkov>,<DPX200>,
      <created by zg, POWCHK disabled, PULCHK disabled
       configuration hash MD5:
       00 E9 B6 7A A2 85 ED C7 34 08 36 98 17 FE 4E 26
       data hash MD5: 16K
       10 09 47 8C 48 D7 00 3D A2 A2 64 DD 65 00 EA CC>)
$$ ##END=
$$ 
$$ hash MD5
$$ CE ED CC 0E B4 E6 36 88 FE 61 C3 D1 21 6B 5E 11
##$RELAX= 
##$RELAX= 
##$RELAX= 
##$RELAX= 
##$RELAX= 
##$RELAX= 
$$ Bruker specific parameters
$$ --------------------------
##$DU= <C:/Bruker/XWIN-NMR>
##$EXPNO= 1
##$NAME= <H-C>
##$PROCNO= 1
##$TYPE= <nmr>
##$USER= <yarkov2>
##$AMP= (0..31)
100 100 100 100 100 100 100 100 100 100 100 100 100 100 100 100 100 100 
100 100 100 100 100 100 100 100 100 100 100 100 100 100 
##$AQSEQ= 0
##$AQ_mod= 1
##$AUNM= <au_zg>
##$AUTOPOS= <>
##$BF1= 200.13
##$BF2= 200.13
##$BF3= 200.13
##$BF4= 200.13
##$BF5= 200.13
##$BF6= 200.13
##$BF7= 200.13
##$BF8= 200.13
##$BYTORDA= 1
##$CFDGTYP= 0
##$CFRGTYP= 5
##$CHEMSTR= <none>
##$CNST= (0..31)
1 1 145 1 1 1 1 1 1 1 1 1 1 1 1 1 1 1 1 1 1 1 1 1 1 1 1 1 1 1 1 1 
##$CPDPRG= <>
##$CPDPRG1= <>
##$CPDPRG2= <>
##$CPDPRG3= <>
##$CPDPRG4= <mlev>
##$CPDPRG5= <mlev>
##$CPDPRG6= <mlev>
##$CPDPRG7= <mlev>
##$CPDPRG8= <mlev>
##$CPDPRGB= <>
##$CPDPRGT= <>
##$D= (0..31)
0 0.7 0 0 0 0 0 0 0 0 0 0.03 0 0 0 0 0 0 0 0 0 0 0 0 0 0 0 0 0 0 0 0 
##$DATE= 1776336225
##$DBL= (0..7)
120 120 120 120 120 120 120 120 
##$DBP= (0..7)
150 150 150 150 150 150 150 150 
##$DBP07= 0
##$DBPNAM0= <>
##$DBPNAM1= <>
##$DBPNAM2= <>
##$DBPNAM3= <>
##$DBPNAM4= <>
##$DBPNAM5= <>
##$DBPNAM6= <>
##$DBPNAM7= <>
##$DBPOAL= (0..7)
0.5 0.5 0.5 0.5 0.5 0.5 0.5 0.5 
##$DBPOFFS= (0..7)
0 0 0 0 0 0 0 0 
##$DE= 6
##$DECBNUC= <off>
##$DECIM= 32
##$DECNUC= <off>
##$DECSTAT= 4
##$DIGMOD= 1
##$DIGTYP= 9
##$DL= (0..7)
0 120 120 120 120 120 120 120 
##$DP= (0..7)
150 150 150 150 150 150 150 150 
##$DP07= 0
##$DPNAME0= <>
##$DPNAME1= <>
##$DPNAME2= <>
##$DPNAME3= <>
##$DPNAME4= <>
##$DPNAME5= <>
##$DPNAME6= <>
##$DPNAME7= <>
##$DPOAL= (0..7)
0.5 0.5 0.5 0.5 0.5 0.5 0.5 0.5 
##$DPOFFS= (0..7)
0 0 0 0 0 0 0 0 
##$DQDMODE= 0
##$DR= 18
##$DS= 0
$$ [...]
##$SUBNAM2= <"">
##$SUBNAM3= <"">
##$SUBNAM4= <"">
##$SUBNAM5= <"">
##$SUBNAM6= <"">
##$SUBNAM7= <"">
##$SUBNAM8= <"">
##$SUBNAM9= <"">
##$SW= 18.0517328524113
##$SWIBOX= (0..15)
0 0 2 0 0 0 0 0 0 0 0 0 0 0 0 0 
##$SW_h= 3612.71676300578
##$TD= 16384
##$TD0= 1
##$TE= 0
##$TE2= 300
##$TE3= 300
##$TEG= 300
##$TL= (0..7)
0 120 120 120 120 120 120 120 
##$TP= (0..7)
150 150 150 150 150 150 150 150 
##$TP07= 0
##$TPNAME0= <>
##$TPNAME1= <>
##$TPNAME2= <>
##$TPNAME3= <>
##$TPNAME4= <>
##$TPNAME5= <>
##$TPNAME6= <>
##$TPNAME7= <>
##$TPOAL= (0..7)
0.5 0.5 0.5 0.5 0.5 0.5 0.5 0.5 
##$TPOFFS= (0..7)
0 0 0 0 0 0 0 0 
##$TUNHIN= 0
##$TUNHOUT= 0
##$TUNXOUT= 0
##$USERA1= <user>
##$USERA2= <user>
##$USERA3= <user>
##$USERA4= <user>
##$USERA5= <user>
##$V9= 5
##$VALIST= <valist>
##$VCLIST= <CCCCCCCCCCCCCCC>
##$VD= 0
##$VDLIST= <DDDDDDDDDDDDDDD>
##$VPLIST= <PPPPPPPPPPPPPPP>
##$VTLIST= <TTTTTTTTTTTTTTT>
##$WBST= 1024
##$WBSW= 4
##$XGAIN= (0..3)
0 0 0 0 
##$XL= 0
##$YL= 0
##$YMAX_a= 51366
##$YMIN_a= -42195
##$ZGOPTNS= <>
##$ZL1= 120
##$ZL2= 120
##$ZL3= 120
##$ZL4= 120
##$ABSF1= 10
##$ABSF2= 0
##$ABSG= 5
##$ABSL= 3
##$ALPHA= 0
##$AQORDER= 0
##$ASSFAC= 0
##$ASSFACI= 0
##$ASSFACX= 0
##$ASSWID= 0
##$AUNMP= <proc_1d>
##$AZFE= 0.1
##$AZFW= 0.1
##$BCFW= 1
##$BC_mod= 2
##$BYTORDP= 1
##$COROFFS= 0
##$CY= 83.5205535888672
##$DATMOD= 1
##$DC= 2
##$DFILT= <>
##$DTYPP= 0
##$F1P= 10.8118882576601
##$F2P= -7.23987719738617
##$FCOR= 0.5
##$FTSIZE= 0
##$FT_mod= 4
##$GAMMA= 1
##$GB= 0.15
##$INTBC= 1
##$INTSCL= 1
##$ISEN= 128
##$LB= 0.25
##$LEV0= 0
##$LPBIN= 0
##$MAXI= 10000
##$MC2= 0
##$MEAN= 0
##$ME_mod= 0
##$MI= 1.114404
##$NCOEF= 0
##$NC_proc= 0
##$NLEV= 6
##$NOISF1= 3.799351
##$NOISF2= 2.8
##$NSP= 1
##$NTH_PI= 0
##$NZP= 0
##$OFFSET= 14.38212
##$PC= 1
##$PHC0= -5301.948
##$PHC1= 6.821927
##$PH_mod= 1
##$PKNL= yes
##$PPARMOD= 0
##$PSCAL= 0
##$PSIGN= 0
##$REVERSE= no
##$SF= 200.129724274929
##$SI= 16384
##$SIGF1= 3
##$SIGF2= 2
##$SINO= 400
##$SIOLD= 16384
##$SREGLST= <1H.CDCl3>
##$SSB= 0
##$STSI= 0
##$STSR= 0
##$SW_p= 3205.1282051282
##$SYMM= 0
##$S_DEV= 0
##$TDeff= 0
##$TDoff= 0
##$TI= <>
##$TILT= no
##$TM1= 0
##$TM2= 0
##$TOPLEV= 0
##$USERP1= <user>
##$USERP2= <user>
##$USERP3= <user>
##$USERP4= <user>
##$USERP5= <user>
##$WDW= 1
##$XDIM= 8192
##$YMAX_p= 0
##$YMIN_p= 0
$$ End of Bruker specific parameters
$$ ---------------------------------
##NTUPLES= NMR FID
##VAR_NAME=  TIME,          FID/REAL,        FID/IMAG
##SYMBOL=    X,             R,               I
##VAR_TYPE=  INDEPENDENT,   DEPENDENT,       DEPENDENT
##VAR_FORM=  AFFN,          ASDF,            ASDF
##VAR_DIM=   8192,          8192,            8192
##UNITS=     SECONDS,       ARBITRARY UNITS, ARBITRARY UNITS
##FACTOR=    0.0002768,     1,               1
##FIRST=     0,             0,               0
##LAST=      2.2672688,     0,               0
##MIN=       0,             -42195,          0
##MAX=       2.2672688,     51366,           0
$$ Real data points
##PAGE= N=1
##DATA TABLE= (X++(R..R)), XYDATA
$$ [...]
1156A441o55r96m96P57J041J75n63j183o77J95J506P16j179j584k28J022J207
1173D99L75l68j200m54Q82J409N20r48j132k83Q13P78J92p33j085l87K44J123
1191B45P46q45j483j90J206J167J50p32q37j36Q52J088J89q16j173k45Q42Q36
1209H64L5j145q98k52Q76R54M35r97j240k4J366J391j62j163o55J59R84P15j36
1228A107r38p92j72O99Q59j00j015r92J78J040O65N3p51q54J51J107J145j80j182
1247B8p33M63Q21O70n49q53p77M4O96R76k22j119j038M03J215Q81k57j008m89
1266h48L60J109P19j67j202o89M73R92L61o02r32n95J86O97N45m8p75q78K93J460
1286D59Q60o91j024m40P22R26L95j46r83o25N3J199J86n33j250l71N75Q36K23
$$ y = [1441, 786, -210, -706, 51, 1092, 1267, 704, -479, -1156, -961, 545, 1261, 82, -1502, -1730, -708, 499, 874, 506, -694, -1148, -266, 1143, 1663, 715, -417, -700, 113, 891, 1083, 350, -735, -1122, -878, 245, 991, 146, -1337, -1527, -321, 846, 996, 264, -573, -709, 143, 1231, 1420, 604, -569, -814, 28, 864, 899, -246, -1144, -1396, -520, 434, 869, -128, -1368, -1392, -26, 1365, 1203, 40, -615, -456, 528, 1243, 1107, 169, -623, -795, -96, 763, 663, -352, -1344, -1166, -126, 539, 592, -159, -1013, -862, 245, 1390, 1210, 28, -705, -242, 579, 1249, 700, -153, -930, -886, -190, 786, 564, -555, -1593, -1190, 25, 906, 649, -359, -848, -488, 621, 1340, 1173, -29, -718, -245, 747, 1108, 506, -426, -1021, -835, -138, 407, 359, -416, -1294, -1001, 459, 1319, 628, -396, -836, -114, 812, 1207, 1061, 78, -547, -494, 705, 891, 358, -892, -1263, -688, 148, 371]
1305C71o1j296l78Q51J133R01j093j127p6R49P43K12r09r77o2M80J072k75m19
1324C9j211j78Q93R12K46o04p19l26N12J227M48p24r12k87Q98Q19jr48p83p4N47
1345b26M42K26n29r91k05O94J281J80q42p19Q2Q37Q78n0o01r18o0P32P70j87r71
1366a77p31j9P05N49L5n57o77j63P60R89J48q06q22L13J013N83p7r30n87R3O41
1387B83M74k63q02p40J40P70N56j66o66m60L8R41Q17Q2r96p37L47J116M29m40
1407G23r41n26L37O60L02k35p78o81K25Q65O01k43p65m25N39P42O20p2r31n64
1427e47L09J009K93o82q86k88L65N59K86m17n46m58J91R60N88l33r65j71N11Q69
1447F47L08j92q72m54L78P33K07m35r30k77N24O14Q7o46k91k04M24O15O15l73
$$ y = [371, 310, -986, -1364, -513, 620, 1521, 428, -699, -775, 174, 917, 1129, 220, -757, -819, -339, 733, 458, 39, -1172, -1350, -457, 455, 701, 97, -622, -948, -436, 791, 1239, 515, -397, -684, 214, 1033, 1032, 84, -699, -773, -226, 216, 442, -87, -1078, -1283, -589, 692, 872, 30, -689, -607, 230, 1108, 1058, 457, -461, -521, 211, 981, 794, -177, -908, -927, -222, 327, 362, -195, -872, -1035, -275, 714, 862, 56, -766, -453, 560, 1143, 1066, 136, -451, -358, 283, 757, 494, -308, -1048, -908, -138, 418, 252, -414, -874, -836, 105, 922, 1004, 8, -729, -382, 734, 1163, 723, -218, -744, -407, 253, 555, 320, -458, -1139, -914, -49, 552, 309, -456, -881, -342, 400, 1020, 948, 17, -547, -238, 771, 1064, 382, -504, -792, -427, 132, 418, 1, -545, -1003, -812, 148, 736, 403, -562, -733, -222, 647, 955, 763, -109, -563, -185, 548, 755, 320, -610, -887, -363, 251, 338, -308, -599, -803, -379, 236, 851, 478]
1467D78q73k88Q24P37P5n43p84k10N40N32J41o77o83l25N53R09Q4o54m99N1M28
1488a84O62K14l48p30j86O73R25j3p64p94j4L77P11k16n72m71j93N09N80K60o17
1509a91n28L01P32L67n3k30o58j60O92P88l10r32n03jO67N68k97p67k29N1K82
1530d11P16K56m53p12K02P84M92l39m60l38K8N13N13k72q71m39J51N93L99j34
1550B18q65k28L75M08M99K09m20o85J17Q28N39m12p10j94J35M63L61m54p70l72
1570i58M66N05M24l53o32l19O12O45J38n3l25m24l4P80O11o04p60j97L13L82J06
1591C23l66o20k39N07N55K99l18n09l69M81Q10J73m77k94j38P8N50N34j045r38
1611a003P06n11n7J628j641M84N65q04M83L91J39o87p5K57M92J074j010p16o21
$$ y = [478, -395, -683, 141, 878, 953, 410, -374, -584, -44, 488, 629, -48, -731, -1056, -503, 406, 490, -164, -663, -612, -184, 478, 692, 344, -386, -572, 101, 1026, 1013, 249, -545, -559, -182, 529, 313, -259, -730, -923, -414, 166, 426, -191, -719, -418, 314, 681, 628, 398, -260, -420, 272, 1060, 750, -182, -685, -686, -19, 549, 252, -515, -744, -693, -411, 305, 561, 108, -604, -402, 382, 874, 535, 75, -263, -235, 278, 791, 519, -352, -791, -640, -47, 352, 218, -647, -875, -500, -92, 407, 616, 196, -489, -372, 456, 995, 583, -127, -321, -186, 277, 638, 184, -586, -958, -492, 13, 437, 84, -548, -867, -255, 390, 528, 475, 150, -274, -308, 472, 1083, 479, -281, -478, -165, 217, 323, -43, -663, -902, -395, 160, 459, 141, -368, -737, -256, 554, 727, 250, -44, -182, -104, 446, 980, -65, -1003, -297, -808, -865, 763, -878, -394, 171, -633, -150, 241, 380, -307, -382, -125, 367, 1441, 431, -285, -906]
1630i06J408L44J178j372o84q81P84j95P99k3j982J063K31J233L72j122m38K90
1648I9j22O80J38J87j004n47N24L38O46j142k94L36J87K13L62j349J20j4N82M26
1668C66m62L34m41N79k43O09n98j83n13o20J465L07m34q22R5K92O63J19J20m50
1688A83k25m72N27J73L09k47m03L2K76K73l9M01j703O64J021p44K42r64l85J117
1708C6m37L48O78o38r19M50P75J078k71r14j47K50O49J5q32o59J67K34M70l93
1728f0J91o93k14M99M91L01j261J099K29j825J813P68j470K79q64J087m82K60
1746A48k96K34j79r53Q02M46o13O17n37Q83l60P2k8r07J212Q0j041J591r57q06
1766e92Q40l61L91o17J71j017J057q8O59o5m02k15KN54O61m27l4p76M97k5L85
$$ y = [-906, 502, 846, 2024, 652, -32, -913, -129, -324, 475, 452, -1530, -467, -236, 997, 1369, 247, -191, 99, -23, 657, 795, 982, -22, -569, -45, 293, 939, -203, -497, -161, 26, 239, 601, -748, -628, -642, -60, 366, -96, 238, -203, 376, 133, 742, 144, -39, -552, -1172, 293, 600, 166, -656, -561, -269, 394, 513, 633, 183, -42, -514, 13, 186, 495, 248, -155, -123, 153, 426, 387, 788, -915, -251, 770, 26, 268, -696, -1081, 36, -401, -53, 625, -13, -932, -482, 293, 1371, 1100, 186, 39, 289, 938, 953, 121, -538, -371, -137, 333, -60, 131, -562, -776, -277, 214, 515, -746, 353, 582, -1243, 570, 1338, -132, 147, -717, 370, -112, 148, -148, 86, -93, -1046, -244, 202, -411, 206, -331, 552, 192, 264, 236, -671, 541, 621, -420, 1171, 214, -592, 248, -113, 278, -339, -168, -1185, -128, -216, 443, 378, -24, -239, -237, 317, 978, 551, 517, -259, 238, 213, 598]
1787E98O95q38p82n59O75O96p7r8j226L1O66K73k15L97o03Q0J62N52M61k15p40
1808f7m6L25K39M33l76n84j134J255k81L08m59o20M25L96M82M87q42l05N74N46
1828G56k24j65j96l87j55K44O06l94k06o43M12K97L47m22j61N3j01L88L73J35
1848E57l31k51J62Q0J54k3k45m14J52Q5L92k24l82l11K15M95N7j39j49j16P4M91
1870C29J10Km85j81J80L26J66k90m03j5r0K67J63J01o54rR2N25L31p87J5OM70
1893A69R3K93l76k92l1qM93J0k01m84r5J43L04K29l31m31M49j45K03J83n11K43
1915i3M75M39o54j11J27k94J03J6Q7N9k19p38K59O82j08J50m7n65o19O49J016
1936F14k04j01p96Q59j72N46j34o36l94k11P05q23J003n55n49M53j04N20N90j195
$$ y = [598, 1293, 455, -327, -886, -211, 485, 408, 310, -916, -885, -219, 54, -161, 236, -367, -287, -125, 427, 888, 673, -67, -113, 212, 451, 884, 508, -76, -1210, 45, -236, 72, -387, -1007, -582, -186, 296, 783, -59, -364, 210, 756, 532, 367, 171, -216, -371, -127, 479, 85, -121, -764, -352, -55, 292, -130, -291, -238, -339, 49, 422, 557, 226, -25, 137, 217, 371, 348, 103, -311, -159, -74, 318, 94, -288, -599, -384, 111, 168, 29, -120, -236, -162, 329, 439, 441, -44, -225, -45, 281, 447, 157, -246, -261, -351, -84, 79, 180, -474, -483, -391, 134, 465, -322, -307, -301, 169, 262, 555, 179, -113, -144, -152, 341, 351, 150, -334, -429, -286, 18, 247, -84, -515, -66, -211, -8, 175, -336, -93, 382, 821, 167, 56, 183, -111, -8, 8, 95, 154, -65, -803, -544, 138, 30, 180, 133, -432, -1051, -402, 614, 410, 309, -487, 372, 200, 746, 612, -24, -418, -629, 76, -747, 256, -299, -848, -395, -499, 21, 611, -584]
1956e84J5J124r76N48P61k47n62l45O27K25k83j171J139j60l22M01J03l66n62
1975f35J49O51J42m31k12k11R8P87L4J21l52r5j88J85L42j5n94k76K17L34m9L5
1997C7j55k44J8M26K01o7k52k66J53N39J51k40l79q8j3L10On0l07k91J86K66J58
2020I9k18o0r2J24L50K47k59j55j72J17L43K04k11n23o8K17M4Q0N8l05m16K29
2042c67M30J07j89j54j7K38K60R3k01k37J25n4K57N1o2n58k6J90J87j1j62r6j71
2065c67j4L54K88r8l56MK41K99Q9k67m30K17J32N1L5j82l09j44L33J93j28n6j72
2088b87J11p9N43mj31k70J8K81J94m6l74p1K2K06l8O3j33l10k02L63L41p0k49
2111a22j61K3L19J48J55k43k30J07J01K19J10m15k63J4K11J78j75j41j08l5J94
$$ y = [-584, -569, 555, -421, 127, 888, 641, 79, -266, 361, 586, 303, -868, 271, 111, -211, 190, 293, -73, -635, -486, 165, 307, -124, -336, -547, -449, 338, 372, 493, 141, 46, -142, 43, 385, 370, -224, -500, -283, 51, 2, 37, -118, -362, -344, 82, 283, 216, -36, -302, -149, 390, 541, 301, -78, -166, -179, 131, 137, 87, -220, -511, -325, -59, 99, -119, -179, -271, -147, 203, 450, 191, 36, -136, -19, 324, 528, 317, -206, -274, -57, -13, 67, 125, -180, -596, -367, 63, 170, -19, -173, -190, 48, 308, 401, 200, -37, 88, 34, 291, 342, 280, -278, -304, -114, 73, 62, -100, -196, -367, -381, -27, 261, 163, -193, -189, 52, 351, 440, 173, -257, -40, 92, 143, 178, -4, -313, -457, -124, 69, -59, -115, -287, -176, -255, 288, 284, 153, -117, -99, 182, 376, 330, -44, -115, -93, 113, 75, 138, 5, -305, -507, -144, 197, 127, -122, -283, -260, 59, 207, 362, 119, -111, -4, 97, 316, 426, 11, -252, -238, -27, 151, -24, -165, -273, -308, -114]
2132a14K62J02m35o1J16L14J55n5j82k21J44J92%k9j88k52n4K79L2p8j43N7p8
2155b37J38L03%k50m0N9J41K52l1l42j83K16J86%j66k11j14P5J69J26r9j65j30
2178c03J94J18J81N4k61r9J06J72J67j79j67l42J63L42o1k32j16qLK19J52j56
2200e3j61n6L32J37Q7n1k30r8J05K09J21p9l37j78J88K64n3l09j09pJ93K9K04
2223A48ll84R9J95L18M6j68k62RO5J84j00l1k72r6K48J02q1l38KQ3J09K28J88
2247B89k04j66N2K22Q4Q2j52l43K00R6O5q1l32r4j32K86J22J31l73q9J37K40K20
2270B60j1j31j18k1J38K29j95m1l25J10Q6J90j79k08J9j41K02J73L1j67k0r9L16
2293I8J13o3j7q0L5K8LO3k91j25P6J92N9j78j7n5J06N2J12p3n8j82J04K13J99
$$ y = [-114, 148, 250, -185, -246, -130, 184, 339, 284, 102, -119, 25, 217, 217, 188, 0, -252, -306, -27, 5, -73, -216, -159, -237, -99, 204, 204, -46, -86, -27, 114, 366, 335, -7, -190, 26, 212, 212, 46, -165, -279, -204, -35, 91, -8, -173, -303, -109, 9, 190, 244, -17, -116, -10, 162, 329, 150, -17, -359, -196, 146, 85, -147, -263, -271, -268, -49, 103, -53, -214, -270, 62, 199, 286, 235, 5, -93, 12, 221, 342, 263, -74, -252, -64, 200, 147, -162, -271, -278, -85, -56, 148, 145, -239, -140, 55, 373, 419, 251, -11, -2, 63, 247, 147, 116, -156, -252, -4, 98, 17, -321, -319, -236, -127, 101, 289, 85, -81, -29, 193, 277, 359, 207, -136, 64, 160, 225, 144, -188, -282, -414, -128, -6, 125, -248, -337, -200, 40, 260, 249, 118, 0, -21, 117, 346, 151, 110, -215, -105, -19, 171, -8, -216, -197, -338, -136, 37, 68, -99, -119, -218, 98, 211, 148, 131, 51, 86, 114, 117, 180, -111, -236, -160, 32, 91, -87, -104, -159, -53, -1, 111, 38, -20, -202, -98, 115, 314]
2318C14p6j70j00O0J03j3r3p3j42L2J85M4n5k27l0Q6K28oJ48r4j77j2K52J32j70
2343A46j71j49P1K39J2k37j27M1J6L7K22j31j55k8Q2J85K04k04o4p1N5K15Q8m1
2367B35l07r1J47J01N3j75l28J28J48J13j5k2j08o4J25K14J19k17n6J9N9J3N3
2390A44j49j34O6J9M7J25k04j45N8M6J22l7k3j2O5R6J76q2j08p1ln3K90j76k2
2415C5k30R7kJ96qk45M5j54L00kr8L8MR3J58Rk8j58j66L5J79j09N5j28j19L1J20
2442e2P5l7o8p9O5J33K74k58l6l2J22K1J38r4j01j63m9J48R3j77p1j54J35J92
2466B5l1Pk8n4m4J97J14j06j00kj0O0J57j52m8j64P0J32M9j60k0j00O0J98J65
2491B15j64j60m7J21K10M1kk79J03j8M5K0r5m9o9r0J37J27k02jJ18l1J25J49j82
$$ y = [314, 238, 68, -32, 28, 131, 118, 25, -48, -190, -158, 27, 71, 16, -211, -241, -155, 73, 67, 215, 121, -56, -68, 184, 316, 146, -25, -174, -103, 136, 148, -89, -216, -175, -159, -122, 100, -31, -186, -214, -132, 53, 257, 53, -11, -82, -27, 188, 276, 235, -72, -163, -16, 85, 138, -37, -365, -237, -89, 24, 9, -13, -121, -185, -60, 154, 273, 56, 0, 19, 78, 91, 144, -5, -139, -73, -54, -7, 118, -86, -231, -173, -127, -5, -42, -65, -77, -12, 84, 260, 178, 70, -1, -4, -57, 233, 57, 35, -195, -98, -100, 96, 88, -157, -112, -266, 34, 32, -66, -28, -24, 69, 227, 236, 208, 50, -116, -81, 98, -11, 44, -84, -203, -172, -52, 23, -14, -82, -161, -96, 37, 311, 53, 17, -15, 107, 128, 266, 172, 71, -92, -141, 7, 100, -77, -148, -302, -167, 25, -6, 1, -27, -81, -125, 72, 186, 80, -20, -22, -32, 28, 185, 33, -15, -179, -109, 23, 72, -88, -108, -208, -148, 50, 215, 51, -109, -156, -35, 175, 216, 214, -65, 38, 20, 65, 85, -10, -59, -128, -218, -81, 46, -156, -157, -39, -70, 55, 204, 22]
2516B2m5M1Q8o9N7M5j65n1J38L5l8j50n3O8j49L00l9r5p5R2P3K8K40k08j71M8
2542c3K87m8N2j57r7j37J58L5Mj72j4K2QK02n3j10oJ66j12O7Q2n0j75m6K32n5
2568E0J4o9n0o4m4J42R8j44j84R3K05J64r2j54K3K3R8O1Rj07j41L3Q8J33j35j19
2594f9m3m6M7K36j96O3k31L7J82K8N2m0o9O1J54M9j43n5kq0P0J22n0k70m2L1J37
2621f7K45k01j33J02N3l7N8J67j69l0J10K9l2J1j7l7j80n7K11o9j14N4k1J95M0
2646A11j37m8o4K08M0L0lo1p3k1Q6j25L1Jj39K02k7k2J44j99J1k6J98j02Mj84
2672a65J51M3K82k02k9Qj19P9j3P4j51n9r2J05%N8r5m3n4J68J36l4Ql6K0L3R5
2699A68mk12k9J24j24Q3J8Rj66p8J57K2P8oj33lK00k6jnj30jJ57J13j18m6j42
$$ y = [22, -23, 18, 106, 37, 94, 139, -26, -77, 61, 96, 58, -92, -145, -77, -226, 74, 35, -60, -135, -43, 30, 58, 298, 90, -81, -33, 254, 206, 258, 101, 4, -133, 25, 60, 64, -108, -122, -100, -92, 110, 57, -53, -59, 107, -5, 62, 144, 94, -81, -127, 105, 50, 64, -5, -55, -119, -163, -21, 77, -67, -251, -158, 47, 211, 119, -35, -12, 11, 109, 170, 179, 72, -69, -36, 52, 185, 50, -69, -112, -158, -111, 125, -71, -8, -239, -202, -20, 8, 60, 20, -49, 12, 166, 215, 72, 17, 15, -65, 5, 127, 77, -193, -235, -204, -67, 178, -23, -156, -54, -1, -38, 20, 187, 18, -12, 98, 127, 95, 106, 89, 52, -128, -185, 26, -43, -157, -103, -124, 71, 111, -26, -74, -138, 70, 110, 140, 137, 76, 3, -18, 68, -57, -26, -25, -164, 38, 11, -11, 133, -66, -55, -81, 117, 15, 19, -165, -14, 29, 311, 109, 80, 88, -31, 48, 35, 109, -42, -101, -193, -88, -88, -30, -125, -168, -222, -54, 82, 48, 56, 20, 40, 73, 168, 164, -48, -77, 47, -77, 6, 24, 33, -133, -211, -54, -32, 46, 40, -93, -96, 104, 78, 77, 72, -58, -59, 98, 211, 93, 47, -95]
2726i5n4J37NO1j8j36q8J54J33r5M3k8j16J94J37j21j56J9l1J00R8p0j28m6K2
2751g9O2J24j37Oj01N4j7K64j08j2n4L5J32L1m8j06o0j5N7j8N1j01m2q9K58j19
2777c2N3Nm2j09Q2M0k0PP5j04J62N6o7j78N3L8j49K37j21m9k6o8K22L4j62Nn1
2804a09J20Q0k8m0j2qJ30j61J03j32j8k1J34k3n2qm1r6lJ67QJ24j34Q4OJ02j0
2831A62m8r6l9J2k2j6O3m3n1l8K35j20n4nk1K9J6J08l9nj07J51M0P5j31j30K0
2858e4J47j05n1J26j38j7r3J74N6j27J9m3J25J06j11Oo4N4j39K26k1q8l5N9K7
2883C9m6R6q5O0j08j9j5N5Nn2P5J10M6r7o6n8N2l3J05o7k8l6OOJ11j20l3NN1K
2913c9O9L9O1j96P4M8M7l2p2nJ1K6P4p3M5j57l6j6P8l5j33R9L4O2J67j16j01R9
$$ y = [-95, -149, -12, -7, 54, 36, -100, -188, -34, 99, 4, 47, 19, -97, 97, 234, 113, -43, -24, -55, 45, 143, 73, -55, -101, -79, -17, 107, -30, -24, -125, -71, -88, 176, 68, 56, 2, 37, 169, 200, 152, 46, -14, -29, 28, 10, 61, -40, -82, -171, 87, -32, 21, 26, -16, -125, -43, -3, -23, -16, 59, -45, 117, 173, 106, -72, -19, 19, -130, 107, -14, -63, -89, -157, 65, 99, -63, -58, -109, 11, 91, 63, 23, 11, 3, 133, -28, 75, -57, -75, -96, 38, 15, -37, -45, -86, -182, -185, -18, -10, 114, -20, 64, 70, 172, 162, 114, 18, -21, -9, -31, -47, 16, -27, -78, -116, 119, -1, -55, -60, -81, -52, -36, 72, 33, 28, -79, 72, 112, 187, 56, -74, -54, 93, -12, -63, 63, -75, -92, -185, -11, 45, -82, -63, -106, 19, 125, 14, 20, -44, 10, -129, 97, 76, -12, -47, 12, 39, -7, 89, 4, 64, -44, -63, -78, -23, -18, -70, 5, 115, 161, 64, -2, -60, -8, -41, 64, -3, -31, -67, -61, -55, 56, -64, -97, -92, -41, -39, 30, 69, 130, -66, 8, 56, 103, 71, -1, -6, 5, 31, 105, 32, 77, -80, -116, -132, -54, -89, -222, -123, -89, -27, 140, 24, -77, 22]
2941B2l5Q6L8o6p1m6j5J12nN2j33Nj72K25Jo0L6mK2K9j2J03j46r5J57O8J08j75
2969B9p9l1J12n6j0Plj24J36Kp4L8J0J0J2N6P4Q9j53N4k37J81J51j72p7J32j03
2996b6J1j9J4%j74J29O9Q6l4j27o8J10R2R6r4k0q2n6P7J18r3n2j14R9N3J7q8M9
3024b7o7N5N3J3P1j84Q3J03qn5P5j83O7N6J8r0lj0JM0n6L8L5J4j11J06K4k1r4
3053e7J29o5m7L0J07k7mj27m1J57j44K5o1%J63r2J49j38O0o5O8J94q8q5n0m3Q3
3080C1Q7l0j46l6k9J67n4Q6j01P8l3p4J02j19P6l4J6N8L7K9kk16J05J25o1j02
3106d0K7n4q1O0LJ17q2k0M9j6J96j68R2q8Q3M0JK6j09j06jjJ10j8l4qJ15j48R2
3135C7j5p2MQ5r3J31J8q3n3R8M0q8L1Mj9R4j37K5J1j46m7M3M7J32j53M1m4J69
$$ y = [22, -13, 73, 111, 45, -26, -72, -87, 25, 20, 72, -61, -56, -228, -3, -2, -62, -26, -30, -8, 21, 9, 112, -34, -129, 28, 96, 204, 29, -50, -81, 31, -25, -35, -28, -31, -155, -19, -17, -91, -53, -43, -33, -21, 35, 109, 198, 45, 99, -138, 43, 194, 22, -55, 77, -26, -15, -34, -20, -20, -194, -65, 4, 90, 56, -71, -139, -29, 63, 159, 65, 45, -37, -93, -16, 102, 9, -43, -157, -58, -5, 12, -76, -27, -94, -39, 14, 27, 98, -86, -3, 100, 92, 37, 112, -71, -4, 52, 70, -20, -23, -33, -32, 8, -48, -10, 25, 39, -72, 34, 58, 37, -57, 72, 7, -40, -10, 97, 70, 66, -61, -102, 55, -89, -64, -125, -125, 38, -54, 95, -43, 17, -48, 20, 214, 126, 41, -9, -52, 31, 118, 88, -58, -94, -123, 44, -10, 76, -25, 53, 20, -54, 48, -71, 5, -29, -13, 45, 82, 111, 109, -107, -2, 123, 62, -40, -13, -67, -148, -88, -85, 32, -50, -70, -21, -37, 159, -9, 83, -5, 78, 118, 119, 145, 36, -70, -71, -72, 38, 20, -14, -22, 93, -55, 37, 22, -50, -46, 39, -54, 77, 95, 12, -41, 57, 97, 9, 40, 44, 25, 119, -18, 7, 18, -128, -175, -132, -85, 47, -106, -65, -109, 60]
3163F0O9k5l5p2m0J32J13j39n5j94P6O2J86k79J20nk9J37n8j31R6k3N2P4rO0q7
3190E6j29J01m8R0j69L7rO2n2N1j31J03K9p5P8J30l6j02j5K0K5n2J78j42Nq8P4
3217iJ29M7k54J3J03n2Kj05N3M1K7J15oj26KM0m3N4l4n5Q5j33J84j82J99r8j44
3244a47LKJ71l2Nm8nN1N0m8J12o9m0N6M9q4Pr3k59L05m4j1J01L6p9M8J1j28J46
3273F6j00J03n5k8R6j23P0l1k1K2O8n0m7j5M8N6m9p4j43R6J93o7L6nNj32J18J02
3301A39p9K8j9r8N1K6o2Nj11j9mK65j24J7j5q1J81Joj27J26q0M0n0P7j05j81J27
3329g8R8J5k05J44J7j21J9OR3m4kR1l4L9J86k20l5o6L8Q8J9m3j59K01l6L3o4k5
3357d5Q5k6k9O1Q9k13J80m8j3qN2j38N3RJ2O9j18m9l4L5O1P0k2p1k6P8K9MJ14
$$ y = [60, 129, 104, 69, -3, -43, 89, 202, 63, 8, -186, -110, -48, 138, -141, -21, -26, -55, 82, 24, -107, -11, -34, 18, 92, 83, 143, 56, -73, 28, -20, 70, -99, -62, -71, -9, -61, -10, -141, -38, -9, -84, -6, 124, 88, -14, -29, -9, 16, -36, 142, 0, 5, -83, -9, 120, 167, -87, -74, 29, -23, -21, -126, -73, -32, -5, 110, 104, -22, -20, 20, -23, 31, -3, -58, 27, -106, 78, -104, 95, -3, -147, -144, -142, 29, -3, 2, -46, -51, 0, 50, 2, 114, 45, 5, 61, 110, 26, 33, -60, -319, -14, -58, -69, 32, 68, -11, 37, 48, -80, 66, -34, 69, 14, -14, 82, -41, 29, -2, -23, -1, 67, 17, -30, -45, 3, 59, 10, -64, -207, -111, 82, 15, 51, 46, 51, -81, 37, 139, 60, 88, 69, -29, 22, 48, -14, -9, -120, -139, -143, 122, -2, 15, 0, -81, 100, 101, 95, -32, 94, 14, 54, 4, 81, -24, -205, -78, 20, 35, -170, -26, -9, -130, -111, -105, -12, -56, -58, 33, -1, 38, 224, 4, -31, -97, -59, 29, 48, 5, -154, 47, 11, 44, -20, -45, 40, 14, -15, 46, 135, -78, 102, 54, 41, 33, 85, -53, 0, 9, 21, 90, -28, -77, -111, -76, -15, 55, 33, -38, -64, 14, 43, 47, 161]
3386A61j70L0o1Q2k5j1N0j79N4k8R1m1J43j74%R3j24J03m0L7pMR5p4R9j82R4j2
3414Hk1J12q4j42J21j12J67M2j39N3q9L1M7R0j97M4J13J2M1J3j41jJ13j3n9O9
3440G8p1j42K12j05KQKj24O0R2Q6o4k7L5j63J77ML9k25J71q7k4J5J2p1P5k3m8
3468a06J57J11k18J18m5M8k0l4R9r7o0J75p3k7jp1j07J33m3JJ5j8L6m3P5J8m5
3495b2K6o7J73j05qM4j5Jm6P8j81M6P6k7k6m1J07o2N1j5l1N0L6J0r3p2J86qJ4
3524G9J09j52j5mm0o8J34j20O3M1r7J1J31j04L4N9k0N3r9m1J86J0j03qj12Q6%
3551A3k2J40k46Q8q7R5O5Kj65j9J23lN8Jm4j16R8OK7KQ0j44o6R1M7r2L9O4q3P3
3581B5k4J46k34J01j6J41q3M7j36l2R2m0R2q1J19j87J01LJ6l7k7L3j44J81K8j09
$$ y = [161, -9, 21, -40, 42, 17, 6, 56, -123, -69, -97, -6, -47, 96, -78, -78, 15, -109, -6, -46, -9, -16, -12, 83, 9, 108, -74, 20, 8, -13, 99, 15, -127, -6, -118, 49, 91, -48, 5, -84, -53, -6, 84, -113, -69, 44, 56, 97, 110, -31, -32, 81, 68, 9, 78, 7, -135, 77, -28, -26, -18, -16, -140, -80, 12, 98, 34, 7, 42, -121, 56, 60, 99, -126, 45, -42, -66, -51, -39, -110, -35, -58, -106, 51, 162, -56, 62, 17, 65, 45, 11, 110, 13, -47, 128, 55, 28, 27, -44, -151, -18, -61, -60, -45, -63, -27, -70, 5, 23, -22, 4, -63, 110, 5, -3, 41, 26, 27, -19, 59, -122, -76, 0, -27, -53, -94, 13, -49, 2, -13, -44, 6, 42, 52, -41, -113, 73, 65, 79, 188, 36, 21, 17, -23, -91, 43, -77, -14, 27, -70, -59, 72, -32, 2, 61, 41, 94, -5, -46, 140, 150, 47, 39, -73, 13, 13, -9, 131, -115, -27, -114, -19, 46, 48, -117, -136, -13, -16, 42, 43, -1, -117, -19, -13, 14, 16, 96, -48, -114, -23, 24, -68, -29, 35, -48, 25, 1, 147, -87, 14, -2, 139, 56, 103, -33, -65, 27, -13, 79, -2, 117, -70, 31, 34, 50, 13, -14, 19, -125, 56, 84, -25]
3607b5nN6nN8Lk9o7M6p1O0j0j03J56q3j48J81j2j05J06L7p1PL3j22O3P0J19j92
3635e3J31lj25r3M9J96l6n1j9q7PJ69r5J0l0P6k8l1K7l8J06j3j13R9m7n2M5q1
3663h0J8M5N0j12P9Oo4MJ59j25K2J24j16J1R9n7j51J06M6j16J06j71J81j09jP0
3689B4N4j88J10l9J0j1N1O0m5m7O8o2N5Rj52J17J21j01j3m2M6J7Qjr9N2q1K8K
3718d9J46q6O7l8J3j20J9J63n8j56J84j23J28k02Q8K3p0K4O3p2P9J7q5Q7q2J66
3744A26l8q6K1o3J9O6N1j80J18k3J9m8n6P6j9LJ7Pj33P7pJ44o9l9L0L4J12j32
3772B7J2K5J8j96J46q0RR1j02pm8K28m8o4j31O9N4N8l7r2K05r6j0K7n7n6K5mQ
3801b6l1J4M8M6l4n3O5j12J56j50Q0nKL8j3j52J27j1L1q2P5q1N8p5l3P4J31l1
$$ y = [-25, -30, 26, 21, 79, 82, 53, -14, 32, -39, 21, 11, -92, 64, -19, -167, 14, 2, -103, 3, 40, -31, -24, 9, -113, -50, 20, 139, -53, 78, 75, -50, -143, -94, 102, 66, 15, -4, -91, -84, 85, -10, 0, -30, 46, 18, -13, 14, -24, 82, 69, -44, 55, 8, -44, 1, -80, -62, -17, 33, -79, 0, 6, -58, -54, 105, -20, 2, 126, 10, 21, 120, 63, -88, 18, 64, -52, 54, -117, 64, -45, -46, 24, 78, -110, 0, -39, -29, -40, 11, 71, 26, -21, 47, -15, 40, 49, -103, 14, 135, 34, 21, -21, 25, 42, 50, 49, -50, 2, -79, -51, -49, 97, 11, 78, 40, 53, -67, -48, 115, 57, -99, 85, -38, 90, -112, -24, -1, -71, -47, 16, -56, 23, 40, -45, 42, -40, 126, 88, 2, 23, -40, -21, 45, 96, -84, 34, 11, 30, -18, -74, 2, -17, -14, 3, 10, -123, -46, -53, 91, 22, -17, 13, 47, 159, 27, 39, 64, 82, -114, 32, -48, -39, 52, -50, -57, -105, 123, 75, 11, -120, -51, 3, 61, 24, -68, 137, 41, 31, 58, 1, -55, -30, -34, -26, -57, -43, 5, 51, 17, -36, 29, -83, 73, -77, 3, -2, 0, 38, 25, -127, 0, -11, 20, -62, 13, -68, -10, -85, -118, -44, 87, 56]
3829E6l9M1Ln9P2p0qN0Rj0j18L4O0o2M1M3n1L7j55J01R6n2r2J3J7J05l5O1qj18
3859c8M0ppK2j00KJ49o4q7O1K0K2q6J88o6o4P0n2J1K0Q1o0j24N7J39k75J42O3
3887E7j50P7k9J55j44r1k9J36Oo7J01j9n5J21M8j72J55o1j30P1L7j33J82p0n4
3912e8J0O4L1o9Nm8J37r0J34k7p5J07j04O9n4k9K8k2j0J4m5oL2k1kJ9Q3j3m8L3
3942D5O3k1l4n2N3j40J23j16J62n1l8RJ01j23J0O6r1K9n7J17m2j31K48r9n5N5
3968C1M6K6m0j22Q2q6J38n7L1o7j33K32j13Q3r8N1r0J20Q0j54n2J90q1J5M9q8
3994gL3K7N4l4r7n4M0K8k2P9L0o6M1n5M2l3L7m0L1j04J07n7Q0r9M1K9j74K14r5
4023b4O9j25Q5o2Q7O1j54L3K6ll6J62j99J59q0k1%J07j20J27j45J9K8l1O1j20
$$ y = [56, 17, 58, 61, 2, 74, 4, -4, 46, 55, 45, -73, -39, 21, -41, 0, 43, -8, 29, -126, -25, 71, 19, -73, -60, -43, 62, 27, 88, 80, -38, 2, -5, -12, 10, -90, -88, 61, -3, -90, -29, -9, 13, -73, 115, 49, -15, 55, 3, 14, 34, 115, 55, -69, -12, 127, -148, -6, 57, -93, -16, -45, 110, -34, -125, -154, -18, -12, -79, 22, 3, -52, 69, 117, -55, 100, 39, -91, -20, 17, -116, 66, -4, -58, -48, 16, 47, -22, -17, -65, 72, -18, 116, 89, 14, 121, 17, 86, 32, 3, 31, 9, -1, 13, -32, -38, -6, -27, -29, -10, 73, 60, 12, 45, 108, 87, 53, 1, 54, -86, 37, -79, 83, 32, -6, 3, 104, -19, -9, 57, -34, -5, -62, 55, 13, -118, 130, 31, -24, 31, 77, 103, 63, -59, 23, -63, 75, 18, 49, -18, -151, 81, -32, 51, -47, 4, -86, 34, 114, -40, -92, 98, 17, 32, 81, -7, 26, 53, 107, 73, -24, -78, -38, -10, -32, 47, 77, 11, 52, -3, 39, 6, 43, 3, 34, -70, 37, -20, 60, -39, 2, 31, -143, 71, -24, 45, -80, 5, -57, 30, 91, -63, -30, -4, -7, -43, 119, -80, 79, -1, -22, -22, 85, -35, 92, -53, -34, -6, -37, 24, -96]
4049i6O2J03l7j04J19m2M2j65L5J57K5m2j11m2J10l5kJ4M0o5Q7Jo5M6j8J9o4J12
4077H4r0l7O7R8j16M7q7J06%j68R8P5j16l9P7k1oj21J39L8R7j46J7j0Q4rMq4Q
4106a1N0j67Q2O9r7Q6K9m7l0RN9r2J45j62O6L4K5p0J54j06l4n7J5J21j19o1N8
4133e1M7M4Jn4k4o3J32n5K9p6N5K1r3R4j12J58l8Kk1K1L7k17J02Q2n7J7N0K7o4
4162fr3J68r8P8j11N9J15n4p7J10q0j8J24j03L6Q6j23j02Q3j01K21n8n6L4qJ8
4188D4O3r8kN3j06J19j08k4J26oq6Q0j91J49p8RM1M8n7l1R2ll7k0R2pr3R5k3M
4218D5j00J42o7l8qMN4k2n1o1M8l2L5K4J73k03m6JJ06L6q0J43j72J25q5N1Kl4
4246a0r6J31j28Q2l8N5O1m2K3q3J5J5r6Q9J62n7j15J3m7JQ5L5n0m3J29j76n9K01
$$ y = [-96, -34, 69, 32, -72, 47, 5, 47, -118, -83, 74, 99, 57, -54, -96, 14, -21, -23, -9, 31, -34, 53, 54, -11, 35, 17, 36, -28, 84, -6, -43, 24, 122, 6, 53, -34, 72, 72, -96, 2, 77, -39, -78, -1, -22, -28, -149, -10, 28, 125, -21, -4, -14, 70, 61, 65, -19, -11, 39, -128, -46, 23, -74, 12, 41, -6, -36, -27, 32, -60, 85, -77, -11, 23, 48, -22, 132, 26, -8, -65, -50, 71, -48, -109, -51, -4, 40, 41, -13, -37, -100, 32, -23, 6, -70, -15, 6, -87, 7, -105, 53, 15, 17, -4, 17, 54, -163, -61, 21, -36, -19, 31, 58, -6, -99, 69, -29, 49, -62, -3, 112, 58, -19, 91, 11, -7, 117, 14, 50, 136, 13, -89, -6, -107, 114, 56, 0, 34, 26, 44, 107, 9, 7, 60, -46, 73, -35, -59, 67, 61, -25, 55, -136, 13, -65, -56, -15, 33, -24, -55, 37, 34, -3, -23, 69, 62, -31, 64, 41, 45, -55, 87, 20, -18, -26, -22, 32, 10, -41, -102, -54, -86, -51, -27, 146, -57, -103, -102, 4, 40, -40, 103, -69, 56, -29, 22, 24, -10, -106, 25, -103, -21, -59, -4, 57, 15, 38, -45, -30, -15, -111, -22, 140, 83, -32, -19, -66, -65, 20, 55, 5, -38, 91, -85, -144, 57]
4274E7l5o0P6J6K4p5N1o3lO4K0k6o2J2O9j45J8P8o6P0l7m3L8P1j35M1J7P9k1j1
4304A9q3J16q8Q0NJ9l5J6j25MJ13j05N7J0K1K5LjR4k83K41j60J22j27l2J83j06
4331a7R3n5pq9r1J00O8N2j25Rp0O4J70l4j07J29Rj26J18j18R5on9J7lo6K6K2K9
4360B8qj63J32O0K9j74J05J3Q8n9m1rj12J12q6J08K0l4l1P2j01OpM9L3PlJ3L8
4389H5k02J09J15j21j9L9m4k0J41j10L2j23O0J58j10j02J40l6J5M5JJ2j18J74
4413A21j11L5j2N3j1j17k8N2p8L0P9Qq2j7J1K2p0P4P6n9M5q4l6J37Kqkm8J28j66
4443e6QK6j2J18j64QN4J4P5l1j2J3M6j53P5LO0r1o0O1R1j41k0J30k0J02j15N9
4471F8Lk5m7M7n2j7j4m7P4K2p5O2LN4j18J04N0mk28J13qk9O9J2N7n6mj54R8N3
$$ y = [57, 22, -38, 38, 54, 78, 3, 54, -9, -12, 52, 72, 46, -16, -4, 65, -80, -62, 16, -50, 20, -17, -60, -22, 49, -86, -45, -28, 51, 30, 19, -64, 52, -36, 44, 49, 68, 33, 49, -76, -72, 41, -64, -7, 3, 24, 49, 52, 51, 145, -138, 103, -57, 65, -62, -94, 89, -17, 76, 21, 14, -75, -166, -66, 2, 54, -71, -62, -132, -68, 102, 68, -39, 90, 99, -27, 91, -27, 68, 62, 3, 20, 17, -49, -23, -1, 28, 20, -143, -11, 49, 78, -96, 9, 22, 110, 51, 10, 1, -111, 1, -85, 23, 43, 9, -22, 50, -51, -45, -52, -3, 30, 37, 34, 47, 85, -117, -8, 107, -14, -33, 6, -38, -58, 83, -27, 5, -118, -58, 100, -10, -112, 28, -8, 7, 52, 53, 65, -53, 121, 10, 45, 33, 86, 75, -42, -70, -18, -96, -66, 13, 21, -61, -78, -67, -45, -115, -41, 35, -24, 21, -63, -99, 38, 40, 32, 30, -18, 110, -56, -48, -22, -34, 84, -80, -72, -18, -4, 71, 40, 28, 41, 87, -66, 9, 12, 72, -19, -79, -18, 73, -68, -88, 42, 22, 124, 9, 68, 71, 46, -1, 46, -6, -23, -37, -84, -10, 12, -63, -1, 2, 56, -62, 42, 92, 88, -140, -27, -35, -64, 5, 17, 74, 18, 14, -140, -42, 11]
4501A1N7k9j8j5M0l2NK5r7K7KQ6q2Oq3K7J3L1R2m7r5J15J1n8K5J32k12j9O8n8
4531g2OP3m9NJ40q2j3m1j1J62j71L0o6O8R3j01J8k3k3J30l4q0n3J00m9l6l6J20
4559Ek9%M3j1O1p5k3J9kO9m0K6L1K3q1k4j12J88o8q2R9j19N8o4K8P5N2q3R9o4
4589ak5n0J50j08P9j8l7K6JJ1L4r8J03o4QK4j6j74J43J8K9Nk8J5j17J26q4J4m9
4618h3J71r0j7J00k9l1K1o3O5p9M7m8l8M1L3r8O0j5J23jln8j33N5N2J4l2M3mm9
4648d6k2Q2J7J7j04MJ10o4k1L2l1L9n4L1k6R7j46J02mk6r4J24K4l0O6k4m9k7J1
4677a2pMJ47rr0j8j3M9Ll3L0J3q6o2Q0MN3r6j7n6N1O7r7M5J03n0P9n0L2p7qL2
4709A1L0q0Q4k1n3n7R8N7l5J51j93m4ML7J16j41Q5n3J25r0K7p2o1O5Nq5L7J34
$$ y = [11, 68, 39, 21, 6, 46, 14, 19, 44, -53, -26, -24, 62, -20, -14, -97, -70, -57, -26, 66, 19, -76, 39, 50, -8, 17, 149, -63, -82, -14, -72, -66, 7, -42, -37, 103, 21, 8, -33, -44, 118, -53, -23, -89, -21, 72, -29, -11, -34, -57, 73, 39, -41, -94, 6, -43, -79, -115, 5, -24, -24, 19, 8, 69, -6, -29, -10, -12, 57, 17, 43, 74, 97, 16, -8, -120, 68, 0, -82, 17, -102, -44, -108, -80, -5, 47, -36, 63, -1, -26, -76, 74, -34, 45, 27, -10, 16, 17, 28, 62, -36, 67, 3, 11, 35, 19, -155, -12, 6, 35, 40, 12, 27, -90, 36, -48, -34, -83, 88, -2, -19, 81, 52, 21, 42, -21, 44, -35, 12, -36, -74, -33, 0, -98, -38, -53, 70, 69, 66, 8, -125, -70, -18, -4, -36, 7, 3, -46, -68, 14, 31, 48, -56, -52, 58, -6, -27, 5, -26, 13, -41, -10, -36, 61, -85, 17, 13, -13, -107, 17, 41, 11, 77, 53, 4, -23, -12, -19, -15, 132, 123, 33, 15, 2, 51, 54, 21, 51, 64, -22, -84, -4, 0, 53, -43, -60, -116, -65, 2, -95, -50, 53, 3, 82, 32, 64, -13, -21, 11, 41, -39, 45, 24, -29, -86, 12, 69, 34, 185, -8, -52, -48, -11, 105, -36, 49, -4, 121, 31, 58, -14, -75, -10, -5, -90, -53, 81]
4737H1k00Q3Q1k2r8O7l0J56r7m6J17j04%O1m3k9j1j2Q2m7j4o5N3l0J09k7K0l6
4765an6R2r1J01j55J4R7L4K9J2q1L3l5r9J53j07N8m6l2O0J7J8m9OkN4k3L2kN3
4795H4n6J2j00J07L8q3L9q7Q3j48O2o7Q7lR4q6M0K5N1m0n3M9p8J36j01j09J8M7
4823c9N1l4K5j1J09n8m4J2M8j26N0J00j79O8O6m2L9k1r1j1R4J25p2j19P4p8N5
4850iJ21p2j21J11N1j92J62N6j14N0j0p7O1MMm8K4j4qm4M9LN5j51J76j30J9P5
4878C1j8L8j0Kj9o4K4oo0J75j10J48o4Qp2J6m9j07J93jj72J18j2J7p4J29l9K5
4906D7o6J9J9k3L6o5J7J01p5p2J14m9j30PK5QP3j3pO4j04M9J22Lm7l4nK1n1j0
4936b6l2j03J73MQ1j90M5L1k7J10q6N3j2J7p9R5k5j13Nj00J24QJ02Mj11L1lJ94
$$ y = [81, -119, -36, 45, 23, -75, -8, -38, 118, 21, -25, 92, -12, -12, 49, 6, -23, -34, -46, 36, -11, -25, -90, -37, -67, 42, 15, 35, -1, -57, 35, -56, 45, -110, -96, 1, 35, 64, 76, -5, 28, -7, -106, 47, -60, -2, -48, -80, -20, -3, 15, -34, -28, -30, 24, 1, 33, 31, 84, 28, 40, -60, 47, 85, 2, 41, -46, 37, -111, -49, -116, -29, -32, 62, -24, 16, 41, 92, 52, -1, 48, -30, 106, 5, -104, -86, -39, 12, -22, 3, -8, 101, 43, -1, 11, 59, -67, -17, 83, -96, -28, 38, -4, 35, 14, -77, -88, 6, 131, 59, -60, 14, -64, -9, 112, 40, -81, 30, 81, -111, 51, 107, -7, 43, 33, -44, 17, 21, 25, -23, 1, -13, -21, -65, -16, -13, 42, -109, 67, -63, -44, 31, 13, 51, 41, 43, 24, -40, -16, -22, -82, 93, -17, 131, 67, 75, 3, 19, -30, -137, 56, 55, -117, 1, -11, 6, -68, 61, 22, 47, -19, 0, 19, -4, 32, -33, -16, 85, 10, -62, 52, 3, -127, -120, -95, -87, -14, -27, -34, 30, -74, -25, 97, 100, 53, 19, 14, 35, -16, -26, -58, -161, 12, 16, 97, -93, -48, -17, -44, 66, -20, 33, 21, 38, -41, 54, 29, -84, -79, -179, -55, -47, 55, 59, -52, -21, -24, 170]
4964A70p3k1o0j4q1L9L2Q0l1M1j41J06q1O0k0j24P1O2n5qP9o6N4n9n0J64j10M6
4992A0k4llo2J74o5q2J16j08Q3p5J45o6j14o5J13q2L9K0K49k08m9M8l5Q0j01k1
5019h6oJ11Oj31N0j1n5J17K2O2j17LN5j0o5J0N9j21J76n0J01j31J15j11K4p5R7
5046C9l5j98J33JJ32p3P2m4j6K9j54J59O1j86l5R6L6L4l4%q5qL3j7j4p8K48r0
5074Fo0J25j4j66P2L5K2m3M5Mj6n2N7pJ8j2o6M0Ok2n6J33o5L8q0O7l1P1o0j9O1
5105C1n7l2J74j28R9q1N5J40k89J15j38K03j06LN3M8j1j40K5M1P4j84PJ90j08
5130a6m6O3K5q4J21j76K13o7j10RJ56j38l0J42j02P8MQm4mN2n0K2j0qk5O2K7j01
5159b9q5R6R2q1j4M4j6n1k1J87M2j56R9j13j6k3n2P3M8K0J0j02N2J9n7L7j27N5
$$ y = [170, 97, 76, 16, 2, -79, -40, -8, 72, 41, 82, -59, 47, -34, 26, 6, -118, -47, 15, -40, -48, 31, -35, 19, -40, -90, 74, -36, 10, -14, -17, -20, -82, 92, 27, -55, 61, -47, 36, -39, 106, 40, -74, -139, -26, -108, -69, -49, 200, -8, -57, -9, -44, 36, -65, -86, -92, 19, 25, -106, -56, -67, -122, -5, 17, 79, -38, -35, 20, 10, -55, -45, 14, -107, 69, 19, 120, -11, 104, -7, 17, -58, 39, 4, -194, -61, -60, 72, -1, 71, 27, 11, 40, -114, 45, 106, -80, -115, -19, 17, 51, 17, 17, -68, -76, -43, -60, -74, -152, 96, 6, -54, 71, 57, -109, -37, -2, 20, -23, 22, 26, 10, -42, 15, 8, 26, 14, -52, -12, -6, -28, -84, 49, -16, 22, -58, 9, -22, 49, -11, -30, 31, -26, -58, 116, -12, 87, 6, 61, 201, -88, 27, -111, 92, -14, -11, 42, 90, 79, -61, -36, 5, 79, -105, -98, 92, -16, -62, 1, 26, -58, 63, -113, 100, 33, -77, -68, 88, -50, -80, 62, -40, 38, 42, 50, 6, 2, 54, 4, 26, 16, 8, -17, 45, 72, -29, -114, -18, 74, -7, -21, 23, 7, -44, -65, 122, 164, 8, 107, -6, -22, -45, -97, -24, 24, 44, 54, -48, 4, 23, -34, 3, -124, -69]
5187f9L7P5j2n3J9P0j17L3J07l5n7k8k3j2Q7n3P7r0q4R9J18j49K5N0q4j16J88
5214Cj35O3N3N0j6Q0q6l3Jr3J07O3p0K4k3m8J21l8nJ0M5j10P8p2j4R7j12l2J51
5243E9l0m9qJ1k2m9M9Q9j09O1j4j03J75j05m0J28k9N9j5j56R1O5q1O0k4n6l2J27
5271E2p9LK0mk5J44j04m6J27k46J54L3L3M1k23R1k2J03j6n1Q9n5o4J78j49J25
5297A09j21O1M7j40J06r0O9j38L4lJ2J3M8%P7j17J12j78J23l9K8q3p4J65N8o5
5323A4m5N6N5n2pL4r2Q7j06M4n8Q2n6K9N7j31J28J2k0r1M0O9r6J07j13M3k2N8
5351B6M4P5n4m8j0l2m9R5l6K0J4m2j2Pk8l0O8%K5r5J01L8p2P4j7J1j83O9N0j05
5381i6J29o5m5J17n0N8N3n9k3K3%r4J22j39j1P3J08j1j0k7L3j63Q9J9n1n8O9k0
$$ y = [-69, -32, 43, 31, -22, -3, 67, -50, -17, 90, 55, -2, -30, -53, -65, 22, -31, 46, -44, -128, -29, 89, -60, -35, 15, -69, -185, 3, -132, -69, -16, 34, 18, 98, 12, -21, -20, -113, -6, 57, -13, 11, -12, -60, 61, 23, 18, 28, 73, -37, 41, -31, -45, 52, -60, -92, 59, 29, -20, -28, -17, -39, -88, -39, 50, -59, 2, -12, -115, 60, -45, -85, 43, 14, 73, 58, -98, -7, 58, -23, 37, 13, -43, -75, 52, -27, -24, -4, -8, -33, 111, 7, -39, 88, -158, -4, 29, 62, 103, -120, -29, -51, 52, 36, -15, 74, 19, -45, 133, -16, 109, -12, 49, 96, -44, 62, -28, 41, -97, -63, -66, -54, -41, 7, 7, 84, -33, 79, -99, 24, -15, 13, -70, -144, 21, 79, 14, -31, 25, 80, 28, 21, 55, -37, 50, -56, -12, -70, 12, -44, -15, 42, -89, 39, 51, 31, -60, -20, 49, -47, 60, -53, -10, -32, 26, 70, 145, 91, 43, 33, 1, -48, 47, 11, 31, 45, 3, -9, -2, -30, -60, 8, 8, 33, -62, 39, 77, 5, 79, 62, 73, -110, -41, 9, -96, 33, -32, -77, 40, -10, 48, 101, 42, 19, 42, 42, -52, 70, -69, -80, -7, 101, 90, 80, 53, 86, -77, 12, 31, -20, -78, -9, -29]
5409b9j4j2mJ13J0k6q0J19j92J37P2j13M8j0m9J69k19N8m4J48j26J45p3q7J08
5434D9O6j94J58o3j01R0n0O7l2n0P0O1k6l9n5J91j15o9j0O8K4j8o9k1l6J73j66
5461i7P0M8j0Lj5P3n6l1M6n0R2KJq6J23k29J9J17J5k2k18J61p1k0J83M2l6j44
5489i0M0J6j0J6J10j97N2M3l4M7RK2m0Q2k2o4J24n5o5K6qP9o3K5k5O2j13N7j04
5518h0O7J9k7N9n4m0M8J11n5j41P7l6K2J16j85J26m6P2K1o3N7j51J37q2n7J47
5544F2k7l7J16j40M6j4J11j42k2J06n8l9k8j3J68j26Q8j3l1m5O6ok5m7M9M5p3
5571b9K1N9j22R4j02O7l8qPJ12k3N0j00n8N4K1j4L2m8J2j9N5j03J14N5j22J43
5598A10Ko7M4j09K7N2l3orm1j18P7kN5p9J44r8JR7q0L8K0j5K3P8k33J65r2Q3j18
$$ y = [-29, -43, -55, -59, 54, 64, 38, -42, 77, -115, 22, 94, -19, 29, 19, -30, 139, -80, -22, -66, 82, -44, 101, 28, -59, 49, 115, -79, 79, 16, -85, 5, -45, 22, -10, -60, 10, 71, 45, 6, -49, 142, 27, -42, -52, 16, 40, 22, -47, -68, -104, 69, -97, -27, 21, 11, 14, -1, 72, 16, -15, 31, -19, 73, 75, 76, -10, 113, -116, -97, 20, 35, 13, -205, -44, -115, -135, 48, 90, 54, -90, -50, -34, -44, -28, 82, -115, -63, -20, -54, -7, 2, 24, -16, 66, 44, -20, 104, 49, -16, 10, 2, 81, 18, 43, 18, 80, -33, 24, -80, -13, 6, -21, 38, -16, -56, -8, 103, 48, -93, -16, -52, -30, 86, -99, 27, -19, 53, 74, 11, 68, -83, 54, -28, -85, 62, 35, -2, 114, -26, 20, 6, 117, -25, -47, 59, 1, -38, -66, -79, 89, -37, 51, 38, 7, -38, 28, 22, -3, -50, -1, 44, -29, -8, 51, -71, 23, -79, -12, -50, -58, -51, 61, 38, 88, -12, -70, -16, 5, -9, 23, -25, -13, -32, 23, -80, 34, 89, -33, 110, 112, 45, 89, -20, 7, 59, 26, 20, 11, -30, -148, -71, -73, -18, -97, 47, -51, -50, 47, -33, 5, 25, 10, 33, 111, -122, 43, -49, 34, -84]
5628h4m1J47l3k4M0k5J55j47J2J05j68J33j69N4J89r9Lm1J05j75j9J08L4K5l8
5653D7j92J19P7p4J7rM7o0l3j4R7o1Q6j26M0o6J34N0j6j07N5No1N8p2R5j02J3
5681e3R9n5M6nm9J5%m2m4M6j7N3N0j0n3N0j94J12L9L3n8J9P0J7j38N1J00n1n6
5710b5N3o4M5O5r3j6M5M9j8r2%M9L8j04J17m9Kj1J3k5N9J8K2q3r4J79j31O2jJ1
5740B1l2J16pq4m8P5mj06PQ8N3j33J7Q4n3j6o1J62q6O6K1j13M0K3L3Kj20P3Q1
5769I9k00J03k8K3k3m0J48m5n4l5J47p1R4M3j88L4M3j19QJ55k26J51L4k4m6M4
5795B7L2k5j23J09q2P2M5j29M2RJ25j63m8J87r5m8J33n7%P9o6k2j1o1J06M3k9
5822E0N4k05J44L3n6L8j96J60Ok4P6n9Mp5n7L1pR3m3Q9r3L2L6o7mR6l5l8L4%K1
$$ y = [-84, -125, 22, -11, -35, 5, -20, 135, -12, 0, 105, -63, 70, -99, -45, 144, 45, 48, 7, 112, -63, -82, 26, 60, 85, 47, -145, -26, 51, -23, -6, -15, 32, -28, -61, -75, 22, -39, 47, -79, -39, -105, 29, 79, 63, -44, 11, 16, -45, 13, -59, 36, -66, -53, 46, -9, 37, 32, -17, -2, -2, -44, -88, -42, -59, -6, 44, 34, -19, 31, -163, -51, -12, 21, -37, -18, 52, 69, -69, -18, 82, 31, -25, 28, -36, 9, 74, -19, -35, 10, 59, 41, -51, -51, -2, 36, -68, 49, 0, 2, -9, 4, -21, 38, 56, 78, -5, -99, 80, -51, 11, 10, 21, -11, 105, 98, 14, -34, 41, 37, -69, -62, 26, 79, -54, -37, 47, -6, -22, -83, 79, -7, 59, 80, -33, 7, 30, 63, 65, -55, 18, 99, -101, 2, -26, -3, -26, -66, 82, 37, -17, -52, 95, 24, 118, 161, -27, 7, 50, -69, -61, 94, -132, 19, 53, 29, -17, 27, 59, 34, -89, 20, -62, 10, 55, -74, -32, -23, 102, -61, -109, 78, -17, -65, 68, 11, 11, 90, 24, 2, -9, -70, 36, 79, 50, 104, -101, 43, 76, 20, 58, -138, 22, 28, 4, 80, 21, 25, -50, -107, -76, -83, 10, -33, 56, -37, -5, 31, -36, -40, 56, 21, -17, 17, 17, 38]
5853C8o8R7j11OJ6Oj11J62o7j3k1R7Lq5R7J29j58j9Q4j28O6k1o4M2p0R7j9M2j3
5882A4p2rM7m0L4R3Rj18J14p8n2N3L7p7j2J52j01n8J48q3r0N9M0j31Q4M7J0kl8
5911b0m2R1L3j52J73K0j40M5K2nk7j56J01lJ16Mk2j5p3k8P9k0k4J47j22k7P5r5
5939f5J2J12l2o3op7J27K6L0l6kJ6n1K6K9%n5Q7K5j63n9J91j32J22j51J70j46
5966f5N1P2mj06Q0q1P3l3PO8j48j1J41p5j5M0j19J57Jn9nP0j2j14kJ06j39J33
5994A1k9k6M9K4k9j3K3N1l9m1J6j2L6p0J63j39pM2k7mLO7j05Q6p0M4J02q4l4P9
6024F7q8L5k9RP0j20J55J3r9J28k06J3M3N0J7l2rQ5n2n1l5%K1n4R9q3J8nL9j6
6054a7K3R0k36K83j79J8Q3m9n3L4MQ2j10M5m1l3K03k14j6K6l8P8l0P0q2J04j75
$$ y = [38, -30, 67, -44, -38, -22, -16, -127, 35, -32, -45, -66, 31, 34, -51, 46, 175, 17, -2, 82, -46, 20, -1, -65, -23, -93, 4, -15, 27, 14, -58, -67, -20, -60, -26, 67, 76, -42, 72, -6, -58, -5, 32, -45, -57, 95, -6, -64, 84, 1, -89, -30, 10, -121, -37, 10, 20, 18, -20, -62, 29, 62, -90, 83, 103, -37, 8, 30, 25, -2, -158, -57, -60, 56, 60, 38, 23, -50, -78, 1, -19, -43, 104, -18, -45, 30, -65, -53, 59, 27, -36, -42, -119, 8, 34, 64, 28, 26, 42, -9, 17, 46, 46, -9, 78, 103, -60, -119, 72, -60, 62, -89, 81, -65, -14, 58, 54, -52, 28, -53, 20, -13, -6, 62, -86, -97, 44, -31, -46, -6, -125, 32, 33, -26, -31, 39, 27, -87, -89, 17, -122, 11, -18, -44, 5, 29, 0, -13, 10, 61, 22, -19, -3, -15, 21, -49, 114, -25, -32, 10, -17, -21, -18, 49, -56, 30, -40, 4, 106, 22, -12, 67, -21, 14, -15, -6, 64, -56, 99, 112, 13, 141, -65, -52, -9, 41, 58, 26, 17, 102, 50, -1, -36, -36, -15, -69, 30, -53, -35, -40, -1, -17, 6, 96, -140, 143, -36, -18, 65, 16, -37, -3, 1, 83, -27, 18, -23, -56, 147, -67, -83, -57, -95, -17, -47, 23, -59, 45, -130]
6081a30M0R8m4L8M5N0j25Q5NK9j23m5Q0O7m1J7o5K1q1J57j47k1N3J1j5Q0l2J3
6109B0m1m7J21pj3m7O8j54P3K2M3m0P6q8K8j26P7k3J87j77J27j35R9k29J27Q1
6135B2m3N6p2M7M5m2m3M8p3J07m3J32j70Q5r5J54j62O6m3J28r7M2%r6P9K9m3j01
6163h3O2N8jp4o6J46j51P3j29K27l2o1O4%K7j1J4r4J00k9p6O1%o9M4P5j52P1L8
6192C2n2J28j51O3p8L0J41j6j67RJ26j2Nj7L6L1j68J01q3l3n8P9k6R0k6j8J53
6219A19j94m9O9R6j8p1J28r3R0q8n3N2OJ0M3n5OKp1M1K4NJ1Rn7rL2P0k01J45L3
6250C2L7l5K2j76M1P9k5J19j34P9m1l1P0q4J6q1K33p3M2j14J01o4K3j72J83m5
6276Bl7J6N4rk4k5l1J5N5m7J45r1j11J05j42P8J8J13j01Pj05L8Q0nN5Rj65Q6J8
$$ y = [-130, -90, 8, -36, 2, 47, 97, -28, 57, 62, 91, -32, -77, 3, 70, 29, 46, -19, 2, -79, 78, -69, -90, -37, -26, -41, 39, 7, 20, -21, -68, 53, 46, 33, -14, 54, -100, -27, -5, 38, -2, 74, -14, 14, -112, -35, -58, 129, -48, 79, -56, 43, -186, -59, 22, -21, 35, -37, 10, 55, 13, -30, 18, -55, 52, 9, 141, -29, 56, -39, 115, -47, 19, -24, 104, 7, 49, 49, -47, 32, 61, 18, -83, -21, 37, 36, -38, -104, 42, -109, -36, -165, 62, 30, -31, 33, 33, 60, 49, 63, -31, 69, 40, -36, 25, 25, -44, 0, 75, -77, -6, 32, -20, 108, -43, 20, -58, -28, 113, 97, -70, -61, 65, 53, 58, 41, 77, 108, -60, 41, -42, -75, -133, -54, -80, 10, -16, -34, 119, -75, -124, -55, 41, 23, -48, 80, -13, 77, -11, -64, -12, -6, 4, 47, -8, -2, 0, -71, -30, -6, -1, 10, 19, -38, -47, -15, 55, -146, -1, 32, 69, 34, 56, -120, -79, 0, -25, 94, -40, 39, -2, -33, 37, -47, -31, -112, 121, 48, 90, -24, 77, 13, 36, -136, 47, 2, -35, -19, 35, 26, 2, -23, -54, -39, 16, -31, 114, 23, -88, 17, -125, -47, -29, 84, -17, -10, -115, -77, 3, -2, 53, 62, -103, -17, 1]
6305AJ9J08j85M1M9j02Qj6j4J32l9RQ0m7n4L9l4L4%r7J27q5K6m7L0P0l2o2l9O4
6335a6N9o1J7R7j06r1QR0j9L3lP4m2L4r0O8p3R1q1Mj6k0O9j9P1j00p4K11p4q4
6365d3J01o5J2P4q3N1nl2J17j81J7P9r4P5k8j26K04r7p3J63n4l3M5j2o7M7l6n
6393d9J9kM6O6k5p9p2N5O0mn0M7j21J07j4K9K5Qj41m6J83l3O4o0P8j41M0M3l6
6422cJ9M7N2j75L9j1L2QkK5o4lO0q0L3l7R2j3j01J03j22J25l4K9o0OP3n6J6l4
6452c6P6m1J5M3l0j29K11r3m7m5J02j17J45q9P5K3l4p1P1j9R8j30J7j5j7RL3P5
6480H0j25R1j8j5k1Pl4O6o4N4K8j53K08k6m2j32J58r8J00l2l1O8j49R9on2J2Q1
6508E4m6l7P8j16P5q4K0P1K9r0N3K6J5j21QJ49j91O1J5m3O9l3N6L0J8m2K8j3n6
$$ y = [1, 20, 128, -57, -16, 33, -69, -61, -77, -91, 41, 2, 11, 91, 44, -10, 29, -5, 29, 29, -68, 59, -26, 0, -47, -17, 53, 21, -41, -80, -16, 43, -18, -1, 96, -10, -101, -93, -3, -22, 11, 8, 82, 40, 74, -16, 52, -21, 70, -11, -7, -23, -43, 26, 7, 78, -22, -96, 115, 41, -43, 58, -7, 5, 79, -4, 47, 42, 10, 127, -54, -37, 42, -52, 23, -5, -131, 73, -24, -97, 66, 12, -21, 24, 12, -55, -8, -44, -49, -30, -32, 14, 80, 55, -24, -96, -41, 19, 15, -35, 12, -109, -2, -16, 13, 38, 46, -95, -141, 42, 9, 73, 13, 91, -50, -10, 33, -3, 16, 63, 115, -60, -21, -32, 0, 8, 6, 31, -33, -36, 24, -56, -23, -60, 32, 19, -82, 21, -101, 24, -10, 19, -41, -35, 38, -18, -2, -36, 40, -1, 14, 57, 27, -102, 109, 16, -31, -76, 26, -91, 54, -35, 40, 63, 29, -42, 29, 10, 108, -22, -5, -20, -37, -28, 5, 80, -45, 46, 28, 13, -8, -1, -35, 31, -33, 21, 49, -104, 104, 78, 36, -96, 62, -36, 64, 32, 1, 69, -80, 19, 13, -39, -27, 54, 8, -29, 49, -67, 8, -76, -56, 15, 44, -46, 7, 33, 48, -73, -65, 84, -107, -46, -31, -74, -5, -38, 18, 48, 66, 24, 52, 39, -17]
6537a7M6m6L5Mp2Q3jMj61J79j44J6J40ro6P8r4%L0j8k7l8M1J11qk05J10O0j17
6566h6P3jrl1K4R7j5M8j03m5K4O3J3K1n5q4LJ07r6jJ0R4r0j5K04j29J6m6p7L4
6596e2J44r0j10Q6J42r2j06J39m0Mk4l8J05o4qn0k5J16k4o6M5j6n5J08jp7KQ4
6624C7O7j17J44j99Q9q8J04L6L1p5j10J64K5o7q3Q8p1O4J1l1R3k16J67j77L8L9
6650c7RJ10l6l3j8mJ5p7jP9k3QO4p2R6q2j23J9J95o8n7O6r6J30R5k09P4P1j37
6679d2J37o8j7K8q4J25j05Mk1K3L7j15P0K9Q0n2p2R9k8J2K0n5M1O7j06M1j03Q0
6707B5m7l0k7n4J19j38K11j30P5j46J45m4O5N9q4j7j2j08J11K8J7o6J08M3o1k0
6733B2K4n1m0J9J59j42K0jJK5m1j7kQM6l7k7K5j7K7rM0q2K8R4j28J01p6O4k8K6
$$ y = [-17, 29, -17, 18, 22, -50, 33, 32, 36, -125, 54, -90, -74, 66, 57, -9, 69, -25, -25, 5, -13, -40, -78, -37, 74, 66, -139, -29, 31, -86, -13, -14, -23, -54, -30, 67, 52, 100, -3, -48, -24, 39, 52, 73, 18, -66, -63, 44, -52, -53, -43, 51, -39, -54, 150, 21, 37, -9, -86, -52, 92, 2, -108, -22, 120, 28, -78, 61, 21, 25, 1, -37, 68, 4, -4, -54, -79, 37, 13, -53, -8, -24, -79, 29, 28, -49, -47, 37, 104, -13, 131, -68, 21, -67, 37, 73, 104, 29, -81, 83, 108, 41, -42, 46, -25, 39, 50, 19, 112, -104, 63, -114, -76, -37, -28, 82, 46, 13, -5, -9, 6, -71, -72, 7, -16, -8, 56, -16, 80, -2, -125, -106, 89, 21, -36, 30, -66, 64, 159, -50, 24, 95, -42, 95, 27, 10, 38, -46, 79, -26, -22, -43, -20, 17, -98, -28, 1, 81, 29, -43, 56, 28, 40, 60, 5, 46, 113, 7, 48, -55, 25, -22, -52, -79, -133, -14, -152, 59, -71, 4, -142, 3, -41, 24, 83, -1, -18, -30, -138, -27, 1, 18, -48, 60, 103, 42, 22, 46, -5, -45, -26, 133, -9, 11, 10, 11, 36, -5, -22, -24, -16, 30, -7, -34, -9, -26, 1, -8, 32, -50, -22, 72, -56, 45, -31, 33, 5, 31]
6764C1M0q4k7K2O8l5j14J61j57J6J63j2o1kpm5j6J5J58q6k0k5N0l3o6L3R2j61
6792a02N9M8L5Jo4m2j7L8K0P6L0M8j54n4lJ14j51J28j6P8q7R6j05L1k9q8J7K6
6820f7Q7RJj1%kj1%N4o0n1M6j17J64p7ON9j9Mq3L1K7%N1k08J90p3J08L4k42J14
6851c6K9J07k7j33k5J19m6rKnj2kO0q3PJ10nk4KK7K6l2j7K0l0L4o2K5j5Lj08J80
6883H0p6M8l8M2n3k6j5m0J69q4M2p0M1r5K3N1jn2J26j46RJ37oj62N6L7P6o2k7
6912a6M5k5j1m9j9J79j54L8L4j03J99r0j16J47Qq1N5r8L3L7k7j68J36J46o8O1
6938I3j46R6P2j54M2J10m2Mn2L9Kq1J35j8l8j22Q3j19N7qj21J54Q4j57J04j18
6964a01NK17j58O3k2R0j94K3O6K5J7p4KM3m5o3M5J10k9j06J3j7N1n8Q0J64k11
$$ y = [31, 71, -13, -40, -18, 50, 15, -99, 62, -95, -79, 84, 72, 11, 9, 2, -43, -59, -44, 114, 28, 8, -17, 33, 0, -66, -33, 59, -102, -43, 5, 40, 41, -23, -65, -82, -44, -24, 52, 82, 130, -24, -78, -81, 33, -118, 10, -6, 72, -15, 81, -24, 7, -22, -110, -93, -67, 20, 29, 30, 19, 19, 17, 6, 6, 60, 0, -51, -5, -122, 42, -35, -29, 30, 11, 15, -68, -37, -10, -10, 41, -167, 23, -50, 58, 92, -150, -36, -7, 100, 73, -60, -85, 34, -12, -21, -19, -24, -36, -38, 22, -61, -54, 56, 51, 27, 29, 56, 82, 50, 33, 53, 23, 57, -5, 20, 5, 8, -100, 80, 4, 52, 14, 56, 3, -23, -38, -78, 91, 7, 49, -21, 20, -75, -52, -1, -2, -54, 72, -74, -65, 72, 66, -96, -40, -3, 73, 11, -16, 29, 4, -7, -56, -75, 104, -50, -12, 22, -81, 118, 28, -88, 59, 67, -14, 41, -57, -24, 13, -14, -182, -46, 100, 32, 93, -53, 43, 115, -39, 3, 113, 71, 75, 23, 62, 64, -17, 118, 100, 62, -60, 23, -96, -39, -47, -168, -14, 70, -87, 17, -101, -96, 121, -37, 26, 4, 94, -100, -77, -11, 14, 31, -43, -41, 2, -43, -106, -61, 49, 20, -86, -73, -90, -39, -97, -17, 147, -64]
6991f4R6n1m5J7J18j31N1J24j60O7l5J23q0p4Q7k9r2Q2O5r2m0LJ06l4M9j49J26
7018C8Mj39Q5K9m1J3m9l3J28j02Q2n0J08M0r2K1K0J4j61M4J3O0m4K7Rp6J0M3N8
7047E9oq1O4p9O5l2L9l8l1R1l5OJ8m5n8J22L8q4J8j84O8J16r5pL3L3LN4j11L8
7077b1J0k8L2J8qJ1l3k9P8j1o4NJ12l5m7Q0o8jM8Mm9j7l9LO1n3n3P3Mn5J44q1
7109iO4o1N0r6J34j57P9Q1o9Q7M0k18N7o6J26j07P5K4j81JM7J71k5j6L0L2j23
7136c0N7j33J48Ml5J5o8N8N7l9l1J32j52O9J7k9J04l27J83r6j7J55k7k8M5r7N9
7163fQJ47j39l2L9j02N4O9r5N4l5K2L4o3NJ23n1l2j13P9J29k16K53j32P4J2m5
7190D1j1n7O1j14N8J6R5L7j15l0l2O0q3Q7q0K0P9j00J32j57L4L0L9n0L2R9n1o3
$$ y = [-64, 32, -19, -64, -47, 71, -60, -9, 115, -45, 22, -13, 110, 30, -44, 43, 14, -78, 4, 69, -23, -63, -60, 46, 12, 61, -88, 38, 42, -97, -12, 17, -24, -11, -60, -93, 35, -67, 15, -35, 73, 113, 21, 42, 62, 76, -85, -41, -28, 32, -12, 15, 24, -52, -42, 1, 59, 53, -28, 36, -43, 22, -10, 29, -9, -40, 51, 16, 22, 40, -5, -63, 59, 97, 13, 31, -153, -85, 31, -64, -71, -38, -5, -2, 52, -59, -21, -11, -39, -7, 11, 3, 14, -19, -48, 30, 19, -45, -40, 72, 37, -10, 70, 2, 1, 49, 53, 4, -13, -52, -49, 12, -41, -94, -21, -17, -72, 72, -9, 55, -6, 44, -52, 82, -75, 4, 85, 16, 103, 143, -75, -18, -84, 42, -65, 10, 34, -147, -146, -99, 72, 47, 31, 61, 93, -30, 27, -106, 42, 46, 11, 26, -42, 16, 73, 34, 3, 135, -17, 52, 69, 40, 144, -183, 0, -96, -113, 42, 15, -13, 32, -65, -6, 2, 149, 10, -22, 17, -85, -31, 38, -57, -3, -38, -16, 18, -45, -40, 83, 32, 0, -113, -34, 95, -121, 132, 0, 74, 86, 41, 30, -27, 34, -80, -22, -6, 89, 126, 11, -19, -51, 9, -74, 13, -67, -47, 32, -68, 64, -93, -59, -29, 10, -40, -8, 91, 40, -23]
7218b3K3P9l0j33J40J0kJ8j22K6rKNK9L8J3L9p5L9j34P4oN7lJ4q7M2P3j34M4P5
7249H2j89J07Q4L3k67nJ20n8R0N6m2M9p5J10j16N9L8q4m3L5P2q8N5r8j5J16o9
7276d3l2K7M9l1M3m9k9O1R3k08Q9L8l5p4J80j52J39m0q1qJ0J3R3K6j20J5l5OP9
7305B4l8j9k6J1O8j06J7M6J0k4J02j51k7J33oq7J00Rk4J16j45J08kj23J2rP3o8
7333b6n3Q6M4o6O9j29J57k3p3K0l5N9j46Q3P7r9N7m7R0m1%n3J6J63Pk46Q0J09
7361H0r4L1j8M5k9P2p8q6J39o8L7r1J7N4M0qO2j40j04J21Q9j36O6M4on0M6Nj5
7390B5Nn3J5K1n4O6j00j3J38j9k3K5m5L5J6Oj02J0M8M6j05O4r1J88k0k3j0j11
7418f1R7l3n7O8LP1j10r0O1RR5j33J63M5m8j03n5N6jJLjM1Jm3J41n4J4j5q6N3
$$ y = [-23, 0, 79, 49, -84, 56, 66, 64, 82, -40, -14, -23, -21, -16, 13, 51, 64, 103, 28, 67, -67, 7, 1, 58, 55, 69, -18, 24, 97, -37, 7, 82, -107, 0, 84, 117, -150, -155, -35, -93, -3, 53, 11, 60, -15, 95, -21, 38, 76, -8, -51, -16, 56, -32, 23, -75, -90, 26, -43, -75, -48, 1, -30, 13, -36, -65, -4, 89, -119, -30, 8, -27, -101, 79, -73, 66, 26, -55, -63, -53, -40, 53, 79, -41, -26, -61, -55, 24, -14, -33, -59, -48, 20, -86, -69, -23, -13, -37, 65, -86, -113, 20, 14, -73, 27, 36, 12, 128, -17, 91, 89, -34, -22, -31, 42, -26, -79, 7, 51, -15, 54, -75, 82, 59, -14, 6, -29, 30, -116, -33, 44, -55, 2, -45, 45, 4, 4, -49, -33, 130, 137, -109, -29, 80, -14, 17, -1, 44, 15, 87, 9, -77, 62, -6, 31, -60, -43, 11, 51, 43, 105, -35, -139, -18, 71, -65, 1, 45, 39, -11, 35, 40, 25, 30, -23, -8, 13, -41, 25, -75, -88, 50, 31, 8, 33, -12, 23, 39, 45, -57, -47, 1, 47, -58, 6, -85, 103, 83, 60, 50, -61, 36, 3, -54, 14, 17, 88, -22, -112, -51, -42, 53, -80, 83, 128, 80, -23, -78, -22, -23, -22, -19, -20, 21, 22, -21, 120, 66, 80, 65, -21, 32]
7449C2m1L9k8J7N0j39J64j13m1J65n5o8L3j3J1Q7q3rk8nP2m2k9l6Q0j21K3J06
7477B8l7Qm2rJ32j77pP0J9n2m1jMJ37kj9L3j6j65J93j28J23l1q4M2J3L8q9M7Q3
7507G0k5K9k3j8n8p4O3n4O3M5L3j43J70q5P7n2j7qq9O7Jp2O0O1k3pn2j5n2J47
7537A9R3j53N1j22J82o3O9q8r5J01J7K5J8kjj18J62k6ml9mL4M8m2l8q0N8j4O2
7566E0m8O5j17L9K0O2p7l6L8N9j34J48p3nlqJ4k7k8L6Lm5J30j11Q8%j3nQ1n6K
7597D9j6N5o1j29O8P2j71K83j27l4N4j19J92j9j01P2q1N6Rn7J8m9M5o3l7P7M4
7624C0L3Knl4j61K75n0l7n6O4k8j6l4K4m8O7m7JQ7nQ5k10O8L7n1n5j9J99j63Q
7654c9j5P7j39J22J6P1mK0k28J10K7N4j15njL9O2j60O3N0l7N0J20r9J1p7Q8n0
$$ y = [32, -9, 30, 2, 19, 69, -70, 94, -19, -60, 105, 50, -18, 15, 2, 13, 100, 17, 8, -20, -25, 47, 5, -24, -60, 20, -101, -78, 28, -9, -1, -43, -52, 80, -97, -104, -34, -15, -67, -108, -109, -105, 32, 30, 11, 44, 28, -137, 56, -72, 51, 20, -64, -22, -9, 29, -60, -13, 70, 45, 74, 51, 33, -25, -99, -36, -90, -27, 18, 51, -92, 78, -7, 70, 18, 1, -7, -96, -29, -28, -100, -40, 21, -2, -9, -61, -76, -128, 19, 112, -41, 10, -112, 70, 7, 76, -12, -107, -6, 11, 36, 54, 52, 51, -67, 95, 69, 65, 26, 22, 56, 104, 62, 24, -56, 2, -12, 50, 2, 67, -50, -11, 9, 71, -6, -42, -4, 55, -79, 69, -4, -9, -12, -20, -6, -33, -61, -25, -22, -67, 63, -48, 40, 40, 27, 22, 103, 47, 49, 33, 88, 27, -102, -34, 38, -133, 150, 23, -11, 43, -76, 116, 97, -4, 68, -13, 43, 52, -5, 13, -36, 9, -54, -91, -14, 30, 63, 65, 60, 26, -135, 140, 90, 53, -3, 61, 33, 17, -17, 7, -41, 26, -21, -20, 67, 62, 147, -63, 5, 42, -9, -64, -83, 116, -47, -39, -54, 23, -116, 6, 22, 93, 89, 109, -119, -9, 18, 72, -43, -48, -49, -10, 52, -108, -45, 5, -32, 18, 138, 39, 50, -27, 61, 11]
7682A1j33O9L7j8lRO8on8OR1n8j7j0j2p7P9PJ9J4n6O4JN1j97M6l0J14P6j34Q7
7713D0m9q9J99n6m5m2N2M7j22L5Q4o2K9j04M2K1j20K04MN0j14O1n2j7ro5J57j64
7741h5J30lK3p7l9Q7l5R4J4j85J42j43lJ11om6Q1l8j46J32l6rL9rk7mkM8N1mn1
7772DnL5m4J55j44j9N9m9M5J0k3N1q6Q1r3J6l6P6p9L3Q5j07k2O0Ko5mk4J43Lj03
7803d5J6P1j00O6j8q0R2o9RM1J24j8p5K2Q1j64qJ21J1p2LkL3r3J28l3N6r0p6j6
7833h5R5M1j4j00P8Qj7LP3n5J5L9k9k1p7J40p2J7l4Pm4l6j4o8J92k1J3J16j97
7862d7J31l2O5p9q4n6O4NP1LN4j89L6O7j22J16o4J8rO1Q5l3M0q2M4r1N2m6N8n
7892C1k4o0P2J2m2K6m1Ln5J66j19J01j2m7k7J1k9J0k3J00j09J70j73P5k8p6Q5
$$ y = [11, -122, -53, -16, -34, -37, -28, 40, 34, -24, -18, 73, 15, -2, -12, -24, -101, -22, -15, 4, 18, -38, 26, 27, 78, -119, -73, -103, 11, 87, -47, 40, -9, -98, 101, 45, 0, -42, 10, 57, -65, -30, 54, -8, 21, -83, -41, -20, -140, 64, 68, 118, 4, 65, 13, -4, -13, -78, 79, -85, 45, 42, 65, -12, -51, 36, 1, 95, 109, -76, 66, -77, -80, 31, 25, -21, 60, 22, -124, 8, -28, -37, 2, -7, -34, -38, -40, 8, 59, 55, 4, -1, 34, -10, 145, 1, -18, 41, -8, 37, 47, 24, 75, -11, 70, -23, -7, -43, 33, -46, -13, 72, -35, -57, 3, 5, -60, -64, -88, 55, 58, -45, -29, 42, -58, 8, -10, -90, 2, -67, -58, -17, 107, 89, 14, 36, 117, -47, -55, 66, 77, 5, 8, 6, 39, -54, 74, 41, 97, 7, -69, -85, 10, 51, 37, -63, 15, 23, 6, 9, 82, 27, 42, 81, 52, 31, -46, 94, 22, 39, 5, 12, -32, -68, -82, -150, 42, 21, 34, 150, -47, 84, 52, 117, 38, -46, -102, -38, -33, 38, 41, 95, -94, -58, 9, -113, 3, -61, -43, -52, 9, 94, 61, 101, 19, 63, -28, 24, -22, 36, 31, 7, -53, 19, 31, -11, 15, -26, -23, -78, 88, -31, 70, 58, 11, -16, -5, -34, -24, -47, 53, -56, 114, -59, 16, -12, -88, -3]
7919cl4J53j63J21m2m9K0k6J3jk3L0P5r8L3M6j27L1M5N9j10P9o9p6J67q4j59K25
7947C3q2M3L5j72J41rQ5r7j4O0j34J40p2R3m6j3r0Q9rJ21j09o0K5Q3j34K9J20
7974E6n3NJ5l4N4O9j48K8n1N4p8L7N6l4M2knM6j7m7p0J50j09O5r3l8P1J2N4J01
8004A36k26L2J3L6k0m6L5M4J6r4P7K5j6o1k7J4p0k0J05O0Nl2Q3k19J91j71P3O1
8032Dq9l3R4J2k5N8R5j38p2j8P7k7N4P3l5QK8j38O4Ko0Q5j08R3q8L1%J38p8k1
8062a4N3k4pM5j58P9O8o4K3j24N7N7k5N5m4J8QO5j95J60L8k23J89p5J16n5j2J3
8090B4q0J2L3N8m5N7M9n5j58J26j3L6l6o1M3L8n5p6Q2N6o1qM0PJ00o1r1QP4n3
8120a0K8Q2J4j63J14q4j00L9J36j3m3O8jn9k6L2nM3j11l0m0K01m0no1K5K3j9O1
$$ y = [-3, -37, 116, -47, 74, 32, -17, 3, -23, -10, -11, -34, -4, 71, -27, 6, 52, -75, -44, 1, 60, -50, 29, -40, -116, 51, -33, -192, 33, -49, -6, 29, -143, -2, -11, 74, -23, -37, 23, -111, 29, -43, 50, 4, -9, -99, -10, -19, 102, -7, -67, -42, 41, -93, -64, 56, 3, 8, 23, -11, 43, 112, -36, -8, -59, -5, -83, -46, 10, -24, 18, 16, 11, 57, 40, -7, -77, 73, -36, 29, -64, -102, -31, -19, 35, 136, -90, -58, -45, -9, -29, -75, -40, 4, 20, -74, 3, 28, 12, -49, -76, -62, -132, -152, -47, 13, 18, -14, 69, -150, 41, -130, -57, 4, -85, -118, -24, -12, -37, 21, 116, -22, -94, -112, -35, -62, -8, 65, 30, 38, 66, -72, -8, -6, -66, 19, -89, 4, -84, -53, -53, 85, 7, -14, 39, 15, 8, 53, -105, -26, 42, -22, 1, -123, -66, -9, -34, 21, -23, -5, 3, 68, -127, 33, 71, -152, 37, -38, 78, 23, 11, 24, -56, -44, -11, 47, 2, 59, 108, 53, -105, 21, 8, 44, 8, -53, -10, 28, -27, -103, -21, 35, -26, -34, 6, 13, 113, 52, -39, -31, 43, -10, 18, 100, 114, -49, 65, -19, -119, -80, 56, 43, 0, 68, 67, 8, -18, 14, 9, 52, -59, -89, -129, 72, 32, 27, -34, -9, 14, -5, 56]
8149E6J2j33N5N9m5l2N4J3rq2PO2n9k3L4J10l9m5P4k2o4lJ06o7l2k3MJ30np7k2
8180fJo7R4m5J12q5L8K1j72P3j1
$$ y = [56, 68, -65, -10, 49, 4, -28, 26, 39, 30, -52, -45, 17, -42, -65, -31, 79, 40, -5, 69, 47, -17, -20, 86, 19, -13, -36, -32, 98, 93, 16, -6, -5, -72, 22, -23, 89, 4, 42, 63, -109, -36, -47]
8191d7
$$ Imaginary data points
##PAGE= N=2
##DATA TABLE= (X++(I..I)), XYDATA
0@%%%%%%%%%%%%%%%%%Qj6J6j6J6j7K5l2L2m0M8n6O4p2Q1r0J06j22J38j54J70j87
39i8K11k36K61k92L24l57L96m40M83n33N89o47P12p85Q66r56J059j177J308j460
59g72J642j856K115k438K855l418M220n461P669j2771M7719J1862q9482m079M1248
74i47K4488j6961l756k903o639l949J3130r98j0076Q962J9591j2133k7547K968
88a6770K9107N572j9109r015J4004M911o828p447j896J761J1971J0231j1220k4409
102a9137o99K0840J1284n294k577n357j3456O35K2862J1365j7824j3073J0023
115d08N228j0894J257J6134k207j7704j245J3608J884j2271J161R584k149n194
129c216O763K704j2548p673J6222J6007p113j7747l222N765M839N063N845o491
$$ y = [0, 0, 0, 0, 0, 0, 0, 0, 0, 0, 0, 0, 0, 0, 0, 0, 0, 0, 8, -8, 8, -8, 8, -9, 16, -16, 16, -24, 24, -32, 32, -40, 41, -49, 57, -65, 73, -81, 89, -98, 113, -123, 138, -154, 170, -187, 209, -231, 252, -281, 308, -339, 373, -412, 454, -502, 557, -620, 688, -772, 870, -986, 1129, -1309, 1546, -1872, 2348, -3113, 4556, -8215, 39504, 51366, -38116, -42195, -947, 23541, 6580, 2824, -79, -6718, -10667, 2463, 1465, -8611, 351, 19942, 7809, -19738, -16770, 12337, 17909, -1200, -10215, 3789, 8700, 1872, -5575, -7471, -5710, 6261, 16492, 5272, -19137, -19836, 1004, 12288, 6994, 4417, -940, -14396, -13761, 9101, 20466, 2642, -10431, -408, 4820, -6074, -4817, 11317, 9110, -8594, -9839, 3769, 5653, -6618, -5457, 4127, 1978, -3216, 3547, 6251, -6297, -13970, 2252, 18259, 11146, -6601, -9823, -4058, 781, 5844, 11689, 5198]
143E198j4618l804J0477P403M08n30n282q014r51J2344P819o047p857J561J399
158d94K082J464K0o575q96Q517M663p701r580K242O116K249N71J666l303r366
174h325j874J0571R709j371p409o633k704L894J1507N627r517j3454J619J0351
188A991M022m904l737L33M48J525K081j697k934J381K857N05Q02J339l236n369
204d593l01P765O502l112r423o577K183J0024O445k241j0591o657M126Q768M206
219F524l509n059j61K05K069L284J944l812l561J378J326J944j585j571k851j92
235c627M924M129l007q154k543O455P501K147m692p213l152M078Q757L773n336
250D040p315l340L837N676J917k226m478l246J160L866K607r77k071k318M17L484
$$ y = [5198, -9420, -13224, -2747, 4656, 5064, 4534, -748, -8762, -9713, 2631, 10450, 4403, -3454, -1893, -494, 1588, 3052, 3072, -3503, -4399, 4118, 8781, 1080, -8500, -6258, -142, 2107, 2678, 4344, 1041, -8325, -10199, 372, 10081, 8710, 1301, -5332, -8036, -4142, 7365, 12992, 3475, -9979, -8360, 1991, 6013, 1109, -2628, -2295, -1847, -322, 1759, 62, -2872, -1491, 1366, 1871, 2673, 4012, 776, -4593, -4894, 2871, 9373, 6261, -3162, -9739, -7556, 2468, 8913, 6672, -3919, -10576, -6450, 2318, 6524, 3015, -2044, -2205, -2000, 69, 3353, 5297, 1485, -2076, -698, 628, 2572, 987, -584, -3435, -3627, 1297, 5426, 2419, -5735, -8278, -1823, 5678, 7825, 3133, -4080, -7232, -3154, 5603, 9376, 4040, -3275, -6615, -2778, 2898, 4815, 2589, -1889, -5135, -3975, -109, 2498, 1521, -550, -2868, -2451, 1033]
266A033L231j145n120k179M336N051K95n060n166j493N450O875J17p173o494J080
282f362N765N043o5l082m451j978K475N885L433k788n636k738K796M465K077k515
298B324m854k383L238M754o1m738l528J833M496K821j406l916k713J583M447L394
314E291m72m243m762n72M791N583J87n910n924j50N110M949J91m359m551q2M558
331c65M222j5l823k776J039L071K171l36k835l305k1M046L598k017n625k841K401
348c411M802K758j899m534k995J747N238L739j055m798l686J073M671L509r40
363D219m572l944M35M280L409j381m698k788K058M327J856k144l323j026K305
378i87L538J456j212l822k567J799M871K351k914n373k439K360M944K566k766
$$ y = [1033, 4264, 3119, -2001, -4180, 156, 5207, 5502, 442, -4724, -6217, -767, 6108, 6225, -948, -7442, -6362, -597, 4446, 4381, 1299, -3152, -5130, -2655, 3230, 6663, 3875, -1761, -4499, -1703, 2762, 4839, 2324, -2530, -4913, -1675, 3079, 3018, -1720, -5248, -3415, 1081, 3902, 2496, -1420, -4133, -2550, 1897, 5291, 4819, 576, -4186, -4758, 33, 5616, 5803, -107, -6031, -6181, -1071, 3878, 4069, -290, -4841, -4923, -365, 3857, 3842, 19, -2757, -1718, 1353, 3524, 3188, 353, -2952, -2973, 1073, 4671, 2654, -2971, -5812, -3411, 1391, 4149, 2250, -2284, -5279, -3532, 1706, 5445, 4390, -408, -4094, -3021, 1650, 5159, 4219, -353, -4297, -3862, 418, 3827, 2446, -2252, -5040, -2982, 1345, 3201, 1057, -2266, -3292, -987, 2551, 4007, 2795, -1027, -3594, -1795, 3076, 5427, 2513, -2860, -5299, -2939, 2005, 4571, 1805]
393A805n444k545L350N432J795k806l857q86K329L314J402j406k971k167J099
408a556L608J803k489m372j350K659L887R33k882m090q32L679M612Q46l454l910
424b908o50L686L977N49l107l718j497K226M009J504l235m671j021L590L568L42
440B644k799k968j23L074L288M14k753k860l00K853L378P3l545l532j43K903L201
457B805L57l506m431M1M522M013r33l773k650P35L716K981l96k770k931j71K720
474C29L357K9l966l470N86L191K228l51l006l098N38M169L195j549l745j452J541
491a474L408K054r83l410k367Q01K881K584l98m099l839J110M596K609j902l484
507a913k123J257M047K297j505l175j334J702K890J449j436l177j353J242K146
$$ y = [1805, -3639, -6184, -2834, 2598, 4393, 1587, -2270, -3156, -827, 2487, 3889, 2483, -488, -2655, -1556, 2052, 3855, 1366, -3006, -4356, -1697, 2190, 3123, 241, -3849, -4681, -1002, 3610, 4456, 1002, -2908, -3558, 128, 4105, 4654, 1547, -2171, -3668, -1442, 2567, 4071, 836, -3835, -4856, -1266, 2302, 2644, -155, -3123, -3246, -172, 3116, 3530, 777, -2083, -2383, 470, 3848, 3921, 376, -3156, -3299, -396, 2805, 3162, -344, -4775, -4734, -212, 3801, 2868, -905, -3555, -2820, 896, 3877, 3481, 711, -2220, -2391, 329, 3686, 3715, -251, -3721, -3135, 56, 2284, 1933, -1073, -4171, -3633, 536, 3731, 2182, -1563, -3015, -1474, 1934, 3988, 3005, -405, -2772, -1971, 910, 3494, 3096, -1003, -4842, -3732, 864, 3473, 1571, -1913, -4036, -2779, 1268, 3565, 2060, -1115, -2449, -747, 2143, 3592, 2156, -1021, -2374, -1132, 1014]
522A014J603o98l502l351J466N094K461l074l897r00K310L603J792j927l635r04
538b545K267K909P01j832l001j296J694K299J034j424k999j876J732M086J748
553C497k705l571n57K702L621J044k540l353m75K464K422M74k116l191j148K469
569i63L068j5k478k530l68K089L074J340k371l379j79L021K942K19k508k784l71
586b193K155K352M79k390l255q59L033L196n74l116k126O50K785K496J81k851
602c7k522N50L143K084l25k415k511l50K234K263P0k328k651o69K565L345k38
619B208l525k279J486L420J878j019k740j595J344K636J283j097k464k069M46
634b087K615J677p45k379k030j70K480L220k2l554k463J797L643J632j765k835
$$ y = [1014, 2617, 1919, -1583, -4934, -3468, 1626, 4087, 1013, -2884, -3784, -1474, 2129, 3921, 1994, -1641, -2545, -278, 2631, 3332, 1500, -1501, -2797, -1103, 1196, 2230, 806, -2193, -4069, -2337, 1749, 3497, 792, -2779, -3336, -634, 2987, 4031, 1491, -1862, -2337, 127, 2549, 3023, 907, -2284, -3432, -963, 2105, 2090, -388, -2918, -3286, -1197, 1877, 3217, 846, -2533, -2712, 309, 3251, 3470, 962, -1822, -2193, -38, 2314, 2793, 403, -2852, -3711, -678, 2518, 1944, -1172, -3298, -2648, 137, 2633, 2814, -37, -2559, -2009, 1134, 3218, 2893, 478, -2033, -2383, -149, 2114, 2184, -144, -2795, -3464, -899, 2446, 2208, -1317, -3596, -2110, 1310, 3188, 2169, -571, -2166, -822, 1814, 3097, 2000, -464, -2533, -2087, 528, 2205, 1460, -919, -2949, -3119, -639, 2581, 2559, -995, -3458, -1661, 1982, 3614, 1849, -986]
650i86j153J557K685P42j463k604j515R64K523J423j513k594j120J167K383K056
666B552n86k943j951J834L449J170j857k734j135J589K448O85j776k378j122R16
682a839K511J399j469k896q47K065K683R10r58k748q56K100K237R55j920l123
698a796l51J461K792P39k457k372p29J039K968O28j604k446q24L168K109Kj597
715G30k573K70J392K056J057k242k002o37J810J994M43j737l056k9J373K445J312
732B606k315k396l97K637K981l54k833k155O93K982J204k35k355k041qJ766J845
749A625q21q20k479M35K342J393%j599k010K26K513K251k75k689k073P01K810
766A530L70r02j833j237M44J993O60P61k690j692K42K457K524k10k571k014O10
$$ y = [-986, -2139, -582, 2103, 2845, 1382, -1222, -2737, -1773, 750, 2173, 660, -1934, -3054, -1887, 496, 2552, 1966, -977, -2928, -1094, 2355, 3525, 1668, -1066, -2201, -612, 1836, 2521, 745, -1633, -2755, -1839, 672, 2071, 602, -2294, -3141, -1076, 1607, 2517, 1559, -1189, -2045, 55, 2292, 3247, 1327, -1796, -2147, -686, 2106, 2845, 388, -1984, -2713, -1674, 1294, 1922, 318, -2128, -2952, 216, 2325, 2327, 730, -1843, -1573, -181, 1875, 2932, 690, -1312, -1949, -139, 1855, 2298, 561, -2495, -2524, -1151, 1294, 2606, 291, -2105, -2502, 135, 3116, 2762, -71, -2226, -1533, 1449, 2653, 2418, 63, -1978, -1986, -220, 1625, 804, -16, -2495, -2060, 282, 1675, 1675, 76, -1934, -1708, 805, 3056, 2781, 92, -1981, -1280, 1530, 1900, 998, -835, -2072, -1628, 365, 1025, 1786, -904, -2596, -2354, 103, 2627, 2417, -154, -2168, -1558]
783a558L056J403l99k180k794J484J587J685j572j524j290O72J815Q01k40j979
799a033j430J040K350J595j626j532j297J936J908P25j063l141p64J036K623M92
815A819j310k144r54J319K148J144j407j484j051P22K868J258j518k909Q5J531
831A17J981R8j770j904l64J294J351L12p23k240p98J627K205O98j521j769o3R53
849e16K670O71j403l115M33J765K012j207j436j759l20J396J480K09o73k029n99
866b421K192J419Q65k044j312k64J679K437j57j950j939k30J818J875o19k206
882h57j527N83J675J019M1j183j322j55J844J806R4j599j967N63K167J382p73
899A791k231j285k21K249J255m23k526j319J153J714J236o54j302q89L30J875
$$ y = [-1558, 1498, 2901, 2502, 322, -2472, -988, 599, 2284, 712, -812, -2102, -1430, 385, 1186, 946, -1033, -2463, -1423, 927, 2522, 896, -636, -1933, 3, 1911, 2636, 1573, -1568, -2332, -1296, 1327, 1819, 509, -1635, -2589, -1270, 878, 2022, 615, -869, -1920, -1198, 1670, 2928, 1410, -1499, -1414, 117, 2098, 2196, 426, -1478, -1842, -548, 803, 1115, 392, -1848, -2646, -1019, 1186, 1884, 363, -1406, -1469, -516, 2154, 2825, 1422, -1693, -1260, 505, 2517, 1310, -126, -1885, -2205, -809, 671, 880, 207, -1822, -2421, -229, 1190, 2055, 11, -1301, -1565, 114, 2551, 2394, 444, -1495, -1725, 93, 1968, 1349, -857, -2384, -1801, -126, 893, 934, -249, -1571, -1726, 118, 1924, 2018, 419, -1548, -985, 1182, 2564, 1791, -440, -1725, -1946, 303, 1558, 1135, -1391, -2710, -1557, 157, 1393, 739, -563, -1452, -1122, 753]
915G53J303l6j440k226P50K475P57j262k168j06k80J573J383o74j806j417P94
932a627J871J609p04j869m54N92J375J349n44j447j562M40J928J446j893j745
948a235m08P28R45J319j584k126J52M87K236J608j355j892j20M52K241O13k085
965b4r47n09Q09J318K59r06j013o73Q80J970n0j710j562J874j46J778J82j85j748
984d03k54J78K309j94r26j620n39R54J216M40j424j407oR05J619N02j230j379
1002a259k31J524J364M65q25j923k45J089J941k90j452j896L61J021R42J58j553
1019h09j050N44R34J735k23q29j366N36J410M68m33k20j507l57O54K362Q3k708
1037g76n97N00P74J022J4j834j067N76J023J398M88j145j452M93J639J312n32
$$ y = [753, 2056, 2020, 580, -1646, -896, 1579, 2336, 1074, -1094, -1200, -1480, 93, 1476, 802, -1004, -2421, -1627, 244, 1853, 1149, -720, -1174, -582, 793, 2142, 1598, 151, -1411, -971, 957, 2403, 510, -1235, -1643, -915, 30, 1349, -235, -2361, -2209, -1722, 514, 2122, 767, -1125, -1245, -793, 1448, 2061, -24, -971, -1480, -671, 647, 906, 0, -1013, -1686, -806, 1164, 1114, -596, -2158, -284, -430, 1348, 1530, 1345, -403, -657, -479, 1830, 1636, 710, -910, -1449, -495, 721, 1161, -263, -1670, -1676, -771, 848, 1350, 120, -1259, -1490, 34, 1398, 1863, 1038, -885, -1130, -41, 1900, 1610, 158, -1738, -1377, -356, 586, 744, -809, -1859, -1315, -381, 1354, 1131, 302, -1064, -528, 882, 1350, 917, 697, -810, -1167, -513, 1849, 1932, -776, -1373, -873, -99, 923, 937, -897, -1964, -1388, -365, 1033, 1521, 376, -1076, -583, 1056, 2368, 1836]
1054A836j783j342O95Q59J237l61j972j457K006J315n0K09j661q22Q90Q12J001
1071A412l29p32j164O95Q05J570j688j325p56P65J187M64l48j424q94L04K234
1088G76J15l19j380q82Q47K104J41p35j019k22o1J475J572j206k485L2K53J931
1106I37N0o30j578k48R36J002Q96o52o00j295J090J623K76p98r21j67m6R82L9
1125H96k72j236j145J142J426m3p91j061l66J676J028O3j308j038J1J044J519
1142A545J02o49k117M88O12Q42K03q50j406j44R72J197j45j161o77J43J310Q81
1160A146j36q52n11j25N85J415J35j679j291K40J255Q06l03j167j102R0J280J144
1178I30k09j048q04L52J227Q40j83r02o59K61N53Q41q5j172j269J20J444P40p27
$$ y = [1836, 53, -1289, -594, 265, 1502, 1141, -831, -2288, -282, 1033, 983, 1192, -469, -1291, -401, 411, 1412, 1083, 351, -813, -118, 687, 2257, 569, -756, -1512, -747, 440, 904, 556, -868, -1762, -1458, 776, 891, 572, -808, -1690, -843, 1261, 1402, 667, -352, -574, -635, 840, 2412, 1206, -1279, -1247, -994, 937, 987, 357, -1221, -1469, -533, 469, 1365, 713, 113, -1182, -92, 1531, 1807, 1009, 88, -79, -125, 857, 896, 624, -612, -1757, -615, 811, 768, -23, -1084, -1450, 226, 1254, 1317, 9, -1029, -1018, 26, 1545, 1647, 998, -1119, -631, -19, 823, 1026, 176, -1230, -1374, -402, 795, 650, -511, -1188, -1045, 265, 1146, 1010, 158, -353, -478, 107, 1522, 1657, -22, -1313, -1073, 182, 988, 685, -482, -1584, -1494, -214, 930, 721, -327, -1131, -779, 448, 1288, 1105, 203, -456, -195, 358, 1199, 1114, -58, -1327, -1207, 237, 977, 250]
1197B50j118n81M47J190P60l39r16o31N60J088Q60n59j176n77M43R89M04k97j200
1216d03j072K43J393Q97r13j185m26P77J298L48m10q10l61N60P45P53m58j244
1234b68o47N57R68K66q06r03n80N47J156N02p26j224j18R65J223K26o89r14n6
1253e21N82Q59L45n20j265p36P82J208M4q96j101j71Q16R65L58n51r35k41R80
1272BJ170J25r70o72o9O31O22Q2m05j235m33P46J151J87j561n14J61O41J055k07
1292E07l07j119K15J001R66q9o62r70p8R64M02j82p34o75o10P89J279o7p54j541
1312a665L27J702N75l40r02l81L11J023M94j10p24q52o70J675O16n13p19r56R4
1331a015P51P33J18j103n15K29J252N38j45j090k88M85O96M60l73p96p28J33P76
$$ y = [250, -868, -1449, -1002, 188, 948, 609, -307, -938, -378, 710, 1570, 1011, -165, -742, -299, 690, 1094, 797, -403, -1475, -1232, 161, 1058, 145, -1040, -1466, -689, 609, 957, 547, -263, -624, -64, 681, 1434, 976, -268, -915, -358, 610, 876, 70, -833, -1413, -866, 290, 792, 66, -1158, -1276, -311, 912, 1138, 449, -465, -521, 61, 920, 1265, 745, -520, -1256, -474, 734, 778, -118, -1219, -1390, -574, 391, 749, 198, -737, -978, 2, 1172, 1297, 327, -345, -414, 217, 839, 921, 516, -719, -1152, -406, 745, 932, -629, -1143, -982, -341, 714, 507, 200, -919, -704, 297, 1263, 1174, 512, -458, -536, 428, 830, 648, -86, -761, -1371, -582, 697, 630, -124, -1665, -1338, 364, 939, 599, -303, -684, -373, 650, 1144, 1034, 310, -542, -1212, 463, 1079, 566, -153, -1109, -1015, -264, 469, 587, -516, -1031, -802, 450, 988, 843, -247, -535, -50, 646, 1106, 733, -63, -791, -658, 118]
1350A18O03l49j075o65N91R39M92k81q01n38M92J214M76n15q46l50N34P13K49
1369A001o44o55o55K21Q48N38n48r37n46Q07R89M16n46q12l7N40P85M33n34q68
1389b04m50N66R07K8n77q69l25L56O76M32m27r89k98O94J220J19p21o51J15P04
1409C06O33Q3n99p27k63M31P53Q9q64p69m1M66P34J25l78p57j82P65J048J19p67
1430B05o47J35Q26L61r3p17n14j08L68O73M2o22j072J9R36P02k8n49o52M6Q87
1451A98P47m2p52n73l2Q51L48k44o87m33Q1M62K71J19n91p06KJ083P45k33q06
1472a92l44K63N83P24j66p57m00M6N66O55m94q67o43M90L91M58k30m27o16K48
1492g12R33N86k57p99l48M09P16M65l13p55l11K00L96L17j24q78n32M07O70L00
$$ y = [118, 721, 372, -703, -1368, -777, 162, 654, 373, -428, -966, -474, 740, 1216, 701, -145, -495, 39, 752, 1001, 357, -298, -953, -732, 116, 654, 106, -831, -1377, -570, 419, 835, 289, -523, -560, -20, 765, 1198, 664, -204, -654, -88, 819, 847, 270, -599, -924, -568, 108, 540, 113, -876, -1174, -480, 740, 859, 138, -513, -398, 306, 939, 1022, 423, -304, -567, -136, 617, 706, -158, -927, -968, -502, 232, 357, -21, -778, -960, -195, 853, 972, 205, -442, -307, 519, 880, 787, 70, -444, -552, -184, 489, 531, -91, -1163, -1144, -208, 494, 466, -83, -735, -689, 198, 945, 903, 151, -422, -454, 397, 745, 501, -186, -619, -538, -76, 195, 314, -277, -983, -981, 102, 847, 614, -192, -536, -273, 310, 1034, 868, 111, -289, -243, 323, 978, 484, -383, -1026, -536, -145, 313, 83, -344, -960, -712, 221, 807, 550, -249, -597, -188, 528, 993, 680, -75, -386, -186, 210, 527, 403, -475, -1007, -600, 70, 370]
1512C70m07m70k52K49R23O38l72r47k52N80P74J90o20p99k43M15K81J80j39o09
1532e10n20N27P66J60l80m40j68M36O98K95m42o66l2L91N79L3m06q31j39M56M16
1553B23m6k75l77m49K72J124K03p51l77k2O19O85K8n74o22M6N57M43j26o28p16
1574g63M4O17M28k01k99l43j69L20P82K79n60o37K75O00M36q5o36l96m6N55K28
1595D29j98m51m71k55P69O34mq57j56m0Q80J7L75m90j06p30J208K52R18k170j280
1616a726J121l87L36P57j114K62l15J111J063j027j78l21O69O23r44O02l21l21
1634a10L41M63J9Om29o68p62K180m67q51K0o32N67j65J112p42Qn23K4J552J20
1655A063j143k63K45J83Q02p4j215M34q31K53N58J16o9q41Q46m55Q17%j00p66
$$ y = [370, -37, -507, -759, -510, 413, 1051, 679, -268, -520, 60, 834, 1024, 404, -395, -638, -223, 58, 238, 99, -510, -1030, -503, 263, 423, 43, -397, -565, -129, 569, 864, 422, -244, -276, 115, 694, 727, 321, -510, -649, -193, 223, 177, -98, -475, -924, -652, 472, 675, -76, -453, -475, 144, 829, 857, 283, -339, -293, 264, 707, 581, -47, -763, -719, -102, 326, 125, -174, -517, -686, -366, 416, 695, 135, -502, -227, 373, 809, 724, 88, -308, -354, 201, 429, 231, -220, -691, -946, -177, 457, 453, -404, -560, -600, 280, 297, 672, 182, 76, -654, 554, 806, 1724, -446, -1726, -605, -992, -656, 101, -1013, -751, -1066, 45, 1108, 81, -97, -418, 251, 874, -70, 532, 211, -110, 231, 694, 713, 719, 290, -378, -1140, 1040, 573, -278, -258, -890, -323, -488, 624, -118, -110, -633, -609, 943, 1063, -80, -343, -98, 85, 887, 813, -402, 32, -799, -546, 12, 128, 59, -782, 64, -391, 426, 426, 326, -440]
1675d40p10O18J061O74j015n80m30J113N59K45p51j644J208k99K89P54j312P75
1693A15o91K23J94N99J04n0q08J11J572r11q54K65k85k99R22r06N75n42N5R44
1713C33R7J202p76j087K4N13J081j090l9%o91J002m01J215j315p52l93J376P6
1732C75n44L55j72j172J535N48p21p7o06J098q18J429j23k90q85l40N19J92m64
1751a61L36l57n30O26l96N30n13j086M97J196Q24j004K5k30o0M94O36n85n81K14
1771a25n11O53P0K8k24o51K2O16J14k20n7K58m37J335k48k48L8m21J78K02J59
1792E31J78j169j59P57j42K84k75n85O67n25M42K91pk9k82j62N86l5M24l12j298
1813h20K90Q50M91m42l37p42J67M97K49n34j79N10J23k4l03M82m02J83m1M78J95
$$ y = [-440, -1150, -532, 529, 1203, 188, -392, -822, 291, 850, 1095, 344, -1300, -92, -391, -102, 652, -660, 115, -576, -353, -159, 440, 544, 494, -314, -203, 1369, 458, -396, -131, -416, -715, 207, -699, -124, -666, -611, 333, 430, 1632, 856, -231, -207, 306, 1387, 297, 258, 258, -433, 569, 168, 1383, 68, -684, -1077, 299, 375, -169, 186, 14, -1158, 377, 925, 204, 127, -479, 619, -199, 1230, 1107, 817, -68, -408, 111, 303, -161, 175, -182, -712, -86, -482, 48, -465, -1551, -1054, 142, 966, -38, -13, -243, -303, 191, 827, 242, -339, -125, -636, 17, 87, 115, -109, -760, -738, -122, -8, -228, -285, -27, -464, 871, 623, 375, 413, -8, 170, 372, 531, 709, -460, -619, 138, -4, 280, 5, -580, 87, -438, 4, 295, 288, 259, -23, -185, 401, 366, 790, 478, -820, -530, 320, 811, 369, 32, -710, -543, -46, 203, -331, -510, 0, 123, 99, -204, 278, -124, 59, 18, 496, 691]
1834F91o52q0J32N9N5J78n48o5l08K27M74m2j85k62l5N48r9L52l91P0LnK65J94
1858E76k06n75j26K82L62n4m54k87j20L76L05O1k39k59K6M02L70l1k67j33Om5
1880c0L32R5q8o02q4J77M64q5l79l34J84J06L40nM8l56R9J21N71k9o31J62L3J4
1904A23K25n6n81k46O61n03N81J48j052J80N4L60j73O64l61j39l6K20K99J82p8
1925D72j053O44j25K63K13q17J96k85K43k9J19m56L69j9L97N67l0r97L15K78m42
1946a77J69K60O27k192J001l44O77J25N6p89K55L69Q53j676Q28r09J051K13n55
1965a58O63r97k8R58K45p93J83k10o6J42J83qj69k27k39M98J01J08k09k8k90M92
1987A51kK39r3k74k31K78K57j28j53k72j94J49K83J64k73l47m9L80M42n0k72k54
$$ y = [691, 39, -41, 91, 150, 205, 383, -165, -230, -538, -311, 163, 121, -64, -326, -361, 187, 88, 440, 49, 119, 122, 117, 382, 576, 370, -205, -331, -49, 313, 259, -195, -482, -602, -226, 79, 140, -99, -358, -332, 70, 440, 409, 142, 9, 15, -30, 302, 397, 309, -293, -377, -200, 264, 179, -200, -534, -350, -244, 96, 91, 139, -217, -118, 3, 574, 545, -86, 76, 109, 123, 348, 292, -289, -535, 126, -377, 204, 352, -700, -520, -466, -106, -279, 385, 24, -115, -151, 69, 368, 550, 472, -581, 63, -62, 201, 414, -403, -207, -492, -249, -278, -159, -615, -246, -265, 132, 699, 669, -328, -13, 265, -177, -8, 252, 879, -1313, -312, -656, 21, 146, 202, -587, -332, 37, 890, -786, 42, -867, 184, 397, -158, 505, -492, -520, 438, 683, -110, 73, -137, -203, -61, 122, 114, -55, -282, -521, -23, 78, 186, -23, -51, -341, 151, 149, 388, 295, 21, -210, 68, 325, 197, 44, -228, -422, -273, 10, 174, -99, -446, -495, -115, 327, 277, 5, -249]
2009b49K38K89J01O1r3m01n6J95K59j32l30l21J14K56J28Q3l28k41R8L08L31M6
2031C56l17k82J23L35Q1l4p7k88j35J68K54q7k28k75M0K39K43l6k40q7P4K92K65
2054C84%k75k06l9M85J16k18k44j61q7K32J41N9m25k21K22J96J18k3k34o2J69
2076g3K16J59ok10j92n7K95K58k18k73o3r6J25K08J48m91k16J68L90K16k27j37
2098g6r5K49K48o9j78m7n6o9J75K18k51k85k40L57K6J90p5k14q3J30K48J20j33
2121I0j17j29J58L47k2l88N3J1r7P3K02j72m30j1K52K03L6j07j25p9K57L03k7
2144B81j6j85j22M8L65j05k31k41K8J58R0R1k93j69j9J78K68N5j61j57k9K00K43
2167B77l6Lk22r4K9L73j04k17k25l7J83Q4Lm3j91p7K43K52M6k20n6j61L34K40
$$ y = [-249, -11, 278, 379, 440, 347, -54, -110, 85, 344, 212, -118, -439, -325, -69, 59, 142, -186, -427, -329, -21, 310, 356, 39, -243, -120, 215, 296, 262, 185, -103, -238, -70, 184, 97, -131, -406, -366, -127, 116, 80, -160, -247, -173, 119, 384, 384, 109, -97, -136, 349, 465, 247, 3, -158, -245, -13, 128, 187, -238, -459, -237, -41, 77, 54, -180, -242, -73, 143, 302, 296, 86, -106, -163, 132, 390, 172, -101, -164, -260, -135, 73, 221, -270, -486, -318, 72, 288, 61, -76, -171, 78, 326, 257, 79, 32, -24, -93, 82, 300, 49, -236, -476, -119, -93, 97, 22, -192, -275, -145, 103, 223, 90, -27, -156, 2, 349, 327, -61, -8, 3, -94, -21, 181, 9, -421, -432, -180, 23, 59, -48, -173, -252, 5, 308, 281, 265, 80, -42, 6, 371, 266, 35, -206, -178, -20, 70, 161, -132, -301, -320, -142, 126, 181, 20, -137, -166, 34, 277, 241, 244, 22, -72, -43, 330, 226, 9, -216, -253, -70, 14, 17, -26, -217, -294, -51, 201, 247, 27, -29, -190, 144, 384]
2191C84k6l59k22J15Q2J01J09k87k82L5K45J91l5l06J9%K28K38J2o1l41J65J90
2214A95J26o1l15o2P3O4N9m3j35j91LK67J22j3k89K5R5J80K13j14j17k50J30J81
2238A43Q0j9l41j11M6K03L8j34j18r0m2L51J19r3j52o5K40J25j2m3j98M1P6R3
2262A37l2M6k41j08P6O6K9p9k3o5Q6O3K47l8k00j28K16K60o2k1l36P1O6P1o7O0
2288I4k37r4k8K09pN6k59M3J83J41J09j23o4j35J42K01K6j26l16Q8Q9N5K6j84
2312a11j40J5J21k0K28j45q0n8K50K63q1k34l0P7nK10k3k85j85J56J10J34k64
2335i7n9k7p7K20L9K55k29j62R9K01R4L4k35k33K07J06r2R2k51p1K1J16P7l3k32
2360b37QM7K03P7P5j89n2J11P5J40K3j45j72N1J1Q1p2k5j90m2R5J72j14j07j2
$$ y = [384, 358, -1, -223, -108, -26, 75, 184, -103, -385, -350, -105, 86, 51, -255, -236, -236, -8, 230, 242, 181, -160, 5, 195, 321, 260, -55, -117, -44, 20, 79, 36, -99, -290, -287, -20, 102, 89, -200, -175, -80, 100, 313, 199, 82, -168, -38, 143, 223, 204, -137, -248, -202, 1, 39, -95, -213, -303, -345, 6, 125, 32, -120, -185, 55, 180, 168, 125, -73, -32, 44, 137, 105, 151, -90, -198, -122, -56, -27, -106, -129, -194, -108, -45, 202, 164, -36, -164, 52, 312, 250, 229, -107, -36, 30, 101, 34, 94, -143, -237, -265, -56, -63, -7, -266, -223, -40, 101, 210, 87, 23, -112, 30, 231, 257, 131, -185, -97, -8, 47, 73, -111, -251, -236, -115, -135, 93, -52, -132, -190, 60, 323, 242, 8, -22, 55, 50, 260, 237, -48, -233, -77, 33, 167, -97, -156, -183, -260, -40, -1, 254, 25, -137, -38, 163, 257, 291, 56, -177, 30, 136, 44, 136, -115, -186, -165, -49, 28, -5, -237, -229, -182, 21, 98, 173, -16, -68, 43, 118, 258, 281, 136, -36, 15, 26, 107, 35, 10, -180, -222, -127, 45, -69, -176, -188]
2385a88J01J52J38M4k11n5oK19J25j65k26r7J11M0O0n3j37o2j07K55J10O4k46
2408a34k7J60KK38j02j84k3J07J33k8q2r2j10J20P8N7k07j42R3P2J54p6Q7j09
2432a5j48J34K80J4n0k14j2J31J43l6k49r7qR4k5Q9o1q4q8J35K13j24L1j00J8
2457b9R4J69l1k9l30K2L6J96k4n7r2j93J14M8L10l12n8L2Q6J89Q0m7k41O2M1J34
2483A70J04j66k67QJ01J68q4j43j13J17O0j7J73r1n5j74L43J86n4k25k9j4J23
2506A21k6J1j44j35N0L9J50L4l13k0L8K36P8l0Rj40M5n4K82K1k21j13R9K3J66
2531B06k49p7j2o3K3K26q1l1p8J8K25j6jn2j2N7RJ71q6j24j99J14P0K8L9k05j2
2558a12l8J72m0O1p5r2qL27l7Mj34R0j70J19J56j21j91j03J19l0J08jk16L5J27
$$ y = [-188, -87, 65, 203, 247, 36, -19, -25, 194, 319, 154, -72, -169, -58, -18, 42, -11, -148, -210, -317, -62, 48, 112, -134, -161, -1, 1, 239, 137, -47, -70, 37, 170, 142, 60, -32, -142, -22, 56, 113, -94, -236, -143, -71, 83, 7, 94, -15, -163, -29, 251, 265, 215, 1, -11, 120, 263, 227, -22, -119, -127, -33, -58, 31, -30, -114, -202, -67, 146, 22, 53, -47, -29, 65, 234, 203, 174, -156, -134, -98, 98, 74, 17, -75, -268, -154, -106, 204, -108, -166, -134, -48, 141, 221, 174, -67, -5, 36, 170, 274, 108, -159, -151, -50, 118, 34, -109, -222, -105, -45, -62, 111, 20, -35, -209, 134, 320, 266, 41, 12, -2, 121, 95, 106, -38, -173, -123, -84, 66, 100, -213, -233, -195, 41, 119, 89, 98, -42, 3, -51, 231, 252, 31, -82, 17, 40, 206, -43, -120, -132, -195, -172, 54, -27, -58, -136, -118, 107, 91, 90, 38, 26, 83, 92, 263, 177, 53, -146, -32, 38, 66, 105, -100, -112, -150, 22, -18, 43, -32, -124, -132, 195, 158, 162, 28, 118, -52, 67, 223, 102, -89, -192, -73, -103, 5, 4, -212, -177, -50]
2583e0R9kj09J48l4m0J10J04j60j42J35Q1j2L7j42j00j30P2L2L2J9j38o1J71J67
2608H7m2m6L4J08j15J18J19q4j92l2M1P6o0j31l6m2M8J16m5M0n5r0K3K39J32j80
2634C1qM5L0P8m2j14j47N8J89O1k70R6j37r2K57j8j7j15R0n0k5J48J53j35r6j3
2660d3K02j78P6m9m5j27J00J27j15j14O9j72J90J91n0j19J29q5J51L1n7j23j42
2683a53J28J7K01j02j32q3m0J77j4k1j75L3Q1J20J7p0l2KJ05LK0L2j57K2O6l3
2709A2J06Nk23j13M9K61k47L5Rj25J57M0J15K4j14n3J24J03Qj24N1j06p0L1jL6
2735a0j17j36K07M1J7k0j41R5JJ80K7n4j20RL0J35j25l8j02J35l3L2P1j38Q1j28
2761a01K2J04J20j35n6m3K17lL3k0j52K4j3J69o8l3j23Rr6J18j5Rj44J09K1L8
$$ y = [-50, 49, 47, -62, 86, 52, 12, 122, 226, 66, -76, 59, 140, 128, 165, 23, -77, -207, -135, -103, -71, -52, -190, -251, -80, 87, 45, -1, 33, 141, 26, 144, 263, 179, -13, -45, -4, 72, 12, -119, -155, -197, -149, -33, -78, -38, -93, -183, -160, 79, 211, 31, 23, 68, 98, 176, 134, 20, -127, -69, 120, 181, -89, 7, -130, -222, 35, 17, 0, -115, -25, -75, -100, 48, 201, 66, -30, -43, 159, -19, 57, 8, -37, -164, -64, 63, -52, -166, -97, -269, -79, 112, 62, -57, 72, -13, 138, 169, 112, -11, -153, -25, -8, 193, 91, -41, -124, -164, 13, -1, -22, -197, -164, -83, 37, 54, -16, -48, -46, 59, 62, 82, 114, -43, -21, 45, 12, 118, 123, -100, -213, -164, 97, -150, -115, -106, -231, -74, -34, 81, 105, -9, -62, 62, 165, 173, 49, 100, -6, -76, -45, -46, -10, -127, -263, -56, -15, 2, -18, -159, -64, -63, 117, 144, 90, -30, -21, 9, 144, 19, -19, -121, 14, -19, 13, 84, -54, 27, -101, -79, 25, 145, 10, -46, -89, 128, 125, 158, 138, -14, 10, -3, 166, 98, 65, -58, -49, -145, -27, -42, -33, -177, -68, -47, -9]
2787iK9M3j04Q1N2J7n4K4q8RNK3Jj37K6r9J30J3J17j35QJ1J66j15Q6J0k38K01
2815G3J42l0j62J8Oj25J56m5k04R9Q8j68R7R4On7r1K1K6J22pP3j87j04J76J26
2841A43o0k23K6P5O6j4j2p7k5M3L1M6N6j32m8K49oPk25J10J9k6joP3j24j8J8o2
2870i7m3J48j88J65o8O7L7Q6J0l31K43j0K28j82j24J09j52L9P9n0m7m4L7M5L6
2895gj08P0K4J51M3j53qm6L5L2J78q4J2j53k9k0L4j27O4m4N0k7LR4K0m4j74K32
2923A8L4N3j25kO5p2J38L6M2k72OJ02l0R3j60q8J07k3k1J89o6l8j05O1J23l2j7
2950A6p6J24r8J10l2r8l3j2J1R9l7j22O7j6N2N9M8L9j87J28mR1k4r9q9M7P6L2
2978G2Np6n8N2L7L6Kj04k1R0k4O0j25J02j7M3o2J30O1j77j01M7NJ0M9j86J8l0
$$ y = [-9, 20, 63, -41, 40, 92, 109, 55, 79, -9, 0, 5, 28, 29, -108, -82, -181, -51, -38, 79, -56, -48, -37, 129, 14, 100, 110, -128, 73, 215, 185, 23, 41, 47, -78, 78, 33, -171, -72, 16, -152, -55, 39, 45, -12, -103, -82, -56, 66, 59, 132, -55, -159, 17, 143, 83, -140, -114, -39, 27, 13, 1, -76, -101, -58, -27, 19, 75, -57, -105, 144, 138, 145, -80, 30, 49, 23, 22, 16, 89, -35, -53, -35, -97, -140, 8, -180, -15, -83, -16, 21, 107, 117, -214, 29, 19, 247, 65, -59, 50, -102, -63, 16, -34, -81, -125, -88, -43, -7, -115, -45, -21, 130, 173, 20, 12, -34, 1, 33, 211, 127, 139, -14, -43, -63, -29, -156, -92, -136, -86, -113, -110, -16, 4, -40, -214, 18, 52, 105, -20, -22, 43, -29, 109, 145, 187, -85, -79, 23, -7, 86, -74, -162, -55, -78, -99, 90, 24, -14, -119, -58, 65, 33, 16, -60, 64, -34, 76, 44, -54, -87, -99, -88, 11, -26, -148, -81, -97, -45, 14, 62, 101, -86, 42, 38, 129, 105, 6, -83, -36, 40, 72, 77, 1, -57, -5, 32, 68, 70, -34, -55, 35, 11, 71, -54, 48, 31, 74, 12, 142, 203, 26, -75, -28, -23, -13, 36, -150, -132, -162]
3006a62J22q2P4Q4j29OJ32J25j73nJ4J05l8l0n2m7j4Q9j44K87j38o9j3Ro4K36
3032A23q8r2J2O7J44j32O3m2j41M3J01K5j74P8j19L5J25k0p5M4k8O7N0N2q4q5
3058e1J14Q0m6%Mj43J1Q7Q2j87j01J12krJ01lj14N5J9o4K12j58Q7j10M3L8k8L6
3086F5M5k08O0o3J22J0q9l2M2Q4p4K5J05j53l2N1R2M6q1r5K8Q1P8j33K4j16J04
3113a4k8L6K5j82J07rJ05n2K9P8r0m8J54k1m1P9j07p2J17m6M6j76O0K8l2k1J37
3140F2k7n3O6mq0K31j10j6j5l9J79j48o2l0M9n7J29m4k28O4J47O7l7nn0j0M2j6
3168EK2M2j06l5P2Q9j5M2j99M5k5N3J00j21o6K3O3j11J68Q2j06j8K0l2N5jL8j9
3196F5m0j8M6q3N1o8jR7M0k13j1j0R7J17l8k4q5J4J36J67l10J27j50J41k5P8R
$$ y = [-162, -40, -122, -48, 36, -93, -87, 45, 170, -3, -8, 6, 111, 73, 43, -9, -56, -70, 19, -125, 162, 24, -45, -58, -49, -113, 123, 35, -57, -45, 22, 166, 34, 97, 55, -86, -43, 58, 83, -91, -13, -132, -97, 28, 8, -67, -23, -51, 16, 66, 118, 34, -51, 63, 143, 97, 97, 101, -42, -31, 56, 138, -49, -150, -38, -40, -49, 52, 49, -65, -10, 9, -55, 157, -1, 86, -24, 19, 57, 29, 65, 110, -98, -38, -101, 21, 31, -58, -90, -48, 36, -38, -13, 92, -61, -93, -42, 50, 96, 15, -80, -52, 29, 107, -26, -2, -118, -14, -42, -6, 19, -163, -56, -65, 40, -12, 17, 95, 5, -43, 111, 90, 49, 128, 21, -51, 66, 20, 66, -110, -50, -22, -54, -75, 62, 35, -18, 48, 44, -36, 195, 85, 69, 54, 15, 194, 46, -16, -46, 3, -54, 75, 31, -197, -133, 14, 81, 44, 39, -11, -21, 21, 5, 27, 69, -37, -72, 0, 89, 74, 116, -83, -38, -63, -10, 90, -31, -97, -74, -11, -122, 46, 128, 22, 4, 24, -8, 47, 46, 84, 65, 25, 7, 53, -30, 21, -47, -48, 49, 89, -124, -135, -145, -48, 69, 31, 7, -78, -64, 72, 239, -71, 56, -94, 47, 22, 100, 109]
3223A09j09q0P8N6j72J17m6r3Q6l7J56l3N6m1K9j4L7L8j45J25n0p2J06n8m2j87
3249a86P7O6oO7l8p3M8P2K1N5j41R0J0L2q7L6m0j0j5n7k7J54q0r6J97j78J72O1
3277A24q0j1j4k9P1M4p3p8M7N9j03J32k22R1n7R0r8N5O5o2j5R2P6j14Q6j66k6
3304a16L19j06j24j6J00n7RO0n3j4q7J75j08L3K7l8n4M6R5Q6o4o2j1Nk0r6J92
3331A21j96J13n1O8k2j44R8j51P6J35j78J63q0n0J34K1J5P0j54K5M3N1Oj56J8
3356b5l4K7q3R0P0j79Q9p4J00J1Q7j08J31j20J2N8o2m0N0P2k4K1p2o1O8j1J7l5
3384b5P2K3r7jN5r1J21m4j05J96l5l1jLp8J08p6O9m5m9k4q3J95j00J03j29P6J0
3412A7r4O5Q8n7p9LN2Rj69K51q3J9o6q3Q5j64J28Q7p0N9R2k09J46p8J91j85P4
$$ y = [109, 0, -80, -2, 54, -118, -1, -47, -140, -54, -91, 65, 32, 88, 47, 76, 62, 99, 137, -8, 117, 67, -5, 101, 43, 1, -186, -109, -43, -49, 18, -20, -93, -45, 27, 48, 103, -38, 52, 62, 94, 7, 43, 3, -7, -22, -79, -106, 48, -32, -128, 69, -109, 63, 124, 44, 33, 19, -10, 61, 105, 32, -46, 1, 60, -43, 89, -133, -42, -99, -9, -107, -52, 13, -49, -64, 28, 104, -10, 76, -90, -116, 203, 97, -27, -43, 57, 0, 9, 69, 16, 2, -85, 90, -18, 15, 42, 4, -50, -4, 91, 177, 113, 51, 40, 45, 25, -71, 121, -75, 38, -13, 55, 33, -111, -13, -164, -88, 47, -131, 32, -48, -98, 36, 57, 72, 142, -12, 13, 56, 107, 113, -43, -25, -59, -32, -115, -25, 45, -134, -45, -119, -19, -8, 79, -29, 102, -18, -6, 52, -10, -50, 0, 72, 48, 69, -3, -64, 4, -7, 10, -25, 47, 70, -27, -28, 27, -64, 57, 13, -92, 104, 69, 38, 37, 40, -38, 70, -6, 63, 18, -31, -55, -138, 57, -43, 60, -69, 7, 17, -77, -12, 76, 19, -60, -57, -5, 4, -165, 86, 3, 22, -44, -127, -42, -206, -78, 9, -61, -2, 90, -119, 27, -51, 140, -45, 29]
3439B9O1l7M1k7n0M4j12L9r3J38j17M6j03J42n4R9n1O2j10P6N5k7P8k07j5R2O1
3466F0l4O1p2J7q8jR7n5j10J03p6J24k4R9o9r4R0j4N7j7mo4n6j0J61j38P0p0k3
3495h0R1L5q1J41j67J54j55J75q3n9N0k6L2%j30O5RR6j17N0m2N1j20J05J9J6k4
3522EJ03l0l5P1p9j9p6J59p0J3J7K0j23j5M0M1l4q0Q9m7J21j71M6J43j26J04m4
3549B3R8j44J12k3k4Nk4qp3L7M2m9J42k21J41L0j17O8KJ00q5J03l0q4j4o9J13
3576E1M9o4Nrp3j3j3jN7J25j8j92k0J25L3N5n3p3k9J06N0K4O2k29N2q3R8qm2l2
3606f0k5J06k9j6Q9j11km1P1J10k1o7mML4J08j66r5J03k7j6O6q0J7N0q5J34n4
3634gJ8j24M1Q9PP6r2Q6o9p1N0O3o7j32J22J8m5P8q6k7M6m2J69K6j81Q3k8n9J28
$$ y = [29, 90, 53, 94, 67, 17, 61, -51, -12, -105, 33, -84, -38, -141, 1, -53, 46, -5, 57, -53, 23, 78, 51, 129, -78, -93, -1, 60, 26, 87, 15, 32, -56, -57, 40, -15, -125, -22, -98, 26, 2, 101, 32, -62, 28, 14, 71, 54, 50, -14, -70, -80, 81, -57, 13, -57, -80, 11, 46, -35, 106, -61, 93, -62, 113, 30, -29, 21, -5, 27, 27, -103, -38, -29, 67, -50, 0, -42, 9, -111, -6, 13, 29, 5, 108, 78, 43, 114, 35, 16, -60, 99, 29, 42, 59, 79, -44, -59, -19, 22, -12, -92, -3, -50, 71, -100, -54, 89, -37, 67, 23, 121, -23, 89, 66, 42, 47, 23, 15, -58, -21, 21, -28, 114, -107, 34, 64, -53, 15, 17, 117, 32, 135, 105, 21, 7, -62, 51, 100, 36, 41, 32, -41, -54, -67, -68, -11, 114, 96, -96, -116, 9, 42, 97, 44, -29, -58, 48, 98, 122, 184, -45, 7, -76, 22, 14, -28, -60, -85, 21, -8, -24, 65, -46, -48, -89, -18, 92, 71, 4, 0, 4, 38, 146, -20, -115, -12, -39, -55, 11, -69, -52, -2, -87, 47, -7, 11, -113, -72, 17, 24, 100, 8, 94, 25, -46, 4, 67, 0, -132, -10, 8, -37, 41, -45, -72, -26, -68, 101, 127, -54, 29, 1, -58, 70]
3663G0J1j12L4j1m2O3l4k6q6Q6p1R8k8J46j21J9K4l1Q8j65J07l0l0J41j16J2r7
3690a01R6j7KJ5MK7n0j54K21k8Q6Q0j63lJ33j51r8O7l7N2j2J0l0m7M6N5mk1RO5
3720E2m9l2O1mM1K4m6J4l3j2J03j5r7R3k4m5j27J5M9L4m8R9r6l7J25pK4m9M2m4
3750A1O1n2J6l0mq7O0qR6j35K9NL6o1M2J41j53M0r8J75L5p5o5K0J30r0K8p8j17
3779a28Q0n5R1L4N2j51Nj2R9L7n2J4p2J04j71K13N3j12Pj8j00M9K0J3Qq3J13j0
3807B8K7m3kJ03q4R4o4o2K8jjO1n2q0q2J23L1p1L2K2j14J05p7J41j36k8J27n5
3835c0J1L9l6R9j28O3J18j59R1p3l5O3n8m2Q2j12J60j99J44JQQ0j14P7q4P7J19
3862A62j45m5m6O1P7o0l2n6J20mln3m8Q6j5L8m1O1p8R8m0o8%M4NK5K2rp8R3q4
$$ y = [70, 81, -31, 3, -8, -50, 13, -21, -47, -133, -47, -118, -20, -48, 98, -23, -4, 20, -11, 77, -88, 19, -11, -41, 100, -16, -4, -101, -5, -22, -20, -5, -1, 26, -24, -178, 43, 15, 101, 181, 18, 15, 148, -3, -101, -34, -71, -19, -31, -21, -51, -98, -52, 3, -1, -22, -13, 52, 3, -29, 32, 28, 69, 93, 47, 61, 28, 16, 119, 104, 7, 100, 76, 31, -96, -81, -32, 2, -46, 53, -43, -80, 45, 38, 62, 13, 55, 11, 72, 20, 36, 6, 2, -85, -25, -33, 63, -72, -43, -38, -2, -63, -21, 120, -33, 7, -91, 84, 119, 44, -21, -1, 129, 39, 67, -11, -128, -48, -103, -12, 22, 74, -77, -72, -84, 15, 52, 0, 14, -58, 46, -125, 88, 141, 29, 36, 18, -82, -33, -13, 0, 8, -75, 38, 28, 55, 12, 10, 113, 29, 123, 59, -3, 25, 24, 23, 84, 32, -48, -130, -7, 24, -47, -15, 7, -107, -2, -79, 62, -74, -102, 25, -30, -19, 20, -16, 83, -45, 18, 136, -23, 68, -5, -40, 23, -35, -77, 5, -107, 53, -146, -2, -1, 7, 87, -27, 50, -34, 43, 162, 17, -28, -74, -13, 64, 4, -28, -84, 36, 32, 29, -24, -72, 14, -1, 37, -4, 57, -21, 77, 37, -31, -31, 13, 18, 43, 65, 56, -22, 71, -13]
3893a3o5J89j94J9R6j57m0K45m1k1m1J15q9Rj0m1P9n8j22J89L5L5o5o1l7j6N6
3920dM7j51l3J54N2n7O8J1m7m3J4J10n5q3N9m2p0J33j43J37j40R2M4l6K2q0N7
3947A6k8Q9k1O0k19J13P7j70J31l7j00N5O7p6L7j8k8R6M0j36L0M5Qp2K1P1r0O6
3975B7oJ7q4qN5lq5Q6J23j47J15m2j26n3J32j0N7K8mj05m0J43j24P4j22J26q0
4002e6Q0l1Ql8n7Q0K2k6J8n3L3K2q0Q2o2N9N8j63J38p0lJ21n5R7j38J5j14R2N5
4031C4N2n0l0k9l2O0rO4k0j4O1lk17K05m6K1j24K6M0J14m1j61Q0m9J09J6K8r0
4059ej22L07j80Q3o1o2R1n2K7J5q1J7k2M2j3k5q0J38j02N5oN0O4j72K20j64J26
4086H8r1R4k8j88J30PJ09j78p6PJ35p0M6m3J8K1K0q2J83J2j77J36jl4K9n2o2J05
$$ y = [-13, -78, 111, -83, -64, 32, -125, -165, 80, 39, 18, -23, 92, 3, 12, 2, -39, 40, -18, -140, 49, 84, 119, 54, -7, -44, -60, -4, 43, -108, -141, 13, 65, 8, 76, 87, 40, -3, 11, 121, 66, -17, 42, 0, -70, 63, -80, 57, -83, 9, 53, 17, 39, -41, 16, -12, 77, 56, 116, -103, 10, 87, -83, 48, 11, -89, -34, 33, -43, -6, -24, -52, 44, 84, -52, -22, 23, 31, -41, -20, 51, -39, 27, 21, 38, -46, -54, 1, -2, -87, -1, 122, -25, 90, 48, -78, -131, 1, -9, 48, 76, 72, -33, -73, 70, -54, 20, -102, 24, -56, 24, -7, 1, -37, -94, -14, 8, -18, 0, -53, -20, 2, -78, 4, -58, 1, 59, -104, 34, -36, -39, 82, 27, 124, -14, 1, -113, -21, 34, 86, 36, 6, -23, -55, 5, -4, 60, 40, 26, 87, 84, -133, 72, 26, 47, -77, -51, -11, 103, 62, -99, -19, -68, 41, 57, 85, -5, -127, 180, 0, 83, 22, -40, 51, -1, 26, 41, -40, -23, -45, -3, -16, -41, -121, 17, -85, -30, -36, 14, 78, -94, 126, -38, 88, -3, 91, 63, -125, 5, 12, 121, -57, -133, -126, 9, -61, -15, -58, -40, -19, 1, -81, 102, 114, -63, 73, 72, 38, 67, 15, -47, 58]
4114E8j03K7M4j27J3J13r6O8m0N2jl9O8r7P4J08j57O9p0N3rN7p8M0o1m6J54r0
4142a6J0m1M4m0K7o2R2O7l3N0j08M5n5kNJ31j57n0J42n5j43J11j1jj6M0jM7O5
4171H5j12Q9j69J05r%J2j0j11J01N8Rq1j0R0j60L5J40j18J19k0p7N5J5K2o2K9
4198B5N4J2j52O9Qn1J12r0k7m8nK06o2q9P8j19oR0J64j99O3J8k8p9N0m8K9J15
4226I0j68J26p5k6j8J47q9j05J63k2J9J29k40J60K2n7p7O9M6j12J45k59J30m8
4250e0m6KJ90r6Jj54K27n6j36J52j04R3K5l6l4J40j40K5M8o4L5N1k2rM4j64P4
4277dJ60q6Nrk7M7k4j12O7Q5j27L1q5Q0n5M5J05j26n5P6M8nK6n1k6L3K0J7o4J01
4307I0Lj20Q2n2j9K0L0n5O7k3o9N5kq0K9l3J05P6o4n6Q5q7J15m7k3K1p3l1lO0
$$ y = [58, -45, -18, 26, -101, -88, 25, -71, -3, -43, 9, 8, -31, 37, -60, 14, 122, -35, 34, -36, 17, 8, 65, -13, 27, -34, -80, 74, -16, -6, -47, -3, -43, -16, -78, 14, 81, 48, 98, -10, 35, -20, -22, -17, 114, -43, -93, 49, -6, -149, -38, -49, -50, -66, -26, -27, 20, 85, -27, 62, -107, -2, -11, -11, 1, -9, -120, -19, 39, 48, -33, -43, 47, -113, -78, 62, -56, 63, 43, -34, 21, 36, 58, -4, 25, 79, 91, -61, 8, 16, -35, 77, -13, -40, -88, -93, 113, 51, -38, 40, -79, -85, 5, 169, -30, 33, 51, 23, -56, -6, -54, -25, 90, -78, 48, -27, -53, -71, 76, -13, -118, 45, 23, 42, 171, -69, 91, 113, 56, -21, 48, 94, -18, 127, -132, -2, -50, -96, -94, 96, 0, 1, -153, 74, 18, -118, 34, -70, 23, 48, 12, -22, 118, -22, 3, 51, -13, 22, 73, 51, 42, 86, -78, -4, 156, 70, 75, 66, 39, 86, 62, -50, 17, 102, -25, 6, -79, 1, -54, -9, 96, -30, -85, -9, 39, 34, 60, 9, -17, 16, 36, 53, -11, 90, 93, -27, 55, 3, -16, 4, 34, -21, 46, 23, -46, 9, 7, -73, -44, -77, 28, 104, 40, -16, 69, -18, 97, 50, 27, 48, -25, -56, -59, 1]
4337AR3j49O9j5p6J48j85P9nn4P8P5p7Q3M9o0m2R1p0j7r6J14j29J32J6p2J0QM3
4366D2Pm1L3K3p8K0j6M6k0q5K8J23j77J55n6J6p1l5P5nrO4p8L0J06j71K15j92
4394e1K5J52l2j85K7R2M8M1j12l1j2O9K0n4P5j28O9K5j04k1R5j6J8M7p0K0l3M5
4422A9pk7L5K8j63J11J02k42J37m9J04k9P0j84J36R3j49L7J7NJ5J2p7N4j27J8
4448f1P0Q9r4l9P2j50J11l4J4M2M7j47J0mO6n6Q4o1OL1j8R0o4l7R1q7K5m4k6O6
4478hl3O1k3L4L9o0K3j04J68m5m4J22l4o5J0j2j28J75l0j13P1j3j05O1MN6m4M
4506c3JO9J12j05n6N3m0m5L3P0L2q9J2L7r5Q1op9lJ26L4K6j45K3K1K5l2j7j09
4535i9J66j97R9Q3O1j94P4k4j56J56K4K7L8n4O0l4M4l2l4O1j5j4k1L9q5J05j39
$$ y = [1, 94, -55, 14, -1, -77, 71, -114, -35, -40, -94, -16, 59, -18, 65, 114, 54, 12, 103, 33, 16, -80, 34, -95, 37, 53, -19, -9, -1, 42, 49, 8, 41, 64, -14, 6, -10, 36, 16, -69, -41, 82, -95, 60, 4, 20, -51, -86, -11, -16, -25, 39, -39, -9, 97, -74, 141, -51, -26, 126, 94, -91, -64, 28, 76, 117, 5, -26, -38, 31, 51, -3, 72, -56, 13, 38, -66, -87, 8, -8, 10, 57, -13, 7, -26, 19, 12, -15, 20, 48, -115, -4, 98, -144, -7, -56, 48, 19, 89, -95, 41, 134, -15, 22, 39, 44, 59, 71, -6, 48, -79, -61, 9, 98, 4, -35, 37, -113, -2, -36, -22, 20, 67, -80, -70, -74, -8, -64, 20, -41, -35, -4, -22, 68, 4, -33, 58, -29, -4, -48, -74, -8, -41, 20, -3, 31, 70, 10, 33, -71, 97, 52, 8, 130, 96, 31, 41, 29, -99, 76, 46, -67, 4, -9, -114, -53, -49, 7, -37, -33, -32, 37, 149, 44, -12, 41, 1, -44, -11, 59, 91, 2, 14, 51, -44, 37, 31, -48, -51, 75, 109, 135, -10, 13, 34, 59, 27, 10, -99, 67, -130, -31, 52, 113, -81, -7, -31, -187, -31, -7, 20, 58, 4, 64, 30, 74, 42, 8, 69, 54, 40, 19, 58, -27, 78, -61]
4562f1K6O1j31J35j35N3J93j83J9K9J1j5J22j48J3oJ3n8R8L4r7l4m6P7O3l9l3
4589c9R8JM9j55m0l3P2P6j4%n3Pj4J64p6L7k1j29J25o5k9Q1p2Q8J4m4n8M7o6k
4619e1O9O8n1o6N5j6m5J15r8M6k8K1j01J1LP6O1q5l9n5J52j67J43J24j40J7j01
4646h2K33j87NR2r0J07o6O6p2K5j9M4K2l4n5L8m7K8K7qQ4j18P1j92J93j5j20J5
4674e5k2R1n2L1q1J03j16J19j0r0M3o0J08k4L2J5j05J97l9j05L7n2N6p4J26j30
4700e7o8J46pR5j44mJ8m3l4J46j00O6k4k9L3K9q9J58j23o6OJ04l5j02P0J57j24
4727b1L5o8L2J02o6R4j52N1J19j9q2p3J15q1lj9J03j60J67o4n7M7m0P1r1J48j53
4754f5Q5j00j7J08Qp2J15j81M4P7k1kn5J26o5J21k00K30k32J27j32J24l3N1l7
$$ y = [-61, -35, 26, -105, 30, -105, -52, 141, -42, -23, 6, 17, 2, 124, -24, -11, -17, -4, -62, 36, 70, -27, -61, -107, -30, 33, -6, -39, 59, 60, 109, -46, -86, -119, -47, 29, 15, 15, -38, -31, -45, 119, 43, 80, 59, -70, 55, -10, -39, 42, -30, 58, 72, 28, -30, 17, -49, -51, 18, 86, 35, -31, 24, 8, -37, 78, -20, 26, -2, 19, -82, -71, -68, 8, 69, -16, -55, -110, 42, -125, 18, 142, 2, 19, -82, 151, -36, -31, 61, -29, 78, 12, 78, 6, 31, 12, 56, 78, 44, -11, 27, -20, 8, 35, 27, 111, -7, 64, -128, 65, 50, -70, -55, -77, 14, -38, -7, -88, 15, -101, 18, 8, -82, -39, -99, 9, -15, 17, 32, -73, 124, 85, -20, 17, -35, 21, -53, 73, -57, -125, 21, 14, 109, -35, -39, -21, -64, -98, 48, -52, 14, -10, -39, -6, 23, -66, 92, -31, -97, -91, 13, -22, -124, -54, 103, -21, 14, -54, -22, 80, 14, 108, -44, 7, 126, 107, 25, -48, 67, -14, -17, -36, 67, -93, 74, 10, -47, 0, -40, 31, -60, 88, -65, 20, -80, -97, 11, 19, -53, 62, -119, -75, 2, -19, -21, -76, 50, -15, 106, -94, 136, -96, 31, -101, 23, -10, 41, 4]
4779DO8k3nm3m8nO0j12Q2N7k0j44O1n4R5J43j57Np7J48R0q1J8p5j38R0R2qo5P1
4809B9j3J8n5qk0J48n3pn9K7NJj3j1K4m2K5J2K3k7J09k9j21j7J58j86K8QlO5n6
4840d0k8Q9o6J06j6k4j09Q9k8J07J6k11J50j6l8l4J33q0KoL0K1l9O5r3O2Qr7O3
4869A6m4J29r3l2K8J4K4q4jK9L4q0M0l0k7N2O9n8J17j16K1k5J49r7k9n3n2J24
4897B5m1R4p7o9Q4m1P9k7m6J5m5P7L3j0l3m0J18p3l1k7L0k5l7N8q3J08n4Ko2J83
4927H5r6rm4n1J86J01q7j0j1q6L4Rk1n3O0j6p0J24j17l0J0J65j22Q1rp5N2N2j00
4956d8P5j12R5m6O3p9l1J75j43mK3J22o4J8n9J7j21Q4M5k8K8J4O6q9%n0Q5p1R4
4985E9J8j45R4l8j2P9o1J35j62o4J12n1%l3jKJ34j2j22M7J07r9MOK5m1l5p9J19
$$ y = [4, 72, 49, 44, 1, -47, -52, 8, -104, -22, 35, 15, -129, -68, -122, -27, 116, -41, -36, -113, 35, 125, 44, 62, -13, -151, -61, 31, 23, -42, 29, 16, 34, -21, -29, -49, 99, 46, 39, -20, 7, 12, 13, 0, -11, 13, -29, -4, 8, 31, 4, 113, 84, -37, -54, 104, -82, -54, -46, -49, 16, -40, -68, 21, -45, 61, 45, 21, -88, 1, -27, 80, 96, -115, 35, 19, -19, -53, 80, 0, 2, -4, 26, 47, 8, 73, -20, 42, 50, -47, 16, -28, 101, 8, -24, 4, 18, 42, -42, -43, -14, 20, -60, -20, -50, -77, -25, 44, -14, 103, -13, 8, -17, 132, 35, 6, -47, -99, 25, -16, 78, 1, -68, 16, -25, 54, 27, -19, -4, -49, 28, 61, 51, 18, -22, 96, 23, -8, -35, -5, -30, -67, -9, -92, 16, -38, -36, -98, 85, -11, -20, -64, -115, 71, 172, 85, 75, 64, -22, 12, 21, 0, -53, 7, -9, -79, 45, -72, -102, -92, 73, -49, 32, 23, -52, 0, 52, -48, 27, -85, 10, -36, 27, -52, -83, 92, -51, -55, -32, 90, 26, 44, -15, 2, -119, -35, 10, -18, 10, 24, 90, 1, 1, -49, 36, -35, 59, 77, -68, 26, -12, -24, 55, -6, 129, -33, -97, 15, -36, -36, -69, -70, -68, 66, 54, -68, -21, 86, -13, -9, -3, 22, -19, -54, -133, -14]
5014a4q9J20n3m2k0J93j61J38m5J06j76k8J09K3p4J9J36p2l7j16J40k1j37R8O5
5039F2k6K4o8J5J3O4l9r4L8K7q0J28r4M8oj16O7n4J21PP6j48j9K3L3R4q1L4r4
5068d5j3N5J3n5lM9M6j03L6K5O2lj10n9J50j77J23m0Q5L1onL4q5K9J9n0L2L4n6
5098A3L6j27J48L9j65P8j06J62Mkk0j81K32m7j0j7P2k3m4q7P7o8Qj5J07o2m9m5
5126i2P9lo2J24l7m2L7jL3pl3OMM1%J0K6k0o6N2l0k9O0n2N6R3j41r7J33oK4Lj07
5159d4L9j8O6kq0J41m6n5J4k1k3o2J24o1j3M5rL4q4J6KQ5L6k20K33j23j8J4J01
5188G1L4j06j7m8L1l5Q6k4q9R8j5L0O9j39ljN4j8O8j82R7L8q5k2J50j54J34j05
5216h3P5q7O9J3j03J82m8q6M7J03r9k0L5j5j17J82q9J06l4k7J7m7r2J90r4p2Q4
$$ y = [-14, -103, 17, -36, -78, -98, 95, -66, 72, 27, 133, -43, -71, 38, 61, -13, 6, 142, 70, 33, -83, 57, 36, -101, -3, 62, 36, 60, -8, 7, 20, 84, 45, -49, -11, 16, -64, 64, -30, 18, 12, -104, -37, -91, 30, 37, 113, -35, -54, -31, 2, 96, 15, 49, -45, -58, -3, 10, -45, -48, 1, 47, -56, -20, 5, 67, 64, -46, -105, 45, -132, -9, -49, 36, 67, 61, 56, 90, 5, 34, 53, 3, 35, 69, 13, 49, -78, 70, 109, -56, 22, -84, 78, 82, 80, 60, -121, 111, 64, 54, 37, 109, 86, 42, -45, 32, -36, -28, -43, 64, 2, -47, -92, -13, -16, -78, 46, 9, -33, 4, 3, 36, 29, -4, 2, 6, 47, 47, 57, 83, 63, -3, 49, 19, -10, 50, -2, 54, 147, 6, -91, 42, 36, 60, 63, -44, -5, -23, 43, 41, -39, 102, 56, 1, 15, -6, -29, -91, 33, -28, -41, 4, -5, 29, -55, -39, -37, 48, 84, -136, 97, -26, -44, -30, 71, 105, -1, -18, -66, -35, -70, 16, -8, -97, 1, -14, 16, 85, -54, -57, -58, -4, -22, 46, -136, -39, -1, -86, -108, 42, -112, 22, -83, -8, -95, -26, -13, -116, 66, 18, -68, -21, 82, -17, -37, -2, -17, -134, 48, -41, 65, 31, 4, 21, -26, -118, 72, -22, -94, -10]
5243a0l0P2N4r0jJ5P5j00K0K9L0k6m8k7lK3q7J41Q1j61L0o4J54j94J00N5J2j9
5271C1J4m4L6l8nm4M6M3j06J45j82M4P3LK5p8M2j1R0q3m1k2P4M6q4M3j53P5O6
5300Ep6j8mLN4o4J65p2m6M7jj24M9J03L1K1j16N6L7K2j26Q3%l1N4j61J28j2j31
5329a24J40Qn7J20j02M7jl6q2J68n9J6k2q5P8J0l4K6n0M2or4J86m4l7k5M0J2r5
5358f0J20Nq9P7l5j1M6n2K2J47j16q4J2Q1m4k6M0k2q8j5M3N4n4M1J8n7J13j32
5386f6K3J2N9l8L3q8K9N8k0k8J61r3p3K3J31j12o1NN3m2Q1ln2J7J9J3p2O5j9M0
5416E5l7k4K4j06K6O7JJ2Q2j20P3n8j0k8O6l9k2Q0n2R9j17J04k6j04J8J16n4L5
5444F1PJ8m7q8L3N8K8pJ05j72n5O9l7k0L2J0L2k3j17J17L4j13kO1PP9j11K6J00
$$ y = [-10, -40, 32, 86, -4, -5, 10, 85, -15, 5, 34, 64, 38, -10, -37, -40, -17, -104, 37, 118, -43, -13, -77, 77, -117, -17, 38, 50, 31, 45, 1, 37, -1, -6, -50, -4, 39, -67, 78, -104, -60, 13, 16, 41, -37, 5, -6, 84, 1, -40, -62, 12, 58, -26, 17, -136, -61, 5, -71, -89, -93, -90, -36, -100, 65, -7, -53, -6, -7, -131, -82, 21, 52, 73, -43, 13, 50, 72, -54, 29, 29, -2, 52, -109, 19, 7, -124, 16, 24, -33, 87, -15, 32, 31, -5, -87, 81, 22, 38, 16, -69, 9, 19, -15, 11, -39, 3, -3, -97, 89, 45, 8, -17, 23, 35, -60, 60, 65, -24, 53, 18, 7, 53, 1, 23, 170, 54, -30, -18, 63, 19, -7, 33, 11, -77, -92, -49, 5, -49, -8, 10, -47, 66, -66, -43, -31, 28, -10, 23, -65, -36, 22, 2, -26, 135, 42, -31, -8, 123, 11, -50, -45, 8, -34, 47, 44, -8, 9, 28, 41, -31, 34, 15, 55, 18, -6, 18, -88, -62, 5, 6, 18, 100, -20, 53, -5, -15, -43, 23, -16, -38, 42, -10, 89, -28, 76, 50, -54, -36, 80, 26, 61, 68, 86, 39, -49, -16, 42, 70, 63, 168, -4, -59, 10, -27, -47, -15, -5, 27, 4, -113, 4, 38, -75, -77, -16, -9, 70, -41, -15, 85]
5473H5q4k2OQ8j50J38q9m5J10n6k1m1J41K2j58Q7m0O1o3ml0O9m0J14j03lN4J5
5501D1k8p1O5n0r1J46N4q4p4O3L7o7K2O3l9J06q7k4P3j33N8M3o1j3M6l9L4k8P3
5530C5m7m3Q2o1p5J14Qp1M6J4K4m9k4Jl8K5J47j29P3k5mm4M2Q4j08o9R2L0j52
5559a22O3J52j08K2k1N9r0m5o8K50j10L8M3r4OO8m9J2Rk6O7k5j06R1k0KJ1p3O6
5588BkL9p9j6Q7k0j5K2p8Q1po3n6J63L6m5q0P3l1n4p0Q9J9k1k1P7m4L0Jr5k2J04
5620DMj42L7O4N0L1On9nQ1m6l1On9O8K9n4r0N1m5n7O2J05j44J80p9J06j91J23
5649Em9J5K9k3j02P7J14j09N9n1m5J0J26j11O6r5Q2P1J4j36L8j2J01Kl6o4M1L8
5677E5k6j0J6m7m8J17j26Q3n9j4K25k14M9J21j91K04m7j38J46q3R2k4r0J7K2p1
$$ y = [85, 1, -21, -15, 73, -77, 61, -28, -73, 37, -19, -40, -81, 60, 82, -76, 11, -29, 32, -31, -35, -65, 4, -36, 78, -25, -28, 26, 41, 13, -58, 7, -43, -134, 12, 66, -18, -92, -29, 8, -59, -37, 26, -13, 93, 6, -18, 55, -78, -20, 23, -38, -51, -5, -44, -10, -38, 35, -12, -55, 27, -34, -109, 5, 13, -58, -12, 2, 26, -23, -47, -46, -84, -59, 88, -41, 32, 7, 3, -41, 1, 85, -23, -92, 0, 30, -122, -59, 93, -15, 7, -14, 45, -45, -90, -158, 92, -18, 20, 63, -31, -25, 43, -6, 6, 15, -11, 56, 31, -75, 16, -4, -2, 9, -64, 2, 0, 39, -40, -56, 31, 11, -4, 18, -60, 21, 14, -49, -105, 58, 94, 49, -31, 42, 11, -43, -113, -24, -5, -26, -47, 30, -14, 16, 17, -78, -100, 4, 8, -134, -97, -33, 17, 48, 54, -5, -10, 71, 25, -6, 0, -59, 9, 38, -16, -106, -55, -100, -157, -95, 10, -134, 46, -33, 73, -118, 5, -44, -29, 0, -23, -125, -48, 66, -43, 16, -35, -80, -70, 56, -55, 11, -84, -2, 69, 83, -53, -15, -27, 74, 76, 40, -24, 17, 55, 29, 19, 35, -12, -60, 57, -69, 14, -45, -59, 166, -48, 1, 122, -69, 135, 88, -50, 96, 13, 105, 81, -9, 8, 30, -41]
5703d1k1J46n7k1m6kP6L1r8j4l4K8J4L9q0R7l3J9q5J00n7J02j36N2p7O8%r4K12
5732H8p9j3l8rK9L7l9PlP2l7q8R7R7j31K6m6Q1K7j26J3K6OQO1j21KL2R9r6po5
5764i0J4J15j56J19J26j58R6k7oJ0n0L2j40P8O8q8nJ3N1j2M3l1k8N4m9qR2j51
5792h8l0J45j12lJ74k0J4L5m3j84J08j31Q0j5M7M8k8QM1J3p1mm8Q0k6M1o0k1O8
5821A8J6j27R2o1P6JK3j31P8j00Q7L8R2j01q7J24n2L5o2J09q8NP3r3M6N1m6J9
5849C5l4j07N8J15r9RQn7N3J2M6MQ1j31MJ7n7M8k3J29p7j5o1K0NO4N4j48L2k4
5879c9Q9n5M9m6q6J20j0j30K0M2kO8j38J80q7P7p1O1%q1m1j3J73j11J4P0Ol2j07
5908h0N9n9J13N9j25Q8m4L3j6O1r0RO6J9j02p4N0J23l2q4N5p7P5o6N1O6j02l3
$$ y = [-41, -62, 84, 27, 6, -40, -42, 34, 65, -33, -47, -81, -53, -39, 0, -80, 17, -16, 3, -82, 18, -39, 63, -73, -21, -98, -30, -30, -124, 88, 9, -4, -42, -51, -22, 15, -24, -17, -20, 52, 15, -73, 24, 121, -10, 16, -30, 51, 78, -48, -35, -9, -3, 5, 66, -55, -53, -21, 78, -18, -25, -90, -76, 39, -117, 2, 128, -30, 66, 39, 33, 43, -7, 25, -115, -37, 31, -57, -62, -49, 2, -10, 33, 2, -26, 28, -21, -29, 63, -88, -118, 27, -85, -88, 86, 66, 80, 115, 72, -112, -4, -135, -55, -70, -23, 25, -3, 5, 46, 59, -12, -16, -64, 16, -10, 31, -29, -50, 18, 34, -93, -1, -62, 14, 15, 38, -93, -15, -115, -28, 10, 102, 1, -86, 38, -14, 21, -41, 68, -20, -15, 58, -35, 11, 62, 16, 35, 1, -106, -48, 67, -32, -23, -15, -72, -19, -7, 39, 43, 124, -7, -3, 14, -43, 5, -18, 111, 34, 19, -42, -22, -17, 47, 101, -47, -15, -39, 50, -5, 44, -2, -88, 32, 22, -108, -88, -46, -48, 20, -118, 62, -25, 52, -19, 42, 42, -39, -80, -93, 80, -31, -17, 53, 59, 27, -80, -21, -80, 33, 92, -33, 55, 11, 44, 28, 89, -1, 8, 74, 93, -9, -83, -33, 90, 58, -26, 29, -48, 27, -39, 12, 78, -24, -57]
5936e7j7jk5J33j9J5j07J61j07M9n6j0P5q5P2P8o2q2O5N2P9n5j7n1m5K5M5r5P0
5965B8j2N4Nj55N3R3Pj75Q1O1j12M0%R3j6Rm1no6L5k0R5k7M2j30J36q0J63j15
5994D1ok0j02K4J6J46j38L6m4J50q6O8k11J05O1J18k84M8R2j0j08J54lj07k3K6
6020e7J14m1J04j20k4R6j41KJ39l4l9Q0J0p4l6QL8J04j49q9J76o6r2j7j1O8N7
6047Fr7R5n5P5r8J18l2J2n9L3MMJq8J41p3m0n5J10k9n4L2mL2J56n8r8n4J02K5
6077E2m2oR1p0l3J3N5r0N1P9p7m8jK0k7J02rK1j72K39j05nj7k0N7k1k0j15R8K5
6107B5n8J31o0j31J45k8m8P5p7Q0j0O3j48m0J90m5k8p8M4j2Q1J6j50O3QJ7p1m2
6135h8J14l8Q3k2m6r1J0m9J42m0J9O5j30J59j98J02j04%P2R1q8p1J19k0N5j3m4
$$ y = [-57, -74, -75, -100, 33, 14, 29, -78, 83, -24, 25, -31, -41, 34, -51, 21, 99, 37, -45, 20, 72, 151, 96, 79, 28, -17, 8, 53, -42, 28, 16, 70, 75, -80, -27, 66, 73, -102, -21, 40, -72, -32, -32, 61, 45, 54, 13, 8, -58, -23, -43, 52, 25, 67, -63, 73, -7, 156, 41, 35, 15, -87, -63, -47, 99, -39, -3, -47, 103, 17, 85, -126, -21, 40, 158, -126, -78, 14, 4, -104, 50, 47, -60, -83, -57, 57, 16, 120, 0, -24, 72, -69, -67, 72, 38, -1, 79, 89, 15, -21, -13, 25, 129, -20, -109, 67, 1, -91, -108, -119, -51, 6, -91, 4, -51, 24, -74, 44, 12, 24, -35, -2, 2, 6, 7, -81, 60, -13, -53, -108, 2, -27, -81, -49, -53, -21, 135, 77, -21, -75, 27, 52, 10, 4, 95, 25, -8, 5, 60, -30, 21, 100, 23, -25, -26, -6, -33, 69, 60, 81, -91, 148, 43, 38, 21, 1, 58, 37, 17, -98, 0, 25, -33, 98, 38, -93, 52, 24, -24, 51, -26, 54, 44, 107, -41, -81, 109, 64, 36, -42, 2, -10, 71, 87, -63, 0, 8, 25, -46, -88, 26, -12, 71, 49, 3, -88, -78, -127, 15, -25, -6, 59, -71, 88, -110, -8, -112, -112, -40, 51, -37, -108, 11, -9, 46, 33, -11]
6162a1K8j3r7M8J07j51J72o4n0R2m0Nj13J28o7k9J6k6o4J59j56J25l1k8Q1l6J27
6189A12k28K22p8j25J36r3L3J10k5j65O8P1j8M1k2oJ3J0j71J47j22p3J10MN0k0
6215a9O8j8O4q7j5j6nr5O3J24n7Kj10J26olq8M2k6Pl1K37j23o8L3O0Rk9q4O7o7
6246d5N5J6o7J77j27P9m7Q8j91J07L2j31n0R6K3J5N0r3k6J8J50j12j14R9j7N3
6272C8M9j15J01q3P5j53M9lK1L1j35J29Q3m7q2KR7r9J09q4QN3l9N9m9l7J81j80
6300b1L9q4j8P8jj9O2q3L1O1M1m6n2R1j14j15J87p7K7Q4k4K5j23J45j57Q8L6l7
6328B4oj0n9J41K9n9l1J6p1O3j00N4n8P9m3k4O2ML6n5L9o7Kl8J24p9J19r7N6o9
6358a8OJ43n4oq2j02J21L4P8o5j3Q6o8o6O6J9j22M1JO7Rj50K8l1oJ30n4K7O1j39
$$ y = [-11, 17, 4, -93, -45, 62, -89, 83, 19, -31, 61, 21, 26, -87, 41, -26, -55, -39, -65, -129, 30, -126, -1, -32, -60, 21, -15, 112, -116, 106, 28, -97, 39, -54, -21, 89, 64, -101, -33, 38, 20, 61, 39, 33, 46, 56, -115, 32, -90, -163, -53, -49, 1, -19, 49, 31, 95, 8, -7, -23, -28, -123, -60, 64, 7, 9, -101, 25, 19, 16, -72, -30, -56, -49, -80, 157, 34, -34, -1, 59, 68, 39, -45, 22, -45, 10, 26, -41, 136, 9, 88, 41, 129, -62, 45, 77, -54, -104, -8, 15, 30, 80, -13, -39, -21, 129, 17, -97, 2, -15, 38, 87, -28, 73, -10, 65, -88, -39, -42, -21, 10, -125, 4, 87, 40, -42, -40, 57, -42, 67, -17, -9, 44, 5, 64, 15, -22, 159, -21, 18, -66, -84, -6, -7, -26, 36, -47, -16, 45, 86, 40, -12, 79, -35, -150, 37, -40, -13, 71, 47, 72, -51, 94, -63, 25, 61, 24, 18, 8, -51, 90, 119, 60, 29, 45, -26, 37, -63, -9, -67, 12, -31, -55, 7, 11, 47, -8, 31, -36, -34, -72, 52, -27, 92, -5, 51, -18, -12, 131, 77, 71, -11, -113, 8, 42, 120, 55, 42, 128, 60, -6, 60, 79, -43, -2, -1, 66, 75, -75, -47, -78, -84, 46, -8, 19, 80, -59]
6388e9J74j28l6O6N4m9%M0j19M0P6k7J4Jrr8M9K2M1K5l6Ok5P6j32J6P8r5O3r1
6418f3P1L3p1J5N3l9K6r2O4n8p4J23Ok0J8P7K7j11j8l4R9k6O0j62J47Mq1J3O3
6447E0j7l2M3p3k5P5k3k7K3N8r0L7O7J9j5q9Q8j08J7Q0o2n0%K12j44L6k7Pk3O3
6477G0o0oOQOQ6Q6k80J7P3N4m3n2r9K93j85R3r6J5J13p0L1n6j30R6K4Q4N4n7m4
6507C1j2j2K7n4J03n2l3p4J26q3O2nJ3M0j09qJ34r6j6N1o2OJ63j76K9l3J00l0
6535C0k5rQ6r7l6J68j61O8MP4j61J28J9p9k3N5kl3l7N2Km0nO9j00nom5J57k7m0
6566a9K3l4p5J81o2m4J04j14N4J00k44J73J01j46m2L7O2o9M9Ll4R5o4O6n4j00
6592e3j6N6j2O2J8j31K4Q8k8J1R1k2p7j10Q7M2K6j2N5n0JK4rol4j4M5r7J66n5
$$ y = [-59, 115, -13, -49, 17, 71, 22, 22, 62, -57, -17, 59, 32, 46, 47, 38, -60, -11, 11, 52, 77, 41, 47, 22, 98, -34, -18, 60, -35, 28, -63, 8, 41, -30, -15, 38, -1, 25, -67, -3, -61, -135, -12, -6, -26, -8, 69, 96, -15, -33, -67, 32, 6, 66, -96, 51, 55, -26, -13, 50, 33, 1, 44, -29, -54, 21, -2, -29, -6, 52, -38, -1, 66, 85, 70, -19, 69, -39, -22, 58, -4, -54, -54, 158, 14, 50, 23, 30, 7, 70, 10, 4, 10, 18, 24, 110, 196, -84, -67, 6, 60, 17, -35, -134, 159, -26, 67, -29, -14, 99, 29, 60, 4, -126, -30, -6, 78, 132, 75, 31, 19, 7, 34, -20, 83, 31, -2, -76, 50, -33, 29, 24, 37, 77, -32, -40, 94, -2, -18, 33, -29, -23, 140, -36, -7, -40, 60, 30, 5, -4, 82, -15, -51, 117, -44, 24, 28, 102, -59, 69, 88, 9, -14, 41, 39, 6, -31, 21, 23, -17, -22, 47, -53, -58, -64, -109, 48, 21, -19, 4, -30, -105, 76, 14, -30, 74, -40, 14, 114, -130, 43, 144, -2, -44, -7, 55, -14, 35, 38, 4, 99, 35, 101, 47, -53, -69, -13, -25, 37, 55, -76, -52, 36, 8, 19, 110, 88, 11, -99, -12, 30, 56, 44, 99, 49, 50, 74, 65, 59, 25, 11, 56, -41, 125, 70]
6622G0q8J09q4j9ok0L3l1J33j81Q5P3p3O0m3KL5p3J1k2l1Nn5J36j3o8j35K29L
6651D2j03J21l2L8j0j04L1N1lj7J04p8N1J7j38m7J5P6j24R7N6J7r3L6r4J35L4
$$ y = [70, -18, 91, 7, -12, -18, -38, -5, -36, 97, -84, 1, 74, 1, 61, 18, 20, 55, -18, -7, -29, -60, -55, -110, 26, 13, -55, -190, 39, 42, -61, 60, 28, 66, 56, -48, -17, 34, 31, 14, 118, 40, 91, 108, -30, -77, -62, 14, -110, -13, 43, 60, -33, 3, -91, 44, 78]
$$ [...]
8191i0
##END NTUPLES=NMR FID
##END=
