##TITLE=1H_DE-80H_X3
 200.13MHz, d2o
 8 sc
 
 19ns.26.2.2025
##JCAMPDX= 6.0         $$ Bruker NMR JCAMP-DX V2.0
##DATA TYPE= NMR FID
##DATA CLASS= NTUPLES
##ORIGIN= UXNMR, Bruker Analytische Messtechnik GmbH
##OWNER= pz
$$ XWIN-NMR		Version 3.5
$$ Tue Mar 10 12:00:55 2026 Russian Standard Time (UT+4h)  Yarkov@DPX200
##.OBSERVE FREQUENCY= 200.1313
##.OBSERVE NUCLEUS= ^1H
##.DELAY= (6, 6)
##.ACQUISITION MODE= SIMULTANEOUS
##.ACQUISITION SCHEME= undefined
##.AVERAGES= 8
##.DIGITISER RES= 18
##SPECTROMETER/DATA SYSTEM= spect
##.PULSE SEQUENCE= zg30
##.SOLVENT NAME= CDCl3
##.SHIFT REFERENCE= (INTERNAL, CDCl3, 0, 14.3821)
##AUDIT TRAIL= $$ (NUMBER, WHEN, WHO, WHERE, WHAT)
$$ ##TITLE= Audit trail, XWIN-NMR		Version 3.5
$$ ##JCAMPDX= 5.01
$$ ##ORIGIN= Bruker BioSpin GmbH
$$ ##OWNER= Yarkov
$$ C:/Bruker/XWIN-NMR/data/yarkov2/nmr/H-C/1/audita.txt
$$ ##AUDIT TRAIL=  $$ (NUMBER, WHEN, WHO, WHERE, WHAT)
(   1,<2026-03-10 12:00:13.28 +0400>,<Yarkov>,<DPX200>,
      <created by zg, POWCHK disabled, PULCHK disabled
       configuration hash MD5:
       00 E9 B6 7A A2 85 ED C7 34 08 36 98 17 FE 4E 26
       data hash MD5: 16K
       E6 10 0E 8F 51 51 83 9C C4 FC 22 2B D1 2A 0B 3B>)
$$ ##END=
$$ 
$$ hash MD5
$$ E4 C7 BD 0F 82 95 CB 1C C1 CD 82 DD 1D 5B 6B 48
##$RELAX= 
##$RELAX= 
##$RELAX= 
##$RELAX= 
##$RELAX= 
##$RELAX= 
$$ Bruker specific parameters
$$ --------------------------
##$DU= <C:/Bruker/XWIN-NMR>
##$EXPNO= 1
##$NAME= <H-C>
##$PROCNO= 1
##$TYPE= <nmr>
##$USER= <yarkov2>
##$AMP= (0..31)
100 100 100 100 100 100 100 100 100 100 100 100 100 100 100 100 100 100 
100 100 100 100 100 100 100 100 100 100 100 100 100 100 
##$AQSEQ= 0
##$AQ_mod= 1
##$AUNM= <au_zg>
##$AUTOPOS= <>
##$BF1= 200.13
##$BF2= 200.13
##$BF3= 200.13
##$BF4= 200.13
##$BF5= 200.13
##$BF6= 200.13
##$BF7= 200.13
##$BF8= 200.13
##$BYTORDA= 1
##$CFDGTYP= 0
##$CFRGTYP= 5
##$CHEMSTR= <none>
##$CNST= (0..31)
1 1 145 1 1 1 1 1 1 1 1 1 1 1 1 1 1 1 1 1 1 1 1 1 1 1 1 1 1 1 1 1 
##$CPDPRG= <>
##$CPDPRG1= <>
##$CPDPRG2= <>
##$CPDPRG3= <>
##$CPDPRG4= <mlev>
##$CPDPRG5= <mlev>
##$CPDPRG6= <mlev>
##$CPDPRG7= <mlev>
##$CPDPRG8= <mlev>
##$CPDPRGB= <>
##$CPDPRGT= <>
##$D= (0..31)
0 0.7 0 0 0 0 0 0 0 0 0 0.03 0 0 0 0 0 0 0 0 0 0 0 0 0 0 0 0 0 0 0 0 
##$DATE= 1773129612
##$DBL= (0..7)
120 120 120 120 120 120 120 120 
##$DBP= (0..7)
150 150 150 150 150 150 150 150 
##$DBP07= 0
##$DBPNAM0= <>
##$DBPNAM1= <>
##$DBPNAM2= <>
##$DBPNAM3= <>
##$DBPNAM4= <>
##$DBPNAM5= <>
##$DBPNAM6= <>
##$DBPNAM7= <>
##$DBPOAL= (0..7)
0.5 0.5 0.5 0.5 0.5 0.5 0.5 0.5 
##$DBPOFFS= (0..7)
0 0 0 0 0 0 0 0 
##$DE= 6
##$DECBNUC= <off>
##$DECIM= 32
##$DECNUC= <off>
##$DECSTAT= 4
##$DIGMOD= 1
##$DIGTYP= 9
##$DL= (0..7)
0 120 120 120 120 120 120 120 
##$DP= (0..7)
150 150 150 150 150 150 150 150 
##$DP07= 0
##$DPNAME0= <>
##$DPNAME1= <>
##$DPNAME2= <>
##$DPNAME3= <>
##$DPNAME4= <>
##$DPNAME5= <>
##$DPNAME6= <>
##$DPNAME7= <>
##$DPOAL= (0..7)
0.5 0.5 0.5 0.5 0.5 0.5 0.5 0.5 
##$DPOFFS= (0..7)
0 0 0 0 0 0 0 0 
##$DQDMODE= 0
##$DR= 18
##$DS= 0
$$ [...]
##$SUBNAM2= <"">
##$SUBNAM3= <"">
##$SUBNAM4= <"">
##$SUBNAM5= <"">
##$SUBNAM6= <"">
##$SUBNAM7= <"">
##$SUBNAM8= <"">
##$SUBNAM9= <"">
##$SW= 18.0517328524113
##$SWIBOX= (0..15)
0 0 2 0 0 0 0 0 0 0 0 0 0 0 0 0 
##$SW_h= 3612.71676300578
##$TD= 16384
##$TD0= 1
##$TE= 0
##$TE2= 300
##$TE3= 300
##$TEG= 300
##$TL= (0..7)
0 120 120 120 120 120 120 120 
##$TP= (0..7)
150 150 150 150 150 150 150 150 
##$TP07= 0
##$TPNAME0= <>
##$TPNAME1= <>
##$TPNAME2= <>
##$TPNAME3= <>
##$TPNAME4= <>
##$TPNAME5= <>
##$TPNAME6= <>
##$TPNAME7= <>
##$TPOAL= (0..7)
0.5 0.5 0.5 0.5 0.5 0.5 0.5 0.5 
##$TPOFFS= (0..7)
0 0 0 0 0 0 0 0 
##$TUNHIN= 0
##$TUNHOUT= 0
##$TUNXOUT= 0
##$USERA1= <user>
##$USERA2= <user>
##$USERA3= <user>
##$USERA4= <user>
##$USERA5= <user>
##$V9= 5
##$VALIST= <valist>
##$VCLIST= <CCCCCCCCCCCCCCC>
##$VD= 0
##$VDLIST= <DDDDDDDDDDDDDDD>
##$VPLIST= <PPPPPPPPPPPPPPP>
##$VTLIST= <TTTTTTTTTTTTTTT>
##$WBST= 1024
##$WBSW= 4
##$XGAIN= (0..3)
0 0 0 0 
##$XL= 0
##$YL= 0
##$YMAX_a= 114824
##$YMIN_a= -111378
##$ZGOPTNS= <>
##$ZL1= 120
##$ZL2= 120
##$ZL3= 120
##$ZL4= 120
##$ABSF1= 10
##$ABSF2= 0
##$ABSG= 5
##$ABSL= 3
##$ALPHA= 0
##$AQORDER= 0
##$ASSFAC= 0
##$ASSFACI= 0
##$ASSFACX= 0
##$ASSWID= 0
##$AUNMP= <proc_1d>
##$AZFE= 0.1
##$AZFW= 0.1
##$BCFW= 1
##$BC_mod= 2
##$BYTORDP= 1
##$COROFFS= 0
##$CY= 83.5205535888672
##$DATMOD= 1
##$DC= 2
##$DFILT= <>
##$DTYPP= 0
##$F1P= 10.8118882576601
##$F2P= -7.23987719738617
##$FCOR= 0.5
##$FTSIZE= 0
##$FT_mod= 4
##$GAMMA= 1
##$GB= 0.15
##$INTBC= 1
##$INTSCL= 1
##$ISEN= 128
##$LB= 0.25
##$LEV0= 0
##$LPBIN= 0
##$MAXI= 10000
##$MC2= 0
##$MEAN= 0
##$ME_mod= 0
##$MI= 1.114404
##$NCOEF= 0
##$NC_proc= 0
##$NLEV= 6
##$NOISF1= 3.799351
##$NOISF2= 2.8
##$NSP= 1
##$NTH_PI= 0
##$NZP= 0
##$OFFSET= 14.38212
##$PC= 1
##$PHC0= -5299.148
##$PHC1= 6.821927
##$PH_mod= 1
##$PKNL= yes
##$PPARMOD= 0
##$PSCAL= 0
##$PSIGN= 0
##$REVERSE= no
##$SF= 200.129724274929
##$SI= 16384
##$SIGF1= 3
##$SIGF2= 2
##$SINO= 400
##$SIOLD= 16384
##$SREGLST= <1H.CDCl3>
##$SSB= 0
##$STSI= 0
##$STSR= 0
##$SW_p= 3205.1282051282
##$SYMM= 0
##$S_DEV= 0
##$TDeff= 0
##$TDoff= 0
##$TI= <>
##$TILT= no
##$TM1= 0
##$TM2= 0
##$TOPLEV= 0
##$USERP1= <user>
##$USERP2= <user>
##$USERP3= <user>
##$USERP4= <user>
##$USERP5= <user>
##$WDW= 1
##$XDIM= 8192
##$YMAX_p= 0
##$YMIN_p= 0
$$ End of Bruker specific parameters
$$ ---------------------------------
##NTUPLES= NMR FID
##VAR_NAME=  TIME,          FID/REAL,        FID/IMAG
##SYMBOL=    X,             R,               I
##VAR_TYPE=  INDEPENDENT,   DEPENDENT,       DEPENDENT
##VAR_FORM=  AFFN,          ASDF,            ASDF
##VAR_DIM=   8192,          8192,            8192
##UNITS=     SECONDS,       ARBITRARY UNITS, ARBITRARY UNITS
##FACTOR=    0.0002768,     1,               1
##FIRST=     0,             0,               0
##LAST=      2.2672688,     0,               0
##MIN=       0,             -111378,         0
##MAX=       2.2672688,     114824,          0
$$ Real data points
##PAGE= N=1
##DATA TABLE= (X++(R..R)), XYDATA
0@%%%%%%%%%%%%%%%%%%%qJ6j6J6j6J6k4L2l2L8m6N1n9O8p6Q6r8J11j23J36j55
$$ 0 0 0 0 0 0 0 0 0 0 0 0 0 0 0 0 0 0 0 0 -8 8 -8 8 -8 8 -16 16 -16 22 -24 27 -32 36 -40 46 -52 59 -64 72 -83
40h3J75j93K14k38K64k93L23l55L93m33M74n23N77o35P02p77Q58r51J057j179
$$ -83 92 -101 113 -125 139 -154 169 -186 207 -226 248 -275 302 -333 369 -408 450 -501 556 -623
60f23J325j497J705j964K296k739L353m260N672j1233J22789r297j81038k8280
$$ -623 702 -795 910 -1054 1242 -1497 1856 -2404 3268 -7965 114824 105527 -75511 -103791
74a03791J16065N9543n6488l2849M00j3224J6338P1007o34r7658m3205R3010P9603
$$ -103791 12274 71817 15329 -17520 -17120 -30344 -14006 57001 56367 -41291 -84496 8514 88117
87H8117n9942r2427K0967P1388Q903l4024j6390n240r67K7839L1566l1968n4336
$$ 88117 28175 -64252 -43285 28103 37006 2982 -13408 -18648 -19615 8224 39790 7822 -46514
100d6514K1654O0033p805m5164L384K6592j6391j1539M1575J1017o8326k3923
$$ -46514 -24860 35173 27368 -17796 -14412 12180 -4211 -15750 25825 36842 -31484 -55407
112e5407P9332M4468p3911o3356N4087O5994l2990n0004K1112K3791k3181r13
$$ -55407 23925 68393 -5518 -68874 -14787 51207 18217 -31787 -10675 13116 -10065 -10978
124a0978M1397q767o5660M605Q6670J2271r1203l2998P8095M7985n5881n1052
$$ -10978 30419 21652 -44008 -39403 47267 59538 -31665 -64663 13432 61417 5536 -45516
136d5516L1677L7803j3106j5601J911q566l663K7227J5924l6007l0464L7176M1651
$$ -45516 -13839 23964 10858 -4743 -2832 -11398 -15061 12166 28090 -7917 -38381 -1205 40446
149D0446k8765m3937J5715L9199l577k7562q55J0473m882N642J6344j7322l1713
$$ 40446 11681 -32256 -16541 22658 19081 -8481 -9336 1137 -3745 1897 18241 919 -30794
162c0794J8619M6311j1572n7227J096N9294R005n0353j3497L7102J2698k5694
$$ -30794 -12175 34136 22564 -34663 -33567 25727 34732 -15621 -29118 7984 20682 -5012
174e012l471K0828r494k2366K0158K6784k3610l3667J8314L6901j1663l4157P934
$$ -5012 -8483 12345 2851 -19515 643 27427 3817 -29850 -11536 25365 13702 -20455 -12521
187a2521K4950q936j4725J4176J0918k0294j3314K6109J9652k5637k2724J7702
$$ -12521 12429 3493 -11232 2944 13862 -6432 -19746 6363 26015 378 -22346 -4644
199d644J9911p054j1994Q38q38n192J3140J5798k1154k7786J8526L6838p179l8494
$$ -4644 15267 8213 -3781 -2943 -3781 -8973 4167 19965 -1189 -28975 -10449 26389 19210 -19284
213a9284n012L2980J1898j9564q710M419J89M668J2096m121k4889m738L2041J4436
$$ -19284 -24296 8684 20582 1018 -7692 -3273 -3084 1584 13680 9559 -15330 -20068 11973 26409
227B6409l1540k2318K2369K5082j1214k2318L896J4635j813l175M751m945r196
$$ 26409 -5131 -27449 -5080 20002 8788 -13530 -9634 5001 3188 13 4764 -181 -9377
240i377P806J5922o019k1323K575K2645p29k0489r77J5140J122j2010M32J0311
$$ -9377 -1571 14351 8332 -12991 -10416 12229 11500 -8989 -9966 5174 6296 -5714 -5282 5029
254E029m175q910P566Q536q370p312Q182Q035p793p666Q993N887j0269l983J0217
$$ 5029 854 -8056 -490 8046 -324 -7636 546 8581 788 -6878 2115 8002 -2267 -6250 3967
269C967L249j1214n051J1999N559j2706n018J0613M222p274k925N976J019n458
$$ 3967 7216 -3998 -9049 2950 8509 -4197 -9215 1398 5620 -1654 -4579 1397 2416 -3042
283c042L510O584p099p489Q570R177p610j1658M388J2746k967j1430J056O942
$$ -3042 468 7052 -47 -7536 1034 10211 2601 -9057 -4669 8077 5110 -6320 -5264 1678
297A678R2k836M46O96l360O75Q202k38j0848m10J1153L422r783o126Q039N904
$$ 1678 1770 -1066 -620 76 -3284 -2609 5593 5355 -5493 -5903 5250 8672 -1111 -7237 802 6706
313F706o434l868L470J96j885J542K136k633m655M353O737m687o339L888O020
$$ 6706 272 -3596 -126 70 -1815 -273 1863 -770 -5425 -1072 5665 978 -5361 -1473 4547
328D547j444n453P62N285j686m385K861K200l457j919K626K405l385l044M223
$$ 4547 3103 -2350 -1588 3697 2011 -2374 487 2687 -770 -2689 -63 2342 -1043 -4087 136
343A36J844m179K01L535k93k832P0M508L71n338J48M673j24l063j291J510J549
$$ 136 1980 -2199 -1998 1537 1244 -1588 -1518 2990 3361 -1977 -1829 2844 2720 -343 -1634 -124 1425
360A425k055l15J466k011j236L352J089k391k487K197M374j769l528J622J906
$$ 1425 -630 -945 521 -1490 -2726 626 1715 -676 -3163 -966 3408 1639 -1889 -267 1639
375A639p13L6O9m97j441j19K794m34l683K50J995L43p41o67P37O9j234K143K352
$$ 1639 926 962 1031 534 -907 -1026 1768 1334 -2349 -2099 -104 239 -502 -1169 -432 -363 -1597 546 2898
394B898k371k594R71L640J431l870k677K070J799M54q15k588j291J437K954J304
$$ 2898 527 -2067 -1096 2544 3975 105 -2572 -502 1297 1751 936 -1652 -2943 -1506 1448 2752
410B752m090l836L160N032R61l866m527K455N604J264l595m865M30N726K349l926
$$ 2752 -1338 -5174 -2014 3018 3979 113 -4414 -1959 3645 4909 1314 -3551 -3121 2605 4954 1028
426A028m440o39L851L330j251l328l163Q51O498K845n488n934J606Q463L385o892
$$ 1028 -3412 -4051 -200 3130 1879 -1449 -4612 -3761 2737 5582 94 -5840 -4234 4229 7614 722
442G22o159K533O061K348m295m223L95J424K450K534l452o090j1P488N978o060
$$ 722 -5437 -2904 3157 5505 1210 -3013 -2618 -1194 1256 3790 338 -5752 -5763 1725 7703 1643
458A643r410K189R649L299n680p159J842P054J778l210m012j721K605L377J433
$$ 1643 -7767 -5578 4071 7370 1690 -5469 -3627 3427 5205 1995 -2017 -3738 -1133 2244 3677
473C677k420o750j056Q663N241o095r131R97J1551M582r126p394L877Q474J369
$$ 3677 1257 -5493 -6549 2114 7355 1260 -7871 -6874 4677 9259 133 -7261 -3384 5090 6459
488F459o629l442K977J050N98J802j768n139j439O874O124o767r823L987J0756
$$ 6459 -170 -3612 -635 415 1013 2815 1047 -4092 -5531 1343 7467 700 -9123 -5136 5620
503E620J468r002n357P165O609m280m927J765L110j155k085K323J262m997k047
$$ 5620 7088 -1914 -7271 -106 6503 2223 -2704 -939 2171 1016 -1069 1254 2516 -2481 -4528
518d528N617L052m353n102K029P170N0o837k057N269N221k913o302J595N799j312
$$ -4528 1089 4141 -212 -5314 -3285 3885 3935 -2902 -4959 310 5531 2618 -3684 -2089 3710 2398
534B398m045O58K696q24l394J932M097l796n594L036P391j09q827k880R920N706
$$ 2398 -1647 -989 1707 883 -2511 -579 3518 -278 -5872 -2836 4555 4446 -4381 -7261 2659 8365
550H365q380p372N408Q824k206p854N57M667j013j838K259j92m439j164O225M288
$$ 8365 -15 -7387 -1979 6845 4639 -3215 -2658 2009 996 -842 1417 1225 -3214 -4378 1847 6135
566F135p167p116M604R500P87r293n383P255P825k383p214k062M635M275j894
$$ 6135 -1032 -8148 -3544 5956 6743 -2550 -7933 -678 7147 4764 -2450 -4512 123 4398 2504
581B504l544j401K11K381K238n07l005l972J553P523J159p384m847N986Q848k895
$$ 2504 -1040 -2441 -2230 151 2389 1882 -1123 -5095 -3542 3981 5140 -2244 -7091 -1105 7743 4848
597D848r705J15P172J966l365k273J196l29j617K963L066n272n160L755P836j17
$$ 4848 -4857 -4742 2430 4396 1031 -1242 -46 -375 -1992 971 4037 -1235 -6395 -2640 5196 5079
613E079q935l430P843N316l129n102p62L461K766l75j519l403j204M607L397l182
$$ 5079 -3856 -7286 557 5873 2744 -2358 -3120 341 3107 2732 1213 -2190 -3394 1213 4610 1428
629A428n244j150M840M505k213n284j886M187O032j784o835j001N462M273k462
$$ 1428 -3816 -4966 -126 4379 2166 -3118 -5004 -817 5215 3431 -3404 -4405 1057 5330 2868
644B868n557j03L832J080q42j438j765K63J764J965r45m644n43N629K339l804
$$ 2868 -2689 -2792 1040 2120 1278 -160 -1925 -1662 102 2067 1122 -3522 -4065 1564 3903 99
660I9l662K000M609r74l111P02J130m88M11N78q01j838k86K390O55k514p54J030
$$ 99 -3563 -1563 3046 2072 -1039 -337 793 305 716 1294 493 -1345 -1631 759 1414 -1100 -1854 -824
678h24O65O60m49j053K50N08J479M67k021p35J360J457n9k197p43J561L66m31
$$ -824 -159 501 52 -1001 -751 -243 1236 1703 -318 -1053 307 1764 1705 -492 -1235 326 692 261
696B61l78j342j19J694J206j036k686N73L725K00k816n80J601J564m92j543q6
$$ 261 -117 -1459 -1578 116 1322 286 -2400 -1827 1898 2098 -718 -1298 303 1867 1375 -168 -254
713b54L41K91R20o87k051L4J459J016j278k005J045K304n71j254j75Q86J064m06
$$ -254 87 378 1298 611 -1440 -1406 53 1069 -209 -2214 -1169 1135 564 -690 -865 21 1085 679
731F79l33O9o50P35R34j135r86J26R71L07j552n00J363o3n35J06j46N78K65l23
$$ 679 346 415 -235 500 1434 299 -687 -561 410 717 -835 -1335 28 -35 -570 -464 -610 -32 233 -90
751i0O20m2o02Q82L7n17j0j10K99k53r72P33L39j083o3O85K5l22l33M24Q65n94
$$ -90 530 488 -114 768 805 288 278 168 467 214 -758 -25 314 -769 -832 -147 -122 -444 -777 -353 512 -82
773h2O1N93n53L21M94l11l7o02Q1R58q66j062O61L19J13n77q54J026L91l78L94
$$ -82 -21 572 19 340 834 523 486 -116 -35 923 57 -1005 -344 -25 88 -489 -1343 -317 74 -304 90
794I0j47k91Q14L91j96l75o47J310L77j328m34M18K94l0r33k10P61k90J04L31
$$ 90 -57 -348 466 857 661 286 -361 949 1326 -2 -436 -18 276 246 -687 -897 -136 -426 -322 9
814In64J20N41K13K39q21J42J270l28p27J51J13N5l58m92M63k71n44N29K7m16
$$ 9 -555 -435 106 319 558 -263 -121 1149 821 94 245 358 413 55 -437 26 -245 -789 -260 -233 -649
835f49K38J73L04j61l92R79M26r68K02M03K19k57p63K78N86p65j56L06n55j32
$$ -649 -411 -238 66 -95 -487 492 918 -50 152 555 774 517 -246 32 618 -147 -303 3 -552 -684
855f84L86K63n3q90L81J308n40o08O32L86K3l75N1P35p27p70R09J98q71m97L10
$$ -684 -298 -35 -88 -978 -597 711 171 -437 195 581 604 229 280 1015 288 -482 427 625 -246 -743 -433
876d33P64o09q97R09L48p62K93P66l7m66k48J299N40j547k52Q86J72l46o95j41
$$ -433 331 -278 -1175 -266 82 -680 -387 379 342 -124 -372 927 1467 -80 -332 554 726 380 -315 -456
896d56M96m22K5N16j091k41J136M39m04p73L03J415m09o13P53j57n70P61K23m17
$$ -456 40 -382 -357 159 -932 -1173 -37 402 -2 -775 -472 943 534 -79 674 517 -53 708 931 514
916E14j457LK163m61k401M43J617K4j226n68J572M63j524O77J507p36j291L96
$$ 514 -943 -940 1223 762 -1639 -1196 421 445 -781 -1349 223 686 -838 -161 1346 610 -681 -285
934b85J796M9k464r7K253l06j817o3Q59M50j061j13R24m94p45J302L83n82j26
$$ -285 1511 1560 -904 -1001 1252 946 -871 -934 -75 375 -686 -799 125 -369 -1114 188 571 -11 -137
953a37P7P64J00n93J00k96p1R29j54j491m47J220J216j587j973J801J876j424
$$ -137 -60 704 804 211 311 15 -56 873 719 -772 -1219 1 1217 -370 -2343 -542 1334 -90
971i0j338J123J482r82j370J970J310k749p02K757J025k829k054K259K774k371
$$ -90 -1428 -305 1177 195 -1175 795 2105 -644 -1346 1411 2436 -393 -2447 -188 2586 215
987B15k569J506J689p08j384N29J340o86j072J869Q63j957q98J647J645j204j848
$$ 215 -2354 -848 841 133 -1251 -722 618 -68 -1140 729 1592 -365 -1263 384 2029 825 -1023
1004a023P35J168n44k98k92r29M34J393j43j451o05J825R69j744r8J589n26r98
$$ -1023 -288 880 336 38 -254 -1183 -749 644 501 -950 -1555 270 1239 -505 -603 986 460 -538
1022e38P52J500q17k618J075L163j117l309r4K783J016k974j090K861L62k237
$$ -538 214 1714 897 -1721 -646 2517 1400 -1909 -2003 780 1796 -1178 -2268 593 955 -1282
1038a282M16J963l97k194O96L443o82l873O26L330k04k456o82J636O15j469J43
$$ -1282 -866 1097 700 -1494 -798 2645 1963 -1910 -1284 2046 1842 -614 -1296 340 955 -514 -371
1055c71O11j422J24J461L12j177q04J218J297r61q01R46m1k80O51J97j061j158
$$ -371 240 -1182 -1058 403 715 -462 -1266 -48 1249 288 -513 433 392 112 763 960 -101 -1259
1073a259J052K114j608k462J360K065j042j904P33K122j072j639J967J340k234
$$ -1259 -207 1907 299 -2163 -803 1262 220 -1684 -951 1171 99 -1540 427 1767 -467
1088d67j000K187J691j936k251J914K001k200j508J459Q99j057r78J262P81k108
$$ -467 -1467 720 2411 475 -1776 138 2139 -61 -1569 -110 789 -268 -1246 16 797 -1311
1104a311j74K410J97j905k02J795O91j827n20J840k56j284R91N51j199j030J019
$$ -1311 -1485 925 1122 -783 -985 810 1501 -326 -846 994 738 -546 445 996 -203 -1233 -214
1121b14J269j527j463J832J217j488p91J018R44r24n01J475N27j936Q0J748M7
$$ -214 1055 -472 -1935 -103 1114 -374 -1165 -147 797 -127 -628 847 1374 -562 -482 1266 1313
1138A313j951m80J955P63k607o07K220j68j649L65J505k87j843Q04K282j167j693
$$ 1313 -638 -1118 837 1600 -1007 -1614 606 438 -1211 -846 659 372 -1471 -667 1615 448 -1245
1155a245J402J442r81j435N67J647j105j393J338N92j405o05J120N96j187q57
$$ -1245 157 1599 618 -817 -250 1397 292 -1101 237 829 -576 -1181 -61 535 -652 -1509
1171a509J647R35j593m62J569M33j212l46J418K23j759K65J802j037j421M17J408
$$ -1509 138 1073 -520 -982 587 1020 -192 -538 880 1103 -656 -391 1411 374 -1047 -630 778
1188G78n03j620N45J695j096j115J296O65o98o19J052R21j179j014J611N65j405
$$ 778 275 -1345 -800 895 -201 -1316 -20 645 -53 -672 380 1301 122 -892 719 1284 -121
1205a21o10J179N17j233q93J486L72j706J43J352j47j265q1J894L5j675K41J940
$$ -121 -731 448 965 -268 -1161 325 697 -1009 -866 486 339 -926 -1007 887 922 -753 -512 1428
1223A428p68j182M83Q65k45j302M98J079r75j091J112M68q44o69Q54J026j038
$$ 1428 660 -522 -39 826 581 -721 -223 856 -119 -1210 -98 370 -474 -1143 -289 737 -301
1240c01p57J455N26j109j73Q88L02q99n22J482k9j677L40J101l47j146N3J212
$$ -301 -1058 397 923 -186 -359 529 831 -68 -590 892 863 -814 -474 627 280 -866 -813 399
1258C99j56j366O83J140p53o80Q26Q27m48r68O72J133j214o97R74K99q46n54P79
$$ 399 243 -1123 -440 700 -53 -733 93 920 472 -496 176 1309 95 -602 372 671 -175 -729 50
1277E0N46j134n51J382J05j091kJ031K32q37k22J166J16j278N06P16l65m95o0
$$ 50 596 -538 -1089 293 398 -693 -695 336 568 -269 -491 675 791 -487 19 735 370 -125 -185
1296a85P43l02j140N47Q75p19o80M26O35j54q36O73Q80q69k18R12J19o46l23O22
$$ -185 558 256 -884 -337 538 -181 -861 -435 200 46 -790 -117 763 -106 -324 588 707 61 -262 360
1316C60M51j018k88R13k65o48pN27J07p00j06R43j35p87N10Q18l73l21l6R88m03
$$ 360 811 -207 -495 418 153 -495 -502 25 132 -568 -674 269 134 -653 -143 675 302 -19 -55 933 530
1337E30q57N24N44o05m58K73J88k13p33M88O26p19j84O36R9j96j20L29M96n10
$$ 530 -327 197 741 136 -322 -49 139 -74 -807 -319 307 -412 -596 40 139 -57 -177 152 648 138
1357A38k23O76j39m85M8J83k2m42j51O60j61o63L07L41l37j31K36M41j10l75M39
$$ 138 -85 591 452 -33 15 198 176 -266 -417 243 82 -581 -274 67 -270 -401 -165 276 166 -209 230
1378B30M24n31jJ20K17k10m31J32M63o03j07K07j20k6q0K1M84n46R1M91j24r2
$$ 230 654 123 122 242 459 249 -182 -50 413 -190 -297 -90 -210 -236 -316 -295 189 -357 -266 225 101 9
1400IK14J62mk20j22L95k65k88K68k4l73ro0K02n4l24J94K49j15J9J57J99R9l63
$$ 9 223 385 381 161 39 434 169 -119 149 125 -248 -257 -317 -115 -169 -493 -299 -50 -165 -146 11 210 309 -54
1424e4J76L90l41j10Q6k8N3l80K3K08k71j34J37j7J28k3r9L80L7j21J51J4k0K04
$$ -54 122 512 171 61 147 119 172 -208 -185 23 -248 -382 -245 -262 -134 -157 -256 124 161 40 191 205 185 389
1448C89l35J21J33k71l9j8j21J53k38j01J78nr4K0l0L34L8k00J74K25j56J99j49
$$ 389 54 175 308 37 -2 -20 -141 12 -226 -327 -149 -154 -248 -228 -258 76 114 -86 88 313 157 356 207
1471B07n9J28j65j88J88o9k00j21l4L85k32m85M57L60l08N7j05M79O4l86J12M18
$$ 207 148 276 111 -77 111 42 -158 -279 -313 72 -160 -645 -188 172 -136 -79 -184 295 359 -27 85 503
1493E03l55n3Mj29K72m65M7L15j82l60J30O0K33j27k63L56J75k78K06j3J57N3
$$ 503 148 95 99 -30 242 -223 -176 139 -43 -403 -273 -213 20 -107 -370 -14 161 -117 89 76 233 286
1515B86j10R8Q7l56J68j83j59K94l39k08K81p2J06q8j36M15J35m10L63Q3K9L6
$$ 286 176 274 361 5 173 -10 -169 125 -214 -422 -141 -213 -107 -195 -331 84 219 -191 172 255 284 320
1537C20k37K5K69l98J3N3j27l2k48J49K10m3m31L69J28j73j15J94L91q0k78L55
$$ 320 83 108 377 -21 -8 45 -82 -114 -362 -213 -3 -46 -477 -108 20 -153 -268 -74 317 237 -41 314
1559C14J18m01N3L2Q1J8n19J28J58k75Q5j65O4J70pl9K60p2K8J30P2J6K4q0M5
$$ 314 432 31 84 116 197 215 -304 -176 -18 -293 -208 -373 -309 -139 -146 -185 75 3 31 161 233 249 273 193 238
1584B38j46n5J75l39r5L21l42j21Q6J87J63k98q6M35J05l49J21K63j63K30j30
$$ 238 92 37 212 -127 -222 99 -243 -364 -278 -91 72 -226 -312 123 228 -121 0 263 100 330 200
1605B00K2Q1l43Q0Q6j89Ol31J16L75m76J4M01j40p7J78J01J12j38L4L28k92k56
$$ 200 222 303 -40 40 126 -63 -57 -388 -272 103 -373 -359 42 -98 -175 3 104 216 78 112 440 148 -108
1628a08L52K0l48J63q4n1Ok07J34J3k03K23N4l8Q3j01J78K58l58K00K0J28k4j71
$$ -108 244 264 -84 79 -5 -56 -50 -257 -123 -110 -313 -90 -36 -74 9 -92 86 344 -14 186 206 334 310 139
1652A39%r9j91n3K97m15j30J84J94m1j65K25K74k59J9Q6J39K0n2M9L5j06j39K39
$$ 139 139 40 -151 -204 93 -322 -452 -268 -74 -115 -280 -55 219 -40 -21 65 204 224 172 221 256 150 11 250
1676B50k27j03j39P9N2j18j43K28Q3k44J96J90m4o3J26K34l3k96J30J60k75j07
$$ 250 23 -80 -219 -140 -88 -206 -349 -121 -38 -282 -86 104 60 -3 123 357 324 28 158 318 43 -64
1698f4M1ln1n6r1J42k03k0J92OJ52j69Q1L07J1k10K10j0q9n3p3J47j82j58K15
$$ -64 -23 -26 -77 -133 -224 -82 -285 -305 -113 -107 45 -124 -43 264 275 65 275 265 176 123 50 197 15 -143 72
1723G2r3l85K81M2o0j51Q7J61J54j96K66R0k45J78K1k6rk20J33J92k81j66P1m8
$$ 72 -21 -406 -125 -83 -143 -294 -207 -46 108 -88 178 268 23 201 222 196 187 -33 100 292 11 -155 -84 -132
1747a32O1j83j03M00k27n6J45M0O1M0J44o2J03j09J24j7l00K44j79l0j24m6P6
$$ -132 -71 -254 -357 43 -184 -240 -95 -55 6 46 190 128 231 122 246 229 -71 173 -6 -36 -160 -206 -130
1770a30j0j93Q5J82j97J50J40J7J33o4J5J60k08L5J68l17K00q2p8M3j59k44L20
$$ -130 -140 -333 -248 -66 -263 -113 27 44 177 113 128 288 80 115 283 -34 166 84 6 49 -110 -354 -34
1793c4n0k13K45L5j32K64j09K34k1k54J77Q8nJ9j17P7j52k32J45or2M7j46Q8m0
$$ -34 -84 -297 -52 -17 -149 115 6 240 219 -35 142 230 225 244 127 204 52 -180 -35 -41 -133 -86 -232 -144 -184
1818a84r8J83R9m6O8M2O2J05l7j05Q0m6r9J82k70Q2k5j35L7k25M9J83J56j99N1
$$ -184 -282 -99 0 -46 22 64 126 231 194 89 169 123 24 206 -64 18 -7 -142 -105 -330 -281 -98 58 -141 -90
1843i0n3K05P7j29J46J01l2lj49o4J38n2j85J86l37J01J99l04R4N9j20K42k7j64
$$ -90 -143 62 139 10 156 257 225 222 73 9 147 95 -90 96 -241 -140 59 -245 -151 -92 -212 30 3 -161
1867a61L74j80P5Qk0K61j82j24O2q2l4l5L1j84M8n7j00J56n6M3J50j08J88J70
$$ -161 213 33 108 116 96 357 175 51 113 31 -3 -38 -7 -191 -143 -200 -300 -144 -200 -157 -7 -115 73 243
1891B43k7j1k5QR8k53n3J37j69L5j12K0K8j26p1K59j80P8J36q1J33Q4j94J83J3
$$ 243 216 205 180 188 286 33 -20 117 -52 -17 -129 -109 -81 -207 -278 -19 -199 -121 15 -66 67 151 -43 140 153
1916A53r3J24o2L4j48l6M9qj61K7lo5R6n0o7J60J8l2K04j68O6J46j60J48P0k04
$$ 153 60 184 122 156 8 -28 21 13 -148 -121 -124 -189 -93 -143 -210 -50 -32 -64 140 -28 38 184 24 172 242 38
1942C8P8K0j12k1r2o3O1j39J57Mp6J53k8k75K52K82p5j39J46m1R1k78M6J02j68
$$ 38 116 136 24 3 -89 -152 -91 -230 -73 -69 -145 8 -20 -295 -43 239 164 25 171 130 221 -57 -11 91 -77
1967g7P2Kk50J99j2k04K04ojj10L3K30L9j28J73j5N9l9j46J14q5m7j05M1qk6%
$$ -77 -5 -3 -253 -54 -66 -270 -66 -72 -73 -183 -150 80 119 -9 164 149 208 169 23 137 52 5 -100 -59 -67 -93 -93
1994i3j58J79M0k39J73m4K36J9j32K02K6p2p6P3M8n9o3j72J94k23Q1J1k10J12
$$ -93 -251 -72 -32 -271 -98 -142 94 113 -19 183 209 137 61 134 182 123 60 -112 82 -141 -60 -49 -259 -147
2018a47k9K7K58k13R7J61j9l4k0k6J99r5m5L6Pk09K7r9Q3J28k16j1J36j09O4m4
$$ -147 -176 -149 109 -104 -7 154 135 101 81 55 254 159 114 150 157 -52 -25 -124 -41 87 -129 -140 -4 -113 -49 -93
2044i3J34L7K9m5K37j89l4L08l31P0Po4l4j23K6Q1k44l1K13Q3k14J21lM7R7j0
$$ -93 41 78 107 62 299 110 76 384 53 123 130 66 32 -91 -65 16 -228 -259 -46 37 -177 -56 -59 -12 85 75
2070G5J22j6j22L6K4O0j02n9j4J53k83n5J30q2Q1j44J55K18l64J19J81m3j74K44
$$ 75 197 181 59 95 119 179 77 18 4 157 -126 -181 -51 -133 -52 -196 -41 177 -187 -68 113 70 -104 140
2094A40J00n0r2o6J41j42q0R3q4l6M6l8L5j02m2J56J9j44J64J24r9N0j55L35J2
$$ 140 240 190 98 32 173 31 -49 44 -40 -76 -30 -68 -33 -135 -177 -21 -2 -146 18 142 43 93 -62 273 285
2119B85k82N7N1q0p6q1J11J5k67J45J03j13KJ12Q3o1j04K21J10j55pL8J76k12
$$ 285 3 60 111 31 -45 -126 -15 0 -267 -122 -19 -132 -130 -18 65 4 -100 121 231 76 69 107 283 71
2143G1n2l6J15k43o1J86n1m5r4J09K5m8N0J56N2j82J01J42q6r2R1P4l0l55K29
$$ 71 19 -17 98 -145 -206 -20 -71 -116 -210 -101 -76 -124 -74 82 134 -48 53 195 109 17 108 182 152 -203 26
2168B6M8k30P8k3j34J57k11J14K11k34J31K52j22o4O5R4M2k7k23J99j71j66K23
$$ 26 74 -156 -78 -101 -235 -78 -289 -175 36 -198 -67 185 63 -1 64 158 200 173 -50 149 -22 -188 35
2191C5K0L5j81NNLk78L55M9n2j04P8K67m1k01J28J15k33N6J07k18J1J39j40K6
$$ 35 55 90 -91 -86 -81 -78 -356 -1 48 -4 -108 -30 237 196 -5 123 238 5 61 168 -50 -39 100 -40 -14
2216a4k24NK53j99P9L6m2K09j26P9K27M0l76J45P9m2j02JR7jk68J17M4j40k9M4
$$ -14 -238 -233 20 -179 -100 -64 -106 103 -23 56 283 323 -53 92 171 129 27 28 125 124 -144 -27 17 -123 -152 -108
2242a08O6n2j38K23J34j18l8J94j42R1j36J22K4j19L2J16j81j54J35L7l2j47L7
$$ -108 -42 -94 -232 -9 125 7 -31 163 21 112 -24 98 122 3 35 151 -30 -184 -49 -12 -44 -191 -154
2265a54K50j12j84J97J79p4o4O8P1k7k35K19l7n6q3K3J7l4j56R2Q7j32K9M1M1
$$ -154 96 -16 -200 -3 176 102 38 106 177 150 -85 134 97 41 -42 -19 -2 -36 -192 -100 -13 -145 -116 -75 -34
2290c4K6l9J91K1k02J11J29r8n6m9P8o7l6j33J50j52m5J55j7n2l3P5J71q1n4J73
$$ -34 -8 -47 144 165 -37 74 203 105 49 0 78 11 -25 -158 -8 -160 -205 -50 -67 -119 -152 -77 94 13 -41 132
2316A32J00r9r2P3M7o4r0R0j07j14K2J02p0mm6M4J72k15L4J72J2N2m8j2J31j74
$$ 132 232 133 41 114 161 97 7 97 -10 -124 -102 0 -70 -74 -120 -76 96 -119 -85 87 99 151 103 91 222 48
2342D8M1J47k00L3K4m2pk02J60j15j27nK65q3m0K06q2J13j09L5K9o1rJ32j19j16
$$ 48 89 236 36 69 93 51 44 -158 2 -113 -240 -245 20 -63 -103 103 21 134 25 60 89 28 19 151 32 -84
2368h4J31j89J25L7j45Q7N1k32J15k2J37M5j00J68Pj86P6Oj1J05r3r3J67q9j61
$$ -84 47 -142 -17 20 -125 -38 13 -219 -104 -126 11 56 -44 124 131 -55 21 27 16 121 28 -65 102 13 -148
2393a48K46j23p3R8l6%n0pJ61n2PL9O3J21j77k8J33p2j8o3M1k51J29l0N0K1j40
$$ -148 98 -25 -98 0 -36 -36 -86 -93 68 16 23 62 125 246 69 41 174 102 84 21 62 -189 -60 -90 -40 -19 -159
2420a59J7P2m1J26k2oO3J68k46J15R6n8l7orl3o9N6p4q7P8K6m2O5l7J8R3o0K7
$$ -159 -142 -70 -111 15 -7 -13 50 218 -28 87 183 125 88 82 73 40 -29 27 -47 -134 -56 -30 -72 -7 -44 -26 67 7 34
2449C4n4N0j6J87k57J26kJ5O6k95N2J09j26M0P0l0n1j9m4J69O5j0p0K7J31m2k14
$$ 34 -20 30 14 201 -56 70 68 83 149 -146 -94 15 -111 -71 -1 -31 -82 -101 -145 24 89 79 9 36 167 125 -89
2476h9J82J26k96J60j75k9J59j49l5J48j60l2j4J05Q6J28j00P2r1Q2J27j59N8
$$ -89 93 219 -77 83 -92 -121 38 -111 -146 2 -158 -190 -204 -99 -13 115 15 87 -4 78 205 46 104
2499A04M0j70N9n3K2N4j22o8J70j23k2J36j38L1J11p5J41lR1r7o9K3J16p0p1k8
$$ 104 144 -26 33 -20 2 56 -66 -134 36 -87 -109 27 -111 -80 31 -44 97 94 185 88 19 42 158 88 17 -11
2525a1L3m8K4kj49J13n1J50q8o5J09N8o7N9j40K05m8M8k6j14N9k3j34J20N3j45
$$ -11 22 -26 -2 -4 -153 -40 -91 59 -29 -94 15 73 6 65 -75 130 82 130 104 -10 49 26 -108 12 65 -80
2551h0J2j54R2J06j07k8K58o9k8P9j08nJ88q0k8P7j39M3K3n2k6r9Q9l9r0J64P
$$ -80 -68 -222 -130 -24 -131 -159 99 30 2 81 -27 -32 156 76 48 125 -14 29 52 0 -26 -125 -36 -75 -165 -1 6
2578Fj72J38LL4L2k3L6Q0r0J27m8j52N3K4j28L2j0KM9j54O6M6M7oJ51n7k8Q5q3
$$ 6 -166 -28 -25 9 41 18 54 134 44 171 123 -29 24 48 -80 -48 -58 -56 -7 -161 -95 -49 -2 -8 143 86 58 143 60
2607F0J09j53M5J82k41O5p3L7j33J30j83K9M0j14J54JJ00j4m2K8R8q5J21o5j78
$$ 60 169 16 61 243 2 67 -6 31 -102 28 -155 -126 -86 -200 -46 -45 55 41 -1 27 125 40 161 96 -82
2632h2K39Lp8j3j50J21j01m3M2Pl7l0J49m0O3m7P0M0j78J01%n3J10o9JQ2j8j86
$$ -82 157 160 82 69 -81 40 -61 -104 -62 -55 -92 -122 27 -13 50 3 73 113 -65 36 36 -17 93 24 25 107 89 -97
2660i7J29j33RJ31j14lM6K0N5j30l0N1J66n2l6R5m5o5N6n9J50j59l9k4O6k25J18
$$ -97 32 -101 -92 39 -75 -78 -32 -12 43 -87 -117 -66 100 48 12 107 62 -3 53 -6 144 -15 -54 -78 -12 -237 -119
2687a19P0p7M5J10P5j86RJ11J30j62R5M8K5j08j27J25j4J5p4j58J26J6o5p8J11
$$ -119 -49 -126 -81 29 104 -82 -73 38 168 6 101 149 174 66 -61 64 50 65 -9 -167 -41 -25 -90 -168 -57
2712e7m8J43j00J11j1j60K43j8j31MO1K4k7n7J4n5J4j18K43j14o3j45K27n7N0
$$ -57 -105 38 -62 49 38 -122 121 103 -28 -24 37 61 34 -23 -9 -64 -50 -168 75 -39 -102 -247 -20 -77 -27
2737b7QJ53j22J4QJ9L8J8r8J40m5j79RP5q2P3j26N8m8M5J10q9j8K54j8K4j45J5
$$ -27 -19 134 12 26 34 53 91 109 11 151 106 -73 -64 11 -71 2 -124 -66 -114 -69 41 -48 -66 188 170 194 49 64
2765F4R5Mr9m9rl7m2J1R9j85P4k11K30Q8l7P8j09kO9J8Q6n3q0J37r9J28j93k5
$$ 64 159 163 64 15 6 -31 -73 -62 37 -148 -74 -285 -55 33 -4 74 -35 -37 32 50 136 83 3 140 41 169 -24 -49
2793d9m0J1K9N0j02j8O6j4j6O3N5J7P1j08L9L1l8M0n0P1p0q8J65j12j64O3R5o2
$$ -49 -89 -78 -49 1 -101 -119 -53 -67 -83 -20 35 52 123 15 54 85 47 87 37 108 38 -50 115 3 -161 -98 -3 -65
2821f5j1L6P0k1JM2O0j12Q6J8k7KL7j10N6o8j08K11j64P0o8N0LJ5o5nk1oP4J67
$$ -65 -76 -40 30 9 10 52 112 0 86 104 77 79 116 6 62 -6 -114 97 -67 3 -65 -15 -12 3 -62 -67 -88 -94 -20 147
2851A47o8RM2O0j34o0p3R8J4j38k9P4k5j03lJ92K3k14O9R2J03lq4Q4R7j40J39
$$ 147 79 88 130 190 56 -4 -77 21 35 -103 -132 -58 -83 -186 -189 3 26 -188 -119 -27 76 73 -11 73 170 30 169
2878A69j09o8J13%r8K1r2K6k7Qq1J58j00rJ55k35K89r5QJ1l3J30l5j96J23k2q1
$$ 169 60 -8 105 105 7 28 -64 -38 -65 -57 -138 20 -80 -89 66 -169 120 25 33 44 11 141 106 -90 33 11 -70
2905g0J80j71M6oj61J20Rj22J80K3j48J82ML3o3N6n1k7qR8m9j19J28Nj52Q5r2
$$ -70 110 -61 -15 -21 -182 -62 -53 -175 5 28 -120 62 66 99 36 92 41 14 6 104 55 -64 64 69 -83 2 -90
2932i0Q0j82J41K5M4j31J42Q6j07P4r1J54o8k5p4J7n7R5j52Q5Q3j66R4q2j1J50
$$ -90 -10 -192 -51 -26 18 -113 29 115 8 82 -9 145 77 52 -22 -5 -62 33 -119 -34 49 -117 -23 -105 -116 34
2958C4p8K8P1q3P1R3r2m5NPJ07l7l6p0k6jN6r4j3K9pj05J05J4P6L7j3m2R8L9N
$$ 34 -44 -16 55 -28 43 136 44 -1 4 11 118 81 45 -25 -51 -52 4 -90 -103 -74 -81 -186 -81 -67 9 46 33 -9 89 128 133
2989A33j17N7r6N9k0j08K4L3J00j04Pk8l6N6l6L8rL5P5k8n9Q9P9n0M9o6j44J00
$$ 133 16 73 -23 36 16 -92 -68 -35 65 -39 -32 -60 -96 -40 -76 -38 -47 -12 63 35 -24 65 144 94 143 77 -67 33
3017C3Nm8n3p4R3k1j6J50o8k1R9j3j0m5%N6L9qq3O9j17J1J11j03J8j77M9P7L5
$$ 33 38 -10 -63 -137 -44 -65 -81 69 1 -20 79 66 56 11 11 67 106 98 15 84 -33 -22 89 -14 4 -173 -124 -47 -12
3046a2j15K8Q0P0o3j6J33O9k06L4J3O0j02M2p2O2j07J07q5N5k2K1J23j45O4M9
$$ -12 -127 -99 -19 51 -12 -28 105 174 -32 2 15 75 -27 15 -57 5 -102 5 -80 -25 -47 -26 97 -48 16 65
3072F5q8j27J95P5n7P8j39J32j5m5k2J6j73L0o2J32j2mj77M4Q2K4K2J21r8R7l
$$ 65 -23 -150 45 120 63 141 2 134 119 74 52 68 -105 -75 -137 -5 -17 -21 -198 -154 -72 -48 -26 95 -3 94 91
3099I1k2o2jM2k0J2mm7k9m9l8J19j33J35l9O8k1M7r5kR4M3L4p5j09J44Rk35%J70
$$ 91 69 7 6 48 28 40 36 -11 -40 -89 -127 -8 -141 -6 -45 23 2 49 -46 -48 46 89 123 48 -61 83 92 -143 -143 27
3129B7o2oM8m6M8m1Rl6N0N3K8n8l5N5N4j4r0K4K5r2P3M1j70J59m2j06J01Po5L7
$$ 27 -35 -41 7 -39 9 -32 -23 -59 -9 44 72 14 -21 34 88 74 -16 8 33 -59 14 55 -115 44 2 -104 -3 4 -61 -24
3159b4p0R1J0M3q4J03m5K7J02j11o8k2j3K4lj27J00Oq2L7M1J4lJ8N6m6L9J8J3
$$ -24 -94 -3 7 50 -34 69 24 51 153 42 -26 -48 -61 -37 -40 -167 -67 -61 -143 -106 -65 -51 -54 -36 20 -26 13 31 44
3188D4n5N4j77J46Q0J9j47K9m8NJ92j48j1OJ0O1q6oJ08j6P7j24L9k6N3k1j6m6
$$ 44 -11 43 -134 12 92 111 -36 -7 -55 -50 142 -6 -17 -11 -1 60 -26 -32 76 60 137 13 52 26 79 58 42 -4
3216dQL6j05J02j98O1K2O7j02J72p3Q1r0K2Rn3J07M0m7l0m9J5K2m5P1l2J1r8P
$$ -4 4 40 -65 37 -161 -100 -78 -11 -113 59 -14 67 -23 -1 8 -45 62 102 55 25 -24 -9 13 -32 39 7 18 -80 -73
3245g3K0k1O3n8K00p9k3L5P2m3J27k10J07q9L4o4J5n9O4m9r7R9m4j4l9J63q7J06
$$ -73 -53 -74 -11 -69 131 52 29 64 136 93 220 10 117 28 62 -2 13 -46 18 -31 -128 -29 -73 -87 -126 37 -50 56
3273E6p2K5J07J7n7K2j29L7P9r3P7Rr4R4j77Q8j3q4j0QJ23j6pM3L5k0O7r1k0J40
$$ 56 -16 9 116 133 76 98 -31 6 85 -8 69 78 -16 78 -99 -11 -24 -108 -118 -110 13 -3 -10 33 68 48 115 24 4 144
3303A44p6j04J57k06Q6j18j3L9L2l2N7j8J09o9m6M6M9n4PJ52J0j12q4J32k7q3
$$ 144 68 -36 121 -85 1 -117 -130 -91 -59 -91 -34 -52 57 -12 -58 -12 37 -17 -10 142 152 40 -44 88 61 -22
3329b2m1J0J25j2j53rK7Q8j7Q2n3j5j7N3k9L9NL8J0j26L5O2j06n3P3p3Q9q1rp3
$$ -22 -63 -53 72 60 -93 -102 -75 13 -4 78 25 10 -7 46 17 56 61 99 109 -17 18 80 -26 -79 -6 -79 10 -71 -80 -153
3359a53R6Ql4R8j02J14nQ4q2j4K1q7K5J16j4o1n4k7K8j9p9R6J59j54N1q3m8K52
$$ -153 -57 -49 -83 15 -87 27 22 106 24 10 31 -56 -31 85 71 10 -44 -71 -43 -62 -141 -45 114 -40 11 -72 -120 132
3387A32p4L0n8P9m6l0O1j09N7m9P4n0m7JO6j19O9Mj05M2K2K%MO3O0r9J07l7p3
$$ 132 58 88 30 109 63 33 94 -15 42 -7 67 17 -30 -29 37 -82 -13 -9 -114 -72 -50 -48 -48 -44 19 79 -20 87 50 -23
3417b3Q6j58R4Mj16Q5O8l8O5j56J19L2j5n8p4J74o8mr5Q3P9j66P3M7m9Rj42J21
$$ -23 63 -95 -1 3 -113 -28 40 2 67 -89 30 62 47 -11 -85 89 21 17 -78 5 84 -82 -9 38 -11 -2 -144 -23
3445b3n6q8P5J04j24J43J9O2j1k9q7K6j7LL3n1M6r3N8J30o6j46L9j37Q2Q7P1k0
$$ -23 -79 -167 -92 12 -112 31 50 112 101 72 -15 11 -6 -3 30 -21 25 -68 -10 120 54 -92 -53 -190 -108 -21 50 30
3473C0Q5j34Q0Pj19J99lj48J01m8o9M2n7m4Q4lL6k1j11N7P5M3j36N3P2lp2m0R4
$$ 30 115 -19 61 68 -51 148 145 -3 98 50 -19 23 -34 -78 6 3 39 18 -93 -36 39 82 -54 -1 71 68 -4 -44 50
3502E0n4j7J01K8j17m0%n2J56j55l8J65P6j70J6K0j25Q3J94o7j11J85o5j1m3J17
$$ 50 -4 -21 80 108 -9 -49 -49 -101 55 -100 -138 27 103 -67 -51 -31 -156 -73 121 54 -57 128 63 52 9 126
3528A26j13oOj1r4R7j10K3k2J54lk06J72q9P3P1p9J14j02J0J03j8o9j60J19jo
$$ 126 13 7 13 2 -92 5 -105 -82 -104 50 47 -159 13 -76 -3 68 -11 103 1 11 114 96 27 -133 -14 -15 -21
3555b1m0J07j00L1rO6mm9K5MK3j3m6R4l2N8o0n4L9n4m0J9l9OM3k9m9R4m9J86j24
$$ -21 -61 46 -54 -23 -32 34 30 -19 6 10 33 20 -26 68 36 94 34 -20 19 -35 -75 -56 -95 -89 -46 -75 -124 -30 -79 107 -17
3586a7nqn1J93m8J11J0j35m4j6j02K43j52k0N6p8p2P6L3J9M1j38K16%k8J9p7p5
$$ -17 -22 -30 -81 112 64 175 185 50 6 -10 -112 131 -21 -41 15 -63 -135 -59 -26 -7 34 -104 112 112 84 103 26 -49
3614d9K2Q0o8L6j9m2K9K1J1r8P3Jn9N9j4q0p4K42L8q2O5j5L5qp9q5J00nK2jj81
$$ -49 -27 53 -15 21 2 -40 -11 10 21 -77 -4 -3 -62 -3 -17 -97 -171 71 109 27 92 77 112 104 25 -60 40 35 57 56 -125
3645a25Q1m6n8L0K9P6m4J80r9L0k2M9l8P3j6n9r5J52j66Q6m3r3J66k9k7L1J6j38
$$ -125 -44 -90 -148 -118 -89 -13 -57 123 24 54 32 81 43 116 100 41 -54 98 -68 18 -25 -118 48 19 -8 23 39 -99
3673i9R7J8P1q1R5Rj33P0oj42J01KJJ6p7J11j50R3j08J41n5m5J45j06N9M4k3m6
$$ -99 -2 16 87 6 101 110 -23 47 41 -101 0 2 3 19 -58 53 -97 -4 -112 29 -26 -71 74 -32 27 71 48 2
3701BjM6P2o9p5m1J17j2J1j05J53j18K3k2r4J3O0O3J8l4K1k0O5k3J6n8jp4J35
$$ 2 1 47 119 50 -25 -66 51 39 50 -55 98 -20 3 -19 -113 -100 -40 23 41 7 28 8 73 50 66 8 7 -67 68
3730F8k6l8j5Rm8j28R6L2j4J64j22l5PK28j21N1p3R9r2Ql3q9O4O5j2q0j73J86
$$ 68 42 4 -11 -2 -50 -178 -82 -50 -64 100 -22 -57 -50 178 57 108 35 134 42 50 17 -72 -8 57 45 -35 -208 -22
3758b2j23J26N4n3m8J28l7j68R8M7P7K0o8Q4j64J07j94J37l0mr8J8J41j05%J06
$$ -22 -145 -19 35 -18 -66 62 25 -143 -45 2 79 99 31 115 -49 58 -136 1 -29 -33 -131 -113 28 -77 -77 29
3784B9N9k3Ll6lo1N5J28M7j27j10M9P3N3k25LmP0M3j12MM7J22j22l8J66k83K26
$$ 29 88 65 68 32 29 -32 23 151 198 71 -39 10 83 136 -89 -86 -90 -20 23 -89 -85 -38 84 -38 -76 90 -193 33
3812C3k9l6J2J31m2j04J06j17J55j69N6n7j16Q1n7Q5kL5M3l9J03l3J3J3n8N4j18
$$ 33 4 -32 -20 111 69 -35 71 -46 109 -60 -4 -61 -177 -96 -153 -68 -70 -35 8 -31 72 39 52 65 7 61 -57
3839e7J16K8j69J41j23l5J14n3n5l2M5L6K26j60n8P8j27J26P0j44M6l5K3M4j6
$$ -57 59 87 -82 59 -64 -99 15 -38 -93 -125 -80 -44 182 22 -36 42 -85 41 111 -33 13 -22 1 45 29
3864B9Rj08J40N9j01Lr6nN8J16j78P6K5j6l8J06j22N4K6J3j2Lr5j15J05K8p8Q8
$$ 29 38 -70 70 129 28 31 -65 -70 -12 104 -74 2 27 11 -27 79 -43 11 37 50 38 41 -54 -169 -64 -36 -114 -26
3892b6r6J79j45N7q2P1J43k44J18P0m6J3j0P2j66K41j51L7n3n1J0J09o4j63J20
$$ -26 -122 57 -88 -31 -113 -42 101 -143 -25 45 -1 12 2 74 -92 149 -2 35 -18 -69 -59 50 -14 -177 -57
3917e7J08k5o1m6J3LJ41q6J27j07L4k4k4J9m8j6n9R7L2m2Ll1n9O7j3J0PJ1L8K5
$$ -57 51 26 -35 -81 -68 -65 76 -10 117 10 44 20 -4 15 -33 -49 -108 -11 21 -21 -18 -49 -108 -41 -54 -44 -37 -26 12 37
3947C7qJ38j29o2Nj0K1J18o7l0p6L4l1N9m4k9J3ML9J53r4l0q6Q9Q2L8qj08p5J57
$$ 37 29 167 38 -24 -19 -29 -8 110 43 13 -63 -29 -60 -1 -45 -74 -61 -57 -18 135 41 11 -75 14 96 134 126 18 -57 100
3977A00j53NO1j5mj05N5J7nn9R6L2j16J15N6m4J5qJ5oM0o3m6Q2m7j3j7L5q9N4
$$ 100 -53 -48 13 -2 -6 -111 -56 -39 -44 -103 -7 25 -91 24 80 36 51 43 58 52 92 29 -17 65 18 5 -12 23 -66 -12
4007a2o2J16p7J83j35L6k4KOp1l7J39j40O9O6j17l8Q7o6Q8p7R3O8p2P7j09k6N0
$$ -12 -74 42 -35 148 13 49 25 27 33 -38 -75 64 -76 -7 59 -58 -96 -9 -75 13 -64 29 97 25 102 -7 -33 17
4035A7J3k8Jl8ML1N6q6J6l1J2L9m2R1r3M3q4QN2J6Q2K4l8m6N3lk1j5rj35J04k2
$$ 17 30 2 3 -35 -31 0 56 -30 -14 -45 -33 6 -36 55 -38 5 -79 -71 -19 -3 79 103 65 19 72 69 48 33 24 -111 -7 -29
4067b9L1j8j02K03j19j04J47k6j9N2M3mp5k8J3o9K27j15j09K8K12q7n9l4LQ2j38
$$ -29 2 -16 -118 85 -34 -138 9 -17 -36 16 59 55 -20 -48 -35 -104 123 8 -101 -73 139 52 -7 -41 -38 44 -94
4094i4O3k7J69j07m9M7l3P6r5L3k3L9O3j49J27j4O7k20J33k5k5lj05J14J17l8
$$ -94 -31 -58 111 4 -45 2 -31 45 -50 -17 -40 -1 62 -87 40 26 93 -127 6 -19 -44 -47 -152 -38 79 41
4120D1p9J01RO0j97J17r8R8k1qm4J48j3o0j02J18j04k9j6m1J49o9P9j39N1n3K8
$$ 41 -38 63 72 132 -65 52 -46 52 31 23 -21 127 114 54 -48 70 -34 -63 -79 -120 29 -40 39 -100 -49 -102 -74
4147g4J00l6J26m9m9NJ7k4j18J10N0p9N6qr4J17j28qJ18n3J7k3J36K0K6j80J06
$$ -74 26 -10 116 67 18 23 40 16 -102 8 58 -21 35 27 -67 50 -78 -86 32 -21 -4 -27 109 129 155 -25 81
4174H1m0o1qN%m4N4k0O0l3j29J02O9Ko8R0n0O9j4m7J2MPl8K9j4J3j30l7JQ6k5
$$ 81 41 -20 -28 -23 -23 -67 -13 -33 27 -6 -135 -33 36 38 -30 60 10 79 65 18 30 34 41 3 32 18 31 -99 -136 -135 -49 -74
4206g4Jn7Q7J63l8j49O3J29J%j3Kj15M4p4p2J60Mj36J00j11L4J13r8j5K1N1j35
$$ -74 -73 -130 -43 120 82 -67 -4 125 126 126 113 115 0 44 -30 -102 58 62 -74 26 -85 -51 62 -36 -51 -30 21 -114
4234a14J38R8j8n4n1Qj3Q4l4J2O3j48k5Q4p7O4j3qm2K6N7j7Q6j02O1J4j16j7K9
$$ -114 24 122 104 50 -1 7 -6 78 44 56 119 -29 -54 30 -47 17 4 -4 -46 -20 37 20 106 4 65 79 -37 -54 -25
4263b5kp7O5j4K5j03J25k3NL4r5K2J21j3q5O5k4O0Ll7L1L1q6j4J0%m9rj92J69
$$ -25 -27 -104 -39 -53 -28 -131 -6 -29 -24 10 -85 -63 58 45 -40 25 1 61 64 27 58 89 3 -11 -1 -1 -50 -59 -251 -82
4293h2J19o8M1j12J65m7J5N3p3k8J3JJ28q5QL1p3qrQkO8j01R4j12M0J16p2j6J16
$$ -82 37 -31 10 -102 63 16 31 84 11 -17 -4 -3 125 40 48 79 6 -2 -11 -3 -5 63 -38 56 -56 -16 100 28 12 128
4323A28p2j05J13q5n2K4N5qO7j17J5P8m6N2J3l1m4P8n1M2k4N4o4j1J8j5j0J14
$$ 128 56 -49 64 -21 -73 -49 6 -2 65 -52 -37 41 -5 47 60 29 -15 63 12 54 30 84 20 9 27 12 2 116
4351A16j21L0p3M7K3O5n5k6k3j17N9K2J36j02O7m5r3J36j41J17J6O5j70J43j06
$$ 116 -5 25 -48 -1 22 87 32 6 -17 -134 -75 -53 83 -19 48 3 -90 46 -95 22 38 103 -67 76 -30
4376c0Q4j62J29L9n0j03K2N0L5o0k1J09j03J90j19O1j39K13j02q1J5L6j6M4j32
$$ -30 54 -108 21 60 10 -93 -71 -21 14 -46 -67 42 -61 129 10 71 -68 145 43 -38 -23 13 -3 41 -91
4401i1K7J49k27Q6J56j22j10J14Pk6J47j85O7L4%r7jJ41j3o7p1L0J22oj35j6Q2
$$ -91 -64 85 -142 -56 100 -22 -132 -18 -11 -37 110 -75 -8 26 26 -71 -72 69 56 -11 -82 -52 70 64 -71 -87 -5
4428eP9pl7j31O5R1o8O5o9j3O7l7N2j10J65k30J04n3J12n6MP9j39R4Mm9q9O0N6
$$ -5 74 67 30 -101 -36 55 -13 52 -17 -30 37 0 52 -58 107 -123 -19 -72 40 -16 -12 67 -72 22 26 -23 -112 -52 4
4457DO1L5p4j5R5N6j69Q4O9q1k7L1q1K2L3q0o8O3R4p6L8KL1K0j26P5l2O1qJ0J3
$$ 4 65 100 26 11 106 162 -7 77 146 65 38 69 -12 10 43 -37 -105 -42 52 -24 14 16 47 67 -59 16 -16 45 37 47 60
4488F0k0j09J01J7m3M2Q4j40M4l6M7q9K4m2R3Klm4J47o4r1J5J3K7l4p0J5j8J8
$$ 60 40 -69 32 49 6 48 132 -8 36 0 47 -42 -18 -60 33 35 32 -12 135 71 -20 -5 8 35 1 -69 -54 -72 -54
4517e4l8N0N4M1j15N9lP9q4pR8k2K7j7o0kL4L8K0j57P4o3NJ7J4J25j71Q9n4J08
$$ -54 -92 -42 12 53 -62 -3 -6 73 -11 -18 80 58 85 68 8 6 40 78 98 -59 15 -48 -43 -26 -12 113 -58 31 -23 85
4547H5m0o7oJ52oo8N7K7j59J8K9j26J67r9J18j33O0O2j67J26l6JrJ30j97J61j07
$$ 85 45 -22 -28 124 118 50 107 134 -25 -7 22 -104 63 -36 82 -51 9 71 -96 30 -6 -5 -14 116 -81 80 -27
4574b7Q2KN4m8k2p9M9L4pj65O1K02j86k6O8Q8o1Qj2k4N2Np7J12m2qnr5P2j80O8
$$ -27 55 57 111 63 41 -38 11 45 38 -127 -66 136 -50 -76 -8 80 19 27 15 -9 43 48 -29 83 41 33 28 -67 5 -175 -107
4605a07L9J22j03l5K3M5J14k05J59j37J45r4M9L9l0m1R9j16J01l9m1oJ0j3PR3
$$ -107 -68 54 -49 -84 -61 -16 98 -107 52 -85 60 -34 15 54 24 -17 82 -34 67 28 -13 -19 -9 -22 -15 78
4631G8j26J13o0N1p6J6l9R4Jq4O7Nr5R3P2j64J15pr3M9M6j86J66j51J67j44P2
$$ 78 -48 65 5 56 -20 -4 -43 51 52 -32 35 40 -55 38 110 -54 61 54 -39 10 56 -130 36 -115 52 -92 -20
4658b0P0j03JL6j0R8k3p5O6P0j54j8R8M9j03Kl1o2R4J00j0r8L3o0N2J28j91p7
$$ -20 50 -53 -52 -16 -26 72 49 -26 40 110 -44 -62 36 85 -18 -16 -47 -109 -15 85 75 -23 10 -50 2 130 -61 -138
4686a38K09J1Po0J7k9m8j16J63L9L4j69N0KP3o3L1j23Q0M6Q8j09k0L9l4R8j29
$$ -138 71 82 89 29 46 17 -31 -147 16 55 89 -80 -30 -28 45 -18 13 -110 -30 16 104 -5 -25 14 -20 78 -51
4713e1J10j25J40m5j17j7P6j4J19r4ROM0r3O1kj5j7J13r4L6j48J31l5J23p8k1
$$ -51 59 -66 74 29 -88 -105 -29 -43 76 -18 -9 -3 37 -56 5 3 -12 -29 84 -10 26 -122 9 -26 97 19 -2
4740bn1L9M7L8Nj20Q0p2Q6J56l08MK60j09k0oJq0J85n9j30J11n1l8J22j59N6n9
$$ -2 -53 -14 33 71 76 -44 36 -36 50 206 -102 -98 162 53 33 27 28 -52 133 74 -56 55 4 -34 88 -71 -15 -74
4768g4P1R0rr2o9N9J4NlPn8L3K1Rj09L7O8Q8o1j30J39pJ8p5qn9Q7J30k04J01j18
$$ -74 -3 87 78 -14 -83 -24 -10 -5 -8 -1 -59 -26 -5 4 -105 -68 0 88 27 -103 36 29 47 -28 -36 -95 -8 122 -82 19 -99
4799i9R8L8M2q4J07p8Nl9nn4K3P6M8Mj79k6J79o3R0l3m7n5R4o0QJ23j73R7j23
$$ -99 -1 37 79 -5 102 24 29 -10 -15 -69 -46 30 78 82 -97 -123 56 -7 83 50 3 -52 42 -18 -10 113 -60 37 -86
4828h6J64Oj0p0J3q7K5p6J50l6R6j53J84j0j21Q9k9m3j4n3MJ68k10K3N1NJ23j67
$$ -86 78 84 74 4 17 -70 -45 -121 29 -7 89 -64 120 110 -11 78 49 6 -8 -61 -57 111 -99 -76 -25 -20 103 -64
4856f4j9J24l9q4J20Mn4O2r0Q2P3j87N2L1M6Mj07P5J13j33Lll4q7K05k3j03p2
$$ -64 -83 41 2 -82 38 42 -12 50 -40 42 115 -72 -20 11 57 61 -46 29 142 9 12 9 -25 -112 93 70 -33 -105
4884a05K13j28n0O6L8J1J3n6QN7q9J0q9Q5J9P2j02J03q1N2R4j02j85L8K15k07
$$ -105 108 -20 -70 -4 34 45 58 2 10 67 -22 -12 -101 -16 3 75 -27 76 -5 47 141 39 -146 -108 107 -100
4910a00J48k3j19M1jKO7q9J59j72J37j63J21mn4j8J00L9l3qJj1R2o0m4r3J71n6
$$ -100 48 25 -94 -53 -54 -52 15 -74 85 -87 50 -113 8 4 -50 -68 32 71 38 30 31 20 112 52 8 -85 86 30
4938C0Pj15J43n4K4q4m6j2R7o1Q2k6nl3J3O5j3O7j41R0m3K8lm9P2r5K05o4j01
$$ 30 37 -78 65 11 35 -49 -95 -107 -10 -71 11 -15 -20 -53 -40 25 12 79 -62 28 -15 13 10 -39 33 -62 143 79 -22
4967b2K9rj6j45J92n3O1Lk5j25J06Q0p3Mn7j3MoJ48j00J27j59J7R3l3j3q1J04
$$ -22 7 -2 -18 -163 29 -24 37 40 15 -110 -4 76 3 7 -50 -63 -59 -65 83 -17 110 -49 -32 61 28 15 -66 38
4995C8p4J4Q6q9J1L5m8J9mJ67k5j64J17np7J06j08m9J51j05QR4j68J3N8m0O5q7
$$ 38 -36 -22 64 -25 -14 21 -27 -8 -12 155 130 -34 83 78 1 107 -1 -50 101 -4 4 98 -70 -57 1 -39 26 -61
5023f1R9m2J34j26Jm7P0l5j4j9O6j37Q6p7N0RJ9K05j19j52J29j07pP3Mo5Q0n5
$$ -61 38 -4 130 4 5 -42 28 -7 -21 -40 26 -111 -25 -102 -52 -43 -24 181 62 -90 39 -68 -75 -2 2 -63 17 -38
5051c8Rl4M1O1j61M4O1j7nl1O6LK1m1O9m2k2O4p6m3J00j13J01n1R8n9RQ4L7j53
$$ -38 -29 -63 -22 39 -122 -78 -17 -34 -39 -70 -4 -1 20 -21 48 6 -16 48 -28 -71 29 -84 17 -34 64 5 14 98 135 -18
5081a8o6J09p7P1K2l9R2o0q1J37m8j10J08J4kj75J03L7L1p6O2o2N3R4j37N9l1
$$ -18 -84 25 -52 19 41 2 94 34 -47 90 42 -68 40 54 52 -123 -20 17 48 -28 34 -28 25 119 -18 41 10
5108A0n2J8P6p7N2pK3M5j44J40n1n5ok0j6j7L5J9m7J29q5P4n9jN7K5oM1qj03P5
$$ 10 -42 -24 52 -25 27 20 43 88 -56 84 33 -22 -28 -48 -64 -81 -46 -27 -74 55 -30 44 -15 -16 41 66 60 101 93 -10 65
5139F5n5Ojj59J08J39k17J34p0K8nM9K5q4k1N9M2n1J7m2mR5k7o7P0J0j26N9R9
$$ 65 10 16 15 -144 -36 103 -114 20 -50 -22 -27 22 47 -37 -58 1 43 -8 9 -33 -37 58 31 -36 34 44 -82 -23 76
5168G6j03R0L2l3o5qO1J1p1J10Rj59O7l7O7Q6j57n5J52J7o8k3OJ55j84P4j00L6
$$ 76 -27 63 95 62 -3 -11 50 61 -10 100 109 -50 17 -20 47 133 -24 -79 73 90 22 -1 5 160 -24 50 -50 -14
5196a4K6j25J47J7njk9K3q4N5L0p4j2P6J44k49J18n4mL8k2M6j00K2P7Qj31R8r
$$ -14 12 -113 34 51 46 45 16 39 -45 10 40 -34 -46 30 174 -75 43 -11 -15 23 1 47 -53 -31 46 54 -77 21 12
5225A2Jo2J02l1m3m6Kq7P0P3Q9k3l8K8m8l8j5j5M8lk6K6PR1l5kl2mplK5mn3J7
$$ 12 13 -49 53 22 -21 -67 -65 -152 -82 -9 80 57 19 47 -1 -39 -54 -69 -21 -24 -50 -24 -17 74 39 37 5 1 -6 -9 16 12 -41 -24
5259b4K1n7R2n0jO9m4Q2m1ok4mLnqM9r4m7J40n2QM1j3r8J78j10p9J56n3r2j1J09
$$ -24 -3 -60 32 -18 -19 50 6 88 47 41 17 13 16 11 3 52 -42 -89 51 -1 7 48 35 -63 115 5 -74 82 29 -63 -74 35
5291C5J3j03o9J10J5mJ18j9j52r4K36r8Q0j28OJ07r6Q8n1l3J63m5j8p5q5J44m
$$ 35 48 -55 -124 -14 1 -3 115 96 -56 -150 86 -12 68 -60 -54 53 -43 45 -6 -39 124 79 61 -14 -99 45 41
5318D1j4oN7J0l9j7j14J29m3J3Kr0R5N7j81J43j06N0K0j63N7J09l4n2J25K2j4
$$ 41 27 21 78 88 49 32 -82 47 4 17 19 -71 24 81 -100 43 -63 -13 7 -156 -99 10 -24 -76 49 71 57
5345E7j39J01k9RL3r3l1J27L2j1j16N2N6L8r3J6m4N1J1r4O9Rn2o0N8K5nm4j7J32
$$ 57 -82 19 -10 -1 32 -61 -92 35 67 56 -60 -8 48 86 -7 9 -35 16 27 -67 2 11 -41 -101 -43 -18 -23 -67 -84 48
5375D8j07J50j10P7K8ql5j05L1J25j56J26j7K1j87K01j56O5Jp2J14j11J87k27
$$ 48 -59 91 -19 58 86 78 43 -62 -31 94 -62 64 47 68 -119 82 -74 -9 -8 -80 34 -77 110 -117
5399a17J18K0p8L8KJ1lN7q4o7J50o8L7rr9R9k9J9P3j08o7J45%n6J28qj14p2Q0
$$ -117 1 21 -57 -19 -17 -6 -9 48 -36 -103 47 -21 16 7 -92 7 -22 -3 70 -38 -105 40 40 -16 112 104 -10 -82 -2
5428bj3K8Ol4J35k51J66m0p3M6P5l9k9M6k9loM6oo5L9m5P2n6m9P9O6M5q5q6N1
$$ -2 -15 13 19 -15 120 -131 35 -5 -78 -32 43 4 -25 21 -8 -11 -17 29 23 -42 -3 -48 24 -32 -81 -2 64 109 24 -62 -11
5459a1L6N9j54K69j39N3j09N2P6q2J4j24O5k9Qn4q8J24L7J7qo0j5j8N3p1O5M1
$$ -11 25 84 -70 199 60 113 4 56 132 50 64 -60 5 -24 -16 -70 -158 -34 3 20 12 -48 -63 -81 -28 -99 -34 7
5487Gm6O1K1n0k0J8R3q5KN7j73K53j82r7J01n9Q4K9J9j06Q8k8m8K9J9J45j15l3
$$ 7 -39 22 43 -7 -27 -9 84 -1 1 58 -115 138 -44 -141 -40 -99 -15 14 33 -73 15 -13 -61 -32 -13 132 17 -16
5515a6R0J0r6l0J75o9mj25j2J8P9j53J91j10J58r7NLN4q1q4K70j10J8J4j72jM7
$$ -16 74 84 -12 -42 133 64 60 -65 -77 -59 20 -133 58 -52 106 9 14 17 71 -10 -94 176 66 84 98 -74 -75 -28
5543b8l2J32j51M7r1K16q5m2N6LK3J3j28J18qm1P7r1K5Q3j33J04n1O2l1o6K1q6
$$ -28 -60 72 -79 -32 -123 93 8 -34 22 25 48 61 -67 51 43 2 79 -12 13 96 -37 67 16 78 47 -19 2 -84
5571h4K2N7jM4m5J9M1L3q9lK5jo9K24r8j65J42o7jorQ1j55Q3P1LO9j01l9L7n2
$$ -84 -62 -5 -6 38 -7 12 53 86 -3 -6 19 18 -51 173 75 -90 52 -15 -16 -22 -31 50 -105 -22 49 52 121 20 -19 18 -34
5602c4q6J45j3j2K3r7O0J40j15o0J01q8j0J43j58J32p6K8n8k2J61o6j4J5j26P0
$$ -34 -120 25 12 0 23 -74 -14 126 11 -49 52 -36 -46 97 -61 71 -5 23 -35 -57 104 38 24 39 -87 -17
5628a7no1M4J44j74N9JL3j07J03Oj86J47L1P1p1n9k4K1O9P3j62J06j17o4J70m
$$ -17 -22 -83 -39 105 -69 -10 -9 24 -83 20 26 -160 -13 18 89 18 -41 -65 -44 25 98 -64 42 -75 -139 31 27
5655B7j00J28or5K7J00j64J67j19m3J48j05j9O4L5n5N2J4j53O6M8j09J49o3j7
$$ 27 -73 55 49 -46 -19 81 -83 84 -35 -78 70 -35 -54 10 45 -10 42 56 -97 -31 17 -92 57 -6 -23
5680b3kj33J50lj6L9R0p5m4pl0Q2n9M2M4j28L9K3P0p8k0M5n7J51k56J93j5L7k6
$$ -23 -25 -158 -8 -11 -27 12 102 27 -17 -24 -54 28 -31 11 55 -73 -34 -11 59 -19 -39 6 -51 100 -156 37 22 59 33
5709C3Q5q0l9l8K3O0N2j87M1L8J19k6q3J1O7j68J34K0q6JO5j04M0j4N1N1n7j63
$$ 33 118 38 -1 -39 -16 44 96 -91 -50 -12 107 81 -2 9 76 -92 42 62 -24 -23 42 -62 -22 -36 15 66 9 -154
5737a54J84pk9K2M1j52J52p3J8Pn4NL8j7r2J20k5L5O7n8r9L9m2n0J47LLJ46j67
$$ -154 30 23 -6 16 57 -95 57 -16 2 9 -45 -40 -2 -19 -111 9 -16 19 86 28 -71 -32 -74 -124 23 26 29 175 8
5766Hm4P1q3L1J13m2P2o7k9q7M7J2oo9M4M3j05J5O9j5M1NQ6j06J27j31L1p3J1
$$ 8 -36 35 -48 -17 96 54 126 59 30 -57 -10 2 -4 -73 -29 14 -91 -76 -7 -22 19 24 110 4 131 0 31 -42 -31
5795c1J9%O2%l3j2o7J00j4L4q4P0N4o8J8j58P5NP2q4J03j51L9J05On4pK6r2L9
$$ -31 -12 -12 50 50 17 5 -62 38 24 58 -26 44 98 30 48 -110 -35 -30 42 -42 61 -90 -51 54 60 6 -1 25 -67 -28
5825b8lpO6k4r8K8nN4Q4j49N0P0j40J39q8L6O0l0o0J36j49J37n1p5L2K3N0m6P0
$$ -28 -31 -38 28 4 -94 -66 -71 -17 67 -82 -32 38 -102 37 -51 -15 45 15 -45 91 -58 79 28 -47 -15 8 58 12 82
5854H2m8O5j35L7p3J60j71O2J30K8j82l0L3J25q7J5j2L1j08J06p8K1M4J72j33
$$ 82 34 99 -36 1 -72 88 -83 -21 109 137 -45 -75 -42 83 -4 11 -1 30 -78 28 -50 -29 15 187 54
5879E4j41J67j15o0P4m2Q0J1j95L08j66J19K0j51J62r5%j30J33m9QK3J9r0J46
$$ 54 -87 80 -35 -95 -21 -63 17 28 -167 141 -25 94 114 -37 125 30 30 -100 33 -16 -8 15 34 -56 90
5904I0j53M9L6J3o1O9k05J35J13Op9k4K2l2l7oJ30q0OJ5K1jL6j63J31j00R3J6
$$ 90 -63 -14 22 35 -26 43 -162 -27 86 92 13 -11 11 -21 -58 -64 66 -14 -8 7 28 27 63 -100 31 -69 24 40
5932D0n9n9M9jJ3j5q1J04o7J40n3J8J01r8p9k2O4N1j19J1P1o7N%R8j7n2l8J28
$$ 40 -19 -78 -29 -30 -17 -32 -113 -9 -76 64 11 29 130 32 -47 -69 -5 46 -73 -62 9 -58 -53 -53 45 28 -24 -62 66
5961F6j15J17j03o7J50l0N5m8m0J3k0J0K4LO4k8j06P5M7J5R7j27o2l2L3N2j26
$$ 66 -49 68 -35 -102 48 18 73 25 -15 -2 -22 -12 12 15 79 51 -55 20 67 82 179 52 -10 -42 -9 43 -83
5988h3K9RJ0o7J92o9M0o7K2Jj19J15l7j30J83r2L1M1J3m4J05o0l0J8J70j96L8
$$ -83 -54 -45 -35 -102 90 21 61 -6 16 17 -102 13 -24 -154 29 -63 -32 9 22 -22 83 23 -7 11 181 -15 23
6015B3m1k8L1j21K33j11pp6J46r3mQ8j01j9P0N8j14J95j25L1J11j63l5L1Q3j33
$$ 23 -18 -46 -15 -136 97 -14 -21 -97 49 -44 -48 40 -61 -80 -10 48 -66 129 4 35 146 -17 -52 -21 62 -71
6041g1J8J33n8P7j02q3J61j08J08j24M7L1n0o4r2J90J7p6j2N4l6O8j09J88m6j24
$$ -71 -53 80 22 99 -3 -86 75 -33 75 -49 -2 29 -21 -85 -177 13 30 -46 -58 -4 -40 28 -81 107 61 -63
6067f3N2O4j04J12j02l1J20Qn9Rm8L7q2K8K6j0K2q2J51j01J29l5m9L1K0J9k8M3
$$ -63 -11 53 -51 61 -41 -72 48 56 -3 6 -42 -5 -87 -59 -33 -43 -21 -103 48 -53 76 41 -8 23 43 62 34 77
6095G7j03Q4k5n9J17r9M0j18J37k4m7j0m9J82j52k1J9Q5M5j37J12q4O1r4M7n3
$$ 77 -26 58 33 -26 91 -8 32 -86 51 27 -20 -30 -79 103 -49 -70 -51 34 79 -58 54 -30 31 -63 -16 -69
6121f9J13j06j6R6Kj1m4j34J13L1o4K9M2M2O1r0j29Q5O9j18J56r8P4R4p3j69M2
$$ -69 44 -62 -78 18 20 9 -35 -169 -56 -25 -89 -60 -18 24 85 -5 -134 -49 20 -98 58 -40 34 128 55 -114 -72
6148g2O5N9j78J15J21K0j88J21M3j50N1Rp1m3J36j12J08K3o0o9J10o5j02J68Q0
$$ -72 -7 52 -126 -11 110 130 -58 63 106 -44 7 16 -55 -98 38 -74 34 57 -3 -72 38 -27 -129 39 119
6173A19j26P1j32N9L9n0Q2j03N2q2m1P6M2j2o8R3K6n7jlj4q3N3J26l6l2J7n7L
$$ 119 -7 64 -68 -9 30 -20 62 -41 11 -71 -112 -36 6 -6 -74 19 45 -12 -13 -16 -30 -113 -60 66 30 -2 15 -42 -39
6202c9J17j0j73J63o3M3o1m5J09n3k8o4J74j78M5Q6N5o9j3P8m0%o8J18n7k7j8
$$ -39 78 68 -105 58 -5 38 -23 -68 41 -12 -40 -104 70 -108 -63 23 78 9 -4 74 34 34 -34 84 27 0 -18
6229a8j3J17j27J22o9K8nk2rr9J27m7rJ09j17j5J25q9R3L8j54K4O0p2m8K9j7J00
$$ -18 -31 86 -41 81 12 40 35 13 4 -95 32 -15 -24 85 -32 -47 78 -11 82 120 -34 -10 50 -22 -70 -41 -58 42
6257D2l9j7RJ15j77J04j89L6J36j28Q2PM0P2j39P4q3NM3N5j01l8Q3Nj22J60q0
$$ 42 3 -14 -5 110 -67 37 -152 -116 20 -108 -26 -19 21 93 -46 28 -55 -50 -7 48 -53 -91 -8 -3 -125 35 -45
6284d5l9M4k5mN3n5R8O8o9n7K5M3n5L3Km8j9J25j01J3j6J10j18p8K03r5j7R7k2
$$ -45 -84 -40 -65 -69 -16 -71 27 95 26 -31 -6 37 -18 15 17 -31 -50 75 -26 -13 -29 81 -37 -115 88 -7 -24 73 51
6313E1n2R2n9o0Q1J6kj33LK9N0l4mk5O2L1K7j28j8J0J7M0j4K5j52J73K4mJ1m4
$$ 51 -1 91 32 -28 53 69 67 -66 -63 -34 16 -18 -22 -47 15 46 73 -55 -73 -63 -46 -6 -20 5 -147 26 50 46 57 13
6343A3M6m0l4R7r4M4P6q2op3J58l4k9k3NO4n5J2j31P5O9j52R9k2P8k00J74Nj04
$$ 13 59 19 -15 82 -12 32 108 26 20 -53 105 71 42 19 24 88 33 45 -86 -11 58 -94 5 -17 61 -139 35 40 -64
6372f4P7l0NL7q5L0Q0r2J2QL6n0Nm1K8O2L8k3L1M6p4J6j36L4jP2M0m7R6j16R7
$$ -64 13 -17 -12 25 -60 -30 50 -42 -30 -22 14 -36 -31 -72 -44 18 56 33 64 110 36 52 -84 -50 -51 21 61 14 110 -6 91
6403I1L0j05K3m7K4L4j18P3o9J14Jj18J13j5O1j76RQ8j9P3j8J01j40j2j4j4J03
$$ 91 121 16 39 -8 16 50 -68 5 -64 50 51 -67 46 31 92 -84 -75 13 -6 67 49 150 10 -2 -16 -30 73
6430G3q0k1k9J18k7k8R6j48Q1L2p4pO2o3p4O6K6NQ5j08m2Rj5K4N9o2K6k6L0P9
$$ 73 -7 -28 -57 61 34 6 102 -46 35 67 -7 -14 48 -15 -89 -23 3 8 93 -15 -57 -48 -63 -39 20 -42 -16 -42 -12 67
6460F7n1j07J36p7J25j61J23q5M4n9o1K26j35Q9j4o0K2k6K4j07L0J3l3RJ27p6
$$ 67 16 -91 45 -32 93 -68 55 -30 14 -45 -106 120 -15 74 60 0 22 -4 20 -87 -57 -44 -77 -68 59 -17
6486a7L2lM7q0P0op5O3M3m2Qp9PL6k4J1j10J22O1j49J25n6j55J87o5M4p8J2L9
$$ -17 15 12 59 -21 49 43 -32 31 74 32 40 -39 -32 4 -20 -9 -119 3 64 -85 40 -16 -171 16 -49 -5 -83 -71 -32
6515c2l8K3kJ09k6m5j12Q9L6m0%m3J37j8j05J5J47k5r3Om6qR6j01Q8r7J12L6n6
$$ -32 -70 -47 -49 60 34 -11 -123 -34 2 -38 -38 -81 56 38 -67 -52 95 70 -23 -17 -63 -71 25 -76 12 -85 27 63 7
6544Gq4M8L6j24R3j9P5k9Rk0k8p3J05j7J07j07Q4l6o5P6N0j47Q6Kp6l9qJ47KM9
$$ 7 -77 -29 7 -117 -24 -43 32 3 12 -8 -36 -109 -4 -21 86 -21 63 27 -38 38 88 -59 27 29 -47 -86 -94 53 55 104
6574A04j40K4n5J06m6k0j7N7n8Q6j36J13%M8n7L0Mp4j1o7J41j74J83M0j26J02
$$ 104 -36 -12 -67 39 -7 -27 -44 13 -45 41 -95 18 18 66 9 39 43 -31 -42 -109 32 -142 41 81 -45 57
6600E7q0o1R4j4O8q1K7k3M0m9O5q4O4O2j70M2m4N0M0M6q0n7J38l5r6J56m8l8j8
$$ 57 -23 -84 10 -4 64 -17 10 -13 27 -22 43 -41 23 85 -85 -43 -87 -37 3 49 -31 -88 50 15 -81 75 27 -11 -29
6629b9M3J4j0k09M54l20Q0m4J5M2J0q9O7m6nJ09o6nk4J2j0N0J08l9j2Q6j41pK
$$ -29 14 28 18 -191 263 -57 23 -21 -6 36 46 -43 24 -22 -27 82 16 11 -13 -1 -11 39 147 108 96 182 41 34 36
6658C6j05rN7P3j4o8P8n0%n7Q1k4l8P8J6j9m8jJ9L2l3m8O7n6l5NN6O1j47J20m4
$$ 36 -69 -78 -21 52 38 -30 48 -2 -2 -59 22 -2 -40 38 54 35 -13 -14 5 37 4 -44 23 -33 -68 -63 -7 54 -93 27 -17
6689a7Jk1l3J46j19m6J07n0J16j53P3J01o3p7R4q2L9q6o0J09J00q0M8J6m1j2p6
$$ -17 -16 -37 -70 76 -43 -89 18 -32 84 -69 4 105 42 -35 59 -23 16 -70 -130 -21 79 -1 47 63 22 10 -66
6716f6k2M6MJ03j69J28q2J03n7p1J19J4k9o6P0j52J79o0j1L2J4L5Ln2k0O4p9o7
$$ -66 -88 -42 -38 65 -104 24 -58 45 -12 -83 36 50 21 -45 25 -127 52 -8 -19 13 27 62 65 13 -7 57 -22 -89
6744h9P4J15r9n7R6n6nk8l7J49n7o4P3J06j04j9J07j06M7o7R5j53P7L0J2OL6q8
$$ -89 -15 100 1 -56 40 -16 -21 -49 -86 63 6 -58 15 121 17 -2 105 -1 46 -21 74 -79 -2 28 40 46 82 -6
6772fJ6P5j48J33j10O1lj08R6M1q3N4K2K0L5j34J14j13P7J3j36K1R9o5J29j43
$$ -6 10 85 -63 70 -40 21 18 -90 6 47 -36 18 40 60 95 -39 75 -38 39 52 -84 -63 36 -29 100 -43
6798d3J43r0r0O0j2l9M3J70j25n5pM4m8J9N0L3Ml0K0jp9J51k5l9L7r8J20Kj57
$$ -43 100 10 -80 -20 -32 -71 -28 142 17 -38 -45 -1 -49 -30 20 53 57 27 47 46 -33 118 93 54 91 -7 113 115 -42
6827d2J17o5j34P6R2j08L1L2K7J6p5J01K5l8j28L2M9l3kl0N2L5r0k2P4n6J02k5
$$ -42 75 10 -124 -48 44 -64 -33 -1 26 42 -33 68 93 55 -73 -41 8 -25 -27 -57 -5 30 -60 -82 -8 -64 38 13
6855A3l1Mn3J47j29J33r2n1P7pp0J34j21L4JJ7j4J34j71mJ48j05R5jq4k37K76
$$ 13 -18 -14 -67 80 -49 84 -8 -59 18 11 -59 75 -46 -12 -11 6 -8 126 -45 -49 99 -6 89 88 4 -233 43
6882D3J13j91%K3P1o0N4r8N0nQ6j13Ll7Qq8J51j39J88l7m1J16j75j9O2J07kr1
$$ 43 156 -35 -35 -12 59 -1 53 -45 5 0 86 -27 -24 -61 -53 -141 10 -129 59 22 -19 97 -78 -97 -35 72 70 -21
6910b1m3O0j14J10J1Q5p7m2j9Qm5L6M4M9qo2O3j65J24k9j8l1N9N4j7j7kR0Mr1
$$ -21 -64 -4 -118 -8 3 88 11 -31 -50 -42 -87 -51 -7 42 34 -28 35 -130 -6 -35 -53 -84 -25 29 12 -5 -7 83 87 -4
6940dN1jP3j02J3m7N6l8jL9j08Q6J6oOj15l2J93j58P1l7J31n6q2M9o7O9M1l9j7
$$ -4 47 46 119 17 30 -17 39 1 0 39 -69 17 33 27 33 -82 -114 79 -79 -8 -45 86 30 -52 -3 -70 -1 40 1 -16
6970a6R8j11M9R1p9p8J96k33L8L9nqK7O8K8k41K26q4J9Np4J74r8k3L6q9J03j20
$$ -16 82 -29 20 111 32 -46 150 -83 -45 -6 -11 -19 8 76 104 -137 89 5 24 29 -45 129 31 8 44 -45 58 -62
6998f2J57j02kl5J62j78j7O3om3NJK1k4L6pM9k5PJ18j23q2lL6L0m0Q8k3k9P7j74
$$ -62 95 -7 -9 -44 118 -60 -77 -14 -20 -63 -58 -57 -36 -60 -24 -31 18 -7 0 118 -5 -87 -90 -54 -24 -64 24 1 -28 49 -125
7029a25J57J10j00M2j3r8M5l2j6J6o6O6j8K9j11J59j00J09qo9o6J54pN9j19P4
$$ -125 32 142 42 84 71 -27 18 -14 -30 -14 -80 -14 -32 -3 -114 45 -55 54 46 -23 -89 65 58 117 -2 72
7055G2J2j16K4J9K5j20J03m7O1qo3J27j38J10j9p2j00Q3J5l6Q4P3m5J17j02kl1
$$ 72 84 -32 -8 11 36 -84 19 -28 33 25 -38 89 -49 61 42 -30 -130 -47 -32 -68 16 89 44 161 59 57 26
7082B6l4k0k4J03L3%o9N7k8PJ9j18k8n3J30Nk6J30j14Q7n7o9O4j5kQ6j91J34J9
$$ 26 -8 -28 -52 51 84 84 15 72 44 51 70 -48 -76 -129 1 6 -20 110 -4 83 26 -43 21 6 4 90 -101 33 52
7111E2%Q4j02k9mQ9j21N7n3MP4p5P1n5qK8o7R2j23J09k8q0RJ40j61J76o4j9j14
$$ 52 52 136 34 5 1 90 -31 26 -27 -23 51 -24 47 -8 -16 12 -55 37 -86 23 -5 -85 -76 64 -97 79 15 -4 -118
7140a18J65p8j7J05n8o4j0L6j1P4o4P3k2l5K7J3n7n2J59K5p2m4jj0Q3r2nm4L4
$$ -118 47 -31 -48 57 -1 -65 -75 -39 -50 24 -40 33 11 -24 3 16 -41 -93 66 91 19 -25 -26 -36 47 -45 -50 -94 -60
7169f0O6L9Rj40J38j25J00o6rM2q9J52j46M8J07m1j2p0O3q4M4R8n9N8pj16o2R5
$$ -60 6 45 54 -86 52 -73 27 -39 -48 -6 -95 57 -89 -41 66 25 13 -57 6 -78 -34 64 5 63 56 -60 -122 -27
7197b7mk6PP8j7R2j75J07n4L8p5L3OR3n0j20J10o8J33j88J11j5rq2J02j08M1J33
$$ -27 -31 -57 -50 28 11 103 -72 35 -19 19 -56 -23 -17 76 26 -94 16 -52 81 -107 4 -11 -20 -102 0 -108 -67 66
7225F6o6q8Q1k2k2R9j25Q6n1qJ35q8n8N0K1M8p6N9lR3j15o9J17n8J9J3l8K0j05
$$ 66 0 -88 -7 -29 -51 48 -77 9 -42 -50 85 -3 -61 -11 10 58 -18 41 38 131 16 -53 64 6 25 38 0 20 -85
7254h5J30Op7J2L4N1j52P1Pj05J11J46j85m0PR9J05j35R0j61O8O8n7J39j04pl3
$$ -85 45 51 -26 -14 20 71 -81 -10 -3 -108 3 149 -36 -76 -69 30 135 0 90 -71 -3 65 8 147 43 36 3
7281Cl4nQ5p7j0P1j74K92o3n2m9l8Q4j92J34j6J39L1k65K36n9o5o3J25r6J7JJ8
$$ 3 -31 -36 49 -28 -38 33 -141 151 88 36 -13 -51 33 -159 -25 -41 98 129 -136 100 41 -24 -87 38 -58 -41 -40 -22
7309b2n2J5J6J59j62O0k5J8L4L8j9o9L4P4j20LM8n8K2mL8k9K4K1O4j83J02j23
$$ -22 -74 -59 -43 116 -46 14 -11 7 41 79 60 -9 25 99 -21 -18 30 -28 -6 -10 28 -1 23 44 108 -75 27 -96
7337i6Q4m7N1K0J20l9ll6p7N2N3n3p9J34n5l9J57j54J2Q7j17K8n6J69j25O4Qj2
$$ -96 -12 -59 -8 12 132 93 90 54 -23 29 82 29 -50 84 29 -10 147 -7 5 92 -25 3 -53 116 -9 55 63 51
7365E1p5QJ07N3j27j06J67j06M9q0J7N2l2J12j47N7j5m2P4j18J31n6rQ0M3j68
$$ 51 -24 -16 91 144 17 -89 78 -28 21 -59 -42 10 -22 90 -57 0 -15 -57 17 -101 30 -26 -35 45 88 -80
7391h0j5O7O5O4k5o0lj13M8J51k95K44qj3L4J5r1J19m3k0p0M6j09qJ48l5l2N0
$$ -80 -95 -28 37 101 76 16 13 -100 -52 99 -196 48 40 27 61 76 -15 104 61 41 -29 17 -92 -100 48 13 -19 31
7419C1M7j63N6QN2l9p0J39j27O9k0k8L6L5j01J27Nl9p8k0Q2M9nj01O4l1R4J1j75
$$ 31 78 -85 -29 -21 31 -8 -78 61 -66 3 -17 -45 -9 26 -75 52 57 18 -60 -80 2 51 46 -55 9 -22 72 83 -92
7448i2J07k1Q5j7j00J13o7J06l8j28M5k9K4k7J18j47J16j9l4r3P4P7j24P8J05
$$ -92 15 -6 79 62 -38 75 8 114 76 -52 -7 -36 -12 -39 79 -68 48 29 -5 -98 -24 53 -71 7 112
7473A12m6P2rq1%QK0j19lR7l3j37J17j9K5K8p7R7k0l4n2R0m5p6J57j31K0J24j79
$$ 112 66 138 129 48 48 56 76 -43 -46 51 18 -119 -2 -21 4 32 -45 52 32 -2 -54 36 -9 -85 72 -59 -39 85 -94
7502i4O6LM6K4k5j82K14j62J23jJ8K1L5j01n9P5o0J36l5l9ko0J57l2j36LJ99k08
$$ -94 -28 -25 21 45 20 -162 52 -110 13 12 30 51 86 -15 -74 1 -59 77 42 3 1 -59 98 66 -70 -67 132 -76
7530g6J27j14J58q3j1k9M1k0K4l1O5j9j28J34l7n9P5o0Q9p0N3N0j14M5r6J20j
$$ -76 51 -63 95 12 1 -28 13 -7 17 -14 51 32 -96 38 1 -58 17 -43 46 -24 29 79 -35 10 -86 34 33
7557C3p5j6R7rj36O1P8JO3p7p6J64j00l9l9N6p7Q5j07J07N8p5l9J75k5q4j18J79
$$ 33 -42 -58 39 30 -106 -45 33 34 97 20 -56 108 8 -31 -70 -14 -91 -6 -113 -6 52 -23 -62 113 88 4 -114 65
7585F5p1M1k2J5Q3m6r0M2j37J01P1jK8j10J04j02R4l0j7j7l2Q1m2P8nk1r2J30
$$ 65 -6 35 13 28 111 65 -25 17 -120 -19 52 51 79 -31 73 -29 65 35 18 1 -31 50 8 86 81 60 -32 98
7613I8k1p7JQO7o9Q1q2j8j2OL1j3P7j40R3l4J7J6M8j24J87j36%P9j56Q5K4m1p0
$$ 98 77 0 1 9 76 7 88 6 -12 -24 -18 13 0 77 -63 30 -4 13 29 77 -47 140 4 4 83 -73 12 36 -5 -75
7643g5N2O1j07k3lQ5r9Q4Q2j8l4Rj4J5M3J1n9q8O6krOO3q9O2L2M5n4k4lk4M4M0
$$ -75 -23 38 -69 -92 -95 -10 -109 -25 57 39 5 14 0 15 58 69 10 -78 -12 -14 -23 -17 46 -43 19 51 96 42 18 15 -9 35 75
7676G5n5o9M8j4L4o2N5j47J54o2n8J17n4JN5n1Rp4Q9Q0n5j7N5Nj18L2K0J3p0J6
$$ 75 20 -49 -1 -15 19 -43 12 -135 19 -43 -101 16 -38 -37 18 -33 -24 -98 -9 71 16 -1 54 59 -59 -27 -7 6 -64 -48
7706d8LL9L4J6m9Rk8l4J53r3O3q1M6l9J8qj1K8p7j3P3j0N3R6j11M3j8j4n1O3o4
$$ -48 -45 -6 28 44 -5 4 -24 -58 95 2 65 -16 30 -9 9 1 -10 18 -59 -72 1 -9 44 140 29 72 54 40 -11 52 -12
7737a2Q0n7K9K2j05P5K3p5j31R8jQ5j28J88j42m6J15j35R1M7P6p4K6q5pPK9n0
$$ -12 68 11 40 62 -43 32 55 -20 -151 -53 -54 31 -97 91 -51 -97 18 -117 -26 21 97 23 49 -36 -43 -36 -7 -57
7765e7J68J5j8r6L0Q1j04qr4M7Q9J1o9o5M6M5K9q2J9Q0m2m8q9P9J60L1j76P5l1
$$ -57 111 126 108 12 42 123 19 11 -83 -36 53 64 -5 -70 -24 21 50 -32 -13 67 25 -23 -112 -33 127 158 -18 57 26
7794B6o5J05j60O6Q5P7m3j42L0j8k1M1LN0j34N7M2K8K4k2Oo8Q3k5k6l8J27r7n7
$$ 26 -39 66 -94 -28 57 134 91 -51 -21 -39 -60 -19 -16 34 -100 -43 -1 27 51 29 35 -33 50 25 -1 -39 88 -9 -66
7823f6K45k69J35l5k6R1m6M7r7MO7m8P6p8P6j88J03O1n2M2j44O7l2O3l1J34p1
$$ -66 179 -90 45 10 -16 75 29 76 -21 -17 50 2 78 0 76 -112 -9 52 0 42 -102 -35 -67 -4 -35 99 28
7850B8p6N2L3p9P6M1m9K4j12P8j05M0R8K2j5nq2R9q3j0J16k1p1k5m1J22l7J20
$$ 28 -48 4 37 -42 34 75 26 50 -62 16 -89 -49 49 71 56 51 -31 68 -15 -25 91 70 -1 -26 -67 55 18 138
7878A38j07k6Po9N8P2J25k51J47j43J24k8K3p0j24kJ01k7M1j8Pqq7J92j13N1O0
$$ 138 31 5 12 -57 1 73 198 -53 94 -49 75 47 70 0 -124 -126 -25 -52 -11 -29 -22 -30 -117 75 -38 13 73
7905G3j07K0nr4P0J1m2J29o5Q6n1l3J22n1q0O6O2j28l3O4p6J6N2k8J10j02k4l4
$$ 73 -34 -14 -19 -113 -43 -32 -74 55 -10 76 25 -8 114 63 -17 49 111 -17 -50 14 -62 -46 6 -22 88 -14 -38 -72
7933g2J37o4l0k5Q6l1J53j3k37O5J16n2Jk5q5kP8l3O0l7n4M3%m0J3P8j26J42r7
$$ -72 65 1 -29 -54 32 1 154 141 -96 -31 85 33 34 9 -76 -78 0 -33 27 -10 -64 -21 -21 -61 -48 30 -96 46 -51
7962e1J09p7J6K3K0l4K4Q2j20P1m8L7j10m3J00L7l4J18n9j7p3L0n6N9j7q6J09
$$ -51 58 -19 -3 20 40 6 30 112 -8 63 15 52 -58 -101 -1 36 2 120 61 44 -29 1 -55 4 -13 -99 10
7989A0Q8j15L5K9k6N8k02J58m3Ql9Ml3J49j3r5J7q8J41k6J9L4q9j17J10j3pK5
$$ 10 98 -17 18 47 21 79 -123 35 -8 0 -39 -35 -68 81 68 -27 -10 -98 43 17 36 70 -19 -136 -26 -39 -46 -21
8017b1J39j76N4j17J31n0L1R3j83P5N2l7J24j64J3o5j9J04O2M0o3l7m6M6J38p8
$$ -21 118 -58 -4 -121 10 -40 -9 84 -99 -24 28 -9 115 -49 -36 -101 -120 -16 46 86 23 -14 -60 -14 124 46
8043D6o8J26r4Q8j14qN0m1O8pk2K8n7M2qp1J18m0qN3j36K4Q1p1J4M4l4l8M3M3
$$ 46 -22 104 10 98 -16 -24 26 -15 53 46 24 52 -5 37 29 -42 76 36 28 81 -55 -31 50 -21 -7 37 3 -35 8 51
8073E1No7m4Q5L8j50n6J81j22J49M5j02O0q2r7J41m1K7kRq4qM1OJ0M9j13L8N3
$$ 51 56 -11 -55 30 68 -82 -138 43 -79 70 115 13 73 -9 -106 35 -6 21 19 28 -56 -64 -23 -17 -7 42 -71 -33 20
8102B0j05L7R6n4Ln2m1M5M7j09R6OO9P5o9k3p3P2L5o9o6N3Q7q6oL5J1j2%l0O5
$$ 20 -85 -48 48 -6 -3 -55 -96 -51 -4 -113 -17 -11 58 133 64 41 -32 40 75 6 -60 -7 80 -6 -12 23 34 22 22 -8 57
8133E7j14J56n1p3O0m0j01O7QQ1m4j6Ok8J09j45J21jln3ol3N7J8o7j5L5O3q2P1
$$ 57 -57 99 48 -25 35 -5 -106 -39 -31 50 6 -10 -4 -32 77 -68 53 52 49 -4 -10 -43 14 32 -35 -50 -15 48 -34 37
8163C7l3o2N2O9p2N8q1j4J18j89N3P0k0P3n6mn3J13j4m1r3J35j2k5mP7j28L7
$$ 37 4 -58 -6 63 -9 49 -32 -46 72 -117 -64 6 -14 59 3 -1 -54 59 45 4 -89 46 34 9 5 82 -46 -9
8191i
$$ Imaginary data points
##PAGE= N=2
##DATA TABLE= (X++(I..I)), XYDATA
0@%%%%%%%%%%%%%Nj3J6j6J6j6K4l2L3m1N3o1P2q7R6j06J26j48J67j89K13k40K72
$$ 0 0 0 0 0 0 0 0 0 0 0 0 0 0 5 -8 8 -8 8 -8 16 -16 17 -24 29 -32 40 -47 49 -57 69 -79 88 -101 112 -128 144
36A44l05L42l83M27m78N33n89O53p24Q00q82R71j073J185j305J435j579J742j924
$$ 144 -161 181 -202 225 -253 280 -309 344 -380 420 -462 509 -564 621 -684 751 -828 914 -1010
55a010K129k362K628k937L299l730M255m911N761o906Q538j1077J5595k6018R3201
$$ -1010 1119 -1243 1385 -1552 1747 -1983 2272 -2639 3122 -3784 4754 -6323 9272 -16746 76455
70G6455K1038k08871J5125J34472N2285q7345m5103J4732J8595J1798M4139j6414
$$ 76455 97493 -111378 -96253 38219 90504 3159 -41944 -27212 -8617 3181 47320 30906
82C0906q2642k3126J00815O3185p5644r2913M2480Q4916l059n5283j4384J2273
$$ 30906 -51736 -74862 25953 89138 13494 -79419 -36939 47977 44918 -10365 -24749 -12476
94a2476J0345J8198J6095l3208m5030K7343N9630j4688n4083L759L6171p504j6982
$$ -12476 -2131 16067 32162 -1046 -46076 -18733 40897 26209 -27874 -24115 12056 4552 -12430
107a2430K8110J0317n5729j5569P6082L3935p8957n5098O4621O7072m3502o0297
$$ -12430 15680 25997 -29732 -45301 30781 64716 -14241 -69339 -4718 62354 18852 -41445
119d1445K4931L7087k0505j1358L0603n718n3177Q461P7905K996r1029k2281Q6897
$$ -41445 -16514 20573 68 -11290 19313 13595 -39582 -31121 46784 49780 -41249 -63530 23367
132B3367M2080o7401n1152M3701M5914k1795k7605N612K838j647J8529Q573l2886
$$ 23367 65447 -1954 -53106 -9405 36509 14714 -12891 -7279 -4441 -6088 12441 21014 -11872
145a1872k3631L7754L7058l3768m3686K3113M2858q722l3825K91J9785p27k213
$$ -11872 -35503 2251 39309 5541 -38145 -15032 27826 19104 -14721 -14430 5355 4628 2415
158B415R970j2595k4113J8987L8810j6140n3079O258N9195M103n5898j2067M4127
$$ 2415 12385 -210 -24323 -5336 33474 17334 -35745 -29487 29708 33811 -22087 -34154 9973
171I973J4217l0256q634K2623k337k0602J5844K4380k2978l0323K1556L5831j5267
$$ 9973 24190 -6066 -14700 7923 5586 -15016 828 25208 2230 -28093 -6537 29294 14027
184A4027l6842Q878K9691q148j9782J1127J1561j7058j1268K3945J6587k6487
$$ 14027 -22815 -13937 15754 7606 -12176 -1049 10512 -6546 -17814 6131 22718 -3769
196c769k1471K2816K2363j1876j6325K959O020k035P206R652j8422k2280K0794
$$ -3769 -25240 -2424 19939 8063 -8262 -5303 717 -1318 5888 15540 -2882 -25162 -4368
209d368L2588j4010l8735N74L6827R441k6602j1244J1957N496J630N919n377j8476
$$ -4368 28220 14210 -24525 -23951 12876 22317 -4285 -15529 -3572 1924 3554 9473 4096 -14380
223a4380N29K9457R643l3140j9037K7413K4060j6920k4905O690J8727k375q988
$$ -14380 -13851 15606 25249 -7891 -26928 485 24545 7625 -17280 -10590 8137 5762 -3226
236c226K919j318o733P388J2842p076j8386M480K2945j504k1782k36J7510J357
$$ -3226 -307 -1625 -8358 -970 11872 4796 -13590 -9110 13835 12331 -9451 -9687 7823 9180
250I180j3629r73J0708k557r873N909Q480q452p766Q412P818p690p680Q698P113
$$ 9180 -4449 -5422 5286 2729 -7144 -1235 7245 -1207 -8973 -561 7257 -433 -8113 585 7698
265G698r419m504J0436L491j0647m143J1449N317j2712n929J1735M329r424l711
$$ 7698 -1721 -6225 4211 7702 -2945 -7088 4361 9678 -3034 -8963 2772 7101 -2323 -6034
279f034O231K215n441R99O334n008o817Q451Q439q112r991O082J2464l799j2568
$$ -6034 197 2412 -3029 -2030 4304 -704 -7521 930 9369 1257 -8734 -2652 9812 6013 -6555
294f555J987R050o78m979m51J257j785j66N663k42j0034L76J1616K105j0262m701
$$ -6555 -4568 4482 3804 -1175 -1626 -369 -2154 -2320 3343 3101 -6933 -6557 5059 7164 -3098 -7799
310g799R095O748p099n065M928J843k662O26J452k404l789L418N662m836o728
$$ -7799 1296 8044 945 -4120 808 2651 -11 615 2067 -337 -4126 -708 4954 118 -6610
325f610M595N996k466n469R39O033q25m776K830L051l061j912L054J966l136l154
$$ -6610 -2015 3981 1515 -3954 -3015 3018 2193 -2583 247 3298 237 -1675 1379 3345 209 -2945
341b945L546K406m825p96L669m84k971K8L666M80m716L02N287Kl768j47K290J454
$$ -2945 601 3007 -1818 -2614 1055 571 -2400 -2372 1294 1774 -2942 -2640 2647 2649 -1119 -1266 1024 2478
359B478j704j134J581j163j609K818O63l250j945K180L526k011m160K082K976
$$ 2478 774 -360 1221 58 -1551 1267 1930 -1320 -3265 -1085 2441 430 -3730 -1648 1328
374A328j037l91L64j19l85M25K129j83l424J78K765k06j497q86M28K76j175R69
$$ 1328 291 -100 264 145 -240 185 2314 2131 -1293 -1115 1650 1444 -53 -939 -511 -235 -1410 -441
392d41J893k498k392K134L303P32l831j938L461K297n79j294j947j47K065J847
$$ -441 1452 -1046 -3438 -1304 1999 2731 -1100 -3038 423 2720 2141 847 -1100 -1247 818 2665
408B665l34l991l031L845M337j166m756k826L375N667m15m765k926K098O238J127
$$ 2665 2331 -1660 -4691 -846 3491 2325 -2431 -5257 -1882 3785 3370 -1395 -4321 -2223 4015 5142
424E142n239l397J653M224K249l281l707j349K199N035Q04o710m537L701P796
$$ 5142 -97 -3494 -1841 2383 4632 1351 -2356 -3705 -1506 3529 4333 -2377 -6914 -3213 4583
439D583J186q026m967N201O734L14n167l646K492L237J179L05l732m562J836O836
$$ 4583 5769 -2257 -7224 -2023 4711 5025 -142 -3788 -1296 1941 3120 3425 -307 -4869 -3033 3803
455C803K808p372q242M409R954N40p745n468M048P784N93n292l072P27L886K975
$$ 3803 6611 -761 -9003 -4594 5360 5900 -1845 -7313 -3265 4519 5112 -180 -3252 -2525 1361 4336
471D336p43l707m333P81Q059K666q190p447L588J0669J954j0738o352O929Q474
$$ 4336 3593 -114 -4447 -3666 4393 7059 -1131 -8578 -4990 5679 7633 -3105 -9457 -2528 5946
486E946p37p689k694N420K621r61M01j759l628L77O155L521p419q639N622J0502
$$ 5946 5209 -2480 -5174 246 2867 1906 2307 548 -3080 -2703 3452 6973 -446 -9085 -3463 7039
502G039j508j0129l637Q204O435n505n707L185M073q61k378J567J684l744j439
$$ 7039 5531 -4598 -8235 -31 6404 899 -4808 -1623 2450 1589 -789 778 2462 -1282 -2721
517b721N504K093n392m217K852O138j109p398j025O121L856l957n843K290O357
$$ -2721 2783 4876 -516 -4733 -1881 4257 3148 -4250 -5275 846 4702 745 -5098 -2808 3549
532C549j135m604J228L191n25k852J154L639l234n137L818O354k134q347j717
$$ 3549 2414 -2190 -962 2229 1704 -1148 6 3645 411 -4726 -908 5446 3312 -5035 -6752
547f752R662M256r416o629P320Q450l490q318J176O813n85l062J747M63l356n31
$$ -6752 2910 7166 -2250 -8879 -1559 6891 3401 -4917 -3741 3072 2487 -575 1172 1635 -1721 -2252
563b252N339K438p308n976O222Q265k264r669l282Q719P104m796p492N0O404L777
$$ -2252 3087 5525 -1783 -7759 -1537 6728 4464 -5205 -8487 232 7336 2540 -4952 -4902 1502 5279
579E279l395m017L15J803K201J136k000l202j968K562N682m38p954l011O958O999
$$ 5279 1884 -2133 -1818 -15 2186 3322 1322 -1880 -3848 -1286 4396 3958 -3996 -7007 -49 6950
595F950m442r498J650Q985J269n069k063K032J262j308J690K099m407m123M720
$$ 6950 2508 -6990 -5340 3645 4914 -155 -2218 -186 1076 -232 1458 3557 -850 -4973 -253
610b53O142k394q765j834Q755M522n697n328J251M483K325j809k155j539M36M475
$$ -253 5889 3495 -5270 -7104 1651 6173 476 -4852 -3601 882 3207 1398 -757 -2296 -1860 2615
626B615K349m253m691J100N112K812l864n463J30M838L944l041o773L35O738K818
$$ 2615 4964 711 -3980 -2880 2232 5044 1180 -4283 -4153 685 4629 1588 -5185 -4850 1888 4706
642D706l828n105J192N310R18k235j455n20R89J775O85j751l590nN281J455n282
$$ 4706 878 -4227 -3035 2275 3193 958 -497 -1017 -28 1747 2432 681 -2909 -2914 2367 3822 -1460
659a460l011K857M235j230l861P16K584l89R5N12q57r39L71K219M42k902p47J572
$$ -1460 -4471 -1614 2621 1391 -2470 -1754 830 441 536 1048 191 -748 -377 1842 2284 -618 -1365 207
677B07O62k95j103j037N43P45O11K35k031l88K138J100l67j657m47K059P76j077
$$ 207 869 574 -529 -1566 -1023 -278 333 568 -1463 -1851 287 1387 1020 -637 -1084 975 1751 674
695F74m26n37o3J351M54j648k101P53L182k62l402k36K352J109q29j394K69J227
$$ 674 248 -289 -352 999 1453 -195 -2296 -1543 1639 1377 -2025 -2261 91 1200 371 -1023 -754 473
713D73L88M51m98j588M94J585K46j500j729J014K023q85j839m4Q94Q99n46n22
$$ 473 861 1312 814 -774 -280 1305 1551 51 -1678 -664 1359 474 -1365 -1409 -515 384 -162 -684
731f84M17j18M44J105q51q94P43J084m9j208p64J432Q1j130O8k84J88K66m27N5
$$ -684 -267 -385 59 1164 313 -581 162 1246 1197 -11 -775 657 738 -392 -324 -608 -420 -154 -581 -526
751e26J59m27O11N90o49J97K64L41R0p36N81O34j075l67R07l49m87m32J66N94
$$ -526 -367 -794 -183 407 -242 -45 219 560 650 -86 495 1129 54 -313 594 245 -242 -674 -508 86
771H6o78m17R78m12p9O63j90J81J4J35P68l63j027P86N09k97n41q89O73N03r26
$$ 86 -592 -1009 -31 -443 -522 141 -49 132 146 281 1049 686 -341 445 954 657 116 -773 -100 403 -523
792e23LK09n59O38K96l66k71r3J085P16j160m36R77L94q6p97l19P17j14m40J74
$$ -523 -520 -311 -870 -232 64 -302 -573 -666 419 1135 -25 -461 516 910 824 27 -292 425 311 -129 45
813D5o74o5N81p3q9l87j45J158j15o99M01N05J52j76m39N88R0p17L97J63r50K59
$$ 45 -629 -694 -113 -186 -275 -662 -807 351 236 -463 -62 443 595 419 -20 568 658 -59 338 501 -449 -190
835a90J19k59k35l32O98K89q09L3Q16J98j43m57M31P42m50l31P43o72j63L25q3
$$ -190 -71 -330 -565 -897 -199 90 -719 -686 130 328 185 -272 159 901 451 120 863 191 28 353 270
856B70k53o80p3J056m25j084N67N69q0j70J7P25j33o49R47M90r46k39M22M70l24
$$ 270 17 -663 -736 320 -105 -1189 -622 -53 -133 -303 -286 439 306 -343 604 1094 148 -91 331 801 477
877D77j125M21O51q92k71Q52k14o70j85J035N84j342j27J399J99m43l62M3P92
$$ 477 -648 -227 424 -468 -739 113 -101 -771 -956 79 663 -679 -806 593 792 349 -13 30 822
896H22k52l51L02p20l77R19J62r35n39J62J229l61j236R46L51n09P02M92n70o63
$$ 822 570 219 521 -199 -576 343 505 -430 -969 -807 422 61 -1175 -229 122 -387 315 807 237 -426
916d26K59J676j24k486N16J809l19j505n58J205N59j644J9J647o46j331P68J521
$$ -426 -167 1509 1385 -1101 -585 1224 905 -600 -1158 47 606 -1038 -1019 628 -18 -1349 -581 940
934I40K0j980k2K670j31k158L00J125K22r05p33J015k66j001P32M41j008q5L91
$$ 940 960 -1020 -1042 1628 1497 -661 -361 764 986 81 -652 363 97 -904 -172 269 -739 -824 -433
953d33N41J11o66L10M25j34P06P6j359q4J397N16j183j782J438J870j760j724
$$ -433 108 219 -447 -137 288 154 860 936 -423 -507 890 1406 223 -1559 -121 1749 -11 -1735
971a735J201J123r01j172J490J227k195q88K952J168k674j665K693K393k333k739
$$ -1735 -534 589 -312 -1484 6 1233 -962 -1850 1102 2270 -404 -2069 624 3017 684 -2055
987b055J790K081j301j651M20J219m78j368J164J021j852o67J860J378j298j614
$$ -2055 -265 1816 515 -1136 -716 503 25 -1343 -179 842 -1010 -1677 183 1561 263 -1351
1003a351J132J691o56p61R5k93L48R66n87j360o71J723Q00k002l87J435j53j039
$$ -1351 -219 1472 816 55 150 -143 205 1171 584 -776 -1447 276 1076 -926 -1313 122 -31 -1070
1021a070P82J241o60j893J182L036j156l219N91K973M99k980j317K777P72k675
$$ -1070 -288 953 293 -1600 -418 2618 1462 -1757 -1166 1807 2306 -674 -1991 786 1558 -1117
1037a117r7J905n48j835O17K737n49l636P53L914l07k859j60J987Q23j602l03
$$ -1117 -1214 691 143 -1692 -1075 1662 1113 -2523 -1770 2144 1837 -1022 -1182 805 1628 26 -277
1054b77Q87q25k69J407j63j559n99J050J262j183j019J102L28k45L65K92o62n61
$$ -277 610 -215 -484 923 760 -799 -1398 -348 914 -269 -1288 -186 142 -103 262 554 -108 -669
1072f69R60J764j281k546J473K268j390k063P23J915p56k178J504J457k063j104
$$ -669 291 2055 774 -1772 -299 1969 579 -1484 -761 1154 398 -1780 -276 1181 -882 -1986
1088a986K316J392j872j876K217K273k129j687J741J261j350j115J059R10j941
$$ -1986 330 1722 -150 -2026 191 2464 335 -1352 389 1650 300 -815 244 1154 -787
1103g87o80K117L25k305j72J871O02j788n65J969K80j388P77R29r41r18J026J193
$$ -787 -1467 650 975 -1330 -1502 369 971 -817 -1382 587 867 -521 256 1185 244 -674 352 1545
1121A545j257j607J562J390k025j054J239P78r92o59J109P87j762l6K019j10j754
$$ 1545 288 -1319 243 1633 -392 -1446 -207 571 -421 -1080 29 816 -946 -982 1037 927 -827
1138h27J6J923O35k287o93K511j53k029Q9J601k37j902M04K047j171j827J477
$$ -827 -811 1112 1747 -540 -1233 1278 1125 -904 -815 786 549 -1353 -949 1098 -73 -1900 -423
1155d23J819j375j312Q84J728r11j235J207R48j446n45J088M84j116j046J453
$$ -423 1396 21 -1291 -407 1321 410 -825 382 1330 -116 -661 427 911 -205 -1251 202
1171B02J000j999p73J755L45j272k83J404M79j629R1J981n46j672Q71J517p23
$$ 202 1202 -797 -1570 185 530 -742 -1025 379 858 -771 -680 1301 755 -917 -46 1471 748
1188G48j401P7J693r50j421J148P03j070n89R07Q18j042r42J570R35j488l11J195
$$ 748 -653 -576 1117 167 -1254 -106 597 -473 -1062 -155 663 -379 -1321 249 1184 -304 -615 580
1206E80N17q64r12J321N49j685k20J512k29j558J89J293N1j834K64J832m94j303
$$ 580 1097 233 -679 642 1191 -494 -714 798 569 -989 -800 493 544 -1290 -1026 806 312 -991
1224i91Q53R75k68j042M73J117p84j090J123N66j133n19N88Q21r05j074J199O77
$$ -991 -138 837 569 -473 0 1117 333 -757 366 932 -201 -720 -132 689 -216 -1290 -91 586
1242E86j184l88J042M15q87j54J106M40j339M1J466k74j363K13Q98J1j320Q4J333
$$ 586 -598 -986 56 471 -416 -570 536 976 -363 -322 1144 870 -493 -280 618 629 -691 -607 726
1261G26q66r62Q06Q07p69p59O72J270q75p77J012O74p78m41P02M12r33o97J380
$$ 726 -140 -1102 -296 511 -258 -1017 -345 925 50 -727 285 959 181 -260 442 854 -79 -776 604
1280F04J9j258j20R57J58r52m39J138K09j059L28R71k57n49K44P65j49j027N24
$$ 604 623 -635 -755 202 360 -592 -1031 107 316 -743 -415 556 299 -250 -6 759 610 -417 107
1299A07Q62o49r14N85M39m21p43M01P99p15p73J016K75p33k1P58M32p07m36J138
$$ 107 969 320 -594 -9 430 9 -734 -333 466 -249 -1022 -6 269 -464 -485 273 705 -2 -438 700
1319G00N9j003K73L18P6o53k55Q19j33j136L16J002n33m22J57O71j6p02L40Q84
$$ 700 759 -244 29 347 423 -230 -485 334 201 -935 -619 383 -150 -572 -415 256 240 -462 -122 762
1339G62o14l26M99J63k37m65K50N81o88m84O06L3n42r9J82N03l43l60P78K9n07
$$ 762 148 -178 321 484 247 -218 32 613 -75 -559 47 80 -462 -561 -379 124 -219 -579 199 228 -279
1360b79L44L80j81k00j48O05Q3r66K57N09m68l28J31J09j5m07K04N39l92r7M69
$$ -279 65 445 264 64 -84 521 604 -362 -105 404 -64 -392 -261 -152 -167 -574 -370 169 -223 -320 149
1381A49N1n9j64R0O19m32l64M39l8l02m5J36P8l72k69L60L6l27J61K88r9J1o8
$$ 149 200 141 -23 67 686 254 -110 329 291 -11 -56 80 158 -214 -483 -123 -87 -414 -253 35 -64 -53 -121
1404a21K72J76l24K89P5k85J39M5pj01m86K07K23l88NN6n8K05k64P1M07j04q9
$$ -121 151 327 3 292 367 82 221 266 259 158 -328 -121 102 -286 -281 -225 -283 -78 -342 -271 136 32 -57
1427e7K57J44k02j7J21J27j00l16J58m4m0j16l30K88P5k82O5P9q6L25k48J26L72
$$ -57 200 344 142 125 246 373 273 -43 115 71 31 -85 -415 -127 -52 -334 -269 -190 -276 49 -199 -73 299
1450B99k23kK54m8J6j3l26K14J08l40q9o3K2J65k81o7L69k07P3J26n5L03Ok35
$$ 299 76 74 328 280 296 283 -43 171 279 -61 -150 -213 -191 -26 -307 -374 -5 -212 -139 -13 -68 235 241 6
1474FL62j9j92J2j29L77j91n34J37K70l59j12k6K09K13m57J14N58k71n9L13N9
$$ 6 368 349 157 169 40 417 226 -308 -171 99 -260 -372 -398 -189 24 -433 -319 239 -32 -91 222 281
1496B81J08k76j62M33j37k83j28K29O2j96m16K41L44n78J49J79R3K7j16R3L53
$$ 281 389 113 -49 384 247 -36 -164 65 127 -69 -485 -244 100 -478 -329 -150 -57 -30 -146 -53 300
1517C00j57n2K19m4L1k15j30J51q9n9k4m09L84P7n23J08L41o6J19J2QK59q1j04
$$ 300 143 91 310 266 297 82 -48 103 14 -45 -69 -478 -94 -17 -540 -432 -91 -157 -38 -26 -18 241 160 56
1541E6K54j6o1j69Q1J89l13m17L13K11k71k10N6K88o2k82K15K84k92P4K21N9M1
$$ 56 310 294 233 64 145 334 21 -396 -83 128 -143 -353 -297 -9 -71 -353 -138 146 -146 -72 149 208 249
1564B49j69L0K87k73r6J5j11J48j41k12J45J0k74K88K5r0J79l0J34K4j16L69j25
$$ 249 80 110 397 124 28 43 -68 80 -61 -273 -128 -118 -392 -104 -79 -169 10 -20 114 138 22 391 266
1587B66j94L02j36l45J48L8j47j25j62L14k5l39J09K21N1j38j8K25K46k23q7J93
$$ 266 72 374 238 -107 41 79 -68 -193 -355 -41 -66 -405 -296 -75 -24 -162 -180 45 291 68 -19 174
1609A74m9J02q6L3J48l02m02M22j31j53Rl6K23k12qL64r7k34M51R5k01M1R1rJ08
$$ 174 125 227 141 174 322 20 -382 40 -91 -244 -235 -271 -48 -260 -268 96 -1 -235 216 311 110 151 242 233 341
1634C41k91J34L3m11J48j9k57J35j05L2K10k18l8K27J01om7L39l7p2j1J11j51
$$ 341 50 184 217 -194 -46 -65 -322 -187 -292 -260 -50 -268 -306 -79 22 16 -31 308 271 199 188 299 148
1657A48k99L27J1l05k6r5K39k12l71M67L5j09P5K4K12n4j25L25J24l46J23L7%
$$ 148 -151 176 187 -118 -144 -239 0 -212 -583 -116 -81 -190 -115 -91 121 67 -58 267 391 45 168 205 205
1680B05j61j11R8Q5l49r5L74l06l9NK30J28j97L0M01j99L2R6p0M1k3q3J07j96
$$ 205 44 -67 31 116 -233 -328 46 -260 -299 -294 -64 64 -133 -103 298 99 131 227 157 198 175 92 199 3
1704Cj87J11o9p2J09r6N9J1k64M35M4k57L01P0k6n1J9J38M6m31R1L40k38k36n4
$$ 3 -184 -73 -142 -214 -105 -201 -142 -131 -395 40 84 -173 128 198 172 121 140 278 324 -107 -16 324 86 -150 -204
1729b04K91k02k74R8K67j66QL07j21J28j98J87J10j3j92J84r4Qj08M4J1m0l16
$$ -204 87 -115 -389 -291 -24 -190 -182 125 4 132 -66 121 231 218 26 210 116 124 16 60 71 31 -285
1752b85L12j29k04L9J40M0P2j83J89J43j77N5K28J4o1J4lO2m07N3R6j90p3J72
$$ -285 27 -102 -306 -267 -127 -87 -15 -198 -9 134 -43 12 240 254 193 207 204 266 -141 -88 8 -182 -255 -83
1776h3j58J50j38J9J63m9N4K81k54K7K05r7OK6j07M2K0j51q1l4J1l1q4J18J16
$$ -83 -241 -91 -229 -210 -47 -96 -42 239 -15 12 217 120 126 152 45 87 107 -44 -125 -159 -148 -179 -263 -145 -29
1801b9l00J34J51P8k5K0pJ99j64J38P3o1k08J57j56L7j72o8J20j3k04J87r5P1
$$ -29 -329 -195 -44 34 9 29 22 221 57 195 268 207 -1 156 0 37 -135 -203 -83 -96 -300 -113 -208 -137
1825a37J48k01K88M5j42lJ36n9K20j44Rl5j42J59k50J5o9Q5j85KP2L9J98j58L9
$$ -137 11 -190 98 143 1 -2 134 75 295 151 160 125 -17 142 -108 -93 -162 -77 -262 -260 -188 -149 49 -109 -70
1850g0J48l0O5KN7J18j70j22J86n8l1p9r1P3j67L6m9M2p9K05J0r2J27j04K29J45
$$ -70 78 48 113 115 172 290 120 -2 184 126 95 16 -75 -2 -169 -133 -182 -140 -219 -14 -4 -96 31 -73 156 301
1876C01j75K9N9j04P8k56q8K05p0p4P9k14O8P1j23J04J04o2K04jj65K96j40j39
$$ 301 126 155 214 110 188 -68 -156 49 -21 -95 -16 -230 -162 -91 -214 -110 -6 -68 136 135 -30 266 126 -13
1900a3K17l4l5kj60J76j21k00kj8j54J68pK1K30j98J4K83j20J50l0o5J65j32o
$$ -13 204 170 135 133 -27 149 28 -172 -174 -192 -346 -178 -185 -164 66 -132 -118 165 45 195 165 100 265 133 127
1925A27J9k04K9J24l15K05Lj46K5P1j67J51nn1K78j92J13J10r6J98n6j83J21n7
$$ 127 146 -58 -29 95 -220 -15 -12 -158 -133 -62 -229 -78 -83 -134 144 -48 65 175 79 277 221 38 159 102
1949A02r1L2j39j29J01q6J01L8o1qK6M8J90j24M7K2J19P2j39J4n4J27k29K4Qj71
$$ 102 11 43 -96 -225 -124 -210 -109 -71 -132 -140 -114 -66 124 0 47 69 188 260 121 135 81 208 -21 3 11 -160
1975a60N6m5K3o6j8L3J68n4j8J76o1j14J99LM7j26K2J55k25O8jk58P5jL3o3p9
$$ -160 -104 -149 -126 -192 -210 -177 -9 -63 -81 95 34 -80 119 122 169 43 65 220 -5 63 62 -196 -121 -122 -89 -152 -231
2002b31K9J92k2lL1Q0J13l7j79L51r3j28O9j15J1n1n9P4n3k00J27M5r8p9J29N7
$$ -231 -202 -10 -32 -35 -4 76 189 152 -27 324 231 103 172 57 68 17 -42 32 -21 -221 -94 -49 -147 -226 -97 -40
2028d0J33l9J00K05l26J28n2jO4r4r3J27j90q4Q9j10J4n5k9J29l5ML29m8p7J40
$$ -40 93 54 154 359 33 161 109 108 172 78 -15 112 -78 -162 -73 -183 -169 -224 -253 -124 -159 -155 174 126 49 189
2054A89l1m7P9k31K60k63j60L21pk31ko8J69j86j7K60j2j38J27m0J59r0JN0L82
$$ 189 158 111 190 -41 219 -44 -204 117 110 -121 -123 -191 -22 -208 -225 35 23 -115 12 -28 131 41 42 92 474
2079D74l64j44K60k16J9r5k4K84k61j79J49K9j52J58J6J26q9J4J04k1j92L10j
$$ 474 110 -34 226 10 29 -66 -90 194 -67 -246 -97 -68 -220 -62 -46 80 -9 5 109 88 -104 206 205
2102B05j71M5N4m2j61n8O4M9k79J41P9j4k21J54J76K53l24n5L78k12L8kL0J19
$$ 205 34 79 133 91 -70 -128 -64 -15 -294 -153 -74 -88 -309 -155 21 274 -50 -105 273 61 99 97 127 246
2126B46k25l3J81l04o7J55K0k25L0R4R8o7j4J11L5k0r9K20l0J7q2J48k2j78P1
$$ 246 21 -12 169 -135 -202 -47 -27 -252 -222 -128 -30 -97 -111 0 35 15 -84 136 106 123 41 189 167 -11 60
2151F0n8n1j50L4J28K2k08R7J20j9j29J21K81m3k19J89L9j42kO5P6j76j10Q2k9
$$ 60 2 -49 -199 -165 -37 -15 -223 -126 -6 -25 -154 -33 248 205 -14 175 214 72 70 135 211 35 -75 7 -22
2176b2k78J10K79j24o9j65J97R8P2k91L26J85l23J46pN5j88jR0K8k83J55J06k55
$$ -22 -300 -190 89 -35 -104 -269 -72 26 98 -193 133 318 -5 141 134 189 1 0 90 118 -165 -10 96 -159
2200a59j3M0J65l4j92K33K10k67l4J82N5j08m4R1J55k41m3J28q8k9j39LJ35j65
$$ -159 -172 -132 33 -1 -193 40 250 -17 -51 131 186 78 34 125 280 39 -4 124 36 7 -132 -129 6 -159
2224a59r7L46n0j03J09N7k8J4m1J18N4l02K30J52k59j44Q3r1O9j12O7K16l37M0
$$ -159 -256 90 40 -63 46 103 75 89 48 166 220 -82 148 300 41 -103 -20 -111 -42 -154 -87 129 -208 -168
2248a68J39j7O7j18J90L5m6j93J88N1j31J10nk3j45o6K28r7k57J49N9r8k2Q6J11
$$ -168 -29 -46 21 -97 93 128 82 -111 77 128 -3 107 102 79 -66 -132 96 -1 -258 -109 -50 -148 -170 -84 27
2273B7j11m4J68J40q5P2o2N4j37n8k1K57k50m1l0p5M7m2k0J43l6J0J66m5j22J81
$$ 27 -84 -128 40 180 95 167 105 159 22 -36 -57 200 -50 -91 -121 -196 -149 -191 -211 -68 -104 -94 72 27 -95 86
2299H6j4J72j60o0J69j40j41R4J4q1n0O1J6j19n0R6J23q0J6LJ32J75k10J84k9
$$ 86 72 244 84 24 193 53 -88 6 20 -61 -111 -50 -34 -153 -203 -107 16 -64 -48 -45 87 262 52 236 207
2324B07r0J5M7o9L5j95J24j38oo4J09L6j77J74l5K9p4J63J22k58R9R2qk4q5n2
$$ 207 117 132 179 110 145 -50 74 -64 -70 -134 -25 11 -166 8 -27 2 -72 91 213 -45 54 146 138 114 29 -23
2350b3K20j07j93N7p8R3j19LK36j65j16K16M0j23K02JK9j03j3O9J59j39q7R5j39
$$ -23 197 90 -103 -46 -124 -31 -150 -147 89 -76 -192 24 64 -59 143 144 173 70 57 126 285 146 59 154 15
2375A5j66J28m1M9k6k7m6l3N4J54nq3J21rJ27Nk13J59J1j43O3q4m1n3l8J00pk14
$$ 15 -151 -23 -64 -15 -41 -68 -114 -147 -93 61 56 -27 94 85 212 217 4 163 174 31 94 10 -31 -84 -122 -22 -29 -243
2403b43N9J39p7J89j45J23Q8j57K4J38pP9j12lR3k10P6q4j52N3l5R2J00q4l3K0
$$ -243 -184 -45 -122 67 -78 45 133 -24 0 138 131 210 98 95 188 -22 54 -30 -182 -129 -164 -72 28 -56 -89 -69
2429f9Lk0K32j8n4J61j0o7l3r6N0l8j50J47n5j32j27J31J47j52k8J45p1N7R0J07
$$ -69 -66 -86 146 128 74 235 225 158 125 29 79 41 -109 38 -17 -149 -276 -145 2 -150 -178 -33 -104 -47 43 150
2455A50l5J19j26q4J47j8j15j1N4o3q3k8L1j39P7K4O8j37O7L1Q6J35r4M3Nn7J13
$$ 150 115 234 108 24 171 153 38 27 81 18 -65 -93 -62 -201 -124 -100 -32 -169 -102 -71 15 150 56 99 104 47 160
2482A60n5Pp4k0Jo6pk0L1q9K2J35j90J33o8J1J76L9rM1l0m9L5j9j39K4p9R4%o0
$$ 160 105 112 38 18 19 -47 -54 -74 -43 -132 -110 25 -165 -32 -100 -89 87 126 117 158 128 79 114 95 -44 -20 -99 -5 -5 -65
2512f5r8R6rj17L9J03R0K7r5L1Pj4J16r9J04m6P4j58j0jJ1j87Q6J2q2K06j04M4
$$ -65 -163 -67 -76 -193 -154 -51 39 66 -29 2 9 -5 111 12 116 70 144 -14 -24 -25 -14 -201 -115 -103 -185 21 -83 -39
2540c9p7n9K26OK3m0orJ59j48j3J33j95K6o9n0J7%n3O3K8l2J64j17o3J84P4q8
$$ -39 -116 -175 51 57 80 40 34 25 184 36 23 156 -39 -13 -82 -132 -115 -115 -168 -105 -77 -109 55 -62 -125 59 133 45
2568D5k6J41J2j31k8M1o1K5rk7n4p3l2K07j18O8q8MK2R9J19r9P8j48J74j28J32
$$ 45 19 160 172 41 13 54 -7 18 9 -18 -72 -145 -177 30 -88 -20 -108 -104 -82 17 136 37 115 -33 141 13 145
2595A45l8k7n0o9jr3P1q3J02l4L1K7m4LJ23r5PJ77j26k6R6j06p6Q9%N3p7m7K7
$$ 145 107 80 30 -39 -40 -133 -62 -145 -43 -77 -46 -19 -63 -60 63 -32 -25 152 26 0 96 -10 -86 3 3 56 -21 -68 -41
2624d1%j21R4M5j0j9r2J36J18j85J50P5j0l4q5Q0p1j60J23Kj39m8J95j49J25m1
$$ -41 -41 -162 -68 -23 -33 -52 -144 -8 110 -75 75 150 140 106 21 101 30 -130 -7 -5 -144 -192 3 -146 -21 -62
2650f2n5J28J5o7N9N3j01J64j10J27q4OL1K6j84J36j92rj6N0J0K0Om8K01j50Q8
$$ -62 -117 11 26 -41 18 71 -30 134 24 151 67 73 104 130 -54 82 -110 -119 -135 -85 -75 -55 -49 -97 104 -46 42
2677D2p7J52kj33R4Q2k4j0k49J11J81k50K9m7Q7r5J07n8j09J85n4J18l5m9J15
$$ 42 -35 117 115 -18 76 158 134 124 -125 -14 167 -83 -54 -101 -14 -109 -2 -60 -169 16 -38 80 45 -4 111
2702A11l4p3o4L8J53N8k78J03O1j51K1kk5l2N3LR0j81J44l9N9P2j4M3M0m7m8P
$$ 111 77 4 -60 -22 131 189 -89 14 75 -76 -55 -57 -82 -114 -61 -58 32 -149 -5 -44 15 87 73 116 156 109 61 68
2730F8j47J52j38Q4q0M6j18O0m4K3N9M8N7L7j36M5Q3J3j43M1N2l7Pr4J49n1j2
$$ 68 -79 73 -65 19 -61 -15 -133 -73 -117 -94 -35 13 70 107 -29 16 99 112 -31 10 62 25 32 -62 87 36 24
2757B4k0j71qK04k20J55K5N3nk4P6O4k2p4M7L9m1r7N7j17O2n9q4J49j05P5l4j4
$$ 24 4 -167 -175 29 -191 -36 -11 42 37 13 89 153 131 57 104 143 102 5 62 -55 7 -52 -136 13 -92 -17 -51 -65
2785f5J7L8P4n7p7J01L4l8Q0plO0p4j23O3j50Q8J0j0l0j17J39j2J0k4R9j51J56
$$ -65 -48 -10 64 7 -70 31 65 27 107 100 97 157 83 -40 23 -127 -39 -29 -39 -69 -186 -47 -59 -49 -73 26 -125 31
2813C1O0kO2n1o1N8p9o8K1Q0j27l5P6MJ7q4P4P6j01L5p8P4J05K5K4j3q4K1J07
$$ 31 91 89 151 100 39 97 18 -50 -29 51 -76 -111 -35 -31 -14 -98 -24 52 -49 -14 -92 -18 87 112 136 123 39 60 167
2842A67q3j33K5J14j53m3J35j45P7Q5j10k1K2N1J36M5k19K3K27j53k2k9PK2j2
$$ 167 84 -49 -24 90 -63 -106 29 -116 -39 46 -64 -85 -63 -12 124 169 -50 -27 200 47 25 -4 3 25 13
2867A3j4l6j0m8j4l8J29r3R1o6N9P5r6J60N7P1j81J22r9r8MJ3o4O1o6M4k7j6j4
$$ 13 -1 -37 -47 -95 -109 -147 -18 -111 -20 -86 -27 48 -48 112 169 240 59 181 82 -16 -12 1 -63 -2 -68 -24 -51 -67 -81
2896h1K5P8J2rm9O2R3o4m4O5j32J81j08o4M8m1j8p0n6J72p9m2O2L3J7N4j73K33
$$ -81 -56 22 34 25 -24 38 131 67 23 88 -44 137 29 -35 13 -28 -46 -116 -172 0 -79 -121 -59 -26 -9 45 -128 105
2924A05j14J1P0J0k7O5j98J20j4q4l8J7M0r7J45j01N8m1K3J05j14J11J2p1K8Q6
$$ 105 -9 2 72 82 55 120 -78 42 28 -56 -94 -77 -37 -134 11 -90 -32 -73 -50 55 -59 52 64 -7 21 107
2950A07j9K9j98M4Q9p3P6p6n3j7M3q0r1K16j45K07n4N1N1p4j5M9O6o1r5m5j8O6
$$ 107 88 117 -81 -37 52 -21 55 -21 -74 -91 -48 -128 -219 -3 -148 59 5 56 107 33 18 67 133 72 -23 -68 -86 -20
2978b0M3q0J14j58Q4k5m6J23k5j26J71o3P8N9j95J34Pl9P1n7K4j0m3n1P7j94J06
$$ -20 23 -57 57 -101 -17 -42 -88 35 10 -116 55 -8 70 129 -66 68 75 36 107 50 74 64 21 -30 47 -147 -41
3005d1K4J0j1q4J26N3n6O5l8n6J34r2P1k7r2pM7p9j5P0O3o4n5J9J5r9O9J34l8
$$ -41 -17 -7 -18 -102 24 77 21 86 48 -8 126 34 105 78 -14 -21 26 -53 -68 2 65 1 -54 -35 -20 -119 -50 84 46
3034D6Qp4M5n4J11j02J62j55J21j32J18j18l1J1m4k2N5j0J7M4J9Q7j67J64j08
$$ 46 54 -20 25 -29 82 -20 142 -13 108 -24 94 -24 -55 -44 -88 -110 -55 -65 -48 -4 15 102 -65 99 -9
3059iJ30k4o2k6J13j30R6k8j29O3o7J1N1l0J1n8M1J19K1k13J38L8RJ7j10J30l2
$$ -9 121 97 35 9 122 -8 88 60 -69 -6 -73 -62 -11 -41 -30 -88 -47 72 93 -120 18 56 65 82 -28 102 70
3086G0p8N4k9o6L9Nj07Q8n3m5Q0NM5O0j9j0J7K5J0k5j10J11o6N1N0j16M4K7n4
$$ 70 -8 46 17 -49 -10 -5 -112 -24 -77 -122 -42 -37 8 68 49 39 56 81 91 66 -44 67 1 52 102 -14 30 57 3
3115Cj25J04m4J5O1j1L1qJ3J54j75l2R1P8j10J7K9r7OJ2q7n0J01q8O4J6m4Q7r2
$$ 3 -122 -18 -62 -47 14 3 34 26 39 193 18 -14 77 155 45 62 91 -6 0 12 -75 -125 -24 -112 -48 -32 -76 11 -81
3144h1Q2J08m0M9k0n5P8k00P1lm4M2k2J18j02q7J6L7L0Mj16N1J18r7P4o1l3K08
$$ -81 1 109 69 118 98 43 121 -79 -8 -11 -55 -13 -35 83 -19 -106 -90 -53 -23 -19 -135 -84 34 -63 11 -50 -83 125
3172A25L0m2k7O4j68K0lm1l5L4J1k3k7m5J61J9j8l1O4q9K8m3J27j7R5j79l6N8
$$ 125 155 113 86 150 -18 2 -1 -42 -77 -43 -32 -55 -82 -127 34 53 35 4 68 -21 7 -36 91 74 169 -10 -46 12
3200A2K5q8K5o8m4P5N4j4j22O3M5L3J1k4m7Q7K06j94P3o7j0l1O1j07l1R8j04j
$$ 12 37 -51 -26 -94 -138 -63 -9 -23 -145 -82 -37 -4 7 -17 -64 23 229 35 108 41 31 0 61 -46 -77 21 -83 -84
3228h4N9K8j29P5J38m3m7N5M6l1Kn5p7J36K4j33PJ34j04k0r7J12Q8j30N3Q6j81
$$ -84 -25 3 -126 -51 87 44 -3 52 98 67 69 14 -63 73 97 -36 -29 105 1 -19 -116 -4 84 -46 7 93 -88
3255h8Q3l6oJ33j01R1J5j64J99j06O6n7o8j9q4J74j07l0K6J98j36K6J8q5O7J23
$$ -88 -5 -41 -47 86 -15 76 91 -73 126 20 86 29 -39 -58 -142 32 -75 -105 -79 119 -17 9 27 -58 9 132
3281A32j09M4K0o4q4J59j54J52j8o4r4J45n3j47J14p9pO5m3k6M1J67p6j8j7N1
$$ 132 23 67 87 23 -61 98 -56 96 78 14 -80 65 12 -135 -21 -100 -107 -42 -85 -111 -70 97 21 3 -14 37
3307C7J16q2r2R7K3m8k5m0JK1q8p9K2kJ17Q2M8j14Q3KQ5r8j4k9P7j79J24Q9j83
$$ 37 153 71 -21 76 99 51 26 -14 -13 8 -80 -159 -137 -139 -22 60 108 -6 77 79 164 66 52 23 100 -79 45 134 -49
3336d9M8r2J01mj00J16ol5L3J07%j95J10N6k0K8J1Pj11RkL5r6j8K7M0j3j16J20
$$ -49 -1 -93 8 4 -96 20 14 -21 12 119 119 -76 34 90 70 98 109 116 5 14 12 47 -49 -67 -40 0 -13 -129 -9
3365iJ9pJ8M0l0K6N9j28J43l2q1l0L1j6%M3j69R8Q0o1N8k29J01K3N0q9J90q6l3
$$ -9 10 3 21 61 31 57 116 -12 131 99 18 -12 19 3 3 46 -123 -25 55 -6 52 -177 -76 -53 -3 -92 98 12 -21
3394b1P2O6m9K2j26K3L2j8j1PJ7o2K0oQ1r5L6O8k2n0nQJ29r2Q9l6j04Jm4P9Kj46
$$ -21 51 117 68 90 -36 -13 19 1 -10 -3 14 -48 -28 -34 47 -48 -12 56 34 -16 -21 -13 116 24 113 77 -27 -26 -70 9 11 -135
3426a35J4jQ0m7Q0j5j5j41O9O5Q4q4J17M%L4q0K4m5J2K3Jn8j36J16j25K21r1M
$$ -135 -121 -122 -42 -89 -9 -24 -39 -180 -111 -46 38 -46 71 75 75 109 29 53 8 20 43 44 -14 -150 -34 -159 62 -29 -25
3455b5P6j08k3J17P1q6RJ13nn3jn4j78K49j15J05L8j67n6J75p2n7L7M8ol3O8Q0
$$ -25 51 -57 -80 37 108 22 31 144 139 86 85 31 -147 102 -13 92 130 -37 -93 82 10 -47 -10 38 32 -1 67 147
3483A47q5pm9m8Q9M8p2j02j0J59m9m1j09J29l0J1%l8K6J11p0J06j5r8O1k3R0j73
$$ 147 62 55 6 -42 47 95 23 -79 -89 70 21 -20 -129 0 -30 -19 -19 -57 -31 80 10 116 101 3 64 41 131 -42
3511d2J3K5k3L5J6J1N1j10r6Q0Q4n6l1J0K49k34J43j32JK8R0Q1r6l5o6k2n9K1
$$ -42 -29 -4 -27 8 24 35 86 -24 -120 -40 44 -12 -43 -33 216 -18 125 -7 -6 22 112 193 97 62 -4 -26 -85 -64
3539f4J04kjj13O2L5J9n3Q6O7j90J35r0P4P4j60M5j3L8j59J57j07k1Q5p5M4r8
$$ -64 40 38 37 -76 -14 21 40 -13 73 140 -50 85 -5 69 143 -17 28 15 53 -106 51 -56 -77 8 -67 -23 -121
3566a21K11p4j26J62J3l9L5r7Q4K3n7J2R6q5oJ9j15J9Jj5J02j54J63K2j03rJ15
$$ -121 90 16 -110 52 65 26 61 -36 48 71 14 26 122 37 31 50 -65 -46 -45 -60 42 -112 51 73 -30 -39 76
3593G6r4J5P7M2Kp7qn6R1n8o0j02O4J0n9J05j49J22J17n8Kl1J3lM2R4j25L1M7
$$ 76 -18 -3 74 116 118 41 33 -23 68 10 -50 -152 -88 -78 -137 -32 -181 -59 58 0 2 -29 -16 -19 23 117 -8 23 70
3622G0M6r3O5r0M8o5j12P7%O0k3J9M0j41K6oJ76j1l6J28p5r6pm1J13l8K7j24J39
$$ 70 116 23 88 -2 46 -19 -131 -54 -54 6 -17 2 42 -99 -73 -79 97 86 50 178 103 7 0 -41 72 34 61 -63 76
3651G6qk8p9p3L1M3O8R8j72J43k9l7J4O9n6j8r5P8R9j82L6M4p9L4m7%j08J20N
$$ 76 68 40 -39 -112 -81 -38 30 128 -44 99 70 33 47 116 60 42 -53 25 124 -58 -22 22 -57 -23 -70 -70 -178 -58 -53
3680e3O3N6lk0n3N3L5L8q4R7l0j16J6j6KL6n8P9k3o1jL8J3ol2J08j9M5n5Qn1M2
$$ -53 10 66 63 43 -10 43 78 116 32 129 99 -17 -1 -17 -15 21 -37 42 19 -42 -43 -5 8 2 -30 78 59 104 49 57 6 48
3712D8j32Q5l7j39J88k4lj01J5J40r1Q1j11R2rp2J29j14J23M1o1n1j5K1O4k7K1
$$ 48 -84 1 -36 -175 13 -11 -14 -115 -100 40 -51 30 -81 11 2 -70 59 -55 68 109 48 -3 -18 3 67 40 61
3739F1p2rm4P5q1M6o2J6J31K0m9K9j5J2o6k5P2m9L0O7j62K2Pj11J38l7J2J26K
$$ 61 -11 -20 -64 11 -70 -24 -86 -70 61 81 32 61 46 58 -8 -33 39 -10 20 87 -75 -53 -46 -157 -19 -56 -44 82 84
3768H4j6q7o9J53q6J01l4j6m8L1m3k2Q9j40O7m8O8j24P7K9n4R9j15J4N0K7L9l8
$$ 84 68 -19 -88 65 -21 80 46 30 -18 13 -30 -52 37 -103 -36 -84 -16 -140 -63 -34 -88 11 -104 -90 -40 -13 26 -12
3796a2N6q9J20o1q9J8r2J62J5p7q9Q2MM5R2k11J32P9L5j20L9J3n8l0K11j75Pl4
$$ -12 44 -45 75 14 -75 -57 -149 13 28 -49 -138 -56 -52 -7 85 -126 6 85 120 0 39 52 -6 -36 175 0 7 -27
3824b7k2O4M5J0q4j81K35n1oj23Q0l5L6Q8nM9r9O9J14j27j5J0l5k9M5j2J1p6j00
$$ -27 -49 15 60 70 -14 -195 40 -11 -17 -140 -60 -95 -59 29 24 73 -26 43 157 30 15 25 -10 -39 6 -6 5 -71 -171
3853a71J13J19j27K1J5N0L8J4n7j8o5R0o4P8OK9q9K8kL0j67K15o7K9j35l9Q9M3
$$ -171 -58 61 -66 -45 -30 20 58 72 15 -3 -68 22 -42 36 42 71 -18 10 8 38 -129 86 19 48 -87 -126 -37 6
3881Fm5J22q2rl1J56j24J35j32J5k9k4j7M5M6p3K5M0j04O7k1K8l8N1lQ9j7j3p
$$ 6 -39 83 1 -8 -39 117 -7 128 -4 11 -18 -42 -59 -14 32 -41 -16 24 -80 -13 -34 -6 -44 7 4 93 76 63 56
3910E6n8l3J12l2j30J01N2M5q4M1j96O4n9jR9L8p6L8R3o3R6j71R6Ln1M6N3n2j1
$$ 56 -2 -35 77 45 -85 16 68 113 29 70 -126 -62 -121 -122 -23 15 -61 -23 70 7 103 -68 28 31 -20 26 79 27 16
3939A6Oq3m5Q2Q6j99J55J18q5j18J02J9LJ45j60o2Q6OL2j19q3J12q4O6p1Q6J4
$$ 16 22 -61 -106 -24 62 -137 18 136 51 -67 35 54 57 202 42 -20 66 72 104 -15 -98 14 -70 -4 -75 11 25
3966B5M2n8p2P0p5J13J1J5j13O9m4o3P0J03j62J0J6M3k8J5m3j5J3j45K31J8j6
$$ 25 67 9 -63 7 -68 45 56 71 -42 27 -17 -80 -10 93 -69 -59 -43 0 -28 -13 -56 -71 -58 -203 28 46 30
3993C0K1J2r5nM8M8k39K10J7j21L2NM5j1N1l3n7K3Nlk4L9M1L6j29P5N7j6M4j27
$$ 30 51 63 -32 -37 11 59 -180 30 47 -74 -42 -37 8 -3 48 15 -42 -19 -14 -17 -41 -2 39 75 -54 21 78 62 106 -21
4023b1O0M2kj25J49j23m0J40o7j18O1O3r2Q0N7j23J16j17P3k5R0j8P0p4p5Rl9
$$ -21 39 81 79 -46 103 -20 -60 80 13 -105 -44 19 -73 7 64 -59 57 -60 13 -12 78 60 130 56 -19 -10 -49
4050d9M6O4j48M3L5q7J42k3q4M3O1r1J20j5N1j32j4J21l5l1%j7Nlp5k7Q8r8J33
$$ -49 -3 61 -87 -44 -9 -96 46 23 -61 -18 43 -48 72 57 108 -24 -38 83 48 17 17 0 5 2 -73 -100 -12 -110 23
4079B3kL3Jj01j1J66j45M1M2n5J05o3kj03R9j89J43l0Ll7J11n7K2p5Q5q6mR6j
$$ 23 21 54 55 -46 -57 109 -36 5 47 -8 97 34 32 -71 28 -161 -18 -48 -45 -82 29 -28 -6 -81 4 -82 -86 10 9
4108IK9Pq8j1L0L8J9J8N3o0M8j92J16k1n5o5J61j6J9ppK0j4M6j36J81q3Ll0MM4
$$ 9 38 45 -43 -54 -24 14 33 51 104 44 92 -100 16 -5 -60 -125 36 20 39 32 25 45 31 77 -59 122 39 42 12 16 60
4139F0l3N9p4q2J47r9RK4J5o3M1m6m1M9L4L2Kl6k5K8m0K0o6O7j20K00j51R6j03
$$ 60 27 86 12 -70 77 -22 -13 11 26 -37 4 -42 -83 -34 0 32 34 -2 -27 1 -39 -19 -85 -18 -138 62 -89 7 -96
4168i6J4k9pJ69m6J63q7j00Q9m5l2PM4Kj70J26OL9j37L5N9r2P7m9J58j29l8O7
$$ -96 -82 -111 -118 51 5 168 81 -19 70 25 -7 0 44 46 -124 2 8 47 -90 -55 4 -88 -11 -60 98 -31 -69 -2
4196bk4K0J5jq5M5J16p4k1N4JJ5K2r4j29j4J74J1j35O3J11rr9K5Q4o6P5Rl1n2
$$ -2 -26 -6 9 8 -77 -32 84 10 -11 43 44 59 81 -13 -142 -156 18 29 -106 -43 68 59 -40 -15 69 3 78 87 56 4
4226Dj17M7kK1Q5j8r4O8n0l9M5P8o7MJ4K2m5J15o8M8j29J22j66J12p6O1k6O5J5
$$ 4 -113 -66 -68 -47 38 20 -74 -6 -56 -95 -50 28 -39 -35 -21 1 -44 71 3 51 -78 44 -122 -10 -86 -25 -51 14 29
4255B9j8K1o7R5J3q8L0O5j41J54o7K1L9m8N3p6n4K5J01j57L7M6n2l0N8m8P1l6
$$ 29 11 32 -35 60 73 -15 15 80 -61 93 26 47 86 38 91 15 -39 -14 87 -70 -33 13 -39 -69 -11 -59 12 -24
4283b4M9k6OJ39q1j22J44j20J7p0J51pp8P8n4O4n6o7M3L9k6l0J26j26J7Q9k8K4
$$ -24 25 -1 5 144 63 -59 85 -35 -18 -88 63 56 -22 56 2 66 10 -57 -14 25 -1 -31 95 -31 -14 75 47 71
4311G1Nj07J42q1m7o1J4o7K8M2N1n2K3k3j7O5o0P5o8J6J31j51J9J34j39J90j66
$$ 71 76 -31 111 30 -17 -78 -64 -131 -103 -61 -10 -62 -39 -62 -79 -14 -74 1 -67 -51 80 -71 -52 82 -57 133 -33
4338c3n9k5MNJ57k8o3P0n2K6j2q5R7J14J0r6N9m2p8K7m3J29k32J76o7j4Q7p6O6
$$ -33 -92 -117 -113 -108 49 21 -42 28 -24 2 -10 -95 2 116 126 30 89 47 -31 -4 -47 82 -150 26 -41 -55 32 -44 22
4367B2l2P8p5oO8l3k1M8k2L6j26L1J51q3k1kKm3J8o3L2P7q8K2j2O3l3l9R9k4m
$$ 22 -10 68 -7 -13 55 22 1 49 27 63 -63 -32 119 36 15 13 15 -28 -10 -73 -41 36 -52 -30 -42 21 -12 -51 48 24 20
4398B0R4j11J1q3K09j81R5n6j1J16j86R2J08L8k06o2R8P7j5r5J28j33P7J8mL2
$$ 20 114 3 14 -69 140 -41 54 -2 -13 103 -83 9 117 155 -51 -113 -15 62 47 -48 80 -53 24 42 38 70
4424G0m5J1L5m5L0M0p6Mo9O7j06k2O2Q3m0M8P5j46o1R2N7p6J31m6o7O3j35P9r4
$$ 70 25 36 71 26 56 96 20 24 -45 22 -84 -106 -44 39 -1 47 122 -24 -85 7 64 -12 119 73 6 69 -66 13 -81
4453h1Q9m9jl6J64j10M1k6j11Q9Q7l5n9j3O1n4J01K7k0o6J5j2k8P9j18Q1l2m0
$$ -81 8 -41 -42 -78 86 -24 17 -9 -120 -31 56 21 -38 -51 10 -44 57 84 64 -2 13 1 -27 52 -66 15 -17 -57
4481e7K6M8M3Mn3l4M4j7m5J41N7j96O0q5O4O7l3j45R4N9r8M6j44J26J73k13J01
$$ -57 -31 17 60 64 11 -23 21 4 -41 100 157 -39 21 -64 0 67 34 -111 -17 42 -56 -10 -154 -28 145 -68 33
4508C3M3j61J47n1N8lo5J10j35Q3j88J26P7k15K03l7M9j24J15q8K9N0m6k3jM9
$$ 33 76 -85 62 11 69 66 1 111 -24 59 -129 -3 74 -141 62 25 74 -50 65 -23 6 56 10 -13 -14 35
4534C5L6j13L7N4rr0J16j4L1j40R9o6k4M5l4P4o0P8j25J62j4j24M9L9m7p5J47
$$ 35 71 -42 -5 49 40 -50 66 52 83 -57 42 -24 -48 -3 -37 37 -23 55 -70 92 78 -46 3 42 -5 -80 67
4561F7k18J46J25q1o6j14R7M0mo3K04j58R8n3r6J17j27L7L2m7J09n4NO3j31o3
$$ 67 -151 -5 120 39 -27 -141 -44 -4 -8 -71 133 -25 73 20 -76 41 -86 -49 -17 -64 45 -9 -4 59 -72 -135
4587a35R1R3j7j54M1P0l8N0m4M0J2M0m6n6Q6J1n9Ok0L0q5J38j00M5lK8kJ2q0l8
$$ -135 -44 49 32 -122 -81 -11 -49 1 -43 -3 9 49 3 -53 33 44 -15 -9 -29 1 -84 54 -46 -1 -4 24 22 34 -46 -84
4617h4LQ5r4J74j17N5R5q2j66J46P2r5MK4o8N1Q9p9j24K0J03r2N2P9k4L4j64J07
$$ -84 -81 4 -90 84 -33 22 117 35 -131 15 87 -8 -4 20 -48 3 92 13 -111 -91 12 -80 -28 51 27 61 -103 4
4645DN2Kq3kQ3N1j69q2J90j04N0j32P6l7L4J31j04Kj07K85p2j45O4m9K7J20j12
$$ 4 56 58 -25 -27 56 107 -62 -144 46 -58 -8 -140 -64 -101 -67 64 -40 -38 -145 140 68 -77 -13 -62 -35 85 -27
4672b7J5OK4j18R5p0J24p4n0J70o6J4j13J04j06J61q0Pm1O6r5N2Nm1m5K0o0J74
$$ -27 -12 -6 18 -100 -5 -75 49 -25 -75 95 29 43 -70 34 -72 89 9 16 -25 41 -54 -2 3 -38 -83 -63 -123 51
4700E1n7L4j8J1o6r6J99k33K12j61J47L3j41K18j51JL9On7L9o0P4j1J1J3j50P3
$$ 51 -6 28 10 21 -45 -141 58 -175 37 -124 23 56 -85 133 -18 -17 22 28 -29 10 -50 24 13 24 37 -113 -40
4727d0R0%l3J9l9Q9j40J08K8n6mnP5K7n7o0K9o4m3P6Oo7N2J5n0R8r9K4J07j8j9
$$ -40 50 50 17 36 -3 86 -54 54 82 26 22 17 92 119 62 2 31 -33 -76 0 6 -61 -9 6 -44 54 -45 -21 86 68 49
4758D9q7lQ9j16n8Q2Q1J7j19O4qr4J19l1r5J36K4m9j3L5k1R2j27K9L6j01L2N5
$$ 49 -38 -41 48 -68 -126 -44 37 54 -65 -1 -9 -103 16 -15 -110 26 50 1 -12 23 2 94 -33 -4 32 -69 -37 18
4786A8N7l5N7j00M0j38K0J46p5o1M4J24q8O1k2m3Qj0n6QJ15n5j26J11L8r4kJ4
$$ 18 75 40 97 -3 37 -101 -81 65 -10 -71 -27 97 9 70 48 5 13 3 -53 -45 70 15 -111 0 38 -56 -58 -44
4814d4o2J16r7J25K0l0J05k00J29m4m8j6M5mn2J06j0N3j05l8j03J43L9r7P3k0
$$ -44 -106 10 -87 38 58 28 133 -67 62 18 -30 -46 -1 -5 -57 49 39 92 -13 -51 -154 -11 28 -69 4 -16
4840a6k2J54p4p2K0p1J16p7J4QM0j02KJ51n9l1jL0Kj2J4O3QPj84J33n7m9M6o0
$$ -16 -38 116 42 -30 -10 -81 35 -42 -28 -20 20 -82 -80 71 12 -19 -20 10 12 0 14 77 85 92 -92 41 -16 -65 -19 -79
4870g9N1L0Q8q0%K4k0Q6j59K1J51j87N2n9L5N7j29Q3n2P0N4N5p5%j5k8M1L0l8
$$ -79 -28 2 90 10 10 34 14 100 -59 -38 113 -74 -22 -81 -46 11 -118 -35 -87 -17 37 92 17 17 2 -26 15 45 7
4899GO1M5q0r2p0K30o4j36K01q6K5l7q9J95q7n9N3M4j03NM5M4P3j90k8J8P1mo2
$$ 7 68 113 33 -59 -129 101 37 -99 102 16 41 4 -85 110 23 -36 17 61 -42 -37 8 52 125 -65 -93 -75 -4 -8 -70
4928g0M1p2J15N0p5J57k5r5j29J52Jo4R7q7J11n0q4m8O9n6Q9n0L4j9m9Q8L4o6
$$ -70 -29 -101 14 64 -11 146 121 26 -103 49 50 -14 83 -4 107 57 -27 -75 -6 -62 27 -23 11 -8 -57 31 65 -1
4956ao7J15J01m9m1j19%Nj0O6K6n7J2m7J16n0O6j5p2P1k03J96M7q8Jo0jJ30k00
$$ -1 -68 47 148 99 58 -61 -61 -56 -66 0 26 -31 -19 -66 50 0 66 51 -21 50 -153 43 90 2 3 -57 -58 72 -128
4985a28P4N1n8j0N8QM1j02J46j11m5l0nj3J60J16k39J21m7j7k3N3q2J21n9r5R3
$$ -128 -54 -3 -61 -71 -13 -5 36 -66 80 -31 -76 -106 -111 -124 36 152 -87 34 -13 -30 -53 0 -82 39 -20 -115 -22
5012b2j6n8O7j7N8q2Q9%l8P4lk6l8J27j11r1N7M2J2n5q3J63o6k6J2Q1lm2n7J25
$$ -22 -38 -96 -29 -46 12 -70 19 19 -19 55 52 26 -12 115 4 -87 -30 12 24 -31 -114 49 -17 -43 -31 50 47 5 -52 73
5042G3o8m7J11P4j33m7J13P5j35l6P2K5n7Kq9NJ46j99P7K1Q8n8P6q9J1K0l7LJ11
$$ 73 5 -42 69 143 10 -37 76 151 16 -20 52 77 20 22 -67 -62 84 -115 -38 -17 71 13 89 0 11 31 -6 -3 108
5071A08p5N4m4j10J57Kj36J23M5j47P6q9k9p1J38J34o5r2k2J14k3k0lm2L3j55
$$ 108 33 87 43 -67 90 92 -44 79 124 -23 53 -36 -65 -136 2 136 71 -21 -43 71 48 28 25 -17 16 -139
$$ [...]
8191D3
##END NTUPLES=NMR FID
##END=
