##TITLE=1H_DE-80H_X3
 200.13MHz, d2o
 8 sc
 
 19ns.26.2.2025
##JCAMPDX= 6.0         $$ Bruker NMR JCAMP-DX V2.0
##DATA TYPE= NMR FID
##DATA CLASS= NTUPLES
##ORIGIN= UXNMR, Bruker Analytische Messtechnik GmbH
##OWNER= pz
$$ XWIN-NMR		Version 3.5
$$ Fri Apr  3 10:17:57 2026 Russian Standard Time (UT+4h)  Yarkov@DPX200
##.OBSERVE FREQUENCY= 200.1313
##.OBSERVE NUCLEUS= ^1H
##.DELAY= (6, 6)
##.ACQUISITION MODE= SIMULTANEOUS
##.ACQUISITION SCHEME= undefined
##.AVERAGES= 8
##.DIGITISER RES= 18
##SPECTROMETER/DATA SYSTEM= spect
##.PULSE SEQUENCE= zg30
##.SOLVENT NAME= CDCl3
##.SHIFT REFERENCE= (INTERNAL, CDCl3, 0, 14.3821)
##AUDIT TRAIL= $$ (NUMBER, WHEN, WHO, WHERE, WHAT)
$$ ##TITLE= Audit trail, XWIN-NMR		Version 3.5
$$ ##JCAMPDX= 5.01
$$ ##ORIGIN= Bruker BioSpin GmbH
$$ ##OWNER= Yarkov
$$ C:/Bruker/XWIN-NMR/data/yarkov2/nmr/H-C/1/audita.txt
$$ ##AUDIT TRAIL=  $$ (NUMBER, WHEN, WHO, WHERE, WHAT)
(   1,<2026-04-03 10:16:59.48 +0400>,<Yarkov>,<DPX200>,
      <created by zg, POWCHK disabled, PULCHK disabled
       configuration hash MD5:
       00 E9 B6 7A A2 85 ED C7 34 08 36 98 17 FE 4E 26
       data hash MD5: 16K
       CA 99 CD A8 62 62 74 69 84 75 7C 5B DA 82 16 0B>)
$$ ##END=
$$ 
$$ hash MD5
$$ AC 50 2D 03 36 BE 64 92 D1 4C F6 5B 2B 58 09 1E
##$RELAX= 
##$RELAX= 
##$RELAX= 
##$RELAX= 
##$RELAX= 
##$RELAX= 
$$ Bruker specific parameters
$$ --------------------------
##$DU= <C:/Bruker/XWIN-NMR>
##$EXPNO= 1
##$NAME= <H-C>
##$PROCNO= 1
##$TYPE= <nmr>
##$USER= <yarkov2>
##$AMP= (0..31)
100 100 100 100 100 100 100 100 100 100 100 100 100 100 100 100 100 100 
100 100 100 100 100 100 100 100 100 100 100 100 100 100 
##$AQSEQ= 0
##$AQ_mod= 1
##$AUNM= <au_zg>
##$AUTOPOS= <>
##$BF1= 200.13
##$BF2= 200.13
##$BF3= 200.13
##$BF4= 200.13
##$BF5= 200.13
##$BF6= 200.13
##$BF7= 200.13
##$BF8= 200.13
##$BYTORDA= 1
##$CFDGTYP= 0
##$CFRGTYP= 5
##$CHEMSTR= <none>
##$CNST= (0..31)
1 1 145 1 1 1 1 1 1 1 1 1 1 1 1 1 1 1 1 1 1 1 1 1 1 1 1 1 1 1 1 1 
##$CPDPRG= <>
##$CPDPRG1= <>
##$CPDPRG2= <>
##$CPDPRG3= <>
##$CPDPRG4= <mlev>
##$CPDPRG5= <mlev>
##$CPDPRG6= <mlev>
##$CPDPRG7= <mlev>
##$CPDPRG8= <mlev>
##$CPDPRGB= <>
##$CPDPRGT= <>
##$D= (0..31)
0 0.7 0 0 0 0 0 0 0 0 0 0.03 0 0 0 0 0 0 0 0 0 0 0 0 0 0 0 0 0 0 0 0 
##$DATE= 1775197018
##$DBL= (0..7)
120 120 120 120 120 120 120 120 
##$DBP= (0..7)
150 150 150 150 150 150 150 150 
##$DBP07= 0
##$DBPNAM0= <>
##$DBPNAM1= <>
##$DBPNAM2= <>
##$DBPNAM3= <>
##$DBPNAM4= <>
##$DBPNAM5= <>
##$DBPNAM6= <>
##$DBPNAM7= <>
##$DBPOAL= (0..7)
0.5 0.5 0.5 0.5 0.5 0.5 0.5 0.5 
##$DBPOFFS= (0..7)
0 0 0 0 0 0 0 0 
##$DE= 6
##$DECBNUC= <off>
##$DECIM= 32
##$DECNUC= <off>
##$DECSTAT= 4
##$DIGMOD= 1
##$DIGTYP= 9
##$DL= (0..7)
0 120 120 120 120 120 120 120 
##$DP= (0..7)
150 150 150 150 150 150 150 150 
##$DP07= 0
##$DPNAME0= <>
##$DPNAME1= <>
##$DPNAME2= <>
##$DPNAME3= <>
##$DPNAME4= <>
##$DPNAME5= <>
##$DPNAME6= <>
##$DPNAME7= <>
##$DPOAL= (0..7)
0.5 0.5 0.5 0.5 0.5 0.5 0.5 0.5 
##$DPOFFS= (0..7)
0 0 0 0 0 0 0 0 
##$DQDMODE= 0
##$DR= 18
##$DS= 0
$$ [...]
##$SUBNAM2= <"">
##$SUBNAM3= <"">
##$SUBNAM4= <"">
##$SUBNAM5= <"">
##$SUBNAM6= <"">
##$SUBNAM7= <"">
##$SUBNAM8= <"">
##$SUBNAM9= <"">
##$SW= 18.0517328524113
##$SWIBOX= (0..15)
0 0 2 0 0 0 0 0 0 0 0 0 0 0 0 0 
##$SW_h= 3612.71676300578
##$TD= 16384
##$TD0= 1
##$TE= 0
##$TE2= 300
##$TE3= 300
##$TEG= 300
##$TL= (0..7)
0 120 120 120 120 120 120 120 
##$TP= (0..7)
150 150 150 150 150 150 150 150 
##$TP07= 0
##$TPNAME0= <>
##$TPNAME1= <>
##$TPNAME2= <>
##$TPNAME3= <>
##$TPNAME4= <>
##$TPNAME5= <>
##$TPNAME6= <>
##$TPNAME7= <>
##$TPOAL= (0..7)
0.5 0.5 0.5 0.5 0.5 0.5 0.5 0.5 
##$TPOFFS= (0..7)
0 0 0 0 0 0 0 0 
##$TUNHIN= 0
##$TUNHOUT= 0
##$TUNXOUT= 0
##$USERA1= <user>
##$USERA2= <user>
##$USERA3= <user>
##$USERA4= <user>
##$USERA5= <user>
##$V9= 5
##$VALIST= <valist>
##$VCLIST= <CCCCCCCCCCCCCCC>
##$VD= 0
##$VDLIST= <DDDDDDDDDDDDDDD>
##$VPLIST= <PPPPPPPPPPPPPPP>
##$VTLIST= <TTTTTTTTTTTTTTT>
##$WBST= 1024
##$WBSW= 4
##$XGAIN= (0..3)
0 0 0 0 
##$XL= 0
##$YL= 0
##$YMAX_a= 212416
##$YMIN_a= -201068
##$ZGOPTNS= <>
##$ZL1= 120
##$ZL2= 120
##$ZL3= 120
##$ZL4= 120
##$ABSF1= 10
##$ABSF2= 0
##$ABSG= 5
##$ABSL= 3
##$ALPHA= 0
##$AQORDER= 0
##$ASSFAC= 0
##$ASSFACI= 0
##$ASSFACX= 0
##$ASSWID= 0
##$AUNMP= <proc_1d>
##$AZFE= 0.1
##$AZFW= 0.1
##$BCFW= 1
##$BC_mod= 2
##$BYTORDP= 1
##$COROFFS= 0
##$CY= 83.5205535888672
##$DATMOD= 1
##$DC= 2
##$DFILT= <>
##$DTYPP= 0
##$F1P= 10.8118882576601
##$F2P= -7.23987719738617
##$FCOR= 0.5
##$FTSIZE= 0
##$FT_mod= 4
##$GAMMA= 1
##$GB= 0.15
##$INTBC= 1
##$INTSCL= 1
##$ISEN= 128
##$LB= 0.25
##$LEV0= 0
##$LPBIN= 0
##$MAXI= 10000
##$MC2= 0
##$MEAN= 0
##$ME_mod= 0
##$MI= 1.114404
##$NCOEF= 0
##$NC_proc= 0
##$NLEV= 6
##$NOISF1= 3.799351
##$NOISF2= 2.8
##$NSP= 1
##$NTH_PI= 0
##$NZP= 0
##$OFFSET= 14.38212
##$PC= 1
##$PHC0= -5301.948
##$PHC1= 6.821927
##$PH_mod= 1
##$PKNL= yes
##$PPARMOD= 0
##$PSCAL= 0
##$PSIGN= 0
##$REVERSE= no
##$SF= 200.129724274929
##$SI= 16384
##$SIGF1= 3
##$SIGF2= 2
##$SINO= 400
##$SIOLD= 16384
##$SREGLST= <1H.CDCl3>
##$SSB= 0
##$STSI= 0
##$STSR= 0
##$SW_p= 3205.1282051282
##$SYMM= 0
##$S_DEV= 0
##$TDeff= 0
##$TDoff= 0
##$TI= <>
##$TILT= no
##$TM1= 0
##$TM2= 0
##$TOPLEV= 0
##$USERP1= <user>
##$USERP2= <user>
##$USERP3= <user>
##$USERP4= <user>
##$USERP5= <user>
##$WDW= 1
##$XDIM= 8192
##$YMAX_p= 0
##$YMIN_p= 0
$$ End of Bruker specific parameters
$$ ---------------------------------
##NTUPLES= NMR FID
##VAR_NAME=  TIME,          FID/REAL,        FID/IMAG
##SYMBOL=    X,             R,               I
##VAR_TYPE=  INDEPENDENT,   DEPENDENT,       DEPENDENT
##VAR_FORM=  AFFN,          ASDF,            ASDF
##VAR_DIM=   8192,          8192,            8192
##UNITS=     SECONDS,       ARBITRARY UNITS, ARBITRARY UNITS
##FACTOR=    0.0002768,     1,               1
##FIRST=     0,             0,               0
##LAST=      2.2672688,     0,               0
##MIN=       0,             -201068,         0
##MAX=       2.2672688,     212416,          0
$$ Real data points
##PAGE= N=1
##DATA TABLE= (X++(R..R)), XYDATA
0@%%%%%%%%%%%%%%%%%oJ4j6J6j6J6k3L1l2L7m5N2o0O9p8Q9j03J17j31J47j66J87
39I9k08K32k61K91l23L57l94M36m81N28n84O45p08P81q60R47j046J157j279J418
59G47j580J767j988K249k565K959l454M075m803N156J194K08659j26214k61655
73a75453J35980J09455o8430o573L7230o7438j4131R7984N76o5255O609m330O
86a3770N6138J7912r2874j9377R4891O927p2991R323M6659l6878j9873P2893j3864
99C5116r2154M1805R3132o8473o6559R6301K0638j08291K6171R8965o2427p2241
111e8017Q4274L3215q3968l099N6827j0190j8030L22k2739K7602N4332o3446o8807
124g1724Q9149O1777j00532l6178J01851K754r5304K4921P7947m3896n7078N1635
$$ y = [0, 0, 0, 0, 0, 0, 0, 0, 0, 0, 0, 0, 0, 0, 0, 0, 0, 0, -6, 8, -8, 8, -8, 8, -15, 16, -16, 21, -24, 28, -32, 37, -41, 48, -55, 62, -69, 78, -88, 99, -109, 123, -138, 153, -170, 187, -207, 229, -252, 276, -308, 337, -371, 410, -450, 497, -549, 608, -671, 747, -833, 934, -1054, 1195, -1370, 1589, -1865, 2210, -2593, 2563, 3757, 212416, 86202, -175453, -39473, 69982, 1552, -5021, 32209, -35229, -49360, 48624, 49200, -16055, -9446, -13776, -13770, 42368, 60280, -32594, -51971, 42920, 49847, -23144, -13821, 32838, -4040, -23913, 48980, 35116, -57038, -15233, 77899, 9426, -57133, 39168, 59806, -48485, -22314, 76651, 14224, -58017, 26257, 59472, -24496, -27595, 29232, 19042, 1012, 1334, -21405, 6197, 60529, -2917, -71724, 17425, 79202, -21330, -57508, 44343, 47097, -48207, -23286, 54661, 10765, -46313, 5322]
136E322L3996m7768j2238L0771j3813j3781L4676k888m4943J8171M0509k7910
148A04k3978K8075p3j8915K5516L152l7001J6646K7770m2515n963O3913k3972
161A2759p4382N0205O6621o5160m3041O6990R315n6562K4020M2786m5297k9336
173d1082N0403K1727l6175j6897P269J3224K3275r965m7531P731O1473r904n8796
186c5248J3214M4912k5170k2779L9834L661m5387J3392M0478k7486k0995L6998
198A5424n682l7029L2074L0483m9086j8833M9250L150l6990J1458J6338j9294
210h737P420J9879k6356j0811L5916l924l0564K0895J6617l4084M671M0673k3805
223G790m4217M0041L7859m9827k5579M9264J1231m0603K324K3920j3570k877J9086
$$ y = [5322, 39318, -8450, -20688, 10083, -3730, -17511, 17165, 14277, -30666, -12495, 28014, 104, -23874, 4201, 4128, -14787, 10729, 13881, -23120, -6474, 21296, -21219, -27182, 36731, 12759, -61623, -11418, 55203, -9957, -52998, 13992, 23307, -33255, -9235, 33551, -11746, -41082, 9321, 31048, -5127, -22024, -14755, -1531, 21744, 11779, -35752, -28021, 33452, 23548, -35248, -22034, 22878, -2292, -25071, 14763, 18424, -26963, -13571, 26907, -579, -21574, 15424, 9742, -27287, 4787, 35270, -13816, -32649, 16601, 19751, -17239, -5781, 10557, -8737, -1317, 18562, -7794, -18605, 17311, 13387, -17177, 3718, 20335, -13749, -9078, 31595, 7790, -36427, 3614, 41473, -8354, -33933, 15331, 26562, -14041, -11717, 12203, -1367, -4244, 14842]
236A4842j4929j5863K7177Q332l1311N585K7328k1227j7366L3834J321l6415J1757
249f935K9277k5139j4643L1283n786k8682K3680J9146l5809k912M0241j4453l5766
262b6498K9747K4852l7636j1227L7563l129k8921J1390J2331j4371N735J1277
274A1113k3630l718L3894o505l6076J9156K7368k9371j0878L5842o477l5772K2796
287b258K9391l3483j7530L4988L253k8290R907J3371j9764M417K2954k2642j8463
300b4149L3621R733l7094K750L3431j2904k2293J9499P447j8860R423J1059k3890
313a2227J728L1213j6785l0905K7829K3082l5171r709L6145n352k9562J8897J8124
326A7307k6617k929K7502r539j9648J7635P002j9293P598J4502k1897n719L1164
$$ y = [14842, -87, -15950, 11227, 19559, -11752, -6167, 21161, -66, -17432, 16402, 17723, -18692, -6935, 22342, -2797, -17440, 13843, 8057, -20625, 3055, 22201, -13608, -16520, 23721, 9268, -26498, 3249, 28101, -9535, -20762, 16801, 13672, -15249, -3859, 8472, -5899, -164, 11113, -12517, -16235, 17659, 11154, -24922, -5766, 21602, -7769, -18647, 17195, 10718, -25054, -2258, 27133, -6350, -23880, 11108, 14361, -13929, -4022, 9349, -10415, -5998, 16956, -5686, -24149, 9472, 19205, -17889, -15139, 18292, 5388, -16905, 2594, 10041, -8819, 604, 11663, -12227, -10499, 20714, 3929, -26976, 853, 23935, -11236, -20945, 15200, 9848, -19714, -817, 17307, -9310, -12239, 15263, 5724, -13924, 3711, 10713, -8580, -982, 13520, -8377, -14096, 17068]
339A7068o309l4497J8308K9439k6524j8745K8411N529k2825Q175J2671j7448J373
352e374K2687j5216k0924K6631J2194l2952K60L0948j3202k3048K1760R849k4834
365a1221L543K1546j4584j3126K1438J481j9809J2233J1850k2770J169K8632j5460
378D922k7943K6162K1806l2054j3159L0316J483k2906Q298J0806j5102M100J6354
391A3083j7403j0882K6588J643k8839R442K5893j8710j7373K4463M168k4656Q650
404c933J8967k0036q485K2557l263j8789J3446R183k0202N666K1255j8112j8680
417b0426K9271J2105l2401k841K8689o521k0327J2368Q491j4924M945J0805j7307
430h073k938K3501p194k4723J7645K1237k4769j0760K5950q99k2275J2958J5139
$$ y = [17068, 10759, -23738, -5430, 24009, -2515, -21260, 7151, 12680, -10145, -1970, 10701, -6747, -5374, 17313, 2097, -18827, 7804, 19998, -12954, -12694, 18254, 5052, -17996, 3764, 13613, -11221, -7678, 13868, -716, -13842, 7596, 9077, -10732, 1501, 13351, -9419, -8250, 20382, 4922, -23021, 3141, 24947, -7107, -20266, 10050, 11533, -11373, -3075, 7731, -7371, -3271, 13083, -4320, -15202, 11386, 13029, -15810, -6368, 19525, 815, -16558, 7905, 12073, -12583, -3933, 15034, -5002, -13487, 9070, 5807, -12982, 464, 9647, -10555, -4889, 16366, -1746, -20426, 8845, 20950, -11451, -14292, 14397, 7876, -12451, -83, 8408, -6516, -1571, 9234, -8073, -11011, 12490, 5296, -19427, -1782, 19455, -5314, -16074, 9876, 8977, -13298, -340, 14799]
443A4799j9921m931K0904n534j7087J3542O644j8300O479J7502j9376j2059K7727
456A0389L243l0118P009K7065j4095j8516J7530P984j5035L745P246j2618L713
469b458J6865j6683j7139K5828J3303k9280o621K6043k520j9274J1065J0224j5961
482f608J701J7868j0554j4549J4796N271j3991P374J0522j8609m416K5777n595
495H987k9354J2872K6314j7154j6147J8050L708j4649O209O861j1333M307J3842
508A2513j4259j0972K1179M468k4598L258K2524j1048j6170J5435O989j7154J373
521f462J4339p255p852J0419j489r665J1490O698j7615Q38K0106r530j9395J6494
535A121J4098k0623o264K1410r48j8631L900Q474m769M201M117j4697L27K2041
$$ y = [14799, -5122, -10053, 10851, 5317, -11770, 1772, 8416, -9884, -3405, 14097, -5279, -17338, 10389, 13632, -16486, -9477, 17588, 3493, -15023, 2507, 10491, -4544, -799, 6447, -6171, -2458, 14407, -2276, -19415, 6413, 19716, -9564, -16185, 9858, 7338, -11936, -871, 9353, -6608, -4907, 12961, 2407, -12142, 2654, 7925, -6066, 1308, 11830, -6779, -11195, 14582, 8987, -20367, -7495, 18819, 1665, -14482, 3568, 7276, -7373, -1164, 5697, -5636, -1329, 12513, -1746, -12718, 8461, 12929, -11669, -8411, 14113, 3065, -13105, 2330, 9319, -7835, -6462, 7877, 622, -7230, 3189, 1700, -7965, 3525, 10223, -7392, -6554, 13552, 4022, -15373, 1121, 15219, -5404, -11668, 9742, 8794, -9837, -5937, 2537, -2232, 1969, 6086, -8611, -8284, 13757]
549A3757n553k5122J0250K1775j2173j1627J4124R92j4458O555R089j1410k102
562e903J2055m587q336R295N94j1975P301J1123j2952o388J7850J532j9411L338
576f464J7095n973j1872O570M618n315L199P50j0588M765J5083j1024j6284J5662
590B22J2221j7849m064J8735l489j5138R481P386j1971J370J0916q036m264J1338
604F858m656j2510J1197P676j6262P7J9410o667j8587J0752J2962j2689n790J2885
618D656M71p119M475l51q755O835J0033j3057q023J7982L297k0348J829J7464
632I389p686j1543J1937L775j1944M740R006j1524l004J5697l792j3722J0381
645A710O557j5968L164J8257j2231j6857J7688J1215k0223n401J7523K57r906
$$ y = [13757, 8204, -16918, -6668, 15107, 2934, -8693, 5431, 6423, -8035, -1480, 7609, -3801, -5903, 6152, 1565, -6771, 2524, 3118, -8857, -1556, 9567, -3385, -9773, 8077, 9609, -9802, -6464, 10631, 4658, -7214, -644, 3974, -1341, 1858, 2608, -7980, -3215, 11868, 844, -15440, 222, 12443, -5406, -9470, 9265, 5776, -9362, 119, 7505, -4466, -3096, 7820, -216, -4480, 6858, 2202, -10308, 889, 8565, -7697, -7620, 11790, 5123, -13464, -2712, 10250, -2439, -8229, 4656, 5127, -1992, 2483, 2132, -6623, 212, 10245, -2812, -10835, 7147, 10444, -9904, -8075, 9389, 1703, -9840, 2097, 5872, -6072, -1332, 7674, -3850, -6854, 8843, 5051, -8671, 1710, 8267, -7701, -4537, 13720, 1489, -15368, 2320, 13535, -6688, -12089, 5434, 5691, -4215]
658d215N038K78p906Q828P420j5160l271J9150j011j8525N639J3389j1120p682
672i148J4081J388j3387N198Q714j1457k700J3684l581j1401J0836N974j4989
685f788K104J5812j0318j2783J7177P138j9960k14J7215o134j1391Q714K611p954
699d771O152L843j3109J914J7036p523j6160J2590J2605j5235o800J5460P79j2269
713e488M662O823q792j635R989m338q989R088M393j1485K276J1055r434p527J4829
728E427K772j6074L516J4571p942r788R966L421q963M487L264j0576K381J4112
742A0574j0771j2280J4508P737j5561k507J4946l138r926O642N494q768J303P947
756F200n873n144Q385n11p724M678N965j0401k180J2977k313j3617P152J1593
$$ y = [-4215, 823, 1101, -6805, 2023, 9443, -5717, -8988, 10162, 9151, -9374, -3735, 9654, -1466, -9148, 4933, 6321, -7066, -1868, 6846, -4611, -7311, 6373, 2792, -8609, 2227, 8201, -6788, -4684, 11128, 810, -11973, 5204, 12342, -7618, -7832, 9383, 3249, -8142, 572, 3183, -4771, 1381, 5224, -7885, -5971, 11065, 3542, -12618, -28, 12577, -2658, -9458, 6002, 6781, -5488, -826, 5997, -2795, -4430, 5559, 1221, -7768, 1320, 5713, -5772, -3496, 7559, -1875, -9402, 5427, 8199, -7875, -4359, 10212, 2270, -7518, 2448, 5869, -3094, 1393, 4657, -5919, -3538, 10574, -197, -12477, 2031, 9768, -5793, -8300, 6646, 3508, -6418, 224, 5718, -3050, -1747, 6200, 327, -4817, 3568, 3057, -4667, 11, 5976, -4425, -6605, 6372, 4059, -9558, -2406, 9187]
770I187r562p947J0636L183p839K490K316n858M157P677j0772o239J3780L047
784H256j5696R46J2950m378r660Q171K445p339M292M497p403j666R534k760q114
799e925P418L928r868J143J0932o444r983Q800Q444j1864l481J0458Q36p717J655
814a668L773m083K836M038q832j105J2836k382j3997O457J1992r366p831R657
828B325J978q726L669M465p651L45Q505m467o476Q268K241r432K950R051p196
843a51o515J0617L105j2173O24J1017l923p456M468K141l930K954J555p757J971
858c453J0521n503j0787R195R222j0788m928J0591K42p886M010L458o716J048
872a774O679n500m684P863N55q875M143P355q032l995J0761Rj0907M517R056o572
$$ y = [9187, -375, -8322, 2314, 5497, -2342, 148, 2464, -3394, 763, 8440, -2332, -8571, 5209, 8256, -7440, -6494, 6456, 2078, -7582, 589, 3034, -4305, -13, 4484, -2919, -4585, 4949, 2189, -5925, 1493, 5421, -4447, -3304, 7628, 1184, -8799, 1, 8445, -3419, -6900, 3558, 4394, -3323, -1668, 2105, -1978, 858, 4896, -3936, -5041, 7795, 5413, -8584, -2127, 9865, 499, -7332, 2325, 4303, -4423, -754, 3711, -3940, -3595, 4910, 443, -6033, 2235, 4476, -4956, -2006, 7045, -151, -6666, 3951, 7056, -5117, -4493, 6524, 2601, -4855, -387, 1754, -2176, 778, 2333, -5424, -3453, 7068, 1565, -9222, -27, 9195, -1593, -6521, 4070, 4312, -3574, 436, 3894, -2822, -1774, 4905, -595, -5279, 2584, 3139, -5736, -1593, 5762, -2270, -6265, 4496, 4505, -6402, -1885, 7171, 599]
888E99n529O667J198m446K762O72o058L492P031q145o563J1478L898j2468n13
903e925J0717k259p162M644L075n004J799M646n647k373P884j809p869N581N555
918E853r027j587R672l140r280O691P504q326m179Q194L48m927L387N42n077M651
934A299N178r271l026J1519l22j2117K880J0222n367p169O274K744n449J817L217
949B429m975O63O571m066n949P262M117q647m24Q390m301p250P886M254r918j083
965e041R247j969o444L488J566l735L938L184p827n61J0829k615j1528N708R952
980H192p690o136P954J353o979K196L422m801N75N507m510m030P505J060q547
995d929L006P954o335n183Q806K180r707J243Q450l329o275M131K015m353K072
$$ y = [599, -4930, 1737, 2935, -1511, 1251, 1923, -4135, -643, 6388, -1757, -8320, 3158, 7056, -5412, -5925, 4792, 2533, -4629, 15, 3090, -1914, -115, 4531, -1116, -3489, 4395, 2586, -5283, 298, 5853, -3174, -4761, 4911, 1771, -7509, -818, 6686, -1640, -5819, 2375, 2723, -2204, 1183, 1725, -3352, 1299, 6477, -2794, -5820, 5699, 5377, -6740, -3860, 6362, 995, -6174, 100, 2844, -2605, -788, 2429, -2546, -1883, 4688, 622, -5327, 1935, 6052, -2595, -3019, 5371, 1070, -6180, 1706, 5960, -3958, -5041, 4206, 2237, -4207, -719, 847, -2888, 1050, 4234, -3593, -4154, 6675, 4060, -7468, -1760, 8192, 502, -5634, 2320, 3673, -3306, -1110, 2312, -2489, -1914, 3593, -917, -4947, 2558, 3618, -4929, -1923, 6031, -304, -5487, 3319, 5499, -4208, -2965, 5485, 2156, -4119, 12, 2027, -2326, -254]
1010b54K338n441J047P628m824q283P786P229q930l845R343Q21p482K117L341
1025B591m723J370N286n264l157P317r78q014L791O199o156l136Q663K72r190
1040e129K417P882m660m526N944J458m763J473J557l868J595M773n162m686Q207
1055B512L134j0596p43J0416j745p570M266L211m902J327M093m490j379O686j317
1070B903p432L566N411o416j748P922j723p720L882N302n664k646O051J047l945
1085a210J575J083l587K017L736n107k089Q284Or457J132Q160l461o293M817M000
1101C606m878n33L434l110r71N387j594n207M784L903o619j219O837j951n764
1116c895M682L472o680r80O412j998m430L591J410l750J780K342m617J55P033
$$ y = [-254, 2084, -3357, -2310, 5318, 494, -7789, -3, 7226, -1704, -5549, 3794, 4615, -2867, -750, 2591, -2132, -762, 4524, -740, -3897, 3420, 2442, -5572, -1781, 4418, -1738, -4874, 3789, 4061, -5129, -2712, 5170, 510, -4016, 1928, 3386, -1377, 96, 1653, -2215, -620, 4153, -1009, -5695, 2512, 5646, -4950, -5693, 4723, 2978, -4592, -326, 2885, -2017, -690, 3403, -1087, -2466, 4220, 2903, -4529, -963, 4448, -1968, -3716, 4206, 2483, -5237, -1355, 3947, -1717, -4363, 1688, 2735, -1210, 365, 1448, -2139, -122, 3614, -1493, -3582, 4702, 4708, -4749, -3617, 4543, 1082, -5211, -394, 3606, -1272, -1805, 1629, -1481, -2452, 2935, 1341, -3866, 918, 4821, -1798, -3017, 3820, 1869, -3895, 787, 4259, -2421, -3401, 3011, 1013, -3417, 174, 1584, -2166, -386, 1956, -2661, -2506, 4527]
1131D527j612p525L480O561m836n145N200K934m116m41K081k109m22K757k023
1146f89k579M567J941n837J80N855l080m564N887K605o350K05N766k999m262L831
1162D77J380l402J469J861m168M57N287l243n408N554M600o140k577N757P01l748
1178a143N78J827j299N63J409l214j269N063m06n777K296M826m279l214N163J456
1194B580n158J007N027k947l296L891J014l274J527J469l252J382L385m492l245
1209d382O212J861p051J56O375j630m949K817K097k603J403J683l365J09M811
1224C544k302m884M032L532n051k013N274k09n269K207L663l535j699L999l49
1239I40k756J960J106k599J806K772m434j833O581r9p407J828O665l623m931L878
$$ y = [4527, 2915, -4610, -1130, 5431, 595, -4550, 650, 3584, -532, -973, 1108, -1001, -1423, 1334, -689, -3268, 1299, 3240, -2597, -2417, 3438, 358, -4206, 1681, 4286, -2064, -1859, 3907, 908, -3354, 477, 1857, -1545, -76, 1785, -2383, -1926, 3361, 118, -5290, 264, 4864, -1276, -3853, 1904, 2605, -1143, -565, 1262, -37, 526, 1935, -1279, -2548, 2515, 2109, -3668, -1372, 3454, -825, -4039, 1124, 2580, -2578, -1571, 3456, 509, -2787, 1104, 2118, -1156, 371, 1840, -1412, -30, 3355, -1137, -4382, 1830, 3691, -3360, -3204, 3171, 1541, -3408, -591, 1506, -1097, 306, 1989, -1376, -1267, 3544, 1242, -3642, 390, 3922, -1129, -3142, 2132, 1923, -3346, -1139, 2524, -1011, -2710, 1289, 940, -1816, 144, 1250, -1349, 457, 3229, -1205, -3038, 3543, 3444, -3963, -2135, 4530, 907, -4024, -146]
1255a46K294l642O06K059k893N61M081k804l865N006K554n611n86N902j930m535
1271b949L568K239m255n69M173j677l086K638R10k957J720K326l966o16N776j174
1287B101o132L257N854m661m413N120K106m474L8K585k325M7K925k918k505M879
1303A484R20n530J088N551k950l999M438K090m719M49M285j753m066L326J161
1318A775l395J449J017k014k71L345k051l886M013L971n255k538N749Q17m506
1333a780J035K534k070K84K036k754j366M328l6n821K041N280l908l848N124J413
1349B492n107J074M216k666k329L720L67l154J678J614l059L78L724l028l458
1364c538M918J768n879m99N681p56m806K007K825k092l45K103j912p24L856j150
$$ y = [-146, 2148, -1494, -888, 1171, -1722, -1161, 2920, 116, -3749, 1257, 3811, -1800, -2386, 3516, 1586, -2949, 619, 2858, -1397, -1966, 2207, 530, -2556, 82, 992, -1965, -245, 2081, -1885, -2501, 3275, 2101, -4031, -774, 5080, 419, -3994, 1126, 3232, -1242, -1204, 1381, -944, -897, 2028, -890, -3395, 1484, 2404, -3126, -2038, 3513, 563, -3436, 1002, 3092, -1627, -1178, 3107, 1354, -2712, 614, 1775, -1620, -171, 846, -1168, -1439, 1906, -145, -4031, -18, 3953, -1302, -3840, 1909, 2726, -1780, -745, 1789, -281, 3, 2039, -715, -2081, 2247, 2211, -3610, -1569, 3711, -197, -4045, 1079, 2492, -2615, -1541, 2675, 9, -2320, 1400, 1767, -1387, 291, 1905, -1154, -776, 2948, -80, -3538, 1380, 3148, -2731, -3230, 2451, 1695, -3111, -1104, 1721, -371, -716, 1387, -525, -1249, 2607, 1457]
1380A457m484L084L862m468k757N107O71n206J152M081l046k029L714j74l101
1395b137K039J627k717P26L171l012k272M811R42n986R53N569k070m774K899K775
1411B544l309q26K259j423l88K620j539k699L480K514m421j005M727j29m909J965
1427e39L433l717j271L438o03k637J733J242k408J84K741k277j559M404j68m961
1443b965J840M986l386l632M033K082l418q91K441j328m94J864j456k141L568
1458A103Q34m626M31M728j391l706K697K585l179j042L174l58k545J691J025k132
1474g11L93J422k218l50L242j257l672K808L302l991k179M629J162l943K40K608
1490A485j164o14J353j252p20K820n91l947J486L605k666k834L605J474l659M4
$$ y = [1457, -3027, 57, 3919, -549, -3306, 1801, 2472, -2734, -1582, 2499, -547, -2576, 1138, 964, -2137, -98, 1529, -1188, -462, 2709, -303, -2575, 2236, 3178, -2808, -1855, 3714, 1644, -3130, -231, 2544, -765, -1591, 668, -755, -1143, 1477, -62, -2761, 719, 3233, -1188, -2193, 2534, 2405, -2504, -539, 2894, -823, -2094, 1344, 741, -1896, -163, 1079, -1329, -1145, 1596, -681, -2240, 2164, 1996, -2965, -1125, 3861, 475, -3157, 876, 2958, -460, -1351, 1090, -238, -732, 1132, -324, -2465, 1103, 1937, -2689, -2258, 2470, 1079, -2627, 70, 2655, -524, -1566, 1608, 1250, -1295, 396, 1421, -711, -318, 1104, -1114, -1464, 1778, 521, -3151, -343, 2959, -1032, -3211, 1418, 2580, -1363, -1123, 1485, 321, -293, 1060, -192, -912, 1908, 1317, -2630, -1144, 2461, -205, -3039, 566, 2040, -1619, -1575]
1506a575K960j431j593K484M33j938J068R27k266L24K686k132k320L445J504m448
1522a872n77M295p59l637J592K400j577n58J168r47j40K601j184l162K871K485
1538B999l877j517M197J90l965R62K644k113j421K612l34j945K069P70k664R20
1554d73K366k403j403L972M55m633R14M068k242l415K740J971k557o9J446j645
1570i08j85K450j590k362L454K276m485j012M805p18m307K287L176l197j148L025
1586A561j089k520K341P19k741J134K368k767j360L971m5m280K124L915l282k714
1602b665L828J141l376N76J988j623o32J816j519j914L241J304m307K9M719j856
1618G50m084K904K965k944q60L233j088k415J941Q76k571J081K316k744j156L536
$$ y = [-1575, 1385, -46, -1639, 845, 1278, -660, 408, 1335, -931, -607, 2079, -53, -2373, 1072, 2576, -1872, -2449, 1846, 1087, -2550, -958, 1442, -135, -693, 475, -472, -612, 1989, 805, -2357, 514, 2999, -878, -2395, 1802, 1992, -1973, -1011, 1633, -480, -1901, 711, 377, -1568, 501, 1271, -1393, -473, 1893, -510, -1913, 2059, 2514, -2119, -1205, 2863, 621, -2794, -54, 1917, -640, -709, 737, -908, -1093, 1357, -233, -2595, 859, 3135, -1350, -2362, 2443, 1725, -2582, -295, 2881, -316, -1464, 1561, 472, -2048, 293, 1012, -1729, -595, 1773, -994, -2354, 1617, 1572, -2708, -584, 3331, 49, -2665, 1163, 2304, -1072, -496, 1492, -131, -763, 1053, -466, -2380, 861, 2165, -2142, -2113, 2606, 750, -3334, -430, 2535, -409, -1269, 1964, 876, -1539, 402, 1278, -1293, -212, 2104, -640, -1796, 1740]
1634A740r50m165K810L394l730k019M447O50m056P68K883j697o97K141j332j645
1650a458K832J75l818J222L791k425l591L461K095l694m10L370r80k064J993N27
1666A026k246J091K017k336n92L069j170l404K573K591l752j404M516j56m319
1681b496J334K713j855r80K102n66j213K311m27l009J936L012l107k270M086R30
1697B501m250J59L172j435j960K165M91k139Q58J440j894q7K718j222k525K854
1713H46J639l806k75M034r90l722J807K426k463j035K076n31j045J731n17k285
1729b110K345J996l304j138M274K5l950J030K995j882j688K251J86k141J098R62
1745I49k056L17J984j615j372K604O59l056M09L487j720k899K843J760k820n25
$$ y = [1740, 790, -3375, -565, 2829, -901, -2920, 1527, 2177, -1879, -1111, 1772, 75, -622, 1519, 187, -1458, 1374, 1549, -2269, -1047, 2744, 319, -3272, 189, 2284, -1410, -1820, 1550, 570, -1494, 499, 1026, -1220, -129, 1888, -448, -1040, 2029, 859, -2545, 28, 2619, -1133, -2537, 1979, 1823, -2496, -1162, 1551, -304, -1284, 818, 252, -961, 1350, 923, -2086, -150, 2862, -245, -2515, 1571, 2501, -1749, -1590, 1582, 147, -1813, 352, 843, -1296, -438, 1002, -892, -979, 1739, 517, -2008, 846, 2485, -1321, -1596, 2438, 1448, -2274, -467, 1959, -504, -1539, 537, 6, -1039, 692, 175, -2110, 235, 2231, -1073, -2211, 2063, 2088, -1862, -832, 2163, 281, -1407, 844, 1030, -1111, -13, 949, -1107, -790, 1194, -421, -1793, 811, 1470, -1586, -1177, 2310, 590, -2309, 534, 2294, -526, -1051]
1761a051K263q19j210J428m76j630J852J206l312k93L926q70l513K012K838k656
1777c05j319K673r7j959J261Q51j826M96J571j851r69K745m77k946J553K717k691
1794e73j748L127Q44k870K20K324r31r79J239l22j202J752L90k807P17K998j854
1811C25k819K509J901k970q17K783k84k090J557O93j629Q42J307j883k69K572
1827A728r88k398J899J749k902j029L183k06k998J113K208j612q26J468l71p46
1843g28J517k32j659J155K105k248j836K958Q94l159m2K699j069j814J601M18
1859E60j557O20J134j533n5K227j063k037K340J419l287J74L018j068k688J743
1875e3J698k058o89J513m57q36J200j86j545J506J411k531o34L257p5l138J022
$$ y = [-1051, 1212, 393, -817, 611, 135, -1495, 357, 1563, -1749, -2042, 1884, 1014, -2499, -487, 2351, -305, -1624, 1049, 952, -1007, 254, 1105, -721, -225, 1346, -505, -1474, 1271, 794, -2152, -599, 2118, -573, -2321, 806, 1650, -1220, -1000, 1324, 393, -586, 653, 331, -871, 881, 1271, -1536, -819, 2179, 325, -2494, 15, 1916, -1054, -1871, 912, 628, -1462, 95, 788, -841, 1, 1308, -575, -844, 1728, 740, -1658, 241, 1990, -912, -1941, 1242, 1036, -1962, -849, 1359, -253, -1079, 389, 18, -728, 789, 557, -1102, 53, 2158, -90, -1926, 1032, 1926, -1233, -1275, 1424, 355, -1459, 142, 560, -997, -377, 757, -776, -831, 1396, 333, -1704, 636, 2055, -1232, -1058, 1960, 892, -1796, -53, 1645, -413, -1102, 411, -46, -882, 318, 132, -1413, 93, 1504, -1027, -1661, 1596, 1521, -1617, -595]
1892e95K654j709j474J831J26j535N40R48j655K35J687j421j294K334M24k737
1908a641P09K750j504k098K510J113k398j79J804p74r33J358o43j152J606O37
1924A165k714J90K912j052k695J953K120k323r25K477k52j625J142M17j313M64
1940e9J152j586o64K180j52k684J310K315k440j333K604N41k456N81J886j235
1956d0o76J459m07j077J588L36k436P27K515j919k361K664J410k894k91K403p15
1973B86j672J495N24j238O89J105j730m00K400p71k201J960J449k653o54K632
1989A221l39k673J131J991j633p71J661n33j211J648L08k083J243K067k160j727
2005a860K945P58l104J58K739j328j857J856M48j825P82J201j672k2K006r52j770
$$ y = [-595, 2059, 350, -1124, 707, 833, -702, -162, 786, -869, -634, 1053, -368, -1662, 672, 1096, -1641, -932, 1818, 314, -1784, 726, 1839, -559, -738, 1066, 292, -641, 717, 74, -1078, 528, 1165, -1549, -1359, 1553, 501, -2194, -241, 1879, -444, -1369, 1108, 856, -769, 373, 790, -523, -59, 1093, -493, -1157, 1023, 871, -1813, -503, 1812, -628, -1961, 643, 1184, -1272, -691, 1195, -40, -716, 743, 336, -741, 847, 1183, -1253, -526, 1989, 70, -2291, 373, 1783, -1111, -1402, 1001, 286, -1386, 109, 633, -605, 84, 1189, -541, -941, 1459, 688, -1513, 447, 1896, -757, -1411, 1221, 882, -1791, -660, 1331, -302, -1073, 588, 55, -1156, 492, 800, -1283, -40, 2027, -133, -1860, 1085, 1843, -1261, -1103, 1636, 308, -1549, 307, 755, -1070, -288, 913, -759, -781, 1225, 273, -1497]
2022a497J923J290k519k50K751p13k647J458J912k105n74J808n32j320J239O0
2038B84j621J213J424j807r65K633K65l124Q93K664j499j448J823K86j689L53
2054c15J138j352j70J729r44j549J840O51k409M03K471j089j992J901J287k015
2070d15n55J838k47j168R84Q1j309Q18Q44j856k7K276p78k304J307J988j679r42
2088a144J859K66j603L97R71j010N4J268r89q62J446P7k097O43J916j303j291
2105a402J816Q16k129KJ642n38q26J055p6n78O18K57j466L37J722j099j575J628
2123B04R97j852n52J816l12j187P52M82o98J82P02p65k07J390k35j535Q21J278
2141A281j649p09J988l24j602O06R94q40m55R69k38n50R80o7j335J003J193j564
$$ y = [-1497, 426, 1716, -803, -1053, 1698, 985, -1662, -204, 1708, -397, -971, 837, 305, -1015, 224, 284, -1337, -124, 1300, -507, -1472, 1161, 1426, -1698, -805, 1859, 360, -1088, 735, 1021, -668, -315, 823, -529, -699, 1030, 86, -1463, 377, 1028, -1381, -978, 1493, 404, -1588, 313, 1600, -415, -970, 868, 621, -547, 437, 518, -791, 27, 871, -985, -1012, 1264, 486, -1818, -511, 1477, -202, -1144, 715, 981, -622, -225, 746, -264, -210, 1058, 69, -793, 653, 730, -1367, -724, 1192, -111, -1402, 414, 1230, -899, -897, 745, 207, -619, 436, 360, -218, 400, 657, -809, -472, 1250, 151, -1424, 204, 1201, -651, -1203, 613, 301, -886, -134, 348, -350, -168, 534, -231, -438, 952, 717, -818, 3, 1281, -368, -1077, 911, 587, -1015, -409, 585, -255, -710, 259, 21, -529, 451, 384, -951, 52, 1245, -319]
2159c19o10J966Q5j978K30J454n49j087P49O59r58K41M01r97J84J264q47r88J704
2178F04M55j831J94J809r82j186J232P48j289k96J078n88n50R76l94j054J175
2195A01Q37j883r1K144m22j861J066J521j442q19J614k45r94P26K61j173M69R88
2213G97j138p41J677O0j827P07J658j290j230J873N04j575J89J254p47o41R15
2230D45k24r26R23N63j643R1J888r40j627J531J061j763l29J732l42j115Q43N04
2248F72j311O57J033j308n95J661k15j694R84J341j651q25J768J22j730O49J186
2265G44q65n41J273l42p84R42K59j379N82J363j248j333J893L25j657k50K103
2282A085j217m38R05K06j795Q75J273j643j21R64r24j54J588P05q62j891K263
$$ y = [-319, -929, 1037, 1122, -856, -626, 828, 279, -808, -59, 600, -358, -117, 284, -713, -529, 735, -112, -1100, 604, 1059, -772, -578, 1231, 249, -937, 295, 1043, -246, -542, 536, -52, -602, 374, -20, -1074, 101, 938, -945, -1036, 1108, 686, -1175, -109, 1412, -30, -849, 765, 520, -474, 252, 513, -660, -191, 797, -341, -1082, 595, 655, -1172, -465, 1193, -97, -1327, 546, 1050, -525, -336, 918, 171, -470, 445, 221, -705, 218, 781, -862, -771, 1117, 177, -1450, 81, 1142, -621, -950, 782, 440, -675, 168, 672, -639, 18, 1051, -257, -852, 809, 594, -1100, -116, 1225, -426, -1251, 517, 639, -1091, -442, 744, -121, -662, 611, 269, -515, 427, 686, -693, -111, 1252, 4, -1329, 564, 889, -768, -1018, 1085, -132, -570, 335, 541, -1254, -379, 894, -749, -870, 94, -830, -984, 604, 1309, 447, -1444, 819]
2299H19l41j551R62R34j275k66J107k54r17J049K4j094O68J138j227p04J763J23
2317I58j873M75J613j049r73J046K74j048L45N27p50j49J186o69q09J207M71j616
2335h34K23J628o11j266J122O36j231r4R89m94o44P73q5r55O92P90j291k67J755
2354H36m31j441Q39J307j119o24J209J1j069O55N19r98L6R89r49n27J041K49j323
2373g90K73J378j017r05J644n68m59l82J459M91j220N55M02j090N0P23r77O50
2391B17P54j192q50R73P45o30j073K020m62j153P47M70q83L69O87r43l65J304
2409G35j67j359O54J103j440l85J231J0j213M90R16p60l46R81j58p17O41K20r44
2428e08L91J103r05q94J176M80j547K27J156o09q82R31K56q54J68Q20p31k41J020
$$ y = [819, 478, -1073, -111, 823, -452, -718, 389, 135, -782, 267, 291, -803, -135, 1003, -224, -928, 835, 958, -915, -440, 1173, 124, -849, 197, 471, -577, -232, 295, -455, -604, 582, -87, -896, 311, 782, -834, -611, 1017, 406, -860, 262, 898, -333, -427, 562, 68, -576, 197, 112, -843, -151, 639, -652, -919, 836, 405, -1036, -197, 1110, -9, -633, 576, 587, -482, 173, 692, -306, -270, 719, -230, -757, 284, 533, -790, -517, 861, -156, -1061, 583, 15, -444, -826, 633, 1124, -96, 459, 861, -229, -179, 544, -433, 217, 971, -221, -1071, -98, 647, 17, -1056, 964, 502, -651, 96, 566, -317, 52, 739, -204, -569, 735, 568, -791, -137, 966, -474, -859, 372, 382, -831, -341, 575, -185, -531, 450, 292, -425, 216, 436, -508, -117, 986, 81, -813, 363, 843, -704, -477, 679, 70, -812, 119, 375, -479, -311, 509, -222, -463, 557]
2447E57l19r85J002N64j147j43J228m21j082O86P75r98k88J018m67o36O94J89
2465B27q30N51Q46r10m00J217m5j299L60J202q48o97R32O2p86K72M00n67k38J007
2485D56m52q41R68M62j150J36J242o05r69R83M02r41R3Q03n26n36P08q4p87O40
2505BN60j048j45J227m24j000P24P24p45k02Q63o5o78K31M15o78J18O19o10l96
2525e08Q56k27q92L46J070q81l81J062M4r83L05P68m83m27P73j52n80N95J06q51
2545d40M2J042o16p89J057J92j031J1J105o39o12Q32J47o49L24O67p50j93R05
2564F05k20j122P10O58j049k85J238k61j080O75O23p81j04P74l12o00R50J05j046
2583e22N10Q22r62m65J127J41j324K75J074p92o93J038R1q91N19L78o05j77R65
$$ y = [557, 238, -747, 255, 819, -328, -471, 757, 336, -746, -60, 715, -283, -571, 447, -20, -656, 38, 227, -603, -52, 794, -116, -516, 701, 656, -643, -283, 919, 71, -626, 306, 368, -418, -146, 254, -313, -551, 456, 4, -837, 131, 593, -557, -421, 821, 216, -753, 230, 632, -309, -216, 587, 61, -475, 233, 149, -638, 2, 562, -486, -631, 596, 172, -828, -104, 620, -125, -327, 536, 471, -207, 24, 439, -239, -121, 498, -112, -508, 348, 121, -771, -425, 645, -236, -617, 445, 489, -494, -189, 579, 96, -331, 442, 290, -290, 305, 411, -440, -398, 644, 28, -761, 296, 488, -543, -532, 573, -66, -678, 154, 301, -348, -24, 643, -107, -300, 605, 385, -737, -27, 631, -418, -703, 535, 274, -806, -131, 492, -289, -393, 381, 69, -531, 419, 524, -522, -12, 810, -152, -617, 510, 651, -673, -398, 676, -116, -809, 229, 320, -571, -52, 326, -279, -456, 509]
2602E09l23q74R19O37j221o9J107m02q85P50N01j074l3R21m40o01O80J64q34M13
2622a55Q24q99k57J018Lj111O02P98r27l43R50k28q17N85L74r24J07P63l52p90
2642g79R69M73j012j1J023n65p25Q95M45r83K8Q56o68n84R96k3q22L52P01q08
2662b42m74J162j81j031O11Q62q70l60J036k09p51O03L32o97n8Q00n55m46P11
2681B43K12j001K18Q42n82n38P89K43q59K37P47n38l25N81J07p18L58M05o63m3
2701b85Q17m92p04O57O61j086lP95k42o81N38M53o83P6P28m45m61O71Rp79L63
2722i3O97p72k77O87l6p52L66O88p70k92Q55j77o12O45K48o46J21O74n35m19P01
2743C01P9o83Q3O91l77o63O83K8n24K81L43m54q8O14k69n26M28N62p66O0O62l48
$$ y = [509, 186, -688, 231, 868, -353, -422, 685, 283, -602, 148, 649, -425, -458, 463, 23, -578, 102, 266, -568, -155, 669, -230, -487, 531, 534, -577, 25, 823, -104, -447, 503, 275, -542, 43, 417, -507, -400, 363, 11, -779, 190, 663, -349, -360, 663, 98, -627, 268, 713, -270, -242, 614, -54, -638, 358, 335, -487, -135, 566, -242, -716, 446, 265, -766, -155, 707, -163, -523, 513, 304, -447, 156, 488, -209, -267, 533, -22, -468, 243, 455, -546, -328, 514, -68, -606, 183, 426, -433, -196, 551, 13, -312, 269, 376, -342, 16, 421, -242, -285, 532, 40, -664, -7, 654, -432, -435, 360, 118, -563, -25, 428, -255, -179, 549, 104, -357, 314, 323, -456, -93, 604, -168, -445, 242, 206, -546, -180, 508, -262, -554, 301, 124, -488, 157, 405, -241, -120, 554, 19, -400, 301, 380, -303, -220, 471, 94, -569, 114, 142, -382, -101, 242, -212, -300, 314, 45, -481, -53, 509, -257, -197, 465, 117]
2765A17n26M13M22p37N5O62l36n34N44Q5n88J60O80n09l81P59Q3p75M04N05m39
2786F4k43L83K6n49L88L68p44m8N76k35m68O47J12o96K60O86m90n44Q12R4n79
2807a80J69M80m57k59L76R2p29M47M72o94j96P88l63m29M96L20n93L4N75j22n67
2828c40N92K02p10O6N49l06l55N42no49J58N86m09l29N73P6p29M28N47n57k17
2849b87O54k09m59L61K48m50j05P29m97l99L85L72p53J04N83l20m75O33K59o82
2869c08J57N24l30k78N87j78n42M11N06p06j99P03k51l52J26L76n25o3P22k40
2889A40n20M15L82p16J38M08j53l35M85K8n39J81M68l62l69N53l0n30K69M01n22
2910b08k36O65r3m59M46K22m77j2M11j21n46O31P1n33l9O75m92l67O59pm45J74
$$ y = [117, -409, 4, 426, -311, -256, 406, 70, -464, 80, 165, -423, -263, 417, -92, -473, 286, 369, -406, -2, 503, 64, -179, 204, 230, -319, 69, 437, -307, -355, 221, -14, -482, 165, 277, -419, -159, 527, 37, -507, 305, 399, -180, -11, 469, 12, -247, 129, 221, -508, -61, 411, -283, -479, 309, -54, -483, 13, 333, -260, -226, 349, 227, -340, 252, 454, -256, -190, 359, 53, -302, 240, 235, -414, -256, 330, -79, -408, 165, 241, -488, -60, 487, -70, -287, 367, 158, -301, 60, 308, -142, -247, 482, -15, -414, -29, 343, -410, -306, 277, -43, -518, 115, 374, -308, -151, 373, 43, -235, 352, 174, -368, 43, 549, -157, -356, 347, 96, -256, -130, 246, -279, -342, 380, 140, -380, 35, 417, -299, -161, 247, 94, -241, 244, 272, -267, -86, 382, 20, -349, 204, 174, -356, -87, 314, -208, -444, 221, 128, -331, 115, 337, -140, -152, 259, 138, -408, 223, 294, -239, -278, 397, -95, -462, 197, 190, -255, -81]
2932h1M93n84j95M85J64n11K68L91n88j2N66j28n72L37K36m73M8L66j05m35M41
2953A11J91o07J18N76l95k95M79R6n16J76M80m39k87N60M0n96J64M93l88k85N08
2974A84j33m18L59L70n37j00N30r9l71M15R7n12J13M02k24l51K85L25m94O5J83
2995H9k60k15M62J07m41J33L28l32j83M31O7m16L00L17m55k12N46o2o37M90J45
3016B02m59jN65k90k96M20N8m71J74L96l01k18M64ml59J32L18k73k54M56j46m67
3038c54L49J88m37N6M43l62j65K85L51n11MM44k42l13M56K7l69J52J74q8l54M56
3060A90n0l95L04K26l52k34L67O3m39L03K87k70o3K60pm03L49J62n29J91L05k10
3082E5k85L90m9l44R6L87k79k34M59km74K55L70l57j46M39j51k68J17L16m47n2
$$ y = [-81, 412, -172, -367, 118, 282, -229, 39, 430, -158, -170, 396, 268, -304, 33, 269, -204, -156, 210, 105, -330, 111, 302, -305, -187, 389, -6, -301, 178, 274, -242, -66, 414, -25, -312, 248, 288, -308, -144, 349, -39, -324, 184, 51, -367, -8, 362, -175, -275, 255, 156, -215, 200, 297, -215, -102, 300, 76, -275, 10, 335, -159, -94, 89, -171, -386, 76, 183, -258, -125, 203, -129, -312, 119, 186, -230, 70, 387, -68, -280, 266, 204, -433, 57, 202, -257, -258, 307, 17, -279, 141, 199, -272, -98, 298, -3, -221, 243, 239, -120, 12, 330, 57, -197, 259, 113, -354, -5, 183, -254, -198, 245, -117, -282, 3, 354, -157, -153, 291, 49, -264, 192, 219, -150, 2, 176, 88, -266, 190, 140, -255, 49, 275, -77, -311, 56, 119, -320, -17, 270, 0, -63, 197, 190, -213, 136, 298, -231, -40, 265, 55, -230, 160, 111, -233, -137, 250, -29, -263, 196, 194, -280, -25, 345, -12, -158, 281, 130, -138, -21, 295, -152, -204]
3104b04L27q3l24K35K92l63j2L34k58r2K53mk00R8M94n16j58K66K4k96J64K25
3126B02l43j95M20m7k07O5K64k92JK60R0l68K93J7j62r3M37k57l62L31J43l77
3148a80J04J81k58K8J24P9l18K28K36j95j13L27r9l20K59K14m18Q4K14m5k45J96
3170H3J47l14K0K59l22k03M09R3l48N7L84l30j70M23j21k17J40K35k81l3J81k7
3192F5k54K04J75m18J37L29l22j63L23P9l12O5K64j59o8J75j5k22J44K09l11j30
3214b05L38l6l05J45K83m60J4L33O0m18K66J55k77j10L44j13k09L63R0m30J49
3235b3K26k87j39K49J04l44J07K67j96k32L79m0j93J77J33k90LJ99R7l18J39J64
3257A82l19j4K95q2j95J68J45l24p1L53k40j45K80K22m27J46K74j35k59M03j45
$$ y = [-204, 123, 40, -284, -49, 243, -120, -132, 202, -56, -148, 105, 101, -99, -1, 493, -23, -181, 85, 109, -187, -23, 202, -141, -336, 84, 37, -170, -105, 159, -133, -132, 128, 218, -150, 143, 160, -2, -95, 342, 85, -277, 54, 197, -180, -76, 105, -153, -125, -1, 78, -240, -12, 224, 29, -84, 243, 144, -176, 83, 297, -121, -37, 177, 132, -113, 83, 230, -84, -64, 195, -127, -330, 79, 172, -176, -119, 265, -65, -235, 188, 67, -150, -10, 225, -56, -89, 92, 65, -189, 15, 190, -228, -91, 238, -84, -247, 76, 155, -157, -92, 172, 13, -55, 120, 105, -117, 27, 236, -75, -205, 133, 97, -208, -63, 220, -240, -226, 107, 167, -251, 15, 170, -107, -217, 127, 14, -195, 168, 258, -172, -23, 203, -84, -223, 26, 130, -214, -107, 160, -36, -268, 111, 71, -122, 55, 188, -102, -99, 100, 197, -121, 18, 182, -137, -151, 144, 62, -133, 35, 180, -144, -215, 138, -102, -247, 33, 255, -172, -26, 248, 113, -146, 257, 112]
3278A12j27l2K14j81k73M29k17j96K37J57k36l6K17N7l00L83J6l77J32K49j88
3299D0k11L04L1l34R6L77l00j78K05j17j47K18R5q8j95K94j18j28J67J76k59j10
3321a82L67j02k15JL49k25p3J26j37k0K11j7k17L9L03j09k74K61J21l27J00J56
3343A36j90m5J75j1j73J92O8k17j32L12r7k89L58J2k45l2L84j89n1J52K8p1m2
3366C3K35k24r0J65j27j79J62J76j28j53K25P0l77K96L88l05l86Q24j64l62j51
3387g2l3r3L97j00m27M96n02J73J46p00O53j82P61q97J040r08L36m09L10J55k88
3408a44oO35k90j82j1P5L76m20k11K39J83m85P5O21q85J27M84k49j1M13l82o7
3430a15K25J35o8m58L19J09p4o5J06j60j6J78M8k54r5L36j76J11J25m3k27k13
$$ y = [112, -15, -47, 167, -14, -287, 142, -75, -271, -34, 123, -113, -149, 68, 125, -175, 208, 224, -153, -21, 228, 40, -171, 133, 164, -170, -74, 303, 3, -175, 30, -87, -234, -16, 79, -9, -204, 90, -28, -156, 11, 187, -72, -182, 185, 83, -132, -131, 218, -7, -80, 46, -91, -111, 100, 83, -134, -95, 208, 99, -175, 86, 207, -120, -20, 136, -54, -99, 76, 65, -108, 84, 152, -65, -197, 115, 18, -271, 87, 99, -146, -178, 206, 17, -34, 118, 146, 75, 33, 268, 44, -46, 119, -8, -187, -25, 151, 23, -130, 95, 165, -212, 84, 472, 167, -219, 605, 441, 79, -72, -105, -198, 199, 99, -328, 168, -334, -161, -15, -715, -62, -244, 517, -380, 660, -248, 88, -321, -11, 144, -144, -150, 485, 195, 13, 2, 77, 453, 33, -178, 61, 244, -241, -166, 455, -430, -303, 181, -68, -79, 334, -48, -115, 110, 245, 177, -281, 38, 147, 73, 8, 114, -46, -62, 116, 164, -90, -185, 151, -25, 86, 211, 168, -59, -272]
3452b72K60L24k88K72l41k38K81J25p24O10m7J2l00K21L07k45M2O6Kl91L81K41
3474B98l83o3L61p7k42K53j59n4J03l5k09L3R1J30k11K24M7j97N9J39L3k36M7
3497d8J23pj73K31j1j60J7J29m20K38j53L40m93J98K10j77P4J40m4l59Q78j49
3519C84m34J29Lk20j54M18k2k46K61m5j82j16L04J95n22K03k1j4j15J42R5k3J23
3542A43P1k66J06Q6j7m23N19l61O99j019O97m7m29J012j091N20l4n3M3Ok29J78
3564A11k46J94L1J1k79K11n9j5J42j14l5K7J12o4j60J12O6j55M1M6j1Q9M5O7j72
3589eP3J87k90j01L49k16j17N38l93j22K14k2N6n05P14k59L15l30K04r4n20O02
3611B78r6j09N13n20n32M06J79j50O7K65k95o37O33l6R0K17l38Q1N64q9l85j99
$$ y = [-272, -12, 312, 24, 296, -45, -283, -2, 123, -601, 9, -38, -26, -326, -105, 202, -43, -1, 65, 67, -324, 57, 298, -85, -148, 213, 136, -106, 147, -12, -66, 37, 2, -207, -174, -83, 47, -164, 60, 107, -90, -31, 108, 141, -95, -48, 75, 68, -105, 126, 115, -45, -28, 101, -319, -81, -234, 106, -387, -189, 21, -156, -82, 58, 14, -345, 533, 384, -50, 79, 82, -138, -292, 126, 104, -142, 119, 74, -108, -224, 80, 275, -247, -44, -65, -79, -194, -52, 43, 20, 143, 214, -52, 54, 140, 123, -300, 219, -142, 557, -462, 235, 188, -241, 771, -320, 200, 166, 113, 156, 162, -67, 111, -135, 59, 90, 101, -178, 33, -26, -41, 101, -13, -48, -21, 91, 27, -133, -21, 45, -110, -69, -23, -34, 55, 100, 167, -5, 68, 255, -35, -136, 213, -3, -120, 418, 25, -97, 117, 95, 151, -354, 360, 101, 416, 86, 290, 196, -324, 278, 182, 73, 586, 66, -466, -60, 119, -31, 36, 301, 6, -631, 2, -34, 56, 273, -65, 16, 580, 491, 106, -93]
3633i3l8J095q37n18R1P2n41P85k87M4o0N48m41J54j147J245k45r8K68n02O93
3654A88m45L01O89j182O71l54M9J32Q37j387N61Q0K82j026N76r1j96P43l85K36
3674B79j85k83l27N79o8l49J85J016o29R37j661J041L45j414j0M68p35L86J42
3693b83K81n45J204q62L71K9J81j70o29O01l7K9Rk97j17O53k47J02n74j10N50
3714A39P01j189N85K07n49K4l22O0K77J67m87P53o54j5N8K24l77R31j290P66K89
3735B98o29l45K65J051n38l54j03O82k88m29M6P41o42r73Q97L38j145J655K73
3754H00m91k29p6m42M31K78Kk23M23l72l05L34m3j23J35l1j37J03Nm1n7O4J40
3777A45k25J51l8j19j00J58o1J25j11K09q4j46J67qq7p9J63m0q6K7R8j42Q5J12
$$ y = [-93, -131, 964, 127, -391, -300, -228, -769, 16, -271, -227, -287, 261, -180, -26, -1173, 72, -173, -271, -3, -505, 188, -257, 44, 733, -449, 222, -132, -83, 49, 886, -501, 60, 140, 422, -604, -28, -119, -315, 428, 43, 279, 94, -189, -516, 63, -5, -354, -169, 847, 218, 1155, -506, 535, 880, -534, -544, -76, -811, -425, -283, -2, -547, 657, -205, 166, 195, 376, 206, -423, 178, 141, 170, 179, -118, -235, 418, 171, 273, -301, -411, 139, 840, -349, 236, 443, -106, -82, -404, -344, -67, 100, -387, 366, -288, -303, -245, -21, -398, 533, -757, 9, 298, -331, -676, -411, 640, 102, -252, -355, 327, 39, -390, -344, 397, -245, -1218, -321, 17, -1128, 527, 800, 309, 80, 4, -438, -7, 271, 273, 50, 473, 101, -204, 130, 87, -36, 99, 68, -69, 34, 39, -2, -59, 5, 145, -80, 71, 33, -86, -186, -28, -89, 36, -75, 134, 50, -96, 71, 63, -24, -103, 60, 20, -66, -39, 59, -83, 2, 114]
3801A14j43j4K9J8j15Q1J05j56l9J21J88j87q2J57n8Qj2Jn6J13k6j01N0Q4j45
3826f5M3P9J5p5n9K20r8j33K57o0j49k8O3p7q5K60j02j48J89qp4Q6j20J10j31
3851i0J42l3J30j24J98k02j96J65N3q2P4Q4j80l8R8K3j20J10J24q8n7K2%k2J3
3876DO2j09J37j1j34J3R7J2%r4n2R8m4O2oj75K42j3j96J31j6Qq4M1J02j33J11
3903E3J68k23nJ6N1l9j81K39l7j45J9J04O2k9K2p5j28K67o7m4j23P3J04p3J07
3928A16r7K8q6MM7j8P2r8j47K02J39j73J5M0N5j99J43o1L4j20M6Oj6J32j6j53
3954a05O2L4k3o6P0K1j02J62J19j47o1J02k4nL7j41j2P1P2j27K4Q6j0L2j76J82
3980G5qj32j8J44j88J10P8n1j15L0J95q2q3M2r2n6J16L3j5pJ25j60J5L0Q0l9L3
$$ y = [114, -29, -43, -14, 4, -111, -30, 75, -81, -120, 1, 189, 2, -80, 77, 19, 27, 15, 16, -40, 73, 47, -54, -4, 80, -65, -22, 57, 72, -3, -62, 158, 60, -73, 184, 124, -25, -53, 10, -67, -152, 108, 6, -142, 47, 39, -35, 51, -69, 41, -90, 52, 19, 149, 25, 223, 21, -175, -10, 43, -39, 35, 119, -61, -99, -1, 22, -98, 12, 136, 48, -9, 13, 13, -9, 4, 66, -43, 94, 83, -51, -38, 59, 71, 71, -23, -75, 23, -21, 41, 35, -140, 102, 89, -107, 24, 8, 16, -68, -27, 75, -58, 53, 221, -2, -7, 9, 60, 21, -160, 79, 42, -103, -84, 20, 82, 53, 75, 0, -128, 139, 72, 28, -95, -22, 82, 9, 116, 19, 47, -39, -35, 12, -6, 66, -32, -179, 23, 162, -11, 4, 44, 99, -100, 43, -18, 16, -104, -58, -52, -68, 64, 48, -105, -43, -9, -32, -98, -28, -7, -109, 53, 172, 25, -36, 66, 42, 37, 74, -67, -79, -8, 64, -63, -39, 47, 37, 69, -107, 75, 67, -65, -83, 61, -127, -17, 61, 10, -105, -75, 120, 38, -45, -3, -95, -151, -35, -2, -17, -24, 101, -59, -44, -14, 66, 27, 60]
4007F0n4j38J91N4j33N5m7Qrp3J59r9J1k7K3k2N2l4k8N1m3K7M9RM7Pn6J7m4J8
4037C1p2K6rJ4q3Q2N8l4m8n5J77k23J93l3n5N4k4M8o5K9r3J18N5j33k4R0j26J00
4065bL2j03P7J9O1r5qK9k2j52K26j00J20q2J37j14kP1Lj34M2R8q5J0K6n7Pk7r2
4094a17LJ92n7j13QJ27O2j24kJ11p3L8n1m3RL6L0r2Q5r1M4o8O7L8n3L2j5L0N8
4123G1j13O1j32J61j68L2O6J53j28m9k3k2J4O9J8l0L3K5K6j37l7M0L3R6j28N8
4149a1K5K7j25K5j09K14j13O8p0J38p5qP1j24Q8p2J3j52K15pK6o8j03J93nj95
4175a34J87l3j65N8J77j84P6M1l7N3l5q3J12O1j07J2j7P1n6NM0lj6j52K12k5j75
4202a17J51o1K5O7j52J64p5K3m8j7Q1j6K0j38J34N9r2l7M9r1k2J44n1r5N6Qr0
$$ y = [60, 6, -132, 59, 113, -20, 35, -12, -4, -13, -86, 73, -26, -15, -42, -19, -41, 11, -23, -51, 0, -43, -16, 33, 42, 89, 96, 40, 57, 13, 31, -41, -15, -24, -10, -93, -11, 47, 13, -35, -90, 87, -136, 57, 24, -31, 23, -1, 47, -18, 11, -82, 36, 91, -42, -66, 24, -102, -2, 30, -73, 4, 23, 84, -11, -19, 10, -12, -164, 62, -38, 82, 0, 137, 23, 21, 92, 95, -39, 3, 101, 16, 26, 52, -5, 2, -25, -117, -114, 78, 21, -92, -84, 43, 105, -19, -21, 90, 17, 55, 4, -39, -30, 6, 36, -56, 29, -62, -18, -86, -19, 19, -34, -2, -17, 13, 71, -42, 19, -113, 48, -120, -88, -22, 131, 3, -46, -69, -91, -77, -8, 10, -20, 13, 38, 64, -73, -110, -70, -37, 59, -69, -11, 14, 41, -84, -59, -168, 46, -67, 1, -69, 69, -6, -14, 57, -67, 21, -51, -38, -190, 25, 18, 44, -24, -127, 66, 61, -134, 53, 20, -145, -87, 90, -94, -18, 23, -14, 39, 4, -79, 33, 94, -13, -1, -18, 53, -3, 2, 42, 39, 23, -129, 83, 58, -117, 34, -27, -2, 65, -87, 77, 2, 25, -23, -40, 41, 25, 45, -93, 41, 100, 8, -29, 20, -71, -93, 51, 0, -95, -39, -31, -121]
4229a21J17Q3j53J22q1J59r9J6k2Kk5r7K7N6J5R8j6Q2m69P91M54o56l68K08K7
4254A50q16J131m91k6l7M73k88j61J33j29j26J51J56M1k42J01k22K71r8K5j25
4275a29K09m6n6J02k6n0k9o3L2N5m8j1l7N3J04j15l9O4j4j24L8K13q3j05J56m
4301D7j29J9O8j1K4J3Q2j73R2J8j20l1J68k00Q1J41l8o8j77J68j8N7n3O5K7j5
4327C7J0p9J34k4j15J12j74K85k37l4R1J6m3j3j9J9M3J1K8lN8n6j4K1O8p3q8J
4355c8r1J79k50M69n04J85J60L4M4K8m11j3K37K44m55J56k3M44k31K65p14J77
4377a08j25M4L60p44O19P8L4M28o88n43J33K98m01r8Q78j085M17J06J86P87l97
4398A79n27N66J34J1k45M43p42j02k66N26k82l98R87l85J54pp21Q48l15N05m81
$$ y = [-121, -4, 79, -74, 48, -33, 126, 27, 43, 21, 23, -2, -99, -72, -16, -1, 97, 81, 163, -306, 485, 939, 283, -85, 123, 150, -666, 465, -26, -52, -89, 384, 96, -65, 68, -61, -187, -36, 120, 161, -81, 20, -202, 69, -29, -4, -129, 80, 34, -22, 80, 54, 4, -25, -88, -56, -1, -49, -60, -97, -44, 60, -55, -94, -30, -44, -168, -130, 83, 0, -105, 51, 47, -82, -63, 5, -6, 18, 31, 113, -60, 32, 50, -70, -101, 67, -133, -52, 89, 51, -17, -194, -26, -44, 13, -40, 25, 52, 37, 47, -32, 102, 78, -37, 75, -99, 186, -51, -85, 6, 22, -21, -34, -53, -34, 9, 20, 48, 45, 103, 47, 33, 54, 122, 49, -39, -38, -129, 50, -200, 269, -235, -50, 110, 144, 188, 216, -195, -208, 29, 273, -182, -26, -49, 395, 164, 429, -285, -108, -233, -189, 171, -573, 46, 124, 158, 586, -102, -645, -512, -214, -615, -713, 165, -920, -503, -397, -211, 576, 179, -348, 218, 352, 363, 118, 561, -181, -283, -549, -23, -305, -703, 284, -101, 53, 46, -675, 173, -142, 363, -118]
4419a18O38q21L55L11Q8m40p9k27J07L07m09K72k36J41Q6j44O6j32L76l26J73
4440a2j92K22o6J24q0LO8o7p5k2J8R5nJ05j49R0j53Q9K7m5N7lj3p9J56l7j57J6
4468h5P8n3PJ0J06l3l3J5J02j27j40J73K9l7R4j35P7P1p7j52J91Lj41Q6q3J06
4494E2j33R7J1K4k2p5N5r7K00j08l9P3K3P6j88K1M6o2J29O8q7k3j27J16pl2O5
4521E6l5nl9K4P9j21J08p2k2J23j26M6k7k4J12p5q5K2N5R9k71J42J03LPJ3n0q0
4549d0o3J52o7P4l9m8l2M5n8O5r5L5J80j48M8n2J21J0o3J9j67P0pR7k1J48k37
4576g3L33j27q7j26M7J64k78K59K18K9R0j15n15K32L26m18J18K47l42J57l96P97
4598E40n67J88Qk1j63o01R31m51M00m25K43k94L61k62r3L68J41l41l13L78K00
$$ y = [-118, 520, -301, 54, 365, 453, 13, -66, -293, -186, 121, -288, -16, -252, -111, -25, -169, -103, -235, 141, -185, -12, -204, 18, -48, 76, -4, -1, 67, 0, -75, -97, -79, 16, 11, 116, -33, 57, -96, -7, 20, -25, 32, 29, 16, -63, 93, 56, -101, -85, -7, -60, -53, -43, 63, 30, -3, 12, 114, -13, -153, 20, 49, 12, 106, -29, 48, 119, 42, -110, 81, 84, -57, 29, -54, 52, -81, 16, 27, 51, 29, -46, 9, -88, 112, 4, -35, 38, 61, 137, -51, -30, 16, -46, 83, 151, 64, 41, -86, 30, 23, -9, 56, 21, 16, -23, 1, 80, -41, 67, -5, -27, 96, -30, 16, -11, -35, 77, 2, -83, -61, -6, 93, -178, -36, 67, 70, 77, 90, 40, -40, -103, 49, -18, 56, 17, -31, -63, -18, -76, -11, -106, -71, 109, -39, 9, -43, 78, 88, 25, 44, -123, -53, -60, 37, 16, 164, -73, 260, 133, 46, -80, -33, 131, -147, 112, 330, 359, 449, 334, -181, 51, 377, -41, 77, 324, -18, 139, -257, 540, -27, 161, 169, 148, -15, -616, 315, -136, 264, -161, 82, -212, 149, -113, -206, 162, 303, -38, -351, 27, 227]
4619B27R0j76m73N88J27o40M80qo01L38K48q5n2Oj32J36q0j3o8R2l5P5Ml4q8J64
4645I0j06j40J08L0K7p7J28rj0Lq3J00q2L6k5P9L0j21p7J00N1j4N1j54l8K1j6
4672i8L14j51j41J19k3J21P2l75q7Q5J30R9k07J88k03O5l62J10J30j9R36n28o09
4695d34P20p1j90m41N63j92L10n21K93Q8L50Rk64n86J94K8K87l22J35L26k27L71
4717D26n92Q6K56L80k92m94L40k05J05L54p32Q56o89L08JJ28l44K64L8m68m46
4738g20J207o30N07k88J24k9P0l20l69P10j74l49K14k78M93j09Q1J65m34m77M79
4759a27M60l10J72l02M68k18l11K04M6j22J39O9j6k51n4K23k57M21qj60Pl42O88
4782D19l18k52k38O83j41m97J37L27k07N46o00N0K35m2P2m18J3K25L7K1L04m79
$$ y = [227, 317, 141, -332, 256, 383, -257, 223, 215, -386, -48, 200, 115, 63, 69, -63, 73, -7, -20, -88, 4, -31, 44, 48, 14, -74, 90, -16, -156, -48, -18, 9, -68, 60, 51, 41, 44, -39, 61, -21, 15, -10, 69, 99, -22, -99, 1, 52, 38, 89, -65, -103, -82, -98, 216, 65, -76, 43, 20, 141, 213, -162, -249, -164, -34, 65, -142, 46, -157, -92, -454, -344, -214, -233, 703, 175, -434, 286, 215, 25, -416, 147, -45, 265, -256, 37, 125, 475, 484, 220, -366, -172, -144, 143, -179, -44, 282, 55, 426, -166, -80, 176, 556, 264, -230, 110, -95, 10, 364, -368, 488, -201, 107, 108, 236, -108, 156, 194, -274, -720, 487, -143, 364, 76, 200, 171, 241, -79, -448, 262, 88, -261, -47, -325, 168, 59, 140, 305, -129, -606, -127, 333, 23, 195, -107, 361, 143, -168, 36, 82, -40, 99, 168, 152, -99, -153, 70, -187, 234, 226, 66, 73, -269, 419, 101, -151, -389, 294, 153, -344, -207, 120, -87, 459, -141, -91, 144, 102, 174, -244, -231, -6, 31, 52, 356, -123]
4804a23J07J6l25N48n97N9P08K59o95J35j97K12j16LL37m12R6K90l87K10K4m39
4826b87M17k83J71J96p36K12L62l13M39q0L92m88j42L35J48n97K62K33P1K75K18
4847H05j069O90o03N28k26l76l80R16k76K47q0K3L23o36J55j85K71m12Q29j126
4867e82P75k3J1J42m3j134J73P19j12P29j245M84m95L34M71k1K32m50R07q10J96
4888B58p0m69j65O37J80n96j58O34l80L05J21J78n51j25RK87q62J229j42n29L25
4909A16MK44n34K49k65M95l70L00K4m53M60k84k08J28K88j98P5K95j236O19Q22
4930E71p13N32n58k39N32M67n15l3K69l43K0L94l30K01o24L20Q6J25R0n41K36
4951e3J95m17k63M43J31M9k7j69J68m7j56J54j17L39k03L8k02J71j23K30J14k51
$$ y = [-123, -16, 0, -325, 223, -374, -315, 393, 652, -43, 92, -105, 107, -9, -6, 331, -81, 15, 305, -82, 128, 152, -287, 130, -153, 18, 214, -522, -310, 52, -261, 178, 98, 490, 2, -140, 195, 343, -254, 8, 241, 312, 587, 805, -264, 426, -177, 351, 125, -251, -631, 285, 9, 256, 176, 199, 522, -114, 41, -144, 127, -285, 544, -582, 193, 170, 181, 323, 280, -854, -681, 38, -74, 655, -590, -106, -601, -267, 204, 183, 415, -35, 872, 62, 258, 188, -281, -446, 191, 371, -225, -383, 251, -129, 176, 297, 475, -76, -201, -192, 95, -767, 462, 320, -209, 116, 120, 364, -170, 79, -186, 309, -61, 239, 263, -190, 270, -14, -222, -94, 194, -4, 71, 366, -870, -251, 571, -142, 390, -168, -407, 125, 592, 77, 44, 313, -30, -10, 384, 54, 255, -369, -49, 37, 162, 252, -289, -53, 142, -275, -538, -95, 36, 85, 58, -111, 57, 10, -146, 8, -109, 230, 27, 65, -137, 34, -89, 141, 255, 4]
4973DO3p8O7j41N8JJ34k18J68j36J30j90J27j3J2K5RnP4J2j13p6J67q5J2NQ7r2
5001HJ3l1l9l8k6N0K7L3p0l5P3J9NO8m9M4l1j03P8L4Nj3qMm6K6R0m3N7j22j68
5032a88J42Q3j16K3P1m7pRL9k9O9R4j92O2JK3k1j17P9R2o4k0p4K7J13k9kq4P1
5061Hj1Q1m5o3p2J79n9K1j03N2n9RqJ45j9q2j02J10L1n4M6q4j2O2Q3q4J06p4k6
5090b4m5K4m6J39j23J50j12Q4k7m1R1k19K59k04R5k9mOK0K6p8m3L7J2l6j7J71
5117F6k08K39L3l14J5L53k33m5J30l2Q4p6m5Q2j41J36Q0j05kk3l2R5Np2k1N8l9
5144a2o5J09o8J5J19j23J78r9n41N37J12N71p16k73L10j06R8j83J1P04k47o2m77
5167b08L22K69o47o3O09j2k59J05Q13j166J70J42O54q19J82J25m42L49L9m77J02
$$ y = [4, 67, -11, 56, -85, -27, -26, 108, -110, 58, -78, 52, -138, -11, -24, -12, 13, 22, 17, 91, 103, -10, -86, 81, -4, 8, 13, 100, 8, 21, -10, -49, -87, -113, -63, -36, -3, -73, -108, -35, -16, -11, 57, 8, 52, 21, -82, -4, 30, 35, 22, 14, 18, -28, -2, 88, 45, 102, -20, -188, -46, 37, -79, -56, 15, -32, -39, -30, 9, -20, 49, 143, -49, 13, 14, 37, 16, -101, -22, 70, 6, -14, -88, -61, 52, 23, 21, -63, 8, -3, 78, 33, -30, -102, 77, 18, 39, -64, -12, -71, -62, -70, 75, 56, -26, -128, -18, 13, -41, 5, -79, -91, -29, 54, -30, 76, 2, -24, -69, -45, -91, 48, -75, 75, -37, 47, 20, -21, 70, -149, 110, -94, 1, -28, -32, -26, -6, 20, -58, -101, -64, -52, -88, -105, 66, -142, 97, 130, -184, -169, 184, -49, -94, 36, 4, 88, 12, -33, 49, -92, 44, 124, 19, 17, -6, -38, 57, 62, -10, -31, 27, -12, -77, 32, -36, -21, 98, -25, 153, 54, -487, 50, 162, 733, 17, -256, 54, -52, 46, -137, -126, 578, 331, 269, -208, 114, 383, -264, -327, 282, 270, 11, 116, 929, -237, -67, 75, 729, -90, 92, 217, -225, 124, 163, -314, -212]
5188b12J10K04Lp4m1q7K52j41M1j39J32l0J17j50O7j15Q8K9K0l4j3q3J23nMj32
5214f6Q1j9m2m6J13%K4j0m9L2N4r8l8J91k26O0K7Rl1J37p3q2J38j08j10O4Q8k4
5242dR0j8j20M1m3J49J3j05n4j02J17N1M0k6r5j7J22j41Q2J07p3j8M4m9K8j06
5268h7l5R9N3o3K4n5K9R4o4Q0q3Q1o4K9J06j41p2P3K8k4o6O7L4o6ml3K09k32J5
5297f8J15m5L2j26M7N1n0K0N9j05L2J21n5j0l3K9rM1j01k3O9q8Q7O5p3M1JPLq8
5327e4k0J22j77K00j04N3j25J33m8j20J34p1M2k4K1l9OL1J29j62K2M2P3p4K9l6
5353a7q9J7J12n1K9j6lJ4K5q4P9M3Rm0j8r3J44j34L7O0lJ6q4J9pO5On0QO3pn7
5385gm0n5R0qo1LJ83k11J18qO1p5p2J26o7J3L0Oj16J61j2J1j41P7j02kj8J6L2
$$ y = [-212, -102, 102, 105, 31, -10, -97, 155, 14, 55, -84, 48, 18, 135, -15, 52, -63, 25, 54, 74, 40, 27, -56, 67, 62, 66, -66, 15, -4, -46, -92, 21, 21, 45, 35, -14, 18, 72, -26, -64, 127, -99, -39, -12, -3, -34, 103, 30, -52, 86, -22, -132, -68, 20, -4, 86, 68, -52, -11, -54, 95, 108, 3, -51, -153, -36, 15, 55, 29, -66, -83, 39, -102, -20, 87, 14, -4, 40, -9, 19, -87, -122, -23, 30, -33, -9, -64, -35, 59, -5, 75, -8, 73, 9, 38, 144, 3, -69, 4, 32, 8, -58, 9, 43, -23, -27, -60, 149, -83, -68, 47, 2, 34, -92, -45, 6, -44, -24, 35, -70, -38, 83, 28, 18, -15, 14, 5, 46, -55, -78, -9, -97, -10, 55, -18, 23, 24, 31, 34, -54, -74, 48, -129, 71, -33, 20, -105, 28, -20, -140, -6, -77, -35, -59, -38, -77, -71, -40, 89, -73, -51, -9, 64, -10, 19, -17, -106, -89, 23, -28, 1, -15, -18, -4, 21, -63, 16, 59, 68, 28, 10, -83, 61, -73, -36, 24, 21, 37, -47, -28, -35, 30, 36, -14, -6, 57, 50, -7, -47, -102, -12, -20, -81, -78, 105, -106, 12, 4, 65, -10, -82, 44, -23, -10, 20, 26, -90, 71, 59, 70, -71, 6, -96, -98, -116, -100, -68]
5414f8K53j00j3o7M2KOK4J08j53M6k18J98m0J50k03L0J06j50O8l6n3N3j0J22n4
5440D3o0KK2k8K8n9J23N5j65KR4j14J54m7l3n9J36o0M7l1r6J27n1L4j01l2j7P5
5468a1q8J18R0n7j64J10J3M8K3k31K51j08o4l2J19K8n5M1Kk3o2P9j5l2j6N0k4
5495a0j9J9O1o6j9qJ0J1j8M7K9l7RkJ4j3j01J94r1m0P4j3Kq5J56j09L4q6N4J3
5525A0K9n7N5M7k16J34J2m6L4N9J0r3l1O9k9jNj5J5j8R1J4j0k9L7p3J7l2J50j69
5555c1n9J05r2M8J9o5O3n0R9j08OJ55p4j5o0ONL5q3J09n1Q8r5L1O5o2j7kj5R8
5585E3Kk45J71J8l2J0K7l6J19r7m1J3Q1j2k7r8Q7k3m1L0R8j49J47p2N3j8j15J35
5613C8oq1J7J34p3k0%j5j10J01Pj13J21k8K8oJ5Oj3jN5Jj02pJ73j74L8O0m8l0
$$ y = [-68, 185, 85, 72, 5, 47, 49, 55, 79, 187, 34, 80, -138, 60, 20, 170, -33, -3, 103, -47, 21, -15, -68, -15, -25, 97, 43, -17, -15, 7, -21, 7, -52, 71, 126, -39, -37, 57, -57, 97, 50, 17, -42, 94, 34, 81, 50, -46, 81, 30, 64, -37, -69, -86, -11, -99, 19, 109, 52, -112, -2, 11, 59, 82, -149, 102, -6, -70, -102, 17, 45, -10, 31, 33, 10, -52, 27, 12, -20, -36, 14, -10, -29, -10, 51, -15, -34, -42, -32, -21, -39, 8, 37, 0, 9, 7, 21, 8, -93, 101, 10, -30, 44, 31, 33, -52, 104, -5, 29, -57, -3, 10, 39, -18, 37, 84, -132, 2, 14, -32, 2, 61, 71, -22, -53, 16, -13, -14, -9, -24, -9, -27, 64, 78, 68, 39, 76, 3, 20, -12, 138, -31, -90, 15, -77, -29, -10, -75, -12, -62, 37, -71, -65, 90, 16, 1, -59, -53, -48, -13, -96, 13, -38, 50, -45, -14, 51, -11, -28, -30, -45, 53, 55, -190, -19, -1, -33, -23, 4, -32, 87, -10, -51, -38, 43, 31, 4, -94, -7, -30, -71, -41, 57, -92, 55, -17, 36, 18, -97, 38, 32, -49, -32, 102, 29, 9, 9, -6, -116, -15, -8, -121, 0, -28, 0, -6, 9, 15, 2, 1, 56, 57, -45, -52, 121, -53, -15, 45, -3, -33]
5643c3J54j81o1J3J69j26Q7k1R6o7j4o5J1n2J28k7Kq1K3O3qnm9J40j25N5o5OL9
5672FpK0n1jJ2j4L4m0M8OJ37j34L4j9K4r5P6q7RJ3J2P5j7o0J7j09P2J30n6K9p1
5703gm3J44j08Mq5J72j10j7J11m5R3n0Jo2J00n6nq2J7kN9j76K29o2j29J11P4n9
5731A7j7J53k06M5l2p8J35n9M8r6J27j38K01m9j48J69J6r6L4nM1M7q6L4N0m9r5
5758c7R1m9p3j1K6O0p4J0O0j3M1Pk4M1k8j80K21o8m2L2q9R7L4Op0JL8k3L5N5r6
5789b2K1m5lJ01Rl5m3mP4m5l3R8po6q7J58o8M9k9qO6o5j06J09L5o8R9q6n1k0k9
5820a01J08jk1J3m1Q5M9K6j88P1Q5o7l3O7L4j15q0N4N0l0Q6m2j0RKn5Q6j91J02
5849d8J08k10K03m1o7P1p8O0l8n8J04m6jpQ9j58J64j15N6r7O0J6Q6Jk0o5J03P0
$$ y = [-33, 121, -60, -121, -108, 61, -65, 22, 1, 97, 30, 16, -49, -38, -90, 38, 11, 13, -68, -45, 18, 10, 5, -44, 96, -29, 26, -39, -33, 6, -1, 19, -32, -33, -21, -35, -1, -41, 7, 13, 150, 16, 50, 31, 55, -40, 36, -51, -42, -29, -17, 58, 41, -19, -2, -111, -39, 91, 35, 64, -7, -50, 94, -14, -10, -95, 77, -33, -50, 61, 16, 109, 59, 60, -2, 98, 42, 37, -45, -28, -30, 29, -147, 82, 20, -109, 2, 76, 17, 0, 153, -53, -8, -40, -118, 17, -42, 6, -90, 37, -101, 100, 51, -97, 72, 88, -8, 26, 21, 62, 109, 23, 57, 107, 58, -37, 54, 5, -68, -79, -53, 7, -67, -57, 3, -10, 31, 38, 14, 55, 27, -153, 68, 0, -42, -10, -99, -2, 32, 38, -32, -31, 7, -16, 19, 74, -22, -1, -46, -49, 52, 61, 26, -17, -21, 53, 8, -25, 73, 66, 0, -87, 71, 3, 52, 23, 15, 81, 16, -90, 19, 54, -14, 85, -1, -52, -72, -101, 7, 6, -15, -2, -43, 42, 91, 117, -71, 0, 85, 18, -15, 52, 86, -29, -109, -55, -5, -35, 51, 9, -1, 8, 10, -45, 41, -150, -48, 60, -150, 53, 12, -55, 16, -62, -2, -40, -98, 6, -40, -41, -48, 41, -117, 47, -68, -12, -109, -49, -33, 53, 54, 34, -31, 72, 142]
5877A42n2jj74N0LM8j70J58j7KL0l0J29j13k6l3J8l5P7l3L3O6j77J31n3K3qn7
5905f9J09lpp3P4k2l9J4l8J07N1j80J57j08j09J14o7j4R0J3Q3q3j8P9j51O9O2
5932D1r9L9K3Q1j27j3J7Q7J8m6j19J17q4p2R8P3k7k1p3J38j18QR5q0j5O2nN5l8
5961A5K7o9m4Q7Nj5l3l5R3m8J4m9O7M3MpO5L2k56O8n8J25O3p7o9J31j42K9Q9j37
5991h2M2M8k9K7J07r7m9P8L2L8j34M8l6K9m3P2R3j91J11j9n1KK2No2n7J42n3K
6020ep3R8n1N1q2N7k5L6M9j62N6NJ16q4j3N2j08R4k4K3k5L5KO0n2o1P2l7q3N7
6050b2j11J03J66p5r8J2L9o1J2j10K05j04J56r3N2m7j08J09m9NK4J02j32M3r7
6075g9R0j48J09M0q2k5J06o1P7m8k6%J5p5L3J98j07k5J59j64j6P4j2Po4l9O4L
$$ y = [142, 90, 89, -85, -35, -32, 16, -154, 4, -13, -11, 19, -11, 118, 5, -21, -54, -36, -71, 6, -27, 6, 72, -105, 26, -27, -4, -12, -69, 40, 37, 30, -43, 31, 9, -30, -16, -54, 53, 104, -76, 81, -27, -136, -22, -89, -103, -13, 0, 83, 0, -18, 61, -90, -21, 41, -58, -19, 4, 85, -42, -55, -38, 49, 67, 21, -98, 19, -65, -137, -39, 34, 7, -14, -87, 51, -67, -59, 36, -44, -59, 3, -2, 53, 15, 42, -27, -71, 16, 21, 6, -27, -62, 31, -17, -3, -52, 15, 58, 62, 55, 120, 152, -104, -36, -94, 31, 94, 17, -52, 79, -63, -34, 55, -82, -40, 8, -21, 6, 113, 16, -33, 45, 77, 115, -19, 29, -7, 22, -21, 51, 144, -47, 64, 45, -6, -4, 18, 23, -39, -96, 46, -7, -5, -78, 20, -31, 20, -62, -5, -30, 6, 55, -107, -51, -46, 70, -14, -27, 25, -83, 11, -13, 10, -15, 20, 22, 82, 30, -31, 41, 4, -79, -22, -133, -30, 136, 61, -37, -25, 14, -47, -35, -145, 60, -44, 112, 19, 71, 24, -84, 25, -24, -19, 5, 107, -25, 18, -79, 11, -137, -28, 12, -70, -95, 11, -50, 27, -21, -47, -47, -32, -107, -74, 124, 17, -8, 151, -13, -29, 45, 33, 40, -24, -63, 1, 4]
6103DK3o9J06j30O0Rj45N7L4Q4M2k59K00q5P1j1LJ9n9O5j39K08r2j73J90L9lL2
6131H1q8P6j19J57j65O2K1o1n3J01J8n9J0q3J08p4J00j1J05j20p3Q8j39K0R6o0
6157f2O6kK9j49R6J6m7mP9j1o0OQ9r2J69j29K4lo4K4l0R7m1l3j21J02K3mR2q7
6187b7J14j23J56J0j91J5m0J00J8L8q0O0o3P6n9J9p7M4k4m0J06o3j2nR3r6J22
6214G1r2n0J05Rm0j1n1L6K4q1R4j39K05j3p6m3R1n5j3k4N5m9P1J8j8kk8R0j71
6243h7K5P3J3Q1n3p7j0J05r5Q5L8j89J77k5p1N5n2K0pl7J1P7p2NK8l6ll3j30J49
6273c5l9KJ2Q3K9k0L0k4O1j59P2j6Q7o6l4%L1n8n5J45p4J18j44O5lm7l5P4J1m3
6303c2Q9l7k2mPn9N5j12J81q6p2J90n2j00J7LM5P2j07q0l3J79j44Q5M8o4R1j17
$$ y = [4, 27, -42, 64, -66, -6, 3, -142, -85, -51, 33, 75, -184, 16, -69, 2, -9, -6, 13, -46, 19, -120, 88, -4, -177, 13, 52, 49, 81, -7, 69, -50, 107, -58, 4, 25, -36, -89, 12, 30, -29, -19, -102, 6, -68, 32, 21, 126, 6, -67, 21, -118, -98, -2, -62, 4, 2, 31, -118, -22, -6, -53, -57, 22, 11, -49, -43, 46, -46, 123, -6, 18, 15, -49, -25, -55, 42, 1, -32, -153, -51, -28, -32, 60, -27, 87, -36, 120, 130, -61, -46, -86, 14, 32, 70, -10, 50, -13, 63, 4, 23, -54, -10, -34, -74, 32, -31, -43, -48, 45, -51, 71, -21, -71, 34, 43, 3, -8, -59, -23, 1, -80, 14, -125, 80, 67, -9, -52, 39, -16, -29, -53, 2, -47, 24, 42, 24, 22, -6, 84, -87, -62, 11, 24, 105, 52, -25, -35, 70, -25, 60, 98, -91, 86, 61, -10, 45, -7, 13, 6, -31, -20, 57, -15, -10, 18, -18, -21, -54, -184, -35, -74, -72, -60, 23, 52, 32, 62, 38, 99, -60, 12, -4, 83, 17, -17, -17, 14, -44, -99, 46, -28, 90, -54, 11, 8, -39, -74, 0, 11, -32, 57, 20, -2, -6, 1, -58, -3, -115, 66, -20, -92, 98, 46, -54, -37, -34, 11, 83, -24, -104, -137, 42, -102, -17, 31, -33, 58, -59]
6331e9R3r3M1O3L5r1M2lJ11q8m2m3Q1p5n4J18qq7Ko0N5p1K46m3l6j06P3mj3k9
6361d5J26l3n9J9k3j03J29L8p2M4j12J27j5j3P5r1N9o9j4J22q9O5j10J58j32L9
6387B1JJom5J51j70M5R9q5j34J78o3J9j02J20l3n0P1r2N4L7p5M3L0l0L8j28J27
6415B2j05Q7m3J48j23M7k7Oq0J31n0r5R5L3l5LQ1j73K5J47r5l3N8kJ2n8Q4o0p
6444gM1Mk9J25r2Rk7%jm2o8R0q5J46Ql7j05N2o2J64Pj42M8kP6Nj11J02m4r6J24
6475E1O4j27Q3l9rrn7J35P1k32O6k5P2Qn3O7q7n8J19J9n0mk0k2J05j80J24K6O8
6504A06j08J1N2p0j1O3r9P3k4l0J8J06j17R7p4L4n5O4n0P7Ll9p9O7pN7o5P6p4
6533Bm1J27l4n6O3L6j05M5o9l6Pj4P9j0N1L4j99J64p3Q9L1j18j8K2RLJ24j86J12
$$ y = [-59, 34, -59, -18, 45, 80, -11, 31, 28, 139, 51, 9, -34, 47, -28, -82, 36, 28, -59, -57, -117, -62, -133, 113, 70, 34, -72, 1, -3, -16, -45, 81, 48, -11, 8, -15, -118, 11, 49, -23, 21, -91, 36, 21, 8, 83, -8, 51, -18, -32, 90, 1, 66, -44, 114, -18, 21, 22, 23, 17, -28, 123, -47, -2, 97, 12, -122, 56, -7, 12, -90, 30, -3, -53, 18, -74, -20, 17, -58, -15, 15, -15, 23, -105, 22, -83, 4, -39, 109, -14, 33, 6, 12, -68, 63, 13, -82, 13, 46, 11, 14, 95, -78, -53, 94, -1, -34, 24, 22, 34, -24, 60, 0, -7, 34, 38, 9, 134, 42, 51, 24, 24, 23, -19, -87, 3, -82, 64, 72, 35, -70, -18, -80, 84, 91, -51, -3, -5, 71, 76, -35, 67, 23, -73, 51, 115, -12, 71, 32, 23, 14, -43, 92, 163, -69, -3, -28, 44, 52, -1, 66, -21, -79, 40, 59, 9, 5, -15, -37, 68, -112, 12, 38, 106, -2, 9, 61, -9, -20, 43, -56, 17, -7, -37, -19, 87, -30, 67, -7, 27, -28, 36, -14, 63, 66, 27, -52, 15, 8, 65, 0, 76, 2, -39, 88, 54, -2, 61, 97, -8, 37, -32, -68, -61, -75, 4, -6, 45, 79, -120, 44, -29, 60, 91, -27, -45, -23, -14, -11, 113, -73, 39]
6562C9k0j16J4M4j3J34o7L9ko5m6MO0M8o2ml9P2O5j37J63j87M9q5Q9L0J11j49
6590c1Pr4P0J60j84J12r3J54nq2o8J05pj29L0L6J1%k4jK8k8M3kj8PJ15j90J41
6619F3j0j6l1m4J31m7p4o0Q6j4N9r8p9J51L7l1k8O7lk3l7Rr5R2L6J1ml7q2p9J49
6650aP9j75L2M3Q8N4j61L8K4J6J4j57M3pn9Q1m2R9J09p1l5J3j6K7j8k6m4J46K8
6679A22r2m0nR5j53m25K69J34j20M05o18L66L75o36K19J68p2o5J71k01J04n6L1
6702b4l5L9J47j42L8m2R4p1nm2N9j08L6QN3J0o7R4N9p5K9j8o8O3n9R6j9l2mlL9
6733E0o8k8Q3q1J2M1q0QQ5n6K9j8M2j70J48J19j27%L4l3k7J46j09J23k7p3j04
6760h1J36j43R5L3ln9M9L2l8l6j7L4O6m0Jl8r5P2Q7j26K17j81N2l8J9J12j63j05
$$ y = [39, 19, -97, -83, -39, -52, 82, 15, 54, 52, -13, -59, -55, 5, 53, -9, -13, -52, 20, 85, -52, 111, -76, -27, -112, -23, 7, 118, -31, -24, -118, -48, 112, -72, 40, -53, 101, 96, 14, -54, 51, 44, -85, -55, -19, -8, -8, -32, -33, -5, -33, 10, 8, -10, -3, 112, -78, 63, 53, 37, 6, -38, 93, 46, -28, -88, -2, -16, 43, -55, -134, 17, 54, 23, -5, 62, 59, 36, -1, 8, -87, 5, 41, 52, 48, 11, -71, -150, -1, 78, -97, -65, -22, 66, 120, -41, -3, 21, 37, 51, -106, -63, -70, -129, -48, -90, 9, 118, 47, 12, 25, 9, 36, 18, -8, -52, 94, 122, 30, -10, -15, 80, -73, -498, -229, -95, -215, 190, -428, -62, 313, -323, -104, 64, -8, -73, 98, -103, 1, -55, -24, -59, -20, 127, -15, 23, -19, 75, 4, -1, -43, 16, -92, -56, -48, 5, 15, -52, 42, 101, 26, 55, 37, -31, 32, -27, 69, 50, 18, 14, 11, 50, -18, -46, 37, -44, -32, 9, -71, -63, 22, -34, -5, -23, 19, -151, -3, 116, -11, -11, 23, -10, -37, 109, 0, 123, 96, 23, -81, 55, -88, 7, 40, 37, -22, 27, 59, 21, -15, -32, 2, 68, 28, 29, -9, -104, -32, 55, -71, 146, -35, 17, -21, -2, 110, -53, -158]
6788a58J86l4k2J45j6o8J4nQ6p5J9j14j0L9K2M9l0l0K4Q6j06N5m1o5R2l1J9k3
6816Hj34R9j4M2lK5n9N6j05J2J12K0m7m6M6n7R5L4l7k19J47j01Q1j4J3P3qL1M5
6845I5j59J1N9J3K5q1O9j2nM1Q2q2%j00R7O0l6j97L2J51m0Q0k05n1J17J37j52
6872e1J4K5o4J24o8n0J24j15J43j33L1N5q2N2J5n4J4J20n3K6r3K4L0j8M1n5k0
6899a8J4M3M0l9n3J4J2j53J47q3M2K5k4L1Pl0P6l7j24J11P5p0P3M2q0l5j6M2L2
6928F4o5N7l5j04M4Q7m1r2K0J41j36J4Q3l2j61J69r3N5P1M3r0j3jK4K5n0m9R0
6956B5k1o4L5P9r9N7N9j38J13m8K1O4j32n6O1NR7p6R0N5j22l7M4q8L7MM6j0J0
6985A1rJ72j48m9K8l6j5O0M3n9k9K9O8m9lp3J29o9K0m8o2M6K7J8m3j6J36o7M6
$$ y = [-158, 28, -6, -28, 117, 101, 33, 47, 42, 128, 53, 72, -42, -52, -13, 9, 58, 28, -2, 22, 108, 2, 57, 16, -49, 43, 12, 31, 8, -126, -27, -41, 1, -2, 23, -36, 20, -85, -73, 39, 59, 12, -34, 12, -45, 50, 84, 47, -172, -25, -126, -45, -59, -46, 27, 19, 50, 95, -64, -53, 6, 19, 44, -37, 32, 20, 15, 56, 138, 56, 56, -44, 53, 113, 77, -120, -88, 63, 23, 103, -102, -153, -36, 101, -51, -37, -12, -76, 48, -20, -70, 54, -61, 82, -51, -20, 35, -47, 5, 20, -34, -20, 100, 47, 73, -20, 4, 34, 16, 57, 2, -18, -4, 39, 79, 40, -13, 1, 13, -140, 7, -76, -34, -9, -33, -2, 5, -25, 51, 14, -110, 1, 76, 6, 79, 121, 41, 6, -10, 32, 64, -1, 56, 21, -83, -39, 48, 7, -85, -65, 76, -60, -46, 37, 5, -156, 13, -80, -25, 46, 89, -1, -14, -15, 9, 34, -16, -65, 25, 4, -60, -25, 54, -45, 12, 71, -67, 46, -2, 19, 83, -49, -105, -44, -39, 58, -18, 72, 127, 5, -32, 12, -76, -39, -35, 11, 1, 11, 2, 174, 26, -23, 5, -31, -46, 14, 57, -2, -31, -2, 66, 17, 14, -59, 70, 1, 21, -27, -89, -43, -16, 2, -41, -57, 79, 12, 58]
7014E8Rj37Q5NO6q2op8K6M0O8q4J4n5J07j48R7L4j06J24k5J2mo7J11l6N7q4k9
7043b8L4j14J03k2LM6o4J03M8j9j30J55J0mn4j2L8m0l6q1K11l0k4j06J00j69J13
7070C1n9m0qR1j53J64M3j4r4J33l0r2J42j02j5L8n0N8p9J9R9m4q2j6P8o9N2pK4
7099A8o6R3J1L2j62P0q4J12L6j09k6m0L0P4J56j42k5k9K2J42j16Oj9j3M9Rl4j
7127fj52K15j02K8O5j13l1J23M4n5k8M5j22J81p5l1N8j08J97j91J18q8J24j68
7151g2M8K2n0Q9Nl4J18J2k78M5J14o4L4J22l4j64R4J0Q8j29j05J78N5r1l3P7j87
7178a30p0J61j7nP4R7j18m0J64q1M6o3j0k1m5J0Q9j63P2OJ56p8q3P3N5q1m9p6
7206a27J40Jl4P4l4K2K9j36ON1Q8j50o0J58o2M5o3L4Q2j07P8J7M9q4q0n3J31k
$$ y = [58, 67, -70, 15, 20, 86, 4, -2, -80, -54, -14, 54, -30, -16, -71, 36, -112, -15, 19, -87, 37, 12, 24, 20, -47, 64, 28, 85, 1, -28, 6, -108, -5, -27, -24, 22, -42, 61, 109, 90, -40, 115, 125, 121, 67, 55, 93, 53, 17, -64, 147, 117, 93, -13, 87, -82, 31, -28, -68, -76, 15, -138, 26, 69, 55, -39, 94, 64, -28, 114, 12, -3, 35, -15, 43, -36, -17, 82, 38, -44, -60, 18, -51, 1, -6, 18, -48, 45, 56, 88, -74, -4, -88, 24, 60, -49, -75, -115, -85, -11, 145, 3, -22, -51, -29, 113, -3, 3, -16, -29, 20, 29, -5, -6, -158, 57, -45, -17, 48, -65, -96, 27, 71, 16, -12, 33, -89, 92, 17, -14, 44, -64, 133, -58, 60, -28, 96, -72, -24, -2, -52, 37, 42, 8, 126, 138, -140, -95, 19, -45, -11, 111, 77, -87, 7, 17, 105, -24, -129, 49, 104, 13, -20, 57, -130, -200, -39, -56, -61, 13, 110, -8, -48, 116, 35, 81, 18, 8, -13, -58, -48, 41, -122, -50, -44, 112, 34, -49, 24, 79, -2, -51, -127, 13, 14, -20, 54, 20, 42, 71, -65, -59, -8, 80, -70, -130, 28, -34, 11, -52, -18, 64, -43, 35, 52, 101, 17, -63, -116, 15, 13]
7234A3%p6N4j0N8p9J34m2n3k7O3j2Jl7m5O4Ml5RL9j17R6l6J15j2m2r1J16o4r3
7264a05J32J2m5M5n2l8M8K0j12R0Nn3j0N6J5K9j6n8J8O0j00nM7nl3K8J19l4j1
7293D7j54q1J41R8j31P1J2K9m7J20j20J6J02j35J46j13P9k12O2R8o2o5k5Q4L1
7318ij16J51J33k21Q6J00j54K8L4l6O5j16L3nK05n2r3P7j59n3P0J21m9m7j3P0
7344E0k5kn0N9K7k2p3N3j1M7O6j49P9l4j17J22o0O1J13j20j2K7P4r5j11O8J66
7371A31j09N8j23J16j67R3Q9j13l4L9J5qJ4m5M9Q2o9j4O1k9o2N3j3J12k8Jm2p7
7399b0k6P0KP2o6j1j7N6kK2q8kj12K21j25j2K0M2k09K20l79L44L51k66k31KK89
7426A45mk65Q5J42q9R4r0O0j69J54L4j33j47J18J22O6o7m8p%J7l7J3l8L9k6K7
$$ y = [13, 13, -63, -9, -19, 39, -40, 94, 52, -1, -28, 35, 23, 24, -13, -58, 6, 10, -25, -16, 23, -94, 2, -34, 81, 69, 27, -64, 52, -12, -105, 27, 39, -6, 39, -13, -51, -3, 17, -95, -5, 0, -53, -63, -7, 8, 37, 21, -37, -19, 41, -59, -64, -17, -22, -55, -27, 92, 58, 47, -107, -188, -47, 51, -80, -9, 3, 32, -15, 105, -15, 1, 103, -32, 114, 1, 80, -132, -70, 28, -34, -99, -124, -40, -9, -125, 26, 159, -62, 24, 124, -30, -2, 32, -4, 61, -55, -22, -27, 178, 126, 33, 110, -49, -102, -32, 89, 40, -7, -20, 50, 25, 23, -27, 32, 59, 37, -36, 17, 6, 53, 119, -30, 49, 15, -102, 20, -40, 21, 134, 14, 2, 29, 103, 8, -103, -35, 131, 22, 80, -43, 73, -94, -1, 88, -25, -59, -20, -5, -13, 1, -44, 5, 87, 18, 4, 65, 36, -26, 27, 14, 126, 98, 99, 57, -20, -46, 24, 26, 98, 32, 21, 4, 60, 58, 80, -8, -10, -122, 99, -26, -38, -18, 24, -185, 35, -344, 0, 351, 85, -146, -144, 145, 141, -124, -39, 103, 14, 108, 18, 78, -91, 63, 97, -36, -183, -65, 57, 123, 56, 8, 1, 1, 18, -19, -6, -44, -5, -31, -4]
7453do6k6M0J20m6j6L1Qo6l1J7N5j05J70l6m3l0J12j44j69J85J26N9j14K9kp8
7480b4Rl3J04j25K5o8j86M61n3K25l57P9l0p2j98N0K41R0j40n4M8k45L99m02J28
7505a28J73o3K7r8K79j72j1l0N0l7j4r7R3j61K69n2k8k7l4K9Q4j12l1J89n5k4
7531A9j35J38m7L7mlm5N2l3J6K9j5l0Q5M9j14R4o8qJ23o7j18L9M1j70J02N5j15
7559i3M0m6J38l4M9m9l0k5Q1rr1k5N9n3nJ3J46j22m2Q5P5j57J19l0j14J24N5Q1
7587A40j39J04r1J3l0l8J17o2k3O8r5O2M2j71J14N4q2P9r9j09K84m3J3k6Q6l85
7613b17R2j20J14J97j33M6m24M32M1m2k9M86o38L36j16j15J51M6j4l70K17k21
7635b81M49k65K69k22J00l8O5J68j86j91J30K2j9j4n8J39mj95M9l2J48q1J10n7
$$ y = [-4, -70, -96, -56, 64, 18, 2, 33, 41, -25, -56, -39, 16, -89, 81, 45, 2, -28, 84, -60, -229, -44, 82, 141, 27, 56, 54, -24, -15, -48, 56, -69, -44, -112, -298, 163, 110, 335, -22, 57, 27, -45, -243, -193, 48, 138, -2, -56, -8, -253, 146, -256, -128, 45, -18, 9, -89, 190, 18, 7, -23, 27, -10, -24, -121, -28, -189, 80, 28, 0, -27, -61, -32, 52, -60, -91, 98, 43, 19, -116, 22, -25, 12, 8, 5, -40, 12, -21, -5, 24, 9, -21, 64, 113, -1, 93, 25, 17, 140, 73, -45, -6, 35, -135, -33, 22, -93, -53, -99, 39, 5, 54, 5, -25, -50, 31, 22, -69, -94, -35, -88, -93, -80, 66, -56, -98, -13, 62, -95, 24, -6, -120, 4, 59, 140, 1, 105, 14, 27, -3, -41, 76, 14, -9, 59, -36, 26, 68, -103, 11, 65, -17, 62, -37, -146, 138, 95, 108, 82, 168, -217, -125, -245, -131, 66, -67, -21, -445, -13, 28, -14, -43, 443, -195, 141, 25, -90, 61, 107, 93, -277, -60, -281, 168, -97, 172, -50, 50, 12, 77, 245, 59, -132, -2, 20, 1, -13, -71, 68, 64, -131, -82, -114, 34, -47, 63, 6]
7659FM8j47R8N3Mj33J34o6lm0o6J33j3n2K8J56j42J9J9q6J17J4l7j5j9k4O6n4
7687bj09k1M5O5k2j8P7k3q7J29o1L4J7np9J04n4R7O9j68J7p6J2L5l2o0M8R0Qk
7717B8m8O6l9Qj23Q5j6O5%M6p0O3o2l7Q0M7N5j29R9j78L4l1O5q4Q4n4K0O2r9M0
7747b3J00j42R1p4n1j9J27J6M4j08L2NJ5m1p0Q0J31k6j39M5p6J7J37k7K2r5n1
7774h0N2O8MJ3j67N7K33j18j58M3J65m7P4j72Q6q9N3n0R8O1j58M1j14J34r7R3
7800B5j37k28M06j30j39K74k58K33k67K14j46J31J46j76N4M0L7q5K20l18Q4qL6
7823Hj87J50j1l3J64j71J96l4j47J5Q2L1j88K10j50K05k47Q9j80L43J53r96J267
7846E69p34K26m67K86n5K98n58K49K99O0m02j44L2O6M38l10O28o08l86j07O75
$$ y = [6, 54, -93, 5, 58, 62, -71, 63, -3, -6, -46, -112, 21, 8, -44, -16, 140, -2, 17, 36, -50, 67, 81, 44, 29, 10, -14, 52, -2, -111, -132, -87, -22, -44, -62, 15, -8, -95, 34, -27, 7, 24, 19, -60, 44, -10, 87, 156, -12, 5, -71, -59, -24, -56, -116, -68, 22, 30, 28, -20, 46, 7, 15, -108, -23, -39, 26, 26, 72, 2, 65, 3, -34, 46, 93, 148, 19, 118, -60, -26, -57, 8, -76, 8, -46, -26, 36, -63, -23, 77, -65, 26, -48, -99, -118, 9, 25, 69, -39, -7, -2, 13, -28, -98, -18, 113, 87, -52, -7, -83, -66, 71, 44, 66, -29, -80, -28, 40, 44, 57, -110, -53, 180, 62, -96, -53, 112, 65, 139, -33, 53, -36, 17, -33, 65, 126, -32, 9, -105, 29, -68, 25, -112, -340, 66, -64, -203, 71, -187, 46, -221, -7, -153, -22, 124, -52, 2, 42, 79, -6, 214, -104, -20, -28, 8, -179, -29, -40, -73, 91, -80, 116, 82, -65, -50, 32, 63, -125, 85, -65, 140, -107, -18, -198, 145, 298, -698, 569, -165, 61, -406, -120, -175, 123, -435, -186, 113, 173, -229, -373, -341, -275, 163, -147, 481, -127, -513, -620, 55]
7867E5m2j71j31J14k1N9O55o63q65J015N05m92j9j95J20R3pj31J39k4j13Q0oJ45
7891A00M4j50J9kJ1mll3M5Kl4J5M5r0P7q3P2j71L53n62Q00n74R1k86Q35r45n95
7918a023J097K11n30N71j54k14K19j40J47r9J69p95M32j21L13k92J76o5L91n26
7938b33J44L25J99k88k08M78l71j54k18M75N5K04m74K66m02k61p4K10M48J00o06
7959c85K51N3J56K3n01Q04q93M49n64J059l14m40k90M77J71M28p27N33j95n31
7979d36J42K77l05K46K10q3m1J27r3Jo7O5m29L43j29J38J30m1m1L46n59N9j57
8002b97J48K86l34k2j03j57M61j49k50K71J33k01j84P94o81K66j15M47j56n89
8022d32M4P45r13J058n46J11J27p54J86J71O9n80R96JN68j251J052l94o31l2j49
$$ y = [55, 13, -158, -289, -175, -196, -137, 518, -145, -1010, 5, 510, 18, -1, -196, -76, 17, 10, -121, 18, -6, -119, -39, -45, 100, 144, -6, 13, 11, 22, 18, 15, -18, 27, 29, -5, 10, 55, -35, 42, -41, 31, -140, 213, -349, 451, -123, -32, -318, 517, -428, -1023, 74, 285, -245, 326, 172, -42, 177, 37, 184, 85, 254, -541, -109, -230, 83, -209, -33, -98, 293, -233, -89, 236, 435, 147, -61, 417, 46, -108, -326, 149, 204, 408, -66, 200, -202, -463, -537, -327, 121, 221, -385, -134, -81, 75, 98, -403, 401, -492, -43, -607, 452, 138, -302, -592, -115, 56, 484, -243, 290, 95, -436, -294, -17, -322, -76, 134, 51, 10, 137, 44, 45, -22, 43, -386, -43, -172, -34, 96, 55, 14, 360, -199, -140, -297, -149, 137, -197, -219, -322, -479, -18, -167, -417, -146, -13, -214, -398, 396, -285, -19, -134, 313, 157, -432, -388, 357, -556, 502, -44, 67, 194, -560, -374, -203, -134, -714, 282, 283, 851, -400, 652, 258, -373, -405, -554]
8043e54P63j57k64P04o90L42o68N91J69l63K44j54n6m77J113m55q38J091j023
8062f82K37O18n13N70j66qr0J89j94J92j07Oo1K8j80J14J29j83O4M8oR8j86L9
8086d4LJ33j22j87K10o2K57j72k60M09N1k73m9j77L11m4jm8m1k5L24l34J06M8
8110A3j50J21K33m65j65O39l43P1k36M06K52k07L29j219J47P03l67K20o08O32
8130FN4pq14J82R76j141J29Q80M46q31k83l56j76N82j40K61L22q3L39j10n88L1
8152c21L21L25j61P6k32O80r68l97L61J15l7QJ74J2o8L65n81K25L90k73J57o87
8174e16N63oj21l1J76j77J48J55k12j79J71j33N24q0l10k18n8
$$ y = [-554, 209, 52, -212, 492, -198, 144, -524, 67, 236, -127, 117, -37, -93, -570, 543, 88, -750, 341, -682, -445, 173, -340, 230, 64, 56, -34, 155, -39, 153, 46, 52, -9, 19, -161, -47, 82, -101, -37, 11, 5, 103, -83, -44, -41, 92, -30, -217, -7, -69, 188, 16, -244, 165, 216, -57, -106, -283, 28, -16, -17, -65, -106, -131, 193, -141, -35, 13, -137, -16, 217, -248, -413, 226, -117, -46, -282, 124, 376, 169, 498, -721, -574, 129, -238, -18, -626, 6, 60, 53, -761, -579, 397, -744, -615, 265, 711, -120, -403, -759, -935, -353, -493, -232, 90, 7, 346, 236, -352, -321, 0, 325, 164, 240, 8, 688, -280, -677, -316, -201, -238, -230, -56, -44, -112, 253, -328, -103, 287, 14, 171, -516, 47, 41, -80, -111, 65, -112, 36, 191, -21, -200, -29, -162, 362, 282, -28, -246, -304]
8191c04
$$ Imaginary data points
##PAGE= N=2
##DATA TABLE= (X++(I..I)), XYDATA
0@%%%%%%%%%%%Qj6J6j6K0k8L2m0M8n6P2q8J04j20J36j60J89k16K48k85L25l69
33a96M18m72N32n99O72p52Q40r35J039j154J279j415J565j728J906k100K312k548
51a336K808l095L413l770M169m621N141n740O444p284Q304r576J1214j3413J6534
66I192k1345K9801m8914J68353j1518l26637J58919J60915p7421q1234P5958n3574
78a7505j1514Q2992N132q5908j41L3211n01K9647J7994q6922j2108Q9645J8149
91F2171q8477k350O1655k3761l1517N4662Q21q2744K3497R7573n9563q1599Q3202
104A3570M4869j03096K547J07978m6609q9097P5873N1359q5649j7139P3675n649
116B2632l8415P630n498J0627L9464m6655o4151P7727O9437r6035n1073J01776
$$ y = [0, 0, 0, 0, 0, 0, 0, 0, 0, 0, 0, 0, 8, -8, 8, -8, 12, -16, 16, -24, 24, -32, 40, -48, 56, -64, 72, -88, 101, -115, 133, -152, 173, -196, 222, -250, 282, -317, 355, -397, 443, -492, 547, -607, 672, -743, 822, -906, 1000, -1100, 1212, -1336, 1472, -1623, 1790, -1980, 2189, -2432, 2709, -3031, 3413, -3871, 4433, -5143, 6071, -7342, 9192, -12153, 17648, -31266, 137087, 125569, -201068, -42149, 118766, 41345, -39889, 36069, -17505, -29019, 53973, 59105, -26803, -26944, 6267, 5766, 35413, 53407, -33515, -45623, 44022, 62171, -26306, -28656, 32999, 9238, -22279, 32383, 33204, -49540, -26043, 71530, 11967, -69632, 13570, 58439, -44657, -42110, 65868, 19259, -69838, 6035, 57394, -28255, -45394, 28281, 22632, -15783, -8153, -13651, -3024, 36440, -10215, -74366, 3361, 72798, -23237, -74310, 27466]
128B7466J8816r8994J1604Q8029l4687o6587N0496M5055n1760k4014L9530j549
140C405k3061K5846N410m0994J0547M4099k3793l4405K9318J2429k3405J4839
152B35J2274l2633O511L5272k9653j8673N4469q762p0494L7856P3167n9103n6996
165e6530O7030K5760o2861Q202N0280l6220l4671N1548K5030m5132j9122K3649
177c037J5377P507j0756l6073R349N6224q716o2558J0387N2472j9119l3201L2496
190A0352J3546m4121N514M4602k1734l1222L3624P958l7489K0657L4306m1606
202e613k5622N0667J0642m4989M627K7696j6936m597K0573j7844j6478L0947L543
215A6616l4079J2825K4212k6999n908L9024j4367m3933L2536M1505m5672l2162
$$ y = [27466, 46282, -52712, -41108, 46921, 12234, -54353, -3857, 41198, -10562, -34576, 4954, 3405, -19656, 6190, 11600, -29394, -18847, 25252, 1459, -32946, -3628, 8801, -14604, 235, 12509, -20124, -13613, 21659, -7994, -26667, 27802, 19040, -51454, -13598, 59569, 466, -56530, 10500, 36260, -26601, -18399, 31881, -4339, -39010, 12538, 37568, -7564, -26686, -3037, 12340, 19847, 9091, -26982, -17633, 38591, 29875, -32683, -22296, 30176, 11057, -22144, 10352, 23898, -20223, -14709, 29893, 8159, -23063, 10561, 18519, -18970, 1687, 35993, -5613, -31235, 19432, 30074, -14915, -10288, 17408, 472, -4125, 16448, -1396, -17874, 13073, 16616, -17463, -4638, 19574, -7425, -13333, 25691, 11324, -32609, -73, 41432, -4240, -36402]
227c6402M9839J9500m5949n425L2177r176j3897J6702o704j8626K2105J4219l0946
240a2583j762L1176j3864k3164K8724J0560l7082N322L4247j9614k2445K8578
252H093L946l1482J5107K4638l0890j1748L9443n885l9128K2784L1201l4635j7770
265b6326L9497L541l3434P977K1136j3876l237J3244j5667p943K9811j704l6841
278b3822J3390L2616k5427j9790L3650K407l6059J5408L4281k9665k2653L5410
290I746J0303l2569L636K1952j5994m620K2299j4961k1239K8492J4538l6827l443
303a8687L6638q595k8211J7380J5611k0105J412J6007j6828m741K8370q793l2143
316b2685K2529K7499l2661j6873L6052K055l4035J2477K4328k3713j0630K8114
$$ y = [-36402, 13437, 32937, -13012, -18437, 13740, 4564, -9333, 7369, 665, -17961, 4144, 18363, -12583, -14345, 16831, 2967, -20197, 8527, 19087, -17995, -12673, 21574, 1960, -20485, 8093, 12039, -19443, -4336, 20302, -10588, -22336, 17107, 11222, -27906, -5122, 26079, -8556, -26326, 13171, 16712, -16722, -8745, 12391, -1485, -4722, 8522, -7145, -15088, 14723, 13019, -23822, -10432, 22184, -3243, -23033, 10617, 13024, -23035, -7627, 26654, -3011, -25664, 9746, 20049, -12520, -8884, 13068, -2926, -7546, 14753, -208, -21447, 7045, 21583, -15244, -18687, 17951, 9356, -18855, -1475, 14136, -5969, -4557, 11450, -5378, -10119, 18251, 9458, -22685, -156, 27343, -5318, -22191, 13861, 15916, -18119, -5642, 18686, -5027, -15657, 12457]
328A2457l364k4340J4446J4416j8899P28J7451j4855j0521K7190l31l4103J2271
341g454L2834k3345k5213K8185J2069k6768J354J8210j3070n616K1138q111k2354
354a8141K1587J7317l0307o159L2982p037k7846J8095J6545k4347l579K3542r805
367B847j8064J8405P447k1534N725J6762j7998n353K6825q285k8693K1546K5807
380B5437k9775j7908L1761P249k7522L602J6996j2857l556J6386j1323j4688K2706
393F508O860k8557L876K8750j4280k1773K2277J1409k5086K582K2455j5431j3954
406a4364K1831K519k1625Q641J3747j6993k692K0880j0442k1820K4358J6491l1433
419a0902p858L2712k534k5022J0839J4370j4386l96J2883j2699o409K0385k949
$$ y = [12457, 9093, -15247, -801, 13615, -5284, -4556, 12895, -1960, -12481, 14709, 14378, -19725, -7454, 25380, 2035, -23178, 5007, 17076, -9692, -8338, 9872, -3198, -8814, 12324, 4213, -18141, 3446, 20763, -9544, -15703, 17279, 10242, -17604, 491, 17036, -7311, -10890, 12652, 2847, -15217, 3188, 10635, -10899, -5174, 11588, -6410, -11763, 15062, 6777, -21916, -370, 25437, -4338, -22246, 9515, 16764, -10758, -7156, 9840, -3017, -6573, 9813, -1510, -16198, 6508, 13368, -15189, -11313, 17437, 3157, -18616, 3661, 15070, -10016, -7434, 15021, -410, -14364, 7467, 9986, -11639, -2998, 10749, -6244, -8936, 11944, 1502, -20318, 4040, 20531, -10902, -18760, 13952, 11418, -13604, -2765, 11605, -2781, -3177, 9706, -2993, -9402, 10983, 8034]
432H034k4775J2411K3779k1941j6957K6158N286k4547P677J9070j6829r897K1339
445H808j36j9394J0050J2230j6208m34J7952j3327j5511K4126P511l0028K022
458a2339K9108j1146k3176J6602J3633j6771j879J2139q198k079J5582j0283j7281
471a6088K1751J5514k8731j0550K8097K069k3373O755J4938j4003m407J7349o563
484B758j6741J3511J0759j4301J161J2853j3387p647K2626m40k8341R481K8688
497B0980j5734k2241J7578R645j7091J581J1438r331j391J3335r470j2648J8378
510E029Q400k3308m46K4466p177k0093J3486J1686j6947k905J6103n092j1669
523h467Q927L271j0467O659Q736j4951l254J9551m817k0070J3846J7517j8696
$$ y = [8034, -16741, -4330, 19449, -2492, -19449, 6709, 11995, -12552, -4875, 14195, -2634, -12531, 8808, 8672, -10722, -672, 11558, -4650, -5084, 12868, -459, -15970, 8156, 15667, -14361, -12339, 16769, 5623, -17553, -951, 12682, -4089, -5968, 6171, -2027, -4106, 11476, 1193, -16088, 5663, 21177, -7554, -18104, 9993, 12062, -11311, -4556, 10382, -3621, -8028, 9321, 2758, -13983, -472, 10287, -4014, -2853, 10000, -3387, -11034, 11592, 11152, -17189, -7708, 20980, 5246, -16995, 583, 10228, -6863, -5282, 6156, -3175, -4566, 8769, -701, -13349, 5029, 13429, -9879, -10325, 14141, 6964, -13129, 357, 12043, -4904, -7809, 8294, 3202, -8467, 460, 3731, -6736, -77, 8659, -6292, -9546, 10005, 5188, -14882, -1036, 16481, -2215]
536b215j0328K1127K305k0701K625J4023m638k406M493j0175k639J8746k916k4213
550a6912Q296K4482j0745j7273J3564O224j4554L405J2484r233n747J2413j656
563D748j1049O823M366j0931L197J1802j0482r169J5789L854j8768J039J8980
576A0199m627j4596P022Q587o200o67L419p112J619J2990q151j6470J3373J4595
590A3981j7033q671J8480N4j7533P041J1960j0989k548J2268n054p692J0122k31
604D155j2487Q316J0601j3930m146J7830l860k0109Q707J6250j2161r191J3326
617C301L023j0332K181L527o643M135J0069r801r261J5643N946j9845r31J9254
631A0266m980j5063R937P441j2628N36J0623q327o063J4222j69j5216P419J1082
$$ y = [-2215, -12543, 8584, 10889, -9812, -7187, 6836, 2198, -208, 4285, -5890, -8529, 10217, 7301, -16912, -8616, 15866, 5121, -12152, 1412, 7636, -6918, -3513, 8971, -262, -6009, 6404, 4748, -6301, 522, 4888, -6043, -2846, 8956, -1526, -10695, 5094, 8948, -9820, -8781, 10199, 5572, -9024, -2002, 6585, 385, -282, 3137, -3975, -2356, 10634, 2483, -13987, -614, 13981, -3052, -11723, 6757, 6811, -10722, -3681, 8279, -2710, -5258, 7010, 1956, -5736, 4386, 4155, -8332, -16, 10585, -3345, -7491, 10339, 6479, -13630, -4923, 11327, -834, -10025, 3301, 6324, -4008, -1827, 1700, -4943, -808, 9261, -540, -9801, 5842, 11788, -8057, -8988, 10266, 5286, -9777, 160, 7601, -5027, -4491, 6132, -2195, -8258, 5964, 5795, -9421, -2002, 9080]
645I080j3328j639J7858q003j8262J5405J4123j9647q407J9460K399j4311K321
658b951M730o842M580Q191j2177n309J7873J084j9090L411J6498q330j0361J3104
672D411M498j4418J821J1202r018o193J3194n41j3271P145Q956j3098k116J5958
686H530o161j4509J4527J0546j9075l603J9316l219j4685P899P058r130J699N957
700E150j0209j235J5369m795j7202J0226J4732j4070r690J6114L931j3831K111
713c399R864p007m200R960j356j0056O693O985j0946j507J1421o003r860J2367
727B956N276j5741M67J5844o146j2255J0043O658r252M9O554p236q71J2563o661
742B248j3587J2728R158j4246n952J5061r9j3049N284P830p750j757Q783l498
$$ y = [9080, -4248, -5887, 11971, 3968, -14294, 1111, 15234, -4413, -12820, 6640, 9039, -5272, -2951, 1779, -5063, -483, 7708, -4469, -9778, 8095, 9179, -9911, -6500, 9998, 1668, -8693, 4411, 8909, -5509, -3688, 7514, -1504, -7697, 5497, 4956, -8315, -1170, 7786, -5312, -7428, 8530, 2369, -12140, 2387, 12933, -6142, -9745, 9571, 6352, -8333, -434, 6624, -2506, -807, 5150, -5059, -6294, 9075, 4280, -12922, -2696, 12036, -2034, -11724, 4390, 8321, -5510, -3399, 6465, -542, -4742, 5218, 3862, -6194, 499, 7484, -3462, -4969, 6452, 449, -9411, 2956, 8232, -7509, -7042, 8802, 2656, -9599, 444, 7102, -2150, -2101, 4453, -2783, -3654, 8909, 2248, -11339, 1389, 10547, -3699, -9651, 5410, 5311, -7738, -2454, 5376, -2374, -4131, 4652, 1154]
756A154o744P803K642q482K287P799p961m216J1596n24j3467M033J3876r906r635
771i745J1526M851j0089RN781m529J209O521o681p457J3243M999j6147J08J4551
786H150l212j1859O709M722p040J45O564p074k820Q957k20q355M372N922p278
801b317k083J0809l269j0547P922Q017j1127l796J0859K163j1337J789O583m331
815f65r82M308o057k383J0499K03j3200L767J4078q230r262R630N021r231P30
830a774O256n749k597Q225k515p875O472M375r238L68R547n018p877R426M797
845F823j1286r45J2070k422r486M548M905m612L01K798n814oR106l870j1103P567
861a426J0209j0276p209J1179K758r282K211O018n502j047P039l425n846O809
$$ y = [1154, -5590, 2213, 4855, -3627, -1340, 6459, -1502, -5718, 5878, 5354, -8113, -4080, 9796, -110, -9745, 1781, 6632, -3457, -3448, 2333, -2196, -987, 5534, -1147, -8604, 4639, 9638, -6509, -6401, 8150, 4938, -6921, -212, 4510, -2530, -2385, 4179, -2895, -5715, 3242, 3022, -5333, -961, 4961, -2317, -4400, 6409, 3140, -7407, 515, 8532, -2595, -6391, 4468, 6631, -4706, -2917, 3666, -665, -1647, 2661, -3396, -5779, 4720, 4923, -8277, -4510, 9568, 1338, -7924, 1706, 6727, -2504, -1774, 4482, -1267, -3864, 4361, 1846, -6029, 443, 4818, -4420, -4052, 5495, 477, -7400, 2026, 6823, -4463, -5408, 6662, 4240, -5246, -698, 4207, -405, -104, 2694, -3120, -3126, 5980, 2110, -8993, -1426, 8783, -1493, -8702, 2477, 5235, -4047, -1836, 4182, -1320, -2367, 4672, 1247, -4599, 2210]
875B210K513q602J506Q200o297o233R569J966j1204K517J0419n913p193P035L652
890D145n520R89K799m590J304O955o007p089R791N216j2389k458J1730j109r247
905e480L570N166m903n83N283l881l312P252O37q203L775P085p484l808R354p81
921C687r952N055Q427q132n981Q455K225o905J604L087m353K329N592p103m000
936e965J0847J596j2171J735J1253m352q954N886M793o276o18M479l801j474O141
951C119k340o473N931N417q010k151Q769j797p787O320N854r205k632R770q00
966C985q308K743M062l890J076L539o109k073R578r67j1359M549J1300o527q199
981f600Q072L769p560M42N438l884j490N115k809n155O043K532q202P98Q410m632
$$ y = [2210, 4723, -3879, -2373, 5827, -470, -6703, 2866, 4832, -6372, -3855, 6564, 651, -6542, 493, 4145, -1375, -386, 2413, -2177, -873, 6082, 75, -7014, 2777, 7993, -4396, -6854, 4876, 3767, -5480, -1910, 3256, -1647, -2230, 3053, -828, -4140, 3112, 3749, -4454, -679, 6406, -1078, -4886, 4468, 3687, -6265, -1210, 7217, -915, -6896, 1559, 3784, -3121, -1517, 1570, -2783, -454, 5138, -1965, -5965, 4882, 6478, -5693, -3958, 7295, 2943, -6011, -125, 4668, -1608, -2226, 2253, -1548, -3022, 3119, 779, -5694, 237, 5654, -2356, -4507, 4262, 2465, -5322, 998, 6852, -2353, -4985, 4785, 3985, -4323, -1580, 2482, -1408, -332, 3207, -2902, -4975, 4603, 3636, -7723, -3174, 8126, 1599, -6600, 1472, 5241, -2319, -1877, 3561, -323, -1813, 3302, 493, -4662, 1381, 3913, -4289, -3491, 4919, 287]
997B87o617P990L686r225l19R583k381p428M066M173m471L8L315m068r65O692
1013D356l305q372O380Q181q716n514R397K438q631Q47N949l629p24N397l272
1028G82m412O170J012p940K406P255n157m844P286J352r226J177Q666l560o152
1043e185N701L389n582J05L395k444j01M511l152n083O643L915r746k220J0561
1058D707o21r302L075N482m751r39M765k872k747N874L20p302K460O953n081l548
1074c527P340j52q361K884O384m991m165O171J761n296J37K557k572N69L982l346
1090f25k865P053J163r251O07Q985k042p411M262N158n387k587M209j467k533
1105b731M453k29n545L408M717n828k454P059j26o321L531M790o049k074O738
$$ y = [287, -6330, 1660, 5346, -3879, -4198, 5385, 3004, -4424, -358, 3815, -656, -618, 2697, -1371, -2336, 4356, 1051, -7321, -941, 7240, -1476, -6990, 2407, 4845, -3786, -2939, 3010, -619, -1343, 4054, 782, -3630, 2540, 3552, -4388, -1982, 5273, 116, -4728, 2558, 3910, -5316, -4139, 4527, 967, -5185, 516, 3905, -1677, -1572, 1823, -621, -722, 3789, 637, -4446, 2197, 6112, -3634, -5854, 4707, 4086, -5216, -2141, 3341, -1410, -2349, 2416, -456, -3203, 2671, 2991, -4311, -1851, 5102, 21, -3527, 3813, 3661, -4700, -1816, 4568, -423, -4588, 1583, 3344, -1952, -1815, 742, -1830, -1261, 2721, -625, -3490, 3563, 4726, -4525, -3918, 5067, 3025, -4386, -124, 5034, -353, -2940, 1269, -198, -2731, 1722, 1493, -4052, -644, 4073, -1755, -4209, 2850, 2724, -3597, -66, 4724, -1325, -3399, 3339]
1120C339o45n779K940K808m080nL124l371j045N863q30p396K557P419m274n753
1136e128N603M252m837j717L219j155j238K496r47k790L177K339n679j125N840
1151B310j551n289M826L985o256j084O313j763m939L604L120l684kK559l143q57
1167a851M813j872n801M438N058o079l503N911J733m668j30L063q65m33J588j953
1183e51j337M390L71n651J367N245l374m332M828K167n452j52N077k167m203L668
1199a06K382l576M86K552k368Q3L303k730l551N450K561o719j172O791j040o074
1215c728K341L492k894k26K129k375p98M358r07m901L328M315m373k913N320Q88
1231C056n492J201M340l047k824L662O58l548J030J976k226M48K861l183k261
$$ y = [3339, 2694, -3085, -145, 2663, -1417, -1422, 1702, -1669, -2714, 3149, 2319, -5077, -2520, 4899, 625, -5128, 475, 4727, -110, -1827, 1392, 237, -1001, 1495, 548, -2242, 935, 3274, -2405, -3530, 2310, 759, -4530, 296, 4281, -1975, -3059, 3254, 1491, -3448, 156, 3276, -408, -410, 2149, -994, -1851, 2962, 1090, -4711, -273, 4785, -1294, -4797, 1114, 2847, -1821, -1951, 1112, 247, -186, 1402, -551, -1888, 2502, 2873, -2778, -1411, 3834, 460, -3872, 956, 3123, -2329, -2481, 2596, 429, -3774, -106, 2276, -1300, -814, 1738, -630, -547, 2756, 26, -3525, 1925, 4486, -2233, -3405, 3386, 2346, -3728, -1387, 2105, -789, -1015, 1114, -1261, -2059, 2299, 1392, -3509, -181, 4134, -239, -3152, 2168, 3056, -2436, -1235, 3105, 58, -2766, 896, 1554, -1994, -964, 1012, -1214, -766, 2095, -1088, -3349]
1246c349N696J258p121J116P311k968o042L924L741l989r74K847k127q86L514
1261A951j746m051L900L377n351j426N984p36m944K780L584l878j292M281p59
1276A674l582J849K079l191K85K768l056j603M890j03o389K563O289l928n101
1291d556N059L404m884r08L806j436j355K794j480l061L943J508n416j07N697
1306C008k109m874L717L307m608r52M780j187l657K859J340k625R68K580k837
1321b90p81L685j659m508L134M513n038l553N788J820n524L18L797j529j094K193
1337A272j313j731L673P72n197R88N438k977m807M578K494n281k56M701k110l243
1353b999L442J337l569R11K648k338o14L591j550l693M007K680n469j437N919
$$ y = [-3349, 2347, 3605, -3516, -2400, 4911, 1943, -4099, -175, 3566, -423, -1397, 1450, -677, -1563, 1951, 205, -3846, 54, 3431, -1920, -3346, 2638, 1902, -3042, -262, 3322, -556, -1848, 2433, 1674, -1908, -59, 2020, -1171, -886, 1882, -1174, -2777, 2113, 2010, -4379, -1816, 4473, 545, -4556, 503, 3907, -977, -1885, 1921, 485, -870, 1924, 444, -2617, 1326, 2834, -2582, -2689, 3008, 899, -3975, -258, 3049, -1559, -2511, 2269, 1082, -2575, 284, 1624, -1001, -33, 2547, -290, -1071, 2614, 955, -3553, -419, 4094, -944, -4497, 1291, 3111, -2413, -2095, 1702, 173, -921, 1272, -41, -1772, 1901, 2673, -2524, -1536, 3902, 925, -3882, 696, 3190, -2091, -2347, 2354, 244, -2999, 443, 1780, -1789, -878, 1770, -568, -1182, 2409, 859, -2834, 1173, 3853, -1616, -3053, 2866]
1368B866l43n461J244L852k210j595K236r57j295K988qm162K133M511l825l327
1384c353N069J517n137K00M637k344l191L420Q12l469Q71K490k590m61L203j864
1400a90k711M172J563n275P8O260k020m959K535L909l215j903K681q30r93K207
1416A309j246k796K581K854m048j809M739O46m952J395M453k749k281L124Q18
1431B038l249R46J972k136o12K678j362k370L045O22m566Q46N488k697m393L946
1447A96K780l712j064L104k38j591J473k34k348K521J409m163m42M741j164m339
1463c071K279L160k986j939L478M07k720J192J994k086k01J875j354r72K643n25
1479A174l591J909L504l525k974M288J908m566k82L288n51j764J715k97j020K173
$$ y = [2866, 2523, -2938, -1694, 2158, -52, -1647, 589, -368, -1663, 1325, 1317, -2845, -712, 3799, -26, -3353, 1716, 3233, -1904, -1704, 2933, 589, -2602, 818, 1630, -1839, -968, 1522, -1068, -1529, 1674, -190, -2901, 1271, 2834, -2441, -2363, 3897, 1877, -3082, -547, 3362, 147, -1756, 925, 95, -898, 1309, 63, -2733, -152, 2702, -1346, -3155, 1584, 2230, -2722, -1327, 3126, 377, -1904, 1220, 2038, -1211, -265, 1707, -429, -1041, 1637, 275, -2095, 950, 1572, -2994, -2148, 3340, 643, -3750, 196, 2976, -736, -1800, 1304, 1066, -525, 948, 714, -1634, 887, 2296, -1867, -2309, 2432, 1268, -3071, -792, 2368, -618, -2557, 921, 1328, -1392, -200, 1794, -292, -493, 1382, 28, -944, 1699, 1174, -2417, -508, 2996, -529, -3503, 785, 2693, -1873, -2155, 1133, 582, -1182, 533, 236, -784, 1389]
1495A389J14l474J004L911k194l213L001K090l882q40L152p20k151J976Q99k075
1511a013L64J510j633j90K697j010k494K651K096m183j035M365k64m050J224K880
1527A915j811j533J464k20q44K047n93k718K171K934l353j946M150Q71m037L38
1543a165L246j660k021K476J68k404J120J420k645J22K619j653j835L422J069
1558B279m299L81M288j553l777K809K724k693j371K014p33j187K013n77k491K557
1574C84K270m179j573M749M3m355J755L892k748k039L256k62k761J894J548k687
1590h13J58K545k103j935L227N20m138J179M179k811l249L725J974l477k87K872
1606A566r53j450J850n10j934K411J535l929q76M566j149m569K615L550l195j758
$$ y = [1389, 1503, -1971, -967, 2944, 750, -2463, 538, 2628, -1254, -2094, 1058, 338, -1813, 163, 1062, -1013, -649, 861, -772, -962, 1735, 725, -1769, 882, 2978, -1205, -2240, 2125, 1861, -2189, -965, 1915, 104, -1429, 35, -185, -1029, 1018, 425, -2293, -122, 2812, -541, -2487, 1663, 2534, -1503, -1165, 2081, 421, -1600, 876, 1044, -1360, -240, 1180, -1465, -1343, 1276, -377, -2212, 1210, 2279, -2020, -1639, 2649, 1096, -2681, 128, 2852, 159, -1212, 802, 69, -1118, 895, 318, -2173, 384, 2654, -1525, -3098, 1651, 1694, -2661, -906, 2986, 238, -1801, 1455, 1193, -1568, 326, 1874, -813, -655, 1890, -213, -2148, 1079, 1599, -2539, -1360, 2819, 8, -3241, 484, 2458, -1019, -1306, 1566, 613, -837, 1013, 503, -1431, 980, 2515, -1414, -2290, 2276, 1127, -3442, -827, 2723, -472, -2230]
1622b230L303k13k771J677J756k165K06K615j982j834L096O8m099J927L817l279
1638a08k965L978J253m352J24L595j138j722K001k62j819K303J004l477N76L929
1654B920j857l866K875K781l613j276L344l91k779J566J362k289L05K437j704
1669a85j320K807j57l218J858L196l261k048M324L39m644R08L450j740j967K213
1685E55m9j711J466M53k692J113L457k400k766L515J749m080l24L774q52k655
1701a447J826J052k381K93J633j545q38K434n09k693K087K219l246q84M059m22
1717A638l800J521L203k272j814K412J71j783J241J14k325J352K393k980j685
1732b614L863P94m140N04L634j366k435K440J025k481N52J711j843l82K086j121
$$ y = [-2230, 1073, 860, -1911, -234, 1522, -643, -437, 2178, 196, -1638, 1458, 1526, -2573, -646, 3171, -108, -3073, 905, 2158, -2194, -2070, 1525, 387, -1335, 666, 404, -1415, 888, 1892, -1585, -1009, 2920, 1063, -2803, 72, 2853, -760, -2036, 1308, 917, -1862, -296, 1066, -1223, -918, 1519, -185, -1505, 1302, 1145, -2073, -215, 2981, -280, -2328, 1996, 2335, -2309, -1401, 2049, 309, -1658, 555, 506, -1205, 261, 714, -1978, -865, 2592, 192, -2574, 941, 2690, -1390, -1714, 2060, 1208, -1447, 379, 1431, -950, -657, 976, -569, -1407, 1027, 518, -2175, -88, 2131, -1115, -1999, 2060, 1638, -2162, -641, 2562, 290, -1524, 888, 1059, -724, 517, 631, -1694, -342, 2051, -929, -2614, 1249, 2043, -2097, -1593, 2041, 675, -1760, 680, 1705, -776, -224, 1487, -356, -738, 1348, 227]
1748B27j785K017J048l077k20L550j111l334K507K332k747j095K739j96j470R89
1764C74L39j521J198J340k627q71L547m09l816J361L455k552k087K885L22k030
1780a092P94J461j588j7J670j143j230K271L97l084Q97K914k277k279K968J070
1796A732k917m30K633n10j656J307L51j256J067J008k341K43K815j207k930K158
1812F7K252k792j434K831J41k475J061J294j746M9J675j354q04K281j83k378J457
1829e8K131k256j389L005K96l281P09K609j467j702J692Oj122Q66L34j656P72
1846e11K227j766k186K955J596l220n39L165o35k383J444R85j648L4J197j172
1862d57o75K026n54k187J805J761k774o20L268m69k899J553K221j943j200J874
$$ y = [227, -1558, 459, 1507, -1570, -1790, 1760, 649, -2685, -178, 2154, -593, -1688, 1051, 855, -615, 374, 713, -808, 390, 1730, -897, -1768, 1779, 1370, -2446, -1085, 2370, -182, -2269, 616, 938, -1092, -298, 1163, -425, -442, 1228, 85, -1145, 1126, 1523, -1561, -664, 2250, -27, -2306, 662, 1732, -1185, -1615, 1018, 508, -1148, 159, 510, -746, 321, 1329, -1012, -769, 2046, 839, -2091, 67, 2319, -473, -1907, 924, 1065, -1410, -349, 945, -801, -752, 923, -431, -1235, 1046, 863, -1515, -58, 2073, -183, -1572, 1433, 1729, -1552, -843, 1766, 299, -1403, 289, 295, -827, 39, 373, -1283, -511, 1716, -50, -2236, 719, 2315, -905, -1444, 1721, 1086, -1297, 147, 1132, -516, -482, 715, -457, -1132, 894, 340, -1847, -42, 1719, -1055, -1675, 1593, 1124, -1775, -222, 1999, 56, -1144, 730]
1878G30j3j196P25K14j423Q83J546k379j049L068J63l194P69K839j215j940J768
1895B96J005j714K28J262j160n32J722r01j605J684J087k601j0K713j035k497
1911b058J986J800k322p16K225l07j326J184K38j292J031R43k254l09K786o21
1927I88k961J471K320k201j521K362M01k014Q12J263j411J45J393j046r52J846
1943H95L67k429O77K466j901j991K484J019k984J34K316r04j343J340K73j301
1959h82J023Q32j876J66K702j402k426K254J810k920p52K637m14k142J145J092
1975H47j529M1J539j376p83K106j39k133J365J973k218j188K797Q3k728P48K263
1992A668j415j536J562K28j506R72O33j584M04K199j807j863K569J371k921j93
$$ y = [730, 717, -479, 246, 460, -963, -80, 1466, -913, -1962, 1106, 1269, -1925, -1156, 1683, 468, -1472, 296, 1301, -413, -185, 1077, -83, -615, 1107, 206, -1399, 285, 1372, -1229, -1239, 1474, 439, -2058, -72, 1728, -594, -1310, 915, 608, -718, 466, 704, -588, 443, 1386, -868, -1177, 1609, 988, -1973, -502, 1818, -383, -1904, 458, 859, -1155, -343, 920, -491, -346, 1047, 1, -951, 895, 1262, -1167, -490, 1976, 75, -1916, 568, 1587, -1397, -1263, 1053, 149, -1194, 146, 419, -882, 141, 973, -903, -737, 1965, 563, -1863, 391, 2201, -719, -1471, 1166, 752, -1390, -245, 847, -682, -641, 898, -478, -1261, 845, 706, -1427, -62, 1911, -307, -1495, 1302, 1385, -1343, -595, 1668, 253, -1283, 279, 507, -999, -27, 606, -978, -574, 1625, -182, -2045, 524, 1895, -1026, -1219]
2008a219K940q05k203J520J142k030J50J519j387o54J848m36k006J449J670k346
2024h48o89K753j52k740J308K313j953j065K050j39j689Q09Q36j534M67J508j484
2041b49j546K468O07k907L31K976j043k195J688R80j769P3J619r60n46J537m80
2058E84j821J302J195k303k43K678r25k210J566J566j923q06K005L3j468P50Q37
2075H17j313N72J058j399o26K038k84k400Q60K132j426j658J885P13j903Q2J546
2092F94q56l02J270m81j153J276M49j639J66K043r28j800J402J154k131m73J916
2109F07l00j202R01M12r78M11N68j020K21J659q19j548J345J356j905r31J993
2126G70J18j638M01R35q97j04P27n29l93J059Qj496P24J464j279q58J853K49j867
$$ y = [-1219, 1721, 916, -1287, 233, 1375, -655, -505, 1014, -373, -1027, 821, 385, -1621, -172, 1498, -848, -1537, 1216, 1064, -1676, -368, 1945, -8, -1073, 977, 838, -851, -42, 794, -740, -273, 1235, -249, -1795, 673, 1280, -1627, -1296, 1680, 637, -1558, 130, 1110, -659, -586, 1033, 73, -473, 1064, 584, -1237, 65, 1260, -1043, -1286, 1392, 467, -1743, -177, 1389, -534, -1340, 665, 698, -770, -20, 817, -496, 76, 1134, -265, -891, 1147, 863, -1537, -677, 1455, 29, -1629, 256, 969, -934, -852, 694, -162, -464, 806, 325, -828, 448, 897, -742, -576, 1467, 539, -1261, 141, 1295, -836, -1309, 607, 307, -895, 6, 418, -560, -149, 419, -601, -380, 1279, 460, -1088, 257, 1613, -292, -1223, 770, 888, -750, -349, 586, -311, -415, 312, -217, -610, 449, 457, -1039, -315, 1149, -130, -988, 865, 1114, -753]
2145g53M08J359r04p73R48Q8p39L30K51j118N36J324j223r35J956M24k056J76
2163g01J738m18j258Q23P02j031q8N90p82j33J211n74j070J184P57j840o3J891
2181I38m55j695J211J183j290n44J235j08r76P48L36j131N69R15j530m70J839
2198G75k4k093P19J706j086j069J335M33j130M65O68r93P0J027p27q22J330K84
2216H68j799J91J805j099j472J663R46j732j65J474n32r45R27M02r66O94P33j390
2234c97k31J720n75j782J283J207j686p31J607J45j526P00P59r40O6J124p73q71
2252i01J508L12j786O49J596j384j138J650N03j874K14J425p20r23J023J14r25
2269f57O81N87j233K68J430q04j338J554P34j671m32J987n17j376P11M01j454
$$ y = [-753, -345, 1014, 110, -663, 285, 373, -366, -36, 215, -903, -367, 957, -266, -1201, 755, 1179, -877, -701, 1037, 619, -639, 184, 886, -145, -233, 357, -425, -558, 653, 79, -991, 193, 950, -890, -953, 938, 483, -1212, -1, 1182, -108, -652, 583, 475, -501, 247, 583, -548, 21, 936, -594, -1064, 775, 751, -1342, -623, 1083, -3, -1072, 263, 696, -434, 31, 699, -294, -224, 803, 76, -746, 584, 868, -931, -740, 1065, -34, -1506, 157, 1103, -629, -794, 680, 148, -797, 130, 532, -434, 260, 993, -397, -628, 1092, 517, -1265, 18, 1225, -461, -1192, 415, 560, -966, -266, 493, -447, -381, 743, -30, -901, 607, 919, -867, -218, 1378, -6, -1144, 506, 1009, -865, -651, 774, 54, -869, 154, 268, -657, 24, 611, -622, -354, 1076, 272, -1066, 488, 1222, -449, -881, 1106, 589, -787, -76, 325, -1129]
2286a129M15J186m52r14J202k26j701J106J061n76j856L168q09j078K98J425j114
2303Fo43J021k8j019O97K70r33K35J208j055q78J583M91j897K56J853q62j263
2321i58J167O55j086P8P26o36m74J094l44j247J070Q27j489k37J671m77j436J036
2339f0J087j336l00J257k58r14P06M86j115L80Q45j168n35J622j14j641O16J381
2357I39j025r33J271L43j111K75Q89p98j31J044n24p84R82K22j306N5J608r76
2375D0r75P76J18o27O58L48l67p78J061N62j537M50J081j242J84J168J66j675
2393e89K55J700j374r11J413J21j451N80P64p49j85Q01l29o71J135J42j342M58
2411b32J297j161p14J367L14j558K75R94o05p09Q19K19r01N54N72r63l7J245p07
$$ y = [-1129, -714, 472, 20, -894, 308, 82, -1619, -513, 548, -28, -1884, 1284, 475, -603, -305, 1120, 6, -637, 384, 356, -663, 34, 304, -629, -394, 814, -241, -1119, 464, 955, -942, -686, 1167, 305, -958, 209, 864, -222, -144, 582, -54, -528, 566, 222, -1025, 45, 872, -617, -854, 817, 340, -1096, -60, 1027, -309, -609, 648, 390, -524, 182, 668, -447, -67, 778, -390, -925, 697, 583, -1058, -442, 939, -86, -1019, 252, 595, -516, -241, 648, -150, -281, 763, 239, -545, 437, 659, -647, -592, 1016, 40, -935, -159, -41, -668, -10, 338, -29, -807, 254, 816, -721, -271, 810, -432, -248, 920, 1086, -589, -334, 1366, -8, -919, 494, 615, -836, -256, 508, -241, -426, 375, 46, -625, 510, 652, -690, -232, 1065, -96, -810, 557, 871, -687, -412, 582, -23, -732, 87, 306, -595, -41, 531, -432, -469, 776, 69]
2430F9r06J202O39j460j15J491m07j332P92O88r53j39Q80p23l81J003k45r70P45
2449a22Q15q98m03J217N8j289N67R63r55n56J077j5r87O11K80o60jP74p42o10
2469h76J199K56j209K51J258p66q80J102L04q32J7O74o35q4O72k57r18P45N43
2488E64j095j35J293m28r77P40O94r99j28J038k10p26M91K42p20M02N47q20l34
2507e61J030j36j170O87Q08p75n67R69M7q89M11N34n24m8P40k94p84P93J86j053
2527e96J68R90n18p62P87M57j193L12Q66n90m09O72J20p47N80M58p98j26J052
2546G23m31r58P20P31j139j47J078l29q47N16M93q74J74P16n39l80R20q0q37M33
2566e7R03j019m05J149Qj227L05R62r26k62R19k44o42O12M28r56k7J104o34n79
$$ y = [69, -837, 365, 1004, -456, -571, 920, 513, -819, -27, 661, -292, -431, 449, -274, -655, 348, 103, -867, -122, 693, -205, -608, 609, 667, -622, -55, 908, -47, -603, 474, 459, -528, 83, 363, -297, -298, 476, -266, -876, 323, 579, -630, -379, 879, 113, -767, 335, 639, -193, -176, 498, -137, -221, 451, 194, -724, 21, 564, -531, -666, 627, 199, -778, -38, 656, -343, -471, 567, 357, -369, 122, 364, -356, 46, 593, -227, -561, 469, 333, -837, -150, 658, -117, -684, 285, 332, -557, -146, 388, -136, -184, 556, 262, -522, 271, 457, -596, -428, 562, 44, -718, 69, 526, -667, -355, 511, -79, -488, 184, 304, -443, 137, 595, -203, -329, 723, 292, -666, 54, 785, -354, -501, 577, 248, -599, -83, 410, -464, -290, 426, -113, -493, 427, 347, -490, -57, 846, -173, -578, 571, 579, -648, -343, 619, -307, -569, 350, 106, -536, 76, 504, -452, -479, 625, -9, -588]
2586e88Q67N00j219N4J208o55q00Q48K87q89J49O78o74l35R89k31q90O16P93j122
2606d14l78J379k40j052P17O69q62l09J093l15q48P11L53r03l0R68o98n70R59
2625B30K69j175K96J065p08o15J144L5r14K59O81o72l35J008l01q15O85M51r82
2644c94k53J105l35q87P38P35j035j35J044l72p06N59L94p76J40P64n73m89Q61
2663C85o1r99L86R75q54n48R32K05r71M92O24p17j10P13j50p29N58M36q60j40
2683d33J014m65o93O07N00q66r6J012o52n47P19K14p14J87O35m34l19Q68l12o65
2703d40L57P28q95k54Q82j11p76K94N86n40k16P29j35p11P49K22r07K37P10n30
2723b1m27P64K09j022L99N37n71l84P61op02L31L18m96o2O59j95n09N72M39q20
$$ y = [-588, 279, 779, -440, -386, 822, 167, -633, 215, 502, -387, -238, 440, -234, -569, 420, 189, -701, -85, 708, -414, -792, 587, 347, -705, 12, 681, -181, -490, 603, 288, -560, 151, 504, -399, -429, 539, -159, -729, 230, 499, -676, -380, 685, -23, -638, 506, 541, -373, -114, 567, -105, -440, 568, 267, -548, 137, 588, -394, -647, 458, 123, -764, -26, 709, -326, -461, 583, 211, -495, 64, 458, -318, -178, 586, 13, -476, 385, 324, -675, -289, 686, -168, -716, 216, 421, -550, -58, 566, -151, -261, 452, 302, -427, 131, 567, -293, -433, 581, 116, -577, 30, 530, -336, -432, 580, -72, -619, 100, 314, -400, -213, 422, -12, -331, 537, 225, -440, -83, 645, -250, -504, 378, 267, -509, -215, 371, -169, -385, 344, 209, -502, 247, 469, -438, -201, 509, -21, -448, 316, 525, -497, -98, 439, -132, -516, 245, 239, -463, -132, 186, -310, -372, 287, 92, -417, 155, 594, -226]
2744b26r8Q21k60p17N10L73n88PN65m54l94N27L8o16K73N80m69l00P24j15o14
2765d33N60L50o02j78O79k23n52N17J68n64J20M20l83m32P39J00o99K31O13n63
2785a32k71P21N3n74J91M96m88k75O46j78o00L80M65p88q6Q61k94o13N26K43o33
2806c50R7O24j16o50O32J55n90R5M10m43j44O34j38o41K79N55n62l76Q84j11o61
2827d17L27L98n52m8P11k82m81O47J82q43J98N77k46n44N04J45o25K27M31n36
2847b27k20N89K06o12Q4O47n95j52O53j38n57M39L42o65j42P03k65m58L83K18
2867B33o01O4N74l45k23M08K36o71K58N42n39k05O07o1o07K79N15n87k28O28m3
2888B34o14K95K63l79k3M87j22n49O24J36o70J54M78j68n44O29J12o10Q9M49l20
$$ y = [-226, -324, 497, 237, -480, 30, 403, -185, -178, 387, -67, -461, 66, 104, -512, -239, 341, -128, -428, 296, 181, -433, 127, 477, -125, -303, 376, 153, -399, 118, 286, -278, -158, 262, -121, -553, 186, 286, -413, -182, 431, -132, -403, 318, 371, -203, -12, 484, -4, -279, 367, 189, -411, -31, 434, -354, -440, 421, 127, -486, 40, 283, -350, -253, 371, 255, -395, 237, 392, -198, -103, 307, -136, -280, 354, 216, -425, -146, 409, -153, -529, 355, 244, -417, -90, 308, -244, -292, 419, 137, -344, 303, 485, -358, -160, 417, 171, -373, 131, 276, -349, -122, 309, -227, -447, 142, 348, -264, -180, 467, -128, -280, 373, 235, -322, 117, 459, -206, -348, 355, 90, -368, 15, 233, -368, -304, 270, -75, -298, 110, 346, -325, -67, 475, -64, -269, 338, 277, -330, -51, 464, -123, -351, 277, 234, -380, -85, 178, -201, -224, 263, 141, -408, 216, 352, -318, -164, 314, 146, -398, 231, 343, -267, -178, 271, -49]
$$ [...]
8191A60
##END NTUPLES=NMR FID
##END=
