##TITLE=1H_DE-80H_X3
 200.13MHz, d2o
 8 sc
 
 19ns.26.2.2025
##JCAMPDX= 6.0         $$ Bruker NMR JCAMP-DX V2.0
##DATA TYPE= NMR FID
##DATA CLASS= NTUPLES
##ORIGIN= UXNMR, Bruker Analytische Messtechnik GmbH
##OWNER= pz
$$ XWIN-NMR		Version 3.5
$$ Thu Mar  5 10:11:38 2026 Russian Standard Time (UT+4h)  Yarkov@DPX200
##.OBSERVE FREQUENCY= 200.1313
##.OBSERVE NUCLEUS= ^1H
##.DELAY= (6, 6)
##.ACQUISITION MODE= SIMULTANEOUS
##.ACQUISITION SCHEME= undefined
##.AVERAGES= 8
##.DIGITISER RES= 18
##SPECTROMETER/DATA SYSTEM= spect
##.PULSE SEQUENCE= zg30
##.SOLVENT NAME= CDCl3
##.SHIFT REFERENCE= (INTERNAL, CDCl3, 0, 14.3821)
##AUDIT TRAIL= $$ (NUMBER, WHEN, WHO, WHERE, WHAT)
$$ ##TITLE= Audit trail, XWIN-NMR		Version 3.5
$$ ##JCAMPDX= 5.01
$$ ##ORIGIN= Bruker BioSpin GmbH
$$ ##OWNER= Yarkov
$$ C:/Bruker/XWIN-NMR/data/yarkov2/nmr/H-C/1/audita.txt
$$ ##AUDIT TRAIL=  $$ (NUMBER, WHEN, WHO, WHERE, WHAT)
(   1,<2026-03-05 10:10:59.81 +0400>,<Yarkov>,<DPX200>,
      <created by zg, POWCHK disabled, PULCHK disabled
       configuration hash MD5:
       00 E9 B6 7A A2 85 ED C7 34 08 36 98 17 FE 4E 26
       data hash MD5: 16K
       FC D2 F2 F1 A1 6A C7 02 83 46 00 47 C8 F9 96 30>)
$$ ##END=
$$ 
$$ hash MD5
$$ 78 7B 8F FE 7D 4B B8 D8 5E 20 FF 57 E1 56 24 D9
##$RELAX= 
##$RELAX= 
##$RELAX= 
##$RELAX= 
##$RELAX= 
##$RELAX= 
$$ Bruker specific parameters
$$ --------------------------
##$DU= <C:/Bruker/XWIN-NMR>
##$EXPNO= 1
##$NAME= <H-C>
##$PROCNO= 1
##$TYPE= <nmr>
##$USER= <yarkov2>
##$AMP= (0..31)
100 100 100 100 100 100 100 100 100 100 100 100 100 100 100 100 100 100 
100 100 100 100 100 100 100 100 100 100 100 100 100 100 
##$AQSEQ= 0
##$AQ_mod= 1
##$AUNM= <au_zg>
##$AUTOPOS= <>
##$BF1= 200.13
##$BF2= 200.13
##$BF3= 200.13
##$BF4= 200.13
##$BF5= 200.13
##$BF6= 200.13
##$BF7= 200.13
##$BF8= 200.13
##$BYTORDA= 1
##$CFDGTYP= 0
##$CFRGTYP= 5
##$CHEMSTR= <none>
##$CNST= (0..31)
1 1 145 1 1 1 1 1 1 1 1 1 1 1 1 1 1 1 1 1 1 1 1 1 1 1 1 1 1 1 1 1 
##$CPDPRG= <>
##$CPDPRG1= <>
##$CPDPRG2= <>
##$CPDPRG3= <>
##$CPDPRG4= <mlev>
##$CPDPRG5= <mlev>
##$CPDPRG6= <mlev>
##$CPDPRG7= <mlev>
##$CPDPRG8= <mlev>
##$CPDPRGB= <>
##$CPDPRGT= <>
##$D= (0..31)
0 0.7 0 0 0 0 0 0 0 0 0 0.03 0 0 0 0 0 0 0 0 0 0 0 0 0 0 0 0 0 0 0 0 
##$DATE= 1772691059
##$DBL= (0..7)
120 120 120 120 120 120 120 120 
##$DBP= (0..7)
150 150 150 150 150 150 150 150 
##$DBP07= 0
##$DBPNAM0= <>
##$DBPNAM1= <>
##$DBPNAM2= <>
##$DBPNAM3= <>
##$DBPNAM4= <>
##$DBPNAM5= <>
##$DBPNAM6= <>
##$DBPNAM7= <>
##$DBPOAL= (0..7)
0.5 0.5 0.5 0.5 0.5 0.5 0.5 0.5 
##$DBPOFFS= (0..7)
0 0 0 0 0 0 0 0 
##$DE= 6
##$DECBNUC= <off>
##$DECIM= 32
##$DECNUC= <off>
##$DECSTAT= 4
##$DIGMOD= 1
##$DIGTYP= 9
##$DL= (0..7)
0 120 120 120 120 120 120 120 
##$DP= (0..7)
150 150 150 150 150 150 150 150 
##$DP07= 0
##$DPNAME0= <>
##$DPNAME1= <>
##$DPNAME2= <>
##$DPNAME3= <>
##$DPNAME4= <>
##$DPNAME5= <>
##$DPNAME6= <>
##$DPNAME7= <>
##$DPOAL= (0..7)
0.5 0.5 0.5 0.5 0.5 0.5 0.5 0.5 
##$DPOFFS= (0..7)
0 0 0 0 0 0 0 0 
##$DQDMODE= 0
##$DR= 18
##$DS= 0
$$ [...]
##$SUBNAM2= <"">
##$SUBNAM3= <"">
##$SUBNAM4= <"">
##$SUBNAM5= <"">
##$SUBNAM6= <"">
##$SUBNAM7= <"">
##$SUBNAM8= <"">
##$SUBNAM9= <"">
##$SW= 18.0517328524113
##$SWIBOX= (0..15)
0 0 2 0 0 0 0 0 0 0 0 0 0 0 0 0 
##$SW_h= 3612.71676300578
##$TD= 16384
##$TD0= 1
##$TE= 0
##$TE2= 300
##$TE3= 300
##$TEG= 300
##$TL= (0..7)
0 120 120 120 120 120 120 120 
##$TP= (0..7)
150 150 150 150 150 150 150 150 
##$TP07= 0
##$TPNAME0= <>
##$TPNAME1= <>
##$TPNAME2= <>
##$TPNAME3= <>
##$TPNAME4= <>
##$TPNAME5= <>
##$TPNAME6= <>
##$TPNAME7= <>
##$TPOAL= (0..7)
0.5 0.5 0.5 0.5 0.5 0.5 0.5 0.5 
##$TPOFFS= (0..7)
0 0 0 0 0 0 0 0 
##$TUNHIN= 0
##$TUNHOUT= 0
##$TUNXOUT= 0
##$USERA1= <user>
##$USERA2= <user>
##$USERA3= <user>
##$USERA4= <user>
##$USERA5= <user>
##$V9= 5
##$VALIST= <valist>
##$VCLIST= <CCCCCCCCCCCCCCC>
##$VD= 0
##$VDLIST= <DDDDDDDDDDDDDDD>
##$VPLIST= <PPPPPPPPPPPPPPP>
##$VTLIST= <TTTTTTTTTTTTTTT>
##$WBST= 1024
##$WBSW= 4
##$XGAIN= (0..3)
0 0 0 0 
##$XL= 0
##$YL= 0
##$YMAX_a= 231428
##$YMIN_a= -211127
##$ZGOPTNS= <>
##$ZL1= 120
##$ZL2= 120
##$ZL3= 120
##$ZL4= 120
##$ABSF1= 10
##$ABSF2= 0
##$ABSG= 5
##$ABSL= 3
##$ALPHA= 0
##$AQORDER= 0
##$ASSFAC= 0
##$ASSFACI= 0
##$ASSFACX= 0
##$ASSWID= 0
##$AUNMP= <proc_1d>
##$AZFE= 0.1
##$AZFW= 0.1
##$BCFW= 1
##$BC_mod= 2
##$BYTORDP= 1
##$COROFFS= 0
##$CY= 83.5205535888672
##$DATMOD= 1
##$DC= 2
##$DFILT= <>
##$DTYPP= 0
##$F1P= 10.8118882576601
##$F2P= -7.23987719738617
##$FCOR= 0.5
##$FTSIZE= 0
##$FT_mod= 4
##$GAMMA= 1
##$GB= 0.15
##$INTBC= 1
##$INTSCL= 1
##$ISEN= 128
##$LB= 0.25
##$LEV0= 0
##$LPBIN= 0
##$MAXI= 10000
##$MC2= 0
##$MEAN= 0
##$ME_mod= 0
##$MI= 1.114404
##$NCOEF= 0
##$NC_proc= 0
##$NLEV= 6
##$NOISF1= 3.799351
##$NOISF2= 2.8
##$NSP= 1
##$NTH_PI= 0
##$NZP= 0
##$OFFSET= 14.38212
##$PC= 1
##$PHC0= -5299.748
##$PHC1= 6.821927
##$PH_mod= 1
##$PKNL= yes
##$PPARMOD= 0
##$PSCAL= 0
##$PSIGN= 0
##$REVERSE= no
##$SF= 200.129724274929
##$SI= 16384
##$SIGF1= 3
##$SIGF2= 2
##$SINO= 400
##$SIOLD= 16384
##$SREGLST= <1H.CDCl3>
##$SSB= 0
##$STSI= 0
##$STSR= 0
##$SW_p= 3205.1282051282
##$SYMM= 0
##$S_DEV= 0
##$TDeff= 0
##$TDoff= 0
##$TI= <>
##$TILT= no
##$TM1= 0
##$TM2= 0
##$TOPLEV= 0
##$USERP1= <user>
##$USERP2= <user>
##$USERP3= <user>
##$USERP4= <user>
##$USERP5= <user>
##$WDW= 1
##$XDIM= 8192
##$YMAX_p= 0
##$YMIN_p= 0
$$ End of Bruker specific parameters
$$ ---------------------------------
##NTUPLES= NMR FID
##VAR_NAME=  TIME,          FID/REAL,        FID/IMAG
##SYMBOL=    X,             R,               I
##VAR_TYPE=  INDEPENDENT,   DEPENDENT,       DEPENDENT
##VAR_FORM=  AFFN,          ASDF,            ASDF
##VAR_DIM=   8192,          8192,            8192
##UNITS=     SECONDS,       ARBITRARY UNITS, ARBITRARY UNITS
##FACTOR=    0.0002768,     1,               1
##FIRST=     0,             0,               0
##LAST=      2.2672688,     0,               0
##MIN=       0,             -211127,         0
##MAX=       2.2672688,     231428,          0
$$ Real data points
##PAGE= N=1
##DATA TABLE= (X++(R..R)), XYDATA
0 0 0 0 0 0 0 0 0 0 0 0 0 0 0 0 0 0 4 -8 8 -8 8 -8 16 -16 18 -24 24 -32 36 -40 46 -53 60 -68 77 -86 100 -110
38 -110 124 -138 154 -171 192 -212 236 -260 286 -316 350 -385 424 -467 514 -567 625 -690 764
57 764 -846 944 -1056 1186 -1342 1532 -1769 2070 -2475 3026 -3808 4766 -6075 231428 187022
72 187022 -157665 -167594 81882 143027 -49221 -113576 -1770 62503 40294 45552 6930 -86732
84 -86732 -72930 75894 110914 -35204 -97105 40015 108459 -12293 -101720 -31632 44946
95 44946 34123 17710 18879 -33658 -69090 8800 70359 -12253 -82566 7718 103174 24770
107 24770 -93964 -59552 36274 35129 -1955 5749 2309 -25034 -5015 29722 -17299 -69725
119 -69725 10247 102172 21469 -93818 -31475 76575 13218 -88250 -3468 117641 29523
130 29523 -105085 -30185 95512 22141 -101919 -27144 112316 57758 -80991 -60966 40154
141 40154 30433 -31609 -13387 29827 9245 -13258 11201 71 -50160 -20899 61015 45359
153 45359 -42699 -42098 35587 30046 -48928 -39666 41182 40848 -22066 -22027 17969 -824 -40144 -6954
167 -6954 42018 14015 -24636 1641 22710 -12083 -30897 6914 29542 1629 -5893 20115
179 20115 3722 -35172 -13386 29595 9786 -25932 5790 42953 -8527 -61403 -5024 56465
191 56465 5504 -52816 1450 66990 10618 -72799 -31740 54232 36372 -29801 -24954 20203
203 20203 19609 -13266 -19454 -9531 -5177 17562 34569 -5280 -48022 -14316 41709 19680 -41312
216 -41312 -23391 45998 38298 -28389 -36895 8025 19744 -2492 -490 15632 -2118 -20543 4086
229 4086 17936 -15106 -28072 12573 38928 3742 -33065 -13951 14286 6386 -2936 3890 1965
242 1965 -3101 7836 12440 -15258 -32801 6856 43872 7833 -38462 -15304 28057 11954 -30740
255 -30740 -18738 24657 21520 -10056 -11222 2354 -1894 -6535 6318 13620 -1995 -7358 9502
268 9502 7112 -15551 -13217 10116 13352 -3746 -5592 7075 -1557 -17791 -2644 17025 2928
281 2928 -13739 2487 20655 138 -26395 -7386 23336 12205 -12149 -6641 9820 4587 -10859
294 -10859 -8395 2647 2009 3032 7715 -2681 -14758 -4874 11141 5110 -11467 -3247 18159 8932
308 8932 -14890 -11165 7889 8745 -3494 -1962 8650 1740 -10612 -3141 5077 -3175 -6772 4747
322 4747 11491 -1485 -13126 -2643 7584 282 -3030 4305 5979 -212 -2862 373 -1054 -5938
336 -5938 2155 11366 939 -10369 -3705 5682 139 -10366 -3210 11467 5542 -7479 -4624 2704
350 2704 1706 -2483 125 5856 2961 -1672 1259 -390 -5643 -1610 5071 3835 -2970 -4361 2229
365 2229 1429 -6456 -3919 3868 3706 467 -65 1198 -1107 -4471 1737 7418 866 -4211 962 5135
381 5135 869 -7343 -6064 3580 5966 1127 -3580 -6481 -2044 5163 3160 -4767 -6791 3927 13463
396 13463 2667 -12922 -7983 8219 12179 -275 -10656 -2774 7950 5176 -4118 -9361 -4734
409 -4734 6048 8837 196 -9458 -8525 4893 11401 3 -9924 -3807 9575 11729 -2916 -13023
423 -13023 -3535 9597 9355 -2571 -10590 -2750 6823 3651 -4482 -7240 -1845 5702 4902 -1032 -5031
438 -5031 -4828 2132 7636 2890 -4247 -3913 3479 7154 -836 -7062 -1185 3683 1309 -813 477 -319
454 -319 -6594 -5778 7950 9953 -7424 -14517 2930 19415 5756 -19603 -12935 15956 20020 -4124
468 -4124 -18907 -4994 14193 9993 -6331 -11197 -4857 5629 11356 1964 -13156 -14463 5027
481 5027 22153 6191 -21874 -15977 16241 25675 -3113 -28132 -8541 25017 19631 -12332 -23402
494 -23402 -1369 19313 9029 -11845 -13521 -691 10027 9341 -3280 -13305 -8081 9637 18601
507 18601 4 -21517 -7839 20886 17790 -13689 -23126 6731 24586 -234 -21451 -4525
519 -4525 15172 3936 -14241 -4456 13320 2042 -14565 -1958 15364 4468 -14946 -7418 15290
532 15290 11762 -10024 -10102 5779 7596 -2302 -3905 2186 -755 -7314 2480 11552 -2923 -17778
546 -17778 -4713 18841 13848 -15820 -21020 8927 24986 3295 -21457 -12696 16040 20034 -4410
559 -4410 -18592 -6930 10779 12564 -1782 -12660 -9266 3327 14440 7088 -15455 -19167 7396
572 7396 27407 6810 -27693 -18478 23661 28189 -11800 -30470 927 28942 8268 -22138 -12267
585 -12267 11638 8911 -5843 -5349 2369 -1180 -5280 5195 9013 -6820 -12636 5296 16501 1449
599 1449 -15124 -4296 13321 6412 -8225 -5411 4147 3320 -3233 -2290 2889 -1506 -6451 498 6718
614 6718 1950 -6368 -5625 4359 8218 100 -6093 -3164 4682 8126 472 -7495 -4336 2995 6514
629 6514 2252 -6524 -7670 26 7936 6214 -7926 -14084 2840 18096 6078 -16804 -14310 13184
643 13184 20912 -5219 -19965 -1562 17585 8746 -11628 -11940 4046 8579 1272 -3951 -5777 -2967
657 -2967 3737 6086 -318 -9113 -4263 10052 9028 -5530 -9271 1298 9298 3904 -5585 -4428
671 -4428 1869 3763 2141 -3024 -6236 -1134 5016 3853 -3930 -7345 789 7211 1189 -5304 -2360
686 -2360 4214 5363 -725 -4217 -315 2987 2818 -275 -3872 -864 3456 728 -3918 -3759 1756 4002
702 4002 -2058 -4399 1586 3583 -750 -2987 543 4268 849 -2511 949 2784 -806 -2005 128
717 128 1821 235 -2604 -990 933 -751 -1156 -972 -752 1229 1516 10 -1541 -1036 2982 3532 -1947
734 -1947 -2408 2391 3886 -17 -4148 -1658 3300 1394 -2562 -1965 -428 909 105 -1801 -714 147
750 147 670 2052 574 -1154 291 1102 1248 771 -561 30 359 -166 636 -1133 -2839 81 2072
767 2072 355 -2711 -2939 1626 2941 -1539 -2265 1282 3064 1524 -1581 -1061 2118 1328 -372 -231
783 -231 -543 345 378 -1584 -1382 -618 98 656 -1367 -1584 1492 863 -1156 -765 1064 2835 510 -1925
801 -1925 737 2310 27 -1160 -805 958 1078 -1501 -1536 -391 -667 -106 -302 -1226 116 965 508 -156
819 -156 -1308 904 2871 293 -887 607 1301 633 -1281 -1229 852 121 -823 -12 -952 -1538 -412 534
837 534 555 -1225 -1313 2364 2296 -1184 -1391 634 2630 1590 -1222 -977 470 424 966 -1261 -3113 -304
855 -304 2161 815 -2624 -3645 1377 3478 -1043 -2372 622 2423 1277 -763 -159 1255 -329 156
871 156 2261 -13 -2400 -1177 1126 1103 -2227 -2528 1120 867 -1103 -69 -25 -926 -149 1917 2858 -986
889 -986 -3108 2007 4061 -281 -2826 -1114 1923 1755 -1309 -1749 -1828 -1577 2164 2494 -3005 -4120 978
906 978 5335 1319 -5738 -2027 5586 3627 -1776 -2124 386 1444 220 688 429 -3729 -2300 4462
922 4462 2881 -5114 -6047 2152 6933 -651 -6607 -318 5154 1745 -1919 -948 1503 1143 67 1833
938 1833 673 -3280 -1308 2676 1531 -2083 -3364 -545 1967 446 -940 -1485 -1841 1834 4161 -221
954 -221 -3541 -849 3784 3355 -2160 -2139 1353 1 -423 2257 30 -5202 -3593 5746 6711 -6833
970 -6833 -10767 4581 11799 -1206 -11433 -1851 10862 4581 -6852 -2861 4280 1219 -1120 2054
984 2054 1356 -5470 -4318 7040 6668 -8728 -10435 5580 11690 -2157 -12393 -1741 10713 4173
998 4173 -6121 -3826 2955 4264 771 -1305 -1167 -1425 733 3732 122 -4373 -2260 1550 2428 -337
1014 -337 -3445 -2185 1481 3553 1344 -4185 -3321 5080 5247 -3114 -4633 2820 6044 -2512 -6224 3522
1030 3522 5935 -5039 -6867 4519 7406 -5428 -10232 4160 10801 -3500 -10125 2482 9335
1043 9335 -771 -7262 1951 6976 -2888 -5025 5586 4910 -6984 -6537 6736 8090 -7339 -10869
1057 -10869 5180 9900 -3310 -9306 -20 7206 1848 -4127 -695 1766 205 1756 2525 -1949
1071 -1949 -3260 1411 4721 221 -5638 -1918 3522 1231 -1586 -2075 -2000 585 3027 1260 -3499 -3748
1087 -3748 4619 6664 -3396 -6384 3405 7071 -1501 -6592 1281 6560 -2575 -6525 2705 4793 -4190
1102 -4190 -5713 3643 5697 -4519 -6229 5181 5933 -4971 -4560 5579 5194 -4587 -4435 6105 4666
1117 4666 -6419 -4132 5862 3328 -5655 -4167 4157 2912 -4749 -2297 4046 322 -3421 1075 3946
1132 3946 -891 -3981 2269 5710 -1965 -5023 2465 4747 -1679 -3991 657 2680 -1776 -2218 1911
1147 1911 -146 -3536 721 3598 -1030 -4182 1190 5754 -419 -5285 1762 5741 -1010 -4268 1279
1162 1279 4096 -1647 -4414 1868 3298 -3873 -3390 3346 2207 -4105 -2860 4305 2772 -4619 -2013
1177 -2013 5596 2175 -4383 -994 4721 1595 -4526 -815 4846 -397 -5034 742 3654 -1949 -4753
1192 -4753 1267 4691 -2318 -5209 2680 5051 -2407 -3632 2722 4242 -1774 -3098 3043 2869 -3274
1207 -3274 -1713 3400 513 -3863 -1292 3294 598 -4822 -660 4255 -428 -3476 1009 3368 -442
1222 -442 -2882 1830 4044 -2039 -3192 3299 3186 -2866 -2991 2252 2693 -3013 -3319 2605 1250 -3536
1238 -3536 -838 2933 320 -3238 108 4475 284 -4256 1185 4915 -555 -3764 768 3792 -797
1253 -797 -4005 943 3135 -2524 -3328 2067 2176 -2583 -2777 2484 3148 -2811 -2176 3643 2025 -2334
1269 -2334 -907 2858 1346 -2855 -768 3579 -147 -3987 126 2726 -869 -3473 -21 2867 -863
1284 -863 -3172 1472 2902 -1521 -1804 2178 2667 -1448 -2239 2526 2668 -2558 -1897 2123 1064 -2218
1300 -2218 -1459 1339 444 -2595 -346 2256 -1041 -2322 1213 2523 -623 -2370 1209 3509 -937
1315 -937 -2429 1592 2289 -1209 -1766 868 1370 -1999 -1877 1989 555 -2853 -723 2277 654 -2302
1331 -2302 -823 3317 1287 -2653 6 3083 609 -1824 -288 2001 188 -2512 -88 2030 -1300
1346 -1300 -2250 475 1380 -919 -2149 558 2425 -665 -1687 1211 1533 -57 -429 416 1066 -182
1362 -182 -478 922 -272 -1490 322 462 -746 -1040 -466 809 -441 -1320 885 837 -849 44 1352
1379 1352 813 -668 -566 1855 1337 -1788 -854 1454 410 -1338 -1375 319 564 -1372 -722 1089 -364
1396 -364 -1318 395 1335 659 -1236 -415 2324 1128 -1271 -562 726 1186 -204 -1567 -295 449 -392
1413 -392 -345 -707 -565 195 -48 -90 154 -193 216 779 427 502 -168 -501 1004 1011 -459 -848 -378 895 327
1434 327 -1730 -1095 795 256 -667 -929 248 1048 -417 -309 1191 648 -255 -93 840 1464 -475 -1553
1452 -1553 694 1520 -689 -1802 -670 1122 219 -1914 -711 1158 -37 -941 -58 1107 572 -1256
1468 -1256 165 2559 575 -1916 -435 1980 1494 -1951 -2236 1384 1572 -1561 -1968 -4 1232 -256
1484 -256 -1584 189 1218 -538 -322 1050 993 -259 -913 966 2093 -543 -1789 173 1472 410
1500 410 -1959 -1753 1166 999 -1399 -1336 187 1217 116 -1328 596 1697 -151 -791 737 1526 97
1517 97 -1677 162 2421 -498 -2452 -284 1648 85 -2380 -1112 2131 505 -2367 -402 2115
1532 2115 715 -1578 -462 2514 1445 -2115 -597 2352 1195 -1750 -1555 1173 1506 -1781 -1917 1032
1548 1032 542 -1074 -950 418 983 -617 -898 1372 1022 -690 -188 872 1390 -112 -1293 141 1240
1565 1240 -185 -1027 -884 195 694 -894 -1268 188 671 -106 -665 -101 1355 293 -795 593 1282
1582 1282 -4 -875 174 1441 -17 -2099 -221 1558 -286 -1880 -693 1216 311 -1887 -614
1597 -614 1790 430 -1281 65 1562 867 -1117 -273 1837 359 -1360 -103 996 -64 -1291 -746
1613 -746 888 -63 -1577 -253 838 -221 -695 -88 857 686 -480 247 956 126 178 338 -148 31
1631 31 -136 -103 -165 -788 -142 222 -945 -609 349 -8 -488 -161 535 794 -717 -91 1617 528 -743
1650 -743 -68 966 625 -1082 -908 1028 194 -1581 -508 652 -143 -1122 -558 1238 384 -1394 67
1667 67 1616 453 -661 133 1291 646 -1059 16 1080 -329 -936 43 235 -298 -1075 -189 733 -360
1685 -360 -814 390 384 -66 175 202 455 85 271 851 -51 -545 519 343 -580 -728 -19 419 -587 -1124
1705 -1124 529 445 -1033 -279 882 558 -454 -516 1302 1235 -849 -347 1276 642 -753 -792 560 506
1723 506 -1276 -798 686 -133 -1227 -403 732 325 -997 -356 1365 537 -680 203 1007 458 -194 -284
1741 -284 518 128 -701 -70 15 -586 -415 -174 -199 -242 -507 299 361 -339 308 532 -73 300 429 483 145 -374
1763 -374 359 721 -680 -631 191 79 -393 -800 -97 608 -518 -810 697 602 -164 -244 238 984 26 -452
1783 -452 794 645 -415 -266 75 146 -332 -781 28 55 -852 -229 253 -122 -7 -111 304 594 -121 129
1803 129 488 40 353 566 -52 8 12 -9 9 -875 -444 411 -503 -807 -18 167 184 -514 -129 988 266 -577
1825 -577 490 932 252 -330 -92 886 231 -1040 -141 543 -355 -919 -562 354 285 -983 -366 819 273
1844 273 -252 31 460 793 -150 -223 730 429 -168 -75 -51 327 -8 -805 -288 -13 -204 -251 -425 96 420
1865 420 -362 -265 536 486 178 -318 201 1078 179 -898 268 701 -193 -764 -424 690 -84 -1467 -235
1884 -235 821 -149 -741 -285 1033 743 -858 -208 1324 471 -423 -120 766 604 -697 -667 631 59
1902 59 -966 -454 -111 305 -508 -1060 357 659 -291 -50 113 598 587 -403 -91 781 179 -193 -312 -65
1922 -65 580 -507 -1027 232 231 -567 -715 -204 723 -15 -965 306 1049 -15 -402 70 990 634 -766
1941 -766 -195 1108 11 -842 -336 236 161 -1083 -926 638 286 -913 -317 500 676 -51 -603 751
1959 751 954 -357 -299 310 504 194 -751 -197 678 -341 -919 -188 64 116 -904 -609 751 378 -693
1978 -693 -100 664 771 -64 -520 816 822 -507 -300 350 377 -143 -968 -197 372 -563 -815 -21 294 -3
1998 -3 -476 -147 797 250 -334 300 570 513 -34 -354 471 625 -387 -613 -16 203 -336 -902 -265 586 -273
2019 -273 -887 156 721 255 -535 -13 1278 323 -740 219 1016 190 -581 -465 810 137 -1228 -411
2037 -411 548 -209 -726 -461 613 375 -879 -150 961 55 -180 205 537 513 -300 -171 622 -92 -586
2056 -586 13 -113 -182 -273 -386 -99 -192 -360 251 -317 -275 631 271 -251 93 452 595 -200 -302 861 306
2077 306 -954 -301 432 -12 -962 -742 669 334 -1343 -194 1016 230 -591 -73 1114 639 -810 -189
2095 -189 1342 -23 -687 61 657 115 -1085 -346 712 -490 -1140 111 425 -313 -505 61 590 -79
2113 -79 -321 693 560 -351 224 515 103 -334 -106 436 -171 -1018 60 404 -815 -617 257 452 -460
2132 -460 -732 722 945 -852 -319 1208 763 -515 -418 847 782 -913 -551 1129 122 -1232 -630 663
2150 663 119 -1144 -510 1273 199 -1092 171 1035 207 -534 58 947 75 -825 373 799 -362 -587
2168 -587 187 276 -457 -940 228 274 -773 -158 494 29 -309 160 613 229 -559 490 1094 -402 -458 465
2188 465 429 -520 -868 361 629 -989 -975 921 287 -1116 -490 876 792 -719 -548 1428 618 -1012
2206 -1012 -37 1049 329 -781 -342 1012 66 -1475 -207 854 -419 -1068 -212 597 34 -965 276
2223 276 900 -236 -423 753 650 -75 -366 437 520 -687 -519 792 -200 -847 -134 222 -192 -807 -73
2242 -73 804 -364 -809 631 911 -370 -332 726 959 -370 -936 848 735 -897 -529 547 273 -904
2260 -904 -845 691 392 -1073 -309 989 169 -723 -140 944 524 -777 117 1171 19 -764 259 680
2278 680 -84 -674 -68 573 -584 -891 393 220 -654 -356 399 554 -448 -179 1010 360 -748 294
2296 294 968 -94 -625 56 696 -268 -1307 129 691 -687 -847 178 556 -483 -868 723 1058 -643
2314 -643 -449 888 677 -274 -462 664 775 -701 -575 834 78 -890 -333 280 213 -872 -446 649
2332 649 -5 -619 188 552 -15 -82 347 679 -138 -248 604 401 -603 -59 276 -80 -462 -407 433 -67
2352 -67 -967 124 842 -186 -499 308 785 54 -640 504 1086 -360 -656 590 581 -416 -726 227 693
2371 693 -732 -1006 469 427 -699 -451 190 620 -306 -581 733 830 -333 113 512 275 -173 -354 325
2390 325 155 -708 -143 187 -331 -181 -63 -28 -50 -270 138 356 -169 267 540 -109 -112 360 404 85 -341 117
2412 117 548 -558 -641 251 168 -501 -736 86 597 -353 -785 662 625 -368 -238 479 807 -89 -463 595
2432 595 660 -495 -414 231 248 -331 -626 220 310 -549 -489 401 89 -192 -239 257 718 -200 -8 347 106 -97
2454 -97 22 -137 244 49 -273 -112 -344 -246 -57 -369 -74 185 -84 -145 117 224 319 -71 -89 558 218 -232
2476 -232 17 228 124 -294 -425 297 151 -671 -218 213 -67 -309 -314 295 421 -333 26 544 270 -68 6
2497 6 329 391 -199 -217 321 -85 -302 -232 -263 -13 -218 -517 181 130 -218 6 52 269 316 -146 236 380 -6
2520 -6 98 85 13 123 -236 -337 198 -178 -398 -66 -73 48 -150 -313 210 90 -131 121 339 227 120 -71
2542 -71 167 360 -235 -36 39 -210 -284 -209 -235 -106 -391 -111 200 -129 -39 209 183 102 143 85 363 -6 -72 305
2566 305 41 -187 -5 -165 -28 -132 -319 -77 -218 -211 62 -55 14 127 150 102 127 35 367 144 -54 161
2588 161 169 -161 -189 -151 37 -240 -427 47 245 -391 -301 235 189 -84 -112 344 606 -48 -100 476 384 -50 -161
2611 -161 197 322 -344 -494 363 171 -517 -421 124 341 -376 -521 482 328 -294 -46 334 290 -80 -146 430
2632 430 198 -469 -115 258 -124 -266 -284 -140 75 -364 -89 135 -152 -14 183 -10 69 340 213 104 18
2653 18 125 447 -209 -256 271 41 -336 -365 -31 237 -480 -477 304 219 -368 -225 419 513 -211 -384 632 652
2675 652 -549 -347 445 249 -407 -611 297 338 -677 -429 468 176 -502 -366 367 402 -355 -123 653 291
2695 291 -172 92 408 188 -228 -273 342 81 -445 -81 -66 -235 -51 -135 -72 -72 -47 331 -57 -352 287 371 -23
2718 -23 15 251 362 11 -497 244 388 -529 -466 229 199 -439 -599 185 597 -664 -391 508 552 -161 -280
2739 -280 615 685 -335 -434 735 309 -493 -404 306 260 -567 -651 486 197 -645 -284 279 228 -291 -182 365
2760 365 382 -261 55 494 57 -62 -9 81 178 -308 -56 13 -252 -74 56 -401 -120 233 172 -99 -403 245
2782 245 670 -241 -179 428 320 -111 -387 183 527 -318 -529 342 109 -459 -341 140 266 -419 -548 525
2802 525 506 -526 -344 525 381 -134 -241 440 511 -418 -175 409 -24 -439 -409 114 92 -530 -371 288 -20
2823 -20 -367 -19 201 317 21 7 381 121 31 248 2 -128 186 -70 -317 -289 -138 90 -176 -432 119
2844 119 257 -183 -208 196 413 -43 -332 465 479 -282 -242 300 320 -361 -384 257 352 -633 -522 276 234 -407
2866 -407 -410 295 405 -325 -199 600 421 -245 -115 419 409 -153 -329 438 99 -355 -305 -22 12 -266 -279 36
2888 36 65 -308 -5 26 53 208 138 34 295 151 191 -7 -128 137 153 -396 -167 155 18 -374 -481 103
2910 103 357 -337 -261 389 279 -136 -233 381 501 -244 -237 782 290 -318 -299 192 330 -494 -679 346 322
2931 322 -591 -347 308 341 -223 -299 300 521 -310 -75 358 396 -81 -291 232 381 -256 -462 119 100 -300
2952 -300 -226 -199 213 43 -200 41 100 220 134 -27 105 328 121 -75 25 120 99 -141 -206 227 -20 -314
2974 -314 -90 37 29 -226 -207 266 196 -266 131 387 278 -25 -34 338 373 -325 -266 367 193 -321 -431 203 116
2997 116 -351 -173 254 -54 -181 -132 331 304 -63 -83 341 352 -15 -127 112 158 -83 -390 -71 179 -206 -166
3019 -166 -90 -98 12 -24 -28 197 -122 -39 129 -3 261 88 109 127 177 -25 202 -107 -196 -38 -184 -85 -145 -233 -162
3044 -162 -124 34 65 -120 101 212 -18 20 169 61 50 110 -169 196 -15 -225 -74 -104 -212 -66 -241 -20
3066 -20 98 -291 -59 176 -5 -11 -67 83 212 13 116 126 91 -48 -48 -116 59 -154 -227 109 27 -235 -74 -91
3090 -91 87 -84 -131 156 176 -81 165 233 144 -31 -75 175 221 -235 -264 170 -83 -38 -201 -51 63 -83 -124
3113 -124 193 139 -16 146 86 103 42 -121 250 223 -150 -87 -190 -190 30 -251 -113 -112 -191 -40 -71 -125 73 12 -23
3138 -23 120 6 201 245 -136 15 294 -135 -77 119 -174 -83 -213 2 149 -335 -97 96 69 -24 -34 231
3160 231 448 -78 -53 280 162 -38 -61 57 175 -84 -361 175 49 -262 -211 -93 -18 -66 -114 67 25 -33 -48
3183 -48 335 138 156 4 51 231 -49 11 19 -104 -46 35 -100 -191 26 -155 -87 -268 -40 170 -35 -95 217 160
3207 160 136 25 39 301 19 -129 241 120 -251 -164 48 202 -341 -392 136 107 -380 -91 118 112 -21 -142
3229 -142 232 330 -166 -28 341 -9 -187 -193 54 110 -280 -192 133 -116 -298 -35 192 73 -82 -13 263 195
3251 195 -179 184 190 18 44 84 219 -102 -184 79 11 -323 -125 144 -36 -326 -154 121 184 -155 150 130 -109
3274 -109 -26 162 156 -30 -178 157 362 -313 -121 50 -12 -170 -265 0 126 -181 -141 266 184 -111 125 202 212
3297 212 -54 -97 448 172 -332 -5 165 -26 -278 -256 89 -45 -338 -69 189 -148 29 96 53 134 -135 159
3319 159 325 -13 93 265 24 -47 3 49 -13 -321 -30 94 -328 -225 115 -2 -224 -67 47 349 -106
3340 -106 -147 304 247 -61 151 124 133 -142 -373 166 127 -453 -242 131 -56 -137 -281 182 46 -121 129 359
3362 359 156 -116 77 188 95 -213 -13 175 -9 -229 -52 -81 -5 -78 -190 58 -117 -66 30 -80 -16 155
3384 155 -12 -41 48 -23 37 -72 -172 140 33 -251 -36 56 -56 -259 -112 165 29 -312 -18 194 -49 -90
3406 -90 -165 408 355 -190 -26 453 130 -441 -110 176 55 -254 -249 191 55 -189 -100 100 14 -68 -168 287 183
3429 183 -116 89 170 82 -73 -11 69 167 -175 -25 -5 62 -78 -187 -171 -11 7 -91 -25 -104 100 24 -62 195 192
3454 192 -5 109 120 104 100 -290 62 86 -127 -270 -96 161 -5 -304 -202 219 28 -188 25 233 131 -115
3476 -115 -85 330 155 -197 45 113 48 -217 -97 91 46 -225 -36 86 -4 -73 -44 120 198 53 -79 206 241
3499 241 56 5 109 92 93 -172 -22 -45 27 -97 -119 -27 49 -101 -108 -28 60 -84 -96 34 277 -34 -99 184 145
3524 145 3 -78 -119 152 -78 -328 -152 114 -137 -189 -209 15 27 -124 -44 169 42 -23 52 139 105 -19 -78 53
3548 53 19 -148 66 -26 3 -71 -212 50 16 -40 -41 -2 116 116 -90 2 120 54 100 -36 122 75 48 -102 61 33
3574 33 -35 -43 -15 -7 -57 -288 61 42 -70 94 141 122 137 -71 118 136 -29 -154 76 26 -63 -122 -114 114 -104 -197
3600 -197 -2 -125 95 40 -68 89 33 135 131 151 79 203 81 21 41 -157 -83 15 -114 -20 -182 11 143 -100
3624 -100 -242 171 172 47 -84 -11 267 93 72 78 216 -60 -83 49 -112 -18 -277 -67 67 -120 -186 28 -74
3647 -74 -33 -75 -19 96 33 -9 109 88 50 5 113 111 44 -155 -114 -79 -119 -9 -110 86 -115 -180 2 57 61 75 1
3674 1 41 257 66 35 61 142 61 -100 -104 43 130 -197 -22 -62 31 30 -162 39 137 -120 -51 254 111 -11 -48 131
3700 131 290 -140 -159 110 61 -70 -150 -54 94 -97 -182 48 37 -97 -24 74 77 33 -99 173 149 -93 17 144
3724 144 -31 -17 -29 74 104 -334 -14 37 6 -88 -66 39 51 29 -35 110 76 39 36 143 127 49 79 57 -209 -115
3750 -115 -4 -68 -90 -5 18 -132 -70 4 44 -76 -142 93 95 -15 30 124 152 -7 -102 132 76 -101 15 82 -65
3775 -65 -23 -73 -56 61 -146 -39 104 -34 35 188 100 -13 19 39 212 21 -10 155 27 -11 -73 -104 116 -1
3799 -1 -218 98 -5 -59 50 -65 77 89 28 189 140 -1 110 164 12 8 -73 14 31 -194 -21 52 -199 -29
3823 -29 67 -49 -39 -1 154 173 -6 -3 193 83 -63 59 18 74 -74 -46 -21 -15 -181 21 -2 -111 -11 -108 -79
3848 -79 85 -161 69 95 42 48 78 76 56 12 40 89 -58 -138 21 -127 69 -24 -185 5 -16 -7 84 -25 -11 151
3874 151 -75 87 63 75 206 -41 -81 112 21 -1 -142 17 24 -206 -221 88 54 -113 -26 112 -6 26 -154 28
3898 28 163 17 74 -51 13 28 -34 33 90 -79 -105 -10 -43 12 -183 -21 116 60 -33 88 8 29 71 8 190 69
3924 69 7 120 -88 -99 38 -237 -41 67 80 -63 -5 -4 158 104 -80 88 72 -16 159 103 30 -32 -131 62 108
3949 108 -4 -55 -9 -16 -34 -34 -82 144 -50 -170 152 -110 11 -70 75 137 -20 -73 199 121 -36 -22 -1 23 0
3974 0 -53 -24 -50 -64 2 1 -1 83 -149 59 -39 13 117 56 -105 6 120 -96 -43 -61 54 -61 -124 17 90 -77
4000 -77 -11 -46 158 30 -110 8 49 -12 45 113 -67 27 72 19 146 -7 -96 83 6 -95 -170 -46 -34 -23 -105
4025 -105 100 68 -21 78 36 58 -110 25 162 68 11 -38 67 -31 46 -62 -151 -56 -80 -50 -42 -22 -9 12 5 91 55 22
4053 22 135 -7 -37 62 -17 -57 64 0 16 -61 40 5 -157 -20 -104 64 -15 -1 33 -85 114 67 18 121 -25
4078 -25 83 -15 18 105 -40 57 141 -64 -16 -31 42 6 5 2 21 68 -35 75 -105 -51 157 127 0 86 -34 83
4104 83 -30 11 -17 174 65 -92 -267 -6 -16 -61 4 20 -30 -49 45 61 44 -27 -24 207 16 48 53 -91 -28 -120 -29
4131 -29 -35 -64 -33 57 -192 7 -32 -41 78 91 32 41 -35 13 93 -57 72 -1 -64 -76 -64 -17 -70 -44 -68 53 35 -50 -101
4160 -101 44 1 -48 -132 16 161 80 -85 105 82 17 -1 -30 -13 -80 -68 52 20 -9 -62 -6 11 83 -108 47 63
4186 63 3 -9 -96 144 59 6 16 1 -25 -45 -78 146 13 -97 -100 40 -59 -45 106 52 -56 7 11 -73 -38 206 20
4213 20 -98 61 -20 -46 -14 84 -9 -95 -62 -54 -4 -76 31 71 -82 47 -42 -11 64 98 29 24 25 34 7 12 -22 -23 -139 -117
4243 -117 -140 -45 -64 -106 -53 -10 -13 97 32 -15 66 28 108 6 -11 -19 72 113 13 -58 8 13 23 -55 9 -158 -50 -14 -67
4272 -67 -36 93 44 23 -63 14 -37 25 -111 63 -1 -153 78 -81 19 -32 -107 -77 8 -56 -7 153 58 129 -58 -46
4298 -46 53 46 -43 65 55 21 29 -36 79 -44 -90 -93 -20 18 -36 -53 -69 60 -25 -2 -16 127 -2 29 -15 71 82 17 -22
4327 -22 0 -59 -43 -8 -61 -34 8 64 -31 -77 -7 -52 -67 117 -22 51 28 74 77 -11 -127 22 -9 -99 -27 -6 -122 18
4355 18 -164 -17 -29 -118 -24 72 -44 118 82 -75 141 75 -43 63 -100 36 -5 40 51 -120 -65 21 5 -146
4379 -146 31 38 -13 -65 12 80 101 45 75 120 128 39 92 125 93 -145 72 -7 -1 26 -87 46 33 -16 -21 -25 56 32 18 54
4409 54 15 123 -24 13 -1 -117 21 37 113 -13 -37 -85 15 16 50 28 -11 189 -104 -4 22 -113 -4 35 30 70
4435 70 41 66 66 -37 -11 -67 -29 -21 -18 59 11 -55 -94 -27 49 32 82 -89 -152 43 -33 -86 20 78 17 -199 -12 -31 56
4464 56 -90 -73 -88 -88 101 -56 -24 48 -57 25 33 -18 54 -1 55 53 -46 -103 26 -11 5 -6 -153 82 46 -85 -32 2
4492 2 -8 -48 -52 33 -68 -49 44 44 -22 96 89 -12 -11 47 -54 -139 -35 -15 -52 -149 6 -53 18 76 66 66 163 40 45 95
4522 95 15 111 -58 -40 125 12 -78 27 178 -132 -66 40 -14 9 -34 -62 94 -50 12 -52 -67 40 -93 -31 89
4547 89 81 -63 -19 -16 -114 -109 3 -4 -70 -58 -20 -32 20 30 5 -118 42 -151 94 8 10 104 -54 -7 -29 -62 -62 -42 -140 -33
4577 -33 -56 11 -54 -125 8 -8 19 50 67 30 117 152 21 -23 40 52 111 -73 -9 -30 -76 30 53 21 -80 -148 -85 11
4605 11 -30 -37 -47 36 59 24 -65 113 62 -26 4 87 -64 53 -2 85 7 -69 -65 -76 3 -48 2 -99 70 -12 15 8 -26
4634 -26 1 38 38 73 34 29 -28 -6 -38 27 8 -169 81 7 -3 57 38 56 38 -100 -100 146 35 101 9 -27 48 -60 104
4663 104 -3 13 -41 -113 86 -33 -72 -132 -65 -4 9 -91 84 71 95 -82 76 153 -33 4 85 -46 -16 -18 -27 -30 39
4690 39 8 -19 15 26 -87 -19 -44 36 14 -17 76 -29 -107 -11 31 113 -42 12 9 -108 57 -119 -28 -48 -61 31 34 -18
4718 -18 99 -20 -32 159 -9 32 -47 5 96 50 78 21 147 6 136 -73 -6 -19 -63 -37 -39 -13 -90 19 28 158
4744 158 -156 -28 14 64 -57 -49 -98 -10 -41 21 32 -7 -123 -49 -102 -22 82 -81 -87 16 4 -21 63 37 69 43 -9
4771 -9 -6 120 130 30 -22 66 -69 -80 -68 42 17 5 36 13 -6 9 -17 32 117 -32 48 -12 107 23 -148 -54 -4 -120
4799 -120 7 86 -85 -117 69 38 -60 -68 -78 -30 60 44 42 19 -27 27 53 -13 7 -29 -73 82 -72 69 -47 -21 -89
4826 -89 -13 50 4 74 124 -63 28 8 66 -6 -43 122 43 3 -21 24 -24 -11 -4 -66 -130 3 -59 -35 90 -19 -40 9
4854 9 3 51 0 9 43 61 24 -35 -4 -99 -5 -8 54 -18 7 -125 -73 -27 -38 13 -30 31 0 99 -123 -25 -71 -90 70 -26 -50
4885 -50 7 -64 -84 -21 -46 -19 89 -8 26 -37 23 65 49 -42 -6 60 -60 53 72 121 -7 -43 94 -73 -61 -7 -49
4912 -49 7 -55 6 -82 -41 -95 87 -61 5 -84 -62 -31 103 37 -6 -4 -35 24 -39 -28 11 0 6 11 -13 -75 23 84 -58 60
4942 60 8 149 52 -41 114 -37 28 -20 -33 -7 44 65 -146 -52 -7 32 -39 -143 -63 -64 -37 31 -74 58 28 -15 23
4969 23 42 -65 -64 43 34 66 60 -119 -9 -73 -111 -49 -8 26 -46 -113 94 32 13 58 -105 141 79 34 -87 -17 -80 67
4997 67 -14 -2 43 44 71 14 8 -38 44 -55 -104 62 -55 -3 -5 -43 31 -62 -28 76 12 15 -140 0 77 -42 -82 -10 2
5026 2 18 24 87 62 92 74 -31 43 9 66 -51 -17 -16 -70 -76 29 -6 -6 -71 -69 -18 22 -58 80 -17 14 -53 21 101 -7 8
5057 8 69 92 -41 56 -89 -58 104 54 60 27 38 -45 48 -27 -49 24 -34 27 6 37 82 -28 111 18 -107 28 101 -5
5085 -5 62 64 14 61 -54 -48 32 -30 6 -44 43 51 -30 -30 29 29 -77 26 -21 -42 70 -85 -105 -12 24 -13 127 72 69 48 25
5116 25 38 44 -45 -18 44 -3 112 -79 -6 -14 43 111 66 -25 -67 -84 -40 16 15 -58 -62 -9 -37 -29 -35 16 43 -48 112 -8 -35
5147 -35 47 41 3 -13 12 104 -26 43 56 -22 -68 -39 48 -56 -31 -43 81 -79 -19 81 -67 -38 27 49 -13 -28 -23 -81
5175 -81 -25 -6 -32 43 -63 -109 -28 -16 4 -46 -15 -37 120 93 -40 103 -30 15 -20 -64 6 0 35 -78 17 50 -124
5202 -124 6 -150 48 -48 29 105 22 -30 40 74 54 -48 44 110 8 -29 -24 -8 -15 -19 157 -171 -25 -2 6 141 -67
5229 -67 70 107 -49 -17 96 -83 -71 -75 42 95 -19 11 -56 -83 -45 16 -101 104 -118 61 98 119 79 -22 -15 0
5255 0 18 -22 -73 -82 15 -6 -6 63 8 -54 -115 -29 -46 -83 -48 5 50 -75 1 69 73 -78 -15 193 75 114 5 -9 23 -124
5285 -124 -58 97 -4 -44 -24 -29 -84 -24 -62 25 -29 -64 58 -83 37 -29 129 -153 72 11 51 -44 -49 5 29 42 51
5312 51 3 -38 44 -48 69 -20 -5 -82 29 25 -97 -29 66 112 52 -79 -13 -15 -57 -85 -98 115 37 98 -29 -6 34 47
5340 47 -40 7 8 5 21 67 -58 115 0 37 59 -2 -54 -30 -17 -58 -23 34 -5 2 148 119 3 13 38 -35 56 69 59
5369 59 55 73 13 12 41 -35 -25 97 -54 -31 32 67 82 135 -51 44 22 20 25 2 33 -113 -1 25 37 -82 -10 28 -26
5398 -26 24 -34 -60 -52 58 11 -53 -119 39 -29 48 53 83 117 4 -36 56 -56 -51 72 8 -69 26 3 8 86 -98 -74 62
5427 62 -27 27 39 -26 -15 -81 -20 -24 20 53 2 32 48 -17 53 26 7 76 34 -112 19 19 39 36 62 -43 0 -141 -82 -21
5457 -21 62 66 15 -57 45 -23 55 -46 -21 33 -33 -59 -125 86 20 54 -36 12 95 8 -44 8 -27 -76 -34 23 -41 -24 -5
5486 -5 -57 7 -34 71 -9 -59 -20 44 -12 -87 -155 -30 -31 80 93 -61 -45 -12 34 -61 -9 -29 -80 64 70 29 -58 -84 37
5515 37 -129 43 -104 59 -134 60 16 101 73 70 -7 148 8 28 18 31 73 11 19 -43 73 43 31 50 37 64 55
5542 55 102 91 191 5 -79 36 -7 68 45 -86 -88 22 -41 -30 -79 50 -14 -5 -42 27 -1 97 14 157 45 43 41 52
5570 52 23 -37 49 -52 46 36 -89 20 35 -62 -123 17 -2 -10 -49 -67 67 40 60 -130 66 -27 6 23 -201 43
5596 43 -79 -38 -1 79 25 5 53 132 -35 108 30 134 48 114 113 -85 108 42 119 149 5 13 -47 90 -29 17 -20
5623 -20 46 -19 -37 26 42 -81 7 6 91 -45 30 0 43 61 -58 17 -117 91 -35 62 -88 5 -52 -38 -44 126 -75
5650 -75 -24 -52 -39 -43 -81 -6 10 -57 15 60 -11 -14 -39 46 18 -16 -47 21 83 105 97 -47 -37 -43 -39 38 26 38 117 -61 -45 9
5682 9 -28 133 -65 -37 -91 -5 -49 -62 68 11 5 109 21 61 -14 -39 92 -34 20 -10 12 52 28 -30 -8 95 -56
5709 -56 -32 -24 -54 38 8 40 143 4 -38 22 -7 74 0 73 -31 -42 79 20 -103 -68 -13 21 -48 24 -123 -4 50
5736 50 -53 -35 -46 32 -13 -84 112 103 0 41 -37 16 -67 -54 51 -53 49 -14 -60 47 54 -21 58 -19 -23 25 105 25
5764 25 -55 -32 36 49 -10 65 71 102 52 11 -5 150 -22 45 -28 142 -41 68 41 35 0 -17 4 57 2 25 82 -6 101
5793 101 -25 -17 1 -57 164 7 5 -129 77 -59 -71 70 167 56 -79 -79 5 -86 -79 20 -95 18 -43 -55 -18 -60
5819 -60 -22 -86 76 -22 45 -89 29 -9 -60 53 81 -20 31 -84 12 -92 -22 -68 7 -67 -14 1 -37 41 42 9 21
5846 21 84 -11 -71 -82 72 -90 -116 84 -38 24 7 152 78 70 2 103 -9 71 39 -58 0 -102 -9 37 130 94 -21
5873 -21 100 -26 23 52 -22 12 122 101 40 87 -64 95 -74 77 -5 -45 4 -99 48 107 -94 -108 -82 48 30
5898 30 -66 -105 69 -73 125 -34 58 111 19 64 -12 -122 -73 9 -48 -36 2 24 -44 76 33 -46 -42 52 25 66 25 -110
5926 -110 -81 -20 -27 47 13 61 37 30 20 -19 -159 -157 61 -8 -12 -67 -45 9 53 -86 -33 10 48 28 -65 1 39 29 26 -91
5956 -91 94 -137 27 39 31 -34 -25 18 -109 95 65 0 55 105 -52 158 -69 128 -11 60 -4 -118 -83 -85 -17 -35
5982 -35 2 81 -60 128 140 3 -18 33 -12 39 0 -16 20 2 -4 -129 22 35 -26 -35 -59 -86 61 45 79 19 -17 29
6010 29 58 50 -71 31 -75 17 57 30 -15 -124 -70 -97 -75 23 -1 23 -34 59 10 38 58 -81 -8 -28 -42 7 -1 60 -57
6039 -57 46 13 -18 -53 -112 69 -9 45 -9 -101 25 -64 -29 61 -18 -18 94 11 -51 47 97 -25 -16 -168 52 -60 -1
6066 -1 -42 -35 26 -103 -70 -19 86 -2 -66 -101 -33 53 2 108 185 50 41 -27 14 -30 38 -25 10 -26 -112 -30 -25 -59 -68 -28 -21
6097 -21 -142 -26 8 37 -71 30 -65 19 -12 -67 3 58 80 -65 -35 21 -41 -17 -42 -51 -75 55 -53 -20 40 36 88 139
6125 139 26 -3 155 -57 39 -2 63 10 -97 8 -30 -24 -5 -14 -26 88 83 25 3 -126 -105 -25 -16 -76 55 -1 104
6152 104 -11 69 10 98 -27 -129 -52 -55 55 -14 -49 -41 41 -21 -32 17 -86 15 114 -19 6 58 -1 -82 -16 -53 39
6179 39 50 80 -40 -95 38 -44 80 -72 60 -60 -64 61 -50 -2 -34 -6 -29 29 -143 -63 30 -14 -29 64 -3 -1 -14
6206 -14 -118 -27 41 -6 69 35 152 42 31 -10 89 17 -94 97 -33 -25 15 -60 -11 46 63 -10 18 -73 25 -134 47
6233 47 61 69 -76 94 76 46 84 -11 -104 -33 -126 53 92 15 12 110 26 -146 -19 -49 25 35 -80 94 39 -23 39 -27
6261 -27 -65 11 52 -72 39 -47 88 42 -97 -62 45 -167 64 102 -157 10 15 -111 99 94 -39 49 -28 48 21
6286 21 32 -53 -13 63 -18 53 -96 64 -94 105 91 -2 79 28 -35 -17 -30 -67 -23 41 51 29 60 -70 24 -23 61 -10
6314 -10 -35 -78 72 -93 -97 -31 -63 1 3 82 -4 -42 36 -82 -45 -16 -16 5 -24 -43 -35 -55 -4 -11 -4 -142 22 11 -54 -44 -67
6345 -67 64 33 13 24 38 -4 -73 -27 -8 29 9 -18 1 -66 45 -51 -33 7 -17 -42 25 -111 -29 -46 22 62 136 -43
6373 -43 -55 69 -52 43 47 6 -9 -56 31 87 57 7 -72 46 -14 -93 -87 4 78 38 -3 88 -126 5 76 -56 -86 69
6401 69 51 -26 -34 38 32 -115 -24 -109 37 -11 65 -15 -35 -26 51 53 -8 100 -34 -23 104 -123 69 -65 0 92 38 -37
6429 -37 -27 -63 -14 89 -31 -14 92 -46 18 30 -2 -13 -76 -15 -26 23 82 170 -133 -33 -37 7 21 -1 109 -29 83
6456 83 22 32 91 13 74 134 98 56 -34 13 68 -72 44 7 16 81 104 -69 -81 30 10 -40 12 -32 5 63 -34 41 62
6485 62 -25 31 24 17 33 -13 41 -78 38 31 -26 -49 -52 88 -16 -45 -46 -65 -5 -38 -89 72 -80 -25 -9 49 -57 21 25 46
6515 46 -28 23 -152 -2 65 -52 -5 -47 -37 3 20 27 -17 -90 62 -27 -144 -26 -17 -68 104 -26 95 -7 -133 -67
6541 -67 -22 -11 64 77 -66 -65 50 93 16 -113 -7 104 86 -8 34 19 -3 10 43 29 -10 88 98 -84 59 -90 -56
6568 -56 44 73 -120 -79 1 23 -8 -138 15 12 -76 74 21 -68 -1 63 44 -60 35 -13 70 87 -83 -10 -6 51 62 64
6596 64 -15 52 -82 -74 -42 -18 106 0 7 55 23 67 10 22 5 -9 -44 9 24 -15 94 -16 79 65 54 -119 -78 121
6624 121 -4 -80 4 -35 -28 -34 148 -10 32 47 117 38 -35 38 20 58 15 129 53 2 5 -47 -5 90 -68 98 44 114
6652 114 -37 -90 51 52 32 38 4 -53 63 23 -14 48 -31 -61 -45 34 -43 79 23 -50 57 43 11 -43 16 -6 -60 -58 27
6681 27 74 82 104 37 -81 -52 19 -137 -4 -63 -22 16 -146 -69 24 21 -57 -39 -4 129 76 1 68 -2 -67 -119 44 129
6709 129 12 -154 -24 95 -19 91 120 -12 5 112 -27 -67 -38 22 -46 35 52 69 53 11 22 58 -45 38 3
6734 3 35 -75 -115 -42 -106 -13 -47 11 -3 -49 35 75 64 35 -17 44 -45 -45 -53 25 -90 8 37 -58 26 -75 -13 -71 -106 43
6764 43 72 62 78 100 -31 10 27 -7 30 37 15 -168 97 -93 -5 9 -7 -9 -18 -24 -67 -7 -40 20 36 45 12 85 14 -36 101
6795 101 86 51 29 22 3 50 -18 25 87 -13 -2 -135 -44 -6 80 -60 85 -103 -20 18 63 58 -47 -22 -2 10 -15 78
6823 78 -89 -44 -44 16 37 49 -9 93 -13 38 61 -60 -80 -74 127 55 94 -92 6 -82 -60 -7 40 5 41 100 77 73 -87
6852 -87 126 95 -65 25 1 5 0 -43 63 15 30 5 23 -141 -38 4 -15 -10 -25 37 -13 30 38 -14 55 97 1 52 -6 76
6882 76 -41 144 -24 -58 40 -8 1 6 -50 0 -55 45 61 36 -26 -4 24 64 53 50 -31 79 88 -14 16 -41 117 -52
6910 -52 49 -99 -2 -14 -17 -14 23 -105 14 -9 73 13 19 57 31 8 -28 34 -62 -16 99 -98 -79 -45 32 35 46 -10 86
6939 86 -20 -34 -69 17 -4 102 -77 22 7 -75 -92 -44 -10 -71 -28 -137 58 31 99 40 53 -44 68 94 -20 -57 29
6966 29 22 85 77 65 -6 2 -14 -7 83 7 64 -77 -52 26 24 64 12 -113 -8 57 -12 -75 54 46 -25 47 -36 40 61 35 104
6997 104 18 -1 24 -3 148 -1 4 -61 17 31 30 -25 30 13 77 73 63 40 -27 -6 -16 -4 1 13 -54 -14 -69 -66 -65 -140 -80 -58
7029 -58 0 1 41 64 77 62 87 17 36 -47 5 108 -9 -114 -16 -99 -25 68 2 41 -30 -73 -77 -14 102 61 48 15 -35
7058 -35 43 -70 4 25 102 22 -4 -9 -4 -39 24 -22 -153 -47 72 36 66 -50 -65 97 54 -82 2 -95 106 -41 12
7085 12 -9 -105 40 11 48 -88 -65 97 36 34 62 -88 -51 -65 -20 -26 -1 48 123 -9 59 -22 102 110 19 -110 -27 -89
7113 -89 50 10 -26 96 -39 49 64 40 30 -26 -126 23 79 58 110 7 -11 55 -104 9 65 28 -46 -33 34 30 1
7140 1 83 -67 124 -5 -48 -42 -69 61 66 187 -35 -54 -83 -92 33 31 10 -111 107 34 -68 21 -120 10 -51 -57 93
7167 93 -3 -108 1 -27 121 -91 -93 -8 -91 49 -29 -43 175 15 -9 -101 67 -20 49 108 -38 1 -6 -33 31 31 -63
7194 -63 5 70 14 -20 127 -29 -40 3 -71 39 -74 -41 18 -57 100 -2 82 7 14 87 -35 9 19 67 24 9 17 -115
7222 -115 32 1 26 146 -34 13 31 -75 -45 75 48 -8 -61 -117 -79 109 45 -19 -3 -44 79 34 -34 66 8 73
7248 73 -37 -9 -68 5 -7 84 40 54 57 57 94 4 33 50 -7 15 -33 -51 38 -43 -77 39 68 -107 -53 -87 21 106 -7
7277 -7 -7 7 55 -46 -12 -89 -20 40 -32 -29 95 2 44 -105 -53 -20 -49 27 8 54 -25 25 -25 -95 131 -17 -23 3 -43 75
7307 75 25 63 49 -53 -40 12 51 -101 -10 -57 -7 -39 19 11 -22 -53 3 24 -19 -44 -59 72 -90 54 8 36 -30 27
7335 27 -8 -58 24 -53 -8 106 -12 10 44 41 11 40 19 22 142 30 -105 80 27 -42 -25 -54 52 47 -27 -91 -38 5
7363 5 -6 116 28 13 29 -118 -21 -5 -11 -161 18 62 -48 14 8 -59 -27 12 75 15 -23 -31 -130 27 38 17 19 -23 33 -43
7393 -43 41 -33 60 25 4 26 76 74 46 27 -33 34 29 40 33 16 -41 -50 -2 88 -116 -43 22 -85 132 -100 25 -56 -114 47
7423 47 33 -29 -2 -15 -131 70 -18 -48 145 -68 89 38 -35 67 99 -70 3 -15 -15 20 85 7 -29 -85 36 -19 -68
7450 -68 -17 24 -61 -110 5 -87 127 -84 -26 110 41 20 111 87 54 15 -72 6 13 62 74 61 -33 100 42 -12 -38 119
7478 119 150 20 -67 61 -89 111 -31 14 54 68 -114 23 25 145 10 20 129 -132 -134 -14 83 -129 -38 90
7502 90 -53 19 -78 -58 -25 -104 52 147 -16 49 -20 -19 -77 34 -108 -106 8 -75 36 40 12 -88 79 76 24 25 86 109
7530 109 -55 -73 -54 -65 -12 -30 -38 -10 -166 63 -45 -64 -46 1 -106 -111 0 12 -81 96 23 -22 8 46 59 -131 67
7557 67 62 26 -133 69 0 27 -150 -24 55 0 14 79 41 92 -40 -53 -37 -17 23 -88 33 16 -156 64 -44 -93
7583 -93 -115 26 112 22 26 29 95 -148 -24 92 66 88 4 96 7 49 -161 77 -4 -67 144 67 50 -65 18 5 73
7610 73 14 6 46 67 30 -16 -39 78 -77 148 92 51 -25 -73 73 108 -11 -3 -45 42 -33 -56 -88 -71 6 -187 36 29
7638 29 15 97 0 56 -26 -8 -157 -1 61 -24 74 -38 -139 34 103 85 -117 -53 1 19 78 -5 -28 -88 -12 -38 -19
7665 -19 77 -24 -24 58 19 -129 -9 48 112 49 -30 -66 -82 -52 -97 -36 28 -13 20 97 -1 -18 -19 33 -21 -16 -55 -37 -12 -74
7695 -74 76 -142 -3 -34 -97 -85 -61 85 66 -6 -59 -18 36 5 77 9 -42 85 -28 -15 -2 -4 8 -75 34 3 -85
7722 -85 -85 -14 44 29 174 83 -29 10 26 24 175 20 60 -19 -37 34 -87 -37 17 44 -23 30 63 39 -36 -82 42 -70
7750 -70 -26 10 10 15 51 12 35 81 -35 43 28 -97 -30 -22 -105 21 -130 -150 -51 -3 43 -29 -52 87 78 -16 15 56 80 55
7780 55 16 -85 61 14 55 -30 -15 13 50 -10 -33 -62 41 37 34 43 10 -15 -110 45 -22 -5 -23 82 -57 -35 27 -43 -3
7809 -3 23 3 7 123 32 148 -33 56 96 6 26 48 81 28 43 53 36 98 73 71 -34 107 -11 -42 36 -77 101 -39
7837 -39 -82 -25 67 -28 75 5 -34 21 -42 -9 -47 28 23 41 68 -16 -81 -112 31 -8 24 -54 -58 130 31 -21 115 111 -23
7866 -23 -97 15 29 -197 14 -11 9 86 -26 -105 135 -76 -74 18 19 62 73 -49 33 57 -19 -40 116 67 -97 28
7892 28 10 118 -36 46 21 -29 32 -41 -53 86 4 -38 -22 -49 -23 30 -6 17 0 80 0 -22 -29 -106 63 -33 -81 105
7920 105 13 -35 38 -20 2 -80 30 28 41 -26 43 -6 -21 12 -83 -2 -45 -33 -57 -41 11 -20 -80 41 81 34 -4 -55 -10
7949 -10 -75 40 -5 -93 -58 97 117 74 35 -55 4 -148 29 46 -46 70 -61 -19 121 9 9 -3 -32 27 29 -2 -17
7976 -17 64 12 -49 -109 6 -35 -42 -81 12 -9 -31 -37 3 -25 -34 24 3 -4 -40 33 26 59 32 -46 -20 -23 55 -117 -53 -15 51 52 -122
8009 -122 -18 54 -66 26 -19 56 -31 26 -92 110 9 11 122 -30 15 0 -62 -83 -31 50 -3 -37 -146 106 1
8034 1 90 -22 -53 27 26 23 36 -51 17 8 52 50 -26 -12 -49 19 -62 -27 -49 103 -76 -92 53 -9 -8 -44 74 -26 -63 -11
8064 -11 26 -12 167 14 36 18 -56 -1 19 -124 0 -57 71 -121 -14 51 -49 21 24 -105 -33 44 68 -34 23 44
8090 44 -7 40 -10 63 -61 -106 -80 59 78 22 -31 -80 -97 -53 120 -49 48 -31 51 47 79 -88 -16 56 33 60 -35 92
8118 92 37 -85 6 -102 -106 -25 -48 35 -34 -23 -24 45 -71 76 0 60 28 -50 20 -18 -26 -60 -25 -27 -50 -138 13 -80 -36 36
8148 36 36 63 46 81 132 48 72 24 18 9 -73 -34 3 -66 56 44 -43 111 -35 -62 83 32 14 9 -8 -59 -69 -69 84 -88
8178 -88 -83 -102 32 -21 -125 -23 -65 -104 11 12 -44 60 15
8191A5
$$ Imaginary data points
##PAGE= N=2
##DATA TABLE= (X++(I..I)), XYDATA
0 0 0 0 0 0 0 0 0 0 0 0 0 8 -8 8 -8 8 -16 16 -24 24 -32 40 -48 56 -64 72 -81 96 -112 128 -144 168 -186
33 -186 215 -240 271 -304 338 -378 423 -472 522 -578 642 -711 784 -865 954 -1050 1159 -1274
51 -1274 1407 -1551 1712 -1890 2093 -2325 2593 -2903 3269 -3711 4256 -4945 5850 -7094 8922
66 8922 -11874 17432 -31540 144450 186800 -211127 -167085 107886 164862 -68613 -121905 22985
78 22985 99988 25218 -5664 -29133 -74623 -44121 89147 97349 -50847 -106346 37121 98926
90 98926 -30730 -112222 -10722 76746 40624 -12544 -13758 -36795 -52509 17013 69835 -11284
102 -11284 -75949 10539 91816 3156 -106368 -47402 68204 55316 -11139 -10670 2163 -16605
114 -16605 -3898 27786 -3366 -43998 20791 91335 5784 -102527 -31457 82489 23598 -78200
126 -78200 -4115 105206 15322 -115223 -33199 98869 26803 -95163 -19516 111378 43110
137 43110 -100971 -65034 57696 46151 -33515 -20447 29946 9222 -25983 -5376 1002 -33483
149 -33483 -8697 59701 35046 -53056 -46795 36513 35709 -40457 -31176 50623 44929 -29753 -32456
162 -32456 16955 8295 -28373 -253 44610 12284 -34425 -9132 19941 -9758 -27097 11667
174 11667 33895 729 -16752 7970 2749 -29093 -7463 35462 14893 -24959 -1900 31704
186 31704 -10969 -55703 238 59082 5590 -54352 -2898 57203 587 -73740 -22248 66197
198 66197 37677 -39541 -29879 24606 22186 -16891 -19687 3661 10878 16955 21061 -14080 -45297
211 -45297 -6549 44668 17742 -40828 -20965 44451 30430 -39771 -40083 18040 31067 -873
223 -873 -7032 10032 -1110 -18983 2727 19244 -9546 -21703 15683 33649 -6654 -40242 -12790
236 -12790 22322 10267 -8137 -913 2018 -4013 2270 6272 -12062 -21112 14374 42040 1965
249 1965 -41626 -12537 32594 13530 -28966 -15052 28619 20522 -18926 -19061 3371 3114 -3747
262 -3747 5728 11550 -3410 -10496 5583 7336 -12186 -8598 15380 15710 -5352 -9606 3909 446
276 446 -13704 -859 17522 2417 -16038 -1654 14975 -3339 -25195 -3890 26465 11526
288 11526 -16540 -8884 10921 5798 -9831 -5768 8411 7022 1208 2740 -4626 -13399 -2393 12293
302 12293 4927 -11312 -4640 14206 4991 -18133 -10590 12044 11600 -3404 -3697 6978 2354 -9736
316 -9736 -2152 8671 677 -4850 4436 8385 -4821 -14522 -2450 9511 929 -5427 2030 3775
330 3775 -2990 -4927 2 1672 -1661 3473 10584 264 -10624 -2225 7768 1982 -7635 -1648 10857
345 10857 3716 -11052 -6991 3443 2170 -2529 -534 4505 1848 -3735 -872 1060 -2722 1105
359 1105 7404 4010 -3296 -4112 2028 2494 -4985 -3059 5097 3167 -2624 -3253 -1583 -1664 -3294 1414
375 1414 6542 193 -5220 804 5214 530 -5441 -2598 7023 7275 -1139 -5109 -4794 -123 5415 1639
391 1639 -6048 -5589 3813 9510 -1626 -14405 -5492 11358 11194 -3156 -10816 -520 10465 4851
405 4851 -5523 -6722 259 8769 7085 -4093 -10623 -5868 6243 9658 -3403 -11786 -2517 9556
419 9556 7647 -6522 -12591 456 12993 8032 -5041 -9583 251 9511 3745 -5562 -5612 1100 6427
434 6427 2913 -4697 -6495 -3273 2835 6105 -30 -6463 -3359 4247 6221 -1395 -6722 930 6714
449 6714 2540 -1132 -353 -163 -3509 -2766 7157 7267 -9036 -13214 4501 16100 317 -20639 -9727
464 -9727 18680 17210 -9950 -19446 15 18046 9223 -9896 -10266 1273 9458 8836 -2440 -13849
478 -13849 -9107 9047 18170 -531 -23885 -12036 19187 20835 -10173 -27706 -2287 28434 15524
491 15524 -18155 -21374 6198 22940 6625 -15853 -11957 5529 12049 4922 -8020 -13244 -3218
504 -3218 11465 13103 -5688 -21403 -4235 21931 13385 -16977 -20211 11200 25664 -2299 -22620
517 -22620 -1839 18609 4857 -14193 -4674 13038 2373 -14803 -2529 13976 1985 -15916
529 -15916 -6444 15247 9929 -12683 -10910 8583 9901 -2709 -4825 2706 2370 -3901 2229 9428
543 9428 -3458 -15358 -902 18094 8327 -18934 -18836 12112 22989 -3447 -23788 -8163 19760
556 19760 17880 -9758 -19437 -702 16189 11422 -5708 -13290 -3803 8569 12008 1090 -16800
569 -16800 -14215 11418 22969 -1376 -29128 -13621 26275 24176 -17907 -29392 7041 31192
581 31192 5134 -25074 -10208 17563 11543 -7917 -7366 3213 1477 -4100 2521 6236 -7361
594 -7361 -11730 5934 14294 -2193 -16221 -2972 14924 6341 -10000 -5158 6849 5336 -2570
607 -2570 -2429 2941 475 -4728 944 6131 -454 -7636 -4784 4604 6578 -2801 -7936 -1727 5726
622 5726 6302 -1605 -7603 -1716 6665 6563 400 -6357 -4917 3792 7946 2607 -8755 -11157 5018
637 5018 15865 272 -18776 -10934 15069 17998 -9329 -20813 2300 19831 6177 -14069 -10154
650 -10154 8726 11635 -646 -6122 -4078 36 4767 4044 -3085 -8686 -2811 9108 6204 -8712
664 -8712 -9734 3476 9830 2096 -7030 -3830 4520 5046 950 -2737 -4020 1317 6204 2299 -4954
679 -4954 -6356 1367 6652 -776 -7240 -2380 4289 3796 -2578 -5128 380 4398 2443 -651 -2434
694 -2434 503 4473 1477 -3422 -2174 2782 3859 -2264 -5159 883 3191 -2128 -3940 105 3338
709 3338 143 -3433 240 3299 -405 -1428 1426 2787 887 -1731 -271 2153 16 -1350 -426
724 -426 -399 369 470 -1689 -2400 -1155 1835 2177 -2567 -2676 2818 3598 -679 -3092 -105 4623 2444
741 2444 -2488 -1500 947 1115 -73 -1870 -1152 330 -184 187 -847 -2516 -217 1141 610 410 -528
758 -528 299 1330 689 805 171 -1297 1016 2735 -168 -2726 -2355 1311 2303 -2450 -3388 1008 1954
775 1954 -224 -2501 -1484 2178 1823 -587 104 838 1030 1179 -584 -429 773 719 542 -1115 -1959 723
793 723 429 -2121 -1341 597 1404 -428 -2573 291 2639 182 -986 561 1793 1742 -659 -1134 893
810 893 536 -36 -182 -1209 -399 432 -734 -1287 -1547 -34 1948 -328 -1788 583 1529 762 -641 -246
828 -246 2027 1528 -391 301 -148 -958 84 551 -162 -1600 -1793 1254 1187 -2519 -2185 970 2143 976
846 976 -1505 -863 1680 1465 936 -120 -1573 929 2995 535 -2753 -2844 1339 2950 -1881 -3871 190
863 190 1873 -157 -1731 -898 1242 458 119 2126 506 -1754 235 2291 1526 -1261 -1920 1518 1457
880 1457 -1807 -1252 -297 -1256 -668 901 964 -1714 -3227 1671 4085 -698 -2814 291 3162 2281 -1084
897 -1084 -1514 16 264 2030 1826 -3287 -3963 1376 4252 -521 -6219 -2330 5627 2916 -3723 -2732
913 -2732 1340 2532 805 150 731 -1628 -918 4565 2701 -5089 -4632 3339 6057 -1985 -7955 -569
929 -569 5508 344 -3927 -1674 1583 1567 -220 771 813 -2092 -196 4032 1966 -1991 -2258 707 2762
946 2762 226 -2175 -1574 -1204 1176 2624 -1808 -4445 -600 3690 2401 -2640 -2399 2384 1822 -257
962 -257 1787 565 -3450 -1325 5686 4944 -6758 -9321 5209 10888 -3756 -12427 -972 10765
976 10765 3080 -9257 -3869 5751 2685 -1780 1127 1535 -3190 -2308 6897 5892 -8017 -8784 7288
991 7288 10775 -4421 -12971 -777 11094 2612 -9170 -4583 4205 4176 -558 -2696 -714 561 1731
1006 1731 3397 108 -3695 -679 3174 2333 -1142 -3410 -1385 2078 2159 -728 -4557 -3085 4432 4179
1022 4179 -4300 -4913 3192 5877 -2051 -5598 3565 6707 -3814 -5826 5056 7237 -5077 -9237
1036 -9237 4254 10221 -4567 -11337 2539 9129 -1940 -8631 1091 7358 -2144 -5594 4828 5557
1050 5557 -5798 -4957 7577 7708 -6960 -9642 6475 10244 -4797 -10295 1020 7733 542 -6256
1064 -6256 -2032 2621 398 93 1571 -1652 -2352 2555 4715 64 -4900 -671 5254 1899 -2590
1079 -2590 -1779 -723 1136 2086 -450 -3982 -3199 3602 5110 -4170 -6894 3533 7279 -1942 -6251
1094 -6251 1987 7360 -1230 -6145 2872 5794 -3494 -5150 3606 5223 -4571 -6752 4218 5583 -5670
1109 -5670 -5541 4964 4711 -4965 -4579 5674 5076 -5737 -3905 6889 4242 -5374 -3416 4991 3561
1124 3561 -4602 -3084 3886 804 -4223 -74 3143 -1414 -4069 1393 4932 -1968 -5136 2863 5399
1139 5399 -1461 -3809 1589 3844 -632 -2552 1679 1013 -3145 170 3069 -1572 -4489 612 4445
1154 4445 -1107 -5909 1119 5853 -1039 -4525 1718 4700 -707 -3761 2204 4277 -2660 -3158 3595
1169 3595 2382 -4144 -2997 3575 2450 -5134 -2998 4969 1805 -5260 -1322 4824 1572 -4064 -664
1184 -664 5262 878 -4587 1054 4762 -1340 -4214 1338 4314 -2256 -5641 1999 4591 -3286 -4698
1199 -4698 2324 3714 -2039 -3473 2595 3477 -2636 -1510 4007 1475 -3178 -581 3767 1012 -4335
1214 -4335 -1106 4171 -318 -4536 124 2915 -1082 -3301 935 3496 -1786 -3388 3130 3556 -2648
1229 -2648 -2479 3169 3336 -2169 -2850 2900 2206 -3382 -1402 2719 -8 -3513 -737 3252 -106 -4698
1245 -4698 323 4834 -722 -4019 1144 4163 -56 -3408 1290 4081 -1507 -3186 2278 2541 -2744
1260 -2744 -3025 2034 2415 -3145 -3244 2862 1759 -3243 -1258 2750 1448 -2362 -482 3636 838 -3264
1276 -3264 576 3589 -427 -3010 152 2748 -736 -3671 665 2528 -2138 -2780 1725 1995 -1868
1291 -1868 -2193 2292 3010 -2117 -1745 2886 1946 -1591 -986 1765 1030 -1974 -753 2126 -901 -2901
1307 -2901 614 1697 -1410 -2831 645 2931 -941 -2742 1688 2701 -1010 -1303 1525 2077 -1092
1322 -1092 -1387 2066 1271 -2746 -927 2158 221 -2848 -1238 2428 652 -3225 -641 2922 388
1337 388 -2080 71 2467 835 -1795 373 2634 -531 -2051 957 1436 -996 -2165 18 1752
1352 1752 -1112 -2525 658 1513 -734 -971 287 1058 198 -281 1119 607 -823 770 1192 -428 -778
1369 -778 50 723 -366 -1479 149 587 -1427 -675 921 140 -978 -575 1470 1270 -1429 -606 2135
1386 2135 1126 -990 -605 946 1145 -956 -956 895 -351 -1750 -197 634 -319 -1603 -717 1757 831
1403 831 -1692 -434 1484 1249 172 -968 458 1310 82 -388 -201 -490 188 -35 -796 -374 -659 -368
1421 -368 241 -171 -77 -271 -402 941 1135 -443 -362 555 1418 802 -1195 -767 1273 448 -1025 -947 -246
1440 -246 618 -740 -1243 441 253 -864 -401 641 1148 -311 -1122 1215 2080 -268 -1055 188 1611
1457 1611 582 -1722 -753 1281 -91 -1402 -527 540 -5 -1573 -478 1956 161 -2133 -127 2409
1473 2409 1396 -1513 -1501 2206 2294 -1476 -1641 607 1417 -261 -1755 -180 772 -899 -1070 438 287
1490 287 -808 -797 685 1770 -386 -1494 912 2125 536 -1202 -945 1668 1434 -1447 -1507 459 795
1507 795 -461 -1762 -275 1352 -781 -1388 634 1206 -125 -1213 422 2572 224 -2074 583 2386
1523 2386 324 -1830 -830 1929 445 -2658 -976 1762 54 -2111 -849 1730 1106 -2133 -798
1538 -798 2654 1168 -1584 -838 1743 1995 -1268 -1608 1543 1143 -1254 -991 369 575 -948 -1301 635
1555 635 586 -1274 -615 746 857 -134 -903 548 1745 243 -778 -73 759 991 -652 -1306 421 673
1573 673 -674 -1104 -500 637 -62 -1474 78 1203 -243 -840 327 1592 453 -1393 182 2116
1589 2116 184 -1632 -88 1386 352 -2005 -961 1550 9 -1944 -464 1080 269 -1231 -544
1604 -544 1731 698 -1212 330 1522 413 -815 -26 1209 451 -1346 -204 1103 -447 -1125 -486
1620 -486 327 96 -967 -423 801 19 -269 440 271 260 335 311 422 43 163 712 -421 -583 530 -175
1640 -175 -694 -583 81 297 -889 -736 1018 421 -1140 -61 1137 829 -417 -398 1532 925 -1146 -144
1658 -144 1216 -54 -1151 -476 798 171 -1874 -514 1290 -142 -1308 -132 1108 653 -740 -109
1674 -109 1502 275 -631 524 760 53 -538 -51 779 -383 -1189 63 147 -581 -393 -139 -11 -81 -175
1693 -175 450 186 -323 785 846 -281 -173 576 686 -88 -861 414 536 -1141 -698 543 -20 -1082
1711 -1082 -880 578 799 -1155 -540 1364 835 -659 -146 944 1038 -499 -493 1128 232 -1011 -195 594
1729 594 68 -1221 -894 692 94 -1346 -344 766 229 -194 -205 775 604 -335 219 727 -12 -54 327
1748 327 -69 -109 -531 -157 70 -714 -393 116 -420 -340 182 210 40 -137 427 1049 -102 -218 888 667
1768 667 -188 -363 32 668 -582 -929 295 127 -785 -638 -29 481 -258 -717 425 778 -406 81 605
1787 605 574 219 -167 299 609 -378 -398 261 -259 -431 -336 -360 117 -411 -430 212 -79 16 565 42 71 547
1809 547 312 322 -177 76 826 -45 -750 103 134 -338 -700 -504 502 -148 -1054 -75 708 -90 -388 29
1829 29 951 467 -586 243 1129 152 -577 -173 552 410 -918 -620 563 -116 -895 -416 48 287 -384
1848 -384 -535 594 597 -100 92 310 477 437 -330 76 473 -227 -232 -395 -152 263 -506 -833 201 216 -414
1869 -414 -389 -25 801 123 -726 428 1066 17 -471 79 974 280 -1163 -254 887 -234 -1116 -447 436
1888 436 294 -1187 -660 945 207 -860 -28 822 680 -332 -468 973 673 -585 -126 466 295 -372
1906 -372 -892 55 356 -695 -772 -59 151 213 -540 -290 727 362 -290 200 383 728 234 -597 362 694
1926 694 -518 -506 -40 336 -146 -1223 -216 805 -417 -1076 2 700 350 -660 -108 1450 414
1943 414 -675 259 818 355 -564 -606 746 362 -1050 -588 400 156 -616 -896 160 719 -644 -513 558
1962 558 611 226 -403 207 1126 163 -633 192 464 -50 -608 -656 544 63 -1143 -482 338 144 -460 -615
1982 -615 462 958 -497 -292 799 567 1 -384 278 826 -78 -690 164 314 -500 -674 -597 327 -50
2001 -50 -879 -97 382 192 -129 -144 610 817 -88 -199 562 436 20 -508 41 772 -260 -1058 -68 319
2021 319 -292 -964 -489 760 177 -1044 -1 994 273 -418 33 946 625 -791 -151 1128 35 -760
2039 -760 -254 506 120 -1064 -549 697 -101 -883 -89 372 239 -286 -154 777 307 -262 441 443 38 116
2059 116 -73 -9 -76 -321 -14 -326 -528 85 65 -513 -221 205 352 -110 -235 775 747 -491 7 999 325
2080 325 -486 -398 691 426 -1235 -561 959 -167 -1154 -405 555 236 -1025 -342 1183 304 -838 374
2098 374 1079 271 -536 23 1052 46 -914 190 610 -531 -559 -145 260 -220 -775 180 447 -592 -93
2117 -93 601 109 -135 215 560 260 -496 159 853 -567 -502 345 242 -725 -798 254 563 -861 -774 847
2137 847 526 -857 -346 873 804 -685 -369 1369 569 -1031 -60 1004 134 -1087 -604 1000 102 -1516
2155 -1516 -256 815 -300 -1006 -218 802 142 -754 374 1197 -182 -521 597 546 -108 -526 362 580
2173 580 -702 -454 434 -345 -741 25 325 -129 -669 6 867 -221 -597 804 716 -355 -409 624 897
2192 897 -563 -928 911 498 -1162 -625 590 317 -1104 -918 972 553 -1314 -222 1296 303 -636
2209 -636 -57 1244 538 -1005 36 1323 -42 -1025 69 619 -171 -1116 -116 828 -576 -953 470
2226 470 404 -328 -257 403 717 -241 -258 951 429 -699 105 602 73 -627 -210 623 -368 -1038 192 625
2246 625 -722 -756 390 674 -353 -765 832 1092 -688 -337 1116 778 -606 -644 837 559 -1120 -696
2264 -696 839 3 -1106 -333 585 118 -858 -210 1004 129 -735 375 960 118 -479 339 874 -158
2282 -158 -759 453 459 -651 -452 303 80 -748 -494 617 262 -920 118 903 -73 -529 202 881 182
2301 182 -654 475 1063 -390 -798 499 629 -473 -971 213 747 -819 -899 681 590 -713 -517 668
2319 668 847 -441 -463 1021 581 -648 -48 687 256 -592 -433 597 -32 -927 -48 399 -377 -440 30
2338 30 454 -19 -368 402 554 -243 -102 698 235 -178 -15 513 196 -860 -137 663 -570 -884 71 480
2358 480 -194 -777 78 1083 -281 -842 756 866 -262 -340 475 921 -398 -854 612 531 -764 -709 203
2377 203 356 -595 -911 413 476 -672 -275 647 365 -73 -73 502 543 -430 -16 573 -51 -179 -53 -23 -147
2398 -147 -374 -97 58 -419 -176 348 -166 -335 296 300 56 -196 215 666 -115 -581 557 417 -407 -352 78
2419 78 437 -585 -974 345 519 -602 -515 387 467 -167 -624 600 757 -416 -306 755 488 -142 -455
2438 -455 271 546 -605 -539 246 67 -416 -328 -53 287 -239 -437 264 180 -55 196 52 301 197 32 147
2459 147 182 -46 96 -298 -243 -4 -179 -390 -235 5 24 -177 -360 390 222 -225 262 447 275 32 -156
2480 -156 623 497 -576 -79 341 -11 -457 -296 17 350 -540 -452 259 -5 -305 -46 246 424 -43 -238
2500 -238 472 308 -102 91 172 29 -31 -349 -63 70 -472 -176 -50 -102 39 -262 -204 229 -66 -17 286 56
2522 56 392 32 7 381 112 -194 97 2 -57 -116 -379 44 16 -512 -126 96 -116 14 -3 83 338 -91 67
2545 67 374 -57 129 164 1 54 -127 -239 188 -188 -504 -7 -88 -365 -78 -234 166 4 -134 370 175
2566 175 -63 403 59 174 207 23 143 -53 -386 -188 -184 -288 -137 -168 -274 -49 -115 142 134 -156 96 463
2588 463 -39 157 204 241 223 -206 164 356 -303 -251 138 3 -251 -383 -85 266 -317 -384 374 232 -124 9
2610 9 405 489 -39 -327 618 329 -322 -153 259 132 -425 -613 149 243 -563 -291 337 207 -48 -79 304 424
2632 424 -231 -43 459 108 -137 10 5 205 -242 -123 75 -224 -351 70 -385 -260 158 -35 -111 -60 141
2653 141 445 37 -170 375 421 15 -141 159 293 -210 -594 296 314 -657 -491 192 326 -357 -607 396
2673 396 527 -549 -231 678 502 -313 -276 428 549 -320 -402 590 279 -625 -476 195 283 -459 -472 360 150
2694 150 -534 -122 211 201 -83 -197 541 218 -241 133 294 -103 -11 12 -79 -175 -237 -90 -199 -432 -2 307
2716 307 -182 -237 237 265 70 -329 258 623 -247 -256 444 310 -279 -389 271 496 -667 -690 389 290 -610
2737 -610 -597 219 499 -330 -402 665 356 -375 -192 631 526 -302 -501 514 367 -560 -301 410 -86 -430
2757 -430 -422 143 230 -478 -255 421 74 -94 195 266 305 -56 120 309 -78 -99 237 -204 -150 6 -105 -289
2779 -289 -468 -120 354 -291 -433 327 416 -217 -179 314 621 -86 -324 599 357 -375 -250 414 208 -384 -612
2800 -612 306 421 -807 -473 395 288 -361 -359 437 603 -345 -206 627 380 -279 -59 358 226 -328 -237 342
2821 342 -32 -515 -124 150 -56 -233 -256 280 174 -80 115 28 58 266 254 -60 34 84 316 -80 -449 66
2843 66 142 -393 -405 98 93 -291 -388 217 468 -321 -275 584 294 -208 -159 515 593 -265 -398 452 294 -515 -398
2866 -398 111 127 -369 -554 241 344 -441 -208 260 305 -22 -310 502 371 -214 -30 397 208 -80 -332 136
2887 136 161 -248 -367 97 -174 -99 -97 -95 128 58 -39 -9 -18 365 383 -113 -92 337 235 -126 -248 90 221 -449
2911 -449 -478 312 92 -462 -265 162 327 -258 -332 577 388 -423 -140 508 471 -209 -357 496 400 -579 -305
2932 -305 269 213 -306 -458 193 340 -367 -393 309 264 -221 2 250 462 -131 -227 467 313 -263 -157 -5
2953 -5 109 -50 -395 -148 177 -171 -220 -225 -50 193 -65 -59 196 230 147 81 67 301 104 -309 64 217 -144 -192
2977 -192 -209 138 47 -550 -259 242 108 -257 -160 328 283 -143 -150 652 288 -121 -123 64 247 -238 -409 312 78
3000 78 -460 -282 -30 71 -293 -372 111 231 -254 -87 309 180 115 11 129 480 -4 -210 189 42 28
3021 28 -362 -120 142 -28 -109 -99 -98 -3 217 -73 188 192 -7 199 182 29 97 25 105 45 -180 -20 -44 -94 -18
3046 -18 -220 -258 154 -277 -207 145 78 -97 -38 -11 146 181 53 188 193 51 -31 -60 -79 42 -184 -184 104 -73 -236
3071 -236 -127 -57 66 -16 -79 308 102 -2 78 73 165 36 -44 23 98 -265 -68 -70 -85 23 -172 -22 7 -149 -11
3096 -11 125 24 38 30 136 272 -65 31 226 246 -68 -141 -43 11 -77 -320 24 -1 -240 103 -56 -11 -3 -89 50
3121 50 181 -23 26 164 51 172 -65 -3 199 -118 -17 -1 -194 -82 -54 -120 -205 -113 42 48 -132 22 210
3144 210 -41 39 238 134 83 -26 23 308 -80 -248 27 87 -246 -175 -31 123 -175 -335 155 204 -162 36
3166 36 199 245 36 -61 172 276 -276 -80 280 -9 -193 -248 0 171 -328 -159 173 -148 -157 15 -7 184
3188 184 -102 36 260 185 15 147 110 53 172 19 -152 -136 -126 60 -149 -351 128 -9 -40 -120 -127 158 -40
3211 -40 -65 158 242 -178 49 255 262 -161 -360 112 210 -300 -264 226 -59 -246 -412 111 188 -205 -205 382 216
3234 216 -96 88 249 237 -85 -55 277 7 -341 7 57 -99 -201 -186 -63 82 -140 113 103 -106 5 68
3256 68 60 111 7 166 99 -305 62 87 -41 -139 -94 37 -4 -299 -91 192 -152 -206 94 61 5 -64 160 364
3280 364 -150 -177 346 249 -246 -70 89 186 -301 -279 85 29 -364 -115 110 93 -167 -123 276 150 -336 152
3302 152 421 53 -184 12 156 97 -197 -86 206 -112 -207 -50 -140 -103 -208 16 99 -106 -55 246 -26 -29 16
3325 16 176 95 13 53 167 -36 -262 -49 67 -113 -169 -63 83 -92 -313 184 109 -301 -125 262 91 12
3347 12 -144 337 198 -324 -40 149 100 -107 -158 37 53 -315 -204 211 -60 -231 5 199 216 -150 -46 344
3369 344 125 -133 82 195 106 45 -146 40 92 -187 26 -30 -165 -120 -90 -173 43 -176 22 -40 -156 180 137
3392 137 -104 68 83 121 -99 -173 131 137 -415 -190 335 -144 -231 -205 93 118 -366 -229 440 219 -192 17 407
3415 407 220 -118 -161 351 94 -314 -146 60 -14 -249 -168 46 63 -331 -47 166 6 -40 55 181 222 -17
3437 -17 -92 114 147 5 -45 -80 147 66 -49 -106 -58 -78 73 -206 8 174 -92 -41 235 266 90 -74 111 273
3461 273 -32 -215 139 106 -99 -238 -263 273 -110 -398 -50 138 81 -146 -157 178 165 -118 83 308 -6 -29
3483 -29 11 92 82 -173 -48 177 -63 -106 -90 -41 62 -282 -132 157 -29 -105 71 -4 60 305 -38 103 128 100
3507 100 68 -81 -83 123 -186 -238 119 -22 -88 -49 -8 65 61 -173 47 314 38 10 150 279 103 -186 51 172
3531 172 -25 -101 -113 -102 -30 -359 -188 105 14 -38 22 44 -64 76 14 215 13 -96 193 -28 20 216 -150
3554 -150 25 -6 -242 -54 -36 -99 76 -78 -143 64 -6 40 110 76 -34 -3 72 240 124 -92 21 -7 -51 1
3578 1 -185 -23 42 -86 -149 29 -127 -11 -124 8 146 17 -5 216 148 73 -22 -36 121 43 -195 -64 -111 -94
3602 -94 -90 -136 -62 -25 -9 -54 1 -63 107 68 189 104 75 -51 102 -34 -117 -45 20 150 -156 -220 -63 -71 -105 -132 -132 19
3630 19 60 -212 84 120 -62 127 219 72 114 -56 -30 166 -148 -148 -112 -7 -17 -227 -205 52 -134 -102 178 -62
3654 -62 -57 -11 75 263 56 -137 98 181 -30 -76 16 -111 4 -167 -182 55 -116 -18 -99 -43 48 -114 30 115 65
3679 65 36 -37 -35 208 200 29 -29 9 127 -17 -293 77 50 -111 -64 40 -37 -183 -35 40 81 -100 -103 120 118 -11
3705 -11 116 186 152 58 -193 -48 182 -112 -46 -207 -32 -71 -140 87 132 -105 -31 116 -7 -22 27 -8 68 -55
3729 -55 -7 147 -12 -61 61 13 -27 -76 -76 18 -100 -62 -60 -114 54 12 24 52 -6 42 139 43 47 86 -11 -48 44 -93 -12
3758 -12 -30 -203 -28 -60 -231 -30 129 -64 -37 -33 0 77 37 -55 211 16 182 -21 119 75 -137 -210 80 -151
3782 -151 -102 -37 18 40 21 -91 167 -19 -94 107 6 121 -37 -124 69 -26 -174 99 -74 -203 -80 20 -93
3805 -93 -115 -70 183 -16 -119 11 151 23 100 18 13 41 50 -11 193 -64 77 9 68 -15 -89 -18 55 -25 -44 32 41
3832 41 -68 -6 -74 97 102 51 137 -31 -82 87 142 -76 62 -47 58 58 -153 -146 54 -120 -72 -69 32 66 -159 83
3858 83 160 10 28 8 -16 -2 -44 27 40 -78 1 65 -56 -32 -45 30 -42 -59 -23 178 27 -58 178 94 -24 49 121
3885 121 11 -67 -60 48 81 -58 -17 -88 -46 4 -77 82 14 -136 -28 212 199 59 -1 154 88 6 48 126 117 -33
3911 -33 -15 -106 121 -48 -112 44 91 -134 57 -33 12 25 15 -52 110 -1 72 -9 -67 51 181 -77 -113 -29 -13
3936 -13 -54 -143 23 75 -200 28 25 -74 11 101 58 103 -68 1 232 9 72 -73 -61 72 -77 -128 108 7 -106
3961 -106 -80 -125 -62 39 -45 155 56 -140 127 80 -27 38 -75 68 28 -85 -20 -54 -7 -50 40 -63 21 35 -2
3986 -2 -15 -9 76 46 -46 106 61 75 90 -13 34 16 -151 -142 103 70 -106 -6 -20 49 -88 -57 85 83 -74 19 157
4013 157 239 59 -14 49 37 -165 -104 123 -108 -42 -68 -73 -35 -35 -68 -2 -35 21 -49 -89 -117 -85 -93 140 35 187 -23
4040 -23 17 91 123 -90 -35 4 -29 -52 -15 -116 14 -1 -24 -86 66 -40 80 117 96 120 -49 105 57 89 38 -87
4066 -87 -103 88 -166 8 -58 -57 -77 -124 29 37 -81 71 27 8 -17 -70 41 174 14 -164 134 51 67 16 -73 -65
4092 -65 -105 -142 210 -7 -93 40 -32 -16 5 82 -23 144 -72 -8 133 16 103 -69 152 -7 -35 -99 16 -138
4116 -138 -57 15 86 15 -17 -91 127 130 -59 46 -35 74 17 -52 -31 36 -76 -137 -58 -110 107 -20 -55 -20 -123 -20
4142 -20 -55 -99 34 11 -3 249 120 1 -107 -24 69 38 -52 12 206 -44 -21 -66 21 27 -20 -25 -19 -10 -82 136 44 -47
4170 -47 -14 59 160 -97 18 31 -15 12 -80 -150 -9 -55 -33 -46 71 -78 8 -36 26 86 -76 30 115 -24 -41 -1
4196 -1 38 54 -76 16 44 13 -28 79 139 -36 3 -117 79 96 -58 33 -17 -29 37 51 -79 38 54 -54 65 72
4222 72 70 61 -67 27 84 -104 67 -8 -101 -34 50 12 1 -44 53 41 -79 132 3 50 107 -32 -8 62 -74 -50 -88
4249 -88 -12 56 14 -151 21 -144 41 89 84 188 140 32 75 159 160 13 -44 20 8 -75 -35 0 -71 -26 0 -80 9 -113
4277 -113 -56 88 -16 55 110 36 91 113 -58 68 139 -8 81 38 -179 114 -46 40 -25 -83 -63 47 -9 100 21
4302 21 10 114 79 55 38 -92 37 10 -34 -14 -8 -65 -32 -147 -152 -117 -60 -38 45 22 -27 67 -57 142 88 15 79 27
4330 27 73 -22 32 55 131 -87 -48 38 -58 80 -65 -174 -35 -66 83 59 18 41 50 -77 -15 -23 60 -5 7 -9 20 -46
4358 -46 -51 4 -161 -2 79 0 74 63 6 79 -95 85 -4 7 29 23 33 65 32 26 -6 -59 -11 -60 0 65 -67 18 12 -72
4388 -72 -22 57 -60 62 70 -65 -11 43 -27 -12 25 -21 27 57 44 -132 -176 -8 -66 38 -19 102 8 -16 57 86 240
4415 240 -8 -48 137 -78 14 97 -1 51 -11 74 10 44 -47 19 89 -97 -66 -34 -75 53 -187 70 6 -6 -8 -12 49
4442 49 8 27 -36 8 -86 4 68 21 40 -15 8 115 -52 -36 72 1 55 102 -15 61 84 72 122 17 43 14 10 53
4470 53 -54 -42 -37 -77 -109 -155 -7 -29 -26 22 -59 -33 40 128 8 -65 14 74 -26 -23 -9 -139 17 30 10 10 -97 28
4498 28 32 14 32 163 77 124 47 54 25 49 121 -1 -28 -32 161 -96 36 -47 -45 133 19 -138 -48 -24 43 -9 57 -76
4526 -76 26 96 62 5 59 36 16 -82 94 -13 -14 -48 -99 -81 27 0 18 78 16 101 -25 -48 -11 17 11 -9 11 -32 50
4555 50 83 -64 -30 -101 -46 18 -121 -78 -24 -90 4 -51 86 173 -6 46 12 -35 48 6 115 -116 44 -26 8 7 -46
4582 -46 7 -83 44 139 27 161 -17 -41 58 -42 67 -26 46 -56 -2 -38 10 -29 75 -60 -63 6 -47 -1 -43 -92
4608 -92 -11 47 -161 1 167 -24 -7 -2 -12 11 25 -36 -16 103 -34 -31 -30 7 10 -74 76 -33 -50 -27 -19 143 28 2
4636 2 27 -39 2 11 89 24 53 30 -21 88 -24 -42 -41 -77 -39 17 -192 -77 81 48 45 -12 25 -6 -55 0 -34 44 -15 -11
4666 -11 -7 -8 -15 -44 46 -13 -117 -152 21 -23 -28 -126 -31 18 13 -13 92 88 34 58 71 -18 -29 -8 -80 -21 26 -16 53 97 -140
4697 -140 -114 -40 2 -116 -112 40 58 93 -29 -74 84 -38 86 -37 -24 -25 13 -63 -45 -113 2 30 29 -34 122 30 -17
4724 -17 -7 15 1 -19 34 65 47 155 -17 49 4 -56 -197 61 39 -156 -48 -130 -80 127 -23 -10 -47 -17 97 7
4750 7 41 90 130 -41 44 40 24 -58 -18 -29 -34 -88 8 9 38 -23 -34 59 -21 -17 82 47 -44 49 45 -50 -43 -23 -12 -23 -69 -24 -31 -12
4784 -12 91 33 -125 28 -43 -37 16 -41 83 184 123 58 70 9 9 78 102 15 -55 24 115 -141 -5 7 -57 3 -143
4811 -143 12 22 -69 -19 70 -30 120 26 7 -28 -24 -9 104 -63 -43 4 20 -42 -44 49 22 -7 -45 72 142 42 122
4838 122 -43 -31 -2 -22 -38 98 8 125 -104 -25 71 89 -60 26 -106 -90 -73 -66 -122 39 25 -69 -12 124 159 -55
4864 -55 -10 55 -51 61 -2 -86 4 -46 40 -34 45 -39 3 -98 8 -76 56 77 26 -50 -62 84 -55 23 6 33 -52
4891 -52 -81 -36 -95 19 5 24 29 -70 100 -44 10 -4 40 12 -71 171 38 27 61 4 -53 -23 -138 -46 -26 -57 -152 -21
4919 -21 -29 -103 11 -31 145 31 -23 33 -10 10 103 -58 -49 14 70 96 -19 -30 -30 75 26 -85 -13 -35 -5 14 112 49
4947 49 79 90 35 23 -14 -7 -106 -6 24 13 47 -68 16 -2 -39 -72 15 -19 51 26 19 -35 42 67 129 -30 8 105 -13
4976 -13 19 -24 -17 -25 -56 -81 147 -37 58 4 122 -131 -11 88 -37 91 -25 52 -27 -123 98 19 -4 42 15 44 130
5003 130 25 20 12 -62 4 15 -66 35 12 -63 7 -24 -6 -18 36 -49 52 91 -47 -38 10 -9 -7 13 -32 -97 115 -107 -28
5032 -28 50 -5 -3 -28 -127 -13 70 -41 -39 52 124 83 54 142 44 -7 -75 21 84 50 18 -29 31 -22 13 82 72 14 -12 -5 70
5063 70 -14 -23 7 -43 43 2 -42 -105 1 -47 6 -2 -21 -162 59 34 -23 -31 72 52 18 11 40 -48 12 -44 94 125 -7
5092 -7 -13 38 -97 -29 -80 -71 -42 38 38 -24 141 83 -5 -37 36 -5 -149 -33 -56 -24 -81 -124 -115 12 31 -89 52 -49 -48
5121 -48 2 58 62 130 8 39 145 91 19 96 5 124 -77 -30 21 -142 -45 55 70 115 -38 -122 38 -37 10 -7 -46
5148 -46 -38 -50 34 50 34 30 -1 37 11 38 87 -52 -36 -91 -35 -24 -7 40 23 -48 -25 -26 9 -105 -116 145 -21 -22 107 87
5178 87 12 -28 -76 -44 -101 -47 36 -54 16 100 21 41 -18 -73 -134 41 139 172 -46 -10 44 71 -78 40 114 -74 25 21
5206 21 16 -95 16 -121 7 -2 1 44 -39 24 50 70 34 103 24 -18 15 17 51 26 54 78 53 -118 -99 38 -22 25 80
5235 80 -33 29 18 -32 -25 -84 -78 -11 17 49 64 -40 -86 -28 22 23 71 48 -1 12 108 56 38 -84 51 39 -49 74 52
5264 52 1 -15 -17 -16 7 70 -45 54 -28 0 41 54 90 62 81 -117 30 -67 57 -95 9 10 -130 -54 26 -30 17 -79
5292 -79 -28 25 68 -36 -48 50 -48 -54 -60 34 34 76 -15 -35 -28 1 9 72 80 55 40 68 -40 36 103 -76 50 16 -102 -68 106
5323 106 -45 -20 -3 42 1 68 8 -66 -21 33 36 57 9 58 -44 -54 -41 -73 -192 2 65 4 -15 -24 -104 32 10 29
5351 29 -24 -90 34 80 -11 -73 -8 -57 49 0 -10 0 -2 -104 -3 -100 -46 -3 -63 29 20 64 67 1 72 3 0 34 -72 -49
5381 -49 -24 -50 -97 77 49 6 -64 -86 46 -76 25 -4 -29 4 20 -70 75 56 33 40 -34 -5 -74 -65 -26 10 -90 -28
5409 -28 76 -4 52 2 39 45 119 115 -75 81 56 51 11 -38 4 -25 -47 -49 69 -35 31 103 -90 -12 -80 5 59 -18 68
5438 68 -46 17 -5 49 -43 30 7 -118 -109 -23 -34 -78 -69 -64 160 30 -70 5 -14 46 61 -30 75 29 6 -32 -100 2
5466 2 -84 -45 -43 45 -9 10 17 61 -47 62 129 4 -22 73 51 12 -22 16 -16 23 -4 -140 -32 0 -2 10 -104 -75 52
5495 52 -85 -80 -48 56 51 11 -62 6 90 -2 -20 53 27 47 39 -155 129 46 18 -13 -10 35 41 -14 -95 33 166 88 39 -117
5525 -117 -67 -21 -154 53 146 67 -2 85 83 -24 116 -1 -86 -23 130 -34 93 55 -64 4 -32 -16 2 -73 -98 -61
5551 -61 -3 -7 35 59 -37 -4 -13 -53 -15 -5 -34 -11 32 -52 71 20 55 -39 50 100 93 -15 29 -25 69 27 -48 -155 21 85
5581 85 -95 -47 -40 -48 52 -163 29 -10 -57 37 -78 26 2 -47 17 -55 -26 -36 29 34 28 -20 -35 -75 -3 2 -23 -61 -38 80
5611 80 -6 -57 9 -58 15 -36 -46 30 78 -4 -92 -4 -18 -45 -9 -50 9 39 75 70 76 -102 -15 8 -5 93 6 6 89 65 -8
5642 -8 58 70 74 -12 56 40 -20 80 -7 -73 -30 13 -96 -2 -29 20 -3 58 -74 -10 -72 -42 34 25 -93 33 -30 -97 -118
5671 -118 -78 65 -19 7 4 48 -26 -31 -19 41 -80 14 6 -27 -32 23 -27 -14 -69 -80 -103 32 39 -16 -123 -97 68 -96 -51
5700 -51 -23 59 74 3 37 -30 -92 33 21 86 43 0 142 -64 -19 -122 -92 67 -3 59 99 -11 -6 9 5 -36 -40 25 -68
5729 -68 -82 36 -61 56 43 95 -7 -80 46 -135 114 -68 143 28 68 76 -53 -36 17 2 -56 76 17 51 21
5754 21 -51 20 8 70 -33 -24 63 -43 96 13 -139 -54 -32 -35 73 28 -54 -57 -41 41 42 20 -19 -39 102 -115 -22 0 -31
5783 -31 -54 49 -16 32 -48 -147 96 -88 -125 -71 -14 75 35 -37 -54 -85 13 -3 -84 -54 -3 -87 39 -2 -136 80 -25
5810 -25 101 2 100 22 54 -64 -30 -23 55 -33 -54 -3 21 -53 1 92 -88 95 -81 -48 -89 90 -12 42 77 51 -13
5837 -13 -85 -69 52 1 98 -33 121 62 -14 52 28 -102 -29 94 105 -4 -69 -6 20 26 -87 22 68 57 140 -37
5863 -37 22 165 -42 -87 -29 -50 -38 126 81 34 -24 58 20 -13 48 -12 -45 34 -26 -70 20 98 46 7 48 41 -35 14 67
5892 67 -33 51 -110 40 -13 -33 -45 -6 40 -90 3 -97 -12 -95 -16 74 -52 23 -52 -12 -10 -87 33 63 50 54 -107
5919 -107 -45 1 14 14 -93 -121 33 63 141 14 -39 -8 -18 120 -19 -96 -29 32 61 -23 52 -76 8 -33 -25 0 17 -57
5947 -57 -13 -27 16 59 68 -13 -37 -2 -39 -74 63 -47 -17 -45 -43 -136 -45 -95 5 -64 -39 -12 -144 67 -43 16 93 -21
5975 -21 -75 14 -79 128 108 102 27 110 25 -54 -8 83 1 107 64 14 -1 34 37 81 -102 -31 22 -33 78 -52 73 -131
6003 -131 -6 50 -38 -49 -9 85 -82 -39 -1 60 -10 -19 49 -40 74 -61 -43 82 11 22 -6 -69 35 -37 -12 -84 -29
6030 -29 60 -55 -38 -49 84 6 -107 40 -33 -38 76 11 -9 -9 -73 52 -117 58 -13 -96 72 21 -3 -94 90 91 50
6057 50 -67 33 -19 35 40 -67 66 -38 5 -35 11 -41 -21 52 -46 120 -53 48 47 15 132 -17 -37 154 -6
6082 -6 111 -24 -49 -37 53 -55 -10 -10 -39 -89 -147 -30 -91 -75 -65 -103 -4 65 -53 23 -1 22 42 56 -3 59 4 36 -102
6111 -102 -21 109 -49 53 -30 -48 -4 -60 -49 -28 109 77 -33 66 78 140 22 -80 141 -85 0 -34 -53 25 52
6136 52 27 95 4 23 22 -90 -44 -13 -10 -56 8 -9 82 41 -23 34 12 13 25 47 32 -25 -40 38 -73 -50 61 -51 1 -1
6166 -1 18 82 -7 -93 -77 -115 69 -9 -5 -1 -30 -29 -4 -34 -35 -57 -60 -44 -97 70 28 11 -18 -63 -28 44 28 65 -50 56 -39
6197 -39 -40 100 127 7 38 -93 2 158 32 29 -66 -19 -26 -1 -96 -12 -5 -15 5 -4 -8 153 -90 2 89 -46 35 -26 -52
6226 -52 57 30 -52 19 -70 -87 -40 -22 -15 -47 -46 -60 -51 84 15 -118 93 25 -32 -101 6 65 44 -66 -133 46 -4 64
6254 64 16 48 -20 58 -46 -39 29 112 -60 -1 82 -68 -2 -73 -30 56 -41 8 -125 -5 -92 -114 -74 25 4 10 59 -9 -26
6283 -26 -55 125 107 -23 -57 12 62 -106 -44 70 45 34 27 36 27 -67 -44 -8 3 59 26 60 -46 -7 5 -28 -43 -65 83
6312 83 -3 -58 69 -53 -42 -28 97 62 22 -46 -106 58 72 -23 -72 -6 -33 -41 14 -49 -77 -45 18 -49 -67 36 -145 -88
6340 -88 -69 -35 -25 -75 -18 -13 50 -81 -81 144 -149 -33 76 -38 26 103 -59 -4 -82 -84 12 -74 16 -2 -47 -7 -36 -33 -2
6369 -2 -63 14 -131 -20 76 -21 -53 -13 -22 35 -62 14 -26 72 22 -41 22 -11 -85 -16 -26 51 -28 66 37 64 -18 -48 -22 17
6399 17 3 8 -11 -64 -37 11 -40 -17 -79 95 19 44 111 22 -60 36 -15 53 94 2 -54 59 -129 6 23 -2 -76 -15 -212
6428 -212 -100 65 47 41 -27 -17 -90 -6 -18 70 36 50 -37 83 106 -26 -49 -77 -101 -61 -2 -128 33 -56 8 -22 -42
6455 -42 27 -78 -11 -53 35 -37 -42 37 45 -78 -64 42 37 24 -59 -56 86 90 46 12 -2 -25 -47 114 30 -39 17 -22 59 3
6485 3 17 68 14 -38 -9 32 -11 -113 56 -46 -3 -25 144 7 -1 -26 -1 -10 -101 15 5 63 10 72 56 -29 -19 -24 -62
6514 -62 -47 -14 1 60 27 42 -18 -98 -15 35 -78 65 68 -57 32 33 13 28 144 34 107 13 18 71 53 54 -29 -39 -92 20
6544 20 19 30 114 17 2 75 -65 72 -2 45 13 14 -81 -36 -16 -33 27 10 -77 -39 92 -105 -87 133 8 31 -116 11
6572 11 37 40 -48 123 -48 166 -20 -13 -39 -80 -13 19 -64 21 -86 61 -14 -29 24 -60 -112 73 -11 -5 66 -82 22
6599 22 -37 -180 -130 -88 18 -107 -40 90 -80 -47 -39 -90 39 -73 28 19 -66 49 48 -19 -98 83 56 -61 -47 -28
6625 -28 2 -39 20 68 -12 16 35 -23 -66 -9 -22 81 -47 0 110 -47 20 55 34 76 -171 -59 -53 -46 64 -55 -64 -60
6653 -60 26 103 152 -30 -12 -86 -20 -40 -65 96 37 22 82 -33 147 15 -76 -78 100 49 -61 39 -75 123 -24
6678 -24 -27 -76 -17 28 58 14 92 41 -134 -86 117 -25 -48 65 -103 -19 38 29 28 -46 33 -87 -10 44 188 -7 13 33
6706 33 142 180 88 49 16 23 -41 24 -102 -14 25 -122 -49 25 1 62 -31 -78 125 -27 121 -67 20 70 69 -84 7
6733 7 51 47 -101 -94 -33 -91 35 -34 2 -81 -42 87 29 62 -96 49 139 -115 -70 -11 26 -43 1 13 19 25 44 -14 20 89
6763 89 -46 88 -139 -35 -10 8 15 -57 40 -31 -42 19 8 24 -6 -85 97 39 42 23 -35 -45 101 -89 43 115 -36
6790 -36 30 18 66 34 68 92 41 93 22 -51 2 -33 80 -36 -139 -3 -92 -38 -34 -36 17 -73 20 -67 -6 -37 62 42 66
6819 66 75 65 89 -8 -95 10 -98 -107 18 -54 -149 31 -67 -58 -18 13 -12 -60 50 -109 -19 33 -24 -6 -11 31 9 -11 -50
6848 -50 29 117 -6 -7 -25 -46 -89 73 -68 -13 -63 -33 64 99 83 52 65 31 -89 52 10 -10 -34 -5 125 -34 -8
6875 -8 61 -10 -58 -38 17 27 -103 79 15 39 23 -40 -42 -22 -73 36 4 -30 64 66 -156 -53 82 -43 -21 -91 -10 4
6903 4 1 -4 53 48 7 -23 -23 -40 48 -20 4 124 80 51 44 -73 23 36 39 74 22 5 -69 119 82 -24 21 13 -52 13 36 62
6935 62 55 -21 91 8 -109 -2 34 -93 65 -34 -98 103 6 -102 -42 -72 -91 0 16 -48 45 31 -110 20 109 -77
6961 -77 -163 -36 -51 29 -34 -45 -61 32 -5 3 86 37 -44 17 17 68 -34 33 -6 -6 33 -51 52 -53 25 40 19 -88 80
6990 80 10 58 93 15 -79 46 22 -75 30 41 47 -37 -95 103 121 -7 29 -5 -28 73 -8 -101 -13 -51 -16 14 84 -120
7018 -120 -50 74 1 19 -12 18 3 -131 24 11 68 -9 40 3 64 -13 -32 -2 12 -34 50 69 -81 -36 -7 -21 18 -38
7046 -38 43 26 60 38 125 10 -49 11 23 -7 49 2 -77 -14 -56 -65 -33 35 34 23 46 -140 56 12 51 69 -43 80 -117
7075 -117 -10 18 -1 -31 1 3 -34 77 141 12 -23 -4 45 -9 -28 -77 2 22 -96 19 79 -52 -109 -10 -43 -20 1
7102 1 -79 -28 32 -23 24 70 -65 -103 57 84 44 66 101 -31 77 66 -126 109 39 50 -45 -83 69 89 0 -70 53
7129 53 33 -10 -64 24 -9 -7 -29 98 -75 -26 13 63 18 18 34 -18 -20 -61 141 49 82 -46 -58 90 -9 15 48 76 -31
7158 -31 0 -56 -70 -83 17 -38 -52 -39 -60 56 -56 -21 52 -19 -57 63 -11 68 19 -20 -68 51 71 -40 1 -14 -48
7185 -48 13 16 -34 5 41 40 -22 -86 20 87 60 45 -35 -79 -13 171 -11 -8 -120 -159 -37 -8 -90 -36 18 55 41 -79 -57
7214 -57 -116 78 -60 -128 5 -20 24 -65 89 12 151 -57 16 -52 -18 33 64 -87 46 -109 -66 -25 -66 37 26
7239 26 81 -17 -87 83 -29 33 155 8 38 111 67 -2 -23 74 -151 -41 -108 -36 -96 41 -65 102 -21 72 10
7264 10 0 -74 91 38 -58 11 -67 -86 -3 -59 29 -27 15 -11 8 -11 -34 25 51 16 -78 -12 35 -13 -33 100 -103 47
7292 47 2 46 -52 88 -56 69 -4 -128 -88 -34 60 -56 -34 -1 46 -15 111 -56 -10 63 -19 39 51 -63 96 -79
7318 -79 -50 -6 -140 -45 40 -13 -50 57 21 -36 -17 -14 89 -17 -24 -18 1 -17 -83 -53 19 9 21 47 -103 14 57 -74
7346 -74 55 48 -82 40 -43 -8 -84 -82 -138 -57 -11 10 4 40 -3 31 -35 -19 -36 15 7 -75 24 13 -159 -40 120 76 81 5
7376 5 -35 13 29 -100 93 -20 -51 35 -56 -30 42 -57 -45 37 -146 -12 -42 -56 -66 12 26 -2 24 -35 -88 41 2 80
7404 80 67 -57 -78 -39 -72 -24 7 -74 15 -44 5 -41 -60 -22 -7 -62 59 92 106 94 85 14 40 -89 -12 -66 -13 -70 -100
7433 -100 82 99 91 -33 -74 51 -94 -65 65 -76 -18 -60 -18 60 49 -32 9 -25 20 -47 33 -18 -106 -26 12 31 54
7460 54 14 36 72 54 -19 34 69 -80 -2 22 60 -34 42 78 -45 67 -40 -33 146 -42 -57 17 10 4 19 -4 27 40 82
7489 82 112 2 79 -66 66 31 -10 28 45 -32 -13 99 74 -55 69 -85 52 -7 -63 -23 41 62 23 -30 -54 54
7515 54 -79 114 -69 -22 30 18 40 8 -51 -97 1 -13 65 -1 -35 161 11 -108 14 -26 71 -71 21 90 32 -95
7541 -95 -3 18 -47 91 -63 -16 24 -102 -21 64 -102 -72 -7 30 -20 -22 53 -30 -21 -56 63 -12 80 6 33 -64 2 68 -24
7570 -24 19 -5 -131 -70 47 -25 -59 73 -66 -74 7 137 52 -21 97 43 18 -31 -34 67 -49 -119 61 -37 74 51
7596 51 -40 -35 83 30 131 -117 -78 129 22 -57 176 -18 -87 -35 -67 6 -88 39 -3 -117 -80 86 -69 -64 -40 2
7622 2 129 18 32 29 -4 83 68 92 -50 109 -69 21 7 178 -46 58 -71 82 -159 90 70 -83 138 -43
7646 -43 9 16 -1 135 133 4 24 65 76 -91 59 58 68 -18 23 39 0 2 49 107 74 66 49 -21 40 -30 84 70 -18 31
7676 31 32 31 39 15 20 -21 19 18 -157 71 120 42 20 57 79 -88 20 50 -91 -84 -53 118 45 30 57 -17 -36 -31 -129 -96 -64
7707 -64 8 -2 55 79 59 20 40 -38 -23 -27 20 -6 59 45 -9 -56 -81 -100 7 -21 -14 -68 36 18 154 -105 125 44 73
7736 73 99 -53 21 -27 -92 66 46 -44 34 12 -5 -99 -79 -36 -1 -71 161 108 36 110 -15 57 34 -101 -71 36 -9
7763 -9 -6 -76 -63 -116 94 17 -93 -89 -71 29 -47 -88 91 -43 16 -15 -41 -57 -32 -43 -45 29 7 -66 58 -23 38 38 22 13
7793 13 28 66 26 -54 -44 -19 26 -33 23 -80 96 31 -29 3 -156 -59 61 10 -9 -14 -9 23 -51 37 -26 -67 -26 38 96
7822 96 -55 53 95 -27 -11 33 72 41 -15 -85 16 -17 45 -7 -2 9 -75 -116 -126 110 2 -3 1 -3 -7 69 -106 107 -39
7851 -39 1 8 -91 -93 -24 -13 -120 -26 54 38 -162 -29 130 79 101 150 12 30 -49 0 113 23 -62 -48 65 -54 -71
7878 -71 -62 -96 84 33 -12 -100 106 15 96 153 -30 61 -105 65 -98 -50 -52 -30 -29 -52 -78 -17 96 -46 -58 94 -54
7905 -54 31 47 -81 24 65 -35 33 -20 -17 62 -55 -13 27 -34 -15 -39 -22 49 -11 -34 -4 28 3 -1 -71 26 20 63 -23 45
7935 45 17 -3 84 -47 47 -48 -22 0 24 46 42 -6 -60 5 46 -57 119 -36 -20 -88 -1 -4 64 49 39 -40 -25 143 -49
7964 -49 -16 -39 -172 54 28 20 77 -64 11 78 -87 7 18 9 -89 -80 19 42 -15 32 -36 117 8 55 -36 -33 -15 26 -6
7993 -6 -53 3 29 -74 -38 -2 -18 -11 20 40 73 -15 8 77 87 18 12 -86 -7 92 -95 7 6 55 78 104 -118 69 31 4
8023 4 -11 -14 -30 34 -47 53 -86 -13 141 51 1 -62 -89 10 -10 -48 67 -11 48 28 -19 -56 -94 13 159 97 -85 -76
8051 -76 -52 41 -52 107 11 -55 -27 23 -54 -83 6 12 -44 -86 -70 -12 -49 8 -64 31 17 82 -97 -72 -18 -69 -126 77 40
8080 40 -88 24 -19 -7 70 -65 -26 38 -46 -68 59 117 66 -82 -73 57 -58 26 15 -81 30 49 -14 -38 66 -103
8106 -103 64 12 -5 -56 -11 85 17 67 -15 94 62 45 -73 -34 27 -56 21 -55 28 7 141 -57 39 -20 2 17 68
8133 68 13 35 -116 -31 44 -24 -3 -1 63 102 81 12 -57 -153 46 55 17 20 -47 42 39 -22 123 -35 8 -19 12 -16 -15 28 56
8164 56 13 55 -43 53 -111 -200 -21 -49 10 14 -48 35 40 4 55 -52 -30 -63 141 27 82 12 39 5 40 -14 -8
8191h
##END NTUPLES=NMR FID
##END=
