##TITLE=1H_DE-80H_X3
 200.13MHz, d2o
 8 sc
 
 19ns.26.2.2025
##JCAMPDX= 6.0         $$ Bruker NMR JCAMP-DX V2.0
##DATA TYPE= NMR FID
##DATA CLASS= NTUPLES
##ORIGIN= UXNMR, Bruker Analytische Messtechnik GmbH
##OWNER= pz
$$ XWIN-NMR		Version 3.5
$$ Wed Apr 30 12:05:42 2025 Russian Standard Time (UT+4h)  Yarkov@DPX200
##.OBSERVE FREQUENCY= 200.1313
##.OBSERVE NUCLEUS= ^1H
##.DELAY= (6, 6)
##.ACQUISITION MODE= SIMULTANEOUS
##.ACQUISITION SCHEME= undefined
##.AVERAGES= 8
##.DIGITISER RES= 18
##SPECTROMETER/DATA SYSTEM= spect
##.PULSE SEQUENCE= zg30
##.SOLVENT NAME= CDCl3
##.SHIFT REFERENCE= (INTERNAL, CDCl3, 0, 14.3821)
##AUDIT TRAIL= $$ (NUMBER, WHEN, WHO, WHERE, WHAT)
$$ ##TITLE= Audit trail, XWIN-NMR		Version 3.5
$$ ##JCAMPDX= 5.01
$$ ##ORIGIN= Bruker BioSpin GmbH
$$ ##OWNER= Yarkov
$$ C:/Bruker/XWIN-NMR/data/yarkov2/nmr/H-C/1/audita.txt
$$ ##AUDIT TRAIL=  $$ (NUMBER, WHEN, WHO, WHERE, WHAT)
(   1,<2025-04-30 12:03:14.70 +0400>,<Yarkov>,<DPX200>,
      <created by zg, POWCHK disabled, PULCHK disabled
       configuration hash MD5:
       00 E9 B6 7A A2 85 ED C7 34 08 36 98 17 FE 4E 26
       data hash MD5: 16K
       02 43 D4 39 4A 8D 39 4B 56 9A BA 30 D7 58 A4 47>)
$$ ##END=
$$ 
$$ hash MD5
$$ C4 03 05 87 3F 8C 03 5F 01 55 35 EE 2A 26 01 AD
##$RELAX= 
##$RELAX= 
##$RELAX= 
##$RELAX= 
##$RELAX= 
##$RELAX= 
$$ Bruker specific parameters
$$ --------------------------
##$DU= <C:/Bruker/XWIN-NMR>
##$EXPNO= 1
##$NAME= <H-C>
##$PROCNO= 1
##$TYPE= <nmr>
##$USER= <yarkov2>
##$AMP= (0..31)
100 100 100 100 100 100 100 100 100 100 100 100 100 100 100 100 100 100 
100 100 100 100 100 100 100 100 100 100 100 100 100 100 
##$AQSEQ= 0
##$AQ_mod= 1
##$AUNM= <au_zg>
##$AUTOPOS= <>
##$BF1= 200.13
##$BF2= 200.13
##$BF3= 200.13
##$BF4= 200.13
##$BF5= 200.13
##$BF6= 200.13
##$BF7= 200.13
##$BF8= 200.13
##$BYTORDA= 1
##$CFDGTYP= 0
##$CFRGTYP= 5
##$CHEMSTR= <none>
##$CNST= (0..31)
1 1 145 1 1 1 1 1 1 1 1 1 1 1 1 1 1 1 1 1 1 1 1 1 1 1 1 1 1 1 1 1 
##$CPDPRG= <>
##$CPDPRG1= <>
##$CPDPRG2= <>
##$CPDPRG3= <>
##$CPDPRG4= <mlev>
##$CPDPRG5= <mlev>
##$CPDPRG6= <mlev>
##$CPDPRG7= <mlev>
##$CPDPRG8= <mlev>
##$CPDPRGB= <>
##$CPDPRGT= <>
##$D= (0..31)
0 0.7 0 0 0 0 0 0 0 0 0 0.03 0 0 0 0 0 0 0 0 0 0 0 0 0 0 0 0 0 0 0 0 
##$DATE= 1746000194
##$DBL= (0..7)
120 120 120 120 120 120 120 120 
##$DBP= (0..7)
150 150 150 150 150 150 150 150 
##$DBP07= 0
##$DBPNAM0= <>
##$DBPNAM1= <>
##$DBPNAM2= <>
##$DBPNAM3= <>
##$DBPNAM4= <>
##$DBPNAM5= <>
##$DBPNAM6= <>
##$DBPNAM7= <>
##$DBPOAL= (0..7)
0.5 0.5 0.5 0.5 0.5 0.5 0.5 0.5 
##$DBPOFFS= (0..7)
0 0 0 0 0 0 0 0 
##$DE= 6
##$DECBNUC= <off>
##$DECIM= 32
##$DECNUC= <off>
##$DECSTAT= 4
##$DIGMOD= 1
##$DIGTYP= 9
##$DL= (0..7)
0 120 120 120 120 120 120 120 
##$DP= (0..7)
150 150 150 150 150 150 150 150 
##$DP07= 0
##$DPNAME0= <>
##$DPNAME1= <>
##$DPNAME2= <>
##$DPNAME3= <>
##$DPNAME4= <>
##$DPNAME5= <>
##$DPNAME6= <>
##$DPNAME7= <>
##$DPOAL= (0..7)
0.5 0.5 0.5 0.5 0.5 0.5 0.5 0.5 
##$DPOFFS= (0..7)
0 0 0 0 0 0 0 0 
##$DQDMODE= 0
##$DR= 18
##$DS= 0
$$ [...]
##$SUBNAM2= <"">
##$SUBNAM3= <"">
##$SUBNAM4= <"">
##$SUBNAM5= <"">
##$SUBNAM6= <"">
##$SUBNAM7= <"">
##$SUBNAM8= <"">
##$SUBNAM9= <"">
##$SW= 18.0517328524113
##$SWIBOX= (0..15)
0 0 2 0 0 0 0 0 0 0 0 0 0 0 0 0 
##$SW_h= 3612.71676300578
##$TD= 16384
##$TD0= 1
##$TE= 0
##$TE2= 300
##$TE3= 300
##$TEG= 300
##$TL= (0..7)
0 120 120 120 120 120 120 120 
##$TP= (0..7)
150 150 150 150 150 150 150 150 
##$TP07= 0
##$TPNAME0= <>
##$TPNAME1= <>
##$TPNAME2= <>
##$TPNAME3= <>
##$TPNAME4= <>
##$TPNAME5= <>
##$TPNAME6= <>
##$TPNAME7= <>
##$TPOAL= (0..7)
0.5 0.5 0.5 0.5 0.5 0.5 0.5 0.5 
##$TPOFFS= (0..7)
0 0 0 0 0 0 0 0 
##$TUNHIN= 0
##$TUNHOUT= 0
##$TUNXOUT= 0
##$USERA1= <user>
##$USERA2= <user>
##$USERA3= <user>
##$USERA4= <user>
##$USERA5= <user>
##$V9= 5
##$VALIST= <valist>
##$VCLIST= <CCCCCCCCCCCCCCC>
##$VD= 0
##$VDLIST= <DDDDDDDDDDDDDDD>
##$VPLIST= <PPPPPPPPPPPPPPP>
##$VTLIST= <TTTTTTTTTTTTTTT>
##$WBST= 1024
##$WBSW= 4
##$XGAIN= (0..3)
0 0 0 0 
##$XL= 0
##$YL= 0
##$YMAX_a= 232292
##$YMIN_a= -258551
##$ZGOPTNS= <>
##$ZL1= 120
##$ZL2= 120
##$ZL3= 120
##$ZL4= 120
##$ABSF1= 10
##$ABSF2= 0
##$ABSG= 5
##$ABSL= 3
##$ALPHA= 0
##$AQORDER= 0
##$ASSFAC= 0
##$ASSFACI= 0
##$ASSFACX= 0
##$ASSWID= 0
##$AUNMP= <proc_1d>
##$AZFE= 0.1
##$AZFW= 0.1
##$BCFW= 1
##$BC_mod= 2
##$BYTORDP= 1
##$COROFFS= 0
##$CY= 83.5205535888672
##$DATMOD= 1
##$DC= 2
##$DFILT= <>
##$DTYPP= 0
##$F1P= 10.8118882576601
##$F2P= -7.23987719738617
##$FCOR= 0.5
##$FTSIZE= 0
##$FT_mod= 4
##$GAMMA= 1
##$GB= 0.15
##$INTBC= 1
##$INTSCL= 1
##$ISEN= 128
##$LB= 0.25
##$LEV0= 0
##$LPBIN= 0
##$MAXI= 10000
##$MC2= 0
##$MEAN= 0
##$ME_mod= 0
##$MI= 1.114404
##$NCOEF= 0
##$NC_proc= 0
##$NLEV= 6
##$NOISF1= 3.799351
##$NOISF2= 2.8
##$NSP= 1
##$NTH_PI= 0
##$NZP= 0
##$OFFSET= 14.38212
##$PC= 1
##$PHC0= -1343.368
##$PHC1= 5.533742
##$PH_mod= 1
##$PKNL= yes
##$PPARMOD= 0
##$PSCAL= 0
##$PSIGN= 0
##$REVERSE= no
##$SF= 200.129724274929
##$SI= 16384
##$SIGF1= 3
##$SIGF2= 2
##$SINO= 400
##$SIOLD= 16384
##$SREGLST= <1H.CDCl3>
##$SSB= 0
##$STSI= 0
##$STSR= 0
##$SW_p= 3205.1282051282
##$SYMM= 0
##$S_DEV= 0
##$TDeff= 0
##$TDoff= 0
##$TI= <>
##$TILT= no
##$TM1= 0
##$TM2= 0
##$TOPLEV= 0
##$USERP1= <user>
##$USERP2= <user>
##$USERP3= <user>
##$USERP4= <user>
##$USERP5= <user>
##$WDW= 1
##$XDIM= 8192
##$YMAX_p= 0
##$YMIN_p= 0
$$ End of Bruker specific parameters
$$ ---------------------------------
##NTUPLES= NMR FID
##VAR_NAME=  TIME,          FID/REAL,        FID/IMAG
##SYMBOL=    X,             R,               I
##VAR_TYPE=  INDEPENDENT,   DEPENDENT,       DEPENDENT
##VAR_FORM=  AFFN,          ASDF,            ASDF
##VAR_DIM=   8192,          8192,            8192
##UNITS=     SECONDS,       ARBITRARY UNITS, ARBITRARY UNITS
##FACTOR=    0.0002768,     1,               1
##FIRST=     0,             0,               0
##LAST=      2.2672688,     0,               0
##MIN=       0,             -258551,         0
##MAX=       2.2672688,     232292,          0
$$ Real data points
##PAGE= N=1
##DATA TABLE= (X++(R..R)), XYDATA
$$ plain form
0 0 0 0 0 0 0 0 0 0 0 0 0 0 0 0 0 0 0 0 0 -8 7 -8 8 -8 8 -14 16 -16 20 -24 27 -32 35 -40 46 -52 60 -68 73 -83
40 -83 92 -102 115 -128 141 -157 173 -190 212 -234 257 -282 312 -341 374 -415 457 -505 558 -620
60 -620 690 -770 863 -973 1098 -1240 1379 -1402 634 9223 190118 141618 59201 -76158
74 -76158 -258551 -42718 141955 128641 130675 -96581 -245801 -33284 73615 150485 165965
85 165965 -115829 -199009 -52732 11891 185726 165747 -112676 -147387 -102297 -18722 214010
96 214010 137602 -78620 -107107 -159561 -19979 216002 110940 -17522 -96209 -202536 -899
107 -899 185120 100195 48877 -110406 -216105 11285 128908 116286 97783 -135923 -197788
118 -197788 1907 70093 151248 116445 -145524 -157656 -36191 31384 191264 105812 -128146
$$ packed form
0@%%%%%%%%%%%%%%%%%%%qJ5j5J6j6J6k2L0l2L6m4N1n9O7p5Q6r8J12j28J41j56
40h3J75j94K17k43K69k98L30l63M02m46M91n39N94o53P15p89Q72r62J063j178
60f20J310j460J633j836K071k338K619k781K036Q589J80895m8500q2417j35359
74g6158j82393K15833J84673j3314K034k27256j49220K12517J06899P6870J5480
85A65965k81794q3180J46277O4623J73835j9979k78423l4711M5090Q3575K32732
96B14010p6408k16222k8487n2454J39582K35981j05062j28462p8687j06327K01637
107h99J86019q4925n1318j59283j05699K27390J17623j2622j8503k33706o1865
118a97788J99695O8186Q1155l4803k61969j2132J21465O7575J59880q5452k33958
$$ plain form
129 -128146 -117013 -89612 19205 209439 82606 -81656 -99575 -142262 29825 196847 65597
140 65597 -22955 -107483 -170458 45011 156411 73892 32256 -131527 -169694 47733 109143
151 109143 105263 61891 -151472 -144214 22520 68121 147505 65220 -153622 -115804 -24380 50611
163 50611 179878 49326 -127303 -96161 -77452 54280 189467 36477 -78871 -99105 -117359
174 -117359 71557 169972 36559 -25755 -119206 -133802 79249 130959 59188 12161 -146026
185 -146026 -124339 67391 90977 97468 26694 -158546 -99662 32378 67805 138058 20344
196 20344 -147984 -78975 -15494 66539 160848 6346 -114868 -78252 -61767 81165 158403
207 158403 627 -70946 -96732 -89685 96158 135926 16377 -31384 -125177 -93340 97700
$$ packed form
129a28146J1133K7401J08817J90234j26833j64262j7919m2687J72087J67022j31250
140F5597q8552q4528o2975K15469J11400q2519m1636j63783l8167K17427O1410
151A09143l880m3372k13363P258J66734M5601P9384q2285k18842L7818R1424P4991
163E0611J29267j30552j76629L1142J8709J31732J35187j52990j15348k0234j8254
174a17359J88916R8415j33413o2314r3451j4596K13051N1710p1771m7027j58187
185a46026K1687J91730K3586O491p0774j85240N8884J32040L5427P0253j17714
196B0344j68328O9009O3481Q2033R4309j54502j21214L6616J6485J42932P7238
207A58403j57776p1573k5786P047J85843L9768j19549m7761r3793L1837J91040
$$ plain form
218 97700 105819 50126 -9582 -147672 -79820 75128 81070 91144 -8115 -153929 -63394 35610
230 35610 73039 121987 -18832 -134868 -56300 -9473 82896 135072 -26899 -99489 -66891
241 -66891 -42916 100816 124726 -21648 -61275 -92627 -58540 109949 101516 2992 -37049 -122663
253 -122663 -53703 101953 78652 40544 -29635 -139869 -40317 74718 70648 78677 -37319
264 -37319 -137167 -31673 36751 78359 101224 -48568 -115409 -39077 -100 95851 104015 -50632
276 -50632 -85281 -60944 -22100 111447 90823 -34432 -58313 -89554 -25472 114265 72455
287 72455 -3239 -45499 -113490 -17067 98274 60122 32483 -49196 -123140 -8034 68058 62607
299 62607 60900 -61090 -113427 -8825 34638 80129 74724 -69316 -91378 -24347 10519 101330
$$ packed form
218I7700Q119n5693n9708j38090O7852J54948N942J0074r9259j45814R0535R9004
230C5610L7429M8948j40819j16036P8568M6827R2369N2176j61971p2590L2598
241f6891K3975J43732K3910j46374l9627l1352L4087J68489q433r8524m0041q5614
253a22663O8960J55656k3301l8108p0179j10234R9552J15035m070Q029j15996
264c7319r9848J05494O8424M1608K2865j49792o6841P6332L8977R5951Q164j54647
276e0632l4649K4337L8844J33547k0624j25255k3881l1241O4082J39737m1810
287G2455p5694m2260o7991R6423J15341l8152k7639q1679p3944J15106P6092n451
299F2607j707j21990n2337J04602M3463M5491n405j44040k2062O7031L4866R0811
$$ plain form
311 101330 70724 -63477 -68532 -53114 676 113958 57313 -41938 -56312 -82553 5200 110041
323 110041 45933 -9279 -56200 -100497 13888 90435 47242 22346 -66778 -101186 17153
334 17153 61800 60045 41756 -77645 -88124 6026 35387 80528 45609 -80049 -69602 -16719
346 -16719 21751 98430 38236 -66466 -55132 -45291 22208 105831 28759 -41309 -53360 -69270
358 -69270 30466 96971 25872 -12694 -63862 -80806 36858 76392 36049 10198 -79036 -76795
370 -76795 33512 53994 56986 20767 -87782 -63032 16522 38867 79093 18173 -83390 -50366
382 -50366 -10420 35283 92495 9422 -65871 -46509 -36799 41307 91982 5171 -39998 -53572
394 -53572 -53267 50014 79863 11841 -16481 -68383 -56149 52119 61267 28791 -2745 -82641
$$ packed form
311A01330l0606j34201n055J5418N3790J13282n6645r9251j4374k6241Q7753J04841
323A10041o4108n5212m6921m4297J14385P6547m3193k4896q9124l4408J18339
334A7153M4647j755j8289j19401j0479R4150K9361M5141l4919j25658J0447N2883
346a6719L8470P6679o0194j04702J1334R841O7499Q3623p7072p0068j2051j5910
358f9270R9736O6505p1099l8566n1168j6944J17664L9534m0343k5851q9234K241
370g6795J10307K0482K992l6219j08549K4750P9554K2345M0226o0920j01563L3024
382e0366L9946M5703N7212q3073p5293J9362R710P8106N0675q6811m5169j3574
394e3572L05J03281K9849o8022k8322n1902J2234J08268R148l2476l1536p9896
$$ plain form
406 -82641 -49810 41557 46606 51306 -1729 -87835 -39514 20555 41857 70979 -7656 -79057
418 -79057 -34502 -4585 47975 80475 -13650 -60294 -39784 -25126 57910 75429 -11712 -38539
430 -38539 -54899 -35192 64184 61718 1447 -22570 -71617 -32832 60539 47905 23106 -16759
442 -16759 -81607 -24521 45045 41642 44991 -21269 -80788 -18900 22341 45038 58883 -28734
454 -28734 -69212 -22278 933 55900 61669 -30440 -51822 -35107 -11621 67356 54996 -22108
466 -22108 -36436 -53034 -14171 70720 44406 -4442 -29612 -69356 -9538 62348 37248 17197
478 17197 -32221 -75863 -3576 44313 38924 36059 -39001 -70563 -3499 23783 49331 44867 -44074
491 -44074 -56862 -13215 7773 61757 42422 -40921 -42624 -31188 1361 70383 33987 -28034
$$ packed form
406h2641L2831R1367N049M700n3035q6106M8321O0069K1302K9122p8635p1401
418g9057M4555K9917N2560L2500r4125m6644K0510J4658Q3036J7519q7141k6827
430c8539j6360J9707R9376k466o0271k4017m9047L8785R3371j2634k4799l9865
442a6759o4848N7086O9566l403L349o6260n9519O1888M1241K2697J3845q7617
454b8734m0478M6934K3211N4967N769r2109k1382J6715K3486P8977j2360p7104
466b2108j4328j6598L8863Q4891k6314m8848k5170l9744N9818P1886k5100k0051
478A7197m9418m3642P2287M7889n389k865p5060l1562O7064K7282K5548m464q8941
491d4074j2788M3647K0988N3984j9335q3343j703J1436L2549O9022l6396o2021
$$ plain form
503 -28034 -34424 -49280 4382 69165 27678 -7661 -35183 -61462 10832 58246 28386 11699
515 11699 -43250 -63546 13081 40860 37013 24183 -51643 -56720 6351 25075 51293 27252
527 27252 -53671 -44875 -8180 16439 64087 23037 -45588 -35635 -27006 16188 68915 16496 -29411
540 -29411 -34437 -43249 21519 62959 14152 -10105 -41130 -50815 26208 49750 21030 5421 -51070
553 -51070 -48301 24552 35537 35086 11946 -57955 -39761 13295 25613 50587 9910 -56940 -32203
566 -32203 -4496 24172 60782 4011 -46049 -30039 -22164 29364 62101 1357 -29076 -35534
578 -35534 -33821 36189 54354 5336 -13036 -46034 -36785 37354 41458 16903 -3457 -56222 -32277
591 -32277 30421 30976 32795 -2189 -59663 -24498 16086 27411 46945 -6299 -54015 -20823 -1537
$$ packed form
503b8034o390j4856N3662O4783m1487l5339k7522k6279P2294M7414k9860j6687
515A1699n4949k0296P6627K7779l847j2830p5826n077O3071J8724K6218k4041
527B7252q0923Q796L6695K4619M7648m1050o8625R953Q629M3194N2727n2419m5907
540b9411n026q812O4768M1440m8807k4257l1025r685P7023K3542k8720j5609n6491
553e1070K769P2853J0985m51k3140o9901J8194N3056J2318K4974m0677o6850K4737
566c2203K7707K8668L6610n6771n0060J6010P875N1528L2737o0744l0433o458
578c5534J713P0010J8165m9018j8372l2998R249P4139M104k4555k0360n2765K3945
591c2277O2698N55J819l4984n7474L5165M0584J1325J9534n3244m7716L3192J9286
$$ plain form
604 -1537 31654 53365 -11413 -41469 -25007 -16194 39535 50501 -10761 -26781 -36026 -23098 45509
617 45509 42102 -1497 -15884 -48583 -21298 44072 32959 14113 -12432 -57162 -15746 33432
629 33432 28285 29854 -15852 -57510 -11878 17216 30591 40433 -20913 -48789 -13679 1560 38410
642 38410 43091 -22220 -35762 -22271 -8409 46338 38093 -16823 -24148 -35433 -11086 48843 29892
655 29892 -4333 -18939 -47804 -7345 43858 24489 11571 -20585 -53323 -2206 31953 25929
667 25929 25733 -26363 -50457 -1524 17186 33564 32368 -31377 -41149 -8285 4744 43252 31238
680 31238 -30101 -30481 -21006 -160 50095 25158 -20600 -23182 -34405 1590 49643 19505 -5605
693 -5605 -22789 -44017 6194 41252 18448 8871 -28135 -45912 8425 28107 24195 18877 -34601
$$ packed form
604a537L3191K1711o4778l0056J6462Q813N5729J0966o1262j6020r245J2928O8607
617D5509l407m3599j4387l2699K7285O5370j1113j8846k6545m4730M1416M9178
629C3432n147J569m5706m1658M5632K9094J3375R842o1346k7876L5110J5239L6850
642C8410M681o5311j3542J3491J3862N4747q245n4916p325j1285K4347N9929j8951
655B9892l4225j4606k8865M0459N1203j9369j2918l2156l2738N1117L4159o024
667B5929j96n2096k4094M8933J8710J6378j196o3745r772L2864J3029L8508j2014
680C1238o1339l80R475K0846N0255k4937m5758k582j1223L5995M8053l0138k5110
693e605j7184k1228N0211L5058k2804r577l7006j7777N4337J9682l912n318n3478
$$ plain form
706 -34601 -40597 5077 16182 34825 21673 -37171 -31553 -4796 9365 44888 18255 -32707
718 -32707 -24659 -19072 9075 49467 12425 -21651 -23212 -31671 13550 46335 10091 -7033 -27565
731 -27565 -37842 17969 36749 14356 5275 -35095 -36265 17406 24794 23890 10905 -40655 -29732
744 -29732 9481 16039 35137 9740 -40147 -22733 -3204 14095 43319 5159 -32083 -19536
756 -19536 -16521 17878 44993 1984 -19895 -23061 -25917 23241 39370 3424 -8011 -31151 -28826
769 -28826 25528 29925 11441 -130 -39385 -25343 21984 21732 23374 1603 -42786 -19066 11698
782 11698 17946 34380 -1633 -39438 -15302 -2029 19762 39675 -5943 -29875 -16932 -13831
794 -13831 25100 38006 -6188 -17650 -23814 -19671 30036 31172 -309 -8193 -32869 -18869 29674
$$ packed form
706c4601n996M5674J1105J8643j3152n8844N618K6757J4161L5523k6633n0962
718c2707Q048N587K8147M0392l7042l4076j561q459M5221L2785l6244j7124k0532
731b7565j0277N5811J8780k2393r081m0370j170N3671P388r04j2985n1560J0923
744b9732L9213O558J9098k5397m9887J7414J9529J7299K9224l8160l7242J2547
756a9536L015L4399K7115m3009k1879l166k856M9158J6129l5946j1435k3140K325
769b8826N4354M397j8484j1571l9255J4042M7327k52J642k1771m4389K3720L0764
782A1698O248J6434l6013l7805K4136J3273K1791J9913m5618k3932J2943L101
794a3831L8931J2906m4194j1462o164M143M9707J136l1481p884k4676J4000M8543
$$ plain form
807 29674 23036 10177 -4860 -40089 -14524 22676 18328 21891 -7214 -41171 -10096 11458 19488
820 19488 30691 -11572 -35597 -9845 -282 25152 33351 -14138 -26038 -15333 -8548 31366 29442
833 29442 -11481 -16516 -24888 -11322 34138 22747 -2878 -11040 -33885 -8303 31015 17404 9089
846 9089 -10966 -38262 -3839 21998 16809 19877 -15345 -36649 -2236 10407 21147 25258 -19706
859 -19706 -29650 -6004 909 28548 24709 -19857 -21151 -14397 -3131 34737 20068 -14068 -15048
872 -15048 -24495 -2069 35295 15012 -3906 -14287 -32321 1642 29801 13151 7185 -17729
884 -17729 -34252 4391 20133 16467 15584 -22429 -30398 2961 10411 23536 18138 -24861 -23171
897 -23171 -3728 3928 30662 15428 -22320 -16866 -13943 2935 34569 10695 -14459 -14495 -23146
$$ packed form
807B9674o638j2859j5037l5229K5565L7200m348L563k9105l3957L1075K1554Q030
820A9488J1203m2263k4025K5752R563K5434Q199m7489j1900J0705O785L9914j924
833B9442m0923n035q372J3566M5460j1391k5625q162k2845K5582L9318j3611q315
846I089k0055k7296L4423K5837n189L068l5222k1304L4413J2643J0740M111m4964
859a9706r944K3646O913K7639l839m4566j294O754J1266L7868j4669l4136r80
872a5048r447K2426L7364k0283j8918j0381j8034L3963K8159j6650n966k4914
884a7729j6523L8643J5742l666q83l8013p969L3359P450J3125n398m2999J690
897b3171J9443P656K6734j5234l7748N454K923J6878L1634k3874k5154l6q651
$$ plain form
910 -23146 6336 32928 8116 -3743 -17091 -28305 10383 26323 10020 5325 -22933 -27861
922 -27861 10972 17374 16272 10046 -27736 -23117 6190 10493 24787 9827 -27997 -17165 -2497
935 -2497 8090 31165 6550 -22717 -13849 -12518 9848 32637 3279 -13784 -15310 -20145 13567
948 13567 28591 3320 -4144 -20171 -22690 15881 21529 8340 2526 -26028 -20156 14275 14680
961 14680 16444 4191 -29308 -15326 7460 10996 24509 1645 -27984 -11790 -2073 11980 29031
974 29031 -2089 -21437 -11884 -10718 16144 28637 -3027 -12524 -16297 -15579 20010 23643 83
987 83 -5204 -22720 -15759 20040 17027 7318 -1695 -28020 -12495 15506 12708 15979 -2366 -29000
1001 -29000 -8615 7558 12362 22684 -5337 -25264 -7679 -1415 15793 24900 -7988 -18407
$$ packed form
910b3146K9482K6592k4812j1859j3348j1214L8688J5940j6303m695k8258m928
922b7861L8833O402j102o226l7782M619K9307M303J4294j4960l7824J0832J4668
935b497J0587K3075k4615k9267Q868J331K2366K2789k9358j7063j526m835L3712
948A3567J5024k5271p464j6027k519L8571N648j3189n814k8554N872L4431M05
961A4680J764j2253l3499J3982K2786L536J3513k2864k9629J6194R717J4053J7051
974B9031l1120j9348R553J166K6862J2493l1664r497l773P18L5589L633k3560
987H3n287j7516O961L5799l013r709r013k6325J5525K8001k798L271j8345k6634
1001b9000K0385J6173M804J0322k8021j9927J7585O264J7208R107l2888j0419
$$ plain form
1013 -18407 -10895 -7993 20346 22495 -7020 -11344 -17214 -10074 23392 17671 -1545 -6762 -23850
1026 -23850 -7964 22004 13255 6746 -6394 -27847 -4635 15814 11895 14588 -9363 -27150 -2892
1039 -2892 7332 14456 19198 -12309 -21995 -4752 -83 19492 19507 -12698 -15250 -10283 -3924 23587
1053 23587 16040 -9140 -10259 -17572 -3801 24372 11884 -2242 -9020 -23355 -973 21134 9970
1066 9970 5795 -11061 -25098 1573 14686 11845 12050 -14703 -22851 1223 7522 16481 14303 -17102
1080 -17102 -18001 -3200 2279 21822 12877 -15656 -12998 -10093 1125 25003 9521 -10149 -10368
1093 -10368 -16953 2871 24099 7114 -2404 -11482 -21222 5442 19115 7741 4458 -15185 -21255
1106 -21255 6244 12465 11643 8649 -18590 -17871 3599 7300 17572 8820 -19336 -13418 -2155 5119
$$ packed form
1013a8407P512K902K8339K149k9515m324n870P140L3466n721j9216n217j7088
1026b3850J5886K9968q749o509j3140k1453K3212K0449l919K693k3951j7787K4258
1039b892J0224P124M742l1507r686J7243M669J9575J5l2205k552M967O359K7511
1053B3587p547k5180j119p313J3771K8173j2488j4126o778j4335K2382K2107j1164
1066I970m175j6856j4037K6671J3113k841K05k6753q148K4074O299Q959k178l1405
1080a7102q99J4801N479J9543q945k8533K658K905J1218K3878j5482j9670k19
1093a0368o585J9824K1228j6985r518r078r740K6664J3673j1374l283j9643o070
1106b1255K7499O221q22k994k7239P19K1470L701J0272q752k8156N918J1263P274
$$ plain form
1120 5119 22411 6382 -16301 -10835 -9419 6040 23978 3741 -10381 -11294 -15039 8706 21781
1133 21781 3442 -3169 -14294 -17352 10686 16823 6503 2132 -18452 -16012 9617 11268 12033
1146 12033 4081 -20940 -12715 4834 7781 17857 2805 -19987 -9651 -1908 7840 21475 464
1159 464 -15390 -9093 -8302 10504 21566 -764 -9266 -11836 -12202 13279 18170 863 -3777 -16398
1173 -16398 -12696 13931 13601 5596 -984 -20375 -10436 11399 10287 11775 -1050 -21461 -7715
1186 -7715 5779 9431 16892 -3055 -19241 -6779 -969 11163 18952 -4769 -14256 -8527 -6318
1199 -6318 14111 17667 -3987 -8512 -12611 -8434 16340 14257 -361 -4620 -17361 -7539 15400
1212 15400 10676 5356 -3957 -20500 -5288 11369 9232 11159 -5695 -20534 -3553 5499 10741
$$ packed form
1120E119J7292j6029k2683N466J416J5459J7938k0237j4122r13l745K3745J3075
1133B1781j8339o611j1125l058K8038O137j0320m371k0584K440K5629J651P65
1146A2033p952k5021Q225J7549K947J0076j5052k2792J0336P743R748J3635k1011
1159D64j5854O297P91J8806J1062k2330q502k570l66K5481M891j7307m640j2621
1173a6398L702K6627l30q005o580j9391R939K1835j112J488j2825k0411J3746
1186g715J3494L652P461j9947j6186J2462N810J2132P789k3721r487N729K209
1199f318K0429L556k1654m525m099M177K4774k083j4618m259j2741R822K2939
1212A5400m724n320r313j6543J5212J6657k137J927j6854j4839J6981R052N242
$$ plain form
1225 10741 15010 -7799 -17167 -4460 100 14157 15599 -8512 -12506 -8110 -3338 17048 13361
1238 13361 -6278 -8467 -13289 -4018 17889 10500 -1299 -6575 -17462 -2424 15705 8616 4859
1251 4859 -7193 -19202 -738 10883 9262 9757 -9518 -18009 -661 5330 12012 11934 -11293 -14443
1265 -14443 -3323 1173 15872 11285 -10693 -10505 -7883 -115 18549 8962 -7224 -8212 -13093 754
1279 754 18209 6848 -1818 -8690 -16606 2578 14975 6732 3622 -10839 -17033 3395 10225 9373
1293 9373 7340 -12992 -14865 1725 5722 13293 8180 -13668 -11502 -2480 3073 16760 6796 -11648
1307 -11648 -9084 -7692 3011 18190 4897 -7296 -8557 -12108 4834 16962 4220 -1991 -10385
1320 -10385 -14239 6413 13468 5782 2167 -13342 -13747 6035 9165 9412 4135 -15451 -11333 3105
$$ packed form
1225A0741M269k2809r368J2707M560J4057J442k4111l994M396M772K0386l687
1238A3361j9639k189m822R271K1907p389j1799n276j0887J5038J8129p089l757
1251D859j2052j2009J8464J1621j621M95j9275q491J7348N991O682p8k3227l150
1265a4443J1120M496J4699m587k1978J88K622P768J8664r587j6186r88m881J3847
1279G54J7455j1361q666o872p916J9184J2397q243l110j4461o194K0428O830q52
1293I373k033k0332j873J6590L997P571n113k1848K166R022N553J3687r964j8444
1307a1648K564J392J0703J5179j3293j2193j261l551J6942J2128j2742o211q394
1320a0385l854K0652P055p686l615j5509m05J9782L130K47n277j9586M118J4438
$$ plain form
1334 3105 6281 13854 3759 -15051 -8762 -1725 5640 16876 2172 -11872 -7859 -6892 6820 17137
1348 17137 1089 -7136 -9271 -10400 8510 14721 1938 -2463 -12098 -11331 9220 11320 5196 431
1362 431 -14973 -9802 7664 8259 9516 832 -16172 -7711 3670 7009 13390 -505 -14914 -6550
1376 -6550 -1246 7956 15326 -1977 -11348 -7155 -5304 10115 14878 -1814 -6847 -9869 -7554 11734
1390 11734 12266 388 -3475 -13420 -7487 11194 9167 4596 -2086 -15863 -5894 8357 7534 9181
1404 9181 -2684 -15901 -4406 3858 7972 12535 -4106 -13633 -4580 -750 10022 13279 -4975
1417 -4975 -10070 -6799 -3748 12282 11766 -3744 -6563 -10379 -4489 13301 9466 -393 -4676 -13706
1431 -13706 -3470 12068 7618 4075 -4794 -15415 -2098 8507 7434 8023 -6367 -14796 -1732
$$ packed form
1334C105L176P573j0095j8810O289P037P365J1236j4704j4044M013R67J3712J0317
1348A7137j6048q225k135j129J8910O211j2783m401r635P67K0551K100o124m765
1362D31j5404N171J7466N95J257q684j7004Q461J1381L339O381j3895j4409Q364
1376f550N304R202P370j7303r371M193J851J5419M763j6692n033l022K315J9288
1390A1734N32j1878l863r945N933J8681k027m571o682j3777R969J4251q23J647
1404I181j1865j3217J1495Q264M114M563j6641r527R053L830J0772L257j8254
1417d975n095L271L051J6030n16j5510k819l816N890J7790l835r859m283r030
1431a3706J0236J5538m450l543q869j0621J3317J0605j073N89j4390q429J3064
$$ plain form
1444 -1732 4009 9131 10245 -7485 -11960 -3294 355 11878 10316 -7116 -8598 -6600 -1423 13888
1458 13888 8495 -4731 -6306 -10614 -1275 13830 6613 -802 -5980 -13423 189 11598 6067 3563
1472 3563 -7173 -14024 1168 7983 7469 6680 -9138 -12562 425 4339 10166 7550 -9979 -10007 -2414
1487 -2414 1805 12873 6738 -8714 -7562 -6235 1394 14417 5163 -5381 -6569 -9885 2316 13469
1501 13469 4323 -1083 -7453 -12104 3464 10634 5032 2608 -9478 -11935 3469 7080 7545 4647
1515 4647 -11111 -9947 1609 4445 10855 4499 -11179 -7627 -1845 3467 13223 3148 -9246 -6540
1529 -6540 -5903 4215 13821 1897 -5590 -7101 -8848 5648 12299 2339 -1683 -9027 -9790 6410
1543 6410 9487 4411 1151 -11237 -8962 5290 6542 7646 1959 -12379 -7246 2295 4986 10873
$$ packed form
1444a732N741N122J114j7730m475Q666L649J1523j562j7432j482J998N177J5311
1458A3888n393j3226j575m308R339J5105p217p415n178p443J3612J1409n531k504
1472C563j0736o851J5192O815n14p89j5818l424J2987L914N827k616j7529k8P593
1487b414M219J1068o135j5452J152J327P629J3023r254j0544j188l316J2201J1153
1501A3469r146n406o370m651J5568P170n602k424j2086k457J5404L611M65k898
1515D647j5758J164J1556K836O410o356j5678L552N782N312R756j0075j2394K706
1529f540O37J0118R606j1924p487j511j747J4496O651r960m022p344p63J6200
1543F410L077n076l260j2388K275J4252J252J104n687j4338N133R541K691N887
$$ plain form
1557 10873 1284 -11532 -5738 -1571 5197 12642 32 -8701 -5793 -5091 6677 12377 -374 -5154
1571 -5154 -7559 -7083 8134 10283 829 -2170 -10305 -7204 8142 7737 3909 -725 -12274 -5750 6407
1586 6407 6064 7552 -972 -12666 -4300 2918 5917 10308 -2127 -11127 -4158 -958 7101 11125 -2970
1601 -2970 -8040 -5441 -3907 8868 10225 -2202 -4868 -8011 -4751 9830 8217 206 -2919 -10818
1615 -10818 -4197 9044 6233 3584 -2747 -12409 -2735 6499 5714 6929 -3940 -11946 -1977 3075
1629 3075 6891 8923 -5093 -9819 -2788 -150 9046 8888 -5320 -7038 -5231 -1925 10733 7478
1643 7478 -3719 -4889 -8431 -1910 10931 5763 -411 -4173 -10770 -816 9266 5029 3268 -4871
1657 -4871 -11609 -33 6213 5713 5961 -6350 -10590 -277 2979 7725 6945 -7245 -8271 -2144 794
$$ packed form
1557A0873r589j2816N794M167O768P445j2610q733K908P02J1768N700j2751m780
1571e154k405M76J5217K149r454k999q135L101J5346m05l828m634j1549O524J2157
1586F407l43J488q524j1694Q366P218K999M391j2435r000O969L200Q059M024j4095
1601b970n070K599J534J2775J357j2427k666l143L260J4581j613q011l125p899
1615a0818O621J3241k811k649o331r662R674R234p85J215j0869q006R969N052
1629C075L816K032j4016m726P031K638R196j58j4208j718J807L306J2658l255
1643G478j1197j170l542O521J2841n168o174l762o597R954J0082m237j761q139
1657d871o738J1576O246n00K48j2311m240J0313L256M746p80j4190j026O127K938
$$ plain form
1672 794 10101 6315 -6557 -6048 -5065 332 11396 4882 -4180 -5041 -8126 965 10915 3762 -855
1687 -855 -5591 -10071 2169 8772 4036 2353 -7108 -10049 2484 5716 5949 4364 -8471 -8512 1060
1702 1060 3214 8535 4546 -8696 -6501 -1773 2016 10628 3529 -7041 -5247 -5044 2457 11281 2382
1717 2382 -4185 -5344 -7591 3689 10109 2286 -973 -6809 -8569 4482 7767 3532 1331 -8748
1731 -8748 -7996 3987 5211 6041 2193 -9853 -6315 1947 3886 8778 1688 -9294 -4927 -1290 3760
1746 3760 10429 596 -7147 -4700 -4487 4816 10397 112 -4113 -5915 -6415 5948 8715 1032 -1313
1761 -1313 -7939 -6574 6193 6524 3461 207 -9765 -5498 4885 4786 6212 -22 -10224 -4146 2120
1776 2120 4358 8487 -1000 -9225 -3636 -984 5394 9483 -1929 -6708 -4351 -3394 6914 8952 -1582
$$ packed form
1672G94R307l786j2872N09R83N397J1064o514r062q61l085R091R950p153m617
1687h55m736m480J2240O603m736j683r461k941J2533L232K33j585j2835m1R572
1702A060K154N321l989j3242K195M728L789Q612p099j0570J794K03P501Q824q899
1717B382o567j159k247J1280O420p823l259n836j760J3051L285m235k201j0079
1731h748P52J1983J224Q30l848j2046L538Q262J939M892p090j0982M367L637N050
1746C760O669r833p743K447K13R303N581j0285m225j802n00J2363K767p683k345
1761a313o626J365J2767L31l063l254r972M267J0383r9J426o234j0202O078O266
1776B120K238M129r487q225N589K652O378M089j1412m779K357R57J0308K038j0534
$$ plain form
1791 -1582 -4098 -6343 -4451 7831 7084 180 -2166 -8703 -4117 7220 5322 3107 -1607 -10221 -3039
1806 -3039 5252 4637 6019 -2322 -9990 -2151 2252 5231 7797 -3395 -8280 -2634 -631 6808 8001
1821 8001 -3815 -5877 -4476 -2310 8280 6754 -2657 -3886 -6890 -2229 8915 5308 -227 -3070
1835 -3070 -8906 -1363 7698 4331 2745 -3586 -9741 -496 5227 4609 5128 -4693 -9047 -588 2418
1850 2418 6135 6249 -5407 -7110 -1904 249 8022 5976 -4921 -5110 -4378 -553 9105 4672 -3148
1865 -3148 -3965 -6889 -70 8870 3638 -383 -4113 -8512 952 7240 3585 2387 -5265 -8645 1514
1880 1514 4823 4871 4111 -6512 -7501 636 2581 6862 4224 -6905 -5821 -1558 1383 8591 3452
1895 3452 -5743 -4497 -4136 1523 9288 2555 -3467 -4263 -6440 2248 8537 2300 -635 -5234 -7524
$$ packed form
1791a582k516k245J892J2282p47o904k346o537M586J1337j898k215m714q614P182
1806c039Q291o15J382q341p668P839M403K979K566j1192m885N646K003P439J193
1821H001j1816k062J401K166J0590j526r411j229l004M661J1144l607n535k843
1835c070n836P543R061l367j586o331o155R245N723o18N19r821m354Q459L006
1850B418L717J14j1656j703N206K153P773k046j0897j89P32L825R658m433p820
1865c148q17k924O819Q940n232m021l730m399R464O288l655j198p652l380J0159
1880A514L309M8p60j0623r89Q137J945M281k638j1129J084M263K941P208n139
1895C452r195J246L61N659P765o733o022p96k177Q688O289o237k935m599k290
$$ plain form
1910 -7524 2957 6536 3148 1596 -6665 -7100 2702 4373 5037 2583 -7600 -5770 1260 2980 7294
1925 7294 2146 -7435 -4454 -1181 2667 8586 1205 -5881 -4020 -3790 3397 8686 528 -3428 -4748
1940 -4748 -5400 4488 7504 1075 -1057 -6253 -5743 4707 5622 2832 389 -7717 -5036 3702 3992 5097
1956 5097 572 -8248 -3958 1559 3455 7115 -73 -7399 -3322 -989 4058 8011 -701 -5408 -3720
1971 -3720 -3100 4982 7555 -809 -3351 -5153 -4071 5822 6067 332 -1628 -6850 -3817 5599 4590
1986 4590 2560 -1007 -8066 -2858 4180 3895 4820 -1454 -8093 -2205 1825 4077 6367 -2228 -6821
2001 -6821 -2454 -561 5102 6668 -2485 -4899 -3647 -2142 6283 5975 -1665 -3099 -5452 -2388 6635
2016 6635 4700 128 -2186 -7099 -1869 5870 3756 2325 -2432 -7830 -1198 4094 3753 4196 -3155
$$ packed form
1910g524J0481L579l388j552q261m35R802J671O64k454j0183J830P030J720M314
1925G294n148r581K981L273L848N919p381p086J861K30P187N289q158l956j320
1940d748o52R888L016o429k132n196N10J0450R15k790k443q106K681Q738K90J105
1956E097m525q820M290N517J896L660p188p326M077K333N047L953q712m707J688
1971c720O20Q082K573q364k542j802J082R893K45n735j960n222L033R416j009
1986D590k030l567p059N208P038k85R25o274o639N888M030K252K290q595m593
2001f821M367J893N663J566r153k414J252J505Q425l08p640j434k353L064R023
2016F635j935m572k314m913N230P739k114j431m757n398O632N292l41M43p351
$$ plain form
2031 -3155 -7285 -849 2021 4735 5326 -3785 -5935 -1739 183 6082 5038 -3653 -4281 -3509 -703 7000
2047 7000 4098 -2396 -3247 -5406 -496 6918 3304 -166 -3092 -6719 205 5739 3080 1994 -3664
2062 -3664 -7038 491 3787 3851 3415 -4632 -6248 18 1937 5254 3754 -4933 -4786 -1389 924 6547
2078 6547 3242 -4269 -3692 -3290 818 7153 2403 -2645 -3328 -4992 1375 6651 2077 -583 -3894 -5888
2094 -5888 1919 5135 2529 1247 -4898 -5668 1812 3533 3873 2148 -5583 -4765 750 2226 5418 2015
2110 2015 -5459 -3737 -1190 1794 6518 1440 -4325 -3283 -3089 2191 6694 989 -2528 -3654 -4289
2125 -4289 2892 5782 1203 -663 -4601 -4623 3198 4441 2241 379 -5675 -4175 2645 3220 3778 616
2141 616 -6114 -3262 1198 2627 5235 228 -5512 -2796 -657 2789 6031 -225 -4238 -2918 -2388
$$ packed form
2031c155m130O436K870K714N91r111k150M196J922N899j044q691o28P72K806P703
2047G000k902o494q51k159M910P414l614l470k926l627O924N534k659j086n658
2062c664l374P529L296O4m36q047j616O266J919L317j500q687J47L397K313N623
2078F547l305p511N77M02M108O335m750n048o83j664O367N276m574k660l311j994
2094e888P807L216k606j282o145p70P480J721L40j725p731Q18N515J476L192l403
2110B015p474J722K547K984M724n078n765J042J94N280M503n705l517j126o35
2125d289P181K890m579j866l938k2P821J243k200j862o054J500O820N75N58l162
2141F16o730K852M460J429K608n007n740K716K139L446L242o256m013J320N30
$$ plain form
2156 -2388 3444 5803 -266 -2517 -3912 -3313 4045 4882 560 -1095 -4978 -3243 4006 3761 2091 -501
2172 -501 -5961 -2543 3000 3001 3672 -801 -5985 -1943 1275 2992 4777 -1376 -5160 -1934 -408 3697
2188 3697 5073 -1641 -3715 -2627 -1520 4532 4532 -1253 -2466 -3905 -1866 4852 3661 -12 -1653 -5153
2204 -5153 -1601 4300 2948 1691 -1549 -5803 -1047 3069 2866 3189 -2045 -5504 -878 1463 3359
2219 3359 3999 -2617 -4441 -1441 29 4299 3839 -2620 -3284 -2529 -569 5100 3184 -1728 -2436 -3874
2235 -3874 -464 5118 2519 -319 -2237 -4836 54 4243 2290 1303 -2701 -5146 331 2919 2751
2250 2751 2440 -3352 -4596 89 1584 3793 2837 -3490 -3608 -937 596 4783 2564 -3104 -2788 -2411
2266 -2411 462 5183 1859 -1942 -2477 -3696 826 4885 1620 -511 -2840 -4334 1306 3887 1853
$$ packed form
2156b388N832K359o069k251j395N99P358Q37m322j655l883J735P249k45j670k592
2172e01n460L418N543JO71m473n184M042L218J717J785o153l784L226J526M105
2188C697J376o714k074J088J107O052%n785j213j439K039O718j191l673j641l500
2204e153L552N901j352j257l240m254M756M116k03L23n234l459M626K341J896
2219C359O40o616j824L000J470M270m60o459o64P55J960N669j916m912p08j438
2235c874L410N582k599k838j918k599M890M189j953r87m004k445N477K588j68
2250B751l11n792j244M685J495K209r56o327j18K671J533M187k219n668L16L77
2266b411K873M721l324l801n35j219M522M059l265k131k329j494N640K581k034
$$ plain form
2281 1853 889 -3500 -4140 1341 2656 2752 1446 -4132 -3493 685 1761 3837 1430 -4104 -2706 -630
2297 -630 1353 4735 1017 -3310 -2323 -2029 1708 4934 640 -2040 -2529 -3125 2166 4305 772 -571
2313 -571 -3322 -3494 2366 3277 1589 301 -4087 -3045 1944 2390 2731 579 -4442 -2430 950 1909
2329 1909 3809 257 -4170 -1934 -417 2037 4413 -290 -3198 -2046 -1640 2567 4208 -437 -1996
2344 -1996 -2677 -2225 3094 3452 153 -903 -3585 -2262 3050 2722 1308 -434 -4411 -1826 2379 2103
2360 2103 2539 -580 -4518 -1324 1122 2238 3519 -1030 -3908 -1296 -145 2778 3836 -1318 -2840
2375 -2840 -1841 -1118 3384 3405 -1045 -1864 -2863 -1373 3711 2635 -164 -1297 -3793 -1061 3324 2054
2391 2054 1052 -1277 -4206 -553 2480 1996 2232 -1719 -4040 -415 1239 2434 2844 -2171 -3403 -828
$$ packed form
2281A853r64m389o40N481J315R6j306n578O39M178J076K076k407n534J398K076
2297f30J983L382l718m327R87K94L737L226m294k680m89n96N291K139l533j343
2313e71k751j72N860R11j688j288m388J042M989M46L41k152n021K012L380R59
2329A909J900l552m427K236J517K454K376m703k908J152M06M207J641m645j559
2344a996o81M52N319L58l299j056k682J323N312l28j414j742l977K585M205k76
2360B103M36l119l938L194K446J116J281m549k878K612J151K923J058n154j522
2375b840R99P23M502K1m450q19r99J490N084j076k799j133k496K732M385j270
2391B054j002k329k929L653L033m84K36l951k321L625J654J195M10n015j232K575
$$ plain form
2407 -828 156 3187 2852 -2101 -2431 -1755 -429 3822 2292 -1465 -1710 -2798 -288 3929 1789 -339
2423 -339 -1587 -3662 83 3280 1526 860 -2026 -3882 450 2247 1842 1730 -2640 -3388 308 1215
2439 1215 2643 1940 -2758 -2609 -499 540 3549 1662 -2527 -1989 -1559 441 3910 1220 -1634 -1750
2455 -1750 -2655 772 3725 985 -466 -2063 -3125 1203 3002 1223 605 -2666 -3201 1194 2048 1945
2471 1945 1107 -3240 -2661 651 1208 2858 1084 -3226 -1943 -358 1027 3614 639 -2602 -1613 -1429
2487 -1429 1305 3721 211 -1543 -1886 -2233 1774 3273 248 -548 -2479 -2448 2066 2446 893 211 -3147
2504 -3147 -2160 1755 1706 1881 342 -3457 -1692 925 1380 2803 24 -3298 -1332 -222 1464 3340
2520 3340 -364 -2461 -1417 -1234 1987 3251 -472 -1498 -1919 -1716 2444 2641 -14 -685 -2694 -1656
$$ packed form
2407h28R84L031l35m953l30O76J326M251j530l757k45j088K510M217k140k128
2423c39j248k075L745L197j754o66k886j856M332J797m05j12m370p48L696R07
2439A215J428p03m698J49K110J039L009j887m189N38M30K000L469k690k854j16
2455a750r05L427K953k740j451j597j062M328J799j779o18l271n35M395Q54j03
2471A945q38m347N79L312N57J650j774m310J283J585J385K587k975l241R89J84
2487a429K734K416l510j754l43l47M007J499l025p96j931L1M514L80j553o82l358
2504c147R87L915m9J75j539l799J765K617M55J423k779l322J966J110J686J876
2520C340l704k097J044J83L221J264l723j026m21K03M160J97k655o71k009J038
$$ plain form
2536 -1656 2511 1930 821 -365 -3366 -1154 1999 1542 1803 -554 -3410 -721 1048 1540 2612 -955
2552 -955 -2952 -704 27 2022 2754 -1220 -2166 -1218 -794 2625 2507 -1046 -1358 -2103 -1024 2862 1882
2569 1882 -338 -882 -2845 -742 2713 1492 727 -880 -3267 -282 1948 1384 1552 -1301 -3081 -118
2585 -118 946 1723 2102 -1708 -2469 -449 180 2381 2026 -1787 -1739 -1078 -299 2931 1647 -1299 -1233 -2051
2603 -2051 -168 3016 1102 -381 -1202 -2725 165 2497 965 574 -1530 -2903 462 1782 1353 1336
2619 1336 -1929 -2557 340 840 2025 1574 -2188 -1959 -232 341 2606 1300 -1952 -1396 -1100 220 2943
2636 2943 825 -1329 -1183 -1870 604 2770 564 -416 -1432 -2327 916 2203 688 406 -1911 -2308
2652 -2308 991 1432 1261 804 -2373 -1849 623 865 2108 842 -2429 -1301 -118 715 2631 481
$$ packed form
2536a656M167n81j109j186l001K212L153m57K61k357k856K689J769M92J072l567
2552i55j997K248P31J995P32l974r46R48M24L419j18l553l12p45J079L886r80
2569A882k220n44j963K103L455j221p65j607k387K985K230n64J68k853j780K963
2585a18J064P77L79l810p61K020O29K201l55l813M8O61P79L230j284k946O6q18
2603b051J883L184j914j483q21j523K890K332j532l91k104j373L365J320m29j7
2619A336l265o28K897N00J185m51l762K29J727N73K265j306l252N56K96J320K723
2636B943k118k154J46o87K474K166k206r80j016q95L243J287j515k82k317l97
2652b308L299M41j71m57l177N24K472K42J243j266l271J128J183Q33J916k150
$$ plain form
2668 481 -1999 -1101 -971 889 2822 139 -1267 -1275 -1664 1224 2441 159 -372 -1709 -1891 1495 1772
2685 1772 642 165 -2223 -1598 1332 1191 1283 273 -2573 -1231 725 854 1940 0 -2417 -858
2701 -858 -116 1020 2384 -269 -1795 -908 -786 1452 2366 -410 -1089 -1285 -1260 1781 1907 -127 -489 -1907
2719 -1907 -1222 1785 1363 507 -222 -2347 -929 1407 990 1317 -280 -2537 -586 654 1051 1855 -610
2736 -610 -2140 -473 -41 1386 2019 -891 -1531 -781 -542 1825 1734 -741 -956 -1335 -689 2025 1313 -237
2754 -237 -491 -1936 -529 1931 968 452 -612 -2267 -193 1408 895 1112 -840 -2212 -71 618 1162
2771 1162 1553 -1103 -1808 -274 61 1639 1533 -1231 -1215 -710 -296 1981 1188 -922 -864 -1409 -77 2109
2789 2109 779 -298 -720 -1810 154 1745 688 398 -963 -1947 357 1226 907 869 -1314 -1760 284
$$ packed form
2668D81k480Q98J30J860J933k683j406ql89K888J217k282n31j337j82L386K77
2685A772j130m77k388O25K930j41R2j010k846J342J956J29J086j940k417J559
2701h58P42J136J364k653j526Q87J22K238R14k776o79j96K5L041J26k034l62j418
2719a907O85L007m22q56p29k125J418K336m17L27j597k257J951J240L97Q04k465
2736f10j530J667M32J427O33k910o40P50K39K367r1k475k15l79O46K714p12j550
2754b37k54j445J407K460r63n16j064j655K074J601n13K17j952j372K141O89N44
2771A162L91k656p05J534L35J578j06k764J6N05M14K277p93k110N8n45J332K186
2789B109j330j077m22j090J964J591j057k90j361r84K304Q69l19l8k183m46K044
$$ plain form
2806 284 602 1295 1099 -1523 -1341 -136 265 1744 925 -1325 -926 -749 199 2029 649 -915 -792 -1305
2824 -1305 348 1981 427 -243 -939 -1657 592 1565 508 277 -1340 -1608 724 974 782 562 -1572
2841 -1572 -1226 520 585 1314 515 -1638 -947 -82 435 1758 269 -1413 -726 -653 547 1816 71 -881
2859 -881 -796 -1081 831 1642 50 -282 -1134 -1244 1018 1249 398 101 -1508 -1108 870 856 852 220 -1658
2878 -1658 -840 575 615 1325 -44 -1602 -535 0 682 1588 -214 -1251 -522 -515 946 1563 -372 -778
2896 -778 -850 -791 1199 1250 -189 -381 -1197 -814 1292 876 244 -202 -1553 -520 945 697 800 -228 -1617
2915 -1617 -302 529 648 1209 -454 -1382 -254 -20 914 1308 -588 -1065 -492 -362 1216 1161 -532 -688
2933 -688 -849 -430 1390 835 -207 -360 -1264 -292 1310 686 163 -419 -1505 -131 940 514 706 -628
$$ packed form
2806B84L18O93j96k622J82J205M01J479q19k250L99J77R48J830j380j564J23n13
2824a305J653J633j554o70o96p18K249R73j057k31j617k68K332K50j92k20k134
2841a572L46J746O5P29p99k153O91Q65N17J323j489j682O87P3J200J269j745r52
2859h81Q5k85J912Q11j592l32q52j10K262K31q51k97j609M00J978j4mo32j878
2878a658Q18J415M0P10j369j558J067N35O82R06j802j037P29PJ461O17j935m06
2896g78p2N9J990N1j439j92q16L83K106m16o32m46j351J033J465k48J03j028j389
2915a617J315Q31J19N61j663r28J128K34R34L94j896m77N73J30J578n5j693j56
2933f88j61M19J820n55j042j53r04R72J602o24n23n82j086J374J071m26J92j334
$$ plain form
2951 -628 -1423 -12 491 739 972 -760 -1148 -84 123 1068 900 -851 -840 -395 -123 1364 737 -642
2969 -642 -589 -900 -45 1446 490 -280 -582 -1198 130 1226 440 261 -745 -1366 285 832 559 520 -892
2988 -892 -1153 251 490 808 606 -1045 -919 14 180 1164 521 -918 -624 -410 160 1348 354 -695
3006 -695 -526 -796 303 1338 194 -276 -675 -1014 471 1051 264 52 -924 -1025 558 696 594 259
3024 259 -1115 -840 411 493 965 332 -1224 -576 87 366 1198 118 -965 -479 -390 514 1265 -29 -615
3043 -615 -547 -695 705 1128 36 -253 -764 -783 753 867 207 -43 -1098 -717 691 554 498 -33 -1219
3062 -1219 -478 419 520 871 -70 -1157 -394 76 556 1100 -221 -896 -383 -332 708 1045 -254 -612 -577
3081 -577 -445 883 837 -136 -286 -907 -451 955 649 199 -163 -1127 -329 717 487 466 -242 -1189 -253 442
$$ packed form
2951f28p95J411N03K48K33j732l88J064K07R45j68j751J1M45K72J487o27j379
2969f42N3l11Q55J491r56p70l02o16J328J096p86j79j006o21J651N47k73l9j412
2988h92k61J404K39L18k02j651J26R33J66R84o43j439K94K14N70J188r94j049
3006f95J69k70J099J035j144m70l99l39J485N80p87k12r76j01J583J38j02l35
3024B59j374K75J251Q2M72o33j556O48O63K79Q32j080j083M86Q9R04P51j294n86
3043f15O8j48J400M23j092k89n11j9J536J14o60k50j055L81J408j37n6n31j186
3062a219P41Q97J01L51r41j087P63M70M80N44j321o75N13N1J040L37j299l58L5
3081e77J32J328m6r73j50o21M56J406l06m50l62r64P98J046k30k1p08r47R36O95
$$ plain form
3101 442 444 793 -402 -1098 -209 56 612 920 -527 -763 -356 -139 902 835 -422 -512 -688 -196 1032 649
3121 649 -226 -373 -916 -153 1007 446 138 -375 -1097 -52 794 460 474 -528 -1025 31 466 548 629 -728
3141 -728 -845 -76 75 795 584 -681 -653 -343 -32 983 469 -547 -413 -669 44 1114 375 -265 -375
3160 -375 -854 157 923 274 161 -555 -939 263 655 442 355 -755 -897 233 339 630 438 -843 -682
3179 -682 39 212 901 360 -780 -569 -297 171 975 231 -645 -451 -631 248 1043 143 -248 -538 -796 402
3199 402 793 226 47 -717 -780 443 620 396 229 -882 -665 304 407 713 229 -896 -512 55 258
3218 258 910 181 -773 -413 -293 361 1040 7 -486 -492 -578 480 914 -45 -227 -626 -631 649 692 151 -50
3239 -50 -829 -571 540 499 403 67 -936 -408 401 391 762 -38 -913 -331 52 442 841 -109 -713 -378 -256
$$ packed form
3101D42KL49j195o96Q89K65N56L08j447k36M07K17J041o7j257r0j76M92J228l83
3121F49q75j47n43P63J160n61l08n13p22J045Q46l34J4j002m97J056M35Q2Q1j357
3141g28j17P69J51P20k11j265K8L10L11J015n14j016J34k56P13J070p39o40j10
3160c75m79J011P66o49j13p16l84J202L92k13q7j110j42J130J06K91j92j281J61
3179f82P21J73O89n41j140K11K72M68Q04p44q76J94j80Q79P95r00l91k90k58J198
3199D02L91n67j79p64o3J223J77k24j67j111K17R69J03L06m84j125L84N67K03
3218B58O52p29r54L60J20O54O79j033m93oq6J058M34r59j82l99nJ280M3n41k01
3239e0p79K58J111m1r6l36j003N28Q09j0L71q00q75N82L83L90L99r50o04L35J22
$$ plain form
3260 -256 462 940 -244 -468 -535 -408 664 735 -25 -226 -715 -436 723 591 133 -98 -971 -397 560 403
3280 403 517 -123 -1008 -273 341 365 655 -160 -839 -189 71 537 797 -305 -684 -303 -215 659 702 -370
3300 -370 -463 -519 -228 801 549 -84 -221 -756 -209 758 381 149 -230 -896 -103 620 423 445 -309 -944 -71
3321 -71 321 450 614 -427 -775 -86 72 644 660 -503 -568 -314 -146 834 597 -414 -386 -511 -112 878
3341 878 382 -86 -299 -745 11 745 324 92 -359 -821 22 554 428 380 -517 -859 57 252 497 480 -580
3362 -580 -620 -33 81 726 510 -548 -477 -267 20 905 390 -434 -389 -567 105 877 243 -116 -379 -775 138
3383 138 755 248 158 -467 -769 237 493 378 279 -607 -664 148 252 619 373 -679 -493 -60 124 738
3403 738 290 -541 -407 -348 109 887 189 -305 -341 -564 204 809 130 -88 -431 -662 327 635 257 53 -568
$$ packed form
3260b56P18M78j184k24o7J27J072P1p60k01m89K79J159j32m58k31q73N74R57j57
3280D03J14o40q85P35O14K4K90q15o79O50K60M66K60j102l79L81Q8Q74M3j072
3300c70r3n6K91J029k52o33j37n35N47R67l77k32l79o66P93P23j97K2p54o35Q73
3321g1L92J29J64j041l48O89J58N72J6j163o5K54J68R80k37j011K8j25L99R90
3341H78m96m68k13m46P56P34m21k32m51m62Q43N32j26m8q97l42R16J95K45j7j060
3362e80m0N87J14O45k16j058P1K10K87Q85n15q24M5j78O72P72o34l59k63l96R13
3383A38O17n07r0o25l02J006K56j15r9q86n7Q12J04L67k46j052J86M33J84O14
3403G38m48q31J34N9M57P78o98m94l6k23P68O05o79k18l43k31R89L08l78k04o21
$$ plain form
3424 -568 -729 263 435 446 201 -736 -559 189 276 652 249 -667 -438 -103 175 818 127 -610 -369 -348 270
3445 270 870 85 -329 -410 -541 394 757 37 -106 -497 -583 434 531 236 75 -715 -524 396 324 470 155
3466 155 -777 -387 201 265 753 61 -749 -338 -65 341 776 -56 -528 -332 -316 424 746 -86 -334 -429 -466
3487 -466 486 604 32 -101 -613 -416 572 424 226 -24 -727 -345 409 302 480 -27 -796 -250 209 340
3507 340 628 -130 -674 -199 -71 414 722 -195 -482 -334 -254 523 650 -160 -274 -518 -259 619 464 10
3527 10 -103 -649 -196 593 378 204 -118 -778 -202 416 300 497 -198 -723 -137 141 433 603 -281 -635
3547 -635 -151 -72 518 610 -256 -366 -318 -189 669 510 -195 -253 -579 -206 623 333 7 -228 -715 -163 583
3568 583 292 310 -306 -747 -34 358 338 468 -307 -725 -47 136 530 469 -448 -541 -178 -6 663 523 -365
$$ packed form
3424e68j61R92J72J1k45r37J77P48Q7L76m03r16K29L35K78O43o91p37K41K1O18
3445B70O00p85m14q1j31R35L63p20j43l91q6J017R7k95j61p90J91R20p2J46l15
3466A55r32L90N88O4M88o92q10M11K73M06M35q32m72J96J6P40L22q32k48r5l7
3487d66R52J18n72j33n12J97R88j48j98k50p03L82P54j07J78n07p69N46M59J31
3507C40K88p58n44M75J28M85L08r17k87J48Q0P77J27q10j14k44K59Q78j55m54
3527A0j13n46M53P89k15j74l22o60N76O18j16J97o95n25N86K78K92J70q84l54
3547f35M84P9N90R2q66j10M8J29Q58j59p05n8l26L73Q29k90l26k35m87N52P46
3568E83k91J8o16m41P13L92k0J30p75m18O78J83L94o1r17r3L63J72O69j40q88
$$ plain form
3589 -365 -327 -339 -89 716 300 -269 -313 -578 -11 639 298 -7 -267 -666 49 558 237 221 -389 -662 72
3610 72 327 372 362 -477 -601 20 136 537 381 -527 -461 -135 64 647 338 -449 -316 -416 63 731 166
3631 166 -191 -360 -559 149 638 211 -53 -429 -644 160 472 255 155 -500 -563 170 304 397 230 -568 -405
3652 -405 113 170 561 229 -527 -381 -159 201 721 111 -405 -308 -373 208 658 107 -180 -359 -477 261 600
3673 600 135 -14 -474 -494 324 443 244 90 -636 -527 190 272 447 77 -669 -322 84 213 587 32 -560
3694 -560 -245 -163 287 696 -60 -389 -266 -300 359 678 49 -177 -433 -425 448 462 154 0 -531 -344 425 409
3716 409 282 14 -623 -325 275 298 401 -44 -658 -245 24 296 567 -174 -585 -230 -125 410 669 -86
3736 -86 -379 -369 -197 484 580 -84 -190 -465 -257 553 422 106 -115 -558 -235 434 339 284 -99 -644 -169 299
$$ packed form
3589c65L8j2K50Q05m16n69m4k65N67O50l41l05k60l99P15N09l21j6o10k73P34
3610G2K55M5j0q39j24O21J16M01j56r08O6L26J99N83l09p87J33j00M79O68n65
3631A66l57j69j99P08M89m27k64l76k15Q04L12k17j00o55o3P33J34R3j67p98J63
3652d05N18N7L91l32p56J46K22L60N20o10n16R7o5N81M50n51k87j79j18P38L39
3673F00m65j49m60k0Q18J19j99j54p26J09P17Q2J75l70p46L47M06J29L74n55n92
3694e60L15Q2M50M09p56l29J23l4O59L19o29k26k56QQ73J4l08j54n31J87P69j6
3716D09j27k68o37K98O00K3J03m45o14M13K69K72K71p41m11L55J05N35K59p55
3736h6k93J0J72O81R6o64j06k75K08Q10j31l16k21m43L23O69r5n5l83n45M75M68
$$ plain form
3758 299 301 422 -156 -623 -90 16 396 525 -212 -551 -251 -87 508 501 -270 -368 -306 -191 569 437 -103 -224
3780 -224 -505 -113 586 328 -27 -200 -654 -62 487 303 280 -257 -605 -42 273 326 366 -349 -507 -63 117
3801 117 466 447 -354 -437 -124 -18 560 325 -273 -339 -343 -26 601 247 -180 -305 -486 34 579 286 13 -385
3823 -385 -599 104 409 254 197 -373 -525 100 276 413 278 -518 -424 -13 140 498 312 -447 -370 -212 93
3844 93 572 136 -359 -321 -329 76 641 180 -167 -287 -478 180 549 140 -33 -445 -515 255 370 252 117 -502
3866 -502 -445 147 266 422 110 -552 -409 19 166 591 104 -533 -329 -155 213 657 91 -431 -352 -292 288
3887 288 695 105 -252 -397 -394 337 514 98 -119 -560 -444 339 382 275 4 -623 -382 214 235 413 89
3908 89 -568 -249 84 280 468 -30 -541 -276 -107 342 645 -26 -353 -344 -223 456 578 32 -260 -460 -370
$$ packed form
3758B99KJ21n78m67N33J06L80J29p37l39L00J64N95pp71r8O2J15P60j32n40j21
3780b24k81L92O99k58l55j73m54N92N49j84k3n37l48N63L15N3M0p15j58M44J80
3801A17L49j9q01q3L13J06N78k35n98o6mL17O27l54m27j25j81N20N45k93k73l98
3823c85k14P03L05j55n7n70j52O25J76J37j35p96R4M11J53L58j86p59P7J58L05
3844I3M79m36m95L8qM05N65m61l47j20j91O58L69m09j73m12p0P70J15j18j35o19
3866e02N7N92J19J56l12o62J43M28J47M25m87o37K04J74L68M44n66n22P9O0N80
3887B88M07n90l57j45LP31J77m16k17m41J16P83M3j07k71o27K41N96K1J78l24
3908H9o57L19L33J96J88m98n11K65J69M49L03o71l27RJ21O79J22n46k92k00R0
$$ plain form
3929 -370 483 460 20 -97 -640 -258 417 337 274 -117 -614 -237 246 271 475 -166 -630 -198 114 421 547
3950 547 -217 -558 -254 -41 497 556 -158 -399 -369 -170 583 478 -107 -257 -506 -194 521 372 47 -180 -596
3971 -596 -140 392 334 237 -238 -721 -99 299 343 429 -295 -559 -142 88 470 479 -394 -508 -203 -18 554 440
3993 440 -216 -353 -354 -38 619 356 -208 -265 -496 -67 563 288 75 -294 -594 49 428 330 226 -370 -598
4014 -598 26 317 349 261 -442 -553 -78 131 544 389 -387 -418 -189 81 626 312 -330 -341 -357 79 728 205
4036 205 -125 -317 -505 105 584 236 64 -402 -627 162 449 274 210 -419 -633 103 298 411 272 -536
4056 -536 -398 -52 158 545 244 -496 -445 -236 160 661 167 -293 -356 -377 238 673 143 -251 -378 -452 299
4077 299 546 220 -25 -484 -457 300 424 295 77 -522 -452 247 337 415 57 -587 -339 34 263 565 142
$$ packed form
3929c70Q53k3m40j17n43L82O75q0o3l91m97L77M83K5K04o41m64M32L12L07J26
3950E47p64l41L04K13N38N9p14k41L0J99P53j05n85j50k49L12P15j49l25k27m16
3971e96M56N32n8r7m75m83O22L98M4Q6p24k64M17K30L82Rq73j14L05J85N72j14
3993D40o56j37jL16O57k63n64n7k31M29O30k75k13l69l00O43L79r8j04n96k28
4014e98O24K91L2q8p03j11M75K09M13j55p76l1K29K70N45l14o42j1j6M36O49n23
4036B05l30j92j88O10M79l48j72m66k25P89K87j75o4o29k14P36J95J13j39q08
4056e36J38L46K10L87l01p40N1K09L96N01m94m60o3k1O15M35n30l94j27p4P51
4077B99K47l26k45m59K7P57J24j29k18n99P0O99R0P8l58o44K48L73K29L02m23
$$ plain form
4098 142 -502 -302 -162 264 645 16 -404 -354 -323 309 551 14 -207 -423 -378 375 481 187 -19 -571 -353
4119 -353 274 357 300 58 -607 -264 213 262 445 -85 -564 -228 68 329 516 -69 -538 -265 -135 300 565
4140 565 -118 -354 -367 -275 387 529 -19 -174 -452 -267 407 407 153 -96 -555 -279 402 381 290 -86 -584 -217
4162 -217 254 351 397 -133 -544 -140 64 359 490 -197 -482 -176 -98 414 430 -207 -297 -363 -239 460 423 -68
4184 -68 -207 -487 -162 479 307 40 -215 -585 -93 386 273 280 -185 -627 -89 234 322 389 -318 -561 -88 69
4206 69 462 408 -247 -421 -167 11 522 312 -249 -313 -404 -73 512 274 -86 -237 -463 -47 464 266 110
4227 110 -284 -578 -26 313 297 236 -266 -517 48 230 336 254 -333 -415 -47 68 455 326 -375 -283 -156 30
4249 30 553 221 -282 -207 -316 60 499 247 -82 -239 -465 37 438 193 26 -339 -484 59 281 263 174
$$ packed form
4098A42o44K00J40M26L81o29m20N0L1O32K42n37k21k16M5P53J06k94k06n52K18
4119c53O27Q3n7k42o65L43M77M9J83n30m79L36K96K61J87n85m69K73J30M35K65
4140E65o83k36j3R2O62J42n48j55k78J85O74%k54k49m59K76O81k1r1l76m98L67
4162b17M71R7M6n30m11M04K04K95J31o87k85L06P8N12J6o37r0o6J24O99l7m91
4184f8j39k80L25O41j72k67k55l70M92M79j13Pm65m42N38L23Q8O7p07k43M73J57
4206F9L93n4o55j74K54J78N11k10n61o4r1L31N85k38l60j51k26M16N11j98j56
4227A10l94k94N52L39j6o1n02k51N65J82J06q2n87q2L68J15L87j29p01R2J27J86
4249C0N23l32n03P5j09L76M39k52l29j57k26N02M01k45j67l65j45N43K22j8q9
$$ plain form
4270 174 -375 -386 32 180 324 211 -408 -333 -22 117 466 194 -342 -360 -131 101 482 175 -238 -259 -267 147
4292 147 528 118 -88 -326 -371 187 384 187 39 -374 -448 186 328 230 93 -386 -328 72 234 334 119
4313 119 -463 -245 0 178 405 97 -289 -243 -146 154 495 32 -223 -230 -340 189 459 65 -121 -312 -319 236
4335 236 328 62 -50 -397 -328 150 296 216 32 -401 -217 124 204 312 57 -410 -199 22 145 435 53
4356 53 -295 -219 -122 221 404 -48 -138 -245 -237 266 341 29 -54 -325 -198 274 306 80 -41 -405 -191 202 211 285
4380 285 -54 -404 -155 112 247 271 -27 -359 -126 -54 191 396 -101 -253 -153 -121 287 321 -120 -159 -270 -215
4402 -215 321 216 31 -76 -283 -95 272 217 63 -32 -397 -143 175 164 277 -108 -354 -126 91 180 229 -158
4424 -158 -275 -108 -95 245 233 -123 -279 -176 -86 292 247 -127 -192 -234 -146 296 175 23 -158 -303 -100 266
$$ packed form
4270A74n49j1M18J48J44j13o19P5L11J39L49k72n36j8K29K32L81l07m13k1qM14
4292A47L81m10k06k38m5N58J97j97j48m13p4O34J42r8j37m79N8M00J62J00k15
4313A19n82K18K45J78K27l08l86M6R7L00L41m63k55pj10N29K70l94j86j91pN55
4335B36R2k66j12l47O9M78J46q0j84m33J84L41Q0J08k55m67K11K21J23K90l82
4356E3l48P6R7L43J83m52r0j07QN03P5l12q3k71J27M72L2k26j21l64K14L93RP4
4380B85l39l50K49K67J35K4k98l32K33P2K45K05m97j52J00L2M08L4m41l9j11N5
4402b15N36j05j85j07k07J88L67n5j54r5l65K54L18j1J13l85k46K28K17Q9M9l87
4424a58j17J67J3L40j2l56j56J03R0L78m5l74o5m2Q8M42j21j52j81j45K03L66
$$ plain form
4446 266 107 96 -77 -344 13 212 163 177 -123 -272 -28 86 188 302 -137 -251 -35 -27 235 224 -167 -267
4468 -267 -132 -46 265 226 -90 -111 -275 -41 268 119 37 -131 -319 22 241 125 167 -141 -228 8 188 236
4490 236 201 -211 -250 -33 54 196 179 -134 -192 -42 36 286 161 -165 -101 -166 -3 333 142 -93 -84 -229 61
4513 61 257 95 -16 -149 -232 -19 206 120 76 -211 -223 73 78 191 113 -194 -152 40 81 215 131 -182 -161 -97
4537 -97 14 260 154 -126 -140 -180 16 287 73 -86 -117 -248 58 221 124 43 -171 -254 5 159 97 82 -186
4560 -186 -201 -24 111 123 119 -188 -200 30 76 213 55 -140 -160 -83 61 238 70 -109 -171 -96 57 260 119
4583 119 -63 -181 -229 65 208 103 -51 -247 -206 36 191 93 26 -243 -232 35 58 174 24 -204 -179 32
4605 32 118 248 48 -259 -123 -113 49 276 31 -102 -98 -112 140 273 40 -50 -166 -119 122 194 98 -23 -190
$$ packed form
4446B66j59j1j73k67L57J99m9J4l00j49K44J14J02J14m39j14K16QK62j1l91j00
4468b67J35Q6L11l9l16k1j64K34L09j49q2j68j88L41K19j16M2l08q7K36J80M8
4490B36l5m12l9K17Q7J42j7l13n8J50P8K50j25l26O4o5J63L36j91k35Rj45K90
4513F1J96j62j11j33q3K13K25q6m4k87j2K96NJ13p8l07M2J92M1J34q4l13K1O4
4537i7J11K46j06k80j4m0J96K71k14j59l1j31L06J63r7q1k14q3K59J54o2j5k68
4560a86j5J77J35J2ml07j2K30M6J37j58j95k0P7J44J77j68j79o2P5J53K03j41
4583A19j82j18m8K94J43j05j54j96M1K42J55r8o7k69J1K67K3J16j50k28K5K11
4605C2Q6J30k00l07J36J0J62K27k45j33Mj4K52J33k33r0j16M7K41P2r6j21j67
$$ plain form
4628 -190 -219 84 118 112 21 -247 -215 24 67 206 28 -222 -120 -50 38 255 84 -230 -113 -91 93 210 25
4651 25 -90 -134 -195 126 249 79 -36 -166 -193 159 248 81 43 -188 -185 85 156 123 30 -282 -141 55 122 246
4675 246 12 -230 -130 23 78 228 -2 -219 -150 -44 87 303 46 -82 -142 -152 150 182 79 -48 -166 -148
4697 -148 187 182 124 25 -229 -154 115 150 185 45 -224 -134 14 105 228 -20 -288 -143 -34 84 213 -48 -254
4720 -254 -150 -114 168 264 -38 -134 -165 -147 141 173 7 -84 -217 -187 169 194 110 -68 -300 -151 88 175 184 -26
4744 -26 -325 -174 14 172 262 -17 -324 -158 -10 160 258 5 -164 -107 -135 233 255 -62 -149 -262 -193 199 217
4767 217 13 0 -288 -118 185 180 87 -94 -288 -94 167 198 217 -65 -287 -134 42 214 270 -94 -273 -128
4789 -128 -4 239 255 -61 -192 -132 -88 220 229 -26 -152 -244 -131 270 203 24 -128 -298 -63 266 181 74 -73
$$ packed form
4628a90k9L03L4or1k68L2K39M3J39j78k50J02P0Q8K17j71l14J17K2J84J17j85
4651B5j15m4o1L21J23j70j15j30k7L52Q9j67l8k31LK70P1l3r3l12J41J96O7J24
4675B46k34k42J00J53N5J50k30k17O9J06J31K16k57j28o0j0L02L2j03j27j18J8
4697a48L35nn8r9k54P5K69L5L5j40k69R0J48R1J23k48k68J45J09J18J29k61k06
4720b54J04L6K82R6l02r6l1J8K88L2j66r1j33L0L56K5q4j78k32J49K39Q7Rk10
4744b6k99J51J88J58R0k79l07J66J48J70R8k53j69N7k8L68K2l17q7j13O9L92J8
4767B17k04j3k88J70L03nr3j81j94J94K61L1J9k82k22J53J76J72N6l64j79J45
4789a28J24K43J6l16j31O0M4L08Rk55j26r2J13M01o7j79j52j70K35L29q5j07j47
$$ plain form
4812 -73 -350 -59 136 174 209 -146 -275 -87 50 221 255 -137 -265 -123 -53 264 325 -96 -230 -183 -55 296
4834 296 226 23 -99 -252 -78 285 110 0 -115 -315 -61 231 197 185 -143 -353 -48 150 206 98 -181
4855 -181 -346 -54 71 275 211 -212 -202 -59 21 355 166 -187 -163 -159 -39 419 172 -97 -192 -257 10 308 163
4878 163 4 -190 -287 58 306 189 87 -191 -339 40 119 281 179 -302 -310 -41 62 349 189 -228 -303 -140
4900 -140 53 421 238 -183 -227 -216 99 386 146 -65 -196 -281 96 365 148 49 -208 -369 120 278 173
4921 173 27 -254 -375 26 175 230 99 -349 -323 -26 124 345 134 -281 -266 -121 141 417 75 -260 -220
4942 -220 -239 121 377 100 -60 -271 -311 175 341 134 -37 -228 -312 184 247 209 67 -370 -302 84 222 253
4964 253 92 -363 -290 -12 163 331 51 -291 -207 -150 125 431 43 -223 -237 -221 195 404 50 -154 -324 -268
$$ packed form
4812g3k77K91J95L8L5l55j29J88J37J71L4l92j28J42P0L17O1m21j34M7J28L51
4834B96p0k03j22j53J74L63j75j10j15k00K54K92l4j2l28k10L05J98N6j08k79
4855a81j65K92J25K04o4m23J0J43Q0L34j89l53K4MJ20M58k47k69r5o5K67K98j45
4878A63j59j94r7L45K48j17j02k78j48L79P9J62j02m81qK69J03K87j60m17p5J63
4900a40J93L68j83m21m4J1L15K87k40k11j31q5L77K69k17r9k57j61M89J58j05
4921A73j46k81j21M01J49N5j31m48K6K97J50K21k11m15J5J45K62K76l42l35M0
4942b20j9L60K56k77j60k11m0M86J66k07j71j91q4M96O3l8j42m37O8L86J38L1
4964B53j61m55P3K78J75J68k80l42Q4N7K75L06l88k66j4J6M16K09l54k04j70N6
$$ plain form
4986 -268 191 295 101 11 -360 -273 237 268 148 -14 -423 -221 116 214 344 -28 -427 -183 44 237 344
5007 344 -49 -330 -215 -113 240 411 -58 -252 -262 -148 236 360 -11 -164 -329 -206 301 264 69 -53 -404
5028 -404 -164 274 270 255 -78 -420 -124 152 241 253 -99 -475 -178 36 262 365 -110 -330 -149 -36 297 395
5050 395 -155 -181 -286 -135 356 267 -67 -221 -391 -150 357 246 30 -178 -402 -66 264 234 227 -143 -485 -50
5072 -50 241 304 289 -219 -364 -64 17 316 316 -179 -290 -167 -14 463 290 -174 -229 -350 -63 451 271 -48
5094 -48 -223 -388 37 410 181 78 -220 -472 5 310 191 167 -260 -486 18 189 320 212 -249 -354 -52
5115 -52 139 427 244 -315 -282 -155 57 508 221 -282 -265 -333 48 524 143 -127 -289 -435 98 336 193
5136 193 60 -332 -437 92 269 304 54 -351 -386 49 195 369 137 -409 -289 13 141 460 157 -382 -274
$$ packed form
4986b68M59J04j94r0l71Q7N10L1j20j62m09K02L37R8J30l72l99K44K27J93J07
5007C44l93k81J15J02L53J71m69j94j0J14L84J24l71j53j65J23N07l7j95j22l51
5028d04K40M38mj5l33l42K96K76Q9J2l52l76K97K14K26J03m75k20J81J13L33R8
5050C95n50k6j05J51M91q9l34j54j70K41N07j11k16k08k24L36L30l0pl70l42M35
5072e0K91O3j5n08j45L00Q1K99%m95j11J23J53M77j73m64n5j21K87N14j80l19
5094d8j75j65M25L73k29j03k98k52M77L05j19k4m27k26N04J71J31j08m61j05L02
5115e2J91K88j83n59L3J27K12M51k87n03J7o8L81M76l81k70j62j46N33K38j43
5136A93j33l92j05N29J77L5k50m05l5M35J46J74k32n46J20L02J28L19l03n39J08
$$ plain form
5157 -274 -121 153 515 117 -291 -273 -254 146 474 93 -131 -312 -366 161 404 145 -24 -359 -379 199 253 255
5179 255 91 -472 -323 88 263 388 84 -420 -297 5 174 534 40 -361 -250 -150 214 440 27 -280
5199 -280 -247 -283 346 466 18 -96 -427 -331 320 366 121 -36 -465 -320 282 225 226 -25 -596 -249 176 255 391
5222 391 -44 -555 -211 -33 265 443 -97 -417 -214 -137 363 458 -67 -222 -259 -187 424 377 -10 -128 -406 -170
5244 -170 419 297 48 -160 -549 -146 311 281 257 -163 -556 -98 143 303 350 -175 -467 -104 49 379 412
5265 412 -230 -348 -181 -70 459 345 -163 -288 -334 -87 481 313 -70 -215 -450 -47 466 225 99 -190
5285 -190 -523 41 346 326 175 -278 -515 -19 234 323 313 -325 -433 -124 84 445 283 -327 -302 -200 -10
5306 -10 490 284 -233 -266 -356 10 468 193 -110 -262 -496 13 446 252 106 -373 -538 60 341 301 177
$$ packed form
5157b74J53K74L62l98m08J8J9M00L28l81k24j81n4N27K43k59j69l35k0N78N4K
5179B55j64n63J49M11J75J25l04n04J23L02J69L60m94m01J11J00L64K26m13l07
5199b80L3l6O29J20m48j14l31R6O51M6k45j57m29J45O02n7Jk51n71L47M25P9J36
5222C91m35n11L44J78K98J78n40l20K03P7N00R5n25j55l7P2O11m7l87j18k78K36
5244a70N89j22k49k08l89M03M57l0k4m20l93M58K41J60M7n25k92L63J53L30L3
5265D12o42j18J67J11N29j14n08j25m6K47N68j68l83j45k35M03N13k41j26k89
5285a90l33N64L05k0j51m53k37M96K53Q9j0o38j08L09K08L61j62o10K5J02J90
5306a0N00k06n17l3r0L66M58k75l03j52k34N09M33j94j46m79j65N98K81m0j24
$$ plain form
5327 177 -371 -460 83 215 375 285 -407 -334 -39 125 495 196 -367 -329 -214 125 526 106 -322 -288 -297 171
5349 171 542 125 -129 -387 -430 192 426 130 -13 -412 -370 227 365 318 162 -443 -418 147 254 416 91
5370 91 -464 -272 -74 170 518 61 -420 -208 -182 155 497 6 -294 -248 -350 345 476 15 -151 -407 -364
5391 -364 358 376 182 -27 -464 -346 282 267 277 -49 -538 -213 188 189 369 -56 -535 -170 47 256 499 -67
5413 -67 -358 -169 -184 335 516 -86 -287 -301 -252 408 415 3 -185 -454 -228 405 363 83 -77 -559 -189 350
5435 350 279 267 -67 -527 -165 253 268 358 -149 -509 -219 -12 304 460 -232 -343 -202 -75 439 426 -196 -258
5457 -258 -311 -141 540 340 -75 -179 -417 -80 440 231 46 -221 -532 -77 299 214 260 -255 -585 -81 197
5478 197 327 351 -286 -433 -61 55 433 371 -299 -355 -188 -37 500 292 -214 -275 -348 -44 566 221 -147 -212
$$ packed form
5327A77n48q9N43J32J60r0o92P3K95J64L70k99n63L8J15L39M01m20m28L4rM68
5349A71L71m17k54k58m3O22K34k96j43l99M2N97J38m7j56o05K5N65J07J62l25
5370I1n55J92J98K44L48m57m81K12K6L37L42m91l00M6j02O95J31m61j66k56M3
5391c64P22J8j94k09m37J18O28j5J0l26m89L25M01JJ80m25m79L65K17K09K43n66
5413f7k91J89j5N19J81o02k01j4M9O60Pm12j88k69K26O33m2k80j60m82L70N39
5435C50p1j2l34m60L62M18J5R0n07l60K90K07L16J56o92j11J41J27N14j3o22o2
5457b58n3J70O81k00m15j04k38L37N20k09j85k67l11M55L76q5M6n15l30N04K78
5478A97J30K4o37j47L72J16L78o2o70n6J67J51N37k08n06o1p3L04O10l45l68o5
$$ plain form
5500 -212 -401 40 454 214 23 -319 -513 50 325 250 125 -384 -433 7 166 359 225 -357 -392 -68 96
5521 96 458 199 -322 -236 -209 110 486 187 -198 -251 -314 126 511 152 -69 -283 -383 163 487 157 39 -341
5543 -341 -436 159 320 283 111 -430 -395 97 204 379 83 -457 -366 -10 123 493 60 -400 -286 -148 162
5564 162 568 41 -213 -269 -279 231 461 127 -82 -341 -335 247 401 181 50 -401 -326 176 307 271 -8 -455
5586 -455 -282 135 194 347 -32 -450 -252 -18 165 503 -63 -376 -222 -89 275 475 -22 -291 -302 -224 317
5607 317 434 19 -154 -404 -240 350 288 141 -56 -457 -185 283 279 193 -45 -502 -163 112 275 345 -56 -427
5629 -427 -172 -13 304 396 -103 -334 -200 -116 335 315 -152 -223 -296 -144 324 293 -35 -182 -375 -128 324 263
5651 263 79 -119 -350 -84 229 223 185 -103 -446 -95 135 244 244 -187 -397 -103 74 334 354 -218 -277 -193 6
$$ packed form
5500b12j89M41M14k40j91l42j94N63K75p5j25n09m9M40J59J93j34n82l5L24J64
5521I6L62k59n21Q6K7L19L76k99l85n3o3M40L85l59k21k14j00N46L24l30j18l80
5543c41r5N95J61l7j72n41L5M92J07J75k96n40R1L56J33L70m33m60J14J38L10
5564A62M06n27k54n6j0N10K30l34k09k59ON82J54k20j31m51P5N02J31l6k79m47
5586d55J73M17N9J53l79m18J98K34J83L38n66l13J54J33L64K00m97k69j1P8N41
5607C17J17m15j73k50J64N90o2j47j97m01K72M68mq6k38m57L39K75J63P0m01l71
5629d27K55J59L17R2m99k31J34Q4M51k0m67p1p3J52M68l1l28j47j93K47M52o1
5651B63j84j98k31K66L13ol8k88l43L51K30J09%m31k10K94J77K60K0n72n9Q4J99
$$ plain form
5674 6 314 316 -182 -212 -282 -26 331 239 -88 -159 -381 23 345 177 57 -191 -366 28 236 166 119 -193 -394
5697 -394 -47 171 260 228 -291 -283 -52 77 318 160 -217 -234 -134 0 351 150 -147 -221 -302 6 363 149
5719 149 -73 -191 -297 -9 249 151 37 -260 -288 54 237 171 105 -268 -329 2 198 228 77 -254 -227 27
5741 27 52 315 136 -240 -238 -90 111 322 57 -259 -231 -195 67 308 76 -81 -174 -236 107 198 73 63 -206
5764 -206 -231 128 191 138 31 -264 -193 111 200 235 57 -268 -166 -18 144 245 50 -222 -156 -120 193 281 43
5787 43 -192 -155 -179 141 269 9 -35 -205 -203 107 161 57 -32 -267 -143 89 105 140 -48 -308 -114 78 160 213
5811 213 -23 -212 -137 -15 134 241 -67 -157 -93 -102 137 193 26 -106 -125 -94 201 163 -2 -96 -236 -130 120
5834 120 128 68 -10 -207 -72 85 104 130 -11 -260 -45 36 74 172 -67 -203 -29 -32 74 172 -104 -147 -75 -92 172
$$ packed form
5674FL08Km98l0p0K56L57r2l27p1k22M04L22j68j20k48j75L94K08p0m7l12k01
5697c94L47K18Q9l2n19QK31J29K41j58l77j7J00J34L51k01k97p4q1L08L57k14
5719A49k22j18j06K88K58r8j14k97k8L42J83o6o6l73o1L31J96L0j51l31K7K54
5741B7K5K63j79l76KJ48K01K11k65l16K8L6K62K41k32j57r3o2L43R1j25j0k69
5764b06k5L59O3n3j07k95P1L04Q9L5j78l25J02J48J62J01j95k72O6L6L13Q8k38
5787D3k35L7k4L20J28k60m4j70KL10N4j04q9k35J24K32J6L5j88k60J94J92Q2N3
5811B13k36j89P5J22J49J07l08r0O4rK39N6j67j32j9L1K95l8j65r4j40J06K50
5834A20Qo0p8j97J35J57J9K6j41k49K15Q1L8R8k39j36J74lJ06R8k76m3P2j7K64
$$ plain form
5859 172 171 -111 -63 -132 -54 188 126 -19 -42 -218 -24 146 59 62 -29 -200 3 80 96 68 -84 -201 -57 -11 119
5884 119 117 -70 -115 -63 -24 162 146 -69 -96 -54 4 196 99 -16 -67 -105 -72 163 47 -32 -32 -137 21 138 48 39
5910 39 -70 -148 -13 59 97 83 -52 -131 -11 56 105 21 -87 -139 27 -19 112 41 -44 -43 -106 -22 139 52 -23 -107 -120
5937 -120 -24 41 67 -30 3 -118 59 102 26 13 -51 -34 -15 11 23 63 -26 -127 -1 -35 27 73 -44 -78 14 -14 62
5964 62 67 -13 -85 24 -80 109 -28 -43 -19 -27 -36 51 6 28 2 -89 10 5 -39 31 20 -50 34 -1 73 30 -2 -75 41 -22
5994 -22 -3 42 6 -5 45 -40 31 8 21 -34 -13 -61 7 37 30 -18 -95 -27 24 5 52 55 -33 18 -32 -9 49 9 35 -19 3
6025 3 3 28 54 24 -17 -41 -92 -10 16 -9 -39 -49 -4 36 73 -13 -74 -87 6 -27 27 -21 -43 -78 15 20 49 -33 -83 -97 3
6056 3 63 43 31 -43 -59 -61 0 88 62 -7 -56 -71 -15 66 62 -14 -6 -92 39 -6 51 60 -22 -41 38 6 25 31 -23 -62 6 34 71
$$ packed form
5859A72jk82M8o9P8K42o2j45k3j76J94J70q7Lr1j71K03P7J6k8j52j17J44M6J30
5884A19kj87m5N2L9J86j6k15k7M2N8J92r7j15n1l8L3K35j16p9%j05J58J17r0r
5910C9j09p8J35P2L8j4j35p9J20O7M9q4j08n2J66m6J31p1q5Jo3Q4J61q7p5q4j3
5937a20R6O5K6r7L3j21J77M3p6j3o4J7J9K6J2M0q9j01J26l4O2M6j17l4R2k8P6
5964F2Nq0p2J09j04J89j37j5K4qrQ7m5K2k6r1R9nm4P0j1p0Q4l5P4m3l2p3J16o3
5994b2J9M5l6j1N0q5P1k3J3n5K1m8O8L0pm8p7O8N1j9M7Lq8N1n0K3N8m0K6n4K2
6025C%K5K6l0m1k4n1Q2K6k5l0j0M5M0L7q6o1j3R3l3N4m8k2l5R3NK9q2n0j4J00
6056CO0k0j2p4j6kO1Q8k6o9m9j5N6Q1mp6Qq6J31m5N7Rq2j9P9l2J9On4l9O8K8L7
$$ plain form
6089 71 81 -55 -139 -75 30 30 6 -29 -38 -70 19 129 -2 5 -61 -130 -68 68 89 -22 -100 -135 49 89 72 34 -26 -61
6117 -61 -7 75 45 12 -50 -119 -14 49 106 55 -123 -92 -15 11 137 0 -30 -65 -72 27 105 23 -55 -104 -136 0 173 55
6145 55 -42 -93 -120 19 127 112 -8 -104 -125 -15 66 78 60 -81 -161 35 43 107 81 -107 -144 -12 81 107 53 -133
6171 -133 -91 -74 63 153 -7 -33 -110 -145 98 212 65 -53 -77 -109 162 180 50 16 -112 -72 53 101 90 67 -229
6196 -229 -107 16 78 123 33 -147 -154 -19 163 179 9 -157 -94 -67 142 215 4 -75 -125 -75 114 162 65 -56 -177
6221 -177 -122 88 169 64 -57 -211 -101 50 135 118 -70 -208 -92 82 151 210 -71 -183 -77 35 142 174
6243 174 -62 -162 -118 -51 240 161 -80 -117 -213 -96 159 214 -11 -121 -200 -26 191 115 59 -95 -225 -52 149
6266 149 168 104 -92 -163 -87 67 195 146 -105 -212 -44 32 202 165 -41 -112 -144 29 238 147 -103 -149 -171 33
$$ packed form
6089G1J0j36q4O4J05%k4l5rl2Q9J10j31Po6o9O2J36K1j11p8l5J84M0j7l8o0l5
6117f1N4Q2l0l3o2o9J05O3N7n1j78L1P7K6J26j37l0l5pR9P8q2p8m9l2J36J73j18
6145E5r7n1k7J39J08j5j20r6k1J10Q1J2j8j41q0J96QO4k6j88l7J32R3K6n4j86
6171a33M2J7J37R0j60k6p7l5K43J14j47j18k4l2K71J8j30l4j28M0J25M8j1k3k96
6196b29J22J23O2M5r0j80pJ35J82J6j70j66O3K7K09P3k11p9n0N0J89M8r7j21j21
6221a77N5K10Q1j05j21j54J10J51Q5j7j88j38J16J74O9N9k81j12J06J12J07L2
6243A74k36j00M4O7K91p9k41l7r6J17K55N5k25j10p9J74K17p6n6j54j30J73K01
6266A49J9o4j96p1P6J54J28m9k51j07J68P6J70l7k06p1l2J73K09r1k50m6k2K04
$$ plain form
6290 33 258 178 -22 -137 -223 -9 216 37 70 -198 -263 33 144 157 98 -156 -291 20 94 209 40 -165 -252
6313 -252 -66 97 231 137 -119 -146 -116 82 265 151 -118 -158 -181 29 267 116 -48 -173 -276 80 201 82
6335 82 -21 -194 -284 52 123 133 91 -276 -269 29 143 227 66 -267 -170 -59 92 305 10 -265 -158 -165 110 377
6359 377 53 -139 -197 -153 118 296 105 -57 -261 -177 100 229 86 46 -243 -261 123 208 192 63 -322 -198
6381 -198 49 144 241 39 -265 -180 -3 145 257 -27 -268 -151 -63 147 304 -2 -162 -187 -133 213 306 1
6403 1 -106 -258 -111 219 236 106 -67 -351 -160 158 172 153 -22 -350 -107 79 162 290 -54 -395 -152 61
6425 61 194 244 -48 -302 -189 -43 289 303 -91 -203 -234 -78 310 250 -22 -136 -345 -53 253 229 109 -143
6447 -143 -399 -10 287 231 171 -128 -391 -78 151 270 224 -219 -320 -148 67 303 207 -164 -277 -141 18
$$ packed form
6290C3K25q0k00j15q6K14K25j79L3k68o5K96J11J3n9k54j35L11P4J15j69k05q7
6313b52J86J63J34r4k56k7L0J98J83j14k69m0k3K10K38j51j64j25j03L56J21j19
6335H2j03j73r0L36P1J0m2l67PK98J14Q4j61l33R7J11J51K13k95k75J07pK75K67
6359C77l24j92n8M4K71J78j91j62k04Q4K77J29j43m0k89j8L84Q5j6j29l85J24
6381a98K47R5R7k02l04Q5J77J48J12k84k41J17Q8K10J57l06j60k5N4L46R3l05
6403Aj07j52J47L30J7j30j73k84J91L18J4j9j75l28K43J86Q3J28l44l41K43K13
6425F1J33N0k92k54J13J46L32J4l94j12l1J56L88o0k72j14k09K92L06k4j20k52
6447a43k56L89K97n6o0k99k63L13K29J19m6m43j01J72K15K36r6l71j13J36J59
$$ plain form
6468 18 323 250 -147 -253 -301 -2 373 213 -38 -217 -389 0 300 227 88 -202 -454 28 293 262 255 -270
6490 -270 -330 8 166 291 202 -295 -342 -47 102 366 188 -275 -224 -163 92 416 235 -247 -282 -242 113 397
6512 397 155 -94 -237 -372 64 323 87 77 -272 -366 138 234 229 83 -360 -374 78 130 355 199 -405 -258
6534 -258 -83 122 430 107 -333 -291 -150 126 451 80 -284 -299 -294 185 402 82 -125 -315 -311 218 352 165
6556 165 -61 -378 -311 236 328 246 14 -417 -329 121 190 363 30 -432 -241 21 227 404 -45 -379 -276 -125
6578 -125 208 468 -31 -169 -268 -238 282 410 68 -177 -363 -229 350 352 121 -51 -442 -232 246 264 234 -85
6600 -85 -483 -243 154 262 340 -136 -410 -190 8 293 413 -174 -349 -244 -92 330 399 -126 -263 -272 -128 343
6622 343 330 -47 -206 -408 -188 338 329 112 -179 -490 -139 287 301 185 -149 -550 -160 147 329 313 -163 -422
$$ packed form
6468A8L05p3l97j06m8K99L75j60k51j79j72L89L00p3j39k90k52M82K65l1pn25
6490b70o0L38J58J25q9m97m7K95J49K64j78m63N1O1K55L24j81m82l5M0L55K84
6512C97k42k49j43j35M36K59k36j0l49r4N04R6nj46m43j4M52N2K25j56o04J47
6534b58J75K05L08l23m40M2J41K76L25l71l64j5NM79K17l20k07j90MN29J34j87
6556A65k26l17O7N47R2q2k32m31Q8M50O9J73l33m62J91K62K06J77m49l34J03J51
6578a25L33K60m99j38r9L0N20J28l42k45j86J34N79Kk31j72l91K10M78J8l0l19
6600h5l98K40L97J08P8m76k74K20J98K85J20n87j75J05J52M22O9n25j37rJ44M71
6622C43j3l77j59k02K20N26rk17k91l11L51M26J4j16l34m01L90L07J82j6m76k59
$$ plain form
6644 -422 -124 37 352 377 -187 -328 -178 -5 448 398 -202 -256 -364 -87 501 361 -79 -245 -492 -62 451
6665 451 193 105 -215 -513 -15 324 285 151 -263 -530 -31 155 342 274 -339 -442 -98 93 412 219 -297
6686 -297 -290 -227 58 534 239 -227 -283 -335 77 529 228 -89 -248 -427 57 511 195 70 -341 -453 57 327
6708 327 257 145 -404 -439 41 214 362 204 -449 -411 -73 173 529 199 -361 -316 -154 240 553 143 -264
6729 -264 -257 -344 176 517 85 -83 -311 -389 173 474 179 47 -438 -388 205 322 334 85 -484 -393 137 236 365
6752 365 60 -450 -233 -57 211 513 21 -443 -248 -140 212 545 42 -275 -359 -289 321 464 27 -170 -429
6773 -429 -314 342 386 122 -57 -587 -303 285 347 238 9 -547 -266 173 241 384 -102 -539 -220 20 351
6794 351 494 -127 -469 -273 -124 363 473 -83 -271 -349 -194 392 434 -5 -135 -471 -250 437 327 129 -170
$$ packed form
6644d22K98J61L15K5n64j41J50J73M53n0o00n4j08K77N88j40m40j66k47M30N13
6665D51k58q8l20k98M98L39l9j34m14k67M99J86J87o8o13j03L44J91L19j93n16
6686b97PO3K85M76k95m66n6n2M12M52l01l17j59j79M84M54l16j25m11j12N10K70
6708C27p0j12n49l5M80J73J48j58o53L8L38K46L56l30n60M5J62L94L13m10m07
6729b64Pq7N20L41m32j68k28p8N62L01k95j32m85N0N93J17J2k49n69R1N30R9J29
6752C65l05n10K17J76K68L02m92m64J95J08L52L33n03l17q4P0O10J43m37j97k59
6773d29J15O56M4k64j79n30K84N88O2j09k29n56K81M39O8J43m86m37L19K40L31
6794C51J43o21l42J96J49M87J10n56j88p8J55N86M2m39j30l36K21O87j10j98k99
$$ plain form
6815 -170 -502 -177 323 314 264 -149 -597 -150 239 329 373 -199 -496 -121 71 409 420 -237 -413 -240 -53 478
6837 478 410 -212 -241 -391 -98 460 315 -14 -232 -496 -106 466 260 78 -205 -542 -58 329 320 271 -293 -513
6859 -513 -4 210 292 325 -271 -438 -47 54 484 308 -309 -341 -178 -1 567 227 -239 -293 -417 50 526
6880 526 232 -99 -319 -536 3 469 144 47 -323 -583 67 351 290 183 -410 -451 49 199 414 200 -445
6901 -445 -391 -45 149 453 208 -342 -295 -235 175 536 165 -281 -322 -336 180 535 76 -85 -389 -428 216 508
6923 508 168 70 -428 -435 172 387 280 71 -523 -415 83 228 458 108 -546 -369 -3 226 530 25 -441
6944 -441 -265 -200 221 555 33 -302 -300 -324 241 496 64 -147 -397 -366 337 392 110 -57 -572 -339 311 265
6966 265 273 18 -592 -303 227 264 391 -8 -560 -186 28 355 498 -77 -407 -235 -71 312 524 -83 -272
$$ packed form
6815a70l32L25N00rn0m13m48M47L89R0M4n72k97L75J92L38J1o57j76J73J87N31
6837D78o8o22k9j50K93N58j45l29k18k64L90N72k06j82k83l37M84L87rm9n64k20
6859e13N09K14Q2L3n96j67L91J01M30j76o17l2J63J77N68l40m66n4j24M67M76
6880E26k94l31k20k17N39M66l25r7l70k60O50K84o1j07n93m1N00J50K15k14o45
6901d45N4L46J94L04k45n50M7O0M10L61l71m46m1j4N16L55m59j61l04l9O44K92
6923E08l40r8m98pO07K15j07k09n94J08M98J45K30l50o54J77L66K29L04n05m66
6944d41J76O5M21L34n22l35Kk4N65K55m32k11k50L1P03N5k82j67n15K33O50m6
6966B65Qk55o10K89N30L7J27l99n52L74K14L27J43n75l30J72J64L83K12o07j89
$$ plain form
6987 -272 -309 -238 381 467 -84 -145 -409 -280 475 349 108 -104 -639 -242 374 285 230 -154 -575 -141 172 273
7009 273 368 -179 -495 -186 28 380 494 -139 -413 -228 -102 483 437 -164 -258 -312 -114 540 319 -55 -199
7030 -199 -506 -98 417 268 119 -243 -602 -36 373 288 314 -285 -587 -62 226 403 342 -265 -441 -99 115
7051 115 387 405 -318 -374 -192 -23 583 287 -246 -310 -351 -16 567 204 -57 -292 -398 35 529 175 52
7072 52 -293 -518 90 333 287 225 -395 -510 62 235 397 248 -396 -381 -93 99 498 313 -332 -336 -228 67
7094 67 498 142 -294 -312 -369 116 557 105 -163 -365 -481 195 468 170 0 -384 -458 152 310 283 115 -490
7116 -490 -385 168 248 414 50 -440 -335 -9 227 550 48 -455 -285 -118 238 579 29 -358 -300 -297 296
7137 296 534 78 -125 -384 -320 308 430 114 45 -473 -330 264 360 272 11 -540 -306 181 256 453 9 -554
$$ packed form
6987b72l7P1O19Q6n51o1k64J29P55j26k41k12n35L97O16q9n5l84m21M34L13J01
7009B73R5n47l16L09K14L52J14o33k74J85J26N85m6o01r4n4J98O54k21l74j44
7030a99l07M08N15j49j49l62l59N66M09q5K6n99l02N25K88J77o1o07j76L42K14
7051A15K72J8p23n6J82J69O06k96n33o4m1L35N83l63k61k35j06M33M94l54j23
7072E2l45k25O08K43m6o2o20j15N72J73J62j49o44J5K88J92L99j85o45mJ08K95
7094F7M31l56m36j8n7M85M41m52k68k02j16O76K73k98j70l84p4O10J58k7j68o05
7116d90J05N53Q0J66l64m90J05L26K36L23n02n03J70J67L56L41n50l87N8LN93
7137B96K38m56k03k59O4O28J22l16o9n18J43N94R6q8k61n51K34M87P5J97m44n63
$$ plain form
7159 -554 -199 35 273 529 -128 -414 -244 -151 318 530 -98 -336 -298 -241 413 391 -30 -186 -396 -245 333
7180 333 382 107 -45 -597 -228 308 324 279 -79 -540 -134 214 282 367 -98 -512 -203 62 340 466 -185 -397
7202 -397 -220 -110 472 428 -179 -290 -339 -148 469 324 -77 -208 -463 -91 427 306 86 -193 -574 -81 337
7223 337 268 231 -192 -558 -117 198 368 352 -313 -449 -139 49 415 347 -249 -377 -202 44 434 341 -222 -311
7245 -311 -337 -10 533 236 -114 -272 -438 -48 491 248 75 -294 -487 34 323 245 225 -373 -528 3 202
7266 202 378 249 -350 -417 -47 132 485 276 -330 -314 -171 91 548 212 -233 -301 -316 129 566 174 -140
7287 -140 -288 -417 151 467 215 1 -398 -471 150 344 272 157 -433 -447 105 244 379 154 -453 -393 47
7308 47 124 507 132 -395 -289 -183 188 501 91 -294 -297 -271 222 494 138 -119 -382 -360 229 326 179 -58
$$ packed form
7159e54L55K34K38K56o57k86J70R3M69K12o28k38L8N7O54k2m21j56k10J51N78
7180C33M9k75j52n52L69N36J6m5l58m61M06L48O8Q5m65m14L09K65K78J26o51k12
7202c97J77J10N82m4o07j11m9J91O17j45m01j31k55L72N18j21k20k79l81M93M18
7223C37o9l7m23l66M41L15J70j6o65j36L10J88L66o8n96j28J75K46L90r3n63q9
7245c11k6L27N43k97l50j58j66L90N39k43j73l69j93N21K89p8k0n98j55N31J99
7266B02J76j29n99o7L70J79L53k09o06J6J43K62M57l36m45o8j5M45M37l92l14
7287a40j48j29N68L16k52k14l99p3O21J94p2j15n90j4N52J39J35k25o07O0M40
7308D7P7L83l75n27J06J06L71L13m10l85lK6M93K72l56k57k63K2N89R7j47k37
$$ plain form
7330 -58 -458 -353 224 321 272 21 -528 -310 137 198 370 8 -494 -221 14 226 480 -7 -401 -175 -116 227
7352 227 512 -7 -301 -281 -236 315 491 22 -133 -403 -220 384 347 151 -95 -500 -213 249 322 243 -116 -499
7374 -499 -208 107 222 353 -78 -453 -170 34 247 433 -120 -403 -227 -73 364 376 -124 -299 -362 -216 438
7395 438 371 -44 -185 -449 -159 399 304 93 -125 -534 -116 300 218 229 -181 -489 -111 187 346 294 -248 -439
7417 -439 -173 41 368 354 -276 -316 -207 -48 423 322 -206 -282 -408 -42 433 249 -85 -206 -386 -40 442
7438 442 190 53 -177 -498 -28 335 243 212 -271 -434 16 181 293 258 -282 -356 -46 82 402 301 -301
7459 -301 -331 -183 29 460 225 -181 -256 -370 88 435 118 -73 -210 -350 57 383 198 18 -343 -414 123
7480 123 327 242 117 -361 -389 55 191 280 149 -348 -380 -60 130 398 127 -310 -297 -190 107 438 150 -261
$$ packed form
7330e8m00J05N77R7m9k51n49K18M47O1J72l62n02K73K35K12K54m87l94K26N9L43
7352B27K85n19k94K0M5N51J76m69j55k70J83O04l7j96k46m05K87M62P3p9l59l83
7374d99K91L15J15J31m31l75K83K04K13J86n53k83J76J54M37J2n00j75o3J46O54
7395D38o7m15j41k64K90N58r5k11k18m09M18M16q2J1m10l08L78K98J59n2n42j91
7417d39K66K14L27j4o30m0J09J59M71j01n28p6j26L66M75j84l34j21j80L46M82
7438D42k52j37k30l21M70L63r2l1m83j63M50J65J12l5n40p4L10J28L20j01o02
7459c01l0J48K12M31k35m06p5j14M58L47l17j91j37j40M07L26j85j80l61p1N37
7480A23K04q5j25m78k8M44J36Q9j31m97l2L20J90K68k71m37J3J07K97L31k88m11
$$ plain form
7502 -261 -284 -277 151 452 103 -96 -233 -347 125 345 154 -52 -396 -310 225 247 232 21 -462 -304 101 197
7524 197 366 53 -427 -189 -2 192 425 51 -360 -231 -153 214 406 -24 -259 -310 -240 268 407 51 -170
7545 -170 -396 -252 259 326 56 -84 -430 -184 265 251 223 -89 -399 -191 140 197 320 -39 -432 -202 51
7566 51 246 402 -85 -345 -253 -76 340 405 -116 -246 -262 -137 274 356 -9 -171 -384 -174 381 340 109 -194
7588 -194 -429 -130 241 230 224 -129 -471 -118 180 269 342 -153 -398 -119 97 313 396 -175 -360 -207 -73 352
7610 352 288 -136 -257 -245 -55 368 258 1 -199 -331 -101 394 238 53 -201 -450 -71 308 177 172 -197
7631 -197 -429 -31 196 263 267 -245 -378 -129 48 378 247 -232 -303 -173 -6 500 248 -196 -230 -258 51 451
7653 451 235 -75 -192 -354 16 454 128 103 -277 -399 57 258 224 158 -314 -450 46 148 292 186 -273
$$ packed form
7502b61k3PM28L01l49j99j37j14M72K20j91k06l44Q6N35K2j5k11m83J58M05R6
7524A97J69l13m80K38J87J94K33l74m11J29P8L67J92m30k35n1P0N08J39l56k21
7545a70k26J44N11O7k70j40l46K46M49j4k8l12l10K08L31N7J23l59l93K30K53
7566E1J95J56m87k60R2J77M16O5n21j30j6J25M11Q2l65j62k13K10N55m1k31l03
7588a94k35K99L71j1ol53l42L53K98Q9P3m95k45K79K16K16Q3n71j85J53J34M25
7610C52o4m24j21J2J90M23j10k57k00j32K30M95j56j85k54k49L79L79j31nl69
7631a97k32L98K27O7Mn12j33K49J77L30j31m79p1J30J67N06k52m44l4k8L09M00
7653D51k16l10j17j62L70M38l26k5l80j22M56K01l4o6m72j36M96J02J44j06m59
$$ plain form
7674 -273 -335 -37 76 413 249 -281 -215 -159 48 391 124 -193 -293 -314 92 449 109 -98 -303 -302 100 340
7696 340 176 -11 -308 -342 128 260 188 46 -411 -356 109 160 304 63 -453 -254 -59 143 414 88 -330
7717 -330 -247 -91 120 441 63 -158 -272 -195 211 413 12 -131 -256 -275 201 303 116 -13 -377 -279 174
7738 174 266 252 -6 -454 -207 115 127 286 42 -391 -195 -10 131 328 -69 -354 -158 -57 304 388 -39
7759 -39 -217 -237 -170 358 342 -13 -138 -358 -239 304 282 90 -48 -394 -161 232 231 227 -64 -466 -179 161 222
7782 222 359 -133 -388 -140 21 254 342 -142 -323 -183 -109 320 321 -141 -231 -247 -98 438 277 18 -141 -391
7804 -391 -96 385 269 102 -85 -424 -47 241 217 175 -143 -440 -39 123 272 277 -146 -326 -75 100 380
7825 380 334 -215 -293 -151 -14 351 261 -204 -197 -273 -44 406 194 -77 -211 -397 -16 340 183 83 -232 -422
$$ packed form
7674b73o2K98J13L37j64n30O6N6K07L43k67l17j00k1M06L57l40k07k05JM02K40
7696C40j64j87k97l4M70J32p2j42m57N5M65N1J44k41n16J99J95K02K71l26m18
7717c30Q3J56K11L21l78k21j14P7M06K02m01j43j25j9M76J02j87j29l64R8M53
7738A74R2j4k58m48K47L22J2J59k44m33J96J85J41J97l97k85J96J01L61Q4m27
7759c9j78k0O7N28j6l55j25k20J19N43k2j92j38l46K33L93jmk91m02K87L40O1
7782B22J37m92k55K48J61K33Q8m84j81J40P4M29Jm62r0j6J49N36j61k59j59k50
7804c91K95M81j16j67j87l39L77K88k4m2l18k97M01J62J49Nm23j80K51J75K80
7825C80m6n49p8J42J37L65r0m65Pp6K29M50k12k71j34j86L81L56j57j00l15j90
$$ plain form
7847 -422 11 334 270 208 -263 -418 49 202 309 248 -262 -357 -83 115 352 188 -294 -185 -148 143 446 225
7869 225 -185 -143 -272 -4 419 112 -96 -239 -348 79 381 191 72 -245 -375 142 280 184 107 -309 -353
7890 -353 71 201 344 102 -351 -263 -35 118 447 57 -296 -232 -175 109 434 77 -209 -253 -217 164 423 92
7912 92 -116 -252 -378 187 287 142 -3 -398 -341 167 208 235 39 -419 -283 100 172 390 67 -352 -209 -79
7934 -79 176 385 34 -274 -176 -150 200 420 43 -186 -228 -239 282 371 56 -78 -334 -266 253 330 90 -17 -405
7957 -405 -213 202 195 266 -31 -455 -155 152 234 357 -11 -396 -172 -35 250 407 -127 -307 -201 -90 254
7978 254 371 -69 -215 -303 -176 334 292 -23 -90 -372 -157 282 242 104 -146 -424 -154 179 235 176 -70 -405
8000 -405 -81 137 263 273 -131 -390 -67 -31 281 355 -160 -255 -206 -63 374 274 -148 -166 -226 -82 388 227
$$ packed form
7847d22M33L23o4o2m71j55M67J53J07o1n10r5K74J98K37j64m82J09L7K91L03k21
7869B25m10M2j29K68M23l07k08j43j09M27L02j90j19l17j30N17J38r6p7m16m4
7890c53M24J30J43k42m53Q8K28J53L29l90l53O4N7K84L25l57k86m4L6L81K59l31
7912I2k08j36j26N65J00j45j45l95N7N08M1K7j96m58J36L83P2K18l23m19J43J30
7934g9K55K09l51l08R8K6L50K20l77k29m2j1N21Q9l15j34k56O8N19P7k40j07l88
7957d05J92M15pP1k97m24L00L07Q2J23l68l85K24J37K85J57n34j80J06J11L44
7978B54J17m40j46q8J27N10m2l15o7k82K15M39m0j38k50k78K70L33N6n9k46l35
8000d05L24K18J26J0m04k59L23L6L12P4n15r5M9J43M37j00m22j8o0J44M70j61
$$ plain form
8022 227 -30 -163 -365 -1 293 238 110 -167 -444 -36 202 167 146 -207 -408 -4 141 306 211 -255 -311 -124
8044 -124 42 382 197 -167 -240 -210 51 403 220 -107 -213 -245 -19 452 136 -23 -187 -344 32 337 142
8065 142 112 -283 -350 58 198 182 153 -243 -330 42 70 288 171 -278 -307 -60 52 372 118 -269 -210 -182 59
8088 59 423 109 -193 -215 -224 128 369 92 -24 -232 -308 123 292 133 53 -349 -290 149 169 213 82 -258 -276
8111 -276 94 228 331 33 -296 -218 -92 94 349 54 -283 -221 -175 144 354 4 -141 -154 -215 198 375 22
8133 22 -59 -294 -232 247 278 82 40 -279 -195 237 209 169 2 -350 -159 63 145 290 -63 -392 -171 -39 204
8156 204 350 -24 -217 -197 -112 259 318 -1 -150 -226 -166 271 251 -31 -87 -234 -126 306 180 106 -76 -360 -140
8179 -140 107 224 208 -80 -328 -97 82 177 188 -124 -295 -92
$$ packed form
8022B27k57j33k02L64K94n5j28k77k77M08K38l5k1l53k01M04J45J65r5m66n6J87
8044a24J66L40j85l64p3L0K61L52j83l27j06l2K26M71l16j59j64j57L76L05j95
8065A42l0l95o7M08J40j6k9l96q7L72K8K18j17m49k9K47J12L20k54l87N9K8K41
8088E9L64l14l02k2rL52K41k77j16k08p6M31J69j59q0m02N9M39K0M4j31l40j8
8111b76L70J34J03k98l29P8J26J86K55k95l37O2M6L19K10l50j45j3o1M13J77l53
8133B2q1k35O2M79L1j96m2l19Q4M32k8m0j67l52J91K22Q2J45l53l29K21J32K43
8156B04J46l74j93K0Q5L71N9l19j49p6O0M37k0k82n6j47J08M32j26p4j82k84K20
8179a40K47J17j6k88k48K31J79R5J1l12j71K03
8191i2
$$ Imaginary data points
##PAGE= N=2
##DATA TABLE= (X++(I..I)), XYDATA
$$ plain form
0 0 0 0 0 0 0 0 0 0 0 0 0 0 -8 8 -8 10 -16 16 -24 24 -32 38 -41 49 -58 67 -80 91 -105 121 -138 157 -179 204
34 204 -228 259 -291 325 -364 407 -453 503 -560 616 -682 754 -830 918 -1009 1113 -1226 1349
52 1349 -1486 1640 -1813 2008 -2231 2486 -2781 3130 -3552 4068 -4719 5569 -6733 8429 -11138
67 -11138 16153 -28573 126111 142875 -97358 -110067 -198337 25513 232292 101038 -10180
78 -10180 -126062 -229030 40842 184559 105271 55697 -154149 -218804 42083 120598 139750
89 139750 94210 -175500 -183863 10955 71055 187390 94174 -174341 -141829 -46405 46159
100 46159 222728 75345 -140043 -118537 -110673 52935 230560 56324 -79772 -119737 -158217
111 -158217 72587 205366 58540 -14876 -145632 -176126 83751 156741 84915 30846 -175831
$$ packed form
0@%%%%%%%%%%%%qJ6j6J8k6L2m0M8n6P0p9R0j07J25j47J71j96K26k59K95l36L83
34B04m32M87n50O16o89P71q60R56j063J176j298J436j584J748j927K122k339K575
52A349k835L126l453L821m239M717n267N911o682P620q787J0288j2302J5162j9567
67a1138K7291m4726J54684J6764k40233j2709q8270K23850K06779j31254j11218
78a0180j15882j02968K69872J43717p9288m9574k09846o4655K60887P8515J9152
89A39750m5540k69710q363J94818O0100J16335r3216k68515L2512R5424R2564
100D6159J76569j47383k15388K1506P864J63608J77625j74236j36096l9965l8480
111a58217K30804J32779j46826p3416j30756l0494K59877P2990p1826n4069k06677
$$ plain form
122 -175831 -163055 66557 106872 132184 46586 -190719 -130179 24048 75889 177762 39013
133 39013 -172922 -102999 -35384 73668 202829 20321 -129382 -97708 -89433 88587 193971
144 193971 13348 -72210 -118984 -122515 106053 163372 30379 -24687 -150723 -123128 105319
155 105319 123330 72539 2263 -177942 -105426 78845 94661 121039 1483 -183088 -83677
166 -83677 29249 84602 158477 -11400 -159840 -76982 -24833 98060 171320 -22448 -114372
177 -114372 -88457 -65966 117585 157618 -13737 -66722 -118980 -82664 127460 125665 15679
188 15679 -34787 -151996 -76059 113784 95070 61394 -25661 -170599 -57562 78853 82541
199 82541 105672 -34112 -163372 -46342 31072 91863 132327 -48035 -135006 -54339 -13472
$$ packed form
122a75831J2776K29612M0315K5312q5598k37305O0540J54227N1841J01873j38749
133C9013k11935O9923O7615J09052J29161j82508j49703L1674Q275J78020J05384
144A93971j80623q5558m6774l531K28568N7319j32993n5066j26036K7595K28447
155A05319J8011n0791p0276j80205P2516J84271J5816K6378j19556j84571R9411
166h3677J12926N5353P3875j69877j48440Q2858N2149J22893P3260j93768r1924
177a14372K5915K2491J83551M0033j71355n2985n2258L6316K10124j795j09986
188A5679n0466j17209P5937J89843j8714l3676q7055j44938J13037J36415L688
199H2541K3131j39784j29260J17030P7414O0791M0464j80362q6971Q0667M0867
$$ plain form
210 -13472 112563 133861 -49736 -97441 -82137 -39666 131688 116761 -30165 -65131 -116454
221 -116454 -42869 133404 93412 9157 -48949 -144973 -32081 113177 77781 51902 -52249
232 -52249 -153258 -20819 73183 78743 86551 -65090 -139485 -21564 31114 97126 100850 -73308
244 -73308 -108494 -39337 -453 120110 95602 -64422 -78871 -72946 -11882 133658 76915 -37643
256 -37643 -61321 -107510 -7599 127268 62485 2095 -61594 -128816 4106 102921 62404 39916
268 39916 -73466 -128378 8065 67309 78088 63738 -86723 -111442 -4349 34711 100843
279 100843 67550 -87778 -86962 -32034 16367 120587 57566 -70471 -66946 -65065 15401 126441
291 126441 44646 -38382 -61458 -92512 24468 113571 39363 -3123 -71494 -104549 31639
$$ packed form
210a3472J26035K1298j83597m7705J5304M2471J71354j4927j46926l4966n1323
221a16454P3585J76273l9992q4255n8106r6024J12892J45258l5396k5879j04151
232e2249j01009J32439R4002N560P808j51641p4395J17921N2678O6012L724j74158
244g3308l5186O9157L8884J20563k4508j60024j4449N925O1064J45540n6743j14558
256c7643k3678m6189R9911J34867o4783o0390o3689o7222J32922R8815m0517k2488
268C9916j13382n4912J36443N9244J0779j4350j50461k4719J07093L9060O6132
279A00843l3293j55328Q16N4928M8401J04220o3021j28037L525J881Q0466J11040
291A26441q1795q3028k3076l1054J16980Q9103p4208m2486o8371l3055J36188
$$ plain form
302 31639 86341 49797 24948 -88342 -98804 27946 58126 73077 37414 -97934 -80918
313 -80918 7864 38897 99279 34456 -92671 -64699 -23652 34258 114526 23163 -71114 -58330
325 -58330 -55249 40130 113069 17601 -39646 -65574 -74405 49942 96262 23756 -9623 -80148
337 -80148 -77207 51016 72074 42987 8139 -94983 -67944 38298 51519 67409 10578 -98676
349 -98676 -54243 12598 43069 89651 3866 -87458 -46150 -16721 48347 99451 -3419 -63995
361 -63995 -50572 -41140 59504 93371 -2120 -37778 -66879 -52940 66814 76096 12051 -18031
373 -18031 -85713 -50237 62421 58457 36529 -10350 -96301 -39526 43987 48830 61750 -14100
385 -14100 -93912 -31337 16781 50068 76876 -21954 -78255 -33252 -9425 59963 78953 -23913
$$ packed form
302C1639N4702l6544k4849j13290j0462J26750L0180J4951l5663j35348J7016
313h0918Q8782L1033O0382o4823j27127K7972M1047N7910Q0268r1363r4277J2784
325e8330L081R5379P2939r5468n7247k5928q831J24347M6320p2506l3379p0525
337h0148K941J28223K1058k9087l4848j03122K7039J06242J3221J5890n6831j09254
349i8676M4433O6841L0471M6582q5785r1324M1308K9429O5068N1104j02870o0576
361f3995J3423R432J00644L3867r5491l5658k9101J3939J19754R282o4045l0082
373a8031o7682L5476J12658l964k1928m6879q5951N6775Q3513M843J2920p5850
385a4100p9812O2575M8118L3287K6808r8830n6301M5003K3827O9388J8990j02866
$$ plain form
397 -23913 -56048 -46082 -24856 71471 69404 -14647 -35762 -65005 -28327 74477 56018 5249
409 5249 -26629 -82547 -22429 64432 45960 29661 -28322 -89736 -15216 43638 46675 50989 -36126
422 -36126 -83335 -13761 19984 56821 60709 -41422 -66411 -23766 656 70279 57751 -38095
434 -38095 -48498 -42788 -7759 78186 46717 -23005 -36626 -62309 -5306 75384 37668 166
446 166 -35451 -74713 2120 61356 36382 22641 -42576 -75977 5017 40736 44747 36672 -51492
459 -51492 -67242 -1753 21981 59614 39826 -53877 -53165 -17495 11754 73482 34705 -44791
471 -44791 -41793 -37996 11131 78557 26911 -26529 -39329 -55695 16605 71054 23479 -4481
483 -4481 -45333 -64063 21244 55131 29760 13560 -54863 -60194 19369 37219 43926 21855 -60872
$$ packed form
397b3913l2135R966K1226R6327k067q4051k1115k9243L6678J02804j8459n0769
409E249l1878n5918O0118Q6861j8472j6299n7983o1414P4520N8854L037M314q7115
422c6126m7209O9574L3745L6837L888j02131k4989M2645K4422O9623j2528r5846
434c8095j0403N710L5029Q5945l1469o9722j3621k5683N7003Q0690l7716l7502
446A66l5617l9262P6833N9236k4974j3741o5217l3401Q0994L5719M011q075q8164
459e1492j5750O5489K3734L7633j9788r3703P12L5670K9249O1728l8777p9496
471d4791K998L797M9127O7426n1646n3440j2800j6366P2300N4449m7575k7960
483d481m0852j8730Q5307L3887k5371j6200o8423n331P9563J7850O707k2071q2727
$$ plain form
496 -60872 -49464 6782 24612 60087 19677 -58878 -39248 -12584 21299 70149 12933 -45917
508 -45917 -35743 -32363 26503 71068 9305 -26817 -40857 -45000 33767 61920 13211 -8538
520 -8538 -51714 -48313 35059 47527 25537 2324 -62427 -42905 27353 34611 42258 4617 -65454
533 -65454 -33833 11266 29186 57253 554 -58172 -28432 -8245 32276 63516 -4778 -42883
545 -42883 -31332 -24917 39426 59465 -4452 -25573 -42072 -32839 44882 48796 5221 -12600 -54859
558 -54859 -30742 42976 37767 21966 -7881 -63700 -24106 31497 31922 38933 -11489 -63687 -19255
571 -19255 13657 33660 50110 -17063 -54054 -20738 -3746 41833 52667 -18887 -38994 -29173
583 -29173 -14740 49703 46482 -12682 -25205 -42827 -17671 51674 36529 787 -18425 -55134
$$ packed form
496f0872J1408N6246J7830L5475m0410p8555J9630K6664L3883M8850n7216n8850
508d5917J0174L380N8866M4565o1763l6122j4040m143P8767K8153m8709k1749
520h538m3176L401Q3372J2468k1990k3213o4751J9522P0258P258P647l7641p0071
533f5454L1621M5099J7920K8067n6699n8726K9740K0187M0521L1240o8294l8105
545d2883J1551O415O4343K0039o3917k1121j6499R233P7721L914m3575j7821m2259
558e4859K4117P3718n209j5801k9847n5819L9594N5603M25P011n0422n2198M4432
571a9255L2912K0003J6450o7173l6991L3316J6992M5579J0834p1554k0107R821
583b9173J4433O4443l221n9164j2523j7622K5156O9345j5145l5742j9212l6709
$$ plain form
595 -55134 -13523 44891 29183 18201 -19163 -60219 -7877 31079 29896 33197 -25046 -56042
607 -56042 -6638 14456 37498 40287 -30117 -45320 -13962 978 47852 38547 -28754 -33471 -27540
620 -27540 -4322 54937 31562 -18260 -25512 -42106 -2250 54169 25242 -1847 -24670 -51952
632 -51952 2795 44395 23879 14268 -29946 -53298 4890 29007 29553 25156 -36115 -46754 721
645 721 15056 40151 28249 -37654 -35951 -10152 6890 50271 24508 -31836 -27656 -25443 6137
658 6137 54541 18011 -19416 -25581 -38984 10490 50461 15295 -3361 -30148 -45551 15228
670 15228 39841 19798 10035 -37967 -43465 14696 26587 29976 16465 -43649 -36161 5912 16653
683 16653 41901 15088 -42535 -27851 -8197 13526 50020 10261 -32883 -23805 -22829 16777 50948
$$ packed form
595e5134M1611N8414j5708j0982l7364m1056N2342L8956j183L301n8243l0996
607e6042M9404K1094K3042K789p0404j5203L1358J4940M6874r305o7301m717N931
620b7540K3218N9259k3375m9822p252j6594L9856N6419k8927k7089k2823k7282
632e1952N4747M1600k0516r611m4214k3352N8188K4117N46m397o1271j0639M7475
645G21J4335K5095j1902o5903J703K5799J7042M3381k5763n6344M180K213L1580
658F137M8404l6530l7427o165j3403M9474L9971l5166j8656k6787j5403O0779
670A5228K4613k0043r763m8002n498N8161J1891L389j3511o0114P488M2073J0741
683A6653K5248k6813n7623J4684J9654K1723L6494l9759m3144R078R76L9606L4171
$$ plain form
696 50948 6697 -18594 -26407 -32854 21802 43921 8400 -4762 -34441 -35760 23829 32797 16591
709 16591 3960 -42821 -31575 19696 23252 29125 5908 -46168 -24516 8659 19045 40990
721 40990 2210 -42331 -19908 -6092 20966 46509 -2658 -31663 -21427 -19017 26446 44148
733 44148 -3019 -18098 -28660 -25231 31461 35976 3232 -7014 -37947 -24147 30345 26462 14931
746 14931 -2754 -44840 -19043 22022 20515 27505 -5095 -45188 -14008 8961 21084 36714
758 36714 -9549 -38361 -13654 -3945 27110 39167 -12126 -27447 -19509 -12911 33617 34713 -9029
771 -9029 -16988 -29928 -15569 36454 27069 183 -11055 -39384 -12397 32600 21047 13519 -10693
784 -10693 -43855 -7507 22417 19930 25267 -14894 -41327 -5668 8981 24085 31134 -18905 -32955
$$ packed form
696E0948m4251k5291p813o447N4656K2119l5521j3162k9679j319N9589Q968j6206
709A6591j2631m6781J1246N1271L556N873k3217n2076K1652L3175J0386K1945
721D0990l8780m4541K2423J3816K7058K5543m9167k9005J0236K410M5463J7702
733D4148m7167j5079j0562L429N6692M515l2744j0246l0933J3800N4492l883j1531
746A4931j7685m2086K5797M1065j507O990l2600m0093L1180K2969J2123J5630
758C6714m6263k8812K4707R709L1055J2057n1293j5321P938O598M6528J096m3742
771i029p959j2940J4359N2023r385k6886j1238k8329K6987M4997j1553p528k4212
784a0693l3162L6348K9924k487N337m0161k6433L5659J4649J5104P049n0039j4050
$$ plain form
797 -32955 -9808 -2108 31424 30179 -18650 -22739 -18775 -6962 37382 24653 -11799 -15360 -29509
810 -29509 -5869 37597 18795 -559 -14248 -37703 -1639 31143 16364 11429 -18130 -39698
822 -39698 1472 20475 19820 20401 -23273 -35077 128 9786 27388 23131 -25615 -26635 -7250
835 -7250 2367 35024 20155 -22402 -19328 -18399 787 38505 14642 -13216 -15917 -28416 3997
848 3997 35924 11470 -852 -18135 -33631 8224 27865 13093 9473 -23873 -32701 8718 17498
861 17498 19802 14572 -28976 -27064 3550 9708 28839 13940 -29217 -20177 -5920 7010 35720
874 35720 10065 -23222 -16358 -16812 9132 37080 6271 -13186 -17549 -25029 13030 32134 6201
887 6201 -2377 -22729 -27702 15350 23766 11495 5266 -28558 -24381 13041 15508 20315 7455 -31517
$$ packed form
797c2955K3147P700L3532j245m8829m089L964J1813M4344j2729l6452l561j4149
810b9509K3640M3466j8802j9354j3689k3455L6064L2782j4779m935k9559k1568
822c9698M1170J9003o55N81m3674j1804L5205R658J7602m257m8746j020J9385
835g250R617L2657j4869m2557L074R29J9186L7718k3863k7858k701j2499L2413
848C997L1927k4454j2322j7283j5496M1855J9641j4772l620l3346q828M1419Q780
861A7498K304n230m3548J912L0614O158J9131j4899m3157R040J4257J2930K8710
874C5720k5655l3287O864m54K5944K7948l0809j9457m363p480L8059J9104k5933
887F201q578k0352m973M3052Q416j2271o229l3824M177L7422K467M807j2860l8972
$$ plain form
901 -31517 -18674 5376 10885 28796 4656 -29427 -14305 -5297 11538 33348 541 -21812
913 -21812 -14189 -14965 16036 32551 -792 -11863 -18790 -19925 20389 26706 2650 -3618 -25856
926 -25856 -19920 20438 19254 10507 31 -31567 -15910 15310 14037 19824 -713 -32159 -11522
939 -11522 6072 13451 27171 -3843 -27424 -10151 -3923 16735 29224 -6371 -19141 -13365 -11554
952 -11554 21228 26149 -5169 -10792 -20045 -13915 23964 20198 888 -5412 -27060 -11472 22220
965 22220 15000 10111 -4812 -31183 -7516 15473 13293 18615 -8202 -30191 -5389 5936 15932
978 15932 23505 -11630 -24343 -7214 -2312 21305 23493 -12080 -16459 -12994 -6650 25620 19427
991 19427 -7823 -10364 -20839 -6765 26027 14377 2 -8387 -26957 -3820 21649 11659 9032
$$ packed form
901c1517J2843K4050N509J7911k4140l4083J5122R008J6835K1810l2807k2353
913b1812P623p76L1001J6515l3343j1071o927j135M0314O317k4056o268k2238
926b5856N936M0358j184q747j0476l1598J5657L1220j273N787k0537l1446K0637
939a1522J7594P379J3720l1014k3581J7273O228K0658J2489l5595j2770N776J811
952a1554L2782M921l1318n623r253O130L7879l766j9310o300k1648J5588L3692
965B2220p220m889j4923k6371K3667K2989k180N322k6817k1989K4802J1325R996
978A5932P573l5135j2713J7129M902K3617K188l5573m379L465O344L2270o193
991A9427k7250k541j0475J4074L2792j1650j4375q389j8570K3137K5469r990k627
$$ plain form
1004 9032 -10158 -28591 -918 14049 13337 16050 -13884 -25582 -969 5865 18190 18380 -16502
1017 -16502 -19749 -5671 109 23857 16375 -15221 -14038 -13048 -1233 27334 12290 -9194 -10887
1030 -10887 -20534 1028 26173 9400 -483 -11987 -24911 4084 20391 9640 7359 -15764
1042 -15764 -24747 4808 12502 13812 11902 -19230 -20531 1823 6174 19966 12140 -19581 -15033
1055 -15033 -4605 3386 25057 9308 -15903 -11700 -12501 4381 26395 5958 -9115 -11961 -18741
1068 -18741 7340 23512 5493 -1235 -15355 -20898 9784 17917 8612 4641 -19721 -19145 8702
1081 8702 11650 14542 6629 -22462 -15142 3495 7619 20730 5010 -21113 -11369 -4075 7362
1094 7362 24539 2312 -15654 -10410 -11225 9975 24158 951 -8304 -13078 -15520 12870 19948
$$ packed form
1004I032j9190j8433K7673J4967p12K713k9934j1698K4613O834J2325J90l4882
1017a6502l247J4078N780K3748p482l1596J183R90J1815K8567j5044k1484j693
1030a0887r647K1562K5145j6773r883j1504j2924K8995J6307j0751k281k3123
1042a5764q983K9555P694J310j910l1132j301K2354M351J3792p826l1721M548
1055a5033J0428P991K1671j5749k5211M203q01J6882K2014k0437j5073k846o780
1068a8741K6081J6172j8019o728j4120n543L0682Q133r305l971k4362N76K7847
1081H702K948K892p913k9091P320J8637M124J3111j5720k6123R744P294J1437
1094G362J7177k2227j7966N244q15K1200J4183k3207r255m774k442K8390P078
$$ plain form
1107 19948 2769 -1935 -17863 -16005 13358 14411 7905 1302 -22009 -13075 10380 10535 14597 1160
1121 1160 -23020 -9681 4301 9520 19996 -1319 -20482 -8360 -2945 11469 21957 -3549
1133 -3549 -14716 -10132 -8794 14656 20212 -2886 -8272 -14502 -11065 16844 16019 1200 -3590 -19479
1147 -19479 -9969 15539 11677 7537 -2578 -22599 -7282 10751 9761 13894 -4346 -22095 -5274
1160 -5274 4048 11125 17879 -6726 -18108 -5966 -1959 14780 18211 -7611 -12721 -9810 -5596 18014
1174 18014 15485 -5278 -8201 -15423 -5922 18909 11901 -18 -6299 -19889 -3893 16289 9681
1187 9681 6730 -6939 -21550 -1839 10846 10268 12078 -9325 -19713 -1788 4438 13106 14356
1200 14356 -10995 -15416 -4852 -393 17000 13456 -10105 -10733 -9823 -1991 19590 10655 -6053 -8029
$$ packed form
1107A9948j7179m704j5928J858K9363J053o506o603k3311Q934K3455J55M062j3437
1121A160k4180J3339J3982N219J0476k1315j9163J2122N415J4414J0488k5506
1133c549j1167M584J338K3450N556k3098n386o230L437K7909q25j4819m790j5889
1147a9479R510K5508l862m140j0115k0021J5317J8033r90M133j8240j7749J6821
1160e274R322P077O754k4605j1382J2142M007J6739L431k5822n110K911M214K3610
1174A8014k529k0763k923p222R501K4831p008j1919o281j3590J5996K0182o608
1187I681k951j3669j4611J9711J2685n78J810k1403j0388J7925O226Q668J250
1200A4356k5351m421J0564M459J7393l544k3561o28R10P832K1581q935j6708j976
$$ plain form
1214 -8029 -15299 -898 19131 8200 -158 -8432 -18950 1287 15325 7898 5605 -10916 -19199
1227 -19199 2228 9960 10671 9511 -13339 -16539 606 5082 14853 10208 -13996 -12619 -3896 2226
1241 2226 18529 8468 -11547 -9705 -9656 2077 19741 6246 -6552 -8922 -14381 3864 17975
1254 17975 5531 -457 -10689 -16477 5498 13739 7042 4167 -13723 -15694 4940 8827 11069
1267 11069 6101 -15890 -12798 1825 5660 15630 5502 -15375 -9797 -3296 5070 18765 3546
1280 3546 -11816 -8691 -8778 6567 18858 2212 -6626 -10095 -12475 8272 16009 3166 -1450 -13117
1294 -13117 -13334 8850 11887 6619 1829 -15929 -11632 6866 8379 11349 2477 -16914 -9128 2430
1308 2430 6729 15396 1092 -15263 -7658 -3043 7562 17232 -635 -11181 -8254 -7472 9890 16512
$$ packed form
1214h029p270J4401K0029j0931q358q274j0518K0237J4038p427k293j6521q283
1227a9199K1427P732P11j160k2850l200J7145M476R771m645k4204J377Q723O122
1241B226J6303j0061k0015J842M9J1733J7664j3495j2798k370n459J8245J4111
1254A7975j2444n988j0232n788K1975Q241o697k875j7890j971K0634L887K242
1267A1069m968k1991L092J4623L835R970j0128k0877N578O501Q366J3695j5219
1280C546j5362L125q7J5345J2291j6646q838l469k380K0747P737j2843m616j1667
1294a3117k17K2184L037n268m790j7758M297J8498J513K970q872j9391P786J1558
1308B430M299Q667j4304j6355P605M615J0605R670j7867j0546K927P82J7362O622
$$ plain form
1322 16512 -596 -6321 -10990 -9530 11651 13483 1786 -2563 -14670 -9265 11117 10056 6128
1335 6128 -1265 -17332 -7406 7980 8057 10993 -1912 -17110 -5570 2947 8425 14452 -3381 -14257
1349 -14257 -5707 -2109 10356 15048 -4155 -10079 -8042 -5547 12611 13249 -2678 -6113 -11794 -6216
1363 -6216 13526 10527 980 -4006 -15196 -4937 11962 8456 5797 -4152 -16876 -3299 8115
1376 8115 8187 9858 -5910 -15964 -2876 3351 9878 12123 -7210 -12787 -4443 -642 12797 11908
1390 11908 -6836 -9004 -7946 -2572 14763 9818 -3992 -6303 -12171 -2442 14414 7654 485 -5745
1404 -5745 -15090 -1083 11657 6933 5305 -6929 -15495 -5 7594 8443 8506 -8761 -13663 -763
1418 -763 3476 11093 9325 -9627 -10744 -3788 884 13975 8204 -8388 -8183 -7777 476 15312 6386
$$ packed form
1322A6512j7108n725m669J460K1181J832j1697m349j2107N405K0382j061l928
1335F128p393j6067R926J5386P7K936j2905j5198J1540Q517N478O027j7833j0876
1349a4257Q550L598J2465M692j9203n924K037K495J8158O38j5927l435n681N578
1363f216J9742k999r547m986j1190J0259J6899l506k659r949j2724J3577J1414
1376H115P2J671j5768j0054J3088O227O527K245j9333n577Q344L801J3439q89
1390A1908j8744k168J058N374J7335m945j3810k311n868R729J6856o760p169o230
1404e745r345J4007J2740m724j628j2234q566J5490P599Q49O3j7267m902J2900
1418g63M239P617j768j8952j117O956M672J3091n771j6592K05M06Q253J4836q926
$$ plain form
1433 6386 -4769 -6901 -11528 1669 14347 5375 -190 -7871 -13638 2804 11058 6100 3863 -9814
1447 -9814 -13281 2617 6981 8723 6111 -11411 -11086 599 3928 12146 6071 -11068 -8430 -3309
1461 -3309 2737 14537 4594 -8694 -7121 -7585 3430 14881 3237 -4823 -7690 -10555 4966 12999
1475 12999 3473 -575 -9593 -11406 5894 9926 5566 2199 -11866 -10306 4724 6749 8924 3022
1489 3022 -12896 -8344 1486 4987 12185 2259 -11797 -6700 -2767 5026 14046 1099 -8500 -6679
1503 -6679 -6610 6473 13594 729 -4485 -8401 -8737 7770 11118 2108 -1234 -11068 -8807 7700 8243
1518 8243 5254 256 -13078 -7081 5699 6264 8967 13 -13309 -5413 2006 6094 11782 -1334
1532 -1334 -11519 -5043 -2107 7393 12508 -2215 -8185 -6478 -5043 9140 11437 -1327 -4663 -9121
$$ packed form
1433F386j1155k132m627J3197J2678q972n565p681n767J6442Q254m958k237j3677
1447i814l467J5898M364J742k612j7522L25J1685L329Q218o075j7139K638N121
1461c309O046J1800r943j3288J573m64J1015J1451j1644q060k867k865J5521Q033
1475A2999r526m048r018j813J7300M032m360l367j4065J560J5030K025K175n902
1489C022j5918M552R830L501P198r926j4056N097L933P793R020j2947r599J821
1503f679O9J3083P121j2865n214l916l36J6507L348r010l342r834K261J6507N43
1518H243k989m998j3334N997J2780N65K703q954j3322P896P419M088N688j3116
1532a334j0185O476K936R500N115j4723n970J707J435J4183K297j2764l336m458
$$ plain form
1546 -9121 -6013 9968 9143 1270 -2384 -11796 -5488 8759 6913 4989 -1974 -13302 -4089 5876
1560 5876 6150 8445 -2973 -12688 -3287 1991 7175 10551 -4188 -10258 -3970 -1369 9276 10474
1574 10474 -4421 -7192 -6386 -3190 10944 8762 -2796 -4780 -9627 -3126 11193 6781 567 -3921
1588 -3921 -12025 -1841 9312 5765 4505 -4534 -12657 -895 5964 6418 7281 -6038 -11405 -1377
1602 -1377 2257 8271 8365 -6734 -8794 -3336 -247 10608 7744 -5839 -6288 -6330 -875 11922 6108
$$ packed form
1546i121L108J5981q25p873l654r412O308J4247j846j924o963j1328R213R965
1560E876K74K295j1418r715R401N278N184L376j4739o070O288K601J0645J198
1574A0474j4895k771Q06L196J4134k182j1558j984m847O501J4319m412o214m488
1588c921q104J0184J1153l547j260r039q123J1762O859M54Q63j3319n367J0028
1602a377L634O014R4j5099k060N458L089J0855k864j3583m49m2N455J2797n814
$$ [...]
8191A30
##END NTUPLES=NMR FID
##END=
