##TITLE=1H_DE-80H_X3
 200.13MHz, d2o
 8 sc
 
 19ns.26.2.2025
##JCAMPDX= 6.0         $$ Bruker NMR JCAMP-DX V2.0
##DATA TYPE= NMR FID
##DATA CLASS= NTUPLES
##ORIGIN= UXNMR, Bruker Analytische Messtechnik GmbH
##OWNER= pz
$$ XWIN-NMR		Version 3.5
$$ Wed Apr 30 10:26:46 2025 Russian Standard Time (UT+4h)  Yarkov@DPX200
##.OBSERVE FREQUENCY= 200.1313
##.OBSERVE NUCLEUS= ^1H
##.DELAY= (6, 6)
##.ACQUISITION MODE= SIMULTANEOUS
##.ACQUISITION SCHEME= undefined
##.AVERAGES= 8
##.DIGITISER RES= 18
##SPECTROMETER/DATA SYSTEM= spect
##.PULSE SEQUENCE= zg30
##.SOLVENT NAME= CDCl3
##.SHIFT REFERENCE= (INTERNAL, CDCl3, 0, 14.3821)
##AUDIT TRAIL= $$ (NUMBER, WHEN, WHO, WHERE, WHAT)
$$ ##TITLE= Audit trail, XWIN-NMR		Version 3.5
$$ ##JCAMPDX= 5.01
$$ ##ORIGIN= Bruker BioSpin GmbH
$$ ##OWNER= Yarkov
$$ C:/Bruker/XWIN-NMR/data/yarkov2/nmr/H-C/1/audita.txt
$$ ##AUDIT TRAIL=  $$ (NUMBER, WHEN, WHO, WHERE, WHAT)
(   1,<2025-04-30 10:22:47.75 +0400>,<Yarkov>,<DPX200>,
      <created by zg, POWCHK disabled, PULCHK disabled
       configuration hash MD5:
       00 E9 B6 7A A2 85 ED C7 34 08 36 98 17 FE 4E 26
       data hash MD5: 16K
       62 69 99 FD F0 69 42 11 44 79 6A F6 DF BE A7 C0>)
$$ ##END=
$$ 
$$ hash MD5
$$ 33 79 35 B4 83 BF A4 D7 7A B4 55 4B 78 5E 5E D3
##$RELAX= 
##$RELAX= 
##$RELAX= 
##$RELAX= 
##$RELAX= 
##$RELAX= 
$$ Bruker specific parameters
$$ --------------------------
##$DU= <C:/Bruker/XWIN-NMR>
##$EXPNO= 1
##$NAME= <H-C>
##$PROCNO= 1
##$TYPE= <nmr>
##$USER= <yarkov2>
##$AMP= (0..31)
100 100 100 100 100 100 100 100 100 100 100 100 100 100 100 100 100 100 
100 100 100 100 100 100 100 100 100 100 100 100 100 100 
##$AQSEQ= 0
##$AQ_mod= 1
##$AUNM= <au_zg>
##$AUTOPOS= <>
##$BF1= 200.13
##$BF2= 200.13
##$BF3= 200.13
##$BF4= 200.13
##$BF5= 200.13
##$BF6= 200.13
##$BF7= 200.13
##$BF8= 200.13
##$BYTORDA= 1
##$CFDGTYP= 0
##$CFRGTYP= 5
##$CHEMSTR= <none>
##$CNST= (0..31)
1 1 145 1 1 1 1 1 1 1 1 1 1 1 1 1 1 1 1 1 1 1 1 1 1 1 1 1 1 1 1 1 
##$CPDPRG= <>
##$CPDPRG1= <>
##$CPDPRG2= <>
##$CPDPRG3= <>
##$CPDPRG4= <mlev>
##$CPDPRG5= <mlev>
##$CPDPRG6= <mlev>
##$CPDPRG7= <mlev>
##$CPDPRG8= <mlev>
##$CPDPRGB= <>
##$CPDPRGT= <>
##$D= (0..31)
0 0.7 0 0 0 0 0 0 0 0 0 0.03 0 0 0 0 0 0 0 0 0 0 0 0 0 0 0 0 0 0 0 0 
##$DATE= 1745994167
##$DBL= (0..7)
120 120 120 120 120 120 120 120 
##$DBP= (0..7)
150 150 150 150 150 150 150 150 
##$DBP07= 0
##$DBPNAM0= <>
##$DBPNAM1= <>
##$DBPNAM2= <>
##$DBPNAM3= <>
##$DBPNAM4= <>
##$DBPNAM5= <>
##$DBPNAM6= <>
##$DBPNAM7= <>
##$DBPOAL= (0..7)
0.5 0.5 0.5 0.5 0.5 0.5 0.5 0.5 
##$DBPOFFS= (0..7)
0 0 0 0 0 0 0 0 
##$DE= 6
##$DECBNUC= <off>
##$DECIM= 32
##$DECNUC= <off>
##$DECSTAT= 4
##$DIGMOD= 1
##$DIGTYP= 9
##$DL= (0..7)
0 120 120 120 120 120 120 120 
##$DP= (0..7)
150 150 150 150 150 150 150 150 
##$DP07= 0
##$DPNAME0= <>
##$DPNAME1= <>
##$DPNAME2= <>
##$DPNAME3= <>
##$DPNAME4= <>
##$DPNAME5= <>
##$DPNAME6= <>
##$DPNAME7= <>
##$DPOAL= (0..7)
0.5 0.5 0.5 0.5 0.5 0.5 0.5 0.5 
##$DPOFFS= (0..7)
0 0 0 0 0 0 0 0 
##$DQDMODE= 0
##$DR= 18
##$DS= 0
$$ [...]
##$SUBNAM2= <"">
##$SUBNAM3= <"">
##$SUBNAM4= <"">
##$SUBNAM5= <"">
##$SUBNAM6= <"">
##$SUBNAM7= <"">
##$SUBNAM8= <"">
##$SUBNAM9= <"">
##$SW= 18.0517328524113
##$SWIBOX= (0..15)
0 0 2 0 0 0 0 0 0 0 0 0 0 0 0 0 
##$SW_h= 3612.71676300578
##$TD= 16384
##$TD0= 1
##$TE= 0
##$TE2= 300
##$TE3= 300
##$TEG= 300
##$TL= (0..7)
0 120 120 120 120 120 120 120 
##$TP= (0..7)
150 150 150 150 150 150 150 150 
##$TP07= 0
##$TPNAME0= <>
##$TPNAME1= <>
##$TPNAME2= <>
##$TPNAME3= <>
##$TPNAME4= <>
##$TPNAME5= <>
##$TPNAME6= <>
##$TPNAME7= <>
##$TPOAL= (0..7)
0.5 0.5 0.5 0.5 0.5 0.5 0.5 0.5 
##$TPOFFS= (0..7)
0 0 0 0 0 0 0 0 
##$TUNHIN= 0
##$TUNHOUT= 0
##$TUNXOUT= 0
##$USERA1= <user>
##$USERA2= <user>
##$USERA3= <user>
##$USERA4= <user>
##$USERA5= <user>
##$V9= 5
##$VALIST= <valist>
##$VCLIST= <CCCCCCCCCCCCCCC>
##$VD= 0
##$VDLIST= <DDDDDDDDDDDDDDD>
##$VPLIST= <PPPPPPPPPPPPPPP>
##$VTLIST= <TTTTTTTTTTTTTTT>
##$WBST= 1024
##$WBSW= 4
##$XGAIN= (0..3)
0 0 0 0 
##$XL= 0
##$YL= 0
##$YMAX_a= 278633
##$YMIN_a= -236861
##$ZGOPTNS= <>
##$ZL1= 120
##$ZL2= 120
##$ZL3= 120
##$ZL4= 120
##$ABSF1= 10
##$ABSF2= 0
##$ABSG= 5
##$ABSL= 3
##$ALPHA= 0
##$AQORDER= 0
##$ASSFAC= 0
##$ASSFACI= 0
##$ASSFACX= 0
##$ASSWID= 0
##$AUNMP= <proc_1d>
##$AZFE= 0.1
##$AZFW= 0.1
##$BCFW= 1
##$BC_mod= 2
##$BYTORDP= 1
##$COROFFS= 0
##$CY= 83.5205535888672
##$DATMOD= 1
##$DC= 2
##$DFILT= <>
##$DTYPP= 0
##$F1P= 10.8118882576601
##$F2P= -7.23987719738617
##$FCOR= 0.5
##$FTSIZE= 0
##$FT_mod= 4
##$GAMMA= 1
##$GB= 0.15
##$INTBC= 1
##$INTSCL= 1
##$ISEN= 128
##$LB= 0.25
##$LEV0= 0
##$LPBIN= 0
##$MAXI= 10000
##$MC2= 0
##$MEAN= 0
##$ME_mod= 0
##$MI= 1.114404
##$NCOEF= 0
##$NC_proc= 0
##$NLEV= 6
##$NOISF1= 3.799351
##$NOISF2= 2.8
##$NSP= 1
##$NTH_PI= 0
##$NZP= 0
##$OFFSET= 14.38212
##$PC= 1
##$PHC0= -1261.595
##$PHC1= 4.933743
##$PH_mod= 1
##$PKNL= yes
##$PPARMOD= 0
##$PSCAL= 0
##$PSIGN= 0
##$REVERSE= no
##$SF= 200.129724274929
##$SI= 16384
##$SIGF1= 3
##$SIGF2= 2
##$SINO= 400
##$SIOLD= 16384
##$SREGLST= <1H.CDCl3>
##$SSB= 0
##$STSI= 0
##$STSR= 0
##$SW_p= 3205.1282051282
##$SYMM= 0
##$S_DEV= 0
##$TDeff= 0
##$TDoff= 0
##$TI= <>
##$TILT= no
##$TM1= 0
##$TM2= 0
##$TOPLEV= 0
##$USERP1= <user>
##$USERP2= <user>
##$USERP3= <user>
##$USERP4= <user>
##$USERP5= <user>
##$WDW= 1
##$XDIM= 8192
##$YMAX_p= 0
##$YMIN_p= 0
$$ End of Bruker specific parameters
$$ ---------------------------------
##NTUPLES= NMR FID
##VAR_NAME=  TIME,          FID/REAL,        FID/IMAG
##SYMBOL=    X,             R,               I
##VAR_TYPE=  INDEPENDENT,   DEPENDENT,       DEPENDENT
##VAR_FORM=  AFFN,          ASDF,            ASDF
##VAR_DIM=   8192,          8192,            8192
##UNITS=     SECONDS,       ARBITRARY UNITS, ARBITRARY UNITS
##FACTOR=    0.0002768,     1,               1
##FIRST=     0,             0,               0
##LAST=      2.2672688,     0,               0
##MIN=       0,             -236861,         0
##MAX=       2.2672688,     278633,          0
$$ Real data points
##PAGE= N=1
##DATA TABLE= (X++(R..R)), XYDATA
0@%%%%%%%%%%Qj6J6j6K4l3M1n6P2q8J04j21J45j76K09k47K90l39L93m52N21n98
32c19O85p82Q87j001J129j273J427j596J782j986K208k448K713l004L317l658
48a919M033m443M892n383N924o524P190p930Q759r699J0772j2007J3450j5168
62h053J7252j9843K3182k7691L4215m4755O6019j79549J72391J56717k01494k15397
74b27006K92943J60724l74509K3798J89449J67175m68822J81777J67549L5803
84A48881l76811J82015K48373j94862j72061J18719L05534l64497j9612J34310
94I989K16403l62099j427K58609j125k34552m1479L75640k02217j27605l717L50818
106B37238k60429j32241J53982J77142j94417j91216L28857j7361j34842j70577
$$ plain form
0 0 0 0 0 0 0 0 0 0 0 0 8 -8 8 -8 16 -17 24 -32 40 -48 56 -65 80 -96 113 -134 156 -183 210 -242 279 -319
32 -319 366 -416 471 -530 599 -674 753 -843 939 -1047 1161 -1287 1426 -1578 1739 -1919
48 -1919 2114 -2329 2563 -2820 3104 -3420 3770 -4160 4599 -5100 5672 -6335 7115 -8053
62 -8053 9199 -10644 12538 -15153 19062 -25693 40326 -139223 33168 189885 -11609 -227006
74 -227006 65937 226661 -147848 -124050 65399 232574 -236248 -54471 113078 148881
84 148881 -227930 -45915 202458 7596 -164465 -45746 259788 -104709 -124321 9989
94 9989 226392 -135707 -137134 121475 120350 -114202 -155681 219959 17742 -109863 -113580 237238
106 237238 -23191 -155432 -1450 175692 -18725 -209941 118916 101555 -33287 -203864
116b03864L78829j01153j76912j2736K70523p0388k75901J91986J13893m1359
126G2918l00578K98951M1400j14347j77677K55382P0690k56836K1527J50067R6631
137A58128l39063J54945J10475J6587k75417J56892J63860j51230j15233R6693
147b3363K14737k84160J1479R2325J56851k84295K9480J78568o627j79180r422
158a03607K70870j65848q3087M538K58908k15411p5350J13914J26871j59677j20698
169a48577K45675k9223r8885j15223K87286j01196j15781m846K03652p5963j86826
180a39907J50081P3507l9752k12031K35671N821p8961j26211K02279K5246j80951
191h5208K6470J11213N4982k48039J35829O5457Q103k04639J39995R8452j13165
$$ plain form
116 -203864 174965 73812 -103100 -115836 154687 84299 -191602 384 114277 72918
126 72918 -227660 71291 112691 -1656 -179333 76049 146739 -110097 -88570 61497 158128
137 158128 -180935 -25990 84485 101072 -174345 -17453 146407 -4823 -120056 -23363
147 -23363 191374 -92786 -81307 11018 167869 -116426 -86946 91622 84995 -94185 -103607
158 -103607 167263 1415 -81672 -77134 181774 -33637 -108987 4927 131798 -27879 -148577
169 -148577 97098 67875 -31010 -146233 141053 39857 -75924 -80770 122882 46919 -139907
180 -139907 10174 83681 43929 -168102 67569 73390 -5571 -131782 70497 95743 -85208
191 -85208 -58738 52475 107457 -140582 -4753 60704 68807 -135832 4163 102615 -10550
202a0550p9225Q5137J42318k18046K8246O6034J08354k22481M9765J20252j1843
213E7961j36913J5251J90071j36652n0132J1563J87072j79053l2242Q2180Q8830
224I7936j32538o5902J78995l5693p1909p1907K13670r7417o9703J73J51331p7415
236A9621j18832J14617M5453l8404j44171J83702j6957n3013q7611J59977o124
247E8258j23146K6950Q3438K4130j77849J16550L5448J231j51008J24510N1559
258G0071q3645n3926P6563Q7371j65257L7356M7495P1116j73189O2052P6560j4433
270C8134j05071L3409J27428j11721k6681J7473J30795j48822p13N7590O0292
281G2113j11492k4168J26798l8370n3195l8028J57035r3349l6385M808J12523
$$ plain form
202 -10550 -89775 -4638 137680 -80366 -52120 13914 122268 -100213 -50448 69804 57961
213 57961 -78952 -63701 126370 -10282 -60414 -48851 138221 -40832 -73074 9106 97936
224 97936 -34602 -100504 78491 42798 -29111 -101018 112652 15235 -54468 -54295 97036 19621
236 19621 -99211 15406 60859 22455 -121716 61986 45029 -7984 -95595 64382 58258
247 58258 -64888 -37938 45500 69630 -108219 8331 43779 45010 -105998 18512 70071
258 70071 -13574 -67500 9063 96434 -68823 -31467 16028 87144 -86045 -23993 52567 38134
270 38134 -66937 -33528 93900 -17821 -44502 -27029 103766 -45056 -45769 11821 72113
281 72113 -39379 -63547 63251 24881 -28314 -66342 90693 -2656 -39041 -34233 78290
292G8290p9716o7285Q7551K6586m0414r1990J44761l2548l6423n7949J30489l1188
304C0164q0768K7420O5800k470j24639J02419J4792o601j10496J14472J5863o2182
316a6226l5628P2691M4058j25110M3727L5074M1684j35705P1433M3510j5930q1751
328e8173M7526P9668r1590j0484K2309Q8578j25192K1507L9134M0106r5808N863
340c6556Q7619l8168m0703j3555J15377q8339j3945P945Q5229q0852l0932O7218
352B0338J4824m2731n4300J15557m1578k5780l6620J08972m8099n0607K6676N4124
364D0776k2024q5224R0241J235j2575q0294J05390r213m5559k3234O9348J2552
376D1419r3746M6034K6339K0381j06657P6052J9332j5519o4748N6564M4402p4335
$$ plain form
292 78290 -1426 -68711 18840 45426 5012 -86978 57783 25235 -11188 -69137 61352 30164
304 30164 -50604 -23184 42616 40146 -84493 17926 32718 26117 -84379 30093 45956 -16226
316 -16226 -51854 20837 64895 -60215 -16488 18586 60270 -75435 -4002 39508 23578 -58173
328 -58173 -10647 69021 -22569 -33053 -10744 77834 -47358 -25851 13283 53389 -42419 -36556
340 -36556 51063 12895 -27808 -41363 74014 -14325 -28270 -20325 64904 -15948 -46880 20338
352 20338 35162 -7569 -61869 53688 12110 -13670 -50290 58682 10583 -40024 -13348 40776
364 40776 18752 -66472 23769 25004 12429 -67865 37525 28312 -17247 -40481 28867 41419
376 41419 -52327 -6293 20046 40427 -66230 9822 29154 13635 -51113 5451 49853 -24482
388b4482n40K5545N7940j06067L5603K5663K6508q4228K6710N8745l6120l2865
400b7588M084Q4779q2796O26J0195O5878q0897n567N1993P565m4772k6970R3189
413D9719m6345j8683k1201R2163n8532k8825K4925M5506l4894n6108P8899p448
425A9176j5994n7930R5740k5508l2102j5348O4812q267o9169M4588J9831O783
437B6612q4235P5573K997j3313n2596O0164K0327n9419M478K6629L7140q9979
449d5622M2501J6049J8240p4881L8977L8268l2516k7841J5287O2606p6067R458
461a5541J0957N1951p8434J1013L9754L563m4956q292P4951m7246j3163j0984
473b6427P7739o2876j2776K1479L8540m1565l4440O6997j2315j6710m1550Q4978
$$ plain form
388 -24482 -25022 523 58463 -47604 -12001 13662 40170 -44058 -17348 41397 5277 -27588
400 -27588 -23504 61275 -21521 -20895 -10700 55178 -25719 -31286 20707 28272 -16500 -43470 49719
413 49719 3374 -15309 -36510 55653 -2879 -31704 -6779 38727 3833 -52275 26624 19176
425 19176 3182 -54748 40992 15484 -16618 -31966 32846 24579 -44590 -2 19829 26612
437 26612 -57623 17950 20947 7634 -44962 15202 35529 -23890 -19412 7217 44357 -45622
449 -45622 -3121 12928 31168 -43713 -4736 33532 1016 -26825 -11538 51068 -24999 -15541
461 -15541 -4584 47367 -31067 -20054 19700 23263 -21693 -29985 44966 -2280 -15443 -26427
473 -26427 51312 -11564 -24340 -2861 35679 -5886 -40326 26671 14356 -2354 -43904 41074
485D1074l4946k0673j0951N9214k1311m9148M0265J4999j642o6175P1470p867
497A4309j0032m3714O0422L374m6177O502K6607K2023p5544M5003Q810J2859o6400
510d1958M5944K2540k7895k4058K2379M4986o8080J5093J0355M0815p3353K2010
522a1222K8671J521m2807M374N8535m4963q189m746O4394o2292o91J6576L2429
535C1590m3175j8271N4450j4339j5344k9494P3156l9010j1106q904N2907k8637
547C823l2997L4377J1429o669n1267O4961j4601o720l6600N8223q402l4578O778
560a2243K5873J0653o2270M4661L222R067n7928M8996R957k2570k0729K6325L0314
573C3328n8830J8424Q674L1621o6299K9084J8237R89l9035J2790M3379m0269l893
$$ plain form
485 41074 6128 -14545 -25496 33718 12407 -36741 3524 18523 16881 -49294 22176 14309
497 14309 4277 -39437 20985 24359 -21818 -15316 11291 33314 -42230 2773 11583 24442 -41958
510 -41958 3986 26526 -1369 -25427 -3048 41938 -26142 -11049 -694 40121 -33232 -11222
522 -11222 17449 18970 -23837 -19463 39072 -5891 -14080 -18826 45568 -16724 -17415 -839 31590
535 31590 -11585 -29856 24594 10255 -5089 -34583 38573 -437 -11543 -20447 32460 3823
547 3823 -29174 5203 16632 9963 -41304 23657 9056 2336 -34264 23959 15557 -19021 -12243
560 -12243 13630 24283 -37987 6674 9896 18963 -38965 10031 19988 -2582 -23311 3014 33328
573 33328 -25502 -7078 1596 33217 -33082 -3998 14239 15228 -23807 -11017 32362 -7907 -11800
586a1800j240N2130n8419Q269J0939K7371m1981o090M2201j4435j3235k0302O1291
599C4699l9651l504p997M6571l2464j9942K8000Q952r969l8510N7321j8655l737
612A114l0306N4219j6607k4242O137K4347J978m9542M2074j292O469m9168M8837
625A4018k68j6637j7532K7471J8007m8361J9709O170K4013n7606L2771Q646J655
638A2056l4442J8139K9574l4063n18P65M0821n2587J4677N540K3052l9622L683
651a2925L0679j3385j1531j2207M9827l8757K454o919M0258l4890q556K1821P091
664A2960j3082k6346M9225k1444j443k3888M9342k3367j4457N230K2483n812l6684
677b7283L8167n035M111m0046M7026r203j0485j4707K7666O827l7343J9593L840
$$ plain form
586 -11800 -13040 39090 -19329 -11060 -121 27250 -14731 -20821 21380 6945 -6290 -26592 34699
599 34699 -4952 -8456 -16453 30118 -2346 -22288 5712 14664 4695 -33815 23506 4851 1114
612 1114 -29192 25027 8420 -15822 -9685 14662 16640 -32902 9172 7880 14349 -34819 14018
625 14018 13750 -2887 -20419 7052 25059 -23302 -3593 2577 26590 -31016 1755 10401 12056
638 12056 -22386 -4247 25327 -8736 -9254 -8489 32332 -20255 -5578 -38 23014 -16608 -12925
651 -12925 17754 4369 -7162 -19369 30458 -8299 -5845 -12764 27494 -7396 -15952 5869 12960
664 12960 -122 -26468 22757 1313 -130 -24018 25324 1957 -12500 -7270 15213 9401 -27283
677 -27283 10884 5849 9960 -30086 16940 7737 -2748 -17455 10211 17038 -20305 -712 3128
690C128J7132m8397L4475L69K721l0144K2148J7231k7473J605K701L0504m6297
703b0297J9110J202J9258l7078J1533K0627j1771j0603m933L9236l6848O778n611
716i397L4145l6023Q73J6099N669j5393j5660M0862k2581L21j8021M3635k7770
729c241n904L746K0395j1644k4862L2940p444K407l1567M3440j5558m791j2728
742a4811K7089k155k6981J7998K427J1198l9661L4345n774L748k6594K5111O977
755A2917k1185K303N043K1325m0211K1828j730J5723l4699J7948J2059r977j0314
768h970J688K9495l4237R682l996K8269l6192Q646J0887M662j7166o249L2504
781A9023k2404J539j2767L7639l0250J202K027J8528j6115j4496K7232q473P20
$$ plain form
690 3128 20260 -28137 6338 6707 9428 -20716 1432 18663 -8810 -7205 -4504 26000 -20297
703 -20297 -1187 15 19273 -17805 -6272 14355 2584 -8019 -12952 26284 -10564 -3786 -9397
716 -9397 24748 -11275 -10402 5697 11366 -4027 -19687 21175 -1406 -1085 -19106 24529 -3241
729 -3241 -9145 -5399 14996 3352 -21510 11430 3986 6393 -25174 18266 2708 -2083 -14811
742 -14811 12278 10123 -16858 1140 3567 14765 -24896 9449 3675 7423 -19171 5940 12917
755 12917 -8268 -5965 -922 20403 -19808 2020 290 16013 -18686 -738 11321 1344 -8970
768 -8970 -7282 22213 -12024 -2342 -6338 21931 -14261 -5615 5272 9934 -7232 -13481 19023
781 19023 -3381 -1842 -14609 23030 -7220 -6018 -3991 14537 -1578 -16074 11158 2685 3405
794C405k3958L9173j9775j97j1294K6456r391j7979J5664K205N683l1823L3328
807A1497r951M170k3616K7497j466j5685K164P768J3077l4489K3254l456J2358
820A3122l2356K2999M792q032j0350P434K0680l0935J1377k511K2997l5361J4573
833a571O068M342j8448J495K4591k0906K061q439L1964l1023O527J35J7314j9474
847e364o014K1567q062j269j7459L4928k2093K921j0268K6145j5073j0662J2959
860B256L119N68k5041L1701j2344L939k1073K9287q088j1041J471J0472N963k9023
874a7834K3349m212R386k9894K6319r68n948j0579J1843J3180k7042J1838j319
887a881J8517l3509J8269K092M574j9147P108J7785j8501J844n001K6937l0345
$$ plain form
794 3405 -20553 18620 -1155 -1352 -12646 13810 4419 -13560 2104 4309 9992 -21831 11497
807 11497 1546 5716 -17900 9597 8131 -7554 -5390 2378 15455 -19034 4220 764 13122
820 13122 -19234 3765 8557 525 -9825 -2391 18289 -12646 -1269 -3780 19217 -16144 -1571
833 -1571 4497 8839 -9609 -8114 16477 -4429 -2368 -10807 21157 -9866 -3339 -3204 14110 -5364
847 -5364 -11378 10189 2127 858 -16601 18327 -3766 -845 -11113 15032 -41 -10703 2256
860 2256 5375 5943 -19098 12603 259 4198 -16875 12412 4324 -6717 -5246 5226 11189 -17834
874 -17834 5515 1303 10689 -19205 7114 6146 198 -10381 1462 14642 -12400 -562 -1881
887 -1881 16636 -16873 1396 3488 8062 -11085 -3977 13808 -4693 -2849 -7850 19087 -11258
900a1258R830j379J6447k1598K49J6668o859l381j2029L0854k2781M558r147K5546
914A5720j9045n047J0482M301l816j9113K9442j3321L263j8556K9908j2843p106
927e731N37J2508K74k3713K2219m465P003k7107K7701n266l642j0924J4753P144
941A1291k2691J1143l37J4868l0914J9972r56N212j9483J0957J2217j5568R18
954c371k138K2586k8761J1474k282J5671k2858M771J2643n331n459p477K7007
967A6475k2368N089p783K4505k1531q29Q259N397p285j3924K6528j3236K453j6077
981a4327K9225j5709l831n57J3753l915j8689K0030m190N143k4108K7315p971
994B169j467j1222J6339K622j8373R615O72J1809k7904K0186k914N669j9367J3419
$$ plain form
900 -11258 -1428 -2807 13640 -7958 -7709 8959 2100 -1281 -13310 17544 -5237 -679 -9826 15720
914 15720 -3325 -8372 2110 6411 2595 -16518 12924 -397 2866 -15690 14218 1375 -5731
927 -5731 -5194 7314 7588 -16125 6094 1629 8632 -18475 9226 3960 318 -10606 4147 11291
941 11291 -11400 -257 -594 14274 -16640 3332 2376 7588 -11895 -938 11279 -4289 -3371
954 -3371 -5509 17077 -11684 -210 -2492 13179 -9679 -4908 7735 2404 -3055 -10532 16475
967 16475 -5893 -804 -8587 15918 -5613 -6442 1817 7214 -71 -13995 12533 -703 1750 -14327
981 -14327 14898 -811 -4642 -5199 8554 4639 -14050 5980 1790 6933 -17175 10140 2169
994 2169 702 -10520 5819 8441 -9932 -317 355 12164 -15740 4446 1532 7201 -12166 1253
1008A253P816j2706k62M02J8569k6601J1954k447J4501k3260Q074R315l950p167
1022d509l473K3033k1144N060o243K2735k2585K355O219O146r724r332K3028j2384
1036h18J715j3594K7341j6955j158j707J4325o795j4109J7124l403L568k1022
1049a5488K5733r357K60j1390J7094p36j4453P698J856R011k4799J9456l837N665
1063F713j8897J5034M402j0286j392K668J4894k4208J1744k094J2982k2839J0213
1076a066O686k805q324k74J9197j9323M697m820K0488k2235M394M398O575j0958
1090c370n787J9348j0881J035j1396K4755j6794O67k667J4254q401j0382J4118
1103D499k346K129j7983K3497r711J254j1117J7209l240j1167N999L003O307k1601
$$ plain form
1008 1253 9069 -3637 -3899 -3497 15072 -11529 425 -2022 12479 -10781 -2707 6608 2658 -4509
1022 -4509 -7982 15051 -6093 -1033 -7276 15459 -7126 -4771 1448 7594 -2130 -11462 11566 -818
1036 -818 897 -12697 14644 -2311 -3469 -5176 9149 2354 -11755 5369 1966 5534 -15488
1049 -15488 10245 888 1148 -10242 6852 6116 -8337 -639 1217 10228 -14571 4885 1048 6713
1063 6713 -12184 2850 7252 -3034 -4426 -1758 13136 -11072 672 -1422 11560 -11279 -1066
1076 -1066 5620 2815 -5509 -5783 13414 -5909 -1212 -6032 14456 -7779 -3385 1013 7588 -3370
1090 -3370 -9157 10191 -690 345 -11051 13704 -3090 -2423 -5090 9164 763 -9619 4499
1103 4499 2153 4282 -13701 9796 85 1339 -9778 7431 4191 -6976 -977 2026 8333 -13268
1117a3268J8267m119N061j7800J5963J585q271k161M607J1227k1425J1209j673
1130g98J1137k1558J1540M314j841q824K247J5305j6999M230l578J7837k0914
1143g902N769K686O738j1477k813J5625r107K73r108K1741j5981J914l217J3812
1157H953r584p047J1377j283N16j4788K1103r662J576j0211J6961n407q326M678
1171a144M056L441j8203J6939m229M093j6161J6313q42o472k616O073P760j8414
1185i406J0416j288R213j9692J2153K231r31q896M064J1709j4449L574k466J5180
1199A1412j9083O532J316O651j1517m49J2306p423m80o918J8769j4894K629l204
1213d353J3009j0477m183R161m87j124j1521J8694r492J541q836J6285p266n822
$$ plain form
1117 -13268 4999 880 5941 -11859 4104 5689 -2582 -4743 -136 11091 -10334 875 -798
1130 -798 10339 -11219 321 4635 2794 -6030 -3783 11522 -5477 -1247 -4825 13012 -7902
1143 -7902 -2133 553 7291 -4186 -6999 8626 -481 -208 -9316 12425 -3556 -1642 -4859 8953
1157 8953 -631 -7678 3699 2416 2932 -11856 9247 -415 1161 -9050 7911 2504 -5822 -1144
1171 -1144 2912 6353 -11850 5089 860 4953 -11208 5105 4263 -2209 -4825 1248 9008 -9406
1185 -9406 1010 -278 8935 -10757 1396 3627 2696 -6200 -2136 9573 -4876 -1302 -3768 11412
1199 11412 -7671 -1139 177 6828 -4689 -5138 7168 -255 -735 -7653 11116 -3778 -1149 -4353
1213 -4353 8656 -1821 -6004 3157 2670 1546 -9975 8719 -773 768 -8068 8217 951 -4871
1227d871L741M746P47j4712J5425m273L091j4182J6084k948m696k834O993M634
1241F945j5232R420j035P404j7487J2244L61n5q676N398Q403j1920K945j456J2577
1256I836j7155P007K97O309j1407J715R351o070j196m598J5816j3925L172k767
1270c615J1815j1169j526P333r9k622q207J6260r361J470p205J5148q709l456
1284c943K979M989j486j1285J3691m294K286j2088J5330m598l000k982P488J993
1298E080j2172Q295q17N804j5289J2009j124O22q368O496N478r724K434m52J0080
1313H352j5424P478m04N644j1213L764O802n202j712k271J2964j3176L767k107
1327b738J0399j1724R48N757L4l835n087J3860r233J495n603J3821r843j261K219
$$ plain form
1227 -4871 -1130 3616 4363 -10349 5076 803 3894 -10288 5796 2848 -1848 -4682 2311 6945
1241 6945 -8287 1133 98 7502 -9985 2259 2620 2565 -6111 -713 7690 -4230 -1285 -2741 9836
1256 9836 -7319 -312 -15 6294 -5113 -3398 5953 -117 -1313 -5911 9905 -4020 -848 -3615
1270 -3615 8200 -2969 -4495 2838 2739 117 -8090 8170 -1191 279 -6926 8222 -487 -3943
1284 -3943 -964 4025 2539 -8746 4945 651 2937 -9151 6179 1581 -1419 -4401 3087 5080
1298 5080 -7092 1203 386 6190 -9099 2910 1786 2408 -5960 536 6014 -3710 -1276 -1728 8352
1313 8352 -7072 406 2 5646 -5567 -1803 4999 -203 -1915 -4186 8778 -4398 -631 -2738
1327 -2738 7661 -4063 -3115 2642 2676 -1159 -6246 7614 -1619 -124 -5727 8094 -1749 -3010 -791
1342g91N073l331q108J1907m266J589j0096J4442n993j451l114P894l99r364P238
1357A230n34M198j3257J1907k451J002p996P719K701p949K112P09P526j3937Q138
1372A118r41M736j0991N863M414m634k021k1J0193j2501M449j511Q904j2048L233
1387a758M223O4m683k394J1546q984J620m287J2466j0577O42J401N105m768n358
1402e742J0182m093R76q363J3563p047j96l191Q298k563o955O397j77K570j1393
1417g734J1909l616J127p538Q933J08o456J990J810N030j2561Q871j475L786j0670
1432f486P776K163m091k220J903P650j1770N046j111P591j2166N151K726K21n372
1447b989j09R420q543J645l226J1286j1040K181O80N229o028l028Q693l832K80
$$ plain form
1342 -791 4282 951 -7157 4750 484 2073 -8023 6419 426 -1025 -4139 3755 3356 -6008 1230
1357 1230 696 4894 -8363 3544 1093 2095 -5901 1818 4519 -3430 -1318 -609 6917 -7020 1118
1372 1118 177 4913 -6078 -215 4199 -435 -2456 -2477 7716 -4785 -336 -1847 7057 -4991 -1758
1387 -1758 2465 2529 -2154 -4548 6998 -1986 -366 -4653 7813 -2764 -2122 -721 4384 -384 -5742
1402 -5742 4440 347 1323 -7040 6523 -524 -720 -3911 4387 1824 -5131 1266 1089 3659 -7734
1417 -7734 4175 559 1686 -5852 3081 3189 -3267 -1277 533 5563 -6998 1873 398 4184 -6486
1432 -6486 1290 3453 -638 -2858 -955 6695 -5075 -29 -1140 6451 -5715 -564 2162 2383 -2989
1447 -2989 -3098 6322 -2221 -576 -3802 7484 -3556 -1375 -695 4534 -1494 -4522 4171 339 619
1462F19o771J2838p970P32l134Q715m561m891N807J59R31r648J1967m648J087
1477A232o982R986k254n105J901K737K795j1224R374j948L031j0286R223J95l423
1492g48k398L351N499j0861N366r03O625j2098O549J401N77n947J674P581p935
1507b267J528k346J0294j1356L365J28N365p212r45P404l584n11n160J2131q814
1522a980J472k869Q990o473k894N253M64p18p802J1856n591J091o386J0795m433
1537G75l653J680L526P87r739R520k377K492r859J0289j541k532k758M576L610
1552D796r796N371p08N856j1941P579K55J021o543L218N940p298J287j444R316
1567F909j1577M382l10N400q239R48O233l384j222l551J1269r467K130k527R017
$$ plain form
1462 619 -6152 6686 -1284 -552 -3686 5029 468 -4423 1384 1543 2474 -7174 4793 145 1232
1477 1232 -5750 4236 1982 -3123 -1222 1515 4310 -6914 2460 512 3543 -6743 2480 2675 -748
1492 -748 -3146 205 5704 -5157 209 -694 5931 -6167 382 1783 2360 -3587 -1913 5668 -2267
1507 -2267 -739 -3085 7209 -4147 -782 -654 4711 -2501 -3446 3958 374 -137 -5297 6834 -1980
1522 -1980 -508 -3377 5613 -860 -3754 1499 1963 1245 -6557 5299 -292 799 -5587 5208 775
1537 775 -2878 -1198 2328 3115 -6624 2896 519 3011 -6848 3441 1900 -632 -3390 1186 4796
1552 4796 -5000 371 -337 5519 -6422 1157 1412 2433 -4110 -892 5048 -2250 -963 -2407 6909
1567 6909 -4668 -286 -596 4804 -3435 -2487 3746 362 -860 -4411 6858 -2609 -479 -3006 6011
1582F011q035j048M632O86k019o070J1405o209J151n813J1147o028k274J225M159
1597B920p69q271R189k588K190r423J0808k880j550l229N510K021q604N062m50
1612f4N117j1595Q279p08J400o971M563M358o610J063n25Q162j1528N231o20N158
1628D710q898K709M953l164j742k043J0145r746K703k214Q705r035O28L764R35
1643B410l018m398J0482o395J268n322J1068p081r55N76M655k014o727Q439k546
1658D42J864q829J0951l882o77l626O277N18p327M677j32M196j0911Q745j553
1673G33J569p099N783K680n857R32L52O742j1112N939r29M706r154M235L551k851
1689B20k096o24Q679r549L157j984Q137r506K056K753J222l713k848R198o174
$$ plain form
1582 6011 -2024 -3072 1560 2246 227 -5843 5562 -647 504 -5309 5838 -190 -2464 -1239 2920
1597 2920 2151 -6120 3069 481 2671 -6752 4056 1176 -374 -3603 1907 3928 -4676 386 -64
1612 -64 5053 -6542 1737 1029 2429 -4542 21 4379 -2231 -1168 -1693 6469 -5059 172 -448 4710
1628 4710 -4188 -1479 3474 310 -1432 -3475 6670 -3076 -373 -2587 6118 -2917 -2289 1475 2410
1643 2410 -608 -5006 5476 -919 349 -4973 6095 -986 -1941 -1365 3290 1276 -5451 2988 442
1658 442 2306 -6523 4428 546 -131 -3757 2520 3038 -4289 388 256 4452 -6459 2286 733
1673 733 2302 -4797 986 3666 -2191 -1259 -907 5835 -5277 662 -267 4439 -4715 -480 3071 220
1689 220 -1876 -2500 6179 -3370 -213 -2197 5940 -3566 -1510 1243 2465 -1248 -4096 5102 -1072
1704a072J279m730J0575p674K31p5N006l115n082P458k339J374p882J0730m744
1719f0J16l781O868j119n814M234K11K957r790R023k421J585o867O823P80m865
1735b120Q32J194M990j0174O395j278M129q969N482K008k328k334O27O958q835
1750c423L394j786P354r472L191J676J531m221j373P707n682J183m010R751p918
1765b098J222n75N136m064l368O373k126P54o585J0122n408P04l543P060k662
1780I42m197L811M29J607q270Q904l116J469o256P413r39l756P26J837L262q867
1796e001O481j559L517q441O294N80j701k487J667N199p831L362j480O415r122
1811d107M052P32J739m638J12O066n064R17l001Q644q018K097q10M980m999j495
$$ plain form
1704 -1072 207 -4523 6052 -1622 -1391 -1466 3540 425 -4657 2801 462 1836 -6046 4684 -60
1719 -60 56 -3725 3143 2024 -3790 444 655 3612 -6178 2845 424 2009 -4858 1965 2745 -2120
1735 -2120 -1288 -94 4896 -5278 1117 -161 3968 -5001 481 2489 161 -2173 -1546 5412 -3423
1750 -3423 -29 -1815 5539 -3933 -742 934 2465 -1756 -3129 4578 -1104 79 -3931 5820 -2098
1765 -2098 -876 -1451 3685 -379 -3747 2626 500 1254 -5331 4791 -617 87 -3456 3604 942
1780 942 -3255 556 985 2592 -5678 3226 110 1579 -4677 2736 1797 -1959 -1233 604 3866 -5001
1796 -5001 1480 -79 3438 -5003 1291 1871 170 -2317 -650 4549 -3282 80 -1400 5015 -4107
1811 -4107 -55 677 2416 -2222 -2110 3956 -1108 -191 -3192 5452 -2566 -469 -1279 3701 -1298 -2793
1827b793N231j951k8m870R200n999J234l059P019m190k425L281O63K01o438Q436
1843C512l714J368n486P676k507k502M73K401J588p346O213j668K886p740O773
1858A927o66j041k700K622L516o726L166j023N321q617M732j3J778m963J586M488
1874C387m528O34j785P279p985K869q30M586n770L20M115j834p49l092Q059o338
1890a662J620k443O658n343q02K683Q66j043m643P657l944J186m727P678l691
1905E0j388J35K945J06n864N712j561K193o975P049j634n29k868L558J883n661
1921b849K930m51M124q045N323n82J566n095K988K935m066M40n41N760p760L517
1937A94p48L951o234J946L008j694j372j454O791o356J851j878O185o122N41K026
$$ plain form
1827 -2793 2438 487 459 -4411 4789 -1210 24 -3035 3984 -206 -2631 650 1313 1514 -4924 3512
1843 3512 -202 1166 -4320 3356 849 -1653 -1180 1221 2809 -4537 1676 8 2894 -4846 1927
1858 1927 1261 220 -2480 142 3658 -3068 98 -925 4396 -4221 511 498 2276 -2687 -1101 3387
1874 3387 -1141 -507 -2292 4987 -2998 -129 -959 3627 -2143 -1823 2292 458 -291 -3383 4676 -1662
1890 -1662 -42 -2485 4173 -1170 -1972 711 1577 534 -4109 3548 -396 790 -3937 3741 50
1905 50 -1338 -1203 1742 1848 -4016 1696 135 2328 -4647 2402 768 239 -2629 929 2812 -2849
1921 -2849 81 -370 3754 -4291 1032 450 2016 -3079 -91 2844 -1222 -782 -1323 4437 -3323 194
1937 194 -554 3397 -2837 -891 2117 423 -949 -2403 4388 -1968 -117 -1995 4190 -1932 -1391 635
1953F35J146k082l044O750l883R08l996P516m504n07k13L491j225m491N160j295
1969C66J408o164P209k425k03k904M399L24m668K703J61K823p319N798j081J271
1985A698n066M173J510l613K73N30M325p363L963o81L358o419L134K036j467j852
2001a461j46N610o104J907j426N730o504J457J459J447k881j770N868l589N36
2016A33l318P235n004J19m53L903k336l307M634j024O14n290P185l024mk767M986
2033B282j012l753K556O27J625o500O021j463R87m860M958L27l104J45J315L094
2049C245o757M086o17K888o375L882J237j117k229P74M597n629J753j058N292
2064C972o580K011R91J724l471p94N060l224J47k651O837n294N84n63M077l188
$$ plain form
1953 635 1781 -301 -3345 3405 -478 430 -3566 3950 -554 -1061 -1274 2217 992 -3499 1661 366
1969 366 1774 -4390 2819 394 191 -2713 1686 2010 -2658 45 206 3029 -4290 1508 427 1698
1985 1698 -3368 805 2315 -1298 -1025 -495 3830 -3533 430 -251 3107 -3312 -178 1858 391 -1461
2001 -1461 -1607 4003 -2101 -194 -1620 4110 -2394 -937 522 1969 -912 -2682 3186 -403 133
2016 133 -3185 4050 -954 -835 -1288 2615 279 -3028 1606 582 1196 -4094 3091 67 63 -2704 2282
2033 2282 1270 -2483 73 700 2325 -4175 1846 383 1370 -3490 1468 1795 -1309 -1164 151 3245
2049 3245 -3512 574 -43 2845 -3530 352 1589 472 -1757 -983 3614 -2015 -262 -1320 3972
2064 3972 -2608 -597 394 2118 -1353 -2147 2913 -311 -164 -2815 4022 -1272 -688 -1251 2826 -362
2080c62k221M127q38o5m350O949l463J86k531N264k098k817K306R34O60n576N958
2097B063j743Q06m554N365o14k483o9J820K153o054L953n74K564o178M236O02
2113A293p13k555J437L733n056J510p29M812o469K397O12J874l878J00M247k906
2129b91j16j951O234n397R99o02M026l802j151L523p12n48l393O438l746M43k305
2146b351N246k831j919J942J111rm691N587j896Q13m275N401j231j818l92K134
2162H21J456n284L602n21K339n868M327J17l27k711J855K928m433J315m68M268
2178C416o164K698K44J870l975Q37L388k622k11j338N431n303J435o56L740m078
2194a288k04K812o10q27k536N735l794P17k150N016l249j084J443J266m59l835
$$ plain form
2080 -362 -2583 1544 706 641 -3709 3240 -223 -37 -2568 2696 598 -2219 87 1021 1681 -3895 2063
2097 2063 320 1126 -3428 1937 1323 -1160 -1229 591 2744 -3310 643 69 2633 -3545 691 1293
2113 1293 580 -1975 -538 3195 -1861 -351 -1080 3732 -2737 -340 272 2146 -1732 -1632 2615 -291
2129 -291 -407 -2358 3876 -1521 -522 -1124 2902 -900 -2051 1472 760 212 -3181 3257 -489 -46 -2351
2146 -2351 2895 64 -1855 87 1198 1189 -3502 2085 189 1002 -3273 2128 897 -921 -1313 821
2162 821 2277 -3007 595 74 2413 -3455 872 989 662 -2049 -194 2734 -1699 -384 -852 3416
2178 3416 -2748 -50 194 2064 -1911 -1074 2314 -308 -519 -1857 3574 -1729 -294 -950 2790 -1288
2194 -1288 -1492 1320 710 -117 -2653 3082 -712 5 -2145 2871 -378 -1462 -19 1247 788 -3047
2210c047N003j885Q68m022N271j673j152p14K334Q39m457L211n03K099n436M356
2226A092l92J1k748K221K065l784J231k77L562n686L012k04J750l876J504K418
2242A899k296j59q15M521n019J844q12L393m130O25K032m40r69j801M905l631
2258h53R63k054M713l468k96Q52J411q19l014M360j827Q91l688N063k080n19r71
2275a336K485J86l579K867n47J756m835M358j005L07k606K536J069l080J249j77
2291c52K801n082L299p06J616l630K103J387j866j15l72L599m587K156j010L106
2307B347m083J307J229j64j123j134M069l370J136j959M398l641M08L03J594j228
2323H9k142L672j742Q50l243M785k546J24j114K585n81k600K528o07J343m114
$$ plain form
2210 -3047 1956 71 939 -3083 2188 515 -637 -1351 983 1822 -2635 576 73 2172 -3264 1092
2226 1092 700 711 -2037 184 2249 -1535 -304 -581 2981 -2705 307 103 1853 -2023 -519 1899
2242 1899 -397 -556 -1371 3150 -1869 -25 -837 2556 -1574 -949 1083 643 -326 -2127 2778 -853
2258 -853 110 -1944 2769 -699 -995 -143 1268 449 -2565 1795 -32 859 -2829 2234 154 -365 -1336
2275 -1336 1149 1335 -2244 623 76 1832 -3003 1355 350 657 -1949 587 1656 -1424 -175 -352
2291 -352 2449 -2633 666 -40 1576 -2054 49 1436 -430 -545 -917 2682 -1905 251 -759 2347
2307 2347 -1736 -429 800 636 -487 -1621 2448 -922 214 -1745 2653 -988 -580 -277 1317 89
2323 89 -2053 1619 -123 727 -2516 2269 -277 -153 -1267 1318 737 -1863 665 58 1401 -2713
2339b713M313j659O41k400K791L5k253J215r3K045m398L499j221J580l404K563
2355E41M49j373j42k5K789m103K318j186K887m024J885N06J18j304n19L293l078
2372i68J220j799M056l779J063j50J687j644j220K993j691P72k693M435k983P65
2388F4j204K624j363j537K164o89R26l323M177k245R65k214K987r01j437J066
2404F0J5J361l712L506j589J586l259K958l79q32l20L97K017l611K363j230K651
2421A982l981K391j28M14j558J78K509k806J231j498L637l922J713n35J727k073
2437g19k49K309j671O72k071M025l393J367j279K616k046n03J676o64N17k569
2453a982L929k683J292k152L188j694o33P46K50P40l066L408j804J590l185L300
$$ plain form
2339 -2713 1600 -59 582 -1818 973 1008 -1245 -30 -123 1922 -2476 1023 -198 1382 -2022 541
2355 541 990 -383 -525 -550 2239 -1864 454 -732 2155 -1869 16 522 640 -664 -1183 2110 -968
2372 -968 252 -1547 2509 -1270 -207 -357 1330 -314 -1534 1459 -232 540 -2153 2282 -701 64
2388 64 -1140 1484 121 -1416 748 59 985 -2338 1839 -406 559 -1655 1332 431 -1006 60
2404 60 75 1436 -2276 1230 -359 1227 -2032 926 547 -285 -605 -208 1809 -1802 561 -669 1982
2421 1982 -1999 392 264 678 -880 -702 1807 -999 232 -1266 2371 -1551 162 -373 1354 -719
2437 -719 -968 1341 -330 342 -1729 2296 -1097 270 -1009 1607 -439 -942 734 70 587 -1982
2453 -1982 1947 -736 556 -1596 1592 -102 -735 11 261 1001 -2065 1343 -461 1129 -2056 1244
2469A244j057l20n81Q51J315l147K325j189K377l909K866p04O47j796Q76J682
2485A480k490J239j179L129l972K300r05J726k416O70J546j524N22j430L483l581
2501a402J848j372K608k606L96J149m81J03j892L577k824J461k111L336k274K9
2517d55L61O12J49k480L174j816J509l098L562j624J27q52J312N73k603K212j104
2534d41K042l755L230j217Q29j933J491Q59k102J211q91K582l846K731j230J687
2550A247k610J413Q20j255L39r05K942l518K114j477K619k955J072O08j67l10
2566b3j293L143k741J493k060L414k715N92p9R96m15j857K823j726J362k908L679
2583A685k092N37j060J692j31j992K019r95J652l406L413j668J001j975J955P0
$$ plain form
2469 1244 187 -133 -714 137 1452 -1695 630 -559 1818 -2091 775 71 718 -1078 -202 1480
2485 1480 -1010 229 -950 2179 -1793 507 -398 1328 -1088 -418 1128 -396 126 -1304 2179 -1402
2501 -1402 446 -926 1682 -924 -528 621 140 243 -1649 1928 -896 565 -1546 1790 -484 -455
2517 -455 -94 518 667 -1813 1361 -455 1054 -2044 1518 -106 21 -831 481 1054 -1549 663 -441
2534 -441 1601 -2154 1076 -141 688 -1245 246 1105 -997 214 -677 1905 -1941 790 -440 1247
2550 1247 -1363 50 870 -385 -46 -951 1991 -1527 587 -890 1729 -1226 -154 454 287 -23
2566 -23 -1316 1827 -914 579 -1481 1933 -782 -190 -269 727 312 -1545 1278 -448 914 -1994 1685
2583 1685 -407 130 -930 762 631 -1361 658 -337 1315 -2091 1322 -346 655 -1320 635 705
2599G05j597J089o06K005l504K905j487J697k709J959J35q66J05m62K396l279
2615a514K166j493K575l153J559J01J96p15p43K649k522J412j938L378k963J020
2631A5m04J274r17j204K399j565J142k553L599k452R26j188J916p68j290J728
2647F58q71J246k923L374k000J172j965K225n81j047Q62l60J513l086K867j628
2663e44J692k708K232l44m72j83p2J893k898K013j431K491l174J836k88N15j063
2680e05k17K122k199J228j675L122l028J389o68J424j320n17J872j393R29k073
2696a509L262k612J236j244J978j275n90J322p17Q79k354L099k140J293j883K330
2712A075j082n00N57p1J008k579K640j589J613k612K386p44q1m83L38J325k439
$$ plain form
2599 705 -892 197 -409 1596 -1908 997 -490 1207 -1502 457 592 -274 -169 -631 1765 -1514
2615 -1514 652 -841 1734 -1419 140 241 437 -278 -1021 1628 -894 518 -1420 1958 -1005 15
2631 15 -389 885 -32 -1236 1163 -402 740 -1813 1786 -666 260 -928 988 220 -1070 658
2647 658 -213 1033 -1890 1484 -516 656 -1309 916 335 -712 150 -210 1303 -1783 1084 -544
2663 -544 1148 -1560 672 328 -144 -327 -399 1494 -1404 609 -822 1669 -1505 331 43 558 -505
2680 -505 -722 1400 -799 429 -1246 1876 -1152 237 -431 993 -327 -844 1028 -365 564 -1509
2696 -1509 1753 -859 377 -867 1111 -164 -754 568 -149 730 -1624 1475 -665 628 -1255 1075
2712 1075 -7 -507 50 -21 987 -1592 1048 -541 1072 -1540 846 102 21 -462 -124 1201 -1238
2729a238J806j248K216l057K081o44P12j277L11J463j851J070j290K632k956J701
2745D31q72J406j592J99J244j181O86j489K763k613J467j251J931j623O2Q84m94
2762d2M79j758K716k105J295j762K342j424m0K49K22N14k020K300j438J420k413
2779a465K443j046J79o65P06P30j956J600j022J775k765K212r15P52j348Q18P55
2796G88j470R25r04K043k715J923j014J307j712P97O24r00M52r28K186k457J546
2813D91j160J806j864N92M72k42O3j156K267j945J174j562K316j707L33j4N01
2830C65pj452J975j275J124k084K444j361L88p12J006Q4j426J409q01J260k341
2847a404K288j157P35j310J234Q9j080Q04n21J402k349J987j064J143j757J257
$$ plain form
2729 -1238 568 -680 1536 -1521 560 -84 628 -649 -338 1125 -726 344 -946 1686 -1270 431
2745 431 -441 965 -627 -428 816 -365 321 -1168 1595 -1018 449 -802 1129 -494 -432 452 -42
2762 -42 437 -1321 1395 -710 585 -1177 1165 -259 -299 -50 172 686 -1334 966 -472 948 -1465
2779 -1465 978 -68 111 -554 152 882 -1074 526 -496 1279 -1486 726 -189 563 -785 33 788
2796 788 -682 243 -661 1382 -1333 590 -424 883 -829 -32 592 -308 144 -784 1402 -1055 491
2813 491 -669 1137 -727 -135 337 95 158 -998 1269 -676 498 -1064 1252 -455 -122 -136 365
2830 365 358 -1094 881 -394 730 -1354 1090 -271 117 -595 411 495 -931 478 -323 937 -1404
2847 -1404 884 -273 462 -848 386 475 -605 199 -322 1080 -1269 718 -346 797 -960 297
2863B97J26o43J64l88J630k221J493j020J682k028R80J36Rl57n71J825j740R65
2881C39j252K169j912O27j63P27n37q47J664j111P60j646K375j618N30o49J201
2898F57n32q78J251o20P40j867K267j334O79j210J526m76p27O32j48Q36k024J961
2916G33j019R68j774J612k77l98j33J34J136j974J361p88J492k147J298r7K01
2933C28p51QJ425j583P54q97K000k115R00k45Q65j020k54J373j005M36j185K231
2951A265j848O85n99J345j044m04J047m23L01j448K209j455O28j144J759r04m36
2968d66M55J99L74j735J894r13Q10j796J868n35k10m06N78P36j790J219n18J283
2986A047k232J556k62L19j079N19J029j428N66n37J766k239J127k94R01j373K80
$$ plain form
2863 297 423 -220 -56 -444 1186 -1035 458 -562 1120 -908 72 208 217 -140 -711 1114 -626 339
2881 339 -913 1256 -656 -29 -192 535 -2 -849 815 -296 464 -1182 1193 -425 105 -544 657
2898 657 125 -753 498 -122 618 -1249 1018 -316 363 -847 679 203 -524 108 -40 796 -1228 733
2916 733 -286 682 -1092 520 243 -155 -288 -154 982 -992 369 -419 1073 -1074 224 127 328
2933 328 -423 -415 1010 -573 181 -716 1284 -831 69 -176 689 -331 -585 788 -217 219 -966 1265
2951 1265 -583 102 -497 848 -196 -600 447 24 325 -1123 1086 -369 259 -885 874 -30 -466
2968 -466 -11 188 562 -1173 721 -192 618 -1178 690 155 -55 -461 117 853 -937 282 -236 1047
2986 1047 -1185 371 109 428 -651 -132 897 -531 35 -502 1264 -975 152 -142 759 -614 -334
3003c34J048q88J64p59K026j971P97n61J443j432J0Q49k32p5j089K094j446N60
3021B04j094J937j196k19K64N07Oj495J760p64O57j811K065p20j11o14R53L58
3039F87j584J086l11J070k236J762l99L55j275R40O56j271M31k29J487k246J316
3056B39l81R34j603O77P50p29m8m31J829j973Q30n56J551j688K96O35j5l59q65
3075i07J996j377M57j090K072j398o4Q4P90l00j316J668o30N05j776K182q89%
3093Gp25J232Nj361J000j51Q28k142J892n56M06j380J267K83j078L37j6J230k181
3112a103J407m31R65j779R97M85n59k64j71J643j916Q17n65J637j890M97M35K25
3130D30o12o63J848j271L72j067K168j563J04n8J006n81j077J555n42L69j665
$$ plain form
3003 -334 714 -174 -10 -769 1257 -714 83 -478 965 -467 -457 392 160 85 -1004 1090 -356 204
3021 204 -890 1047 -149 -368 -104 403 409 -1086 674 -90 567 -1244 821 101 -10 -624 329 687
3039 687 -897 189 -122 948 -1288 474 75 430 -845 95 751 -520 -89 -318 1169 -1077 239
3056 239 -142 792 -811 -134 616 -113 -161 -592 1237 -736 94 -462 1089 -599 -303 332 317 -42 -907
3075 -907 1089 -288 169 -921 1151 -247 -311 -227 563 263 -1053 615 -15 490 -1286 896 7 7
3093 7 -718 514 519 -842 158 7 835 -1307 585 29 435 -945 322 605 -473 -136 -152 1078 -1103
3112 -1103 304 -127 838 -941 56 541 -18 -282 -453 1190 -726 91 -474 1163 -727 -230 205 430
3130 430 -182 -845 1003 -268 104 -963 1205 -358 -254 -312 694 113 -964 591 49 418 -1247
3147a247K242j054J15p97J405k96j131R25p9O52j988J932p15M76j414J437j3q56
3165d06K05J37J039k068J423m91J021j895J175K66l53m59K6J485j818P67n55J692
3183A191j998O50K88M20q66m11J684j185L19j014K184j682K59j69J109q01p97
3200h19J383n04K87j508K192j225K71q26J483n53q30P80j9M88j805J916q24N54
3218D41j462J569k36o27M9K83Q53j911J358m84J055j975J317Q3j39o58K12J310
3236A038j670O92n30J691k065P97R4N71j027j66J466j103K77r02K077j776M88
3253d8l22J166r84m80J182m91K30j322K104j333M30q68J524p55n68O22O6L74j646
3272a119J843q66O06j489J663m16m31j17M44O84j764J276m73J053k005J451j15
$$ plain form
3147 -1247 995 -59 56 -741 664 368 -763 162 83 735 -1253 679 -36 440 -974 463 450 -406
3165 -406 -201 -64 975 -1093 330 -161 860 -1035 140 406 53 -406 -380 1105 -713 54 -501 1191
3183 1191 -807 -157 131 551 -315 -726 958 -227 92 -922 1262 -420 -161 -330 779 -22 -819
3200 -819 564 60 347 -1161 1031 -194 77 -749 734 181 -649 131 112 600 -1205 711 -113 441
3218 441 -1021 548 312 -315 -266 17 870 -1041 317 -167 888 -1087 230 313 174 -484 -272 1038
3236 1038 -632 60 -470 1221 -844 -47 47 618 -409 -575 891 -212 65 -837 1240 -536 -48
3253 -48 -370 796 -188 -668 514 23 253 -1069 1035 -298 132 -736 788 33 -535 87 153 527 -1119
3272 -1119 724 -142 464 -1025 638 222 -209 -326 118 802 -962 314 -159 894 -1111 340 225
3289B25L1q27M27J068j518O31m64J592k083R95j20O70j151J18J151r69K48p68
3307g44J913j794O90m46J180j111j51R12m12J63j136J939j366N72r34J557r12
3324h0l11M35J71K07j445J728q68O37j502J728n90k46k60N97M77j580J193m45
3342a54R86j953J538l12J64r03O19P61j320O08m06J420j988J160l31P25j188L82
3360a92P96q09K36o31J689j757Q56n67J177j215J33O40k86N3r27J760j353O36
3378B39r81J618j082q1K47L20K8j254J615q31N96j476J805p81n5l64P40K15j337
3397h19J118m21Q66j822J600n24L05r32P85M17j052N54l53J211j841J253n15P66
3415E96j212O00M62o12J55m86J449j652R32o52J212j313L58M14j30j02p39J602
$$ plain form
3289 225 256 -571 -144 924 -594 37 -427 1165 -918 77 -43 627 -524 -406 745 -224 24 -744
3307 -744 1169 -625 65 -381 799 -312 -463 449 37 200 -936 1003 -363 209 -725 832 -80
3324 -80 -391 44 215 422 -1023 705 -163 474 -1028 700 110 -136 -396 201 678 -902 291 -154
3342 -154 832 -1121 417 105 269 -634 -15 746 -574 34 -372 1048 -940 220 -111 614 -574 -192
3360 -192 604 -205 31 -600 1089 -668 188 -379 798 -417 -284 356 70 123 -804 956 -397 239
3378 239 -742 876 -206 -287 -40 280 308 -946 669 -162 434 -1042 763 -18 -73 -437 303 518 -819
3397 -819 299 -122 744 -1078 522 -2 303 -629 156 573 -479 75 -278 933 -908 345 -170 596
3415 596 -616 -16 446 -166 -11 -497 952 -700 232 -420 792 -521 -163 251 121 19 -720 882
3433H82j301O36r47J638j222J17J14M37j72j001J464q00N62j386J798r26J15m41
3451d33Q17j7j040R81m26P68j635J582p08M24r25Q61J22p76M70k90R89j642J271
3470C93o37Q08j229P67J94m15L6k95J216j508R10o55J235j409N49K13L9l04m68
3489e60J387j199N69q72J606j332L07l1N47l70p28J258p29M85j205J686j055L01
3507F5m95Q40k24p38Q35m11O40j400J506q26N21r24R45j25n33L59j89P99j453
3526h08J223o53Q06j256R05J0k59j13j00J008j380Q45n91J166j446O86N8J61m54
3545a92k45J153j068N17p56J470j342M55j70O04n08m30J005o64M40j026J516j074
3563c15M52n60Q53l86m46O24l08N15j202J369q27N74r26R83k85l47K24m1O15j281
$$ plain form
3433 882 -419 217 -730 908 -314 -197 -83 354 182 -819 645 -155 407 -979 819 -107 8 -433
3451 -433 384 367 -673 308 -118 650 -985 597 -111 313 -612 249 371 -405 65 -225 764 -878 393
3470 393 -244 564 -665 102 296 -119 -83 -378 838 -670 240 -415 820 -589 -40 173 212 -92 -560
3489 -560 827 -372 197 -675 931 -401 -94 -125 422 52 -676 582 -147 338 -867 819 -236 65
3507 65 -430 410 186 -552 283 -128 512 -888 618 -208 313 -611 334 209 -324 35 -154 645 -808
3526 -808 415 -238 568 -688 217 227 -32 -145 -245 763 -617 228 -363 803 -643 43 101 262 -192
3545 -192 -437 716 -352 165 -591 879 -463 -8 -178 426 -82 -512 493 -171 269 -757 759 -315
3563 -315 137 -423 430 44 -402 222 -86 429 -773 596 -231 343 -583 400 115 -232 -8 -49 566 -715
3583g15J105n98P49j246R72j19j32k48Q1P87j206P42m90J046j399P76p3K54n72
3602b86jQ87r02M33o44J302j280N74k78O18n70j87P34n25L63q65J321j025N20
3621A89n96Q59m84k53M57k07L78j016J215p71N42r08J019l83k10O5J17M25j111
3640f73J003n00O59j196J017k27k4l52K47N79j020O31l99R29j296P95j94L35o03
3659b89J20O32o98L60n45J106j138N93l70O48n99m0M95l70K80p28J153r31N25
3678B04o16Q59n50j02K76n5K45q69J090o98N00q62J006m26j17k8K25K80r22Q52
3698B92m20N80j089R63k85O9l94K97M04p89M93l58Q07j121P52k91L88n79J73M19
3718C11m92K77m75R43r71N62m18O50n88N6L16k12J75o05R88q03M60n71Q42n68
$$ plain form
3583 -715 390 -208 541 -705 267 148 16 -232 -151 636 -570 172 -318 728 -671 105 32 286 -286
3602 -286 -287 600 -302 131 -513 789 -491 83 -195 423 -147 -334 400 -125 238 -627 694 -331 189
3621 189 -407 452 -32 -285 172 -35 343 -673 542 -229 313 -595 424 41 -169 -104 13 438 -673
3640 -673 330 -170 489 -707 310 83 59 -293 -46 533 -487 144 -255 674 -622 173 -21 314 -289
3659 -289 -169 463 -235 125 -420 686 -452 141 -229 419 -180 -220 275 -95 185 -543 610 -321 204
3678 204 -412 447 -103 -205 71 16 261 -608 482 -216 284 -578 428 2 -115 -143 82 362 -560 292
3698 292 -128 452 -637 326 41 110 -284 13 417 -372 121 -237 570 -551 201 -90 298 -281 -108 311
3718 311 -181 96 -379 564 -407 155 -263 387 -201 -145 171 -41 134 -471 517 -286 174 -397 445 -123
3738a23k5J75N7J20p28R58n78M02p91R67m55m1r7K87J60p54P02l57N09r64Q76
3759C00l37J65m06L13K52n76L69l07P02r39O36l18M34n48K04K72l22J78l92P97
3779D77q16M86m04O34n79J13K14q7M7m49Q24o76L75n27Q14n87M7Q4J41jn66P76
3801C40m71L54p01Q56m46N1j69K92R8n69N27k97M81q21P18l16K42m21K85J75l75
3822a67K40k75O10p66N33l26M56n40K21J50j70O3k83O62o78M01l67N95n86J79
3842d8J14Lm8l28O78n76L31m57P17n69J21lJ92n7m17O00l79L35o27P56m35J60
3864F3k50K91N0l87L61k47M50p01O01l42L26m40K86Q2k41J32k07N12o49M60l07
3885a57M34n31K82O0j02%j76N26o02L64l02N35n85K39N3L8j23j75N34m81K81l97
$$ plain form
3738 -123 -148 27 84 204 -524 434 -144 258 -533 434 -21 -62 -159 128 288 -466 236 -121 388 -576 300
3759 300 -37 128 -278 35 287 -289 80 -227 475 -464 172 -146 288 -260 -56 216 -106 72 -320 477
3779 477 -339 147 -257 377 -202 -89 125 38 85 -364 460 -216 159 -368 446 -141 -94 -10 131 130 -436 340
3801 340 -131 223 -478 378 -68 -17 -186 106 204 -365 162 -135 346 -475 243 -73 169 -252 33 208 -167
3822 -167 73 -202 408 -358 175 -151 305 -235 -14 136 -34 29 -254 408 -270 131 -236 359 -227 -48
3842 -48 66 69 21 -307 371 -205 126 -331 386 -183 -62 -65 127 70 -347 253 -126 209 -418 338 -97 63
3864 63 -187 104 154 -233 128 -119 331 -370 231 -111 215 -225 61 143 -98 34 -173 339 -310 150 -157
3885 -157 277 -254 28 88 -14 -14 -190 336 -266 98 -204 331 -254 -15 38 76 -47 -222 312 -169 112 -285
3907b85O52n31J84q7K15j01k79M48l16L17n46O30m05K21k97K96k1k65K52k19L97
3928B60o00N34l42L53m50L20nj63J02j24L93n78M52k98M05n33L65m7m1n1o5M02
3950B89n30L68k99M87n72L16m8P5j32q8L96m10K82l67N64n16K56j86K66j66j51
3971a66L05k40K71m93N74m21K90l47L50j13j37J85j50K97n14N38l70L24m21L97
3991A59j27r3P5n1K62n22N01l25L53n20M54j50k5o1N4K56m92L82k77M45n94M08
4013A12j48J49k14PK89l51K55l43N49n34L22k35L09k56j5K21j91K09m13N86m99
4034a91L37l36M12k65l4J63j11J69m46N96m41L02m21N32l04n6Q6L7J25m94N77
4055B37l58L11n55N95k58J5j07J36J62m45L90k67M27o24N03k33J90k90J40K20
$$ plain form
3907 -285 367 -164 20 -67 148 47 -232 216 -100 217 -329 301 -104 117 -180 116 95 -170 82 -137 260
3928 260 -340 194 -148 205 -245 75 70 -93 9 -115 278 -300 152 -146 259 -274 91 44 3 -48 -113 289
3950 289 -241 127 -172 315 -257 59 11 86 -46 -134 262 -148 134 -233 331 -185 71 -115 151 -15 -166
3971 -166 139 -101 170 -323 251 -170 120 -227 123 10 -127 58 -92 205 -309 229 -141 183 -238 159
3991 159 32 -61 14 -37 225 -297 204 -121 232 -288 166 16 -9 -70 -16 240 -252 130 -147 298 -296 112
4013 112 -36 113 -101 -94 195 -156 99 -244 305 -229 93 -142 167 -89 -104 117 -74 135 -278 308 -191
4034 -191 146 -190 222 -43 -77 86 -25 144 -302 294 -147 155 -266 266 -38 -94 -8 29 154 -340 237
4055 237 -121 190 -365 230 -28 -13 -120 16 178 -267 123 -144 283 -341 162 -71 119 -171 -31 189
4075A89l31K27k71N21o06M10k56L51l76Q6J96j82J15l07O02o00L45l14M88m43
4095a56N0J90o9L0l63O74n39K95m13O52m61K1O5J14J6m60O23l70K93o00P10l39
4117c7O3j75K44R3m59M02k36M29p02N88k70K33l88K49J64l32J79k06N44p23M71
4138A31k48L82n31K35J89k18L6k11O46p13L73k71N74o35J71J84j9j00l04P39n85
4159a75K82m29P56n81Q4J1K25p5m52O30l54K93o50P82m12J11k71L71L2m59L84
4180A03j87M26p98O79k93K52m94L84J24l65J36r3N38q32N51k41M28o68L60J74
4200A84j97p4j01O56p66L68k55O46p62K47J48N4j99k61P37n85K62m82Q56o31J04
4221e1n7L33j60m27O09l11K93p36Q68m29J31l63M92k5m57L59j19M08q63P56l08
$$ plain form
4075 189 -142 85 -186 335 -271 139 -117 234 -142 -56 140 -42 73 -234 368 -232 113 -201 287 -156
4095 -156 -106 84 15 45 -318 356 -183 112 -301 351 -110 -89 -24 90 106 -354 269 -101 192 -408 302 -37
4117 -37 26 -149 95 188 -271 131 -105 324 -378 210 -60 173 -215 34 198 -134 45 -161 383 -340 131
4138 131 -117 265 -266 -31 158 -60 -24 -235 411 -302 71 -200 374 -261 -90 94 75 -25 -329 410 -175
4159 -175 107 -322 434 -147 -63 -52 173 98 -354 276 -78 215 -435 347 -65 46 -225 146 178 -281 103
4180 103 -84 342 -456 223 -70 182 -312 72 196 -169 -33 -126 412 -420 131 -110 318 -350 10 184
4200 184 -13 -87 -188 468 -298 70 -185 461 -301 -54 94 148 -51 -312 425 -160 102 -380 476 -155 -51
4221 -51 -108 225 65 -362 247 -64 229 -507 361 -68 63 -300 192 167 -290 69 -50 358 -505 251 -57
4242e7K86o23N36P3l75J12j6N08q82N89k20M49p88M65J40j71j61l7O58q03L65
4263D8k64P08q24K83R7J34k84k29P22n28K16n07R30o80J39j35M41k12m22N86k42
4284b3K55p55R35m76J52m10N82j03m35L30l0L33q98Q35l22K62o70O30Kl46M9P4
4306b9M67r22O13k17M73q45N17R4j17k30K3O31p44L23k80P68q68L03M0K57l74
4327a17j87O75m54J62m99R42o98J57j87N39l15l59N46j87J78p25R56n01J47m44
4347c71O88k10l87L06QK54q51Q51l38K63o94P04p3k86j6J37M22q70N78k02M83
4368C96q65N64L2j4l12O5N81o75K63k69P73q67L10KL08m36j30O04l81Q9m42R29
4390E25p14J69j97N76m20k49M94j39Q2o37R32n31J62m34P37l20k88K75N9J71p86
$$ plain form
4242 -57 229 -394 142 215 -160 -48 -64 444 -438 151 -69 380 -408 57 197 26 -135 -172 486 -317 48
4263 48 -216 492 -332 -49 48 182 -102 -331 391 -137 79 -428 502 -178 -39 -174 267 55 -367 219 -23
4284 -23 232 -523 412 -64 88 -322 260 157 -278 52 22 355 -543 292 -30 232 -438 192 194 -152 -103 -29
4306 -29 438 -484 129 -88 385 -460 57 151 34 -196 -173 458 -286 37 -243 525 -343 -40 0 257 -117
4327 -117 -304 371 -83 79 -420 522 -176 -19 -206 333 18 -341 205 18 196 -529 427 -74 73 -371
4347 -371 317 107 -280 26 34 288 -563 288 -50 213 -481 223 150 -136 -152 -15 407 -463 115 -87 396
4368 396 -469 95 127 113 -199 -134 447 -228 35 -234 539 -328 -18 -16 292 -144 -274 330 -51 38 -404 525
4390 525 -189 -20 -217 359 -61 -310 184 45 127 -510 422 -109 53 -381 356 36 -252 23 82 253 -533
4411e33Q35l42K53o81P38j48k11o7J99L51q04N27j99N00q86N61JL5l68J22N14
4432C97o21K10k15P33q67L49l5L39n03pN23l54M3l56Q80p32K04j67N54m87j34
4453b46M19j03mn12Q89n43J65m10P39m00k10K25J17Q5o83P64l26K42o89P62j92
4474H9j62j21K60K65p30M87j76M68q76O21p4Q8m29K28M05n56J89j44O54q61M12
4495C7n9L20n42J10M29l47J3k31P75p62K64j70N54n65qL50p7q5l90Q19n58J65
4517D2l77P34m71q9J39J81j8n82O93k91K12o47P79k62r8j59L24J55o29M51j23
4538c6L82q20O57j21Q5m32L25K74n20J93p1N18q31M70q6K92n82K50L13l22k2j12
4560a96O46p38K86j41N07o05Q9K94n2j43k69P28n42J62l32P10n08l9J06K29j08
$$ plain form
4411 -533 302 -40 213 -468 270 122 -89 -156 43 394 -410 117 -82 418 -468 93 94 129 -239 -117 397
4432 397 -224 -14 -229 504 -363 -14 -49 290 -213 -220 303 -51 -8 -364 516 -216 -12 -179 375 -112 -246
4453 -246 173 70 66 -446 443 -100 65 -345 394 -6 -216 9 126 211 -472 292 -34 208 -481 281 89
4474 89 -73 -194 66 331 -399 88 -88 380 -496 125 51 139 -290 -62 343 -213 -24 -168 486 -375 37
4495 37 -22 298 -244 -134 295 -52 -39 -270 505 -257 7 -163 391 -174 -182 168 91 6 -384 435 -123 42
4517 42 -335 399 -72 -161 -22 159 141 -441 252 -39 173 -474 305 43 -55 -214 110 265 -364 87 -36
4538 -36 346 -474 183 62 147 -285 40 314 -206 -13 -84 434 -397 73 -13 279 -303 -53 260 -62 -84 -196
4560 -196 450 -288 -2 -143 364 -241 -152 142 90 -53 -322 406 -136 26 -306 404 -104 -143 -37 192 84
4581H4m61O40k60J54n90P92l37n1j86L98K9n41M40r7K75p58O94j90O6m07M07J31
4603B32m67K05k2M18p90N24j05K23n61L50K08k95j5m0N50p19L25j17M56o24J82
4624h2K16l2j87j73O57n16J31k79O87n54J9Q1K61k05l54N87k66J05n16P80m03
4645d3k0j49M10r8m48M59r8J83o49P18k56M7l73M76J9m15K20L2K95p28N69j36
4667A5K05n59M16J24k69m4L0M84o98L30j16M51o65K47J73mk42r7N94n02J06k34
4689b55O58n90P6P2K69k74k65N65k68N6m13P59m62J9j20M29k11l36M29q9J15n71
4711d07P09l08O4l43N19r6l48J95O1K33o92N71j39J91n67M68N7k35q7J05M10o69
4733c08L11q2M21o65L02J21K2k81k4N30m85J13j71N97o13J38O3K51l33j47N05
$$ plain form
4581 84 -377 263 3 157 -433 359 22 -29 -215 183 212 -329 111 14 289 -469 225 35 101 -306 101 232
4603 232 -235 -30 -52 366 -424 100 -5 218 -343 7 215 -80 -95 -135 415 -304 21 -96 360 -264 -82
4624 -82 134 102 -85 -258 399 -117 14 -265 422 -132 -113 -32 229 24 -330 257 -9 96 -420 360 -43
4645 -43 -63 -212 198 100 -348 111 13 196 -453 265 9 56 -317 159 178 -237 -17 15 310 -418 151 15
4667 15 220 -339 77 201 -68 -112 -82 402 -296 34 -82 369 -296 -49 124 120 -122 -219 375 -127 -21 -255
4689 -255 403 -187 -111 -39 230 -44 -309 256 -12 44 -369 390 -72 -53 -173 256 45 -291 138 49 164 -407
4711 -407 302 -6 58 -285 234 138 -210 -15 46 279 -413 158 19 210 -357 111 168 -67 -154 -49 361 -308
4733 -308 3 -79 342 -323 -21 100 122 -159 -183 347 -138 -25 -196 401 -212 -74 -11 240 -93 -240 265
4754B65k77L8l31P15n19O1r7M31k92k36L77q6N3m95O95l31O9l46N42j59k74J63
4776c4P7J85o31N52j50J94n57M94K3j93j28J44L54o16L08q1L97o71L46R2L5l12
4798a72O4M41m65J14j33N53o30J95K9K28l61m6M38k86K2k56O32n14J06j07M08
4819B60l32j49L35o7J0m15O42l28J01l36N34j94k09J13J29J23n64N16j64J82n40
4840c53N16m9j33j34J88K49n42L01q3L47o36M00jM3k97J32L18m14J38j19M63o03
4862b69K67j8K12l73N8L26k35J1j87N52n05J58j19L96l49o7K39j0k3l57N86l32
4884c9J08l43N45k53j18N0J57M9m75M71j63J85n27N44j45n4j62K26J42m53L09
4905E4r4K77n58M37r0N6k74K02J86l39J49r0L71n48L30j00K34l68J19K17j95J3
$$ plain form
4754 265 -12 26 -305 410 -109 -48 -145 286 -6 -242 135 49 102 -393 302 -29 40 -306 236 77 -197 -34
4776 -34 43 228 -403 149 -1 193 -364 130 153 -40 -168 -24 330 -286 22 -59 338 -333 13 105 140 -172
4798 -172 -108 333 -132 -18 -151 402 -228 -33 -4 224 -137 -183 255 -31 -9 -265 367 -147 -41 -148 260
4819 260 -72 -221 114 47 57 -358 284 -44 57 -279 255 61 -148 -35 94 217 -347 169 5 187 -353
4840 -353 163 114 -19 -153 35 284 -258 43 -40 307 -329 71 70 113 -184 -52 266 -148 -10 -129 334 -269
4862 -269 -2 -20 192 -181 -123 203 -32 -21 -208 344 -161 -3 -122 274 -75 -142 97 87 64 -293 293 -39
4884 -39 69 -274 271 18 -100 -50 107 156 -319 152 -11 174 -353 191 46 -8 -170 56 198 -255 54
4905 54 -40 237 -321 116 26 82 -192 10 196 -143 6 -84 287 -261 69 -31 203 -165 -46 171 -24 -11
4927a1j43M79m73J90j74M01l80J4J56J3m7k71N01l31J37l20N16l11j7RJ69k5l43
4950b61M25k12J85m47N37k47L6j52K33K6l25K98j31K36m89M76k16J28k64K44N3
4971A33k47J40r1L11m94L59j70K27l69K11Q0j17j8r1L83m30K24j89L93m27J38
4992d4O3M7r6j51M06l37J79k77M67l80J26m7J61j06j75L45k55J89l51M92l58J47
5014D5j42K25j14j58K60j71J84l99M80k97J79k81K98p3j45J22p1K25m27L96k29
5035i3K43l76L03l6n8k8k5K78m01K76j81L27m30K64m9N9j39j2K70l25K11k32M15
5058B61m50K38q6J48j92LK38k78J88k60M47m56K44j45K51k29k4K08j52J23l15
5079b38M99m02K36k84L68k10m0R8k5J29l65M25k85K55l95M03j65qm3O9J40l62
$$ plain form
4927 -11 -154 325 -148 42 -132 269 -111 -97 59 72 25 -246 255 -76 61 -259 257 -54 -71 -62 107 82 -261
4950 -261 164 -48 137 -310 227 -20 16 -136 97 123 -202 96 -35 201 -288 188 -28 100 -164 80 133
4971 133 -114 26 -65 246 -248 111 -59 168 -201 10 90 -27 -45 -136 247 -183 41 -148 245 -182 -44
4992 -44 19 66 -30 -181 225 -112 67 -210 257 -123 3 -44 117 11 -164 181 -74 115 -236 256 -102 45
5014 45 -97 128 14 -144 116 -55 129 -270 210 -87 92 -189 109 36 -109 13 -58 167 -260 136 -93
5035 -93 150 -226 77 41 -17 -45 -70 208 -193 83 -98 229 -201 63 14 73 -66 -78 192 -133 78 -154 261
5058 261 -189 49 -37 111 -81 -78 160 -118 70 -190 257 -199 45 -100 151 -78 -102 106 -46 77 -238
5079 -238 261 -141 95 -189 179 -31 -71 27 2 131 -234 191 -94 161 -234 169 4 -4 -47 22 162 -200
5101b00L33k28K92m47L89j66O7j56J15J45l42K74j79L24m92L92j64J46k52J31
5121a8J71k72J57j80M18n13L35j93K93l30R4J61j41O9k46M81m51K68k80M19l35
5142i3N7N8K4M0l08M42l28K25l90N01l04M4n5J60J0l17L78k23K29m51N14k60P1
5165B4j60K27J9l07K88j33K70n31M88k10J50l13K51P3k47J23j09L84n55L69j94
5186i3L24m38J98J16j08k7j54M69m71K57k74M74m44J25N2O8q0k28M66l45J97l44
5208b60N50m17J06n5K24j16k57M17k23J70m34N81l37R7k09L29q5k80K78r8K13
5229A94n21N12k23J64l73L42J6k16P3m8L40n42L68j79L40m96K64P1n9q6r0M33
5251B84m75K55k39M94n24J91M9R9j64j53M66l62J65l26N88m85J28p6K61j87k06
$$ plain form
5101 -200 133 -95 197 -250 139 -27 40 -116 -1 144 -198 76 -103 221 -271 121 -43 103 -149 -18
5121 -18 153 -119 38 -142 276 -237 98 -95 198 -132 -38 123 -18 51 -195 286 -165 103 -177 242 -93
5142 -93 -36 22 46 86 -222 220 -108 117 -273 228 -76 -32 -87 73 83 -234 144 -79 150 -301 213 -47 24
5165 24 -136 91 110 -197 91 -42 228 -303 185 -25 125 -188 63 136 -111 12 -97 287 -268 101 -93
5186 -93 231 -207 -9 107 -1 -28 -182 287 -184 73 -201 273 -171 -46 6 74 -6 -234 232 -113 84 -260
5208 -260 290 -127 -21 -76 148 32 -225 192 -31 139 -295 286 -51 46 -163 166 81 -199 79 -19 194
5229 194 -327 185 -38 126 -247 95 111 -105 -32 -80 260 -282 86 -93 247 -249 15 86 27 -59 -149 284
5251 284 -191 64 -175 319 -205 -14 35 134 -30 -183 283 -79 86 -240 348 -137 -9 -85 176 -11 -217
5272b17L95k09J23m10N97l49R2k23L70j15k47K32m3J87n24N26k10J67m10L86q
5293A10j73KJ8L24n54L66j61L29n20L03N0l2j49j5L91m58K23k03M74n46K31NJ35
5316A50k35p3M16l60J43k84N77n04J62r7K93k39j46L48j65J05l96N96l44J05k52
5337b00M10j62j95J73KJ63m99M91k04J90m33L96k5j50l2N8K68m99L25j43L05n17
5359b78L37Mk2j64M7L39m53K03j56M29n38K55lJ35k63oL63l11J13k53N49m80J60
5382Gj01L11k53j23K99j25Q8l85N45l24J20k76M13j56j74J31L4J32m62M41j70
5403b8J80m33L86l0j29m9R6K05m40L05j18K61m74L19j5Qj67P0K72l79J84j31L72
5426B65m72K38k5J40k51J5K78k37Q8k18M79m25J52j40L12k41q7K11p4N0l30M94
$$ plain form
5272 -217 178 -31 92 -318 279 -70 22 -201 169 54 -193 39 -4 183 -341 185 -25 142 -268 118 110
5293 110 -63 -61 -43 281 -273 93 -68 261 -259 44 94 62 -87 -102 289 -169 54 -149 325 -221 10 15 150
5316 150 -85 -158 258 -102 41 -243 334 -170 -8 -105 188 -51 -197 151 -14 91 -305 291 -53 52 -200
5337 -200 210 48 -147 26 28 191 -308 183 -21 169 -264 132 107 -43 -75 -17 251 -248 77 -66 239 -278
5359 -278 59 63 41 -123 -76 263 -190 13 -143 286 -252 3 0 135 -128 -134 229 -82 31 -222 327 -153 7
5382 7 -94 217 -36 -159 140 15 103 -282 263 -61 59 -217 196 40 -134 -3 31 163 -299 142 -28
5403 -28 152 -281 105 75 -54 -103 -7 198 -242 63 -55 206 -268 51 36 44 -123 -53 219 -160 24 -107 265
5426 265 -207 31 6 146 -105 -90 188 -49 39 -179 300 -125 27 -113 199 -42 -129 82 8 58 -272 222
5448B22k99J26k76L97j48j20P7N2J03l93L98j77J69l64L66r6n9o0J06J36l65K83
5470G8j18K22l95L04n0J6j55Q3J88l02J63j18L14m25K19m3J46k35K3K14j81O2
5492A0j83M03l50J36j46L11k42n7J76k3K0k77M12k33J00k34L54j85n2M1P6N5l10
5515a98L29j67J49l13L30j18l4m4Q7R3k87K44j16J87l40K72o8M4j73J15J19k29
5537a18J28r6K68l56K02p4J72k34M8J71j25L3j59L59l12J38j50K87k27j6J05M
5559D8Jk20L46k27J14k11L04j93mK7N6Mk08K76j65J32k55L10j61J6o6J12L8k02
5583a28J79r1J60k99K61q6N7j53J11R7j70P8p1K40l23J88p5J61k27P0J23r9Nj11
5607a03K88k71J21j32K57k49N1O2lj6j39K70k15J17j76K88k28O4rP1j9j46K27
$$ plain form
5448 222 -77 49 -227 170 22 -98 -21 31 134 -259 139 -38 131 -233 133 37 -22 -82 24 160 -205 78
5470 78 -40 182 -213 91 41 57 -98 -15 173 -129 34 -84 230 -195 24 -19 127 -108 -85 129 -52 10
5492 10 -173 230 -120 16 -130 181 -61 -118 58 35 55 -222 190 -43 57 -177 177 -8 -60 -19 57 112 -198
5515 -198 131 -36 113 -200 130 12 -22 -66 21 114 -173 71 -45 142 -198 74 6 50 -123 -8 111 -118
5537 -118 10 -86 182 -174 28 -46 126 -108 -60 111 -14 19 -140 219 -93 45 -105 182 -45 -61 44 48
5559 48 49 -171 175 -52 62 -149 155 -38 -42 -15 41 45 -163 113 -52 80 -175 135 -26 -10 -76 36 74 -128
5583 -128 51 -40 120 -179 82 -4 53 -100 11 108 -62 16 -55 185 -138 50 -25 136 -91 -21 102 3 8 -103
5607 -103 185 -86 35 -97 160 -89 -38 24 21 5 -134 136 -79 38 -138 150 -78 -14 -23 48 29 -117 110
5630A10j60J34k25K79j73N2p7J28mj63J52p6J55l01K65r7Q6j95J47N4j35K8k5
5653d1J98l05J81p2J62k47J13O2o1k4n5K46k63J43j17K20k39Q4K4K1l6r8K48k14
5677g0J35j74K74k28Q7n2R5m7j26K08j27J05k39K99j71N7j37J85k2j50J14k5J27
5700A18l06K70r7Q5k16J78L6j25K5lJ77k89J77p1J69k66J50N2m7n0l3K22k51J41
5724D6j11K31k62J04KL9p0o9K13j93J14j82L05k41P9o4J42q2j26J95q6P8k58L28
5748A32j58N2j67K23l7j49J05lJ24l22K88j02J13k57K10L2j23jK2J86l08J86q5
5771c9J97k92J59J1kp6k5K20k34J10j22K66k96J03pR3j14p3K24j41P0k01L44k37
5795f2M5o6K04j06j38J73l2N8k92L62j58M9k05K89n1j59Q1L9J24l42K67r2J31
$$ plain form
5630 110 -50 84 -141 138 -35 17 -60 68 64 -99 53 -23 132 -169 96 -1 85 -110 37 91 -44 -16 -41
5653 -41 157 -148 33 -39 123 -124 -11 51 -10 -34 -89 157 -106 37 -80 140 -99 -15 9 30 -6 -104 144 -70
5677 -70 65 -109 165 -63 24 -28 67 20 -106 102 -25 80 -159 140 -31 26 -111 74 52 -98 16 -9 118
5700 118 -188 82 -15 70 -146 32 68 -57 -32 -35 142 -147 30 -41 128 -138 12 64 17 -33 -66 156 -95 46
5724 46 -65 166 -96 8 10 49 -21 -90 123 -70 44 -138 167 -74 5 -59 83 1 -125 70 -16 62 -196 132
5748 132 -26 26 -141 82 45 -104 1 -2 122 -200 88 -14 99 -158 52 84 -39 -40 -18 168 -140 46 -39
5771 -39 158 -134 25 36 34 -42 -67 153 -81 29 -93 173 -123 -20 -27 66 -48 -121 103 -38 32 -169 175 -62
5795 -62 -17 -83 121 15 -123 50 18 76 -216 146 -12 37 -168 121 70 -89 -8 31 155 -187 80 -12 119
5818A19l01K48Mq5m4J8K06l15J71r0K32l27J53K7L4j28j9K35k22R3j29L21l05
5841a04Q1jJ44j55r2K53j12J2k16M03k37K1j10K66j30j63J74K6L9l25L56j34N0
5864D6k35L00m5j50J8Q4J21l56K55o3J56l47K37M0n2j02M4K34l16J31n4K57l47
5887a44J24M4P5j72j6K75k05Rj29L68l10L5KK03k04j03K61p7l6k18M20k17k4j12
5911a51L19j50j81J60O0L5l47L64q7M2k84L18k2j46rJ10J33l55K16l0J77l69K30
5934C3O3n7j40O3K48l14Q3l3K81l72J05O1R9k36kK85j91l6j00L96l12nK0K38k20
5959d3j38K77k8o5k31M19j86k8j35L36j18j99J29J02L4l59L36o2M9k91L08%j46
5982c9o9J42J48l44J56J0J80m10K39O4k1k13J01K62l09K7J4K94m07R8R2J21k74
$$ plain form
5818 119 -182 66 70 -15 -59 -41 165 -150 21 -69 163 -164 -11 16 50 -78 -97 138 -84 9 -120 201 -104
5841 -104 -23 -24 120 -35 -127 126 14 26 -190 213 -24 -3 -113 153 23 -140 34 60 99 -226 130 -4 46
5864 46 -189 111 66 -84 -66 18 139 -217 38 -25 131 -216 21 61 9 -93 -49 185 -131 0 -54 203 -144
5887 -144 -20 24 99 -73 -89 186 -19 -10 -139 229 -81 -46 -44 159 -45 -148 113 36 0 -218 202 -15 -39 -151
5911 -151 168 18 -163 -3 57 92 -255 109 22 64 -220 98 76 -70 -79 31 164 -191 25 -5 172 -197 33
5934 33 96 39 -101 -38 210 -104 -21 -54 227 -145 -40 21 120 -116 -118 167 -24 -60 -160 236 -76 -81 -61 177 -43
5959 -43 -181 96 68 3 -228 191 5 -23 -158 178 60 -139 -10 92 126 -233 103 41 90 -201 107 107 -39
5982 -39 -108 34 182 -162 -6 4 184 -226 13 77 56 -157 -56 206 -103 -76 -62 232 -175 -77 15 136 -138
6005a38RL01j58p2r1M12l15k3J4K75k40j30K43K1r8k25L93j41o6j40L50j21j75
6028a15O7J39J3l22K80pL6l28L35oj30j01J77J17l35J49M4J55m05K35Q2j6k24
6051a60J39K23k83oN1K88m01J02R1J39k95QK81j38j13n9L76k94k7J0K73k42j22
6074a59K12M3j03k14L76j23o7j50L41j02j76N5J64j3k96K54J2Rk90L22Jj37q8
6097a29J98Q9l07J25Q9J03l69K33P1k2k33J56J79k38l1P4K29l74R4Q3J23k98O0
6120i5K16q4j37m2L38k53k6jK80k53o6J59O8j24j70L39j15n6j41L33j25j47M8
6143e4J77m0k70K59Nj5k68L18k4j19r4K16M1k78J32O0R2l55K38N9m2k24J95J34
6167A43k24j7P7K03l34R9O5J40k92P4J75o2j23j7K98k49j5MK44k43l4J22Q5j58
$$ plain form
6005 -138 -129 172 14 -58 -149 263 -52 -75 -61 214 -26 -156 87 108 10 -215 178 37 -29 -169 181 60 -115
6028 -115 -48 91 104 -218 62 55 91 -237 98 92 -38 -139 38 155 -180 -31 13 168 -237 -2 80 64 -160
6051 -160 -21 202 -81 -87 -36 252 -149 -47 44 183 -112 -104 177 39 -74 -133 243 -51 -78 -68 205 -37 -159
6074 -159 53 96 -7 -221 155 32 -35 -185 156 54 -122 -67 97 84 -212 42 54 63 -227 95 96 -41 -129
6097 -129 69 158 -149 -24 65 168 -201 32 103 81 -152 4 183 -55 -86 -12 217 -157 -63 20 143 -155 -95
6120 -95 121 37 -100 -142 196 -57 -83 -84 196 -57 -123 36 104 -20 -190 149 34 -22 -163 170 45 -102 -54
6143 -54 123 83 -187 72 77 62 -206 112 88 -31 -125 91 132 -146 -14 46 138 -217 21 80 38 -186 9 143
6167 143 -81 -98 -21 182 -152 -53 12 152 -140 -66 109 47 -76 -93 205 -44 -59 -55 189 -54 -88 34 119 -39
6191c9j03K84j15n8j04L01j59r4M4J67j06j92K34ol8k14L23q2j00o2K16k3k19
6214a45J41O0L7k99K61Nj0k09K17O4j83NR0J45l14J34L2J19k87J18J29p3j05K4
6238d4K16k44K7%K21k71K3J24L5j52m9K60j59m0n9K93k27l8N6J41j33j25K46n7
6262D4n8j45L12j30o7k9K08p9j79J67N1j1k57K79m1m3j64K38J1j83K9R0Q5k93
6286a65J77K1O5k73J86P6j02r2Q6J66k64P4M1J67k91R8J06pj69M3K37k08j9lK41
6311A91k76K4J00Q2j75n0K51j20n5r3L12k01m3oJ99j31j49J88K6n0k13K96p6n9
6335b8j22K48n0j54N4J05L6k75K33oK8k38K32M0j40n1J16J31k92J27M4J00l02
6358a64J81Q7n5j63Q5K04k55K2K0K40l49R3R8O1k07mK49j56n2o4L22k57k5M0J92
$$ plain form
6191 -39 -142 142 27 -31 -135 166 7 -87 -43 124 18 -174 60 54 16 -198 125 43 -57 -119 97 74 -145
6214 -145 -4 56 93 -206 55 60 50 -159 58 122 -61 -56 34 179 -135 -1 31 150 -137 -19 110 37 -68 -44
6238 -44 172 -72 -45 -45 176 -95 -72 52 87 -65 -114 146 -13 -53 -112 181 -46 -84 -28 113 -20 -145 101 44
6262 44 -14 -159 153 23 -44 -73 135 56 -123 44 95 84 -173 106 65 22 -142 96 107 -76 -47 43 128 -165
6286 -165 12 33 98 -175 11 87 -15 -107 -21 145 -119 -45 -4 163 -128 -30 76 69 -100 -57 180 -28 -47 -50 191
6311 191 -85 -61 39 121 -54 -104 147 27 -28 -121 191 -10 -53 -59 140 9 -140 48 74 24 -189 107 31 -28
6335 -28 -150 98 48 -106 -52 53 89 -186 47 41 69 -169 63 103 -37 -88 28 159 -133 -6 38 138 -164
6358 -164 17 104 49 -114 -29 175 -80 -58 -38 202 -147 -54 44 105 -102 -106 143 -13 -65 -129 193 -64 -89 -49 143
6383A43j93j07K25j1o1j75L32j36m2r8K83j04j68J13R8j7k73K84k9k0k23K88j2
6406I7j80jJ52O6l19J91M3O1l16K37P7j09j53J40J95l02N2O0K05l69J29J20L6
6429A12k28L5K66k01m8l2L14k91QN7J81k02j03K48m2q4j53L59j86o3n7K95j69
6452A6j60J56Q8p2k58L51o8o6j89L39o8j81K3J93J9l39K46M9J5l21K89N7j43j12
6476a36J77J39l16Q5O8J84l81J62J12Ok37Q4K46k24m6NL08l43L4Q0J59k55m4K55
6500A22o6j24r8L69k31o1j4K92k08j50K14P1r6k39L76r2p9j68L62j04j89N2J94
6523A33k0l28K76L4j5l00L21K4j48j14K04J06l26R4R4J41l93J98J03rk44J24K19
6546A74k37l7N5K70l62O4Q6J44k86J3K70j06j31m4L56k75l2K2K83k73r9K24N2
$$ plain form
6383 143 -50 -157 68 57 -4 -179 153 17 -25 -123 160 56 -112 1 99 82 -191 93 64 44 -179 109 97
6406 97 -83 -84 68 134 -185 6 49 110 -206 31 108 -1 -154 -14 181 -121 -69 -9 196 -173 -44 76 112
6429 112 -116 -81 185 -16 -64 -96 218 -73 -65 -8 173 -29 -132 116 74 -10 -163 196 10 -53 -110 185 16
6452 16 -144 12 100 28 -230 121 53 -13 -202 137 69 -112 -89 104 123 -216 30 79 94 -227 62 119 -24 -136
6476 -136 41 180 -136 -51 17 201 -180 -18 94 100 -137 -53 193 -31 -77 -72 236 -107 -73 7 166 -89 -133 122
6500 122 56 -68 -166 203 -28 -89 -103 189 -19 -169 45 116 20 -219 157 65 -14 -182 180 76 -113 -61 133
6523 133 113 -215 61 95 80 -220 101 125 -23 -137 67 173 -153 -59 35 176 -217 -19 84 75 -169 -45 174
6546 174 -63 -100 -45 225 -137 -73 13 157 -129 -116 154 48 -83 -127 229 -46 -78 -56 227 -46 -145 79 131
6569A31j38j90L87j41q3j22L60j62j56N8J85n9k86K64K6j5k89L46k5j46r5K29
6591G9O0l03J28R5Q8l75K59O0l6k31J85J77k58qR3K25l91J13R7J12l17Q1K41j33
6615D1j26J1L24l12j9L5K61l07m1K01L8j76j18L84j87p2r4L58k03j19P7J88j14
6638C0k35K87j5m4k35L63p2j15q6K53pk87J62R7L5l54L03L0n9k35K53R2k46LJ36
6663E4J50l94J76P0Q1l47J74J74j31j48P5K78l27K4P0K21l45M5J82J8j90m5L38
6686B03j88o8n2L35k57o9Q7J78j74j66K83m1o3k07L94j62r0n8K71r3k22J71Q5
6709I7k4l20L38k7o3k14L15Lk17J9J63Q6l76K20P0M5l28K30J17j38j26J41K01
6732B12l20P2M5K09l66J13J25K2k25K6K87k21n1j7L26l26PP1J72k37q9K85o5r9
$$ plain form
6569 131 -7 -197 190 49 -34 -156 204 42 -114 -56 129 70 -216 48 74 59 -230 116 91 -55 -150 79
6591 79 139 -164 -36 59 147 -228 31 91 55 -176 9 186 -72 -80 13 238 -153 -40 57 169 -148 -67 174 41
6615 41 -85 -74 250 -62 -81 -46 215 -92 -133 68 106 -70 -188 196 9 -63 -157 201 -2 -121 -44 144 30
6638 30 -205 82 67 23 -212 151 79 -36 -122 131 124 -163 -1 96 131 -223 80 110 51 -184 69 161 -85 -82 54
6663 54 204 -190 -14 56 137 -210 -36 138 7 -141 -66 212 -115 -91 -21 200 -145 -100 82 100 -90 -135 203
6686 203 15 -53 -105 230 -27 -96 -9 169 -5 -171 112 71 8 -199 195 33 -57 -115 156 63 -159 12 97
6709 97 73 -247 91 64 1 -213 102 105 -112 -93 70 156 -220 0 70 115 -213 17 134 -4 -130 11 212
6732 212 -108 -36 9 218 -148 -35 90 112 -113 -87 200 -21 -72 -89 237 -89 -82 -11 161 -76 -165 120 55 -44
6756d4j47M01k16o7m1L03j88j71K09P0r0k58L81p4p5j88L65q3j95M4J81K4l53
6779b12K65M3J9l29K97L8j37j23J78J59l61J22N5J66l81J81R3J3k52R6K53k31
6801d8m4J7L11l66M8R4J72k99LK62r6j25q1L95k75m6j2L17k59j17K03Q1j36k16
6825b17M00j38o7j69M04j66j59M0K14m9l33L05LK0l42L56k1j21j32K44Q5l32J46
6848b9O4J43m19K64P6j1k72J98J90k69j6N1K93m22J13P5J67l48O7K51j29j38k4
6871a25L87l37mnL35l47n6K11O8j82j62M01j63o9j59M17k09j25N5K22r4k93L16
6894H2nj7l17M13p9r7j41K87L2l12J51Q3J03m30L19K7k5k84K38J54k68k3R5K59
6918B45m61J76P1J39l71J35K17j23j56J6L66l69L7J3L16l77J0J87O0k00j26M23
$$ plain form
6756 -44 -191 210 -6 -73 -114 189 1 -170 39 109 19 -239 142 68 -7 -195 170 87 -108 -64 117 141 -212
6779 -212 53 96 115 -214 83 121 -16 -139 39 198 -163 -41 14 180 -201 -20 73 86 -166 -70 183 -48
6801 -48 -92 -75 236 -130 -82 12 184 -115 -112 150 54 -71 -152 243 -32 -78 -90 227 -32 -149 54 135 -1 -217
6825 -217 183 45 -22 -191 213 47 -112 -72 142 93 -240 65 68 88 -254 102 81 -40 -172 72 157 -175 -29
6848 -29 35 178 -241 23 99 88 -184 14 204 -65 -81 -30 263 -159 -46 29 196 -152 -85 166 37 -101 -125
6871 -125 262 -75 -79 -84 251 -96 -152 59 127 -55 -217 184 21 -48 -207 210 1 -124 -69 153 59 -234 82
6894 82 77 60 -257 156 77 -20 -161 126 158 -154 -3 80 183 -247 72 99 74 -210 28 182 -86 -109 -14 245
6918 245 -216 -40 31 170 -201 -66 151 28 -128 -112 254 -115 -78 -65 251 -126 -116 71 131 -69 -195 228
6940B28k14m7j40M38k70r1M9K22j40k39L17l6l1l03M44j23j06j23L01l0l01J76
6962a9Q2P7m21L53jj9k82K90R9k59lJ28K11m57K06O6J34m06J95J84j31j36M4L31
6986B66l71M9QL02l79L3J66O2k13q8L80k05n0j29M21l08n0N3K26j90k04L20m2
7009E7m1k74M33j46j09q3L14o7k76J83R7L9l83L60j9k6k81L20O0k50MJ44J71m24
7033a97J98M3J28l87K09J39j10j58P5K94l60P6rK91l83O8J39N9k20n5L50j99n1
7056f0j05L92k90l4O0K04j80j60K92l7p7k10M16j79p2q4L05j09k25J63Q7Kl37
7079b38L48l6l0k52L11Kj99oJ40J28l75K22K3R4l37K03J10j02j35Q3K42l04N8
7102e0LK47l49R8J13N0k00k2K99j89k9p8L39k95LL6J99k09j04K47n5n7j81L68
$$ plain form
6940 228 14 -33 -173 265 -5 -96 -47 175 35 -204 113 77 46 -257 187 64 -42 -165 136 106 -195 -19
6962 -19 63 140 -281 72 71 52 -230 60 159 -100 -103 25 236 -221 -15 51 185 -221 -26 158 27 -109 -65 266
6986 266 -105 -56 -48 254 -125 -92 74 136 -77 -165 215 10 -40 -169 252 -56 -106 -53 173 -17 -221 99 57
7009 57 16 -258 175 29 -80 -163 151 84 -192 -9 88 127 -256 104 85 59 -222 98 158 -92 -88 56 227 -197
7033 -197 1 44 172 -215 -6 133 23 -135 -60 234 -126 -50 -59 232 -151 -83 56 115 -105 -160 190 -9 -60
7056 -60 -165 227 -63 -97 -37 167 -13 -173 119 82 5 -205 211 32 -40 -124 181 72 -153 10 97 99 -238
7079 -238 110 74 44 -208 103 105 -94 -100 40 168 -207 15 38 132 -205 -2 108 6 -129 -46 196 -108 -50
7102 -50 -47 200 -149 -51 62 112 -88 -110 189 0 -29 -107 232 -63 -60 -24 175 -34 -138 109 54 -3 -184 184
7126A84j80n4q4K79j29j81J61P9j6k76L08n8j3k10K95k9j45qJ19R9l14J95JJ01
7150A24k97K08O6q4j23Q3J97k67P0OK12l31J17P1L8j74L4K12j83k3n1K87k87L0
7174f5K6J61j94o6K22o7m1j47L28j78k1m6K28j38j04J11N2j1k10K67p3J0j81K54
7198A17n4j02k0J11M4k46J80j0P2k59K13J2m1j09R9J09k17Q6lJ48k72J27M2L0
7222E7j64N5J69j63Ol0K13k36N8K6J28j85lJ50n1m1p6K37j67On5J97j35n9R0K5
7248E2l1j50K21q9J0j31K08q0m8j4R0Kj68J58l0M7j95K05m0j9p9J11M7j82J07
7273BlQ9k29J72MJ1j36J10P3j26J6KJ53k25R7j2J00j69N2P3n2k5l5J50j54N5n2
7300e9J48j56K8N0J6n9o9J73r6K3q5J97j41mJ8P2m9r3J44n1K8j40K00r2j1m7J24
$$ plain form
7126 184 4 -50 -134 145 16 -165 -4 75 59 -217 91 33 20 -190 105 76 -69 -77 42 141 -173 22 23 124
7150 124 -173 35 101 17 -106 -23 174 -93 -23 -17 195 -136 -19 52 90 -84 -50 162 -21 -44 -95 192 -95 -65
7174 -65 -39 122 -72 -138 84 17 -24 -171 157 -21 -42 -88 140 2 -102 9 61 50 -160 107 34 44 -137 117
7198 117 63 -39 -59 52 96 -150 30 20 92 -167 46 58 17 -92 7 116 -101 -15 -18 130 -142 -15 27 57
7222 57 -107 -52 117 -46 -40 -70 143 -93 -35 -9 119 -66 -69 81 30 -11 -87 150 -17 -11 -66 131 -4 -63 27 52
7248 52 21 -129 92 3 13 -118 90 10 -38 -52 38 40 -128 30 0 47 -148 57 17 -2 -81 30 77 -105 2
7273 2 -1 88 -141 31 35 46 -90 20 93 -33 -17 -15 138 -87 10 -2 98 -71 -19 54 2 -23 -58 92 -62 -7 -59
7300 -59 89 -67 -39 11 27 -32 -101 72 -24 -1 -86 111 -30 -34 -16 56 7 -86 58 7 35 -105 95 3 -8 -55 69
7327F9k4j14R7j1M5j79J81m7J4j14J23J1j06K7K1R1j86J17k3N6j52J00L9m5k5
7352c5JJ23j60Q0l7J26j66O7L0J3p6j0J36j13L3o2J66j66M1MQ3r2m6J24n3Jj06
7379i4K01j30%k2J25r1o8R3j3J5j26J89j01K6r7J54m8o5L3L5M2j63J52m5N6j43
7405h5J31j3k6m4M7P4j58J04l7J00j80J00J6jq2L1J03j30L1k3J52j91O7MP3j30
7431f7J1J27p6k0n0J91j73L4l2J35j03l7R9rj5j15J94j01L4r4J66q6m2K8M2J1
7457E2j46J48m6M2j46J65m3m0l6P8L5j61J07j6P8j89J37oJr1P9P7j36M1j3J43
7483A14k06R8jQ2j48M0R5p3j4m1J77j61M3m3J40j28rO9Lk5q9J79j16K8r6J65r7
7510a4k6QO4j6j20J38n5N0j48J84o2j8m2R5J8j33R7%O0j91J59j4Oj18J07M8j24
$$ plain form
7327 69 45 -69 28 17 62 -117 64 17 31 -83 40 51 -55 -28 -7 84 -102 15 -8 48 -104 -4 35 -10 -35
7352 -35 -34 89 -71 9 -28 98 -68 -1 29 42 -34 -44 92 -21 12 -50 116 -50 -9 -5 78 -14 -60 64 11 12 -94
7379 -94 107 -23 -23 -45 80 -11 -79 14 1 16 -110 79 -22 4 -93 61 13 -52 -19 16 58 -105 47 2 58 -85
7405 -85 46 33 7 -37 10 84 -74 30 -7 93 -87 13 29 28 -54 -23 80 -50 -19 -42 110 -81 -14 -10 63 -67
7431 -67 -56 71 -5 -25 -75 116 -57 -23 -55 80 -23 -60 39 30 15 -100 94 -7 27 -67 99 13 -29 -1 41 52
7457 52 -94 54 8 50 -96 69 26 -14 -50 28 63 -98 9 -7 71 -118 19 13 14 -77 2 79 -57 -16 -29 114
7483 114 -92 6 5 87 -61 -21 74 1 -13 -54 123 -38 5 -38 102 -26 -35 34 37 12 -77 102 -14 14 -82 83 -14
7510 -14 -40 -32 32 16 -104 34 -21 29 -119 65 3 -15 -57 38 56 -77 20 20 80 -111 48 34 40 -78 29 77 -47
7537d7K9J3J27k09J11j9P7j44N1P3n5k6l6J60j49L9m4J39j41J4M7Ql6o6J65j06
7563b5L3r0J87j22mLQ0m4q3J24m6L1j38J88q2Ln9R9Pj23Q5rP1j94J55m5K2j10
7591h6J03K1p9K7qJ13j84J06k7P8j41O3M2k1m0rJ34j49O2n4J36j29L7K7L2n6m3
7618d5J26r1M4r6J79j27J5k1P9m9p2J09m3J9j19J66q6On3J01j6q1N3qO4j47J33
7645D0m9N3j16R9Ro0J6qR6j43R1l3Q7j37P0K9k8k4j0J12j31P0o9J23j34M5J5K9
7673D2n7l6J10q0K1q4J53j24L0k3R4o6l6Q5l6K6j05J57q0K2o1R6k1n9N5lM8j35
7701f7J28o2N4r8R5k6k1j2QQ4j46R0m8J02j42Q0qPm8KQ3r6M2m9J16j31O1j2M2
7730B8n4j2P9n7K6o0J26j09N0l1Q4o8j5N6k8L0q5J24q7L4p1R0n1j0J4OL2r8R1
$$ plain form
7537 -47 -18 -5 122 -87 24 5 82 -62 -11 62 7 -19 -55 105 -44 -5 -49 90 -51 -37 10 18 -18 -84 81 -25
7563 -25 8 -82 105 -17 -21 -18 62 18 -65 59 13 44 -94 94 12 15 -44 55 62 -61 24 15 86 -108 47 2 24 -86
7591 -86 17 38 -41 -14 -22 91 -93 13 -14 64 -77 -14 28 7 -33 -42 92 -57 5 -49 87 -42 -5 22 54 -2 -45
7618 -45 81 -10 34 -62 117 -10 5 -16 63 14 -58 51 8 27 -92 74 -12 -6 -59 42 26 -55 -2 -10 54 -93 40
7645 40 -9 44 -72 27 36 -24 -8 -16 80 -63 28 -5 82 -55 15 44 16 -8 -18 94 -37 33 -36 87 -47 -2 13 42
7673 42 -15 -51 59 -21 0 -84 69 -55 -25 -48 46 -20 -56 29 -7 19 -86 71 -9 13 -48 48 27 -32 23 20 68 -67
7701 -67 61 -1 53 -45 50 24 3 -9 -1 83 -63 27 -21 81 -61 19 11 18 -30 -28 55 -41 1 -48 68 -63 -2 -14 28
7730 28 -26 -38 41 -16 10 -50 76 -33 17 -14 70 2 -13 43 15 45 -40 84 -3 31 -40 50 -1 -11 3 9 41 -57 34
7759C4n8O1r8Q8l4Kj4J4M0r2O8l8P3j17J06l2K0n7L3N6r4N5m5R9j18P8l3N4p8
7788b7K9N0m9J2l8R9j01M4m4Q1p7KK6Pqo2J05p5L3p4J12o6oRL0Pp5P6l2N3j14
7819g3J16m0J0l9N3Qo6O1k5O4j17R9m0J9n7O1J6p1L2k3P5j16Q1l5M9r9N1K6k8
7848hlk4Q0r8M7l6J06r6J1J3L7k7n4J02n4K1o1J18p6Oj4O4k8p2R0l3L4j11J27
7877F1o2J2m2O7qp4O3j8N3j25J13l5J8q1O6J6p2K9jQ3j42Q1k7P1j11O3L2k2k5
7906a7j5J10j10L9l7J10j06K2K0K8l4m9J03o7J4p0J44j04pKQ0n7o3R9l4J5j00
7933h4J35n8pm9R9k4p1M1J7M6j18J02j9J7r7R7J4o1jJ5Q3j26N7oP8j28M8M8k2
7962B6n4k1J26j03K0l7J23j32K3K2L1n5n3J30o7K1p3J51r7j1%Q0m8p2R5Jkj01
$$ plain form
7759 34 -24 37 -61 27 -7 -5 -19 -5 35 -57 11 -27 46 -71 35 3 23 -34 -1 55 -39 16 -29 70 -48 30 -3 51 -27
7788 -27 2 52 3 15 -23 76 -25 19 -25 56 -21 -19 7 14 6 -56 49 -26 7 -67 45 -21 -27 -18 12 19 -56 20 -12 41 -73
7819 -73 43 3 13 -26 27 35 -31 30 5 69 -48 51 11 30 -27 34 50 -21 11 -12 63 -53 28 -7 42 -57 -6 20 -8
7848 -8 -11 -35 45 -53 -6 -42 64 -32 -21 -8 29 2 -52 50 -4 17 -44 74 -2 4 -10 54 26 -46 44 11 45 -66 61
7877 61 -1 11 -31 36 28 -46 17 -1 52 -73 40 5 23 -58 8 24 -48 -19 -20 63 -79 2 -25 46 -65 -2 30 8 -17
7906 -17 -32 78 -32 7 -30 80 -26 -4 16 44 10 -39 64 -3 11 -59 85 -19 -26 -24 56 -1 -64 35 1 16 -84
7933 -84 51 -7 -14 -63 36 12 -59 -18 -1 45 -73 29 10 27 -70 27 41 -20 -21 -6 77 -49 8 2 80 -48 0 48 26
7962 26 -28 -49 77 -26 -6 -43 80 -52 -29 -7 24 -31 -84 46 -21 0 -73 78 -19 -30 -30 50 2 -70 25 26 24 -77
7990g7J52m9qo4J17k8j02N7L8L3j49J12mK5j23R9L0p5k3M7Q0j57N9KP6j37L2O4
8018B7j2o8nJ43j17Jj3J45j56J2N7M3p4m7J46n3k2o7J62r1l2J5Q5o7q6J01J9j8
8046B8j21J60k7l8q2J23Qj14L5N7M3j71J07K1J2j47J09O2r6l1N2R1j54L4L3R2
8072H6j65M3R1j8q7J6J51j24j4MJ38j42j8O7M4r0n6J55n2n0n6J80j05o5K9J11
8098G3o5r6R5L2l1j43J81pn0r1J33K7j33L2Q9J8j69J12L8Lj46J07P9r6m9O2J14
8125A19j61J6M6Q1j72M1J02k1j08NJ56j28l0J7J47j57l0P4O1r4o7J63k5q2m3J85
8151I5q5o7J1J22n3j11J09L8l1j38J63J9o8p5J49Rj48L2P9L9j86R2P3j8j47J08
8177A1Q7j00p0O9J02j77J7P0P0j78M8J09l1j00
$$ plain form
7990 -77 75 26 18 -46 71 43 -59 -2 36 69 -80 32 28 53 -70 29 59 -16 -39 8 88 -69 -10 -8 68 -69 -37 27
8018 27 15 -53 -58 85 -32 -31 -44 101 -55 -43 14 57 -17 -64 82 29 7 -60 102 11 -21 -6 79 12 -74 27 46 28
8046 28 -93 67 40 2 -80 43 51 -63 -28 29 72 -99 8 29 41 -106 3 65 -31 -62 -10 81 -73 -39 -6 86
8072 86 -79 -36 55 37 -50 -34 117 -7 -21 -17 121 -21 -39 28 72 -18 -74 81 29 -21 -77 103 -2 -67 -38 73
8098 73 8 -88 7 39 8 -135 46 39 -11 -102 31 58 -75 -43 46 64 -105 7 45 48 -98 9 88 -8 -57 5 119
8125 119 -42 -26 20 101 -71 -30 72 51 -57 -52 104 -24 -54 -37 110 -47 -77 -3 58 -36 -103 60 35 -47 -90 95
8151 95 10 -57 -46 76 23 -88 21 59 28 -110 53 72 4 -71 78 87 -61 -29 50 89 -97 -5 68 50 -97 11
8177 11 98 -2 -72 -3 99 -78 -61 9 79 -99 -51 58 27 -73
8191g3
$$ Imaginary data points
##PAGE= N=2
##DATA TABLE= (X++(I..I)), XYDATA
0@%%%%%%%%%%%%%Qj6J6j6J6k2L0l2L2m0M8n2O0o8P6q4R2j01J13j25J34j46J61
36H4j74J87k02K21k41K58k79L01l23L50l75M03m36M72n13N57o08O68p39Q24r28
57d93J058j218J419j678K022k489L137m075N510p877J2304k2886Q1983J66799
71B33516k86829j15406J60065K87287m36269K7214K00237J35218l69518J9488
81a44997L35369j16295k06642j1552M10981k91619j11004O7356L13413k95025
91e0015j35589K49697R2427j98965j79567L96667r3546j52511j09303L82955j39554
102F2696k15966Q8032K26125r0672l01900K84411O7717q2902k74402L43277K1401
113A27817j86659r9851K56249O0608l27002J11128J44422N8405l62468K14422
$$ plain form
0 0 0 0 0 0 0 0 0 0 0 0 0 0 0 8 -8 8 -8 8 -14 16 -16 16 -24 24 -28 32 -36 40 -44 48 -53 60 -65 69 -77 84
36 84 -90 97 -105 116 -125 133 -146 155 -168 182 -193 210 -226 246 -267 290 -318 350 -389 435 -493
57 -493 565 -653 766 -912 1110 -1379 1758 -2317 3193 -4684 7620 -15266 66717 233516
71 233516 -53313 -168719 -8654 278633 -157636 -130422 69815 205033 -164485 -144997
81 -144997 190372 74077 -132565 -144117 266864 -24755 -135759 -68403 245010 -50015
91 -50015 -185604 64093 156520 -42445 -222012 174655 81109 -71402 -180705 202250 62696
102 62696 -153270 -65238 160887 70215 -231685 52726 120443 37541 -236861 106416 127817
113 127817 -58842 -158693 97556 158164 -168838 -57710 86712 145117 -217351 -2929
123b929J24711o3386k40835J80595J85538k44024n3644J14106K05843l42152N7953
134g8224J30421R7172k86592M9258K28221r4395j48615Q999K93667k34254o0127
145i4469N0272K28580k38592p3463J81454N9051j55146j14986K96736r1115j03596
156e5274p4550K90913j30796j41992O9097J67873q6999k08959K21237L5106o5620
167B0036j95944K69969j0552j30781o7949J99618K0486k34035R5978J00638L1491
178I8955k65836J80918P0757m7498j75651J53046J13109j80043k7547Q9001J37615
189A46826k58931O7263Q5015O6317k19076O3457J52042p6736j06230K2634K06615
200A49196j88488k5444L8378J65272j95391k7983J29391L6510j24776o4085K18724
$$ plain form
123 -2929 121782 58396 -182439 -1844 183694 -60330 -113974 132 205975 -136177 -78224
134 -78224 52197 149369 -137223 -87965 140256 45861 -102754 -93755 199912 -34342 -94469
145 -94469 -44197 184383 -54209 -127672 53782 112833 -42313 -157299 139437 48322 -55274
156 -55274 -129824 161089 30293 -111699 -42602 125271 38272 -170687 50550 85656 20036
167 20036 -175908 94061 83509 -47272 -115221 84397 104883 -129152 -33174 67464 98955
178 98955 -166881 14037 84794 37296 -138355 14691 127800 -52243 -79790 9211 146826
189 146826 -112105 -44842 40173 106490 -112586 -49129 102913 26177 -80053 -57419 149196
200 149196 -39292 -64736 -26358 138914 -56477 -84460 44931 81441 -43335 -107420 111304
211A11304q6118o9632m5562K18674j22328q6333N4574J23211q4130j36399J70247
222D7508J1892n2967j34334K10860l3114q7544m3882J54676r119j60694Q0871
233a5847O8185J1332j89748J50508L2451l4740j26309J29623N9987j29549j0981
244e5088P0700Q6024j92891O9290N3046M3398j66896P0605R6119o1025p6790L2899
256c0609J40656j50587l204L0827J16726j60139L816Q9745K0965j01627k6031
267f9462J57532p8778m5682k3126J62077j13214m4981M2858Q9203q1262q0343
278h5178J28988l853m4030q6548J63934m8344n5326k6106J21264l1946j04778
289g1923O8260M5951o106j31415J27021N340k6929q9636J13830J9691r2301l1
$$ plain form
211 111304 25186 -44446 -90008 128666 6338 -79995 -25421 97790 13660 -122739 47508
222 47508 59400 6433 -127901 82959 49845 -37699 -81581 73095 63976 -96718 -15847
233 -15847 52338 63670 -126078 24430 56881 22141 -104168 25455 85442 -44107 -55088
244 -55088 15612 101636 -91255 -21965 31081 74479 -92417 -21812 74307 13282 -63508 -30609
256 -30609 110047 -40540 -43744 -12917 103809 -56330 -52514 37231 58196 -43431 -69462
267 -69462 88070 9292 -36390 -59516 102561 -10653 -55634 -12776 76427 -4835 -85178
278 -85178 43810 39957 -4073 -90621 73313 24969 -30357 -56463 64801 32855 -71923
289 -71923 -3663 42288 36182 -95233 31788 37128 10199 -79437 34393 54084 -38217 -38248
301c8248O0760M4982j43825P0655L1948K3887j28901P8048N4325m9939n6522M3841
313h989Q9633j22192J2443K7565P9051j34472K8587O0153R255q5400M196J10284
325G0114p2234k8637n612J18970j05563j4384L3496O4591p9173l8577R7051j3776
337B6266l7925n1410J28246n7589l2245j4106R7249m7609o4413N7432L1809j9163
349A6542q9267J08594j2094k1962o3644J02057q259o5301O256N4787J5186j07612
361f4717O9570J8387R375j00933Q2255K4467m1018m2445N1591N1841r9249K2005
373a8871K5284N1331j13846M5017L7939K008p3190K5539P4290o4818j7006O588
385a9735Q6571r7411O734K5467M7632p6741q860P2300j8773l4133k6109J01282
$$ plain form
301 -38248 22512 67494 -76331 -5676 26272 50159 -78742 -694 53631 3692 -52830 -8989
313 -8989 80644 -41548 -29105 -1540 77511 -56961 -28374 31779 41034 -44366 -40170 70114
325 70114 -2120 -30757 -36369 82601 -22962 -37346 -3850 60741 -18432 -57009 40042 26266
337 26266 -11659 -63069 65177 7588 -24657 -38763 58486 10877 -53536 3896 35705 16542
349 16542 -72725 35869 23775 1813 -61831 40226 31967 -33334 -27078 27709 42895 -64717
361 -64717 4853 23240 32615 -68318 13937 38404 -2614 -45059 6532 58373 -40876 -18871
373 -18871 6413 57744 -56102 -11085 26854 28862 -44328 -18789 55501 -9317 -26323 -19735
385 -19735 66836 -30575 -23841 1626 49258 -27483 -36343 35957 17184 -16949 -43058 58224
397E8224o2203j6440o042Q0056n7921l5656M8275K3121k8823n8746R3896k2908
409A4833j8988m4814R2666k7383m5537R850N0390n904q0217O6571R246o38p9549
422e9474Q2733L617l3168l2385N5258K4898p9985K6904K2536L2035r6064N3555
434D60K1441j246o3215L7997M8084n6310r700J3563O3264q8099J9471J8475L6590
447D0775p2777J0007N3338j9739l1290r583Q0952o2428o205j394O7331o2776j6003
460b9792L9981J7794l4363l7182Q0847k8568j6251l1727Q3607l8900l0382J0909
472a4027M5888j9309n8694O1147K792o228o2625P9178j0459k5171k5540N5158
484B2110O215o2764K7923J9307J8901q0072N6336Q912j686n4781M4460K8383m6937
$$ plain form
397 58224 -3979 -20419 -26461 53595 -4326 -39982 8293 31414 2591 -56155 37741 14833
409 14833 -4155 -48969 43697 16314 -29223 -19373 31017 25113 -55104 11467 20713 20075 -59474
422 -59474 23259 26876 -6292 -38677 16581 41479 -38506 -11602 10934 42969 -53095 460
434 460 21901 20655 -42560 -4563 43521 -12789 -22489 -8926 54338 -33761 -14290 4185 40775
447 40775 -32002 -21995 31343 11604 -19686 -29269 51683 -10745 -16950 -18344 48987 -13789 -29792
460 -29792 10189 27983 -6380 -43562 37285 8717 -7534 -39261 44346 5446 -24936 -14027
472 -14027 31861 12552 -46142 15005 17797 11569 -51056 28122 17663 -7508 -33048 22110
484 22110 28325 -34439 -6516 12791 31692 -48380 7956 16868 15182 -39599 4861 33244 -13693
497a3693n525J7414M5711p8098K6844J2466K8858o7814K2388L7940j8510k8827
509b0846J863O4090n9765R03J187N6670o3791j592L1869J3967l6573k0931O7890
522C4941l0908j2876k2251P3509m4689j7756R840M0688k6808m0959N3485j866
534A4350q311m8693P2149j9362j7074k0851N1959o100m7297K6099J5995J0147
546B3011o5625N4972j40p93m7240M6574J3733l7547l321J9286L2017o7676L0373
559b376P618K2962o2006L0290K5145j6214k6208R842M9263n4933O021K310M6988
572C8702o1722R199K3626J1249l6304q398N4831l0845q971j5402O2678m6383o989
585a4729P166L5367l0312k6180M4442m821q498l7142O3433k4637r598j7558M7296
$$ plain form
497 -13693 -19218 -1804 43907 -34191 -7347 5119 33977 -33837 -11449 26491 7981 -20846
509 -20846 -18983 45107 -14658 -13755 -12568 44102 -19689 -21281 10588 24555 -12018 -32949 34941
522 34941 4033 -8843 -31094 42415 -2274 -20030 -10190 30498 3690 -37269 16216 14350
534 14350 6039 -42654 29495 10133 -6941 -27792 24167 18067 -29230 -3131 12864 23011
546 23011 -42614 12358 12218 11425 -35815 10759 24492 -13055 -16376 2910 34927 -32749 -2376
559 -2376 5242 28204 -33802 -3512 21633 5419 -20789 -10947 38316 -16617 -10596 -8286 38702
572 38702 -23020 -13821 9805 21054 -15250 -23648 31183 338 -8633 -24035 38643 -7740 -14729
585 -14729 -7563 27804 -2508 -28688 15754 10933 2435 -34707 28726 4089 -5509 -23067 24229
598B4229j4238l3694K2715J3171L923n2632N1234o490M26m0372M6220K547k8786
611a1747j990J9833K0824n6991L1360L558J8110n5149L4715J4165j3092k3230
623a9634J4987L5835m8292R748K145L7920n6796J6844J5269R481l4017J018M1767
636B6275k8627n157j0411N1670m5160J888L754L0239l1410j3713L4929o307q222
649b52k6997N4145k7605l331j4748M2453k0482k1624J8980J1027j721m0288M6537
662A6094j1162J034l3535M5004p217k0490j038K0203J0221m5939L1165L7J3302
675A7679m7446L7447M021r602k0171J9062K2831m0518J2340J780K9133n0621K2705
688a360P247Q329l1232Q856K9209k5159k335o011M1162m2619Q879O42K5728l1732
$$ plain form
598 24229 9991 -23703 -988 12183 16106 -36526 14708 8218 8644 -31728 14492 17039 -11747
611 -11747 -13737 6096 26920 -30071 1289 4847 22957 -32192 2523 16688 3596 -19634
623 -19634 -4647 31188 -17104 -7356 -5211 32709 -24087 -7243 8026 17507 -16510 -15492 26275
636 26275 -2352 -7509 -17920 33750 -11410 -9522 -5768 24471 -6939 -20652 14277 7970 -252
649 -252 -27249 26896 -709 -4040 -18788 23665 3183 -18441 539 11566 9845 -30443 16094
662 16094 4932 5966 -27569 17435 10218 -10272 -11310 8893 19114 -26825 4340 4377 17679
675 17679 -29767 7680 11701 2099 -18072 990 23821 -16697 -4357 -2577 26556 -24065 -1360
688 -1360 5887 14216 -17016 -8160 21049 -4110 -6445 -12456 28706 -13913 -5034 -4392 21336 -10396
702a0396l159K6008o685q374j7921M5200k8932J289j2014L7811k5235j1349J5356
715A599R424o644k8990M1224j4319J312k6986M2523j4697j2999o17J9992J349
728A2171l5151K9390k665R244l9540L7856m233n808j7475K1439J1752l2210J3115
741b115J521K1473m3841K6122O40P775k8584J4848J8259k0956r36j986L1765l9273
755a5288J3623j571K1951l1877N535J8274o323r242r658L6917k9148M462r232
768a1577L3377k8742k714J1936Q356j1040j8725L5602j6200J290k0888L9275k0316
781c66o382o31J9501n977k5075K6498m342N679l2043L6805j0495k335j5377K3019
795H479K513k4284J2570J926J4705l7375K7813m155P295k6490J9715R120j6843
$$ plain form
702 -10396 -13555 12453 5768 -2606 -20527 24673 -4259 -2970 -14984 22827 -2408 -13757 1599
715 1599 11023 4379 -24611 16613 2294 3606 -23380 19143 4446 -8553 -9170 10822 12171
728 12171 -22980 6410 3745 12989 -26551 11305 7072 1264 -16211 5228 16980 -15230 -2115
741 -2115 -594 20879 -22962 3160 3800 11575 -17009 -2161 16098 -4858 -5794 -7780 23985 -15288
755 -15288 -1665 -3236 18715 -13162 -7627 10647 4324 -4918 -14576 22341 -6807 -2345 -11577
768 -11577 21800 -6942 -9656 2280 10636 -404 -19129 16473 273 1563 -19325 19950 -366
781 -366 -6748 -7379 12122 6145 -18930 7568 3226 8905 -23138 13667 3172 837 -14540 8479
795 8479 10992 -13292 -722 1204 15909 -21466 6347 2192 9487 -17003 2712 11832 -5011
808e011p23K106K3415l5748J6639k711J8544l1907J2655J1712n521j0545k249
821i344K9278k8414O523o611K9120l0988M386Q528P826j4610r819K9707j6716
834a134J065j5599L5562k3963p70j331J9088j1638j6289K2739m727K603k5544
847a9938L4817j4604M60j4077K4305m820j7399J1019L191Q793l1573K8098p019
860A253O591k4895K3552J887j3187j361O172J6101l2143J8148l005J5463l1472
873a6896J7964O273m327j1863L887K2362k6699P540m352K5161l1739R609N312
886B232P725j7033k825K3965j5914O35j1405L1704k5552L282k249J8705j5498
899b228r361J8810m145l5k0125L2213j6648K135j2986K5013j0100j1970R180M796
$$ plain form
808 -5011 -5734 -3628 19787 -15961 678 -2033 16511 -15396 -2741 8971 3450 -7095 -9344
821 -9344 19934 -8480 -1957 -8568 20552 -10436 -6050 2478 10304 -4306 -14125 15582 -1134
834 -1134 -69 -15668 19894 -4069 -4839 -6170 12918 1280 -15009 7730 3003 5606 -19938
847 -19938 14879 275 735 -13342 10963 6143 -11256 -237 2954 11747 -19826 8272 1253
860 1253 7844 -17051 6501 8388 -4799 -6160 12 16113 -16030 2118 -887 14576 -16896
873 -16896 1068 7341 3014 -8849 -4962 17400 -9299 -1759 -6111 19050 -12689 -3080 2232
886 2232 9957 -7076 -9901 14064 -1850 -1215 -12620 19084 -6468 -3186 -5435 13270 -2228
899 -2228 -11589 7221 3076 3041 -17084 15129 -1519 616 -12370 12643 2543 -9427 -247 4549
913D549L754k6404K7365q435N588k3212K5985l553r979k269R541R906k8285J8370
927B921k886J2702l0190K1327J811k821j2809Q373J6285k3925P601k675K1561
940A7275l0953J2928K336Q065j8419K299J8620j4055r6q150K7955k5496N773l115
954e033J8387j7993m146J5151k933k481j5531K9351j7244K846j1867K5142j3743
967i4p764P368O397n08k1685K5794q792M357k1198K6956p359p208l149J1888M912
982I915k4137J7405k487J0290k8056K2709j538j169j3314J1227J1181k0457O843
995a588j371J8318k9011J4471M3Q454j9015N867J4006j1756j116n361K4313k4400
1009h146P006l474J7756j9470k12J2022j639m728j1341K6258j6997K941j0374
$$ plain form
913 4549 8303 -18101 9264 829 6417 -16795 9190 5637 -4342 -6611 2930 12836 -15449 2921
927 2921 35 12737 -17453 3874 5685 2864 -9945 -1572 14713 -9212 -1611 -4286 17275
940 17275 -13678 -750 1586 9651 -8768 -6469 12151 -1904 -2000 -10150 17805 -7691 -1918 -5033
954 -5033 13354 -4639 -8785 6366 3433 952 -14579 14772 -2472 374 -11493 13649 -94
967 -94 -7858 -490 5907 5399 -16286 9508 716 5073 -16125 10831 3472 -3736 -6885 5003 9915
982 9915 -14222 3183 696 10986 -17070 5639 4101 2932 -10382 845 12026 -8431 -1588
995 -1588 -2959 15359 -13652 819 862 9316 -9699 -3832 10174 -1582 -2698 -8059 16254 -8146
1009 -8146 -1140 -4614 13142 -6328 -6540 5482 3843 -885 -12226 14032 -2965 -24 -10398
1022a0398K4406j6081m392N774P530l911j7132K3434q525L148j8792K6504r887
1035A678m648l925J3206R69j9777J5551j924Q187k5295K2495l809M03j3520J2928
1049B519P003j6781N521j45J5340k6477J4764j411Q583j9094Q348J0252r496k345
1063c419k742K0813k2782P390l304J6715k0102K656R533n94o532p666K3032j6083
1077c085K611q686K2898j7104j845M349Q120o199j3144K0579p738K122j6305K4823
1091A1396j0963k606m536J3589j683j5781J3187j201O432k2291K1112m964J513
1104C204j3309J3718L812j3472M065J120J2440k3678J4316k068Q148j8608J0082
1117b30P185p635l337k94J7261k0863P369k714J5088j9959M924P266J54p698m375
$$ plain form
1022 -10398 14008 -2073 -6465 -691 6839 2928 -14204 9230 705 3853 -14939 11565 1678
1035 1678 -2970 -6895 6311 7280 -12497 3054 1130 9317 -15978 6517 2708 3111 -10409 2519
1049 2519 9522 -7259 -1738 -1883 13457 -13020 1744 333 8916 -10178 -1830 8422 -1074 -3419
1063 -3419 -6161 14652 -8130 -740 -4044 12671 -7431 -4775 4758 4164 -2368 -10034 12998 -3085
1077 -3085 -474 -9160 13738 -3366 -5211 -862 7258 1059 -12085 8494 756 2878 -13427 11396
1091 11396 433 -2173 -6709 6880 5197 -10584 2603 1402 7834 -14457 6655 1691 3204
1104 3204 -10105 3613 7425 -6047 -1982 -862 11578 -12100 2216 148 8296 -10312 -230
1117 -230 6955 -680 -4017 -4311 12950 -7913 -544 -3258 11830 -8129 -3205 4061 4215 -3483 -7858
1132g858J9532j4747K273o981K0687j7169K98K960Q259p672r451J7336o701J287
1146B053j3748K2438j1257r58m888J3461l762j2024J0766l52M554j9078J9372
1159F577n559K002j2644J4162J030j0651K872K523R303k0757J3696k303P127j7632
1173a0254J1472M423o151l984K003J3619j8707P167j985J3079j9136O668N163
1186C377P07q338j579J5966j3088J970n462J8193j6461J874J719Q131q512o299
1200g802J4176n573N14j1292J9875j1059J69m880J3020n344q890Q747M59K586
1214D706j5896J7617n853J949j1493J4293j401q282K058L721O176j7750J2971
1227B816k356N766j6160J2426J889m824m258L847J0084j6297O879j445J0994j7767
$$ plain form
1132 -7858 11674 -3073 -800 -7781 12906 -4263 -3965 -1005 7254 -418 -9869 7467 766 2053
1146 2053 -11695 10743 -514 -1472 -6360 7101 3339 -8685 2081 1729 6283 -12795 6577
1159 6577 1018 3020 -9624 4538 5568 -5083 -2211 312 9615 -11142 2554 251 7378 -10254
1173 -10254 1218 5641 -510 -4494 -2491 11128 -7579 -412 -2397 10682 -8454 -1786 3377
1186 3377 4084 -4254 -5833 10133 -2955 -985 -6447 11746 -4715 -2841 -1122 7009 -1503 -7802
1200 -7802 6374 801 1315 -9977 9898 -1161 -992 -5872 7148 1804 -7086 1661 2120 4706
1214 4706 -11190 6427 574 2523 -8970 5323 3922 -4360 -2302 1419 7595 -10155 2816
1227 2816 460 6226 -9934 2492 4381 -443 -4701 -854 9230 -7067 -188 -1633 9361 -8406
1241h406P909L127J214q544P57J2441j1225J659m112J5621j5406L137O29P823
1255F624r039l513J1311m531l39q792J7329j0758R68m465J2351o810o044P176
1269A468J000N88j2661J5945o128J592r900J4100l642o125J601M525L244j4662
1283i055J2133k470M410j4317J2796l23l541m295N155O830j3722O441j076R029
1297G995j6105Q666J347J669q512K600R318r486J358k852J3180j4331M162j31
1311a122P340r495r91Q908l837j140o281J4999j0651J596l704J1513q247l416
1325d528O033J215j285r480J4373o524J283q204J3652n650m106J299N043O02j1636
1340g913J1198k633L252j2469J2879k320k263m282O198L906j1268N933o83P191
$$ plain form
1241 -8406 -497 2630 3844 -4700 -3943 8498 -2727 -1068 -5180 10441 -4965 -1828 -1199 6624
1255 6624 -2415 -5928 5383 852 513 -8279 9050 -1708 -740 -5205 7146 336 -5708 1468
1269 1468 2468 3056 -9605 6340 212 1804 -8096 6004 2362 -3763 -2162 2363 5607 -9055
1283 -9055 3078 608 5018 -9299 3497 3174 -367 -4662 493 7323 -6399 42 -1034 7995
1297 7995 -8110 556 1903 3572 -4940 -2340 6978 -2508 -1150 -4002 9178 -5153 -991 -1122
1311 -1122 6218 -3277 -4268 4640 803 -337 -6618 8381 -2270 -674 -4378 7135 -1112 -4528
1325 -4528 1505 2720 1435 -8045 6328 -196 1087 -7117 6535 885 -3221 -1922 3121 3723 -7913
1340 -7913 3285 652 3904 -8565 4314 1994 -269 -4551 1647 5553 -5715 218 -465 6726
1354F726j4501R280j98J977q495M404O461q022J055j453J0841j3546N197n63O643
1369E806j0027J543O815l470j905l718J2815j0791K300k841J0539r551r06N014
1383A623J225k877o514J2813o890J096o619J2990p280k215R65N335j549q883J0146
1398C366k723K339j0801J2710l881j158m294P057J408r098N397k28N482j3097
1412g521R846j426K048q457O136L913o882Q14K8Q571j2924O238q36N811j0510
1427e151L986M883l268k518j310J0707j0893K997k077R568j0647J404L964J248
1441B893m150l910J1238p074J030n334J2322q511n58M98N645l303o556R103k643
1456F90J490r357J2527n122k90m331P899p92p310M970L34L818j1874J0385k403
$$ plain form
1354 6726 -7775 1505 1307 3284 -5211 -807 5654 -2368 -1313 -2766 8075 -5471 -274 -837 5806
1369 5806 -4221 -2678 4137 667 -1238 -4956 7859 -2932 -632 -3473 7066 -2485 -3391 1623
1383 1623 2848 -29 -6543 6270 -620 476 -6143 6847 -433 -2648 -1683 3652 2103 -6780 3366
1398 3366 643 2982 -7819 4891 1010 -148 -4442 2615 4023 -5075 322 94 5576 -7521
1412 -7521 2325 899 2947 -5510 626 4539 -2343 -1529 -1501 7070 -5854 384 -452 5359 -5151
1427 -5151 -1165 3718 450 -2068 -3378 7329 -3564 -567 -2644 6924 -3723 -2319 1645 2893
1441 2893 -1257 -5167 6071 -1003 27 -5307 7015 -1496 -2054 -1556 4089 786 -5770 3333 690
1456 690 2180 -7177 5350 228 -62 -4393 3506 2714 -4596 374 708 4526 -7348 3037 634
1471F34J913q351P769J603n966O79J389O463j2322P161j071N004j0804O053L124
1486C278k997k968O30Q797j0713L549j598Q737j1295L203K885J460n112j868R759
1501E747o941R46m394J1693r333P69l0N990m772m560Q137k466O41q048J2372o180
1517d29L33m221Q684k900n646M633R01K063j0571J0884l317J677q128R266o37
1532B592m993N26K672M337j1481P850j353M313j0919P797J371k452l460K303O957
1547F060j0222L868j270Q048j1668M669J731J874n986j15Q352o612P54l571J1113
1562G025r965J841m20O301o123k733P232k250k26o717J2119p071Q16l984R238
1577E083m748m103M322J332M72r164J1057m054J477p726J0249k526l948L21L571
$$ plain form
1471 634 2547 -5804 1965 3568 -2398 -1719 -330 6133 -6189 972 -99 4905 -5899 154 3278
1486 3278 281 -2687 -2057 6740 -3973 -424 -2022 6715 -4580 -1377 1508 2968 -2144 -4012 5747
1501 5747 -1194 -248 -4642 7051 -2282 -1513 -1543 4447 -325 -4885 3252 786 1427 -6621 5751 -429
1517 -429 -96 -4317 4367 1467 -4179 454 1355 3418 -7153 3731 414 2091 -6037 3229 2592
1532 2592 -2401 -1875 797 5134 -6347 1503 150 4463 -6456 1341 2712 260 -3200 -897 6060
1547 6060 -4162 -294 -1564 6484 -5184 -515 1216 3090 -2896 -3011 5341 -1271 -517 -4088 7025
1562 7025 -2940 -1099 -1519 4782 -1341 -4074 3158 908 682 -6035 6084 -987 -171 -4155 5083
1577 5083 335 -3768 554 1886 2358 -6806 4251 197 1674 -6052 4197 1671 -2277 -1956 1615
1592A615K569j0409Q062j596L834j0744Q869j10j707l921L518N334r390L858j049
1607a267P438j1713N677P42K341o680J360O938o097M80k718J0380j0332K748p24
1622a427O399p221r98O313k113j015n224J1509p733J260l599R401o260k533L873
1637F32J621q67p617J0724m559J395p192J0680m023k746p7M235J070r076P783
1652A983j712L445j0358R432j340q43m395M497L799q320L605p22O702j1476O429
1667G26j10K616p174K794N435n545K24j707R277j0429L574r04O187q026P19N248
1683B905j971j660l657J0483q084J742l179R129p325r86L213J833j908n975R919
1698D479m765J359o548J0571n072j541n72M720k74p527P133j642K942r646R622
$$ plain form
1592 1615 4184 -6225 1837 241 4075 -6669 2200 2090 383 -3538 -20 5314 -4076 -218 -1267
1607 -1267 6171 -5542 135 877 3218 -3462 -2102 4836 -1261 -781 -3499 6881 -3451 -703 -1427
1622 -1427 4972 -2249 -3247 3066 953 -62 -5286 6223 -1510 -250 -3849 5552 -708 -3241 632
1637 632 2253 1386 -6231 4493 -66 1329 -5863 4817 794 -1952 -2029 2206 3276 -5800 1983
1652 1983 271 3716 -6642 2790 1450 607 -3788 709 4508 -3812 -207 -929 5773 -5703 726
1667 726 616 3232 -3942 -1148 4287 -1258 -1034 -2741 6536 -3893 -319 -1223 4964 -3062 -2343 2905
1683 2905 934 -726 -4383 6100 -1984 -242 -3421 5708 -1617 -2603 610 2443 535 -5440 4479
1698 4479 -286 1073 -5475 5096 24 -1517 -2089 2631 2357 -5170 1963 321 3263 -6383 3239
1713C239k386j01m664N375K117p071L282k57N547j0809P071r49K626p357M261
1728g6L669m910L7n53P717j0128M374j078N656q460K452L891j768k106k058R043
1744E702q019K144k750Q502p914M99K335K030k751m283Q706m636J266n789J0091
1759E133n762m58r87N009j498n869O290j457K256q551R447l235M13m585O001M24
1775B571n731L003K22M116r734P448j651K388p111N411J888m148m2M71N955r408
1791d352M889j193M921q398L798K501j420k443o16P380p537K366k308P672q085
1806b825J689J476K212l439k636P331m320J010m779R321o260M76j204N158k770
1821D40m079N457j264J255p047R092m052P61m199O503j420m235K762O84K419q275
$$ plain form
1713 3239 853 752 -3912 1463 3580 -3491 -209 -466 5081 -5728 1343 394 3020 -4337 -76
1728 -76 3593 -1317 -1280 -1833 5884 -4244 130 -948 4708 -3752 -1300 2591 823 -1283 -3341 5702
1744 5702 -2317 -173 -2923 5579 -2335 -1836 499 2529 -222 -4505 4201 -435 831 -4958 5133
1759 5133 -629 -1087 -2074 2935 1437 -4432 1858 401 2657 -5894 3553 318 731 -3854 2147 2571
1775 2571 -3160 -157 65 4181 -5553 1895 244 2632 -4479 932 2820 -1328 -1370 -899 5056 -4352
1791 -4352 537 -656 4265 -4133 -335 2166 746 -1697 -2313 5067 -2470 -104 -2412 5260 -2825
1806 -2825 -1136 340 2552 -887 -3523 3808 -512 498 -4281 5040 -1220 -744 -1948 3210 440
1821 440 -3639 1818 554 1809 -5238 3854 -198 563 -3636 2867 1447 -2788 -26 658 3077 -5198
1837e198P587k286K000o556O351M9l246j58J451M073q333N131j302M175q097M873
1853E14J149r28k798P18N677o778K356j807O743q042K686P31K330m086j006N955
1869C414l952O17l591Q377o596J230j173N084l956k307M662j119K39n382Q499
1884D046m699R49l546O666l021k781K470J084Q35o693P407k719J591n881O918
1899B626j477k308l72K296K347p105N017j207L423p651N599J6m38l140J930M063
1915C619n961K166j149N752p909L484J91K313m690N90M660l639J92k277P306o863
1931b215J874r49M803m989o24L912j039p29l671P747n143J074k868O594m281j467
1947a971K109J431n41n137O938k869J200n233P190k605j479o68L050Q55n915M687
$$ plain form
1837 -5198 2389 103 2103 -4453 1898 1947 -1299 -1457 -6 4067 -4266 865 -437 3738 -4359 514
1853 514 1663 735 -2063 -1345 4332 -2446 -90 -1897 4846 -3196 -510 221 2551 -1535 -2541 3414
1869 3414 -538 79 -3512 4865 -1731 -501 -1674 3410 -546 -2853 1809 690 929 -4453 4046
1884 4046 -653 296 -3250 3416 395 -2386 84 1168 2003 -4690 2717 -2 1589 -4292 2626
1899 2626 1149 -1159 -1531 765 3112 -3993 1024 -183 3240 -4411 1188 1204 766 -2374 -444 3619
1915 3619 -2342 -176 -1325 4427 -3482 2 193 2506 -2184 -1594 3066 -573 -381 -2658 4648 -2215
1931 -2215 -341 -1290 3513 -1476 -2100 1812 773 44 -3627 4120 -1023 51 -2817 3777 -504 -1971
1947 -1971 138 1569 1028 -4109 2829 -40 1160 -4073 3117 512 -967 -1635 1415 2270 -3645 1042
1963A042r61K676p146O088q20j19l445L052K586n205J926l90M653p685M180j82
1979B50K111n106K052L421l380j74r66O137o944K408p23M398n691Q07L173r51
1995H22j473k189O859n269J109k286O369n099m09J672J776j588l832O298k754
$$ plain form
1963 1042 81 2757 -4389 1699 879 760 -2685 367 2953 -2252 -326 -716 3937 -3748 432 250
1979 250 2361 -2745 -693 2728 -652 -826 -1792 4345 -2599 -191 -914 3484 -2207 -1400 1773 822
1995 822 -651 -2840 4019 -1250 -141 -2427 3942 -1157 -1566 106 1882 294 -3538 2760 6
$$ [...]
8191f3
##END NTUPLES=NMR FID
##END=
