##TITLE=1H_DE-80H_X3
 200.13MHz, d2o
 8 sc
 
 19ns.26.2.2025
##JCAMPDX= 6.0         $$ Bruker NMR JCAMP-DX V2.0
##DATA TYPE= NMR FID
##DATA CLASS= NTUPLES
##ORIGIN= UXNMR, Bruker Analytische Messtechnik GmbH
##OWNER= pz
$$ XWIN-NMR		Version 3.5
$$ Wed Apr 30 12:16:09 2025 Russian Standard Time (UT+4h)  Yarkov@DPX200
##.OBSERVE FREQUENCY= 200.1313
##.OBSERVE NUCLEUS= ^1H
##.DELAY= (6, 6)
##.ACQUISITION MODE= SIMULTANEOUS
##.ACQUISITION SCHEME= undefined
##.AVERAGES= 8
##.DIGITISER RES= 18
##SPECTROMETER/DATA SYSTEM= spect
##.PULSE SEQUENCE= zg30
##.SOLVENT NAME= CDCl3
##.SHIFT REFERENCE= (INTERNAL, CDCl3, 0, 14.3821)
##AUDIT TRAIL= $$ (NUMBER, WHEN, WHO, WHERE, WHAT)
$$ ##TITLE= Audit trail, XWIN-NMR		Version 3.5
$$ ##JCAMPDX= 5.01
$$ ##ORIGIN= Bruker BioSpin GmbH
$$ ##OWNER= Yarkov
$$ C:/Bruker/XWIN-NMR/data/yarkov2/nmr/H-C/1/audita.txt
$$ ##AUDIT TRAIL=  $$ (NUMBER, WHEN, WHO, WHERE, WHAT)
(   1,<2025-04-30 12:14:31.64 +0400>,<Yarkov>,<DPX200>,
      <created by zg, POWCHK disabled, PULCHK disabled
       configuration hash MD5:
       00 E9 B6 7A A2 85 ED C7 34 08 36 98 17 FE 4E 26
       data hash MD5: 16K
       AE 65 11 6C 7B 1F C5 29 A2 E2 BF 2A 45 D5 4F C5>)
$$ ##END=
$$ 
$$ hash MD5
$$ 27 92 AA 0D 47 C8 63 04 D3 93 8C F0 85 F1 F0 E6
##$RELAX= 
##$RELAX= 
##$RELAX= 
##$RELAX= 
##$RELAX= 
##$RELAX= 
$$ Bruker specific parameters
$$ --------------------------
##$DU= <C:/Bruker/XWIN-NMR>
##$EXPNO= 1
##$NAME= <H-C>
##$PROCNO= 1
##$TYPE= <nmr>
##$USER= <yarkov2>
##$AMP= (0..31)
100 100 100 100 100 100 100 100 100 100 100 100 100 100 100 100 100 100 
100 100 100 100 100 100 100 100 100 100 100 100 100 100 
##$AQSEQ= 0
##$AQ_mod= 1
##$AUNM= <au_zg>
##$AUTOPOS= <>
##$BF1= 200.13
##$BF2= 200.13
##$BF3= 200.13
##$BF4= 200.13
##$BF5= 200.13
##$BF6= 200.13
##$BF7= 200.13
##$BF8= 200.13
##$BYTORDA= 1
##$CFDGTYP= 0
##$CFRGTYP= 5
##$CHEMSTR= <none>
##$CNST= (0..31)
1 1 145 1 1 1 1 1 1 1 1 1 1 1 1 1 1 1 1 1 1 1 1 1 1 1 1 1 1 1 1 1 
##$CPDPRG= <>
##$CPDPRG1= <>
##$CPDPRG2= <>
##$CPDPRG3= <>
##$CPDPRG4= <mlev>
##$CPDPRG5= <mlev>
##$CPDPRG6= <mlev>
##$CPDPRG7= <mlev>
##$CPDPRG8= <mlev>
##$CPDPRGB= <>
##$CPDPRGT= <>
##$D= (0..31)
0 0.7 0 0 0 0 0 0 0 0 0 0.03 0 0 0 0 0 0 0 0 0 0 0 0 0 0 0 0 0 0 0 0 
##$DATE= 1746000871
##$DBL= (0..7)
120 120 120 120 120 120 120 120 
##$DBP= (0..7)
150 150 150 150 150 150 150 150 
##$DBP07= 0
##$DBPNAM0= <>
##$DBPNAM1= <>
##$DBPNAM2= <>
##$DBPNAM3= <>
##$DBPNAM4= <>
##$DBPNAM5= <>
##$DBPNAM6= <>
##$DBPNAM7= <>
##$DBPOAL= (0..7)
0.5 0.5 0.5 0.5 0.5 0.5 0.5 0.5 
##$DBPOFFS= (0..7)
0 0 0 0 0 0 0 0 
##$DE= 6
##$DECBNUC= <off>
##$DECIM= 32
##$DECNUC= <off>
##$DECSTAT= 4
##$DIGMOD= 1
##$DIGTYP= 9
##$DL= (0..7)
0 120 120 120 120 120 120 120 
##$DP= (0..7)
150 150 150 150 150 150 150 150 
##$DP07= 0
##$DPNAME0= <>
##$DPNAME1= <>
##$DPNAME2= <>
##$DPNAME3= <>
##$DPNAME4= <>
##$DPNAME5= <>
##$DPNAME6= <>
##$DPNAME7= <>
##$DPOAL= (0..7)
0.5 0.5 0.5 0.5 0.5 0.5 0.5 0.5 
##$DPOFFS= (0..7)
0 0 0 0 0 0 0 0 
##$DQDMODE= 0
##$DR= 18
##$DS= 0
$$ [...]
##$SUBNAM2= <"">
##$SUBNAM3= <"">
##$SUBNAM4= <"">
##$SUBNAM5= <"">
##$SUBNAM6= <"">
##$SUBNAM7= <"">
##$SUBNAM8= <"">
##$SUBNAM9= <"">
##$SW= 18.0517328524113
##$SWIBOX= (0..15)
0 0 2 0 0 0 0 0 0 0 0 0 0 0 0 0 
##$SW_h= 3612.71676300578
##$TD= 16384
##$TD0= 1
##$TE= 0
##$TE2= 300
##$TE3= 300
##$TEG= 300
##$TL= (0..7)
0 120 120 120 120 120 120 120 
##$TP= (0..7)
150 150 150 150 150 150 150 150 
##$TP07= 0
##$TPNAME0= <>
##$TPNAME1= <>
##$TPNAME2= <>
##$TPNAME3= <>
##$TPNAME4= <>
##$TPNAME5= <>
##$TPNAME6= <>
##$TPNAME7= <>
##$TPOAL= (0..7)
0.5 0.5 0.5 0.5 0.5 0.5 0.5 0.5 
##$TPOFFS= (0..7)
0 0 0 0 0 0 0 0 
##$TUNHIN= 0
##$TUNHOUT= 0
##$TUNXOUT= 0
##$USERA1= <user>
##$USERA2= <user>
##$USERA3= <user>
##$USERA4= <user>
##$USERA5= <user>
##$V9= 5
##$VALIST= <valist>
##$VCLIST= <CCCCCCCCCCCCCCC>
##$VD= 0
##$VDLIST= <DDDDDDDDDDDDDDD>
##$VPLIST= <PPPPPPPPPPPPPPP>
##$VTLIST= <TTTTTTTTTTTTTTT>
##$WBST= 1024
##$WBSW= 4
##$XGAIN= (0..3)
0 0 0 0 
##$XL= 0
##$YL= 0
##$YMAX_a= 258208
##$YMIN_a= -270642
##$ZGOPTNS= <>
##$ZL1= 120
##$ZL2= 120
##$ZL3= 120
##$ZL4= 120
##$ABSF1= 10
##$ABSF2= 0
##$ABSG= 5
##$ABSL= 3
##$ALPHA= 0
##$AQORDER= 0
##$ASSFAC= 0
##$ASSFACI= 0
##$ASSFACX= 0
##$ASSWID= 0
##$AUNMP= <proc_1d>
##$AZFE= 0.1
##$AZFW= 0.1
##$BCFW= 1
##$BC_mod= 2
##$BYTORDP= 1
##$COROFFS= 0
##$CY= 83.5205535888672
##$DATMOD= 1
##$DC= 2
##$DFILT= <>
##$DTYPP= 0
##$F1P= 10.8118882576601
##$F2P= -7.23987719738617
##$FCOR= 0.5
##$FTSIZE= 0
##$FT_mod= 4
##$GAMMA= 1
##$GB= 0.15
##$INTBC= 1
##$INTSCL= 1
##$ISEN= 128
##$LB= 0.25
##$LEV0= 0
##$LPBIN= 0
##$MAXI= 10000
##$MC2= 0
##$MEAN= 0
##$ME_mod= 0
##$MI= 1.114404
##$NCOEF= 0
##$NC_proc= 0
##$NLEV= 6
##$NOISF1= 3.799351
##$NOISF2= 2.8
##$NSP= 1
##$NTH_PI= 0
##$NZP= 0
##$OFFSET= 14.38212
##$PC= 1
##$PHC0= -1258.116
##$PHC1= -0.6662583
##$PH_mod= 1
##$PKNL= yes
##$PPARMOD= 0
##$PSCAL= 0
##$PSIGN= 0
##$REVERSE= no
##$SF= 200.129724274929
##$SI= 16384
##$SIGF1= 3
##$SIGF2= 2
##$SINO= 400
##$SIOLD= 16384
##$SREGLST= <1H.CDCl3>
##$SSB= 0
##$STSI= 0
##$STSR= 0
##$SW_p= 3205.1282051282
##$SYMM= 0
##$S_DEV= 0
##$TDeff= 0
##$TDoff= 0
##$TI= <>
##$TILT= no
##$TM1= 0
##$TM2= 0
##$TOPLEV= 0
##$USERP1= <user>
##$USERP2= <user>
##$USERP3= <user>
##$USERP4= <user>
##$USERP5= <user>
##$WDW= 1
##$XDIM= 8192
##$YMAX_p= 0
##$YMIN_p= 0
$$ End of Bruker specific parameters
$$ ---------------------------------
##NTUPLES= NMR FID
##VAR_NAME=  TIME,          FID/REAL,        FID/IMAG
##SYMBOL=    X,             R,               I
##VAR_TYPE=  INDEPENDENT,   DEPENDENT,       DEPENDENT
##VAR_FORM=  AFFN,          ASDF,            ASDF
##VAR_DIM=   8192,          8192,            8192
##UNITS=     SECONDS,       ARBITRARY UNITS, ARBITRARY UNITS
##FACTOR=    0.0002768,     1,               1
##FIRST=     0,             0,               0
##LAST=      2.2672688,     0,               0
##MIN=       0,             -270642,         0
##MAX=       2.2672688,     258208,          0
$$ Real data points
##PAGE= N=1
##DATA TABLE= (X++(R..R)), XYDATA
0@%%%%%%%%%%Qj6J6j6K4l2M0n6P2q8J04j26J51j78K15k55K98l50M09m75N47o27
32c35P18q20R32j054J189j339J504j683J880k097K335k594K875l183L518l883
48b037M283m718N195n720O294o928P633q416R291j0277J1400j2695J4201j5983
62h477J8136k0803K4219k8803L5392m5968O7150j79380J78372J44156k11751j96341
74b24098L35063P7090l60778P3064K23259L8342m32584K97175J06257o3219l36769
85b67198L67869N2449k25495r8372K91593L8083l61167J61556J62672r282l69110
96b56402L15751P5341j31193k15671L16109M8685k84526L0623K12345K9183l68139
107b27894K40808J03860m8780l04183L18868N2977j90098j03945K61734M2570
$$ plain form
0 0 0 0 0 0 0 0 0 0 0 0 8 -8 8 -8 16 -16 24 -32 40 -48 56 -70 81 -97 118 -137 161 -189 220 -255 292 -335
32 -335 383 -437 495 -559 630 -709 795 -888 992 -1105 1230 -1364 1511 -1672 1846 -2037
48 -2037 2246 -2472 2723 -2997 3297 -3631 4002 -4414 4877 -5400 6000 -6695 7506 -8477
62 -8477 9659 -11144 13075 -15728 19664 -26304 40846 -138534 39838 183994 -27757 -224098
74 -224098 110965 188055 -172723 -99659 123600 161942 -270642 26533 132790 69571 -267198
85 -267198 100671 153120 -72375 -170747 120846 158929 -202238 -40682 121990 112708 -256402
96 -256402 59349 134690 3497 -212174 103935 152620 -131906 -101283 111062 140245 -227894
107 -227894 12914 116774 67994 -236189 82679 135656 -54442 -158387 103347 145917
117A45917l20558J31297J48089N669l40859K79249O6814r9095k12610K85660M4791
128A34364k39820P303J92359L4830l24894K01146R1364k6000k78961K76286M5562
139A13539j48127j08515K28096M2121k69122R8313J28474J8072k99692K34033
149C7192N7864o9792j98624K47115M1328j96430j1214J71758L6975k82286J63519
160b595Q5590j3180k54999K40672M4165j21212j11970K07169M0799k33976P2957
171d6580J20857K2737k71267K02263N4649n1395j89796K21847L7292j64069k4101
182h7563J54595L8079k46753J35402P3689J946k32306K09116L5447r0061j11708
193a20117J81141L7288j94471N2083J03360K9712k37580J70007M4964l0410j76207
$$ plain form
117 145917 -174641 -43344 104745 110414 -230445 48804 115618 16523 -196087 89573 134364
128 134364 -105456 -98153 94206 129036 -195858 5288 96652 70652 -208309 67977 113539
139 113539 -34588 -143103 84993 127114 -142008 -43695 84779 102851 -196841 37192
149 37192 95056 25264 -173360 73755 115083 -81347 -92561 79197 116172 -166114 -2595
160 -2595 82995 69815 -185184 55488 99653 -21559 -133529 73640 114439 -119537 -46580
171 -46580 74277 97014 -174253 28010 82659 31264 -158532 63315 100607 -63462 -87563
182 -87563 67032 105111 -141642 -6240 67449 69395 -162911 46205 81652 -8409 -120117
193 -120117 61024 98312 -96159 -44076 59284 88996 -148584 21423 66387 35977 -140230
204a40230J92852L2788j32514l4573J38482L6960k13657J09254O8647Q122k10444
215a44313J81688L4199p2385j10663J64649L4694j67783L4326R8471K8954k12140
226a30303J45046M3217k0455j64067J71327K8989j08265m1942J24746L4854j83734
237a00587Q7970N9611J5897j88496J56886K5975n0009j06554J43833K9282j36415
248f2607K0423Q4349L1621j84713J22385L4314o751j51342J51024K2607q5223
259b3913m6850J12673L1296j58423P0646N5431J7829j70738J38307K3861l9395
270A0724j02857J32416K4740j16884R787Q0838K7336j62895J04019L3261l017
281C7468j38202J34462J8595o8790m8809J02302K5777j33386N5609M8745J9281
$$ plain form
204 -140230 52622 85410 -47104 -81677 56805 93765 -119892 -10638 58009 66131 -144313
215 -144313 37375 71574 -811 -111474 53175 87869 -79914 -45588 52883 81837 -130303
226 -130303 14743 57960 37505 -126562 44765 73754 -34511 -76453 48293 83147 -100587
237 -100587 -12617 46994 62891 -125605 31281 57256 7247 -99307 44526 73808 -62607
248 -62607 -42184 42165 73786 -110927 11458 45772 39021 -112321 38703 61310 -23913
259 -23913 -70763 41910 73206 -85217 -14571 40860 58689 -112049 26258 50119 10724
270 10724 -92133 40283 65023 -51861 -42074 38764 66100 -96795 7224 40485 37468
281 37468 -100734 33728 52323 -16467 -65276 37026 62803 -70583 -14974 33771 53052
292E3052j49467J18765J7281k5200r6073J16716J8181r3217J480P0768K5499j40084
304h2299Q8248K6059M582j26378J20323J2287n2697n0970R4676K0817j15081M4950
316a5483M5800J8418j35858J07159J4479j8648r2280J09582J3318p9531m912O8749
328C0793K0497j23791P6114K5178N204j14835J08389Q562m1593n0531Q6771J5442
340D6200r5956L4187M1668J6873j17909R2156J0403j0739q4683R7529P886o2567
352b4952j0178O2227J7000j05860O4183K1634P913j04830R8552M249l1816n1101
364e2979Q2656J0246q2941K6953M0870J4487j08177Q4846Q759p448q1969R4109
376B9412L338n3387j4162O1630J2164r4070N6220K0764P738r6102R0362J111k4140
$$ plain form
292 53052 -96415 22350 39631 14431 -81642 35074 53255 -39962 -38482 32286 57785 -82299
304 -82299 5949 32008 36590 -89788 30535 42822 -9875 -60845 33831 54648 -60433 -15483
316 -15483 30317 48735 -87123 20036 34515 15867 -76413 33169 46487 -33044 -37956 30793
328 30793 51290 -72501 3613 28791 33995 -80840 27549 36111 -5482 -56013 30758 46200
340 46200 -49756 -15569 26099 42972 -74937 17219 27622 16883 -67800 29729 37615 -24952
352 -24952 -35130 27097 44097 -61763 2420 24054 31967 -72863 25689 29938 -1878 -52979
364 -52979 29677 39923 -43018 -16065 24805 39292 -68885 15961 24720 17272 -64697 29412
376 29412 32750 -20637 -34799 26831 38995 -55075 1145 21909 29647 -66455 23907 25018 878
389H78n0134P7084N499o8765J9687L7759J2184r3605P3208O212k838p4871Q4430
402B6728k66m1688j7328N7258Q401q0176M7022J9594P433q7041Q2256q46j8672
415B675m9658P4371J527n9750J4229L8784Q661q5893O7783N906j821p2262Q2158
428B6710l745l5153k0338N7452M189p1248M1113J9142O995q0451P6486l755j2616
441D781m8849P0105k356m8588Q590L6287P024p4818N8882M154J296o6537P4670
454B4641o248k6771k2369N4168J272o0815L3791J9426N539p3031O9721l590j0415
467E319m7675O8165n031m2704M664L8074L300o8490N3905N691M47o3904P2564
480B4325p999k2708k4501N4648k170n3767K8817J9529M915o7576O4711n544n479
$$ plain form
389 878 -49256 27828 33327 -35438 -15751 22008 34192 -59413 13795 20007 17169 -57702 26728
402 26728 26462 -15226 -32554 24704 33105 -47071 -49 19545 26978 -60063 22193 21347 2675
415 2675 -46983 27388 28915 -30835 -16606 22178 30839 -55054 12729 18635 16814 -55448 26710
428 26710 22965 -12188 -32526 24926 29115 -42133 -1020 18122 25117 -55334 21152 17397 4781
441 4781 -44068 26037 23681 -24907 -16317 19970 26994 -47824 11058 15212 16508 -50029 24641
454 24641 18393 -8378 -30747 23421 24693 -36122 -2331 17095 22634 -50397 19324 15734 5319
467 5319 -42356 25809 20778 -21926 -17262 20812 24112 -44378 9527 15218 15665 -48239 24325
480 24325 16326 -6382 -30883 23765 21595 -32172 -3355 16174 21089 -46487 18224 12680 7201
493G201m7378O4808p916l3788r1L6156K230n9893M6895M070L450n9832O6644r679
507A2877j6195k6390N2293m185m6065K3104K0212L501o1916N9294m608m636m6058
520c8772O2915r107l0042l156L8073r17n4886M2407O511J493n6678O3830r903
533A1768j3790k7504N2053o530m0195J8469K0828K527n6645N4129n431j048m5247
546c6616N9493j1247k2475p235L6345j717m7494L6144N506L935n3504N9173j1410
559H898q310k9325N0439q274l3981J3768K1543J395n2319M9853m400o13m4320
572c5646N8165j1994j9885r505L7925m293m3376L2226P832K007n0282N5810j0538
585H446p085k9544M9355r602k9120R761K1961M70m7001M4262m236J786m2587N3877
$$ plain form
493 7201 -40177 24631 16715 -17073 -17164 18992 21222 -38671 8224 12294 15744 -44088 22556 12877
507 12877 -3318 -29708 22585 18400 -27665 -4561 15651 19152 -42764 16530 11922 7286 -38772
520 -38772 24143 15036 -15006 -18162 19911 18994 -35892 6515 13026 14519 -42159 21671 11768
533 11768 -2022 -29526 22527 15997 -24198 -5729 15099 17626 -39019 15110 9679 8631 -36616
546 -36616 22877 11630 -10845 -18080 18265 16548 -30946 5198 10704 14639 -38865 20308 8898
559 8898 588 -28737 21702 13428 -20553 -6785 14758 16153 -36166 13687 9287 8674 -35646
572 -35646 22519 10525 -9360 -18865 19060 14767 -28609 3617 11449 13456 -36826 18984 8446
585 8446 1361 -28183 21172 11570 -17550 -7789 14172 14642 -32359 11903 7667 9453 -33134 20743
599B0743j2777j3824j2837L6241m892l6894K6580P327L658m7120N1393j1398k724
612C476l1052M8124j1063k4019N675K3013p53m3542M0928l357K104m2090N3145
625B0589j3545j1668j4858L7700o962l3540K3181R460J945m4303M8364j0525j795
638D043l0818M6431j1581j9988K271K3102j417l8545L5347k564L558l9642M8295
651A8492j3290p182j6957L5544p102k7894J7957R522K807m0947M3786j0290R74
664E420l1461M5058j2565j5963j047K4115k629l5533L2365j457L485l9129M7715
677A8374j3915n369j8776L6942r017k4910J5061J1096J623l8489M0967r626K118
690F079l1306M3323j2925j2302l935K3782l004l0902K7230q04M669l6383M2642
$$ plain form
599 20743 7966 -5858 -18695 17546 12654 -24240 2340 9667 13325 -33795 17598 6200 3476
612 3476 -27576 20548 9485 -14534 -8859 14154 13401 -30141 10787 7430 9534 -32556 20589
625 20589 7044 -4624 -19482 18218 11256 -22284 897 10357 12302 -32001 16363 5838 4043
638 4043 -26775 19656 8075 -11913 -9642 13460 12043 -26502 8845 6281 9839 -29803 18492
651 18492 5202 -1980 -18937 16607 9505 -18389 -432 9090 11897 -29050 14736 4446 5420
664 5420 -26041 19017 6452 -9511 -10558 13557 10928 -24605 7760 6303 9788 -29341 18374
677 18374 4459 -910 -19686 17256 8239 -16671 -1610 9486 11109 -27380 13587 3961 6079
690 6079 -25227 18096 5171 -7131 -11066 12716 9712 -21190 6040 5236 9905 -26478 16164
703A6164j3065j941j9990L4387q704k0194J0604J1334J757l4810L6334q664L474
716F686l0813M1321j3066r529o389K4770m444k8026K4412P26L799l5293M1757
729A5911j3291p16k1285L5495j0458j7395P884J2882N47l2469L3766q158M600
742G313l0666L9783j3603n982r050K4359m677k3881J9838J221M872l2818L7240
755A3949j2477K063k2001L3030j0038j3566M323J3001N34k9131K9489o644M799
768G331k9438L7509j3035m580j0320K4885n836k1517J7366K993L395l1141L5734
781A3346j1812K231k2370L3430j1173j1345K067J4273o74k6619K6790o062N739
794G821k9017L5726j3366j314j2716K4436o161j7566J3233L277M430k8874L1804
$$ plain form
703 16164 3099 1158 -18832 15555 6851 -13343 -2739 8595 10352 -24458 11876 3212 6686
716 6686 -24127 17194 4128 -5401 -11790 12980 8536 -19490 4922 5648 9447 -25846 15911
729 15911 2620 1904 -19381 16114 5656 -11739 -3855 9027 9574 -22895 10871 2713 7313
742 7313 -23353 16430 2827 -3155 -12205 12154 7477 -16404 3434 4655 9527 -23291 13949
755 13949 1472 3535 -18466 14564 4526 -9040 -4717 8284 8818 -20313 9176 2532 7331
768 7331 -22107 15402 2367 -2213 -12533 12352 6516 -15001 2365 5358 8753 -22388 13346
781 13346 1534 3765 -18605 14825 3652 -7693 -5626 8647 7973 -18646 8144 2082 7821
794 7821 -21196 14530 1164 -150 -12866 11570 5409 -12157 1076 4353 8783 -20091 11713
807A1713j1309M787k2988L1307j0886q018r60J4470q92k3697K3225m655N469k7523
821a9957L3533j2568o60j3296K4641o972j5812J1198N117K584k6838K9883r991
834H62M077k2426L0854j1247o524k625J5377j939k1186K0327l628N762k6480L1330
848A2534j2433J915j5054K3921p188j2212P469N499L252k4654K6406r535O173
861F093k2883K9215j1293l615n166J5738k463j8614J7434k399N297k5185K9702
874A1861j1788K142j5297K4220q060j0850N986P059J444k2655K4523q031M979
887E533k1726K8202j1082k799o099J6109l255j6268J4722j302N078k3435K6874
900A0552j0990L820j6161K2977p926p838K841P399J708k0292K1156p350O396k1738
$$ plain form
807 11713 404 5191 -17797 13510 2624 -5394 -6354 8116 7224 -16473 6752 2097 7566 -19957
821 -19957 13576 1008 348 -12948 11693 4721 -11091 107 5224 7808 -19030 10853 862
834 862 4939 -17487 13367 2120 -4404 -7029 8348 6409 -14777 5550 1922 7684 -18796 12534
848 12534 101 2016 -13038 10883 3695 -8517 -1048 4451 7703 -16951 9455 -80 6093
861 6093 -16790 12425 1132 -2483 -7649 8089 5626 -12988 4446 2047 7344 -17841 11861
874 11861 73 2215 -13082 11138 3078 -7772 -1786 5273 6717 -15938 8585 554 5533
887 5533 -16193 12009 927 -1872 -7971 8138 4883 -11385 3337 2035 7113 -16322 10552
900 10552 -438 3382 -12779 10198 2272 -5566 -2725 4674 6382 -13910 7246 -104 6292 -15446
914a5446K6622j1101l86q198J6590m010j3956J2288j07M383k2283K5740j0628
927d92L967j6372K3441q840o677J585Q883Oj8577J9600o020N233k0557K5515j0670
942B5R4q757J6569m395j1991R813R62M046k0379K2681r305M793j6416K1675q202
957A213m442q49R009K06j6354J6421m953N752j9926K3743j0290J598j0089J6916
971G955n166j0060P819K224L000j9146K1713q867M609j6486K2297r242l431j865
985d646J0411j508j4733J5087l859M791j8915K2813r993K086j0552J6832n537
998B277q270N676L042K708j7296J8838p594N111j6085K0257q257j873l609J0287
1012E212j322j2735J2273k712M725j7784K0819r119K654j1060J6788n965o941
$$ plain form
914 -15446 11176 75 -311 -8509 8081 4071 -9885 2403 2296 6679 -15604 10136 -492
927 -492 3475 -12897 10544 1704 -4973 -3388 5495 5501 -13076 6524 504 5737 -14820 10695 25
942 25 119 -8638 7931 3536 -8455 1358 2320 6366 -14013 8668 -637 4156 -12260 9415 1213
957 1213 -3229 -4078 4931 5137 -11217 5204 251 6003 -13923 9820 -470 1128 -8961 7955
971 7955 2789 -7271 548 2772 5772 -13374 8339 -528 4081 -12405 9892 650 -2781 -4646
985 -4646 5765 4257 -10476 4611 752 5543 -13372 9441 -552 1534 -9018 7814 2277
998 2277 -5993 -317 2725 5433 -11863 6975 -619 4492 -11593 8664 407 -1466 -5075 5212
1012 5212 3890 -8845 3428 716 5441 -12343 8476 -643 2011 -9049 7739 1774 -5167
1025e167M204M280J417j5994J7864o874M445j5784K0662r028j180m431J1578k849
1039C143j1348J1037j613L813j6911J9980q873L245j1653J6770o284n256K181
1052a769M992J282j4436J5302n712M913j5451J8807q058K9n746J1302k546r768
1066f859Q665m96L526j5732J8050p690L055j1493J6393o337m595J297O023L5j3231
1081i389J4335m715L781j4707J8740q249J26o112J2251l770q599P542N50K666
1095D450j4847J7095p286L541j2025J6256o480l090n81O668l1j1854J2048l767
1109I7M348j4568J7230p469J258p356J2064l486p341N609J522K314j3805J5480
1123E897o195L161j1693J5820o334k903r99P435j079j0907J1243k651K959j3550
$$ plain form
1025 -5167 -963 3317 4734 -11260 6604 -270 4175 -11609 9053 25 -1155 -5586 5992 3143
1039 3143 -8205 2832 1219 5032 -11879 8101 -772 2473 -9180 7590 1306 -3950 -1769
1052 -1769 3223 4505 -9931 5371 -341 4572 -10879 7928 -130 -101 -5847 5455 2909 -6859
1066 -6859 1806 1310 4836 -10896 7154 -536 2519 -8974 7419 1082 -3513 -2216 3807 3842 -9389
1081 -9389 4946 231 4012 -10695 8045 -204 -78 -6190 6061 2291 -6308 1234 1784 4450
1095 4450 -10397 6698 -588 2953 -9072 7184 704 -2386 -2967 3701 3670 -8184 3864 97
1109 97 4445 -10123 7107 -362 896 -6460 5604 2118 -5223 386 1908 4222 -9583 5897
1123 5897 -298 2863 -8830 6990 656 -2247 -3246 4189 3110 -7797 3446 795 3754 -9796
1137i796J6807p177Q71p273J2533m211o545M643K481J546j2895J4319n489L353
1151C167j1949J5414o208j658k699P988j045r720R134j734L494j3509J5520o504
1165c09J888q489J2583m136n382K941L392J223j2163J3138m594K966j1715J5213
1179F556o136j626k949Q676j941r048Q551p49K238j2604J5020n927J224q159J2647
1194E773m319n020K218M145O81j1338J1821l657K968j1725J4387n505p99m294
1208d664Q894j638q063O564J47K697j2488J3737n227K093r212J2663m221m043
1222b761P17N018L33j0723J0928k980K648j1633J4430n578p13m626R647k459p549
1237e301O098J008J664j1813J3346m703J538q974J2602m176l797Q7N494J85j0099
$$ plain form
1137 -9796 7011 -166 705 -6568 5965 1754 -4791 -148 2333 3879 -9016 5303 -186 3167
1151 3167 -8782 6632 424 -1234 -3933 4055 3010 -6710 2424 690 4184 -9325 6195 -309
1165 -309 1579 -6910 5673 1537 -3845 -904 2488 3711 -8452 4686 92 3058 -8657 6556
1179 6556 420 -1206 -4155 4521 2580 -6468 2083 1334 3572 -9032 5988 61 1285 -6874 5773
1194 5773 1454 -3566 -1348 2797 3478 -7860 3961 304 3272 -8453 5934 429 -370 -4664
1208 -4664 4230 2592 -5471 1093 1240 3937 -8551 5186 -41 2052 -7160 5503 1282 -2761
1222 -2761 -2044 2974 3307 -7416 3512 532 3180 -8453 5977 399 -314 -4940 4707 2248 -5301
1237 -5301 797 1805 3469 -8344 5002 299 1837 -7137 5465 1289 -2508 -2421 3073 3258 -6841
1252f841R585k018K649j1477J3259m604j83n625R451j814o797M320J791K095j1579
1267g788J1918l805K094r674J2384l921l067j097O207j69r521Q770j375K355j1450
1282h139J3416m781m8n978J0214k666o261L860K532J279j1080J1646l467J831
1296B358r655J2371l889k715j808O589j89q950P494n81K525j1309J2175l761M11
1311A066o800R815j834n712K361L090J710j0776J0247k538K124j0001J1922l453
1325A221k282k640P066m33q480O805L8K084j1107J2219l852M56p065J0479k611
1340A898n165J861L785J014j0326R950k299K123j0176J1941l482j699l540P424
1354C309l67p883N492O90K518j1149J1087l001J068p864R988j784m640N30M140
$$ plain form
1252 -6841 2744 726 3375 -8102 5157 553 370 -5255 4196 2382 -4415 -95 1696 3791 -7788
1267 -7788 4130 325 2419 -7255 5129 1208 -1859 -2956 3251 3082 -6439 2331 956 3311 -8139
1282 -8139 5277 496 448 -5530 4684 2018 -4243 -383 2149 3428 -7652 3994 527 2358
1296 2358 -7297 5074 1185 -1530 -3338 3251 3062 -5888 1606 1025 3550 -7759 4416 655 1066
1311 1066 -5734 4081 2247 -3465 -1104 1986 3696 -7080 3167 629 2753 -7248 4674 1221
1325 1221 -1061 -3701 3365 2932 -5548 1257 1295 3379 -7728 4491 639 1095 -5970 4509 1898
1340 1898 -3267 -1406 2379 3393 -6933 3017 718 2841 -7335 4606 1124 -575 -4115 3309
1354 3309 2942 -4941 551 1241 3759 -7390 3697 696 1764 -6100 3888 2104 -2536 -2006 2134
1369B134J544j0060Q643j464K299j0259J1287k910j515l996P597m68p525M990
1383B97J173K053j0783J0922k892R12p887J0357k316m201J35M664R76r563Q194
1398B041j205K388j0410J1208k958p61m999P908m01o792L593J712K581j0798R881
1413B988k305J729q769R972j722l485j186M952J404r202P055n94K578j0413J0624
1428C626k525o16n253P965n09o502L276K077K078j0327R654k149J411q487J0032
1443C751k011l233j409N301R45q696O548l10K620j0408J0311k432P5o139Q116
1458C029m12n716J918K546K586j0250Q574j670K323r355R764j712k325k698N605
1473B207J189q225N501J60K835j0396R918k275L06o357Q231o67n358J665K824
$$ plain form
1369 2134 3678 -6382 2261 797 3096 -7163 4124 1214 -301 -4297 3300 2832 -4693 297
1383 297 1470 3523 -7260 3662 770 1682 -6205 4152 1836 -2365 -2230 2434 3410 -6153 2041
1398 2041 836 3224 -7186 4022 1064 303 -4696 3212 2811 -3981 -388 1324 3905 -6893 2988
1413 2988 683 2412 -6357 3615 1893 -1592 -2778 2174 3578 -5624 1431 837 3415 -6998 3626
1428 3626 1101 485 -4768 3197 2688 -3814 -538 1539 3617 -6710 2944 795 2206 -6281 3751
1443 3751 1740 -1493 -2902 2399 3344 -5352 1196 886 3506 -6902 3409 977 1052 -5087 3029
1458 3029 2617 -3099 -1181 1365 3951 -6299 2275 605 2928 -6427 3337 1625 -700 -3398 2207
1473 2207 3396 -4829 672 832 3667 -6729 3189 914 1220 -5137 3094 2427 -2931 -1266 1558
1488A558K068r741Q391j564J979q980R676j844k211k764N734Q99p729M959M31
1503H62K835j0204R347j987Q23o990Q101l83m625L90L182K538r520P247j094K785
1519C307r642R340j630j263l976O059R60p141M011Q00K968j0135R087k042J165
1534A868p258Q366q84m105J10L465J992r003P089j062K519r283R230j809j077
1549A58m019O076P74o690L460J043L026r869Q362j652J575p634P920m00l527r39
1565b336L639K443q654N952o12L117r623Q724j532l33m937O270P17o024K611J378
1581H00K972r611Q128j803J874p826Q281j097k898j262M005J752q032N772n99
1596D56K910r333Q734j856Ln115O382M53n479K022J585L041r297P351j411K274
$$ plain form
1488 1558 3626 -6115 2276 712 2691 -6289 3387 1543 -668 -3432 2302 3201 -4528 431 862
1503 862 3697 -6507 2840 853 1676 -5314 2787 2404 -2221 -1831 1351 3889 -5631 1616 522 3307
1519 3307 -6335 3005 1375 112 -3864 2195 3155 -3986 25 825 3793 -6342 2745 703 1868
1534 1868 -5390 2976 2092 -2013 -1903 1562 3554 -5449 1640 578 3097 -6186 3044 1235 158
1549 158 -3861 2215 2989 -3701 -241 802 3828 -6041 2321 669 2244 -5390 2530 2130 -1397 -2336
1565 -2336 1303 3746 -4908 1044 432 3549 -6074 2650 1118 785 -4152 2118 2835 -3189 -578 800
1581 800 3772 -5839 2289 486 2360 -5466 2815 1718 -1180 -2442 1563 3315 -4717 1055 456
1596 456 3366 -5967 2767 911 914 -4201 2181 2634 -2845 -823 762 3803 -5494 1857 446 2720
1612B720q106P775o33k359k158M052K198p681M705j71L305r384Q079j498M98n676
1628d334O390M13m905J362J871K826q894P108j499K355q085Q039j278j797k426
1643b854M456J423o981M472j27L083r111Q091j832R22n973O574Q1m210O19K141
1659G74K862q548O321j155K792q360P551q82j241l244M445J817o602L496K58L361
1675C645r001P389j453J210o194O402R2l791K23K310K569q036O037j164K647q073
1691e188P628j386q66l298M709J079n905L250L63L021q588P280j726J619o498
1706d506O599l01l011n85K640K509p587N222q69L100q346P236j155j95m144M802
1722A409J256n372K307P12L202q405O662j443J804o559O416l42k666q22K744K158
$$ plain form
1612 2720 -5386 2389 1756 -603 -2761 1291 3489 -4192 513 342 3647 -5737 2342 844 1342 -4334
1628 -4334 2056 2469 -2436 -1074 797 3623 -5271 1837 338 2693 -5392 2647 1369 -428 -2854
1643 -2854 1602 3025 -3956 516 389 3472 -5639 2452 620 1542 -4431 2143 2224 -1986 -1367 774
1659 774 3636 -4912 1409 254 3046 -5314 2237 1355 114 -3130 1315 3132 -3470 26 284 3645
1675 3645 -5356 2033 580 1790 -4404 1998 2090 -1701 -1478 832 3401 -4635 1402 238 2885 -5188
1691 -5188 2440 1054 188 -3110 1599 2678 -3227 23 386 3407 -5181 2099 373 1992 -4506
1706 -4506 2093 1792 -1219 -1804 836 3345 -4242 980 111 3211 -5135 2101 946 751 -3393 1409
1722 1409 2665 -2707 -400 312 3514 -4891 1771 328 2132 -4427 1989 1647 -1019 -1841 903 3061
1738C061p076N011q39K765p832P154j483o9l995M922O63m809K106Q43K807p908
1754d679O414j516K026o680O447o01j990j572L077K059o568M133m61L120q049
1769d840O795j324N95m801N103O59m190J182J242K816p619N887j343K202o754
1784d390O403p91j641j743L221J602o046L984m35K715p493O662j549N82m508N098
1800A671K19l774J068J331K466p130N532j265K275o710O235q12j152k377L441
1815A018J608n590L132k5K952p563O205j328J138n206N259J59l132J84J749K356
1831B916o786N050j112K384o721O259j138p54k548L679R91m983K963M7K494p007
1847d266O115j549J104m924N244k05k795R2J851K037o321M645r15K337o589N940
$$ plain form
1738 3061 -4015 996 157 2922 -4910 2244 761 692 -3303 1619 2282 -2527 -421 422 3229 -4679
1754 -4679 1735 219 2245 -4435 2012 1411 -579 -2151 926 2985 -3583 550 89 3209 -4840
1769 -4840 1955 631 1226 -3575 1528 2187 -2003 -821 421 3237 -4382 1505 162 2364 -4390
1784 -4390 2013 1222 -419 -2162 1059 2661 -3385 599 164 2879 -4614 2048 499 1081 -3427 1671
1800 1671 1890 -1884 -816 515 2981 -4149 1383 118 2393 -4317 1918 1106 -46 -2423 1018
1815 1018 2626 -2964 168 143 3095 -4468 1737 409 1547 -3659 1600 1759 -1373 -1189 560 2916
1831 2916 -3870 1180 68 2452 -4269 1990 852 98 -2450 1229 2220 -2763 200 247 2741 -4266
1847 -4266 1849 300 1404 -3520 1724 1519 -1276 -1184 667 2704 -3617 1028 113 2450 -4139 1801
1863A801r50m69l000L754J103m619K161M66K651o982N561j192J454n397N292k33
1879A401k277o33K248J817n924M222p45K310o507N998j321p1l185M072M17l989
1895b167J962O02K159o453N516j423J427n198N369o37j900q04K402J531n504L782
1911F64n09K277o400N638j049J27l560M047O71l753J271R62K295o378M917r84
1927B36J621n455N206m65j580j324K656J350n114L387l20K129o171N611j325L57
1943G99l606M319Kl167J073J139J775n845M823j147J599n326N338q92j140j630
1959a886K897J070m684K872l5K148o131N236j013N93m034M291K75k944M28J436
1975E19J954n760M227p10J700n453N072o41r81j908K978R76m367K566J10J947
$$ plain form
1863 1801 851 382 -2618 1136 2239 -2380 -219 247 2898 -4084 1477 285 1739 -3658 1634 1401
1879 1401 -876 -1509 739 2556 -3368 854 109 2419 -4088 1910 589 518 -2667 1405 1822 -2167
1895 -2167 -205 397 2556 -3897 1619 196 1623 -3575 1794 1157 -743 -1547 855 2386 -3118 664
1911 664 155 2432 -3968 1670 621 748 -2812 1235 1906 -1847 -576 386 2681 -3697 1220 236
1927 236 1857 -3598 1608 1143 -437 -1761 895 2245 -2869 518 198 2327 -3844 1767 442 799
1943 799 -2807 1512 1514 -1653 -580 559 2334 -3511 1312 165 1764 -3562 1776 884 -256 -1886
1959 -1886 1011 2081 -2603 269 234 2382 -3749 1487 474 1067 -2967 1324 1599 -1345 -917 519
1975 519 2473 -3287 940 230 1930 -3523 1549 908 -73 -1981 997 1973 -2394 172 282 2229
1991B229n800N111j188O53l879M380k35k482L02J565J463n205M059p96J662n296
2007c457N098r42n55k277L228P09l899J988M28J991n759M723r12R57m352M386
2023A355n0k151m02J880J600n088L492m18J773n378M836p34m32k450L229O39l623
2040a922J769N03J762n378M556r94Q98m074M325l81j842l88J891J210m602L309
2056F42m29J661n148M721q75r3k753L379M85l212J164Q59J785n291M104p13J226
2073A512m544M320k15j483j105K211J293m398K728j03J762n166M479p59Q5k909
2089b292L376L45k888J009Q44J608m906L929q11J145m175M152m64j249j008K116
2105G31J043m004K561j31J696m908M228p50K90l084L349L77k583M74J099J694
$$ plain form
1991 2229 -3571 1540 352 1005 -2874 1506 1271 -1211 -909 656 2119 -3086 973 177 1839 -3457
2007 -3457 1641 699 144 -2133 1095 1804 -2095 -107 321 2312 -3447 1276 364 1321 -3031 1355
2023 1355 1305 -846 -1248 632 2232 -2856 636 218 1991 -3387 1449 715 283 -2167 1062 1701 -1922
2040 -1922 -153 350 2112 -3266 1290 296 1194 -2880 1445 1064 -778 -1166 725 1935 -2667 642
2056 642 213 1874 -3274 1447 572 479 -2274 1105 1590 -1622 -458 401 2186 -3105 999 286 1512
2073 1512 -3032 1288 1073 -410 -1515 696 1989 -2409 319 216 1978 -3188 1291 532 617 -2292
2089 -2292 1084 1429 -1459 -450 394 2002 -2904 1025 214 1359 -2816 1336 872 -377 -1385 731
2105 731 1774 -2230 331 200 1896 -3012 1216 466 756 -2328 1021 1398 -1185 -711 388 2082
2121B082m804L423m78J402m532M056k93q74j664K396J046l696J962J75J768m880
2137b911M010p40N38l226L384J08k158K82J124J426m345L277o43J360m181L889
2153A194n38o52j541K254Q55l336J794J29J728m622L711o46O56l299L230K65j949
2170g67j47J260J596m249K761l17J565m402L691l29l53k064K418Q75l025J296
2186a91L48J723m452L478p03Q98l374L270r8j460l38J320J219l726K604m85J516
2203A549m055L594o61n2k019K339N99k618J104L37J672m208L204o32J042l437
2219b242L075R3j286o93J380J406l633K147k12J675m165L308m12J49k335K371
2235F26O35k338P23M68J625l957K953o94J179l377L085k89q24q22J417R92l063
$$ plain form
2121 2082 -2722 701 223 1625 -2907 1149 856 -18 -1682 714 1760 -1936 26 201 1969 -2911
2137 -2911 1099 359 897 -2329 1055 1163 -995 -713 411 1837 -2508 769 126 1486 -2695 1194
2153 1194 656 4 -1537 717 1572 -1764 30 159 1887 -2735 976 330 986 -2313 917 1182 -767
2170 -767 -914 346 1942 -2307 454 137 1702 -2700 991 662 309 -1755 663 1538 -1487 -191
2186 -191 157 1880 -2572 906 203 1101 -2273 997 899 -561 -899 421 1640 -2086 518 33 1549
2203 1549 -2506 1088 427 375 -1644 695 1294 -1324 -220 117 1789 -2419 785 153 1195 -2242
2219 -2242 833 926 -360 -1053 327 1733 -1900 247 35 1710 -2455 853 441 590 -1745 626
2235 626 1261 -1077 -354 114 1739 -2218 735 41 1220 -2157 928 639 -185 -1007 410 1402 -1661
2252a661J984l72J586l801L241p71M42k329K386L03j884M86N01J521l676K677
2268F33o31J316l454K948j86o06j168J493J118k944J577j51J716l866K988n75
2284B08N88k492K311L38j653K44N42J446l404K493p31J363l246K877n16k72j160
2301a064J477P12k397J463k88J533l445K895q97Q50k476K359l0j193k1O60J281
2318A419l120K216o47J477l327K792n00Pj531J616P16k214J069o8J584l423K675
2335G41p76R60k571K321p2r71j67O50J140k797K089p74J454l033K693p95K35j393
2353a066J545L30j747J013j79J390l013K563j019J099k488K346l98n60m38Q13
2369A91R31k491J783o18J486l100K654p96M93j785J781K15j481O08P2J333k925
$$ plain form
2252 -1661 323 -49 1537 -2264 977 206 648 -1681 705 1008 -876 -390 111 1632 -2044 633
2268 633 2 1318 -2136 812 626 20 -1148 345 1463 -1481 96 -55 1661 -2205 783 208
2284 208 796 -1696 615 953 -700 -456 86 1532 -1872 621 -110 1253 -1993 884 368 96 -1064
2301 -1064 413 1125 -1272 191 -97 1436 -2009 886 -11 839 -1637 722 692 -501 -522 138 1419
2318 1419 -1701 515 -132 1345 -1982 810 310 317 -1214 402 1118 -1096 -27 -95 1489 -1934 741
2335 741 -35 925 -1646 675 603 -368 -535 115 1255 -1542 547 -227 1227 -1806 887 92 327 -1066
2353 -1066 479 809 -938 75 -104 1286 -1727 836 -183 916 -1572 774 376 -184 -622 191
2369 191 1122 -1369 414 -204 1282 -1818 836 40 533 -1252 529 744 -737 -129 -57 1276 -1649
2386a649K383r42J195k568K378n49l11n61Q56P05k155J692p38J393k767K568j091
2403a61O66j594J680j07j114O26n2J111k554K303j131J261k437K340p37p2p13
2420f85R91N08j890J401n46J369k799K524j052Q31j907J928k66q52K23K77R49
2437A004k390K108j038J282k464K416r75K13q62J105J83j495J305o31J205k440
2453a474K449j331R49j712J863n95n05K31J94P36k066K023j122J264k336K388
2469I56j098L71r72J201P0j332J060m07J135k436K369j236J025j943K045o82l41
2486b15q5M78N46j871J807r92J219k294K428j316O09j095J378l37r10R35m23R05
2504G67k062K276j445J117j798K060j032mj40N04K79j539J703j036J170k160K366
$$ plain form
2386 -1649 734 -208 987 -1581 797 248 -63 -624 232 937 -1218 474 -264 1129 -1638 930 -161
2403 -161 505 -1089 591 484 -630 -4 -56 1055 -1499 804 -327 934 -1503 837 100 28 -685
2420 -685 306 814 -1076 325 -221 1148 -1651 873 -179 652 -1255 673 407 -445 -222 55 1004
2437 1004 -1386 722 -316 966 -1498 918 -57 156 -706 399 582 -913 392 -239 966 -1474
2453 -1474 975 -356 593 -1119 744 149 -356 -125 69 805 -1261 762 -360 904 -1432 956
2469 956 -142 229 -743 458 528 -804 256 -151 984 -1452 917 -319 706 -1237 808 126 -215
2486 -215 -300 178 724 -1147 660 -332 887 -1407 1021 -295 314 -781 597 260 -650 285 -138 767
2504 767 -1295 981 -464 653 -1145 915 -117 -121 -261 243 522 -1017 686 -350 820 -1340 1026
2521A026j340O72j186J468l94q29P35j91Q07k069K188j265J087j933K151j053
2537a26Q2l64P34J21j379J524q85J039k045K361j504Q47j247J589p53m13N70j31
2555B0N24j666K068j432J117j765K173j384M10m71Q51j93j042J335p90R21j934
2572a258K315j496Q90j372J728q25l40L55J21M32j666J964j242J053j867K228
2588A020j329M05o10J044l43r08J216o94P95j784K272j602R61j308J759j127k
2605b35K52J73J30j260J818j315J003j676K224j592O79p37J173o25n99R84m89
2622i2O09j662K186j515R62j487J952j189P2jM82lj241J671j060Q91j737K266
2640A104j528O57q31J299p37m78Q75m13M89j495K113j564R64j352J903j386K96
$$ plain form
2521 1026 -314 358 -828 640 246 -583 152 -39 768 -1301 887 -378 709 -1224 927 -126
2537 -126 -44 -408 326 447 -932 592 -293 746 -1299 1062 -442 405 -842 747 -6 -419 151 20
2555 20 544 -1122 946 -486 631 -1134 1039 -345 65 -406 445 252 -790 545 -245 676 -1258
2572 -1258 1057 -439 451 -921 807 -18 -358 -3 118 550 -1116 848 -394 659 -1208 1020
2588 1020 -309 96 -514 530 187 -721 495 -199 596 -1188 1084 -518 443 -865 894 -233 -235
2605 -235 17 190 320 -940 878 -437 566 -1110 1114 -478 201 -536 637 12 -587 397 -92
2622 -92 517 -1145 1041 -474 488 -999 953 -236 -164 -165 317 314 -927 744 -316 575 -1162 1104
2640 1104 -424 233 -598 701 -36 -514 361 -52 437 -1058 1055 -509 455 -897 1006 -380 -84
2657h4k8M68k16r23J535j101Q23j531K181j659P98r11J432r51k41O41j71K97j380
2676a021J987j405R10j478K064j428L63l02Q17m03q37J340p94O51j549K192j606
2693d99P93j004J558j067j22N37q1J34j168J874j429Q98j338J978j559N17k78
2710b56P66n54n77J228q21N83j365K095j634Q15r92J604j180L0L45J48k9j097
2728h91J754j212P66j419K091j535N24n25J114p44m92J026n03L74j319K039j539
2745d91P98j083J721j322J89K02K83k19q54J614j202P00j243J993j633O59m89
2762c77J035q45k94R30m97L03j181J943j499P78j066J734j335K03R6M63l17q45
2780g71J505r66N82j326K055j524N72o67J297r51k46P32j85R2j093J845j367P20
$$ plain form
2657 -84 -112 356 140 -783 752 -349 474 -1057 1124 -535 263 -648 784 -167 -408 233 62 359 -1021
2676 -1021 966 -439 471 -1007 1057 -371 -8 -310 507 104 -733 607 -187 464 -1085 1107 -499
2693 -499 294 -710 848 -219 -341 196 115 249 -919 955 -474 424 -914 1064 -495 22 -256
2710 -256 510 -44 -621 607 -214 369 -996 1099 -535 280 -712 892 -288 -258 87 235 206 -891
2728 -891 863 -349 417 -1002 1089 -446 78 -447 667 -77 -569 457 -46 328 -991 1048 -491
2745 -491 307 -776 945 -377 -188 14 297 78 -776 838 -364 336 -907 1086 -547 112 -377
2762 -377 658 -187 -481 449 -48 255 -926 1017 -482 296 -770 964 -371 -168 -72 391 74 -771
2780 -771 734 -232 350 -976 1079 -445 127 -540 757 -194 -440 292 107 199 -894 951 -416 304
2798C04j109J801j425L56n8N88n04n73J292r00M99j129J913j583P05o74J275j063
2816b85m8O12j63K6r60J713j281O57j066J779j377L18j29P12n40o11J209o69L78
2835B75j197J926j417N68p67J442j071q5M72Q2j15q96J613j158N81j032J765j432
2853d46M49k42P90p05l32R91o02K82r68J746j434O64p63J388j171J33L17J63k28
2872C2p22J443j034N34j044J739j351M17l50R36p18l92R16l77J71j042J737j238
2890c43N30q33J486j120O7K22L15k91o89J333r13M70r81J663j342M78l72R16p98
2909b02j68P14l30J05q09J515j225O09p96J393j175K49O2M13l93n26J144p39L75
2928B16r58J617j232M31n04J079q25j83N87r6kq48J470j022M63q22J417j079J81
$$ plain form
2798 304 -805 996 -429 -73 -131 457 -47 -620 672 -228 271 -858 1055 -528 177 -497 778 -285
2816 -285 -333 279 116 142 -818 895 -386 271 -795 984 -393 -75 -204 508 -32 -643 566 -103 275
2835 275 -922 1004 -413 155 -612 830 -241 -326 146 228 113 -783 830 -328 253 -779 986 -446
2853 -446 3 -239 551 -154 -486 505 -97 185 -783 963 -471 193 -570 818 -353 -220 97 260 32
2872 32 -690 753 -281 253 -791 948 -403 14 -336 600 -118 -510 406 29 200 -842 895 -343
2890 -343 187 -646 840 -280 -213 9 324 33 -656 677 -236 234 -747 916 -426 52 -320 596 -202
2909 -202 -370 344 14 119 -690 825 -400 209 -587 806 -369 -120 -58 355 -38 -564 580 -159 216
2928 216 -742 875 -357 74 -430 649 -176 -359 228 132 130 -718 752 -270 193 -629 788 -291 -110
2947a10pM97m17m92J041o58L40q73J483j203N07m92R75q30oM34j04j4o60J276
2967F87r89N03p67J312j103L30j24N63m95l35Q49m96K33q14J401j078M46n84J112
2986F51q66j4K88J49j42o46J178q04L95q02J341j042L12k01O15n08k68P27m41
3005g8K32p26J261j034N02n48R66q40J41K06N5j16m74J000q00M50p23J202j000
3024c24L80k78O40n48j70N77k72J28o87J191r07M19o10J064q35J23P8K89k67m22
3044d31Q82o14L32p14J194r65L91l33O84n87n6M44k38J20n51J012q82N03n79R18
3064E30q21K78LK01k21k98P37n95L64o46J052r09M28l68O85n91j9L51j22M7n32
3085d46R68p71M15o00R81q05K45p9L53l18k45O43m55K56n87J004q66M53m15O88
$$ plain form
2947 -110 -117 380 -37 -529 512 -146 194 -679 804 -399 108 -384 591 -239 -245 189 85 71 -589 687
2967 687 -302 201 -566 746 -357 -27 -151 412 -83 -418 431 -65 168 -646 755 -323 123 -461 651
2986 651 -215 -229 59 208 66 -580 598 -206 189 -613 728 -314 -2 -203 412 -96 -364 363 -78
3005 -78 154 -572 689 -345 157 -391 575 -265 -124 82 137 21 -453 547 -253 197 -526 676 -324
3024 -324 56 -222 418 -130 -300 277 5 133 -554 637 -270 149 -461 603 -232 -109 -31 258 -9 -431
3044 -431 451 -163 169 -545 649 -316 75 -258 426 -161 -217 227 -11 109 -442 570 -312 191 -388 530
3064 530 -291 -13 -10 191 -30 -328 409 -186 178 -468 584 -325 103 -265 420 -171 -190 161 39 86 -446
3085 -446 522 -249 166 -434 547 -258 -13 -92 261 -57 -302 341 -114 142 -445 559 -307 146 -269 419
3105D19o28J17K11p9Kl66P87p32M58n28Q35q14L95j53K99l30j06N18m53K76n04
3126c76Q90q41M73m18O77o16J29J61mn8l59P70o42L65n25Q84p87L35j80M07m06
3147a21o7M36l25J73m54Q44p91M65m26O74o78K79K9K9j05j75N80o24M24m89P78
3168D56q07M86k76M02m34Q4K97k90J51l86P78p69M74m40O95o78K52J8J24j86j99
3189b48O00n42L22m67Q28p99M09k58M58m91R0K76k20R1l34P13p39M78m20O59p28
3210c22L96p5J25k34k0M28n08L28l90P11p94N21l30M69n52K40J43j53L8k52O23
3231C92o65M19m21P10p49L85j22K43l21l9M48m06K21l88P53p81M50l31N53o06
3251b55K21J40r2k8k03O11o82M42m08O60p56M81j71K16l25P7L16m09K47l08O50
$$ plain form
3105 419 -209 -92 119 40 42 -324 463 -269 189 -339 496 -318 77 -76 223 -107 -213 305 -148 128 -376
3126 -376 514 -327 146 -272 405 -211 -82 79 75 17 -342 428 -214 151 -374 510 -277 58 -122 285 -121
3147 -121 -188 248 -77 96 -358 486 -305 160 -266 408 -270 9 38 67 -38 -213 367 -257 167 -322 456
3168 456 -351 135 -141 261 -173 -89 208 -82 69 -317 461 -308 166 -274 421 -257 -5 13 137 -49 -248
3189 -248 352 -190 132 -335 493 -306 103 -155 303 -188 -98 178 -42 49 -285 428 -311 167 -253 406 -322
3210 -322 74 -1 124 -110 -130 298 -210 118 -272 439 -355 166 -164 305 -247 -7 136 -17 21 -231 392
3231 392 -273 146 -275 435 -314 71 -51 192 -129 -168 280 -126 95 -293 460 -321 129 -202 351 -255
3251 -255 -34 106 14 -14 -217 394 -288 154 -254 406 -350 131 -40 176 -149 -72 244 -165 82 -226 424
3272D24p77N35l59N14o24L17L9k4r8j22N18n85L79m02O88p64M46k10L59m43J12
3293g7K79k71J11l03O93p40M56l66N94o62L43KK4j46r2M81n86M02l72O37p62N18
3315A63k58L06m10J78K00k77J51k57N98p15M89l78N57o52L90p7R3k01m4M40m95
3336a99L08l76O92p55M60k73M55n27J98J46j40J8k31O08o52M21l96O29o91M09
3356A04j30J58k44K2L44m45L12l41O09p28N23l40M04m85K74O6j49P7k03N04o15
3377b83M66m16N83o47M16j74J99k50J3L15l64K55l56O36o81M57l63N08n28K42
3397B8J9j4l8j69M88n39L82m00O18o62M27k32K65k97P8K04k98K47l19N37o39N23
3419B09l97M47m80L02o9j1Nj51M09n00M34m37N69o10M26k54K89k86M6K01k31K00
$$ plain form
3272 424 -353 182 -177 337 -287 30 69 45 -53 -175 343 -242 137 -265 423 -341 105 -105 254 -189 -77
3293 -77 202 -69 42 -261 432 -308 148 -218 376 -286 57 59 83 -63 -155 326 -260 142 -230 407 -355 163
3315 163 -95 211 -199 -21 179 -98 53 -204 394 -321 168 -210 347 -305 85 8 101 -100 -144 296 -199
3336 -199 109 -267 425 -330 130 -143 312 -215 -17 129 -11 7 -224 384 -268 153 -243 386 -305 104
3356 104 -26 132 -112 -90 254 -191 121 -220 389 -339 184 -156 248 -237 37 103 -46 31 -172 332 -283
3377 -283 183 -233 350 -297 119 -55 144 -106 -93 222 -142 113 -243 393 -288 169 -194 314 -214 28
3397 28 47 33 -5 -174 314 -225 157 -243 375 -287 140 -92 173 -124 -46 158 -140 107 -212 325 -314 209
3419 209 -188 259 -221 81 12 1 6 -145 264 -236 198 -239 330 -280 146 -108 181 -105 -59 142 -89 111
3441A11l48N75n83M26m09N23n03K57o3P7o3j48L83m28L65m24N59n73M41l33L27
3462A69k82J24O5j54J96k93M22m97M79m44M51m24L21j93J07l3j04K53l34L65m16
3483b22M91n02M07l37L36k70Q9O4j05J55l08M51m55L97m26M84m15K64j85J50m2
3504B1j10K34k88L33m08M42m31M13l90L32k38J50n6o7J80k44K87l57M37m48L91
3525A83l59L45k71J56m2m8J07j99L08l80L85l60L79l97L35k17J25q7K0J21k53
3546a49K95l04L62m29M04l09K77k62J71k3o7Q6j62L26l85L16l09M03m16K74j52
3567e3J56j69RJ86k14J71k45M08m38K97k30L08l28J66J3j6k7q7K81l42K50k31
3589a35L55m15K91j37J30j73P4J31k08J42j70L33m00K84j95K70l27J79K2k4o2
$$ plain form
3441 111 -237 338 -245 181 -228 295 -208 49 -14 63 0 -148 235 -193 172 -252 307 -266 175 -158 169
3462 169 -113 11 76 -78 118 -175 247 -250 229 -215 236 -188 133 -60 47 14 -90 163 -171 194 -222
3483 -222 269 -233 174 -163 173 -97 -8 56 -49 106 -202 249 -206 191 -235 249 -166 98 -87 63 21
3504 21 -89 145 -143 190 -218 224 -207 206 -184 148 -90 60 4 -63 117 -127 160 -197 240 -208 183
3525 183 -176 169 -102 54 12 -36 71 -128 180 -200 185 -175 204 -193 142 -75 50 -37 -17 104 -149
3546 -149 146 -158 204 -225 179 -130 147 -115 56 33 -34 52 -110 216 -169 147 -162 241 -175 99 -53
3567 -53 103 -66 -57 129 -85 86 -159 249 -189 108 -122 186 -142 24 37 21 -6 -93 188 -154 96 -135
3589 -135 220 -195 96 -41 89 -84 -10 121 -87 55 -115 218 -182 102 -93 177 -150 29 51 27 -35
3610c5o8L00l18J72j82L75m21K12p0J67k40K7K13j63K2j28L88m06J99j34L07l70
3632a53J45O5Qj21k6K79l02J25j18L29l95J97m3J50k60R6J53j49po3K97l49J43
3655Ap5K80l67J39Q2K1j75pK88k35J8o5L39l84J04K9J83l11N0K37j16j21j9L51
3679B47l51O2k3K92l73Q5J26L8k15K7K72k19j0m8L17l62R9M2J60k93N8J85q2j26
3703i2oK95k83K5J9K63l61O6J35P1k60K0K87j70j16J7L35l39kR6K17l41OK52m2
3728I2k18J8L42k81o1N8K84l42mJ84O5k63J7K96j79j24L9L04l11k2J10J80k99
3751a15mK26j6k24K0L20k17j18Q1K76l26l3J92J21l08qL00q8k32O2L30k77j32
3774a70J77K20l34n8K91J9k90L0L20j74k06J35K74l13q5K26J17l03k7L15q3k10
$$ plain form
3610 -35 -103 197 -121 51 -131 244 -177 35 -35 132 -108 -81 132 -31 -9 -137 251 -155 44 -90 217 -153
3632 -153 -8 57 65 -56 -82 197 -105 20 -98 231 -164 33 -10 140 -120 -24 129 -20 -27 -90 207 -142 1
3655 1 -74 206 -161 -22 60 81 -94 -101 187 -48 -30 -95 244 -140 -36 -7 176 -135 -85 152 36 -85 -104 247
3679 247 -104 -42 -65 227 -146 -61 65 103 -112 -85 187 -32 -42 -90 227 -135 -36 6 166 -127 -69 116 34 -92
3703 -92 -98 197 -86 -61 -42 221 -140 -74 61 132 -128 -108 179 9 -107 -90 245 -94 -96 0 217 -124 -118 134 92
3728 92 -126 -108 234 -47 -108 -50 234 -108 -112 72 137 -126 -109 187 8 -116 -77 227 -84 -106 4 184 -115
3751 -115 -119 107 91 -133 -113 207 -10 -128 -47 229 -97 -130 62 183 -125 -133 167 79 -153 -91 239 -38 -170
3774 -170 7 227 -107 -165 126 145 -145 -115 205 31 -175 -40 234 -79 -164 62 179 -124 -151 164 81 -129
3796a29N4K83k22j39J65J91k91n4K50L7k71J7K97j33k25J30K68k67j51K47J45
3817B02l25k5L14m2l16J08L12j99k35K11K27l07j18K94Q4l27KL29r7k85J45K72
3839B24k39j82K52J49k99p5L16pl03P0K95j61k20J69K23k57j36K76P6l10qL08
3861A61n1k96J27K82k16k25K60J75l11j02L19M4l51O1L27j28l04K07K55k62j86
3882b14K97J16l31j7L05k2l37J45K58j69k39K47J74k84j07K91N8l36N5K79q0l14
3904b25K08K19k24j87K76J26l23l2L00Rl48J21K73j43k80K39K09k82j31L16P1
3925A92l67L9L03m9l41K05K28k02k26K77J67l32n3K92L9l72J17K66j25k76K26
3946HJ92k51j38K63J03l26L7K42j3l30J71K28j73k22K50J63l09n2K62O1l52R9
$$ plain form
3796 -129 -75 208 -14 -153 12 203 -88 -142 108 145 -126 -109 188 55 -170 -40 228 -39 -190 57 202
3817 202 -123 -148 166 124 -192 -84 228 29 -206 5 232 -75 -193 101 185 -142 -140 189 92 -193 -48 224
3839 224 -15 -197 55 204 -95 -170 146 139 -164 -94 201 40 -180 -11 212 -45 -181 95 171 -139 -147 161
3861 161 110 -186 -59 223 7 -218 42 217 -94 -196 123 167 -184 -123 204 76 -228 -21 234 -28 -214
3882 -214 83 199 -132 -149 156 134 -203 -58 200 31 -208 39 213 -71 -178 113 171 -165 -110 169 89 -225
3904 -225 -17 202 -22 -209 67 193 -130 -162 138 147 -201 -80 193 50 -230 9 218 -64 -195 121 192
3925 192 -175 -136 167 118 -223 -18 210 8 -218 59 226 -106 -159 133 172 -200 -83 183 58 -218 8
3946 8 200 -51 -189 74 177 -149 -112 130 117 -213 -42 186 13 -209 41 204 -105 -157 105 166 -186 -87
3968h7K62q6l09K22K08k43j62K77J24l55L1K62pl49J59K41j62k33K38J74k85q6
3990a66K71O3l39Q7K21n1k77J82J98k06j67K36J33l08oK41K4l14J34K11j17k29
4012a79K00J61k50p9K19Q9l15Q2K08l6k94J83J87j90j68K41J27l11J2K25J4l17
4034a91J33K15j28k15K01J63k40p4K06R0k92N0J98l1k57J50J81j72j39J96J18
4055A62k50lJ90K1k82J16J82r9j90J73J40k09q3J89R6k88O6J93l8k59J46J75j65
4078a7j33J85J33k72nK08K0k77J18J71r7j95J59J53j99o9J76P3k49N4J77m2k09
4101a37J25J38j33j17J46J12k26RJ63K1k25P4J73r9j60J44J33j99n5J70O0k41
4123a24O3J78o5j91J23J59j61j05J68Q8k33J7J72Rk27J03J54j14j34J32J35j93
$$ plain form
3968 -87 175 89 -220 2 210 -33 -195 82 206 -149 -118 144 137 -212 -53 188 26 -207 31 205 -80 -166
3990 -166 105 168 -171 -84 137 86 -191 -9 189 -17 -184 52 185 -123 -129 112 136 -178 -44 167 50 -179
4012 -179 21 182 -68 -147 72 161 -154 -72 136 100 -194 -11 176 -14 -182 59 186 -125 -113 112 126 -191
4034 -191 -58 157 29 -186 15 178 -62 -136 70 160 -132 -82 116 85 -172 -22 159 -13 -152 44 162
4055 162 -88 -91 99 120 -162 -46 136 37 -153 20 160 -49 -132 57 153 -135 -69 124 86 -173 -27 148 -17
4078 -17 -150 35 168 -104 -109 99 119 -158 -40 131 34 -161 -2 151 -48 -117 59 132 -117 -63 114 72 -137
4101 -137 -12 126 -7 -124 22 134 -92 -83 80 101 -124 -50 123 24 -136 8 141 -58 -113 57 117 -124
4123 -124 -61 117 52 -139 -16 143 -18 -123 45 133 -100 -83 89 98 -129 -26 128 14 -120 12 147 -46
4145d6m9J69L8k15N1J51n4j62J11J36j52p9J36P8j95J9J58j7j95Q8J36j00j22
4168a15J39J14k05k4J59L2k13O0J72p3j73J31J40j75q9J76O5k14L4J57k9k02J09
4191b4J49j18j31J59Q6j86j5J56J0k03P2J53q4j53J49J05j75n3J46N1j87K6J77
4214A10o2j61R0J54j48r8J52R9k04j8J89j8k07O8J84j15j30J26J29k06m7J80N4
4237A21k28J3K31r2j75J09J54j73q6J66Q2k11j0J99m0j80O9J79j31j12J38J13
4259A36k01m1J78L2k10K7K14r9j60J11J66j87r7J77Q2k13j7K20m7k00N8K34j59
4282Dj41J45J47k31n1K09J5k12L0K33j16j57R0K01k04q7J82Q8k28k2K23n3j83
4305a18O3K20j64j26J36J32k03n9K10K6k24NK51j10j72Q8K23k19j08K06Q3k29
$$ plain form
4145 -46 -95 74 112 -103 -52 99 45 -117 -6 130 -22 -101 35 113 -82 -63 95 78 -117 -29 107 7 -115
4168 -115 24 138 -67 -91 68 100 -113 -53 119 46 -127 4 144 -31 -120 56 121 -93 -59 98 69 -133 -24
4191 -24 125 7 -124 35 121 -65 -80 76 86 -117 -45 108 24 -129 20 125 -50 -103 43 94 -93 -67 110
4214 110 48 -113 -23 131 -17 -115 37 136 -68 -86 103 85 -122 -54 130 15 -115 11 140 -66 -113 67 121
4237 121 -107 -94 137 45 -130 -21 133 -40 -126 40 122 -89 -99 100 60 -120 -51 128 -3 -115 23 136
4259 136 -65 -106 72 104 -106 -79 135 36 -124 -13 153 -34 -131 46 128 -85 -102 118 71 -129 -71 163 4
4282 4 -137 8 155 -76 -127 82 97 -115 -85 148 32 -125 -35 166 -38 -125 57 145 -83 -105 118 65 -118
4305 -118 -55 165 1 -125 11 143 -60 -119 91 117 -107 -102 149 39 -133 -45 178 -41 -149 57 140 -89
4327h9l6K54n1k03M7K61j87j47J57J77k40r4K56Rk09qK70j23j71Q4K30k18j13
4350a44J95J01k34m6K62n7j85K6K73j98j28J34J78k40q1K34L1k26k4L05j42j68
4372a34Q3K45k20j36K14J03k45o6K94m8k12PL27j93j59J28K01k30j25K64L6k22
4394h8m7L16j36j73O8K64k28j31J80J26k22q4K77l6j89j2L08j77j54J16K08k35
4416d9j17K48M7k02p2L20j21j72K7K97k13j47J88J39k18j27L12l7k02l3L47j78
4438C7j72J03K32k26j48K50O1k12r0L48j24j87K5K95j90j61J70J62k25j28L10
4459A30m1j70p0L52j80j54Q3K40k14j41K33P7j99j18L39r2j89J5L09k05j62J65
4481HJ69k13j47L07j8j86q2L49j48j78P4K47j87j84K46Q7j95j33L44r5j66k0L13
$$ plain form
4327 -89 -125 129 78 -125 -78 183 -4 -151 6 183 -57 -151 105 114 -95 -103 167 44 -127 -43 187 -31 -144
4350 -144 51 152 -82 -128 134 77 -108 -82 191 -7 -135 -1 177 -63 -144 90 121 -105 -129 176 34 -134
4372 -134 -51 194 -26 -162 52 155 -90 -156 138 90 -122 -115 212 19 -140 -12 189 -41 -166 98 134 -88
4394 -88 -135 181 45 -128 -60 204 -24 -155 25 151 -71 -155 122 86 -103 -115 193 16 -138 -22 186 -49
4416 -49 -166 82 129 -73 -145 175 54 -118 -91 206 -7 -154 34 173 -45 -172 140 103 -99 -132 215 37
4438 37 -135 -32 200 -26 -174 76 137 -75 -165 183 59 -128 -103 192 2 -159 11 173 -52 -180 130
4459 130 89 -81 -151 201 21 -133 -50 190 -24 -165 68 145 -54 -172 167 75 -114 -99 210 5 -157 8
4481 8 177 -36 -183 124 106 -80 -162 187 39 -139 -65 182 -5 -189 57 144 -51 -184 160 65 -101 -121 192
4504A92j79j78J59J66j78j59L01j9j68r9L48j48j55N0K59j84j88K40Q1j83j51
4525a93L57q9j61n5L38j77j71J33J88j86j85K98Pj62j11L50j37j65L6K65j68j88
4547a76K10J07j63j67L35o4j60n6L16j43j71J07J77j52j91K86Lj39j28L34j11
4568E4j56RK65j57j89K01J03j46j77L23o0j40q4L42j58j66J06J89j54j91K72L0
4590A16j55j30L29r9j50qK80j58j87J88J12j48j69L20p7j27r0L24j30j67Q1J90
4612A45j28j92K48K1j25j53L37r8j33k4K74j41j92J76J12j34j77L09m0j32j00
4633a47L25j38j65Q1K04j37j86K34L2j25j57L33r7j31m3K83j43j59J46J19j29
4654@j87K91l1j18j19L25j27j37M3K04j24j88K19N3j09j67L20r2j19n6K82j26
$$ plain form
4504 192 13 -165 -6 160 -18 -177 124 105 -63 -162 186 38 -117 -67 192 8 -180 60 141 -42 -193
4525 -193 164 75 -86 -141 197 20 -151 -18 170 -16 -201 97 104 -58 -169 181 44 -121 -85 180 12 -176
4547 -176 34 141 -22 -189 146 82 -78 -134 182 39 -132 -25 152 0 -191 95 98 -41 -169 165 54
4568 54 -102 -93 172 15 -174 27 130 -16 -193 130 70 -70 -154 188 30 -136 -30 159 5 -186 86 116
4590 116 -39 -169 160 61 -89 -97 183 25 -162 26 138 -10 -179 141 64 -63 -153 171 41 -126 -45 145
4612 145 17 -175 73 94 -31 -184 153 55 -78 -102 172 31 -161 15 127 -7 -184 125 85 -47 -147
4633 -147 178 40 -125 -44 160 23 -163 71 103 -22 -179 154 57 -74 -117 166 23 -136 10 129 0
4654 0 -187 104 73 -45 -164 161 34 -103 -60 144 20 -168 51 104 -5 -172 148 56 -63 -119 163 37
4676C7j78J40J25j08k02K91k2j18j27L11j11j35K9K20j21j97K18M5j11j71L28
4697A43r6j10o6K97j38j60J14J35j12j79K69k3r6j42L21j28j05PK19j19j71J84
4719D4M7r9j64L01q1j01p3K84j27j46R2J54j17j87K62j5j01j32L02j06j24%K42
4742A55j42j58J71P2r2j82L01o2j05r5K94j31j36Q3J58j16j92K62%j01j48L17
4764A53j04j33MK34j24j77J63R1j07j72K86n7j05r8K92j18j36P3J67j28j71K30
4786F3J9r9j55L17j02j02m2K61j37j64J52R6j05j80L04n6j08j11L20j28j46N4
4808d9J98j46j66K43Kr6j46L10j13j00l8K65j41j54J37J09j18j77K86m0r9j16
4830a49L19j45j17L3K03j40j58J99M9j13j48L09r7j07m0K76j59j43J30J28j23
$$ plain form
4676 37 -141 -1 124 16 -186 105 83 -35 -162 149 38 -97 -68 152 31 -166 52 97 -14 -185 143
4697 143 47 -63 -129 168 30 -130 -16 119 7 -172 97 74 -22 -164 157 29 -76 -69 150 31 -140 44
4719 44 91 -8 -172 129 48 -53 -126 158 31 -115 -23 131 14 -173 89 74 -27 -159 143 37 -87 -87 155
4742 155 13 -145 26 98 6 -176 125 63 -42 -137 157 26 -110 -27 131 15 -177 85 85 -16 -164 153
4764 153 49 -84 -80 154 30 -147 16 107 0 -172 114 57 -48 -146 146 28 -108 -35 132 4 -167 63
4786 63 82 -17 -172 145 43 -59 -101 160 23 -141 11 107 2 -178 126 70 -38 -149 171 43 -103 -49
4808 -49 149 3 -163 80 82 -14 -160 150 37 -63 -101 164 23 -131 6 115 -3 -180 106 66 -33 -149
4830 -149 170 25 -92 -59 144 4 -154 45 94 -19 -167 142 45 -62 -102 174 15 -128 2 130 7
4851Gj76K83m9j02j17L19j23j29K0K17j49j53J97M5r7j77L17r7r0q3L08j55j33
4874a17R8J48j23j71K67k8j04j34L29j45j00PK40j60j65K02N7j06j65L16j02j02
4896e8q0L16j53j49J00J76j51j67K53%j08j50L41j44j04j2K65j66j58J80Q5j21
4918ej76L16q9r1j07L34j66j27Q0J85j45j73K55Mj15j63L62j37j07m1K89j65j54
4941a36J49J13j45j74L34r0q9j13L37j65j31O7K12j63j73K47J3j15j67L54j20
4962D5j18m4L11j78j52J39J40j38j89L17n7j06j44L78j79j21L4K50j86j71K43
4983G4K3j08j89L77j41r6o6L28j92j48J29J63j37k09L23n2j06j63L85j57j39K6
5005g5K62j75j88K43N8j22k05L87j34j04r4L60j83j64J19J75j45k14L39p0r3j80
$$ plain form
4851 7 -169 114 65 -37 -154 165 42 -87 -67 150 1 -152 45 90 -7 -184 133 36 -54 -137 171 16 -117
4874 -117 -19 129 6 -165 102 74 -30 -164 165 20 -80 -73 167 7 -158 44 101 -5 -170 146 44 -58
4896 -58 -138 178 25 -124 -24 152 1 -166 87 87 -21 -171 170 26 -78 -90 175 9 -149 31 116 -5
4918 -5 -181 135 46 -45 -152 182 16 -111 -31 154 9 -164 91 95 -20 -183 179 42 -65 -106 183 18 -136
4941 -136 13 126 -19 -193 141 51 -38 -151 186 21 -110 -43 169 6 -167 80 93 -22 -189 165 45
4962 45 -73 -117 194 16 -136 3 143 5 -184 133 76 -30 -174 204 25 -96 -62 188 2 -169 74
4983 74 97 -11 -200 177 36 -60 -126 202 10 -138 -9 154 17 -192 131 79 -27 -190 195 38 -101 -75
5005 -75 187 12 -176 67 125 3 -202 185 51 -53 -147 213 30 -134 -15 160 15 -199 140 70 -23 -203
5027b03M00j67j26nK92j86j81K34O4j14k32M02j19j13j23L99j89j71J03K09j63
5048A1k18L21k1j13j87M11j65j16n0L32j83k13K29J04j34k32L95j06j08j59M18
5069B16j91j42O0K40j66k32L14oj02k38M48j65j00p6L48j78k20K17J29j32k67
5090b43M13r6j15j64M32j83j69M8K67j59k61L17M0j21k63M61j55j21r1L80j86
5111C1k11J70J63j41k77M11q3q4k17M67k02j58L9K85j62k62L04M2j00k89M71j40
5133E7j09j31M10j77k21J49J81j21l09M15n0r1k53M74j72j66j8L39j59k82L02
5154F8N3r4l04M67j26j12j55M41j86k22J27K21j35l13M01m0q3k75M96j77j54m0
5176a42L61j63k87K75R0p7l49M78j10j05k04M72j78k19J01K26j14l35L93j7p3
$$ plain form
5027 -203 197 30 -96 -101 191 5 -176 58 122 8 -224 178 59 -54 -177 222 33 -138 -35 174 11
5048 11 -207 114 93 -20 -207 204 39 -77 -127 205 22 -191 38 142 8 -224 171 65 -43 -202 216
5069 216 25 -117 -57 183 17 -215 99 93 -9 -247 201 36 -64 -140 208 30 -190 27 156 24 -243
5090 -243 170 74 -41 -205 227 44 -125 -77 190 31 -230 87 127 6 -257 204 49 -72 -163 217 31
5111 31 -180 -10 153 12 -265 146 63 -21 -238 229 27 -131 -92 193 31 -231 73 115 15 -274 197 57
5133 57 -52 -183 227 50 -171 -22 159 38 -271 144 94 3 -250 224 52 -114 -132 207 48 -234 68
5154 68 121 27 -277 190 64 -48 -203 238 52 -170 -43 178 43 -270 131 91 8 -267 229 52 -102 -142
5176 -142 219 56 -231 44 134 57 -292 186 76 -29 -233 239 61 -158 -57 169 55 -280 113 96 23
5197B3l08N00j58j33r6L88j52k92K49J18p4l58M78j00r6k44M93j65k21P4K64j13
5219G7l59L94Lp9l41N20j45j47j07L97j36k99K20J53q4l87M89p8r0k68M92j41
5241H4k29K4L01r9l72L76K5n4l74N26j26j46j49M35j23l12K03J52n6m04M80o5
5263I7q4l01N16j38k26J6K98q8l69L53M4n1m00N34j22j27j89M51j17l12J76J85
5285A46m0m19M47m3o1l38N30j39j94k8L35q2l70L08P2k8m32N28r9j17k17M59j08
5308A10l11J37K11k6m29M34l1m6l73N30j17j88o8L54o9l94L20P4j2m47N24q9j05
5331a1k57M77q7l08J11K34k6m48M23kl1m06N27q6j94r9L66n3l71K62J04km63N04
5355A64o0r1k82M76r0k86P5K52k8m37L94J7k9l98N17r8j58j45M07o5l79K38J38
$$ plain form
5197 23 -285 215 57 -76 -172 216 64 -228 21 139 65 -293 185 85 -11 -255 238 73 -148 -74 190 77
5219 77 -282 112 115 36 -305 215 70 -77 -184 213 77 -222 -2 151 67 -320 169 91 1 -267 225 84
5241 84 -145 -121 180 81 -291 85 110 56 -318 208 82 -64 -213 222 99 -213 -10 142 86 -318 162 97
5263 97 13 -288 228 90 -136 -120 178 90 -279 74 118 67 -333 201 79 -48 -237 214 97 -215 -39 146
5285 146 106 -313 134 91 30 -308 222 83 -111 -139 196 114 -256 52 124 96 -336 192 93 -24 -241 218 110
5308 110 -201 -64 147 121 -308 126 95 49 -324 206 89 -99 -167 187 118 -276 44 118 106 -341 183 94 -11
5331 -11 -268 209 122 -186 -75 159 133 -315 108 106 75 -331 196 110 -84 -183 183 130 -241 21 125 123 -340 164
5355 164 104 13 -269 207 117 -169 -94 158 130 -307 87 104 75 -323 194 96 -62 -207 200 135 -244 -6 132
5378A32pm60M84n9o2l03M82q7k65L2K73j1m58L78L5j3m26N13p3j51j74M00m1l73
5402b34K08J52J1m67M68m6m9l35M82p0k47lK88pm35L40N8nm37N03p3j26k05M13
5426A84m7l31J65J70%m63M51k6n1l52M87o2k28m4L04lm25L06O6J6m50M88o8j02
5450a5k16M03m0l35J42J89K5m60M06%l4l60M72n2k06q2L16%m12K94P0K6m52M75
5474A54n8j05k31M02k6l14J17J90L4m84M15pKl97M80m9j92j00L16Ml95K51R2N1
5498A50m69M59m1o1k94M26k9k88O1K07M2m46L61J0J8m05M58l8j90j07L28Kl87
5521b33K36J02L6m52M45m3o0k88M22m0k64K5K33L5m30L45J6J6m07M59m6j42j67
5544b02L47ll50J87J23O3m66M05j4l7l19M20k2k45RK24L9m23L16L2K6m14M37k9
$$ plain form
5378 132 125 -335 149 90 28 -275 207 120 -145 -113 160 149 -309 69 104 91 -335 178 105 -46 -220 180 139 -234
5402 -234 -26 126 137 -330 138 92 43 -292 190 120 -127 -130 158 151 -284 56 114 109 -328 175 102 -24 -229 184
5426 184 137 -194 -29 141 141 -322 129 103 52 -300 187 125 -103 -147 157 154 -271 35 101 117 -333 155 87 -15
5450 -15 -231 172 132 -203 -61 128 153 -307 99 99 65 -295 177 125 -81 -163 153 153 -259 35 105 131 -321 154
5474 154 96 -9 -240 162 136 -178 -61 129 163 -321 94 87 89 -308 172 123 -69 -169 147 151 -244 7 99 150
5498 150 -319 140 99 38 -256 170 141 -147 -86 121 163 -283 78 88 106 -299 159 121 -69 -176 152 154 -233
5521 -233 3 105 141 -311 134 91 31 -257 165 125 -139 -114 119 154 -276 69 85 101 -306 153 107 -35 -202
5544 -202 145 142 -208 -21 102 165 -301 104 90 53 -266 154 132 -113 -104 120 159 -264 52 84 110 -304 133 104
5568A04j26j80L45j7l24J71J27M1m41M07l6j9l25M33m4k15j6K34L4l95K90L1L7
5591A16l95M14m8r1j98L44%l11J28J36N9m41L76j4Jl45M14m6j85n2K51L1l79K64
5615B9M8M5m12M15l6q2k14L38j2k75J15J38N2m32L85l5J2l49M13n8j57o8K63J5
5639A38l62K51M6N6m09M02m4n3k44L64l1k48O9J68M9m16L34MJ4l54M06n6j39j05
5663a60K82J6l35K12O9L3l87L84m0m5k45L61l1k41N5J74L3l83L22j0K5l54M03
5686A38n9j12j21K63J7l09J81O3N7l91L86n0l5k56L61l6j99J2J81M9l68K78J2
5709F2N4l72L97n6r8j42K73J0l01J73Q7M8l95L63m4qk80L78n4j78j2J95K9l62
5733b33K92nM9l66L99q3o9j62L09j7k83J40J15M0l97L70n2J8l02L85o4j58m3K22
$$ plain form
5568 104 -22 -202 143 126 -198 -27 100 141 -300 107 71 52 -273 160 116 -99 -115 119 153 -242 48 79 116
5591 116 -279 135 87 -4 -202 142 142 -169 -41 95 154 -287 89 75 76 -269 145 99 -86 -138 113 144 -235 29
5615 29 77 122 -290 125 89 7 -207 131 119 -156 -41 97 149 -283 102 67 79 -270 143 85 -72 -140 123 138
5639 138 -224 27 73 129 -280 122 78 25 -219 145 114 -134 -65 103 152 -264 70 74 88 -266 140 84 -55 -160
5663 -160 122 138 -197 15 84 117 -270 114 74 29 -216 145 114 -127 -72 102 135 -248 74 64 89 -265 138
5686 138 79 -33 -154 109 126 -183 -2 61 118 -273 113 63 28 -228 133 97 -102 -90 91 140 -228 50 62
5709 62 116 -256 141 85 -13 -155 118 128 -173 0 87 135 -260 103 59 51 -229 149 95 -83 -95 100 129 -233
5733 -233 59 54 103 -263 136 53 -16 -178 131 114 -169 -29 86 126 -271 99 47 65 -237 148 84 -74 -117 105
5757A05K9l53K61J3N6l70L96q2n4j92L25l3k42J21J01M2l77L62o2J9k98L72p5
5780F4j35m2K23Ll19K60NM3l49L84q2l3k12L36m8k32Q9J34M2l77L47m1L3l39L94
5805A48p5j15r1K46J1l16K27J7O2l84L89p5j0k39L38n8k00P4J29M5l65L34m5K4
5829G1l11M07j11j05p7K47k4k77K01L9O0l79M02r6mk41L43o8j83L8J51M5l66L09
5853G1l7P2l62L90q4p1j29K65k1k75J84M9O6l68L78r3J5k56L54r0j39J4J59K9
5877A21l31L01n1N7l45M02j13m9j38K75l8k40J52N8N6l72L67p9L1k91L64p4j31
5900f8j0J70L3l42K71j9O3l67M06r9l4j65K76k7k34J30P6O3l66L68j05N7l05L79
5924A51r3j24j9J76J9l12K66k4O9l57L91j16qj97L10n9k07J14Q1N5l48L48j04
$$ plain form
5757 105 134 -219 42 55 111 -259 137 55 1 -191 134 101 -141 -20 81 123 -254 108 46 65 -233 139 64
5780 64 -71 -113 110 113 -206 54 59 102 -247 137 55 22 -190 146 98 -134 -45 89 131 -246 101 60 93 -246 148
5805 148 73 -42 -133 113 124 -192 35 52 114 -270 119 44 34 -205 133 75 -125 -51 78 123 -242 92 47 71
5829 71 -240 167 56 -49 -126 121 97 -180 21 60 120 -259 143 47 43 -198 145 77 -106 -68 83 128 -238 71
5853 71 34 106 -256 134 50 -21 -150 115 94 -181 3 52 118 -250 128 35 50 -206 148 58 -81 -67 92 121
5877 121 -210 91 40 97 -248 154 41 -8 -146 129 91 -149 3 61 117 -255 112 33 64 -227 137 63 -68
5900 -68 -78 92 125 -217 54 35 98 -269 137 38 4 -161 115 88 -146 -16 60 123 -243 125 20 77 -228 151
5924 151 58 -66 -85 91 110 -202 64 40 109 -248 143 27 19 -178 132 73 -134 -20 61 116 -232 116 12
5947A2P4l15L61q2r5o8K04K9l00K22j3Q9l59L74r7Rk31L13m1k06Q7R3O1l39L14
5972I6p8Q1l34L78j13o3r0K04J1k73K19k3R9l49L66j21L8k27L06p1j59N9J02N3
5996A11l31L09p4R1l38L76j01m4j24K15K6k61J66J4R9l63L51r7M4k59L14n3j37
6019f6J3J16N7l28K81o8R7l33L59j04k1j38K27mk20J56%Q8l38L45j21P6k63L06
6043A17p4q5j4J25M5k90K39o0J14l62L69j13J1j71K35Pk14J08K5J20l48L19j02
6066AQ2k92L15o1r0l8J45N1k85K36o4J04l21L36j09K2j72K31j0j90J06L6Q8l10
6090a89K95j07R8k88L03p3o4o1J37N2k59K14o4J38l50L24r7M3k10K51k3j59P0
6113a9M1J11l26K74r8J24l00L04q7k5p9J30M8k41J79m6J38l30L15j10N4j96K33
$$ plain form
5947 12 86 -229 132 50 -45 -113 91 120 -180 42 29 118 -241 133 36 45 -186 127 86 -120 -33 60 121 -218 96
5972 96 18 99 -235 143 30 -33 -123 81 92 -181 38 15 114 -235 131 10 48 -179 127 56 -103 -44 58 111
5996 111 -220 89 15 106 -232 144 43 -1 -125 90 116 -145 21 35 134 -229 122 25 69 -190 124 71 -66
6019 -66 -53 63 120 -208 73 5 102 -231 128 24 3 -135 92 88 -132 24 24 112 -226 119 -2 74 -189 117
6043 117 43 -42 -56 69 114 -176 63 3 117 -245 124 11 22 -149 86 93 -121 -13 12 132 -216 103 1
6066 1 83 -209 106 45 -45 -83 62 113 -172 64 0 104 -217 119 10 32 -140 91 81 -109 -3 33 121 -189
6090 -189 106 -1 97 -191 112 39 -25 -86 51 103 -156 58 -6 132 -218 106 9 52 -158 93 70 -89 -19
6113 -19 22 133 -193 81 -17 107 -193 111 24 -1 -80 50 98 -143 36 -10 128 -202 113 3 57 -139 94
6136I4k9j38M7N1R6l01K67r7J06k78K87p8k9q9J51K6k02J32k4J37l26K93j05P0
6160F1k13K39l9j06L1N5R0k90K45q7J30l01K90r0Rj21J53K5j87J38m6J31k93K70
6184I4j11Q2k09K23m6p8ON1Q3k48K18r9J38k74K62r5K8j27J61Rj62J03j5J39l04
6209a71K58r7R2k19K15l8p0j7O9Q1k40J97q1J32k72K50r8N0j48J64J2j48Q6j3
6233fJ13k73K60j29J16k21K20n9m0k5P1N4j87J62p3J27k55K33q7O1j71J70qj19
6257f6P0JJ04k54K12p2R2k15K04n7j7o6Q0O2j85J33m9J21k45K23j00P4j54J67
6281F3k1r9N2QJ01k42K12j02J11k08K17q5Op4R6N3j74J30n9J19k44K24j04Q4j66
6306a02J66m0n2K1J3Q8k21J93r9J26k27K09p2Pp5J00L4j55J15l9J05k19K10j18
$$ plain form
6136 94 65 -73 -26 25 121 -180 87 -10 96 -182 105 27 -2 -91 60 86 -116 16 -8 129 -197 96 -9 61
6160 61 -152 87 48 -58 -27 28 118 -172 73 -14 116 -185 105 15 24 -97 56 81 -106 32 -14 117 -176 94
6184 94 -17 65 -144 79 33 -45 -39 12 95 -153 65 -34 104 -170 92 -3 25 -102 59 68 -94 9 -6 133 -171
6209 -171 87 -10 82 -137 78 40 -30 -47 22 103 -137 60 -21 111 -161 89 -9 41 -107 57 69 -79 7 -6
6233 -6 107 -166 94 -35 81 -140 80 21 -19 -44 27 81 -106 56 -17 110 -145 88 1 62 -109 61 53 -66
6257 -66 4 5 109 -145 67 -5 87 -128 76 19 2 -64 16 78 -107 26 -23 98 -147 76 -24 50 -104 63
6281 63 42 -57 -5 3 104 -138 74 -28 83 -125 92 7 13 -61 35 88 -86 44 -15 104 -140 84 -20 64 -102
6306 -102 64 24 -28 -7 6 94 -127 66 -33 93 -134 75 3 10 -65 35 69 -86 29 -10 95 -124 86 -32
6330c2R3j67J74l5o2K8J2P9j95J80r9J01k07K17r0K0q1J02Rj11Q4l5J10k20K04
6355G9j10J00j73J58l6l8j9N6O3j88J57o8J18k25K01p5L4r9J13Lj00O9l3J04k12
6380a21J97r6R1j69J64n7k1k1M7M9j53J40p9J00j89J93r6N0j13J21Kq9N1j5J00
6405H6j97J70q5J04j88J76m2j8m9N7N4j52J23n1J06k16K00r2O3j31J40k4p8M4
6429@KP3j89J78r5Q8j63J69q1J3m7Q0K6j33J13o0R7j87J93r5N5j19J26j5m7OJ6
6456DP6j86J59p7J04j93J85p0J4p1Q4K6j23R2m9J01j98J87q0O8j48J50m6m3J9
6481a5J2O8j56J44q2Q6j69J76q8L3o8R1Or4P0k1Q0j76J69q6P8j50J53n0l6%K9
6508DP8j78J32n6J01j98J76o0K1r1R6K3j12O9j5R2j92J57o8P7j67J69m4l2j4L6
$$ plain form
6330 -32 61 -106 68 33 -29 -1 11 90 -105 75 -24 77 -130 87 -3 17 -64 38 47 -64 20 -15 95 -125 79
6355 79 -31 69 -104 54 18 -20 -39 17 80 -108 49 -19 99 -126 75 0 34 -65 48 51 -49 20 -13 91 -121
6380 -121 76 -20 71 -98 66 9 -12 -33 14 63 -90 50 -29 71 -118 75 -21 29 -84 37 39 -50 1 -14 86
6405 86 -111 59 -26 78 -110 66 24 6 -43 14 68 -84 39 -12 94 -122 78 -14 49 -82 58 34 -44 0
6429 0 2 75 -114 64 -31 57 -106 63 -18 -5 -52 28 54 -79 34 -26 71 -116 77 -18 37 -82 44 29 -18 -12 4
6456 4 80 -106 53 -24 80 -113 72 2 16 -55 29 55 -68 24 -25 76 -122 65 -15 53 -95 55 9 -34 -15
6481 -15 -3 65 -91 53 -29 57 -112 64 -24 9 -59 32 38 -56 14 -7 73 -103 66 -20 58 -92 61 11 -25 -25 4
6508 4 82 -96 36 -20 81 -117 59 -1 20 -71 25 48 -64 5 -10 82 -110 47 -21 56 -111 58 14 -18 -32 4
6534DN4j49J34o8R6j78J80q3M3q9R3J2r7N8j7Q7j81J63p3P8j65J47l6j2l2M5N8
6561G2j63J18m3R9j99J77o1L6j19J16J2r3K7K0Q1j86J58o9R6j73J53m8j1m0N9
6586A9M5j44J02l2Q8j91J75q2N4j21J31pp3K9qQ1j70J48o4R0j82J60k8l0m5Q0
6612B5L6j46R5j7J00k12J71n0N0j51J42Jp1RL3P0j83J44n5Q7j95J58k9J1q2R6
6638C7J5j22P6j4R6k13J61n8P7j61J38pm5nL2P9j87J33m9J08k17J80l8J0j06J25
6664D5K1j25O2j6J12k19J74n7P3j76J48qn7k8O0Q2j88J29m2J06k16J70l7K3j19
6689h3J03L4j22O0oJ15k18J72o7R2j82J49qm1m8N0R2j89J17k7J21k40J68k8L8
6714E2j44J29K9j16K5K2J26k45J62m3R8k20J60Lk7p4O5R4j83R4k4J15k28J64k8
$$ plain form
6534 4 58 -91 43 -25 71 -107 73 -10 33 -56 37 49 -48 10 -7 80 -101 62 -11 67 -98 49 13 1 -31 14 72
6561 72 -91 27 -16 83 -116 61 0 36 -83 33 45 -48 -21 -1 80 -106 52 -17 79 -94 59 11 0 -40 19
6586 19 64 -80 22 -10 78 -113 62 -20 34 -87 44 37 -36 -7 -15 66 -104 44 -20 70 -112 48 20 -10 -55 25
6612 25 61 -85 10 -7 93 -119 52 2 52 -99 43 44 -27 -18 15 85 -98 46 -9 78 -117 41 12 23 -59 37
6638 37 52 -70 6 -8 88 -125 36 -22 55 -106 32 25 -20 -25 7 86 -101 32 -17 91 -126 54 16 26 -80 45
6664 45 66 -59 3 -13 99 -120 54 -3 70 -106 42 34 -23 -51 9 91 -97 32 -10 96 -120 50 13 36 -83
6689 -83 20 54 -68 -8 -14 101 -117 55 -12 80 -102 47 39 -2 -50 0 92 -97 20 -7 114 -126 42 14 52
6714 52 -92 37 66 -50 -25 -3 123 -122 40 -3 95 -125 35 38 11 -63 2 96 -87 7 -17 98 -130 34 6
6739FN2j49J13L8r7RJ7J17k04J27l7R8k14J60jj8p8O9Q9j82R0l6J45k42J58k2
6765HN2j74J30N6j09mL5J40k48J38l4J10k41J70J1qj17R5R5j61O0k1J47k54J59
6790C5l3P5j79J21N3q3l2L7J31k32J16k6J23k31J48J5j3j08P9J02j63M4j0J56
6814A25k53J39rQ1j99J26O5q6n0M3J50k25R3mJ35k67J53J1K2j43Q1J25j66K4J1
6839a8J45k44J38k9J06k15J18O1n8o9M4J43k07Q9k9J49k45J30J9K0j41P7J20j44
6863d0JOJ75k57J17pJ16k16R9P7n8q1L6J67k19P0rJ55k52J30RN6j79Q1J24j31
6889c0nj0J78k41J09j9J21k14J02O1l3r2N3J49k08O3k4J84k65J12K6P5j92Q1J19
6914A00j16l1KJ99k63J07pJ43k52J01R4m8j09M6J72j97L9j9J91k68J08K8N7j66
$$ plain form
6739 6 58 -91 22 60 -37 -28 -11 106 -98 29 -8 90 -124 36 35 17 -61 8 97 -85 5 -31 114 -128 30 8
6765 8 60 -114 16 72 -37 -41 -6 134 -114 24 -10 100 -141 29 40 32 -85 10 105 -56 4 -17 130 -124 35
6790 35 2 77 -102 19 72 -11 -43 -6 125 -107 9 -17 106 -125 23 38 25 -83 -4 98 -65 -21 -31 125
6814 125 -128 11 2 83 -116 10 75 -11 -61 -18 132 -93 0 -4 131 -136 17 28 50 -93 -12 113 -53 -29 -18
6839 -18 127 -117 21 -8 98 -117 1 62 4 -65 -21 122 -85 4 -25 124 -121 9 28 48 -93 -16 104 -40
6863 -40 -39 -33 142 -115 2 -5 111 -105 -6 71 13 -68 -32 135 -84 -14 -23 132 -120 10 19 75 -104 -23 101 -30
6889 -30 -35 -45 133 -108 1 -18 103 -111 -9 52 19 -73 -20 129 -79 -16 -40 144 -121 -9 17 92 -100 -19 100
6914 100 -16 -47 -45 154 -109 -2 -9 134 -118 -17 77 29 -80 -34 138 -59 -20 -39 152 -116 -8 20 77 -89
6938h9M7J38j09l9J3J73k27P9KJ41k33Q9O5Kj20L3J65j71QjJ87k55R2J9Q2j88
6964i7N9J28r1o0J9J92k40O5nJ59k46R6Q3mj41M1J68j72NlJ83k34P0L4R5j98N2
6991d2J26o8p1jJ98k12M0MJ61k37P4P2K1j36RJ76j39l1NK02k52P9K3J14k19O0
7017d4J12m9r1OK09k17M1OJ70k44O5Q1K1j47K8J74j54j8KJ96k37O4L2J08k10N7
7043c9J19n3q5J2J82j89J8J0J64k28N6O0N1j54L3J61j38k7nJ91k27N7K3J17k13
7068a04O5J27n6j07K1J97j89PKJ84k44O2O3N4j72L7J64j18m1LJ95k25N4J7J14
7093A10k03N6J03l0j04J3J86j86J5pJ76k21M3O8O2j70L1J58j03n5nK11k27L7L1
7118a1J34k14M7J04k0j11J4J91j71j0J8J88k48O0N5O6j79L6J38p8p1kK03k21L6
$$ plain form
6938 -89 -42 96 -13 -52 -39 134 -93 -14 -12 129 -104 -15 50 52 -68 -35 130 -41 -33 -34 153 -102 -10 9 91 -97
6964 -97 -38 90 -1 -61 -42 150 -90 -25 -30 129 -117 -21 62 58 -83 -42 126 -46 -41 -44 139 -95 -25 9 104 -94 -42
6991 -42 84 16 -55 -56 142 -70 -30 -26 135 -102 -28 44 65 -71 -62 114 -25 -56 -51 151 -101 -22 1 115 -104 -44
7017 -44 68 19 -72 -66 143 -74 -33 -27 143 -101 -36 45 66 -81 -53 121 -33 -51 -49 147 -90 -26 6 114 -96 -39
7043 -39 80 27 -58 -46 136 -53 -35 -25 139 -89 -33 27 78 -76 -43 118 -20 -47 -52 139 -88 -31 -8 109 -104
7068 -104 -39 88 32 -75 -54 143 -46 -39 -37 147 -97 -35 28 82 -90 -53 111 -7 -48 -45 150 -75 -21 -4 110
7093 110 -93 -37 66 36 -68 -55 131 -55 -40 -47 129 -92 -49 19 81 -89 -58 100 -3 -58 -63 148 -79 -42 -11
7118 -11 123 -91 -44 60 40 -71 -57 134 -37 -47 -29 159 -89 -29 26 92 -87 -51 87 9 -62 -64 139 -82 -46
7143d6L5J39k17L6J15k5j09J8J72j55j0J7J68k20M3N7Q5j87M1J40p9p7QJ96k05
7168f0J8K9J53k28M9J03j1j33L1J80j66j5J1J74k17M4N1Q8k00L8J50p5q1J4J93
7193A40j98J8L2J45k25L7J07Oj42K9J66j33k0NJ72k12M5N0Q7j94M1J31o7p3PJ81
7219A35j81j0M4J50k23L2J06J8j62L5J77j36l8J4J89k31L4N9R2j92L5J35o2q9
7243f9J7J88j80NK1J58k23M4Q9L5j77L2J75j32l4J0J90k19K7M7J24k15M0J28n0
7268C1j16K7J97j86j6L6J75k38M3Q6L4j58K9J79j25o7K4K01k30L3O0J08k17L6
7292e4J34l4j18J7J87j68j8K5J67k33M4Q5N0j68K9J67j10p1K1J91k08J3N0J29
7316A27k25L6J42k9j36K4J96j75j7L1J78k30K8R0O0j95M1J74j07q1K6J86k10Q
$$ plain form
7143 -46 -11 128 -89 -53 62 37 -72 -54 118 -37 -47 -30 138 -82 -39 18 103 -84 -43 97 18 -59 -51 145 -60
7168 -60 -42 -13 140 -88 -39 64 53 -80 -49 131 -35 -50 -39 135 -82 -38 13 101 -99 -61 89 14 -67 -53 140
7193 140 -58 -40 -8 137 -88 -51 56 62 -80 -51 115 -18 -38 -33 139 -73 -28 22 109 -85 -44 87 20 -53 -46 135
7219 135 -46 -56 -12 138 -85 -53 53 71 -91 -56 121 -15 -53 -39 150 -81 -47 12 104 -88 -53 82 20 -69
7243 -69 -52 136 -44 -39 -18 140 -83 -39 50 85 -92 -60 115 -17 -51 -41 149 -70 -43 4 128 -87 -47 81 31
7268 31 -85 -58 139 -47 -63 -27 148 -90 -47 39 73 -85 -56 123 -2 -69 -45 156 -74 -41 19 127 -90 -54
7292 -54 80 46 -72 -55 132 -36 -54 -29 138 -95 -51 34 84 -84 -55 112 2 -69 -48 143 -65 -52 -2 127
7316 127 -98 -62 80 51 -85 -61 135 -40 -57 -26 152 -78 -50 40 100 -95 -54 120 13 -68 -42 144 -66 -58
7340e8N6J37k28L9J25k1j23J5J86j59l1K1J86k27K5Q2O9j87L3J65r6o9NJ99k00
7365e6ML5J57k35L7J24kj52K2K11j67m6L4J80k26K6Q1Q0k13M4J69r4r1K0K12k16
7391f2J7L2J55k36M0J07Qj43J6J81j28m4J5J93k31L3O3R8k07L5J56o8r1LK05j93
7417d6pM7J53k33L0J13J3j60L6J70j32n2J3K03k37L5O8J02k07K0J60n8j08PK16
7442A46j91j8M0J75k49M3R6L7j55QJ87j20n7MK22k42K5N3J17k06K2J46l6j22J5
7467f0K08j97j0K4J87k46L2R9M7j65J0J95j27o9K0K01k23K1N8J24k24K6J56l7
7491E0j16RK01j75k1J1J88k23K7Q2N7j58J4J67r8p6LK16k21PM9J29k12L5J14j1
7517D8j25NK04j65j5kJ95k21L1P3P2j95L1J67q3q4J1K18k17KM7J35k15K5J37j4
$$ plain form
7340 -58 -2 135 -93 -54 71 50 -73 -58 128 -31 -62 -41 145 -82 -57 25 94 -93 -60 105 9 -60 -55 144 -56
7365 -56 -52 -17 140 -95 -58 66 64 -88 -66 145 -22 -68 -34 146 -80 -54 27 107 -106 -62 107 13 -78 -58 154 -62
7391 -62 -45 -13 142 -94 -54 53 61 -82 -66 115 -13 -57 -42 151 -80 -47 16 114 -93 -58 98 30 -61 -58 147 -46
7417 -46 -53 -6 147 -86 -56 57 70 -90 -54 116 -16 -68 -55 148 -89 -54 14 116 -91 -71 89 31 -77 -70 146
7442 146 -45 -63 -23 152 -97 -54 42 79 -76 -68 119 -1 -58 -54 168 -74 -49 4 121 -85 -63 83 47 -75 -60
7467 -60 148 -49 -59 -35 152 -94 -62 37 84 -81 -71 124 -3 -72 -52 149 -74 -53 5 129 -95 -69 87 50
7491 50 -66 -57 144 -31 -52 -41 147 -76 -49 33 90 -68 -54 113 15 -61 -58 158 -63 -56 -7 122 -90 -55 59 48
7517 48 -77 -72 132 -33 -48 -50 145 -76 -45 28 100 -95 -64 103 20 -64 -53 165 -52 -50 -3 132 -83 -58 79 65
7543F5j38nK04j50l2J9J83k17J7P2P8j79J1J58o7q5%K06j95mK9J60k13K0J13J7
7569F7j49K0J87j45k9%K03k24L0N6R4j86J7J58p6q4pK09j86KK5J57k22L1J00J5
7595F3j42J1J79j24l6j0J96k05K0L7J07j74J1J46m6q7j5K05j80jNJ92k27J9R5
7620C9L8j41kJ79j13l8j3J97k12K2L9J09j80K2J43n0r4j0J94j77PpJ78k00PQ7
7646B4M4j41LJ53q2m6j6J91j83J6K4J17j73J6J16j8r0j0J82j51lj2J68j96L7N5
7672B5N7j54J5J55r0n5j7K03j92J3J7J39j90K2R0kq5k0J87j42pk8J83j83K0N0
7698A1P2j35oJ41p2m2l8J93j69K1lJ36j74K5Q5jr3k3J69j16j6k5J66j68K7K7R6
7725H8j43MJ20n4n3l8J85j47PMJ32j61K1P3J4q1k5J42r6pm1J68j53K0J4J09j50
$$ plain form
7543 65 -73 -78 126 -24 -56 -37 146 -71 -54 18 96 -83 -72 86 19 -66 -66 140 -55 -59 -30 130 -83 -63 50 67
7569 67 -82 -62 125 -20 -49 -49 154 -70 -40 16 110 -76 -59 99 23 -61 -68 141 -45 -43 -18 139 -83 -52 48 63
7595 63 -79 -68 111 -13 -49 -59 137 -68 -48 -11 96 -78 -67 79 33 -54 -69 136 -44 -45 -40 152 -75 -56 39
7620 39 77 -64 -66 113 0 -38 -51 146 -66 -44 -5 104 -76 -54 89 39 -55 -65 129 -48 -41 -48 130 -70 -63 24
7646 24 68 -73 -70 83 1 -45 -61 130 -53 -37 -13 104 -69 -53 63 45 -45 -55 127 -24 -27 -39 129 -67 -30 25
7672 25 82 -72 -57 98 8 -47 -64 139 -53 -40 -23 116 -74 -52 38 36 -49 -69 118 -24 -31 -59 124 -59 -39 11
7698 11 83 -52 -58 83 11 -31 -69 124 -45 -24 -27 109 -65 -40 45 44 -49 -72 97 -19 -35 -60 106 -62 -35 -8 88
7725 88 -55 -51 69 15 -38 -76 109 -38 -31 -27 105 -56 -35 38 52 -29 -54 88 -8 -15 -56 112 -41 -21 -7 102 -48
7752d8NJ05m2m4n0J64j19J0l9J50j48J1N4K8q0k2J39r4ll7J59j52K8J1R2j27L
7779d6J04l7n0k0J55j38J3j6J28j38K1L6N4j00j8J27q6jm3J58j58L1JQ2j04lP8
7806C0j6l3m7J31r5J3l7J45j28MK6N0o9k7J07n7j7l9J51j25K6j6R9j15jO9pl1
7834im1J30j06K3m2J29j28K5J1N3p8k1J04n5%n4J29j02K4k3R2j02J4L8Rl9l2J04
7862E3p6K4m2J22j21M3jM2o4j3P6l6k0l4J13j04K9k6R5r9J9L1qk9j3Q1o3J3m0
7891d8J10j06L4KL8n8jP5n2On0J03r5M1j7O7p4J5J6J0k9oO5n7J5m5R4q7K8rN0
7922C5o0J2K5j2j2k0R2q9K2k4Q0q9L0QK5m4jO4o3K2m1Q8q9N8l0M5n6J5L4j5j5
7953ej5P6p5L2m2P0p0L6rK0l6jN4n0J2l3Q4q7L4j8N0o0J7L0j1j0j5O3o8M5l9O0
$$ plain form
7752 -48 -43 62 20 -24 -74 90 -29 -19 -58 92 -56 -45 9 37 -43 -65 74 -20 -23 -60 99 -53 -25 -14 78 -49 -46
7779 -46 58 21 -29 -49 106 -32 -19 -35 93 -45 -24 12 66 -34 -52 75 -11 -12 -55 103 -55 -24 -23 59 -45 -48 30
7806 30 14 -19 -66 65 -30 -17 -54 91 -37 -33 -7 43 -26 -53 54 -3 -20 -59 92 -33 -7 -23 76 -39 -40 29 22 -9
7834 -9 -50 80 -26 -3 -45 84 -44 -19 -8 45 -33 -54 50 -5 -5 -59 70 -32 -8 -31 61 -41 -27 11 20 -19 -51 53
7862 53 -23 1 -41 81 -40 3 2 44 -20 -33 43 7 -13 -47 66 -38 -9 -35 60 -39 -20 11 3 -26 -39 42 -21 -8 -48
7891 -48 62 -44 -10 -8 30 -28 -29 46 -6 0 -50 53 -42 -1 -18 49 -25 -10 6 16 -13 -19 46 -11 4 -41 53 -34 -6 -15 35
7922 35 -25 -13 12 0 -12 -32 60 -29 -7 -31 49 -40 -10 -2 23 -21 -22 42 -21 1 -40 48 -41 17 -13 32 -24 -9 25 10 -5
7953 -5 -20 56 -19 13 -29 41 -29 7 -2 18 -18 -19 35 -15 -3 -36 48 -39 -5 -23 27 -33 -16 14 3 -7 -22 41 -27 18 -21 39
7985C9p3L5RJ3l6ML8m3K4k7N4p5N9l7M4n5K5K1mk0k0N9o1L6l4O4p0L5k6L6l6J6
8017fL4m8J8k5N6n5M2l6O0n8J3J2q%k0N6n6K8l2O9p6M4j8K8l1J3J1k5OnL5o7N0
8050Il4M0n6M8kKk0PK2m7L2l3N8n5L2oJ4l0J6J7k3Oj3N3p6N7m0M8n3L0kLmnL0
8085B5m5K7k4M5o9O5m6L3l3J2J9j5jj5M6n4M0k5M5o7N1j7J0k0KK9l4K3j6N1o8
8116b6M5k9K8l6K9omLk1M4n1K9k0M6o6M4j8KjoK9m3L4k1M4n3L0rL0m3K1Jj2%n
8151a1K7l9L9k3M5o0M8k1Nj2%J1k9L0k1J9k6L2k2L4m7L4olqpK5m0L0j9L0m7K7
8184emJ8j8J2J3l0J9
$$ plain form
7985 39 -34 1 10 23 -13 -9 29 -14 10 -17 37 -38 21 -16 28 -27 -2 19 15 -5 -25 34 -27 9 -25 39 -31 4 -22 14 -22 -6
8017 -6 28 -20 -2 -27 29 -26 16 -20 40 -18 -5 7 -1 -1 -21 35 -21 7 -25 44 -32 12 -6 22 -9 4 15 -10 -4 -9 26 -41 9
8050 9 -25 15 -41 7 5 7 -13 -6 16 -31 1 -32 26 -29 3 -3 11 -19 -3 14 -9 -3 -16 37 -39 18 -22 26 -27 3 1 4 0 -5 25
8085 25 -20 7 -17 28 -41 24 -22 11 -22 -10 9 -6 -7 -22 24 -30 10 -15 30 -37 14 -3 7 -13 -11 18 -16 7 -9 42 -26
8116 -26 19 -10 18 -18 11 5 1 4 -17 27 -24 5 -15 31 -35 9 -9 -7 -8 -14 15 -28 6 -15 29 -24 6 -3 27 -16 5 6 -6 -6 -11
8151 -11 16 -23 16 -7 38 -22 26 5 10 -2 -2 9 -20 10 -11 8 -18 14 -8 26 -21 13 7 4 -4 -11 14 -26 4 -15 15 -32 -5
8184 -5 -9 9 -9 3 16 -14 5
8191E
$$ Imaginary data points
##PAGE= N=2
##DATA TABLE= (X++(I..I)), XYDATA
0@%%%%%%%%%%%%%Qj6J6j6J6k4L2l7M5m8N6o7P5q5R7j08J17j30J46j62J78j94K13
36A12k33K53k76L00l24L50l78M07m40M76n14N52n95O44o97P58q26R05r98J107
56E83j236J394j590J832k141K544l080L815m864O441r002J3700k4676Q4196J59344
71B27260k89143j06036J92288K33839m53850J02143J95983O8722l99865J79382
81d9277K46082j81596j97991J68730K65064l84922K2127J56282J73101m27988
91b10388J50913J90822l2851k98711J71001K40455k64663q6603J48715K21866
101B30556l98507Q8672J56540Q3512l62646J59194K05878j36676j91764J49619
111a5622K35196l28403N550J35522J68044l84619J27946J65808j0013k79881J50186
$$ plain form
0 0 0 0 0 0 0 0 0 0 0 0 0 0 0 8 -8 8 -8 8 -16 16 -21 24 -24 32 -35 40 -45 52 -56 61 -69 77 -85 93 -101 112
36 112 -121 132 -144 156 -168 182 -196 211 -229 247 -267 285 -310 334 -363 395 -431 474 -524 583
56 583 -653 741 -849 983 -1158 1386 -1694 2121 -2743 3698 -5304 8396 -16280 67916 227260
71 227260 -61883 -167919 24369 258208 -195642 -93499 102484 171206 -228659 -49277
81 -49277 196805 15209 -182782 -14052 251012 -133910 -111783 44499 217600 -210388
91 -210388 -59475 131347 98496 -200215 -29214 211241 -53422 -140025 8690 230556
101 230556 -167951 -79279 77261 160773 -201873 -42679 163199 26523 -165241 -15622
111 -15622 219574 -108829 -103279 32243 200287 -184332 -56386 109422 99409 -180472 -30286
122c0286K14951k21774q9969J26768K09079l52230P1750J29438R4646l29631J37554
133c9704J74423r9794j80103J25661K08667k75206l642J07632J60905l34086J05926
144d9321J33256J2150k51161J25533J82970j75409q8833J04012J88425k99192
154a17570N3242J06538R7830k92943J15203J49572p1015j71044J09182J86429
164A65424k33116j5757R4323J52172k97466Q7293J15952K5527k33718J10210J61994
175A32838j43408r0785R0734J73186k61972M1516Q7651J00430k63878J00039J24130
186I0481m5919j58575R2013J63315j93751j9090P3053J43468k58807P4339Q9822
197E0349L8758k09001R3370J35450j10302q6585P3856J55339k22625L0056P1134
$$ plain form
122 -30286 184665 -37109 -127078 -310 208769 -143461 -71711 57727 152373 -177258 -39704
133 -39704 134719 34925 -145178 -19517 189150 -86056 -89698 17934 178839 -155247 -49321
144 -49321 83935 96085 -155076 -29543 153427 -21982 -110815 -6803 181622 -117570
154 -117570 -64328 42210 140040 -152903 -37700 111872 40857 -130187 -21005 165424
164 165424 -67692 -83449 10874 163046 -134420 -47127 68825 94352 -139366 -29156 132838
175 132838 -10570 -101355 -10621 162565 -99407 -57891 29760 130190 -133688 -33649 90481
186 90481 44562 -114013 -22000 141315 -52436 -71526 1527 144995 -113812 -39473 50349
197 50349 89107 -119894 -26524 108926 -1376 -87961 -14105 141234 -81391 -51335 19799
208A9799R9096k34745Q4931J05327k7769j48978Q0840J44356j62439k7285O5294
219a573J32610k28893N9803P9137M4179j92826Q2437J18502q7729q6055O5574
230a4834J39186j91444K0642N8682R6339k08985P3321Q5832j1519j36668O9194
241b0254J23349j32236k7742N0091J21754j97402N1527N8739N1563j72420P1665
252b1366R6770o4654q0903N4799J22922j62949J5027M6611R2440j86764O4379
263b3688P1317m05j28598O3223J07744j10867l2216M6638J10140j74901M2418
274b9195N1977N1440j58121O4870Q3171m9786p8974N0965J07153j38894Q712L9971
286C289Q4724j64325N6548N6736Q160j16435N6078Q9030q8286l1545L7747R7529
$$ plain form
208 19799 118895 -115850 -30919 74408 46639 -102339 -21499 122857 -39582 -66867 -1573
219 -1573 131037 -97856 -38053 41084 85263 -107563 -25126 93376 5647 -80408 -14834
230 -14834 124352 -67092 -46450 12232 108571 -100414 -27093 58739 47220 -89448 -20254
241 -20254 103095 -29141 -56883 -6792 114962 -82440 -30913 27826 79389 -93031 -21366
252 -21366 75404 10750 -70153 -15354 107568 -55381 -40354 6257 98697 -88067 -23688
263 -23688 47629 47224 -81374 -18151 89593 -21274 -53490 -6852 103288 -71613 -29195
274 -29195 22782 74222 -83899 -19029 64142 14356 -64618 -13653 93500 -45394 -36682 3289
286 3289 88013 -76312 -19764 36972 45132 -71303 -15225 73805 -14481 -46026 -8279 89250
298H9250j49802L7226L8070N2967j41232N8915O5683l4474p3815M4984R2725j18278
310c7781N688L2457P9790j48746N2251M6208J4245j10442N4062P6453p4115l3739
322d3669L6540Q7629j34177L1934L3815N1187j30842N5472N5552k5293p1500M3654
334i698P9331j00638J726K8730P1543j30697M6272L6451J8329j00217M9539O1910
346E2581n8166l2929L1929P5579j14365K7458K5596M9559j17193N1133M3535j5512
358A9205o8017M1284O7761q6175q73K5720O5952j19644M3768K9887K1517r6653
370e6268M9643N2877m8931l5018L2907O7746j04209K4510K3195M7444j10240M9895
382f449L5843r390o6223M1033N7471p3600l444K3562N8918j06165L9784K2950
$$ plain form
298 89250 -60552 -23326 14744 67711 -73521 -14606 51077 16603 -57212 -12228 80497 -37781
310 -37781 -32093 364 80154 -68592 -16341 29867 44112 -66330 -12268 64185 -9930 -43669
322 -43669 -7129 80500 -53677 -21743 12072 63259 -67583 -12111 43441 18148 -53352 -9698
334 -9698 69633 -31005 -29279 -549 70994 -59703 -13431 23020 41349 -58868 -9329 52581
346 52581 -5585 -38514 -6585 68994 -45371 -17913 7683 57242 -59951 -8818 34717 19205
358 19205 -48812 -7528 60233 -25942 -26815 -1095 64857 -54787 -11019 18868 40385 -56268
370 -56268 -6625 46252 -2679 -37697 -4790 62956 -41253 -16743 6452 53896 -56344 -6449
382 -6449 29394 20004 -46219 -5186 52285 -21315 -24759 -1197 57721 -48444 -8660 14290
394A4290K3242q8038M6351M1769l7409l4148L0183N7632q8770K0389J8856M4186
406D8533r9012M6131K8174l710o3216M0019M8403o2836o276K3302N3273r7432
418d4647L6954K0107K4043q5483M7050L5377l1219l6046L2063N1093q1123J7852
430a3979J7833M2159r4027M5538K2381Q49o2161M0374M0222n3323p945K1494M7780
443D7195q7024L4105J4472K5569p8948M4495K7025k2607l5389L0231M3216o9312
455b6972J4425J5245L8960q4997M1941J7769M246n9830L9709L3910m5629j0972
467b2195K3001M2474q0056L0916J4290K4593p6424M4444K3258j8512l7386L2504
479I07L7980o3285J1572J5700L6588q0700M0970J3757P581n8908L9788K7528l7766
$$ plain form
394 14290 37532 -50506 -4155 37614 205 -33943 -3760 53872 -34898 -14509 4347 48533
406 48533 -50479 -4348 23826 20116 -43100 -3081 45322 -17514 -23790 -488 52785 -44647
418 -44647 -7693 12414 36457 -49026 -1976 33401 2182 -33864 -1801 49292 -31831 -13979
430 -13979 3854 46013 -48014 -2476 19905 20754 -41407 -1033 39189 -14134 -22079 -585 47195
443 47195 -39829 -5724 8748 34317 -44631 -136 26889 4282 -31107 -876 42340 -26972
455 -26972 -12547 2698 41658 -43339 -1398 16371 20617 -39213 496 34406 -11223 -22195
467 -22195 806 43280 -36776 -5860 8430 33023 -43401 1043 24301 5789 -31597 907
479 907 38887 -24398 -12826 2874 39462 -41238 -268 13489 21070 -37838 1950 29478 -8288
492h288j2674K1526L8425p1853K8499R726K6159p1487M2480J6511j1376l6982
504b9334L0722L2207n4067Q609J3783L4378p3922L7921J0750R954n7248L9187
516B940K3169l2171j5282K3115L4171o6120K4929J0972K4547o9034M1590J4748
528A7574q969l8350L2523K7938m8750N515J4921L1648o9236L5760Q469J2064n5818
541c4711L8602J8109k5493j6846K2022L0376n8620K2466P256K5771o4575L9543
553C900R245k801l8388L1303K3123m1191L037J3379K9993o3991L3419O011J4145
566B1184n4798L8244J4784k1057j9258K3611K7053n4205J9420Q757K4018o2215
578c4462L8318Q342j242l9053L2199J9956l6623O8J4708K7077n8983L0502M851
$$ plain form
492 -8288 -20962 564 38989 -32864 -4365 5361 31520 -39967 2513 19024 7648 -29334
504 -29334 1388 33595 -20472 -11863 1920 36298 -37624 297 11047 21001 -36247 2940
516 2940 26109 -6062 -21344 1771 35942 -30178 -5249 5723 30270 -38764 2826 17574
528 17574 8605 -29745 2778 30716 -18034 -12519 2402 34050 -35186 574 9043 21107 -34711
541 -34711 3891 22000 -3493 -20339 1683 32059 -26561 -4095 3161 28932 -35643 3900
553 3900 13145 10344 -28044 3259 26382 -14809 -11772 1607 31600 -32391 1028 7039 21184
566 21184 -33614 4630 19414 -1643 -20901 2710 29763 -24442 -5022 3735 27753 -34462
578 -34462 3856 12198 10956 -28097 4102 24058 -12565 -12497 2211 29288 -29695 807 5658
591E658J5113n2327L6512J1049j5472k0354K2339K3613m6932J6350O284K4419
603B6252n7660L5875M157L615l8762L0950J5895l0035k372J3714K5610n4621K8424
616A042L104J6802n1878L6611Q239j1806k2585K3967K0817m3417J3842P540K3113
629B5391n5810L4747L570M909l9338L1642J3212k6108m767J4582K3040m9743K5258
642E85K510J7144m8828L4109N610p330k3092K2491J7800l6718J0691N979K2588
655B3539n0726L1500R34Q284l8434L0057J0174k0699p042J4271K1274m5659K3052
668E25J593J8101m8181L3978L522m398k5095K4057J5384l3718Q441P156K1498
681B2863m9255L0725J07R630l8829L0421P787j7055r090J4709J9132m1182K0209
$$ plain form
591 5658 20771 -31556 4956 16005 533 -19821 2518 26131 -20801 -4451 1833 26252
603 26252 -31408 4467 8624 12239 -26523 4427 20322 -9713 -12085 1629 27239 -27382 1042
616 1042 4146 20948 -30930 5681 13920 2114 -20471 3496 24313 -19104 -5262 2278 25391
629 25391 -30419 4328 7898 12807 -26531 5111 18323 -7785 -12552 2030 25070 -24673 585
642 585 3095 20239 -28589 5520 11130 3800 -19292 3199 20999 -15719 -5028 951 23539
655 23539 -27187 4313 5247 13531 -24903 5154 15328 -5371 -12413 1858 23132 -22527 525
668 525 2118 20219 -27962 6016 9538 5140 -19955 4102 19486 -14232 -5791 1365 22863
681 22863 -26392 4333 4440 14070 -24759 5662 13449 -3606 -12696 2013 21145 -20037 172
694A72R11J8341m5028L1354J312o12k5021K2225J2846k7640N523O004K0490m4012
708b3135K7055j286J1554l7170K8511N534j2794j0835J4667J7152l7184J7628
720c03J136J8115m3756L0745J04J304k6498K3713J0524k4903L377P391J9111m2378
734b2318K6148j863J2651l7514K8927L223r374j2654J5037J5106l3044J5195K44
747b36J8502m0928K8393j906M675k6360K2037Q317j9665R16O471J8010l7645K2779
761C360k651J3688l5494K6749J924o351j3910J5146J3258k9593J2666J299J7291
774A7382l9041K7118j995N369k6971K2922O648j7503j009P999J6314l5634K1428
787C027k656J4090l5142K6658j1l307j5387J5272J1373k5617J0376M45J7580l6383
$$ plain form
694 172 1083 19424 -25604 5750 7062 6450 -18571 3654 16500 -11140 -5617 387 20877 -23135
708 -23135 3920 2634 14188 -22982 5529 11063 -1731 -12566 2101 19253 -17931 -303
720 -303 833 18948 -24808 5937 6041 7345 -19153 4560 15084 -9819 -6442 949 20060 -22318
734 -22318 3830 1967 14618 -22896 6031 9254 -120 -12774 2263 17369 -15675 -480 -236
747 -236 18266 -22662 5731 3825 8500 -17860 4177 12494 -7171 -6255 216 18226 -19419 3360
761 3360 709 14397 -21097 5652 7576 1225 -12685 2461 15719 -13874 -1208 91 17382
774 17382 -21659 5459 3464 8833 -18138 4784 11432 -6071 -7080 919 17233 -18401 3027
787 3027 371 14461 -20681 5977 5966 2659 -12728 2544 13917 -11700 -1324 -879 16701 -19682
801a9682K5076m035Q492k6787K1490M460j2763l138P169J5312l1521J8541l266
814f52J4829l3378K4858r88j078j6214J5432R695k2696Q071J814J6004l4337K3446
828D806l267Q206k6711K1849L396j1191m701Q670J3428k9175J6676k584J4454
841A3856l2226K3962k124J207j7164J5352P935j8962N874J260J5853l1507K1328
854D644m904J0810k6475K0667J380p070o550Q171J2305k5665J4366l037J4905
867A3547l0816K2754l069K997j7964J5816O414j6704L996K742J4187k9735J9961
880D126l965J0054k5983K0695P45o043p681R441J0509k3360J2414j993J3864k8944
894a6121K1222l474M360j8062J5222M929j3260J935K493J3531k6616J7596m896
$$ plain form
801 -19682 5394 1359 9851 -16936 4554 9014 -3749 -6887 282 15594 -15927 2614 -652
814 -652 14177 -19201 5657 4669 3591 -12623 2809 12504 -10192 -2121 -307 15697 -18640 4806
828 4806 1539 9745 -16966 4883 8279 -2912 -7613 1057 14485 -14690 1986 -598 13856
841 13856 -18370 5592 3468 4675 -12489 2863 10798 -8164 -2290 -1030 14823 -16684 4644
854 4644 -260 10550 -15925 4742 6122 -948 -7498 673 12978 -12687 1679 -1358 13547
867 13547 -17269 5485 2416 5413 -12551 3265 9679 -7025 -3029 -287 13900 -15835 4126
880 4126 161 10215 -15768 4927 5672 -371 -8052 1389 11898 -11462 952 -1041 12823 -16121
894 -16121 5101 1627 5987 -12075 3147 8076 -5184 -3249 -756 12775 -13841 3755 -1141
907a141J1674k5170J9383r12k592r215R184R264k0182J0339k107J3950k7724K0341
921E092m286N794j8884J5980L400j1374L65L906J1984k5185J6516m021J0950k4815
935a4578J9497j413j856j0064J0212P717j8115Q532j090J2839k5665J8465m167
948C14O556j8451J4929K515q603j324L738J1132k2001J3919m222J1663k3420J7735
962D480k231N65j1068R985O537j5349O586o89J2340k4359J7593m516P311j9026
976a1841J5760J135p103k731N302R555k0844J3105l400J0932k3182J8042k840
989A890J312j1880J0965N119j3517N042J65J1315k2435J5901m421P880j8385J4611
1003C562M29m767m001M997Q748j7855J0600l203J0982k1400J6046l040K783j2250
$$ plain form
907 -1141 10533 -14637 4746 3834 1242 -7973 1211 10475 -9707 632 -1475 12475 -15249 5092
921 5092 806 6600 -12284 3696 7096 -4278 -3913 -7 11977 -13208 3308 -713 10237 -14578
935 -14578 4919 3506 1650 -8414 1798 9515 -8600 -68 -1158 11681 -13984 4481 314
948 314 6870 -11581 3348 5863 -2740 -4064 -326 10806 -11195 2724 -1498 10165 -13255 4480
962 4480 2249 2814 -8254 1731 8268 -7081 -495 -1184 11156 -13203 4390 -126 7185 -11841
976 -11841 3919 5054 -2049 -4780 522 10077 -10767 2338 -1062 9870 -13312 4730 1890
989 1890 3202 -8678 2287 7406 -6111 -1069 -904 10411 -12024 3877 -544 7336 -11049 3562
1003 3562 3991 -776 -4777 220 8968 -8887 1713 -1490 9492 -11908 4138 1098 3881 -8369
1017h369J0565M205j1296L348Q58J0409k0940J4748m050P819j8492J5139m48l812
1031c16n157O554P198j6759R749k271J0215k1146J6240l478L432j3043J1478K905
1045E601r562J896J552R636j9282J3249m097Q523j7988J4045j000j728o302O223
1059G66O580j4210P531j984J0102j9412J4274l300M284j3061J0918K427p994N50
1073b529K383Q565j7825J1981l190P813j7607J4133j275j426p002P499N294j3298
1087f484O628q17R081j8898J4135l395M661j3586J1497J402o414p81K923P932
1101G884j6277J0544l253Q537j7240J3197j859N69q100P213M765j1072M750o49
1115i91R091j7529J2494l152N253j3542J1031J086n281j834L695O986j5098R406
$$ plain form
1017 -8369 2196 6401 -4895 -1547 -689 9720 -11220 3528 -522 7297 -11195 3944 3496 -316
1031 -316 -5473 1081 8279 -8480 1269 -1002 9213 -11933 4307 829 4261 -8782 2696 5601
1045 5601 -3961 -2065 -513 9123 -10159 3090 -1007 7516 -10472 3573 2573 845 -5457 766
1059 766 7346 -6864 667 -1317 8785 -10627 3647 347 4631 -8430 2488 4915 -3079 -2529
1073 -2529 -146 8419 -9406 2575 -615 7198 -10409 3724 2449 1023 -5979 1520 6814 -6484
1087 -6484 144 -673 8408 -10490 3645 250 4911 -8675 2822 4224 -2190 -2971 -48 7884
1101 7884 -8393 2151 -1102 7435 -9805 3392 1533 2102 -5998 1215 5980 -5092 -342 -991
1115 -991 8100 -9429 3065 -87 5166 -8376 2655 3741 -1540 -3374 321 7307 -7791 1615
1129A615k163P552j6632J2969j615L27q414Q145L837j0389L881N46P971j6737
1143i107J1913k788N233j3671J1137N08l990l004M122O442j3572P899k104Q178
1157G196j6226J2014k058K108r429P922L387q435K174P66P999j5690J0663k702
1171c11N877j3852J0938K14l088l952M894N672j2754P002j062P246j5741J1783
1185B866j665J697r574Q569K814q029J472J797P044j4846R783k022N588j3574
1199h080J0504J30k120m839M980N407j1315N452q87P697j5112J0569j785L161
1213C762j0369Q195K516o288p0J994P087j3954Q683j924O183j3871J0493k02j325
1228I10n741N786M693j0662M718k0P003j4870J0491j477K859j0551Q716K117n952
$$ plain form
1129 1615 -548 7004 -9628 3341 1726 2053 -6361 1784 5621 -4768 -887 -341 7630 -9107
1143 -9107 2806 18 5251 -8420 2717 3225 -765 -3769 353 6795 -6777 1122 -982 7196
1157 7196 -9030 2984 926 3034 -6395 1527 4914 -3521 -1347 -581 7418 -8272 2391 -311
1171 -311 5566 -8286 2652 2866 -222 -4174 720 6392 -6362 640 -422 6824 -8917 2866
1185 2866 1201 2898 -6676 1893 4707 -3322 -1850 -53 6991 -7855 1928 -94 5494 -8080
1199 -8080 2424 2554 434 -4405 575 5982 -5333 119 -768 6929 -8183 2386 601 3762
1213 3762 -6607 1588 4104 -2184 -2254 -260 6827 -7127 1556 -368 5815 -8056 2437 2235 910
1228 910 -4831 955 5648 -5014 -296 -316 6687 -8183 2308 831 3690 -6861 1855 3972 -1980
1243a980o84K764O402j3186P777j304N980j3451R707K8n86o341N512M693r340
1258d009L222J37P362j4013Q988j287L885j0909Q038K114m537j979K884O402j2299
1273f001O699j094O358j3608R671k45R2p153O299M013q816K645Q93O771j3905
1288g381R094j212L830j1236Q609J620m055k611L503N898j1624N874o76O374j3262
1303g255Q887r4Q82p634N808M150p585J283R24P127j2968P522r12M607j1282P710
1319A170J818k983l559L509N893j0792M858l41O475j3180Q707j59J235q181O465
1334I35L551p113P66J599O598j2841P565q48M653j1664Q248J297k359m279M003
1349A11N513j0099M088j90O771j2949P974j91K240q721N943L671n867m58J456
$$ plain form
1243 -1980 -2664 100 6502 -6684 1093 -211 5769 -7682 2025 2053 1467 -4874 638 5331 -4009
1258 -4009 -787 -650 6712 -7301 1687 400 4285 -6624 1414 3528 -1009 -2988 -104 6298 -6001
1273 -6001 698 -396 5962 -7646 2025 1780 1872 -5281 1018 5031 -3785 -1140 -247 6524 -7381
1288 -7381 1713 501 4331 -6905 1704 3324 -731 -3342 161 6059 -5565 309 -367 6007 -7255
1303 -7255 1632 1538 2420 -5214 594 4744 -2841 -1558 -634 6493 -6475 1047 135 4742 -6540 1170
1319 1170 2988 5 -3554 -45 5848 -4944 -86 -427 6048 -7132 1575 1416 2651 -5530 935
1334 935 4486 -2627 -1861 -262 6336 -6505 1060 212 4865 -6799 1449 2746 387 -3892 111
1349 111 5624 -4475 -387 -577 6194 -6755 1219 1028 3268 -5453 490 4161 -1706 -2164 -708
1364g08P006j1944O129o51N362j1523P252J569j512m926L835N546r369L240J46
1379e48O652j2628P620m2K283q914O277L291n555q41K040O440j1678O045n59N340
1395E223j1701P571J098q33n581M203N163q553K437J54P052j2367O958l21L490
1410C993r496N866L171m160j990J798O831j0803M826n77O099j1626O803J173l7
1425A871o092M047N099p886J768M46O809j1967O606j12L310r444O070K895m026
1440f06k189K302O240j0433M619l63N882j1518O861Q88M86o526M207M778p021
1455b393R76M10P149j1581N908m26M482r934N665K648k578l292K087O488r577
1470c968L610n24O635j1518O353O83J370p061M242M526o375M42O57O855j1218
$$ plain form
1364 -708 6298 -5646 483 -168 5194 -6329 923 2492 980 -3946 -111 5435 -3934 -694 -548
1379 -548 6104 -6524 1096 1054 3337 -5577 700 3991 -1564 -2405 -365 6075 -5603 442 -117 5223
1395 5223 -6478 1093 2191 1358 -4223 -20 5143 -3410 -973 -819 6233 -6134 824 503 3993
1410 3993 -5503 363 3534 -626 -2616 -818 6013 -4790 36 -541 5558 -6068 735 1908 1871
1425 1871 -4221 -174 4925 -2961 -1193 -747 6062 -5905 701 589 3899 -5545 525 3420 -606
1440 -606 -2795 -493 5747 -4686 -67 -430 5452 -6066 795 1683 2169 -4357 -150 4628 -2393
1455 -2393 -1417 -1007 6142 -5439 469 43 4525 -5409 256 2904 326 -2966 -879 5609 -3968
1470 -3968 -358 -882 5753 -5765 588 1271 2641 -4420 -178 4348 -2027 -1585 -928 5927 -5291
1485e291N726l28M272r821N884K352k486l383K489N944r215L422l04O342j1187
1500e584O139N76J723p251M144M322n518l02N79P095j0639M859n48N276j0098
1515e227N385K126j139m351K286O046q261K448m56O943j1143N801K27K595p779
1530d499M341L850m816p77Q63O705j0304M846n91N148j0049N691J727r74m437
1545c276K632N510p847K249l01O653j0715N472J68K883p793M040L753m053j379
1560b004O83O876r569L899o85N856r969M974J624J30n126K373N514o912J396l98
1576a338P002j0485N170j89L585q211M380L133l369j813J080O331r237L979p87
1591g69N730r996N469J009M35n330K859M828o396J168k63O743j0106M912l22L899
$$ plain form
1485 -5291 435 107 4379 -5442 442 2794 308 -3075 -586 5358 -3857 -435 -739 5603 -5584
1500 -5584 555 1131 2854 -4397 -253 4069 -1449 -1751 -1172 5923 -4716 143 -405 4871 -5227
1515 -5227 158 2284 1145 -3206 -920 5126 -3135 -687 -1143 5800 -5343 458 685 3280 -4499
1530 -4499 -158 3692 -1124 -1901 -1038 5667 -4637 209 -382 4766 -5283 408 2135 1161 -3276
1545 -3276 -644 4866 -2981 -732 -1033 5620 -5095 377 545 3428 -4365 -325 3428 -625 -2004
1560 -2004 -1321 5555 -4014 -115 -800 5056 -4913 61 1685 1815 -3311 -938 4576 -2336 -940 -1338
1576 -1338 5664 -4821 349 160 3745 -4466 -86 3047 -322 -2135 -1055 5276 -3961 18 -769
1591 -769 4961 -5035 434 1443 1878 -3452 -593 4235 -2161 -993 -1256 5487 -4619 293 -29 3870
1607C870q194M073K987k556k391Q77O457q458L057q38O257r734M666J027J274
1622B374n728K515M818n579M70k72O809r704M551n02M250q347M324K434k045k700
1638b332J319N810q071L078q28O007r703N152L97J624n993L046M082m973J52j22
1654a355O577r308M285p21M738q462M120K186j150l299J120N889p276K225r11
1669a342O452r365M379M08K308o234K691M046m269m09r7O482q830L919p27M730
1685D142q313M211J774q81l394J521N186o862K224p86O023r175M740p1K519o410
1701c552L205L277l599p62J00O162q349L632r76N208q410M087J373J18m052J456
1717a082N096n998J385q48O375q858M110j61L166o617K954L166k996j210J77N926
$$ plain form
1607 3870 -4324 -251 2736 180 -2211 -1334 5123 -3335 -278 -1116 5141 -4593 73 1100 2374
1622 2374 -3354 -839 3979 -1600 -1130 -1402 5407 -4297 254 -248 4002 -4345 -21 2413 368 -2332
1638 -2332 -1013 4797 -3274 -196 -1024 4983 -4720 432 829 2453 -3540 -494 3588 -1385 -1233 -1355
1654 -1355 5222 -4086 199 -522 4216 -4246 -126 2060 910 -2389 -1269 4620 -2656 -431 -1342
1669 -1342 5110 -4255 124 532 2840 -3394 -703 3343 -926 -1335 -1432 5050 -3780 139 -588 4142
1685 4142 -4171 40 1814 933 -2461 -940 4246 -2616 -392 -1178 4845 -4330 410 339 2858 -3552
1701 -3552 -347 2930 -669 -1431 -1331 4831 -3518 114 -862 4346 -4064 23 1396 1514 -2538 -1082
1717 -1082 4014 -1984 -599 -1447 4928 -3930 180 19 3185 -3432 -478 2688 -308 -1518 -1341 4585
1733D585p838L300r03N018q151M163J087J54l978J815M433n654J407o48N821q507
1749c896M269m18L153o597L290K558k408j570M02N578p297K907j023N382q184
1764c854L970P25J129m659J836M223m747N86o44O060q193L772n79L774o864L252
1780b13K247j756k011N99N229o831K694r33N109p926M102M54J072m510K148L625
1796C099m474O20l95N450p785L793o46L594o659L334J882j360k251P27M921o247
1812b397K202r49N349p790L738K68J865n047K130L425l614j94l11N574p399L322
1828A72p72M100o897L404J476p06k711J067M422n760K011q18M993p541L952n3
1844C39J824m976K534K807l351j81m4M966o978L270p67L891o669L377J279m06
$$ plain form
1733 4585 -3253 47 -856 4162 -3989 174 1261 1415 -2563 -748 3685 -1969 -562 -1210 4611 -3896
1749 -3896 373 -45 3108 -3489 -199 2359 -49 -1619 -1217 4361 -2936 -29 -1052 4330 -3854
1764 -3854 116 841 1970 -2689 -853 3370 -1377 -791 -1435 4625 -3568 204 -375 3399 -3465 -213
1780 -213 2034 278 -1733 -1134 4095 -2736 -42 -975 4134 -3792 310 764 1836 -2674 -526 3099
1796 3099 -1375 -755 -1150 4300 -3485 308 -338 3256 -3403 -69 1813 453 -1798 -1071 3850 -2397
1812 -2397 -195 -1144 4205 -3585 153 421 2286 -2761 -631 2794 -820 -1014 -1325 4249 -3150 172
1828 172 -600 3500 -3397 7 1483 777 -1934 -867 3555 -2205 -194 -1012 3981 -3560 392 339
1844 339 2163 -2813 -279 2528 -823 -1004 -1048 3918 -3060 210 -557 3334 -3335 42 1321 915
1860I15k885J095M245n222J470p39N125p297L450l7K386n288K346K727k597r08
1876a214Q8M977o573K784p78M199o801L470Q92J16l284J524L647m744J280n39
1892i56M702p074L733l84K382n317K857K043k276r81M20M393o164K710p58M039
1908C369o601L407P33M21l490J522L552m262P58m58M833o776L124k33K765n475
1924b811K556K109j733j529M74M385n750K205o39M131o562L363N10P44l721J869
1940c99K999l836N90k01M359o505L316n03K756n514L037J456j362j694Q34L847
1956C180n326K047o12M062o425L295L19J160m011J864K890l289mj10M506o210
1972b664K712l59L098n602K663J591r17k133Q26L861m945J591m79M046o236L134
$$ plain form
1860 915 -1970 -875 3370 -1852 -382 -1121 4004 -3293 157 120 2506 -2782 -436 2291 -306 -1214
1876 -1214 -1126 3851 -2722 62 -716 3483 -3318 152 1044 1160 -2124 -600 3047 -1697 -417 -956
1892 -956 3746 -3328 405 21 2403 -2914 -57 1986 -290 -1271 -851 3542 -2622 88 -670 3369
1908 3369 -3232 175 908 1329 -2161 -639 2913 -1349 -591 -1049 3784 -2992 132 -101 2664 -2811
1924 -2811 -255 1854 121 -1408 -934 3451 -2299 -94 -733 3398 -3164 199 709 1453 -2268 -399
1940 -399 2600 -1236 -646 -847 3512 -2993 323 -180 2576 -2938 99 1555 193 -1501 -667 3180
1956 3180 -2146 -99 -711 3351 -3074 221 540 1700 -2311 -447 2443 -846 -850 -960 3546 -2664
1972 -2664 48 -311 2787 -2815 -152 1439 522 -1611 -785 3076 -1869 -278 -757 3289 -2947 187
1988A87K52J257m013K052K472k992o5J01L987n860K826m99K947n494K993J044
2004A195n97k276J140L333m480J365m25L991o088L020O7J715m360K086K319k376
2020c71o96J95M109n539K225m00L336n586K673J113j60k654J122L319m115J003
2036d26l21L894n844K855N3J679m208K158J981k189o43L36L647n207K281m52L069
2053B663n350K821P55M0k718J325K903l678P31k55L842n622K624p4K144m537K143
2070b43J856j535j304M30L735m817J690l88L445n435K565O99N30l058J335K788
2086B293l271M08j77L716n355K506j68K093m318K164J544j403j176N07L291m484
2102a830J749m49L171n109K562N02N98k973J339K531k896J59j43L680n078K183
$$ plain form
1988 187 439 1696 -2317 -265 2207 -785 -850 -749 3238 -2622 204 -295 2652 -2842 151 1195
2004 1195 598 -1678 -538 2795 -1685 -320 -745 3246 -2842 178 245 1960 -2400 -314 2005 -371
2020 -371 -1067 -872 3237 -2302 -77 -477 2859 -2727 -54 1059 899 -1755 -633 2686 -1429 -426
2036 -426 -747 3147 -2697 158 211 1890 -2318 -160 1821 -368 -1011 -675 2972 -2235 46 -406 2663
2053 2663 -2687 134 889 929 -1789 -464 2439 -1239 -508 -763 3079 -2543 81 7 2151 -2386 -243
2070 -243 1613 78 -1226 -796 2939 -1878 -188 -576 2869 -2566 -1 698 1228 -1830 -495 2293
2086 2293 -978 -570 -747 2969 -2386 120 -48 2045 -2273 -109 1435 32 -1144 -637 2654 -1830
2102 -1830 -81 -530 2641 -2468 94 596 1194 -1779 -440 2091 -805 -646 -789 2891 -2187 -4
2118dj92K460m504K032J471q18j743N56L358m068J165l94L480n119K324L74J103
2135A481l325J439K273k439j18n6L460m762K115l36K408m318K145J072o38j618
2151a217O34K896l727J225m47L203m776K288K01J161l174J334K112k121k99r6
2167h03L463m464J734l18K680m343J849J122j82k036N88K965l322P14m12L392
2183B627m676K051O5J542l382J439J791j660n58J8L167m120J733m97K620m173
2199b013K058O19N2j959P55K432k940P55m66L120m341K022j16J625l276J359J627
2216A313j349p26m1L162l811J361m70K819m123J719O96M07k220O12K519k602L66
2233c68m67L236m169J801k03J848l314J406J312r91q44Q4K762l449J401o38K675
$$ plain form
2118 -4 -196 2264 -2240 -208 1263 445 -1298 -742 2616 -1452 -287 -681 2799 -2320 4 378 1481
2135 1481 -1844 -405 1868 -571 -689 -745 2715 -2047 68 -268 2140 -2178 -33 1039 401 -1217
2151 -1217 -583 2313 -1414 -189 -636 2567 -2209 79 280 1441 -1733 -399 1713 -408 -707 -803
2167 -803 2660 -1804 -70 -388 2292 -2051 -202 920 738 -1298 -710 2255 -1067 -353 -765 2627
2183 2627 -2049 2 67 1609 -1773 -334 1457 -203 -761 -743 2424 -1696 37 -460 2160 -2013
2199 -2013 45 664 716 -1243 -488 1944 -996 -241 -707 2413 -1928 94 -22 1603 -1673 -314 1313
2216 1313 -36 -762 -803 2359 -1452 -91 -561 2258 -1865 -146 550 957 -1263 -651 1868 -734 -368
2233 -368 -835 2401 -1768 33 -170 1678 -1636 -230 1082 91 -753 -669 2093 -1356 45 -593 2082
2250B082l906J955J88O17k158Q50J921k194L46m27K915l861J815m31J979l296
2266a605J441J059o08j094Q2K733l156J062o12K853l843J671K27R18k362P36J965
2283A467j906P7m49K959l649J626m93K050l211J464P83m02j045J60K305k823J154
$$ plain form
2250 2082 -1824 131 319 936 -1222 -372 1549 -645 -299 -726 2189 -1672 143 -288 1691 -1605
2266 -1605 -164 895 287 -807 -725 2008 -1148 -86 -698 2155 -1688 -17 210 1128 -1234 -498 1467
2283 1467 -439 -362 -811 2148 -1501 125 -368 1682 -1529 -65 718 316 -729 -569 1736 -1087 67
$$ [...]
8191h
##END NTUPLES=NMR FID
##END=
