##TITLE=1H_DE-80H_X3
 200.13MHz, d2o
 8 sc
 
 19ns.26.2.2025
##JCAMPDX= 6.0         $$ Bruker NMR JCAMP-DX V2.0
##DATA TYPE= NMR FID
##DATA CLASS= NTUPLES
##ORIGIN= UXNMR, Bruker Analytische Messtechnik GmbH
##OWNER= pz
$$ XWIN-NMR		Version 3.5
$$ Tue Feb  3 11:40:27 2026 Russian Standard Time (UT+4h)  Yarkov@DPX200
##.OBSERVE FREQUENCY= 200.1313
##.OBSERVE NUCLEUS= ^1H
##.DELAY= (6, 6)
##.ACQUISITION MODE= SIMULTANEOUS
##.ACQUISITION SCHEME= undefined
##.AVERAGES= 8
##.DIGITISER RES= 18
##SPECTROMETER/DATA SYSTEM= spect
##.PULSE SEQUENCE= zg30
##.SOLVENT NAME= CDCl3
##.SHIFT REFERENCE= (INTERNAL, CDCl3, 0, 14.3821)
##AUDIT TRAIL= $$ (NUMBER, WHEN, WHO, WHERE, WHAT)
$$ ##TITLE= Audit trail, XWIN-NMR		Version 3.5
$$ ##JCAMPDX= 5.01
$$ ##ORIGIN= Bruker BioSpin GmbH
$$ ##OWNER= Yarkov
$$ C:/Bruker/XWIN-NMR/data/yarkov2/nmr/H-C/1/audita.txt
$$ ##AUDIT TRAIL=  $$ (NUMBER, WHEN, WHO, WHERE, WHAT)
(   1,<2026-02-03 11:38:23.40 +0400>,<Yarkov>,<DPX200>,
      <created by zg, POWCHK disabled, PULCHK disabled
       configuration hash MD5:
       00 E9 B6 7A A2 85 ED C7 34 08 36 98 17 FE 4E 26
       data hash MD5: 16K
       1E 2F 74 E9 C8 93 74 60 2C F3 8D CE 8E A2 04 6E>)
$$ ##END=
$$ 
$$ hash MD5
$$ 82 E4 11 4B B5 B4 4A 36 72 F7 4C 9C C4 E4 44 FC
##$RELAX= 
##$RELAX= 
##$RELAX= 
##$RELAX= 
##$RELAX= 
##$RELAX= 
$$ Bruker specific parameters
$$ --------------------------
##$DU= <C:/Bruker/XWIN-NMR>
##$EXPNO= 1
##$NAME= <H-C>
##$PROCNO= 1
##$TYPE= <nmr>
##$USER= <yarkov2>
##$AMP= (0..31)
100 100 100 100 100 100 100 100 100 100 100 100 100 100 100 100 100 100 
100 100 100 100 100 100 100 100 100 100 100 100 100 100 
##$AQSEQ= 0
##$AQ_mod= 1
##$AUNM= <au_zg>
##$AUTOPOS= <>
##$BF1= 200.13
##$BF2= 200.13
##$BF3= 200.13
##$BF4= 200.13
##$BF5= 200.13
##$BF6= 200.13
##$BF7= 200.13
##$BF8= 200.13
##$BYTORDA= 1
##$CFDGTYP= 0
##$CFRGTYP= 5
##$CHEMSTR= <none>
##$CNST= (0..31)
1 1 145 1 1 1 1 1 1 1 1 1 1 1 1 1 1 1 1 1 1 1 1 1 1 1 1 1 1 1 1 1 
##$CPDPRG= <>
##$CPDPRG1= <>
##$CPDPRG2= <>
##$CPDPRG3= <>
##$CPDPRG4= <mlev>
##$CPDPRG5= <mlev>
##$CPDPRG6= <mlev>
##$CPDPRG7= <mlev>
##$CPDPRG8= <mlev>
##$CPDPRGB= <>
##$CPDPRGT= <>
##$D= (0..31)
0 0.7 0 0 0 0 0 0 0 0 0 0.03 0 0 0 0 0 0 0 0 0 0 0 0 0 0 0 0 0 0 0 0 
##$DATE= 1770104302
##$DBL= (0..7)
120 120 120 120 120 120 120 120 
##$DBP= (0..7)
150 150 150 150 150 150 150 150 
##$DBP07= 0
##$DBPNAM0= <>
##$DBPNAM1= <>
##$DBPNAM2= <>
##$DBPNAM3= <>
##$DBPNAM4= <>
##$DBPNAM5= <>
##$DBPNAM6= <>
##$DBPNAM7= <>
##$DBPOAL= (0..7)
0.5 0.5 0.5 0.5 0.5 0.5 0.5 0.5 
##$DBPOFFS= (0..7)
0 0 0 0 0 0 0 0 
##$DE= 6
##$DECBNUC= <off>
##$DECIM= 32
##$DECNUC= <off>
##$DECSTAT= 4
##$DIGMOD= 1
##$DIGTYP= 9
##$DL= (0..7)
0 120 120 120 120 120 120 120 
##$DP= (0..7)
150 150 150 150 150 150 150 150 
##$DP07= 0
##$DPNAME0= <>
##$DPNAME1= <>
##$DPNAME2= <>
##$DPNAME3= <>
##$DPNAME4= <>
##$DPNAME5= <>
##$DPNAME6= <>
##$DPNAME7= <>
##$DPOAL= (0..7)
0.5 0.5 0.5 0.5 0.5 0.5 0.5 0.5 
##$DPOFFS= (0..7)
0 0 0 0 0 0 0 0 
##$DQDMODE= 0
##$DR= 18
##$DS= 0
$$ [...]
##$SUBNAM2= <"">
##$SUBNAM3= <"">
##$SUBNAM4= <"">
##$SUBNAM5= <"">
##$SUBNAM6= <"">
##$SUBNAM7= <"">
##$SUBNAM8= <"">
##$SUBNAM9= <"">
##$SW= 18.0517328524113
##$SWIBOX= (0..15)
0 0 2 0 0 0 0 0 0 0 0 0 0 0 0 0 
##$SW_h= 3612.71676300578
##$TD= 16384
##$TD0= 1
##$TE= 0
##$TE2= 300
##$TE3= 300
##$TEG= 300
##$TL= (0..7)
0 120 120 120 120 120 120 120 
##$TP= (0..7)
150 150 150 150 150 150 150 150 
##$TP07= 0
##$TPNAME0= <>
##$TPNAME1= <>
##$TPNAME2= <>
##$TPNAME3= <>
##$TPNAME4= <>
##$TPNAME5= <>
##$TPNAME6= <>
##$TPNAME7= <>
##$TPOAL= (0..7)
0.5 0.5 0.5 0.5 0.5 0.5 0.5 0.5 
##$TPOFFS= (0..7)
0 0 0 0 0 0 0 0 
##$TUNHIN= 0
##$TUNHOUT= 0
##$TUNXOUT= 0
##$USERA1= <user>
##$USERA2= <user>
##$USERA3= <user>
##$USERA4= <user>
##$USERA5= <user>
##$V9= 5
##$VALIST= <valist>
##$VCLIST= <CCCCCCCCCCCCCCC>
##$VD= 0
##$VDLIST= <DDDDDDDDDDDDDDD>
##$VPLIST= <PPPPPPPPPPPPPPP>
##$VTLIST= <TTTTTTTTTTTTTTT>
##$WBST= 1024
##$WBSW= 4
##$XGAIN= (0..3)
0 0 0 0 
##$XL= 0
##$YL= 0
##$YMAX_a= 266860
##$YMIN_a= -239585
##$ZGOPTNS= <>
##$ZL1= 120
##$ZL2= 120
##$ZL3= 120
##$ZL4= 120
##$ABSF1= 10
##$ABSF2= 0
##$ABSG= 5
##$ABSL= 3
##$ALPHA= 0
##$AQORDER= 0
##$ASSFAC= 0
##$ASSFACI= 0
##$ASSFACX= 0
##$ASSWID= 0
##$AUNMP= <proc_1d>
##$AZFE= 0.1
##$AZFW= 0.1
##$BCFW= 1
##$BC_mod= 2
##$BYTORDP= 1
##$COROFFS= 0
##$CY= 83.5205535888672
##$DATMOD= 1
##$DC= 2
##$DFILT= <>
##$DTYPP= 0
##$F1P= 10.8118882576601
##$F2P= -7.23987719738617
##$FCOR= 0.5
##$FTSIZE= 0
##$FT_mod= 4
##$GAMMA= 1
##$GB= 0.15
##$INTBC= 1
##$INTSCL= 1
##$ISEN= 128
##$LB= 0.25
##$LEV0= 0
##$LPBIN= 0
##$MAXI= 10000
##$MC2= 0
##$MEAN= 0
##$ME_mod= 0
##$MI= 1.114404
##$NCOEF= 0
##$NC_proc= 0
##$NLEV= 6
##$NOISF1= 3.799351
##$NOISF2= 2.8
##$NSP= 1
##$NTH_PI= 0
##$NZP= 0
##$OFFSET= 14.38212
##$PC= 1
##$PHC0= -5217.348
##$PHC1= 6.821927
##$PH_mod= 1
##$PKNL= yes
##$PPARMOD= 0
##$PSCAL= 0
##$PSIGN= 0
##$REVERSE= no
##$SF= 200.129724274929
##$SI= 16384
##$SIGF1= 3
##$SIGF2= 2
##$SINO= 400
##$SIOLD= 16384
##$SREGLST= <1H.CDCl3>
##$SSB= 0
##$STSI= 0
##$STSR= 0
##$SW_p= 3205.1282051282
##$SYMM= 0
##$S_DEV= 0
##$TDeff= 0
##$TDoff= 0
##$TI= <>
##$TILT= no
##$TM1= 0
##$TM2= 0
##$TOPLEV= 0
##$USERP1= <user>
##$USERP2= <user>
##$USERP3= <user>
##$USERP4= <user>
##$USERP5= <user>
##$WDW= 1
##$XDIM= 8192
##$YMAX_p= 0
##$YMIN_p= 0
$$ End of Bruker specific parameters
$$ ---------------------------------
##NTUPLES= NMR FID
##VAR_NAME=  TIME,          FID/REAL,        FID/IMAG
##SYMBOL=    X,             R,               I
##VAR_TYPE=  INDEPENDENT,   DEPENDENT,       DEPENDENT
##VAR_FORM=  AFFN,          ASDF,            ASDF
##VAR_DIM=   8192,          8192,            8192
##UNITS=     SECONDS,       ARBITRARY UNITS, ARBITRARY UNITS
##FACTOR=    0.0002768,     1,               1
##FIRST=     0,             0,               0
##LAST=      2.2672688,     0,               0
##MIN=       0,             -239585,         0
##MAX=       2.2672688,     266860,          0
$$ Real data points
##PAGE= N=1
##DATA TABLE= (X++(R..R)), XYDATA
$$ plain form
0 0 0 0 0 0 0 0 0 0 0 -8 8 -8 9 -16 16 -24 32 -34 42 -56 64 -78 89 -106 126 -146 170 -195 226 -260 299 -340
32 -340 387 -437 494 -555 624 -699 781 -872 972 -1079 1197 -1324 1463 -1616 1784 -1965
48 -1965 2166 -2384 2627 -2892 3188 -3515 3881 -4295 4764 -5301 5920 -6653 7526 -8586
62 -8586 9911 -11619 13902 -17135 22079 -30648 49652 -171855 70123 149160 -154644 105614
74 105614 -134246 183437 -86895 -146626 262616 -117099 -32725 5645 17306 94447 -220286
85 -220286 161036 32534 -135532 74387 -23654 109478 -146995 97 188011 -204197
95 -204197 69382 12927 737 25275 -157745 214539 -71580 -114401 159502 -79287 52687
106 52687 -93746 47993 118494 -221181 122257 27774 -67353 29273 -58675 150057 -127206
$$ packed form
0@%%%%%%%%%qJ6j6J7k5L2m0N6o6P6r8J20j42J67j95K32k72L16l65M21m86N59o39
32c40P27q24R31j049J179j323J480j653J844k051K276k521K787l079L400l749
48a965M131m550N011n519O080o703P396q176R059j0065J1221j2573J4179j6112
62h586J8497k1530K5521l1037L9214n2727Q0300k21507K41978P9037l03804K60258
74A05614k39860L17683k70332n9731M09242l79715Q4374L8370J1661P7141l14733
85b20286L81322j28502j68066K09919r8041J33132k56473J47092J87914l92208
95b04197K73579n6455j2190K4538j83020L72284k86119m2821K73903k38789J31974
106E2687j46433J41739P0501l39675L43438r4483r5127R6626q7948K08732k77263
$$ plain form
117 -127206 -31896 155694 -116928 35248 -39855 58289 23282 -164348 174944 -37620 -74017
128 -74017 63752 -35310 91731 -129207 42142 112183 -160289 72453 -4199 13067 -4139
139 -4139 -90328 153301 -84611 -41370 92415 -47946 36821 -80673 69572 40601 -134443
150 -134443 102282 -17074 -17979 698 -27427 103298 -108930 16373 76768 -76101 38344
161 38344 -41279 55357 -8435 -90622 117646 -48710 -22411 28799 -17790 54247 -86426
172 -86426 51136 40603 -87005 53296 -19665 23348 -20444 -38182 89162 -69713 5143
183 5143 36840 -26713 27181 -54440 58286 546 -66511 66155 -29877 5404 -5899 -11368
195 -11368 53129 -66573 28158 27358 -37106 24317 -27375 35642 -16568 -33212 56098 -36665
$$ packed form
117a27206R5310J87590k72622J52176p5103R8144l5007j87630L39292k12564l6397
128g4017J37769r9062J27041k20938J71349P0041k72472K32742p6652J7266j7206
139d139q6189K43629k37912M3241J33785j40361Q4767j17494J50245k8971j75044
150a34443K36725j19356r05J8677k8125J30725k12228J25303O0395j52869J14445
161C8344p9623R6636o3792q2187K08268j66356K6299N1210m6589P2037j40673
172h6426J37562j0533j27608J40301p2961M3013m3792j7738J27344j58875P4856
183E143L1697o3553N3894q1621J12726n7740o7057J32666r6032L5281j1303n469
195a1368O4497j19702R4731q00o4464O1423n1692O3017n2210j6644Q9310r2763
$$ plain form
207 -36665 3169 5905 -3212 23627 -44075 36777 4184 -32244 27670 -18370 17677 -16807
219 -16807 -10018 36577 -37241 13638 8745 -8386 12862 -24407 28665 -8132 -19487 25647
231 25647 -18670 7206 -6906 -268 17652 -25458 17239 1984 -8302 10677 -12459 14887
243 14887 -11229 -6661 16167 -15615 6820 -2299 -111 7673 -11811 13812 -3182 -5533 7389
256 7389 -7832 6000 -5715 -1651 5849 -8523 5972 174 72 3271 -4033 5356 -2717 -1082
270 -1082 2302 -4889 1117 -1934 55 1930 -1233 2432 -358 959 2164 -696 -235 -942 -1511 -1079
286 -1079 -66 -323 186 -1151 870 3253 -1059 1964 346 -1568 773 -2517 1990 -2206 -2909 3194
302 3194 -2296 2246 527 214 3180 -3714 3335 -188 -2957 1527 -3683 1989 -2057 -858 4254
$$ packed form
207c6665L9834K736r117K6839o7702Q0852l2593l6428N9914m6040L6047l4484
219a6807O789M6595p3818N0879m893j7131K1248l7269N3072l6797j1355M5134
231B5647m4317K5876j4112O638J7920m3110M2697j5255j0286J8979k3136K7346
243A4887k6116M568K2828l1782K2435r119K188P784j9484K5623j6994k351J2922
256G389j5221J3832j1715M064P500j4372J4495n798j02L199p304R389q073J635
270a082L384p191O006l051J989J875l163L665k790J317J205k860M61p07n69M32
286a079J013k57N09j337K021K383m312L023j618j914K341l290M507m196p03O103
302C194n490M542j719l13K966o894P049l523k769M484n210N672m046J199N112
$$ plain form
317 4254 -3359 3110 505 64 2566 -3872 2935 -2195 -2729 2292 -3273 1935 -1205 216 3513 -2401
333 -2401 3172 307 -1020 1035 -2589 1206 -1784 -1651 1387 -1500 874 837 1000 1359 -598 812
349 812 603 -1355 -600 -251 -1708 -130 -608 780 1390 -1837 3444 204 -1015 2344 -2835 2176 -3062
366 -3062 -1609 3800 -6041 3580 -53 -718 4341 -5628 7569 -2169 -4067 6630 -7316 3952
380 3952 -4175 -759 7135 -11742 9314 -256 -3221 6936 -8509 11422 -7897 -4015 12115
393 12115 -14191 7454 -4672 956 7990 -17281 19081 -4954 -6975 12171 -12114 13777 -14161
406 -14161 638 15942 -24754 15497 -3893 -121 7353 -19031 28190 -15651 -7068 20359 -18874
419 -18874 13537 -16792 8991 13127 -33632 29856 -7503 -5331 9437 -15828 31127 -29871
$$ packed form
317D254p613O469k605m41K502o438O807n130n34N021n565N208l140J421L297n914
333b401N573k865j327K055l624L795k990J33L038k887K374l7J63L59j957J410
349H12k09j958P55L49j457J578m78J388O10l227N281l240j219L359n179N011n238
366c062J453N409r841R621l633o65N059r969J3197r738j898J0697j3946J1268
380C952q127L416P894j8877K1056r570k965J0157j5445J9931j9319L882J6130
393A2115k6306K1645j2126N628P034k5271L6362k4035k021J9146k4285K5891k7938
406a4161J4799J5304m0696M0251j9390L772P474k6384M7221m3841Q583K7427l9233
419a8874L2411l0329K5783M136m6759O3488l7359K172J4768k5265M6955o0998
$$ plain form
431 -29871 1656 26412 -31850 17511 -13316 13017 3969 -34403 46641 -20505 -9438 19030
443 19030 -15812 25344 -37324 18097 22193 -46705 31776 -10474 7760 -3002 -24057 54834
455 54834 -42645 -951 30094 -26333 19859 -34349 33860 4646 -52851 56575 -20749 -1731
467 -1731 1848 -11998 48530 -62363 22173 32195 -47029 25566 -22457 35171 -17026 -40320
479 -40320 76003 -45690 -3166 18188 -9720 29152 -64348 50943 13775 -63048 48384
490 48384 -18002 19928 -25227 -14227 74639 -75114 15052 32374 -26603 16475 -45825 64298
502 64298 -19115 -57322 76851 -34115 4621 -13095 6224 50886 -90231 51038 24487
513 24487 -51814 26829 -25629 55623 -47127 -28734 91628 -68550 8359 10785 4737 19560
$$ packed form
431b9871L1527K4756n8262M9361l0827K6333r048l8372Q1044o7146J1067K8468
443A9030l4842M1156o2668N5421M096o8898P8481m2250J8234j0762k1055P8891
455E4834r7479M1694L1045n6427M6192n4208O8209k9214n7497J09426p7324J9018
467a731L579j3846O0528j10893Q4536J0022p9224P2595m8023N7628n2197k3294
479d0320J16323j21693M2524K1354k7908L8872r3500J15291l7168p6823J11432
490D8384o6386L7930m5155J1000Q8866j49753R0166J7322n8977M3078o2300J10123
502F4298q3413l8207J34173j10966L8736j7716J9319M4662j41117J41269k6551
513B4487p6301P8643n2458Q1252j02750J8393J20362j60178P6909K426o048J4823
$$ plain form
525 19560 -78741 83909 -9092 -62763 56082 -22254 30836 -52027 10654 75890 -100394
536 -100394 38669 23129 -19477 5744 -47004 89351 -50985 -44435 84549 -44780 11012
547 11012 -27573 31168 35763 -101189 76918 6165 -44139 19776 -19456 64749 -75208 -1972
559 -1972 85576 -79829 20691 134 21297 718 -73611 100983 -34370 -47013 51354
570 51354 -19624 31601 -67196 37697 55451 -101200 54239 7676 -6420 -10086 -33459 94097
582 94097 -76187 -17105 72390 -46596 16241 -37032 51367 11030 -90908 89305 -15089
593 -15089 -28699 9795 -8455 59028 -87516 25775 61619 -74469 27835 -8741 33359
604 33359 -20085 -52017 97103 -52586 -22028 36251 -13232 25726 -67161 54426 26456
$$ packed form
525A9560r8301J62650r3001n3671J18845p8336N3090q2863O2681O5236j76284
536a00394J39063j5540m2606K5221n2748J36355j40336O550J28984j29329N5792
547A1012l8585N8741M595j36952J78107p0753n0304O3915l9232Q4205j39957P3236
559a972Q7548j65405J00520k0557K1163k0579p4329J74594j35353j2643R8367
570E1354p0978N1225r8797J04893J7754j56651J55439m6563j4096l666k3373J27556
582I4097j70284N9082Q9495j18986O2837n3273Q8399m0337j01938J80213j04394
593a5089j3610L8494j8250O7483j46544J13291L5844j36088J02304l6576M2100
604C3359n3444l1932J49120j49689L0558N8279m9483L8958r2887J21587k7970
$$ plain form
615 26456 -81643 55992 -5325 4281 -20783 -13856 75349 -78266 7716 46256 -35490 13840
627 13840 -34633 56393 -12734 -60315 77767 -28238 -9546 -1512 2966 41544 -78624 41920
639 41920 30225 -54923 27580 -12864 34602 -31146 -24903 73553 -54324 -31 17558 -4786
651 -4786 14997 -53219 55985 -251 -50601 45529 -13423 11755 -24491 1808 47891 -63305
663 -63305 21593 19845 -20963 9449 -25149 45537 -22362 -28418 50904 -26738 2752 -7709
675 -7709 9172 20126 -52042 38380 5552 -28412 18262 -10901 26082 -28143 -4168 40602
687 40602 -38985 9927 3402 1282 4969 -30943 39753 -12020 -20925 26264 -11925 11386 -19674
700 -19674 9296 20855 -37553 21099 1451 -7273 4333 -14019 27888 -19763 -6446 24189
$$ packed form
615B6456j08099J37635o1317R606k5064O927Q9205j53615Q5982L8540q1746M9330
627A3840m8473R1026o9127m7581J38082j06005J8692Q034M478L8578j20168J20544
639D1920j1695q5148Q2503m0444M7466o5748O243R8456j27877N4293J7589k2344
651d786J9783o8216J09204n6236n0350R6130n8952K5178l6246K6299M6083j11196
663f3305Q4898j748m0808L0412l4598P0686o7899o056P9322p7642K9490j0461
675g709J6881J0954p2168R0422l2828l3964M6674k9163L6983n4225K3975M4770
687D0602p9587M8912o525k120L687l5912P0696n1773q905M7189l8189K3311l1060
700a9674K8970J1559n8408N8652j9648q724J1606j8352M1907m7651J3317L0635
$$ plain form
712 24189 -17572 7181 -8189 8238 5888 -24685 23167 -4942 -8761 8052 -6047 13564
724 13564 -15960 3886 13774 -17689 8546 -2737 2782 -120 -11389 17425 -9328 -3624 8975
737 8975 -5529 5799 -8586 6188 4125 -12429 9469 -3018 -660 560 -3821 8868 -7905
750 -7905 1470 5305 -5194 3517 -3514 3376 -394 -5236 6140 -3500 -194 1325 -1302 3023 -3174
765 -3174 2075 1069 -2363 1872 -1337 359 -396 -941 1066 -744 212 536 53 -44 1018 -522 -379
782 -379 894 -1444 656 -962 216 788 -2446 3060 -928 -581 2013 -2041 2588 -2478 205 2263
798 2263 -4304 2939 -1442 143 1404 -3236 5033 -3064 -108 3133 -3846 3424 -3366 1195 1761
813 1761 -5285 5422 -2911 303 2142 -3646 5576 -4467 1187 2798 -5321 4671 -3713 1395 1358
$$ packed form
712B4189m1761K4753j5370J6427k350l0573M7852k8109l819J6813j4099J9611
724A3564k9524J9846R888l1463K6235j1283N519k902j1269K8814k6753N704J2599
737H975j4504J1328j4385J4774k063j6554K1898j2487K358J220m381J2689j6773
750g905R375L835j0499Q711p031O890l770m842J1376r640L306J519k627M325o197
765c174N249j006l432M235l209J696p55n45K007j810R56L24m83r7J062j540J43
782c79J273k338K100j618J178N72l234N506l988L47K594m054M629n066K683K058
798B263o567P243m381J585J261m640Q269q097K956L241o979P270o790M561N66
813A761p046J0707q333L214J839n788R222j0043N654J611q119R992q384N108l7
$$ plain form
828 1358 -4759 6156 -4137 1265 2362 -4053 5075 -4593 1976 1444 -4852 5186 -4344 1747 1269
843 1269 -3676 5500 -4486 2250 1415 -3908 4827 -4348 1786 605 -3519 4665 -4225 2088 1181 -3051
859 -3051 4267 -3313 1907 371 -2769 3649 -3490 1245 461 -2029 2859 -2680 1902 500 -1870
874 -1870 2594 -1859 806 -159 -1216 1658 -1941 667 450 -918 1233 -574 396 547 -701 351
890 351 104 -679 197 -402 -283 910 -1339 992 536 -987 1687 -1707 1571 -114 -2505 3435 -2689
907 -2689 315 569 -1495 3496 -4451 2946 1543 -4222 4402 -3304 2711 -1241 -3781 7547 -6705
922 -6705 1713 2000 -2946 4897 -7549 7257 53 -7899 9297 -5812 2899 -2127 -2659 10264
936 10264 -12933 5992 3704 -6631 6279 -8118 10533 -4575 -8599 15635 -10944 2415
$$ packed form
828A358o117J0915j0293N402J097o415R128r668O569n32o296J0038r530O091m78
843A269m945R176r986O736q35n323Q735r175O134j181m124Q184q890O313r07m232
859c051P318p580N220j536l140O418p139M735p84k490M888n539M582j402k370
874a870M464m453K665r65j057K874l599K608k17j368K151j807R70J51j248J052
890C51k47p83Q76n99J19J193k249K331m56j523K674l394L278j685k391N940o124
907b689L004K54k064M991p947P397j403n765Q624p706O015l952k540J1328j4252
922f705Q418K87m946P843j2446J4806p204p952J7196j5109Q711n026n32J2923
936A0264k3197J8925k288j0335J2910j4397J8651j5108m024K4234k6579J3359
$$ plain form
948 2415 -476 -785 8909 -17462 13954 1611 -12112 10934 -7530 10072 -9474 -4302 19633
961 19633 -20033 6149 3460 -2962 5911 -17129 21729 -6277 -14469 19585 -10959 6772 -10183
974 -10183 3071 17132 -28981 16898 3516 -9646 6815 -12684 24380 -17837 -9078 27817
986 27817 -21244 6153 -4867 6899 8068 -30824 31107 -4611 -16367 14646 -9053 18253
998 18253 -24903 4528 27393 -35056 14082 1759 1749 159 -22471 39162 -20355 -15058 27316
1011 27316 -14186 8918 -20340 16428 15483 -41748 29935 12 -9077 1553 -10161 34920
1023 34920 -35326 -799 33085 -28751 8923 -9790 18924 -905 -36672 46515 -15012 -15117
1035 -15117 14070 -5899 21566 -39435 19274 25632 -43509 21258 -1941 9153 -11236 -19167
$$ packed form
948B415k891l09R694k6371L1416j2343j3723K3046j8464J7602j9546N172K3935
961A9633l9666K6182k689o422Q873k3040L8858k8006q192L4054l0544J7731j6955
974a0183J3254J4061m6113M5879j3382j3162J6461j9499L7064m2217Q759L6895
986B7817m9061K7397j1020J1766J169l8892O1931l5718j1756L1013k3699K7306
998A8253m3156K9431K2865o2449M9138j2323j0j590k2630O1633n9517N297M2374
1011B7316m1502K3104k9258L6768r45n7231P1683k9923r089J0630j1714M5081
1023C4920p0246L4527L3884o1836L7674j8713K8714j9829l5767Q3187o1527j05
1035a5117K9187j9969K7465o1001N8709O358o9141O4767k3199J1094k0389p931
$$ plain form
1047 -19167 50786 -36896 -7238 27734 -14359 9323 -29009 32694 5178 -46219 41357 -7044
1059 -7044 -5379 -5731 -2594 37743 -49559 12480 30017 -30941 9288 -11798 29149 -14835 -31296
1072 -31296 53303 -25182 -9196 9501 900 18065 -46240 33160 15604 -42429 24246 -4360
1084 -4360 14024 -21708 -9042 49683 -45328 2973 21422 -10106 5207 -29496 42533 -9064
1096 -9064 -37881 42776 -13196 573 -13114 7514 31185 -54043 25519 18770 -26699 8624
1108 8624 -11516 33288 -26674 -18260 49152 -31044 -919 3298 7678 9572 -42739 41078 1154
1121 1154 -32339 22387 -5842 15856 -27625 3040 38474 -44535 11810 12172 -4967 463 -23177
1134 -23177 41028 -18184 -23417 34425 -13961 3637 -15399 14205 18175 -44215 28720 6208
$$ packed form
1047a9167O9953q7682K9658L4972m2093K3682l8332O1703k7516n1397Q7576m8401
1059g044J665l52L137M0337q7302O2039J7537o0958M0229k1086M0947m3984j6461
1072c1296Q4599p8485J5986J8697q601J7165o4305P9400j7556n8033O6675k8606
1084d360J8384l5732J2666N8725r5011M8301J8449l1528J5313l4703P2029n1597
1096i064k8817Q0657n5972J3769j3687K0628K3671q5228P9562o749m5469L5323
1108H624k0140M4804n9962Q414O7412q0196L0125M217M380J894n2311Q3817l9924
1121A154l3493N4726k8229K1698m3481L0665L5434q3009N6345L62j7139N430k3640
1134b3177O4205n9212n233N7842m8386J7598j9036K9604L970o2390P2935k2512
$$ plain form
1146 6208 -16686 4955 -8046 28899 -29803 -4200 34782 -28269 5417 -2000 10866 1426
1158 1426 -30824 37476 -9189 -18092 16002 -5261 13242 -25916 11567 21736 -34158 15636
1170 15636 2544 345 -3326 -13890 31775 -21299 -8338 21577 -11770 5305 -13687 14920
1182 14920 6454 -28119 23643 -2146 -7175 1516 -3804 18685 -23128 3992 17562 -18267 6472
1195 6472 -4047 9692 -3094 -16003 24359 -10932 -6046 7919 -3195 8008 -17007 11342
1207 11342 7814 -18586 11881 -2059 2381 -3988 -5224 17290 -15368 606 8804 -6612 4101
1220 4101 -8562 10520 -567 -12248 13633 -4734 -745 -443 -1085 8526 -12388 5253 5127 -7884
1234 -7884 4301 -3246 5384 -2929 -5011 9932 -6376 -132 2043 -1193 3022 -6576 5394 961
$$ packed form
1146F208k2894K1641j3001L6945n8702K5603L8982o3051L3686p417J2866r440
1158A426l2250O8300m6665q903L4094k1263J8503l9158L7483J0169n5894M9794
1170A5636j3092k199l671j0564M5665n3074J2961K9915l3347J7075j8992K8607
1182A4920q466l4573N1762k5789n029Q691n320K2489m1813K7120J3570l5829K4739
1195F472j0519J3739j2786j2909M0362l5291M886J3965j1114J1203k5015K8349
1207A1342l528k6400L0467j3940M440o369j236K2514l2658J5974Q198j5416J0713
1220D101j2663J9082j1087j1681K5881j8367L989L02o42R611k0914J7641j26j3011
1234g884J2185p547Q630q313k082J4943j6308O244K175l236M215r598J1970m433
$$ plain form
1248 961 -5648 4823 -1819 1303 -1583 -931 4736 -5089 1382 1693 -1951 1319 -2095 2764 -865
1263 -865 -2111 3140 -1586 186 -3 -155 1023 -1873 1127 268 -1013 747 -283 134 48 -168 247
1280 247 -26 -310 408 -354 -235 946 -1193 510 320 -669 976 -1350 1444 -348 -1546 2458 -1799
1297 -1799 595 -33 -784 2226 -3079 2040 511 -2264 2488 -2161 2021 -891 -1776 3848 -3704 1555
1313 1555 440 -1549 2671 -3756 3278 -377 -2720 3979 -3359 2129 -864 -1374 3949 -4880 2957
1328 2957 43 -2173 3377 -3930 3562 -1355 -2085 4511 -4513 2840 -870 -1389 3638 -4860 3945
1343 3945 -1068 -1984 3883 -4332 3601 -1594 -1340 3870 -4863 3735 -1322 -1335 3481 -4449 3865 -1751
1359 -1751 -1008 3511 -4574 3731 -1640 -940 3035 -4103 3780 -2100 -615 3198 -4089 3397 -1737
$$ packed form
1248I61o609J0471o642L122k886O52N667r825O471L11l644L270l414M859l629
1263h65j246N251m726J772j89j52J178k896L000q59j281J760j030M17q6k16M15
1280B47k73k84P18p62J19J181k139J703j90r89J645k326K794j792j198M004m257
1297a799K394o28p51L010n305N119j529k775M752m649M182k912q85N624p552N259
1313A555j115j989M220o427P034l655k343O699p338N488k993n10N323q829P837
1328B957k914k216N550p307P492m917p30O596r024P353l710n19N027q498Q805
1343C945n013r16N867q215P933n195K54N210q733Q598n057j3M816p930Q314n616
1359a751P43M519q085Q305n371P00L975p138P883n880J485L813p287P486n134
$$ plain form
1374 -1737 -277 2349 -3862 3815 -1988 -724 2483 -3054 2974 -2181 317 2192 -3582 3004 -1280
1389 -1280 -204 1233 -2374 2963 -2095 -91 1886 -2206 1735 -1327 729 778 -2210 2225 -1010
1404 -1010 -223 626 -855 1327 -1454 516 784 -1149 766 -406 368 -140 -430 698 -410 -50 -47
1421 -47 224 -184 24 113 -278 608 -743 535 -58 -380 853 -1504 1446 -348 -1049 1634 -1515 1438
1439 1438 -1187 -146 2361 -3376 2141 -246 -739 1384 -2915 3959 -2258 -1495 3891 -3311 2129
1454 2129 -2042 1078 2546 -6105 5343 -1011 -2129 2343 -2949 5263 -5243 83 6012 -6872
1468 -6872 3410 -1285 1400 1120 -7046 9392 -3992 -3414 5363 -3574 4390 -6829 3580 5647
1482 5647 -11017 7129 -880 -287 -13 -5122 11767 -9598 -1212 8689 -6878 3922 -6200 7009
$$ packed form
1374a737J460K626o211P677n803J264L207n537O028n155K498J875n774O586m284
1389a280J076J437l607N337n058K004J977m092L941l062K056M9k988M435l235
1404a010P87Q49j481K182k781J970K68j933J915j172P74n08k90J128j108L60L
1421d7K71m08K08Q9l91Q86j351J278n93l22J233k357K950j794p01K683l149K953
1439A438k625J041K507n737N517k387m93K123m299O874o217P63N386p202N440
1454B129m171L120J468q651J1448o354j118M472n292Q212j0506N326N929j2884
1468f872J0282m695K685k80q166J6438j3384N78Q777q937P964j1219J0409K067
1482E647j6664J8146q009N93K74n109J6889k1365Q386R901j5567J0800j0122J3209
$$ plain form
1496 7009 1725 -13110 13720 -3954 -2911 1910 -2692 10452 -14449 4890 9459 -12854 6162
1509 6162 -3216 6547 -3621 -9846 18805 -11216 -2933 6969 -3200 5929 -14438 12237 4642
1522 4642 -17684 13237 -2526 1521 -4728 -3364 18210 -19156 2424 11326 -8937 3530 -9013
1535 -9013 14942 -3914 -16136 21170 -7835 -2535 -546 1258 11978 -23030 12605 9083 -16426
1548 -16426 7623 -3961 11638 -11022 -8088 24851 -18143 -571 6320 -324 4058 -19227 21512
1561 21512 -819 -19243 16836 -4223 4254 -11332 2543 19842 -27173 9090 9633 -8502
1573 -8502 1800 -9881 21833 -12291 -13679 24889 -11730 -882 -3516 7026 8696 -26928 20257
1586 20257 4525 -15974 7269 -3019 14186 -18055 -2007 24814 -22311 2789 4423 2896
$$ packed form
1496G009n284j4835K6830j7674J043M821m602J3144k4901J9339M569k2313J9016
1509F162r378R763j0168o225K8651l0021Q283R902j0169R129k0367K6675p595
1522D642k2326L0921j5763M047o249J364K1574l7366K1580Q902k0263J2467j2543
1535i013K3955j8856j2222L7306k9005N300J989J804J0720l5008L5635l522k5509
1548a6426K4049j1584J5599k2660K934L2939m2994J7572O891o644M382k3285M0739
1561B1512k2331j8424L6079k1059Q477j5586J3875J7299m7015L6263N43j8135
1573h502J0302j1681L1714l4124j388L8568l6619J0848k634J0542J670l5624M7185
1586B0257j5732k0499K3243j0288J7205l2241J6048K6821m7125K5100J634j527
$$ plain form
1598 2896 19 -18847 26450 -6972 -16310 16727 -4254 4819 -15082 8886 15582 -28264 13552
1611 13552 5533 -5494 -1417 -7577 23707 -18823 -6914 22409 -13201 1436 -6124 11707 2946
1624 2946 -24705 23937 -1802 -11717 5443 -1321 13234 -21323 5417 18626 -21625 5927
1636 5927 1352 5668 -4537 -13835 25830 -12342 -9564 13416 -3777 4269 -15084 12607 8657
1649 8657 -23463 14453 1583 -2702 -3487 -3602 19326 -19132 -696 15575 -10743 1998 -6214
1662 -6214 12500 -2161 -17168 20771 -5634 -5994 2694 310 9563 -18676 9163 10148 -16087
1675 -16087 6598 -973 6184 -6683 -6985 19237 -13133 -2533 7729 -2309 2800 -11755 12697
1688 12697 1421 -14663 12012 -1903 149 -4135 -332 12245 -15064 3415 7836 -6892 1927
$$ packed form
1598B896k877j8866M5297l3422r338L3037k0981R073j9901K3968O696m3846M1816
1611A3552q019j1027M077o160L1284m2530J1909K9323l5610J4637p560J7831q761
1624B946k7651M8642k5739r915J7160o764J4555l4557K6740J3209m0251K7552
1636E927m575M316j0205r298L9665l8172K778K2980j7193Q046j9353K7691l950
1649H657l2120L7916j2870m285p85j15K2928l8458J8436J6271k6318J2741q212
1662f214J8714j4661j5007L7939k6405l60Q688k384R253k8239K7839R85k6235
1675a6087K2685p571P157j2867l02K6222l2370J0600J0262j0038N109j4555K4452
1688A2697j1276j6084K6675j3915K052m284L803J2577k7309J8479M421j4728Q819
$$ plain form
1701 1927 -4583 9513 -4126 -8678 13313 -5651 -1722 587 1100 4942 -11708 7800 3449 -8594
1715 -8594 4594 -1527 4390 -5212 -2188 10233 -8754 774 3029 -1027 1271 -6238 7952 -1511
1729 -1511 -6154 6550 -2304 1054 -2849 1053 5044 -7896 3646 2005 -2849 1194 -2370 4845
1743 4845 -3155 -2446 5567 -3443 365 -248 760 1604 -4528 3725 281 -2720 1909 -908 1659 -1941
1759 -1941 -312 3007 -2951 712 726 -479 510 -1567 1955 -476 -1399 1697 -739 98 -157 -32 851
1776 851 -1196 509 488 -751 427 -142 4 166 -421 398 -96 -317 601 -587 190 465 -840 683
1794 683 -310 43 299 -1000 1405 -840 -433 1215 -1140 924 -875 342 1057 -2206 1858 -459
1810 -459 -596 942 -1460 2080 -1667 -192 2064 -2398 1591 -857 249 1040 -2686 2956 -1357 -778
$$ packed form
1701A927o510J4096j3639m552K1991j8964L929K309N13L842j6650J9508m351j2043
1715h594J3188o121N917r602L024J2421j8987R528K255m056K298p509J4190r463
1729a511m643J2704q854L358l903L902L991j2940J1542j641m854M043l564P215
1743D845q000P09Q013r010L808o13J008Q44o132Q253l444l001M629k817K567l600
1759a941J629L319n958L663J4j205R89k077L522k431r23L096k436Q37k55J25Q83
1776H51k047J705k1j239J178n69J46J62n87Q19m94k21R18j188P77K75j305J523
1794F83r93L53K56j299K405k245M07J648k355K064j799J217P15l263M064k317
1810d59j37J538k402L540l747J475K256m462L989k448J106P91l726N642m313N79
$$ plain form
1826 -778 1813 -2005 2204 -2000 419 2007 -3284 2609 -1101 -93 1153 -2575 3322 -2236 -221
1841 -221 2190 -2733 2528 -1944 679 1509 -3309 3404 -1874 -32 1475 -2607 3181 -2563 567
1856 567 1779 -3113 3110 -2128 639 1174 -2863 3440 -2534 573 1381 -2752 3150 -2500 915 1082
1872 1082 -2705 3311 -2604 890 1069 -2557 3026 -2551 1202 712 -2505 3266 -2529 919 719 -1972
1888 -1972 2779 -2782 1444 669 -2362 2681 -2108 1249 -13 -1641 2926 -2667 1054 598 -1484
1903 -1484 1902 -2236 1789 -144 -1789 2469 -1791 886 -235 -636 1902 -2435 1414 257 -1207
1918 -1207 1231 -1314 1457 -809 -718 1873 -1605 670 -138 -64 666 -1501 1437 -406 -612 741 -580
1935 -580 762 -833 295 640 -947 604 -265 267 -203 -301 718 -695 320 -74 -3 193 -412 582
$$ packed form
1826g78K591l818M209m204K419J588n291N893l710J008J246l728N897n558K015
1841b21K411m923N261m472K623Q30m818O713n278J842J507m082N788n744L130
1856E67J212m892O223n238K767N35m037O303n974L107Q08m133N902n650L415J67
1872A082l787O016n915L494J79l626N583n577L753m90l217N771n795L448k00k691
1888a972M751n561M226p75l031N043m789L357j262j628M567n593L721m56k082
1903a484L386m138M025j933j645M258m260K677j121m01K538m337L849j157j464
1918a207K438k545K771k266R1K591l478K275q08P4P30k167K938j843k06J353j321
1935e80J342j595J128L45j587J551q69N32m70r8J019j413J015l94P1J96o05R94
$$ plain form
1953 582 -553 412 -56 -461 752 -757 575 -444 -9 848 -1446 1192 -276 -308 513 -1041 1767
1970 1767 -1544 -110 1667 -1801 1016 -835 917 281 -2380 3121 -1396 -681 1136 -1056 2029
1985 2029 -3064 1458 1958 -3723 2371 -689 821 -602 -2068 4842 -3758 -330 2670 -1926 1464
2000 1464 -3255 3513 435 -4973 4953 -1494 -38 -805 -531 4937 -6684 2215 3342 -4086 1768
2015 1768 -2253 4567 -2520 -4166 7916 -4415 -545 892 322 2817 -7710 6184 1579 -6530
2029 -6530 4260 -1217 3047 -4566 -804 8691 -8897 1477 3390 -1735 796 -5625 8745 -2627
2043 -2627 -6935 8602 -2855 234 -3092 2316 5969 -11671 6058 3585 -5492 1399 -2234 7977
2057 7977 -7159 -3400 11409 -7550 -45 303 2853 1507 -10855 11243 -433 -7933 5265
$$ packed form
1953E82j135R65m68m05J213j509J332j019M35Q57k294K638j468l2Q21j554K808
1970A767l311J434J777l468K817j851J752o36k661N501m517P15J817k192L085
1985B029n093M522N00n681O094l060J510j423j466O910q600L428L000m596L390
2000A464m719O768l078n408R926o447J456p67K74N468j1621Q899J127p428N854
2015A768m021O820p087j646J2082j2331L870J437n70K495j0527J3894m605q109
2029f530J0790n477M264p613L762R495j7588J0374J913n125K531o421J4370j1372
2043b627m308J5537j1457L089l326N408L653j7640J7729k473r077O891l633J0211
2057G977j5136L759J4809j8959P505L48K550j346j2362K2098j1676p500J3198
$$ plain form
2070 5265 -778 4311 -8818 2554 9865 -12702 3713 2947 -227 -1632 -5961 13158 -7285 -5910
2084 -5910 10108 -3747 728 -5718 6584 4215 -14365 10100 1762 -5203 208 -946 9630
2097 9630 -11647 -42 11716 -9484 867 -436 5469 -1628 -10704 14541 -3718 -7027 5272
2110 5272 19 4116 -11247 6272 8276 -13966 5485 2191 775 -3904 -4184 14130 -10312 -3497
2124 -3497 9381 -3506 358 -6598 9580 880 -13316 11703 -543 -3546 -1385 958 8898
2137 8898 -13675 3757 8973 -9104 1631 -1146 6973 -4770 -7630 14291 -6429 -4072 3769
2150 3769 1056 2647 -11015 9091 3994 -11734 6280 615 1653 -5291 -1339 11810 -11132
2163 -11132 -264 6862 -2913 -7 -5503 9630 -1911 -9618 10377 -1902 -2029 -1987 2249 6064
$$ packed form
2070E265o043N089j3129J1372P311k2567J6415p66l174j405m329J9119k0443J375
2084e910J6018j3855M475o446J2302k369j8580K4465q338o965N411j154J0576
2097I630k1277J1605J1758k1200J0351j303N905p097r076K5245j8259l309J2299
2110E272n253M097j5363J7519K004k2242J9451l294j416m679k80J8314k4442O815
2124c497J2878j2887L864o956J6178q700j4196K5019j2246l003K161K343P940
2137H898k2573J7432N216j8077J0735k777Q119j1743k860K1921k0720K357P841
2150C769k713J591j3662K0106n097j5728J8014n665J038o944L952J3149k2942
2163a1132J0868P126r775K906n496J5133j1541p707J9995j2279j27M2M236L815
$$ plain form
2177 6064 -11793 5395 5181 -6737 1557 -1147 6319 -5756 -3887 10800 -6584 -1306 1933 1518
2191 1518 1062 -8171 8621 323 -7301 5066 -460 1850 -5053 1079 7147 -8868 2116 3174
2205 3174 -1556 -291 -3540 7466 -3464 -4694 6970 -2477 -425 -1840 2346 2874 -7604 4824
2219 4824 1791 -3714 1154 -765 4075 -4360 -1116 5958 -4540 135 645 1133 182 -4391 5429
2234 5429 -942 -3320 2949 -660 1187 -2958 1247 3040 -4703 1931 899 -599 -205 -1466 3715
2249 3715 -2454 -1225 2999 -1612 261 -1027 1372 649 -3031 2570 -63 -1167 607 -371 1547
2264 1547 -1847 42 1875 -1818 362 111 267 33 -1231 1664 -428 -858 1004 -370 255 -516
2280 -516 72 720 -1057 403 296 -437 307 -294 357 -5 -431 573 -334 -112 348 -508 297 -16 -237
$$ packed form
2177F064j7857J7188k14j1918Q294k704P466j2075J869J4687j7384N278L239m15
2191A518m56r233J6792q298p624J2367n526K310o903O132O068j6015J0984J058
2205C174m730J265l249J1006j0930j230J1664r447K052j415M186N28j0478J2428
2219D824l033n505M868j919M840q435L244P074j0498M675N10M88r51m573R820
2234E429o371k378O269l609J847m145M205J793p743O634j032j498L94j261N181
2249C715o169J229M224m611J873j288K399p23l680N601k633j104J774r78J918
2264A547l394J889J833l693K180k51J56k34j264K895k092m30J862j374O25p71
2280e16N88O48j777J460j07p33P44o01O51l62m26J004r07K22M60q56Q05l13k21
$$ plain form
2299 -237 372 -378 438 -88 -434 853 -645 51 262 -417 571 -883 586 353 -1071 1052 -450 188
2317 188 19 -604 1365 -1379 251 780 -1090 873 -904 839 126 -1378 1879 -1052 85 371
2333 371 -774 1413 -1826 855 722 -1679 1487 -995 790 -61 -1204 2220 -1826 420 647 -1169
2349 -1169 1453 -1799 1242 278 -1745 2119 -1419 706 58 -1052 2057 -2202 997 472 -1496 1724
2365 1724 -1718 1294 -75 -1354 2255 -1944 1007 91 -1110 1873 -2145 1364 -28 -1314 1998
2380 1998 -1924 1315 -154 -1021 1954 -2098 1426 -213 -1121 1872 -1999 1360 -352 -797 1837 -2103
2396 -2103 1572 -262 -929 1631 -1834 1489 -713 -708 1798 -2041 1316 -338 -401 1256 -1893 1841
2412 1841 -651 -810 1499 -1515 1192 -891 -62 1348 -1988 1466 -312 -344 796 -1279 1654 -1076
$$ packed form
2299b37O09p50Q16n26l46J287j498O96K11o79R88j454J469k33j424K123j502O38
2317A88j69o23J969k744J630N29j870J963j777J743p13j504L257k931J137K86
2333C71j145K187l239K681j33k401L166k482J785q51j143L424m046K246K27j816
2349a169K622l252L041r64k023L864l538K125o48j110L109m259L199n25j968L220
2365A724l442L012j369j279L609m199K951r16j201K983m018L509j392j286L312
2380A998l922L239j469q67K975m052L524j639r08K993l871L359j712m45K634l940
2396b103L675j834o67K560l465L323k202NK506l839L357j654o3J657l149L734
2412A841k492j59K309l014K707k083Q29J410l336L454j778l2J140k075K933k730
$$ plain form
2428 -1076 -347 1322 -1372 859 -650 370 570 -1522 1617 -560 -322 602 -702 1055 -1201 288
2444 288 798 -1206 768 -382 417 -37 -725 1302 -840 -31 376 -355 406 -821 668 19 -624 677
2462 677 -348 355 -279 -28 563 -704 333 -87 -44 36 -296 522 -428 208 132 -238 431 -421 285 -184
2482 -184 -35 262 -691 698 -303 -156 379 -372 686 -770 340 546 -966 616 -427 465 -288
2499 -288 -794 1663 -1216 6 717 -458 652 -1392 1397 91 -1757 1662 -674 298 -582 -189
2515 -189 2047 -2524 886 1089 -1081 456 -1191 2298 -1322 -1653 3025 -1652 56 -316 706 1287
2531 1287 -3505 2740 514 -2140 1073 -578 2098 -2767 -203 3694 -3495 584 688 587 -160 -2910
2547 -2910 4494 -1565 -2546 2898 -911 864 -2734 1758 2744 -5266 2732 1142 -1186 -352 -1253 4591
$$ packed form
2428a076P29J669k694K231j509J020K00k092L139k177K38R24j304J757k256J489
2444B88N10k004J974j150P99m54o88K027k142Q09M07p31P61j227J489o49o43J301
2462F77j025P03o34K51N91j267J037m20M3Q0l32Q18r50O36p6l70O69q52P06m69
2482a84J49K97r53J389j001J47N35p51J058j456J110K06j512J582j043Q92p53
2499b88n06K457k879J222P11j175J110k044K789j306j848L419k336R72q80L93
2515a89K236m571L410K03k170J537j647L489l620l31M678m677J708l72J022N81
2531A287m792O245k226k654L213j651K676m865K564L897p189M079J04j01p47k750
2547b910P404o059r81N444l809J775l598M492R86q010P998j590k328Q34r01N844
$$ plain form
2563 4591 -3968 -1343 4699 -2863 105 -1063 2629 449 -5320 5439 -392 -2767 1127 -24 3047
2578 3047 -5418 1528 4649 -5462 1287 711 1684 -1761 -3191 6990 -3606 -2505 3461 -537 673
2593 673 -4496 4418 1904 -6717 4309 680 -640 -1929 -158 5846 -6695 303 4876 -3334 5
2608 5 -1616 4649 -1571 -5336 7170 -1782 -2356 582 1091 2752 -7090 3842 3719 -6094 1946 514
2624 514 2478 -3471 -2115 7809 -5396 -1491 3380 -262 119 -4909 6093 348 -6607 5063 203
2639 203 -355 -2877 1263 5385 -7766 1890 3946 -3012 -339 -1564 5610 -3446 -3898 7153 -2747
2654 -2747 -1386 -178 2193 1586 -7000 5339 1707 -5030 1918 355 2683 -4559 -68 6361 -5823
2669 -5823 156 2161 294 -629 -4024 6389 -1578 -4639 4666 -497 40 -2960 2229 3639 -6914
$$ packed form
2563D591q559K625O042p562K968j168L692k180n769J0759n831k375L894j151L071
2578C047q465O946L121j0111O749n76R73l445j430J0181j0596J101N966l998J210
2593F73n169Q914k514q621J1026l629j320j289J771O004j2541O998M573q210L339
2608Ej621O265o220l765J2506q952n74K938N09J661r842J0932j23r813Q040j432
2624E14J964n949J356R924j3205L905M871l642L81n028J1002n745o955J1670m860
2639B03n58k522M140M122j3151R656K056o958K673j225P174r056m52J1051r900
2654b747J361J208K371o07q586J2339l632o737O948j563K328p242M491O429j2184
2669e823N979K005j867r23l395J0413p967l061R305n163N37l000N189J410j0553
$$ plain form
2684 -6914 2891 2335 -2329 -391 -1002 4858 -3958 -1986 5606 -2820 -555 -517 2384 450 -5350 5075
2700 5075 82 -3291 1488 218 2143 -4111 1152 3988 -4610 1004 911 621 -1067 -2385 4867 -2388
2716 -2388 -2076 2982 -637 306 -2384 2446 1396 -4433 2808 513 -1085 -400 -417 3118 -3238 -213
2732 -213 3111 -2073 152 -521 1738 -282 -2910 3395 -712 -1518 883 46 1235 -2537 1216 1809
2748 1809 -2618 1009 156 422 -696 -1076 2579 -1672 -586 1405 -475 294 -1137 1395 236 -1814
2764 -1814 1504 -221 -297 -212 -79 1160 -1471 389 903 -802 300 -271 679 -306 -800 1148 -528
2781 -528 -307 304 -82 339 -607 437 366 -644 378 -43 -31 -43 -300 433 -288 -146 356 -219 139 42
2801 42 -50 188 -200 115 -13 -237 299 -252 -93 327 -243 146 -11 66 241 -499 410 43 -453 324 -252
$$ packed form
2684f914R805n56m664J938o11N860q816J972P592q426K265L8K901j934n800J0425
2700E075m993l373M779j270J925o254N263K836q598N614r3k90j688j318P252p255
2716b388L12N058l619R43k690M830j050n829P241k295j598O85j7L535o356L025
2732b13L324n184K225o73K259k020k628O305m107q06K401q37J189l772L753N93
2748A809m427L627q53K66j118l80L655m251J086J991j880P69j431K532j159k050
2764a814L318j725p6Q5J33J239k631J860N14j705J102n71R50r85m94J948j676
2781e28K21O11l86M21r46J044p1j010J022m21J2j2k57P33p21J42N02n75L58r7
2801D2r2K38l88L15j28k24N36n51J59M20n70L89j57P7J75p40R09l67m96P77n76
$$ plain form
2822 -252 261 -283 -172 783 -713 223 294 -267 287 -612 683 -197 -676 886 -552 208 -140 -67 799
2841 799 -1102 685 221 -656 556 -634 732 -488 -489 1212 -1035 423 83 -168 690 -1159 1049
2858 1049 -171 -784 933 -818 661 -505 -226 1147 -1362 832 29 -415 727 -1082 1115 -527
2874 -527 -574 1148 -1154 772 -362 -152 956 -1346 1135 -309 -457 876 -1133 1020 -644 -263
2890 -263 1013 -1291 1063 -419 -180 872 -1201 1153 -619 -207 852 -1282 1089 -606 -115 789
2906 789 -1132 1219 -689 -60 841 -1173 1028 -682 62 566 -1220 1267 -675 -104 690 -850 1047
2923 1047 -882 264 644 -1215 999 -578 113 245 -863 1287 -887 70 701 -750 743 -772
2939 -772 516 235 -1110 1103 -544 21 171 -408 952 -978 386 515 -778 550 -499 486 -194
$$ packed form
2822b52N13n44J11R55j496R36P1n61N54q99J295q80m79J562j438P60l48P3Q66
2841G99j901J787m64q77J212j190J366j220jJ701k247J458l40k51Q58j849K208
2858A049j220o13J717j751J479j166K79J373k509K194q03m44J142j809K197j642
2874e27m7J722k302J926j134K10J108k302K481j444j48J333k009K153j664L81
2890b63J276k304K354j482K39J052k073K354j772M12J059k134K371j695M91R04
2906G89j921K351j908O29R01k014K201j710P44N04j786K487j942N71P94j540J897
2923A047j929J146L80j859K214j577O91J32j108K150k174R57O31j451J493j515
2939g72J288k81j345K213j647N65J50n79J360j930J364J29j293J328j049R85o80
$$ plain form
2956 -194 -676 1066 -691 42 253 -141 469 -790 660 110 -702 525 -297 248 -348 -116 706 -685
2974 -685 238 196 -60 107 -406 613 -303 -355 431 -261 93 -227 202 211 -414 344 4 -20 -40 -98 262 -343
2996 -343 47 71 -84 77 -149 267 -108 15 151 -215 254 -232 2 71 -164 187 -354 360 -9 -309 472
3017 472 -266 242 -226 -94 541 -787 320 97 -198 212 -521 895 -425 -415 915 -549 194 -376
3035 -376 322 392 -1261 1009 -23 -431 246 -270 1080 -1171 41 1222 -1162 228 -182 630 -254
3052 -254 -1258 1875 -661 -673 711 -44 600 -1553 1005 893 -1919 909 94 270 -687 -546 2278
3069 2278 -1829 -262 1503 -702 142 -1116 1660 -64 -2236 2191 -345 -522 -193 187 1724 -2694
3085 -2694 903 1672 -1881 354 -307 1545 -1236 -1518 3226 -1640 -730 848 323 562 -2637 2363
$$ packed form
2956a94m82J742j757P33K11l94O10j259J450n50q12J227q22N45n96K32Q22j391
2974f85R23m2k56J67n13J019r16n2P86o92L54l20M29Ro25P58l40k4k0n8L60o05
2996c43L90K4j55J61k26M16l75J23J36l66M69m86K34O9k35L51n41P14l69l00P81
3017D72p38N08m68J32O35j328J107k23k95M10p33J416j320J0J330j464P43n70
3035c76O98P0j653K270j032m08O77n16J350k251J212J181k384J390m10Q12q84
3052b54j004L133k536j2J384p55O44k153K558j12k812K828q15J76r57J41K824
3069B278m107J567J765k205Q44j258K776j724k172M427k536j77L29L80J537m418
3085b694L597P69l553K235o61J852k781k82M744m866R10J578n25K39l199N000
$$ plain form
3101 2363 691 -2744 1449 162 573 -1761 95 2998 -3116 249 1650 -504 -363 -1430 3020
3116 3020 -1175 -2365 2913 -657 -429 -895 1183 1574 -3694 2014 1375 -1976 182 -145 2167 -2430
3132 -2430 -858 3580 -2355 -359 621 878 50 -2926 3403 -113 -2700 1733 73 707 -2410 866
3148 866 2886 -3775 901 1481 -408 -695 -1236 3522 -2049 -1871 3015 -874 -364 -1218 1926 928 -3771
3165 -3771 2680 754 -1635 -70 169 2179 -3094 105 3002 -2429 -10 294 1331 -689 -2288
3180 -2288 3517 -965 -1805 1357 159 574 -2511 1645 1769 -3296 1368 777 -97 -895 -682 3056 -2414
3197 -2414 -851 2352 -966 -143 -1103 1973 200 -2898 2607 81 -1119 -105 306 1631 -2803 703
3213 703 1982 -2026 269 48 1230 -926 -1404 2785 -1235 -912 851 152 319 -1926 1640 670 -2109
$$ packed form
3101B363j672l435M193j287M11k334J856K903o114L365J401k154J41j067M450
3116C020m195j190N278l570K28m66K078L91n268N708o39l351K158l27K312m597
3132b430J572M438n935J996R80K57q28k976O329l516k587M433j660O34l117L276
3148H66K020o661M676N80j889k87n41M758n571J78M886l889N10q54L144r98m699
3165c771O451j926k389J565K39K010n273L199K897n431K419L04J037k020j599
3180b288N805m482q40L162j198M15l085M156J24n065M664n91q74p98K13L738n470
3197b414J563L203l318Q23r60L076j773l098N505k526j200J014M11J325m434L506
3213G03J279m008K295k21J182k156m78M189m020L23J763o99J67k245L566r70k779
$$ plain form
3230 -2109 1177 233 146 -861 -64 1865 -1932 36 1124 -607 -15 -773 1492 -362 -1443 1740
3246 1740 -339 -400 -121 280 821 -1750 783 797 -1161 333 -79 756 -663 -561 1538 -916 -231 389
3264 389 10 157 -1020 985 96 -988 750 -56 133 -382 52 756 -940 205 342 -293 55 -307
3282 -307 583 -241 -371 622 -232 -8 -54 95 157 -494 308 51 -287 164 -70 152 -91 -72 288 -212 3
3303 3 95 -119 52 -123 54 43 -139 158 -27 -20 159 -114 40 41 -75 43 -145 113 20 -240 256 -18 -61
3326 -61 93 -53 248 -267 -11 307 -366 87 7 33 42 -325 515 -142 -258 386 -190 162 -291 74 343 -659
3348 -659 369 27 -147 149 -279 595 -398 -157 566 -494 206 -215 130 218 -688 685 -162 -241 350 -314
3368 -314 516 -516 73 524 -738 430 -174 47 157 -568 811 -441 -124 502 -502 471 -485 184
$$ packed form
3230b109L286r44q7j007P97J929l797J968J088j731N92p58K265j854j081L183
3246A740k079o1K79M01N41k571K533J4j958J494m12Q35j419J02K099k454O85O20
3264C89l79J47j177K005q89j084J738q06J89n15M34P04j696J145J37o35L48l62
3282c07Q90q24j30R93q54K24m6J49O2o51Q02k57l38M51k34K22k43J9L60n00K15
3303CR2k14J71j75J77j1j82K97j85PJ79k73J54Jj16J18j88K58r3k60M96k74m3
3326f1J54j46L01n15K56L18o73M53q0K6Rl67Q40o57j16O44n76L52m53L65K69j002
3348f59J028l42j74K96m28Q74r93K41P23j060P00m21L45Q8r06J373q47p9N91o64
3368c14Q30j032N89M51j262J168o04K21J10p25J379j252L17O26j004R73r56O69
$$ plain form
3386 184 340 -793 680 -323 -15 255 -503 747 -572 74 443 -672 576 -452 151 208 -656 767
3404 767 -507 104 312 -543 694 -562 207 251 -634 679 -559 177 218 -553 696 -578 278 203 -572
3423 -572 731 -564 200 119 -472 653 -684 333 205 -559 643 -493 338 -16 -446 750 -664
3440 -664 201 131 -346 483 -643 518 41 -523 675 -425 251 -138 -201 624 -770 339 154 -353 365
3459 365 -436 541 -201 -367 685 -485 141 -79 -31 319 -713 522 11 -381 343 -239 384 -355 -71
3478 -71 552 -581 191 15 -4 79 -419 581 -207 -256 373 -167 167 -305 197 223 -533 328 -22 -49 -7 -133
3500 -133 425 -356 -9 305 -204 62 -161 205 -26 -306 330 -117 -32 28 9 181 -261 152 69 -137 83
3521 83 -128 148 -116 -71 176 -146 99 -53 65 63 -149 153 -144 85 -23 -150 213 -181 100 -30 -5 208
$$ packed form
3386A84J56j133J473j003L08K70p58J250j319O46L69j115J248j028O03N7q64J423
3404G67j274O11K08q55J237j256P69M4q85J313j238P36M1p71J249j274Q56p5p75
3423e72J303j295P64q1n91J125j337J017j28p64J202j136Q31l54m30J196j414
3440f64Q65p0m77Q29j126J161m77n64J198j100O76l89o3Q25j394J109j85n07P18
3459C65q01R77p42j66J052j170O26k20M8L50j032J235n11l92P24n82O23p39K84
3478g1O23j133P72j76j9Q3m98J000p88m9O29n40L34m72N02K6p56Q61l50k7M2j26
3500a33N58p81L47L14n09K66k23L66k31k80O36m47Q5O0j9J72m42M13q3k06K20
3521H3k11K76k64M5K47l22K45j52J18kk12L02k97K29j08j27L63l94K81j30K5K13
$$ plain form
3543 208 -303 248 -2 -141 133 -193 296 -269 -62 355 -297 120 -97 200 25 -440 555 -175 -243 144
3563 144 -47 243 -531 287 368 -567 226 47 196 -286 -239 768 -554 -184 404 -38 -17 -494 722 23
3583 23 -772 666 -9 -84 -312 112 699 -1018 246 593 -459 2 -194 815 -474 -636 1155 -480
3601 -480 -275 34 283 287 -1184 926 349 -932 393 77 490 -854 -61 1279 -1166 -65 529 99
3619 99 -247 -742 1397 -370 -988 980 22 -106 -726 666 707 -1572 635 613 -478 -302 -37 1214
3637 1214 -1124 -425 1398 -641 -333 -74 750 -86 -1369 1397 79 -931 323 241 560 -1303 394
3654 394 1248 -1434 145 448 245 -511 -694 1717 -818 -836 1100 -70 -92 -879 1007 494 -1730 968
3672 968 448 -449 -427 163 1251 -1476 -57 1326 -746 -285 -92 984 -456 -1167 1545 -221 -762
$$ packed form
3543B08n11N51k50j39K74l26M89n65K07M17o52M17k17K97j75m65R95p30o8L87
3563A44j91K90p74Q18Q1r35P93j79J49m82M7J007j322L70N88m42K1m77J216o99
3583B3p95J438o75p5k28M24N87j717J264L47j052M61j96J009j289j62J791j635
3601d80K05L09K49Mj471K110n77j281J325l16M13j344P93J340k445J101N94m30
3619I9l46m95K139j767o18J968r58j28o20J392M1k279K207k2j091J76K65J251
3637A214k338O99J823k039L08K59Q24q36j283K766j318j010J254q2L19j863J697
3654C94Q54k682J579L03k03p56j83K411k535j8J936j170k2p87J886n13k224K698
3672I68n20q97K2N90J088k727J419J383k072M61J93J076j440p11K712j766n41
$$ plain form
3689 -762 212 429 365 -1369 770 831 -1272 223 356 323 -749 -303 1461 -974 -412 806 -9 -142
3707 -142 -762 1095 62 -1306 952 144 -281 -402 254 947 -1362 252 915 -679 -134 -98 833 -564
3725 -564 -760 1293 -415 -457 160 349 206 -1095 818 411 -950 282 198 240 -665 -29 975 -836
3743 -836 -103 476 15 -178 -438 808 -191 -677 606 4 -119 -296 293 420 -818 326 358 -357 -30
3762 -30 -54 464 -421 -278 681 -332 -140 87 182 66 -543 506 73 -473 220 17 120 -326 52 425
3782 425 -462 65 204 -49 -25 -183 338 -134 -250 271 -64 -42 -64 88 109 -229 133 83 -116 32 -6 49
3804 49 -73 -53 100 -80 -14 54 -21 31 -29 13 25 -62 62 -28 -54 75 -50 10 25 -2 49 -94 110 35 -115 107
3830 107 -25 3 -30 -31 159 -178 29 127 -107 43 -55 115 -34 -198 266 -103 -102 107 -43 116 -229 132 172
$$ packed form
3689g62R74K17o4j734K139O1k103J495J33l3j072M46J764k435N62J218q15j33
3707a42o20J857j033j368K258q08m25j21O56O93k309J614O63j594N45L6R31j397
3725e64j96K053j708m2O17J89j43j301J913m07j361J232q4M2r05O36J004j811
3743h36P33N79m61j93k60J246r99m86J283o02j23j77N89J27j238J144L2p15L27
3762c0k4N18q85J43R59j013J92K27R5j16o09J049m33n46O93k03J03m46L78L73
3782D25q87N27J39k53K4j58N21m72j16N21l35K2k2J52K1l38L62n0j99J48l8N5
3804D9j22K0J53j80O6O8p5N2o0M2J2q7J24r0k6J29j25O0J5k7N1j43K04p5j50K22
3830A07j32K8l3jJ90l37K07R8k34J50r8J70j49j64M64l69JK09j50J59l45L61M0
$$ plain form
3853 172 -302 179 -17 17 -42 -166 345 -266 -69 257 -168 113 -174 191 81 -374 350 -103 -70 36 -102
3874 -102 300 -350 106 255 -318 190 -136 172 -8 -298 438 -272 -39 127 -139 235 -349 216 120 -356
3894 -356 314 -179 94 -36 -206 404 -392 98 157 -236 261 -299 241 26 -315 406 -301 114 28 -186 345
3915 345 -374 208 65 -261 336 -304 207 -26 -221 377 -366 201 10 -206 336 -349 233 -32 -171 345
3935 345 -377 237 -17 -197 295 -344 267 -105 -161 368 -365 217 -43 -99 265 -397 323 -76 -208 292 -263
3956 -263 245 -167 -44 337 -416 253 -18 -91 150 -307 376 -197 -150 336 -263 172 -153 63 212 -431 338
3977 338 -37 -132 117 -174 300 -306 -5 326 -325 147 -77 114 41 -325 400 -159 -122 159 -103 189 -286
3998 -286 157 195 -349 211 -40 42 -60 -125 347 -277 -11 181 -108 73 -181 224 9 -265 276 -71 -24
$$ packed form
3853A72m74M81j96L4n9j24N11o11J97L26m25K81k87L65j10m55P24m53L3J06j38
3874a02M02o50M56J49n73N08l26L08j80k90P36p10K33J66k66L74n84N65r6m76
3894c56O70m93K73j30j70O10p96M90N9l93M97n60N40k15l41P21p07M15q6k14N31
3915C45p19N82j43l26N97o40N11k33j95N98p43N67j91k16N42o85N82k65j39N16
3935C45p22O14k54j80M92o39O11l72n6N29p33N82k60n6L64o62P20l99j32N00n55
3956b63N08m12J23L81p53O69k71p3K41m57O83n73M7M86n99M35l25K16J49o43P69
3977C38l75r5K49k91M74o06L01L31o51M72k24J91p3l66P25n59L7K81k62K92m75
3998b86M43L8n44N60k51Q2j02o5M72o24K66J92k89J81k54M05k15k74N41l47M7
$$ plain form
4019 -24 -39 -10 198 -301 109 131 -165 75 -74 162 -101 -128 247 -150 3 -1 14 83 -227 175 9 -117 104
4042 104 -64 112 -108 0 144 -157 76 -37 38 31 -119 156 -80 5 37 -60 107 -128 63 16 -81 88 -122
4065 -122 103 -19 -83 107 -80 71 -76 5 139 -170 77 11 2 8 -101 213 -96 -95 151 -40 3 -124 136
4088 136 75 -266 149 69 -67 -76 23 220 -269 -18 248 -135 -63 -48 239 -106 -257 352 -43 -151 3 125
4110 125 103 -400 231 190 -309 39 49 188 -299 -75 463 -318 -103 155 101 -85 -318 483 -67 -415 285
4131 285 90 -17 -302 221 333 -559 131 307 -121 -216 -6 474 -385 -257 516 -87 -241 -55 372 -28
4151 -28 -543 450 175 -390 -47 212 210 -528 102 518 -425 -126 209 215 -274 -293 647 -206 -398 297 134 -54
4173 -54 -426 416 254 -649 258 246 -78 -294 46 566 -554 -129 531 -155 -199 -87 486 -172 -529 583
$$ packed form
4019b4j5K9K08m99M10K2k96K40j49K36k63k7L75l97J53mJ5O9l10M02j66j26K21
4042A04j68J76k20J08J44l01K33j13P5pj50K75k36Q5L2r7J67k35J91m7r7J69k10
4065a22K25j22o4J90j87J51j47Q1J34l09K47o6rOj09L14l09JK46j91M3j27K60
4088A36o1l41M15q0j36rR9J97m89K51K66l83P2J5K87l45j51O09l95j08J54J22
4110A25k2n03O31m1m99L48J0J39m87K24N38p81K15K58n4j86k33Q01n50l48P00
4131B85j95j07k85N23J12q92O90J76m28r5K10M80q59J28P73o03j54J86M27m00
4151b8n15R93k75n65L43K59kp38O30M16r43K99L35Om89j9R40q53j92O95j63j88
4173e4l72Q42j62r03R07j2l24k16L40N20j120M25O60o86m4J12N73o58l57J112
$$ plain form
4193 583 59 -355 -55 292 149 -610 263 436 -443 -88 241 239 -398 -149 608 -277 -311 270 186 -156 -331
4214 -331 463 101 -509 222 232 -73 -305 156 393 -499 -6 379 -110 -189 -51 431 -224 -343 485 -32 -213
4235 -213 -44 245 85 -485 303 232 -350 1 152 174 -343 -24 430 -294 -144 195 113 -143 -207 375 -27
4256 -27 -314 192 127 -84 -180 162 184 -308 41 219 -78 -122 53 211 -157 -125 241 -27 -129 4 138 -10
4278 -10 -192 155 77 -167 11 82 51 -136 21 171 -131 -18 85 21 -64 -49 136 -37 -100 112 14 -48 -33 54
4302 54 33 -98 46 67 -64 -12 33 14 -15 -24 38 -9 -36 51 -33 -12 14 -38 35 -45 18 12 -68 77 -33 -27 36 -31 35
4331 35 -76 44 50 -102 66 1 5 -15 -37 117 -94 -11 87 -60 19 -45 92 4 -125 144 -18 -43 18 1 83 -155
4357 -155 56 101 -141 48 -16 65 -52 -86 198 -121 -37 92 -40 41 -139 145 38 -195 152 -22 8 -29 -21
$$ packed form
4193E83n24m14L00L47j43p59Q73J73q79L55L29ko37K49P57q85l4N81q4l42j75
4214c31P94l62o10P31J0l05k32M61K37q92M93L85m89p9J38M82o55j19Q28n17j81
4235b13J69K89j60n70P88p1n82L51J51K2n17L19M54p24J50L39q2k56o4N82m02
4256b7k87N06o5k11r6L42K2m92L49J78k97m4J75J58l68L2L66k68j02J33J34j48
4278a0j82L47p8k44J78P1l1j87J57J50l02J13J03o4q5J5J85j73o3K12r8o2J5Q7
4302E4k1j31J44K1j31N2M5j9k9rO2m7k7Q7q4K1K6n2P3q0O3oq0J45j10OO3o7O6
4331C5j11J20Oj52J68o5Mk0k2J54k11Q3R8j47P9o4J37q8j29K69j62k5O1j7Q2k38
4357a55K11M5k42J89o4Q1j17l4K84l19Q4J29j32Q1j80K84j07k33L47j74L0l7Q
$$ plain form
4380 -21 194 -208 62 124 -115 55 -90 134 -36 -152 243 -122 -16 23 -8 130 -217 138 61 -158 117 -66
4402 -66 89 -69 -70 220 -188 43 39 -61 95 -165 164 -30 -152 175 -117 81 -52 -29 165 -219 127 18
4424 18 -86 118 -145 151 -67 -78 192 -168 100 -35 -44 138 -190 147 -48 -76 147 -163 143 -61 -50 143
4446 143 -186 146 -75 -53 146 -177 153 -73 -27 116 -184 179 -66 -42 113 -148 155 -116 8 152 -200
4467 -200 135 -68 25 55 -174 210 -121 -36 137 -121 110 -138 68 88 -213 173 -48 -18 21 -102 202 -181
4489 -181 4 143 -147 80 -83 101 2 -187 231 -103 -48 56 -40 135 -205 98 108 -196 113 -35 70
4510 70 -64 -106 257 -168 -7 94 -48 54 -165 175 17 -189 169 -46 16 -66 -12 180 -227 77 90 -96
4532 -96 39 -81 159 -95 -114 206 -117 2 -13 28 81 -211 148 23 -132 79 -50 114 -123 -20 181 -174
$$ packed form
4380b1K15m02K70O2k39J70j45K24j70j16L95l65J06L9l1J38l47L55p7k19K75j83
4402f6J55j58jK90m08K31mj00J56k60L29j94j22L27k92J98j33K3J94l84L46j09
4424A8j04K04k63K96k18j1K70l60K68j35rJ82l28L37j95k8K23l10L06k04J1J93
4446A43l29L32k21K2J99l23L30k26M6J43l00L63k45K4J55k61L03k71J24J44l52
4467b00L35k03R3L0k29L84l31Q5J73k58K31k48K06K0l01L86k21L0L9j23L04l83
4489a81J85J39k90K27j63J84r9j89M18l34N5J04r6J75l40L03J0l04L09j48J05
4510G0j34m2L63m25J61J01j42J02k19L40j58k06L58k15O2q2N4J92m07L04J3j86
4532i6J35j20K40k54j9L20l23J19j5M1N3k92L59j25j55K11j29J64k37J03K01l55
$$ plain form
4554 -174 37 14 -5 35 -153 174 -44 -101 116 -63 72 -91 32 105 -168 109 0 -17 16 -80 140 -101 -20
4577 -20 89 -77 52 -70 51 35 -117 109 -44 1 32 -57 110 -95 26 53 -84 84 -75 45 37 -90 96
4600 96 -68 29 9 -76 146 -96 19 51 -64 81 -115 73 27 -130 96 -60 27 -39 -40 148 -144 29 55 -47
4624 -47 45 -90 122 -29 -111 116 -36 13 -58 36 92 -162 79 49 -55 -6 -29 134 -115 -50 154 -76 -20 -7
4648 -7 77 -3 -165 175 11 -119 45 28 51 -154 53 167 -192 5 79 13 -62 -92 213 -104 -153 157 3 -30
4672 -30 -109 129 85 -246 116 81 -73 -54 24 171 -201 -42 190 -80 -55 -12 141 -56 -179 201 -2 -108 2
4695 2 68 44 -213 105 133 -175 6 70 62 -138 -48 228 -131 -102 142 15 -64 -112 166 18 -218 148 63 -70
4719 -70 -67 47 144 -216 13 182 -96 -32 2 134 -59 -145 223 -32 -102 34 57 57 -174 107 107 -145 23 50 51
$$ packed form
4554a74K11k3j9M0j88L27k18n7K17j79J35j63J23P3k73K77j09j7L3r6K20k41Q1
4577b0J09j66J29j22J21j6j52K26j53M5L1q9J67k05J21K7j37J68j59J20qj27J86
4600I6j64R7k0q5K22k42J15L2j15J45j96J88m6j57K26j56Q7o6jJ88k92J73K6j02
4624d7R2j35K12j51q2K27j52M9p1R4N6k54K41l0j04M9k3J63k49O5K04k30N6J3
4648gQ4q0j62L40j64j30J64j7K3k05K07J14l59J97P4o6p5l0L05l17m9L10j54l3
4672c0p9K38m4l31L62l5j54J9P8J47l72J59K32k70K5M3J53j97j23L80k03j06J10
4695BO6k4k57L18K8l08J81O4qk00R0K76l59K9K44j27p9m8K78j48k36L66q5j33
4719g0LJ14R7l60K29J69k78O4L4J32j93q6L68k55p0J36K3%k31K81%k52J68K7J
$$ plain form
4744 51 -110 -23 181 -123 -43 82 20 -39 -81 154 -7 -137 114 22 -32 -50 50 92 -157 41 101 -81 -6 5
4768 5 96 -67 -79 163 -68 -35 35 17 34 -124 90 53 -118 64 -11 27 -36 -42 124 -97 -10 45 -43 41 -83 63
4794 63 -1 -86 85 -41 16 -10 -20 64 -82 46 12 -48 54 -44 49 2 -39 62 -47 27 14 -47 59 -50 35 -7
4820 -7 -33 62 -61 35 27 -48 48 -64 49 -17 -60 73 -80 14 11 -23 51 -84 65 23 -82 73 -43 31 -26 -22 105
4847 105 -101 25 52 -45 26 -63 87 -7 -82 98 -38 -1 -20 12 63 -110 61 46 -71 32 -18 69 -50 -42 114
4872 114 -79 -22 23 -9 35 -101 90 13 -93 58 -12 30 -63 -9 99 -115 32 47 -37 20 -58 108 -37 -72 108
4897 108 -53 6 -16 27 69 -125 85 16 -68 36 -27 79 -62 -29 105 -91 4 4 3 24 -97 98 -16 -68 72
4922 72 -43 40 -54 11 75 -101 58 3 -16 29 -53 93 -52 -29 81 -63 53 -37 6 48 -88 92 -18 -25 37
$$ packed form
4744E1j61Q7K04l04Q0J25o2n9m2K35j61j30K51r2n4j8J00M2k49J98O0j82P5J1
4768ER1j63j2K42k31L3P0j8J7j58K14l7j71J82p5L8o3oJ66k21Q7N5q8Q4j24J46
4794F3o4q5J71j26N7k6j0Q4j46J28l4o0J02r8R3m7m1J01j09P4j3o1J06j09Q5m2
4820gk6R5j23R6qp5R6j12J13o6m3J33j53R4ll4P4j35J49m2j05J55j16P4n7MJ27
4847A05k06J26K7r7P1q9J50r4p5J80j36L7j9L2N1j73J71j5j17J03n0Q7j19QJ56
4872A14j93N7M5l2M4j36J91p7j06J51p0M2r3N4J08k14J47J5q4N7p8J66j45l5J80
4897A08j61N9k2M3M2j94K10o9q4J04o3J06j41L3J34j96R5%jK1j21J95j14n2J40
4922G2j15Q3r4O5O4j76J59n5j9M5q2J46j45K3J10j44J16r0M3M2j36J80j10pO2
$$ plain form
4947 37 -61 73 -52 -14 57 -89 63 -41 1 48 -78 74 -49 -4 39 -81 63 -39 7 43 -65 87 -62
4970 -62 15 42 -69 63 -45 18 8 -79 95 -62 9 44 -42 65 -70 49 34 -95 79 -50 21 -6 -38 104
4994 104 -98 20 54 -53 41 -62 77 -6 -90 107 -50 -2 0 -10 79 -108 69 49 -73 55 -41 71 -51 -43
5018 -43 131 -96 24 18 1 33 -96 115 -2 -76 83 -37 60 -72 18 94 -139 63 31 -23 8 -58 132 -64
5042 -64 -45 102 -72 31 -44 53 34 -134 128 -20 -33 29 -21 104 -128 26 94 -126 51 -36 44 -4 -108 165
5066 165 -83 -27 56 -47 73 -118 82 63 -140 107 -51 17 -14 -51 147 -134 29 64 -82 69 -95 91
5088 91 -21 -96 142 -84 34 -1 -29 93 -136 91 22 -77 104 -86 85 -40 -36 147 -133 69 8 -35 80
5111 80 -126 126 -25 -74 121 -114 85 -50 -13 109 -158 126 -23 -59 99 -118 123 -70 -26 124 -159 117
$$ packed form
4947C7r8J34j25L8P1j46J52j04M2M7j26J52j23M5M3j20J44j02M6L6j08J52j49
4970f2P7K7j11J32j08O3j0q7J74j57P1L5q6J07j35J19j5j29J74j29P1k7l2J42
4994A04k02J18L4j07R4j03J39q3q4J97j57M8Kj0Q9j87J77k0j22J28r6J12j22Q
5018d3J74k27J20oj7L2j29K11j17p4J59j20R7j32R0P6k33K02l2n4L1o6J90j96
5042f4J9J47j74J03p5R7j9j68K62j48j3O2n0J25k32J54O8k20J77q7Q0m8j04K73
5066A65k48N6Q3j03J20j91K00j9k03K47j58O8l1l7J98k81J63L5j46J51j64J86
5088I1j12p5K38k26J18l5k8J22k29K27o9r9J81j90J71j25MJ83k80K02o1m3J15
5111H0k06K52j51m9J95k35J99j35L7J22k67K84j49l6J58k17K41j93M4J50k83K76
$$ plain form
5133 117 -52 -13 81 -155 148 -75 -34 121 -123 114 -76 27 83 -163 167 -73 -17 85 -110 143 -121 29
5155 29 106 -151 128 -65 43 35 -131 185 -121 -1 90 -106 116 -122 61 45 -171 175 -83 16 26 -85 174
5178 174 -163 38 90 -161 122 -90 80 19 -137 217 -140 18 58 -79 132 -176 117 42 -158 154 -90
5199 -90 74 -26 -77 199 -198 45 66 -77 83 -146 148 -30 -137 184 -98 52 -32 -27 146 -209 111 35
5221 35 -105 78 -94 126 -75 -71 201 -152 52 9 -13 96 -184 159 -6 -120 142 -96 90 -80 -26 178
5243 178 -204 90 16 -52 63 -142 173 -72 -96 159 -103 71 -58 16 113 -197 124 -4 -60 44 -89 141
5265 141 -113 -23 144 -125 69 -46 35 40 -154 152 -41 -54 68 -64 103 -102 24 102 -155 94 -21 -2
5287 -2 31 -103 144 -83 -35 85 -88 75 -92 29 70 -145 105 -34 -14 25 -78 128 -99 -6 99 -94 63
$$ packed form
5133A17j69L9R4k36L03k23M1J55k44K37j90J03N6k46L30k40N6J02j95K53k64J50
5155B9P7k57K79j93J08qj66L16l06J20R1j96K22k38J83j6k16L46k58R9J0j11K59
5178A74l37K01N2k51K83k12J70o1j56L54l57J58M0j37K11l08K93p5k00L12k44
5199i0J64j00n1K76l97K43K1j43J60k29K94j78j07L21k82J50q4NJ73l55L20p6
5221C5j40J83j72K20k01MK72l53K04m3k2J09k80L43j65j14K62k38J86j70N4K04
5243A78l82K94p4o8J15k05L15k45k4K55k62J74j29P4R7l10L21j28n6J04j33K30
5265A41k54R0J67k69J94j15Q1Nj94L06j93j3J22j32J67k05J26P8k57K49j15J9
5287bL3j34K47k27M8J20j73J63j67J21M1k15K50j39K0L9j03K06k27R3J05j93J57
$$ plain form
5310 63 -68 49 28 -112 105 -40 -9 25 -46 94 -95 31 66 -79 48 -41 43 17 -73 96 -49 -9 21 -43
5334 -43 67 -77 28 37 -80 46 -42 18 4 -48 88 -56 -7 35 -34 52 -60 45 27 -73 61 -15 5 -12 -26
5359 -26 83 -54 2 52 -40 27 -43 29 -2 -69 55 -17 -19 -6 -7 45 -56 9 31 -45 5 -23 22 -9 -49 51 -20 -26 23
5388 23 -10 31 -48 32 40 -46 9 -2 7 -16 -24 61 -23 -13 38 -15 8 -16 27 21 -59 25 9 -18 0 -8 35 -32 -15 44 -30 5 -17
5421 -17 7 0 -40 38 -8 -31 13 -13 14 -26 4 36 -42 12 -1 -8 -7 -27 26 -17 -24 32 -13 10 -8 5 30 -45 32 -1 -16 7
5453 7 -17 36 -24 -13 33 -41 8 -23 -1 24 -39 29 -18 -8 12 -29 28 -20 -12 20 -21 31 -20 -6 7 -32 22 -10 -4 17 -22 31
5485 31 -17 -3 25 -18 19 -26 12 14 -40 28 -19 2 5 -13 27 -29 -4 10 -28 10 -25 25 8 -24 41 -29 -6 -3 0 28 -43 27
5517 27 10 -13 3 -17 33 -26 -22 48 -36 12 3 9 10 -40 53 0 -20 22 3 34 -38 17 37 -48 30 -2 2 -16 -30 68 -42 -14
$$ packed form
5310F3j31J17k1j40K17j45L1L4p1J40j89J26L5j45J27q9Q4k6r0J69j45M0L0o4
5334d3J10j44J05Rj17J26q8O0j4n2J36j44M9M2o9Q6j12J05j8j00J34p6K0j7j4
5359b6J09j37N6N0r2O7p0P2l1o7J24p2kJ3jN2j01O5K2p6N0k8M5l1m0J00p1oM9
5388B3l3M1p9Q0Qq6N5j1Rk3qQ5q4J0N1n3K3k4M3oq0Q4j6k7J8qM3o7J7N9p4L5k2
5421a7K4pm0P8m6k3M4k6K7m0L0L2p8N4j3pJk0N3m3pN6m5K3j8J3K5p5P7l3j5K3
5453Gk4N3o0J1M6p4M9l1K2K5o3O8m7J0K0m1N7m8QL2m1N2n1J4J3l9N4l2OK1l9N3
5485C1m8J4K8m3L7m5L8Kn4O8m7K1Lj8M0n6K5J4l8L8l5N0j7l2O5p0K3LLK8p1P0
5517B7j7k3J6k0N0n9MP0q4M8rOJn0R3n3k0M2j9L1p2N5K0q5P8l2Mj8j4R8j10K8
$$ plain form
5549 -14 34 -22 4 -38 43 -1 -66 56 -22 4 -11 -4 46 -71 23 23 -33 16 -19 43 -27 -27 73 -45 11 4 -5 36 -59 68
5579 68 3 -52 50 -26 35 -33 1 70 -85 36 8 -21 29 -58 88 -42 -31 70 -58 49 -35 13 33 -92 75
5604 75 -18 -26 44 -38 72 -70 15 60 -89 53 -21 17 9 -71 108 -61 -5 54 -58 59 -63 42 45 -103 98 -39
5630 -39 -4 19 -53 95 -106 21 52 -102 73 -60 49 0 -92 118 -78 -6 34 -54 91 -110 61 20 -101 112
5654 112 -57 30 -10 -46 126 -125 42 40 -62 59 -88 91 -22 -85 137 -78 27 -3 -9 81 -145 86 17 -97
5678 -97 74 -62 72 -58 -36 138 -136 33 7 -34 53 -106 130 -33 -87 118 -77 44 -45 1 113 -150 95
5701 95 10 -47 60 -87 116 -75 -42 141 -114 43 -12 6 64 -158 139 -30 -71 71 -65 89 -95 18 119
5724 119 -157 60 -9 -1 17 -95 148 -75 -38 109 -59 53 -69 51 65 -146 115 -15 -22 30 -51 123 -110
$$ packed form
5549a4M8n6K6m2Q1m4o5J22p8K6j5PN0j17R4%n6M9l5O2p0%J00j18N6prM1r5J27
5579F8o5n5J02p6O1o8L4O9j55J21k8k9N0q7J46j30J1J01j28J07q4M8K0j25J67
5604G5r3qP0q2J10j42Q5M5j49J42p4L8qq0J79j69N6N9j12J17j22J05Lj48K01j37
5630c9L5K3p2J48k01J27L1j54J75j33J09m9r2K10j96P2M0q8J45k01J71m1j21K13
5654A12j69Q7m0l6J72k51J67kj02J21j47J79j13o3K22k15J05l0oR0k26K31o9j14
5678i7J71j36J34j30K2J74k74J69k6m1Q7j59K36j63n4K05j95J21q9M6J12k63K45
5701I5q5n7J07j47K03j91L3J83k55J57n5J8N8k22K97j69m1J42j36J54j84J13J01
5724A19k76K17o9QJ8j12K43k23L7J47j68J12j22J20J4k11K61j30pN2q1J74k33
$$ plain form
5747 -110 -3 105 -107 54 -38 49 16 -107 145 -64 -34 49 -47 73 -104 48 72 -129 82 -15 21 -6 -67 133
5771 133 -99 -12 72 -52 46 -74 78 27 -100 114 -29 7 -7 -16 95 -107 32 63 -63 43 -32 62 -12 -59
5795 -59 111 -68 -4 17 -9 46 -76 62 24 -74 56 -15 35 -21 -26 93 -68 5 46 -28 37 -57 67 10 -72 66
5821 66 -17 10 -12 -8 65 -89 28 29 -40 27 -24 54 -29 -31 70 -42 8 3 3 37 -74 34 14 -36 18 -20 36 -24 -10 50
5851 50 -42 -1 12 1 6 -32 28 5 -30 39 -8 24 -13 -1 38 -36 0 20 -3 8 -15 31 -4 -22 39 6 6 11 16 19 -30 18 13
5884 13 -12 2 1 23 -8 -13 14 -9 -13 2 -1 -3 -11 8 8 -9 -2 7 0 -1 -9 21 -2 -14 20 -1 2 -4 0 17 -16 8 12 -4 4 -6 22 -7 -18
5923 -18 27 -4 -1 6 -7 9 -24 13 -2 -26 10 0 -1 -5 -19 25 -25 -10 22 -12 6 -15 5 6 -21 24 2 7 4 -13 27 -18 3 12
5957 12 -11 20 -11 10 -5 -21 31 -20 1 2 -4 14 -28 8 -2 -22 21 -22 19 -2 -14 36 -21 12 8 -19 21 -25 16 3 -19 27
$$ packed form
5747a10J07J08k12J61r2Q7l3j23K52k09L0Q3r6J20j77J52K4k01K11r7L6k7o1K00
5771A33k32Q7Q4j24R8j20J52n1j27K14j43L6j4rJ11k02J39L1j26J06p5R4p4m7
5795e9J70j79O4K1k6N5j22J38l8r8J30p1N0n6nJ19j61P3M1p4O5r4J24n7q2J38
5821F6q3K7k2MP3j54J17Jo9O7n1P8q3kJ01j12N0n%L4j11J08k0n0N4l8N6o0J4O0
5851E0r2M1J3j1Nl8O0k3l5O9m7L2l7J2L9p4L6K0k3J1k3M6l5j8O1l3%NNLm9M8n
5884A3k5J4jK2l1nK7k3mJ5lkqJ9%j7PRpjqL0k3j2L4k1LoMJ7l3K4Mj6Qj0K8k9j1
5923a8M5l1LPj3J6l3L7j5k4L6j0jmj4M4n0J5L2l4J8k1K0Jk7M5k2Nlj7M0m5K1R
5957A2k3L1l1K1j5j6N2n1K1JoJ8m2L6j0k0M3m3M1k1j2N0n7L3mk7M0m6M1j3k2M6
$$ plain form
5989 27 -26 21 -10 -14 29 -21 18 0 -4 21 -26 15 -1 -9 19 -16 14 -5 -13 25 -22 22 -6 -5 12 -29 11 -14 -20 20 -25 13 -13
6022 -13 -7 19 -37 5 -6 -2 -6 -39 17 -19 -14 3 -29 6 -29 0 6 -17 16 -12 0 2 -5 25 -29 0 5 -5 6 -16 23 0 -16 18
6056 18 -7 -1 -8 0 14 -29 -3 6 -24 -4 -10 15 -20 -16 14 -26 1 -12 24 -14 -31 22 -3 -8 9 3 7 -34 18 20 -20 20 -3 14 -5
6091 -5 -14 31 -29 8 -1 -6 5 -28 36 -16 -19 27 -14 6 -18 4 16 -45 27 -9 -12 10 -15 40 -28 -1 29 -38 11 -6 21 1 -29
6124 -29 43 -16 -16 21 -12 18 -31 24 14 -58 35 -12 -4 7 -17 32 -62 16 24 -33 16 -29 39 1 -49 60 -39 -3 4 -6 43 -67
6156 -67 31 13 -49 40 -32 25 -27 -30 68 -72 13 18 -14 31 -56 58 -12 -52 57 -44 9 -27 -7 48 -77 36 18 -31
6184 -31 26 -33 48 -48 -42 68 -64 9 -11 4 19 -79 63 -8 -53 46 -19 37 -49 12 66 -83 40 15 -16 8 -53 92
6212 92 -44 -29 68 -35 28 -40 35 41 -96 66 -13 -23 21 -42 67 -69 1 66 -74 31 -26 26 -15 -77 87 -46
$$ packed form
5989B7n3M7l1mM3n0L9j8mK5m7M1j6qK8l5L0j9qL8m7M4k8JJ7m1M0k5oM0m5L8k6
6022a3OK6n6M2j1Mml3N6l6NJ7l2L5l5K9Ok3L3k8J2KpL0n4K9Nj0J1k2L9k3j6L4
6056A8k5OpQJ4m3K6Rl0K0oK5l5ML0m0K7j3L6l8j7N3k5nJ7oMm1N2Km0M0k3J7j9
6091erM5o0L7rnJ1l3O4n2lM6m1K0k4K2J2o1P2l6lK2k5N5o8K7L0o7M9j7K7k0l0
6124b9P2n9%L7l3L0m9N5j0p2R3m7QJ1k4M9r4P8Qn7M9m5O8l8n0J09r9L6Pj0M9j10
6156f7R8j8o2Q9p2N7n2lR8j40Q5Nl2M5q7J14p0m0J09j01N3l6K0N5j25J13j8m9
6184c1N7n9Q1r6OJ10j32P3k0J5J5r8J42p1m5R9o5N6q6O1N4j49J23k5l1K4o1J45
6212I2j36J5R7j03O3o8P5Oj37J62p9j0M4o3J09j36P0O5j40J05n7N2m1o2J64j33
$$ plain form
6238 -46 -35 32 -16 40 -69 42 41 -82 50 -2 11 -16 -30 85 -72 -6 52 -40 12 -47 62 3 -68 79 -27 -15
6264 -15 -5 1 60 -80 34 34 -60 13 -18 43 -16 -47 94 -58 -19 21 -12 26 -71 41 0 -68 46 -12 16 -30 -14 77
6292 77 -77 19 33 -24 -4 -43 54 -32 -54 67 -28 -6 -9 23 24 -74 28 13 -39 1 -6 33 -33 -11 57 -34 -1 -1 -3 -1 -62 49
6324 49 -3 -45 20 -9 18 -17 2 37 -55 12 21 -12 10 -17 42 -21 -13 42 -9 -3 -19 18 8 -49 29 11 -24 2 4 15 -28 4
6356 4 42 -33 -5 6 14 -12 -20 23 -14 -16 11 -7 8 -22 12 24 -30 7 12 4 -20 -5 15 -1 -10 15 -3 -6 2 26 13 -24 13 6 -2 2
6392 2 7 2 -5 0 3 -9 -18 -4 -3 -4 -5 -1 -7 -13 2 10 -4 2 6 -7 -4 -14 7 -11 -7 1 -5 15 -6 0 -2 -11 17 13 10 -7 -19 15 -11 7 5 -7 12
6435 12 -12 7 6 -12 4 -16 5 0 -4 23 -2 -5 1 -14 17 -20 9 -4 -19 10 -10 16 7 -16 22 -16 0 3 -13 10 -15 3 -6 -17
6469 -17 32 -14 18 3 -10 26 -19 15 -5 -18 16 -29 21 17 -11 27 -13 5 -6 -19 15 -17 14 -8 -10 18 -17 22 -8 -5 29 -21
$$ packed form
6238d6J1O7m8N6j09J11jj23J32n2J3k7j4J15j57O6N8r2N2n9J09n9p1J47j06J2
6264a5J0ON9j40J14%r4P3l1O1n9l1J41j52L9M0l3L8r7J12m1o8J14n8K8m6J6R1
6292G7j54R6J4n7K0l9R7q6k2J21r5K2lL2Jr8J02j5n2M0pL9o6K2O8r1L3%kKo1J11
6324D9n2m2O5k9K7l5J9L5r2O7Rl3K2k7N9o3QN5n1Oj6L7j0n7P8j8l5K6KJ1m3L2
6356DL8p5K8J1Qk6qM3l7kK7j8J5l0L4J2n4L7Nqk4J5K0j6rK5j8lQK4j3l7L7pqM
6392BNnpNLj2rJ4JjjMooJ5Qj4OMj3Lj0K1j8MQoK0k1OkrK8mlj7j2L4k6J8kj2J9
6435A2k4J9jj8J6k0K1nmK7k5lOj5L1l7K9j3j5K9k0K6rk3L8l8J6Lj6K3k5J8rj1
6469a7M9m6L2j5j3L6m5L4k0j3L4m5N0mk8L8m0J8j1j3L4l2L1k2kK8l5L9l0LL4n0
$$ plain form
6501 -21 8 -4 0 17 -21 18 -9 0 20 -13 10 -13 -8 17 -29 19 -5 -1 10 -20 19 -5 -1 5 -18 5 -14 -7 31 -27 15 -10 -3 3 -25
6536 -25 20 -10 -1 14 -20 8 -18 11 12 -11 20 -16 -5 6 -9 10 -5 6 15 -1 19 -13 15 4 -4 19 -3 2 -1 1 14 -13 13 5
6570 5 -10 7 -20 4 1 -13 10 -17 -9 -10 -2 -2 -4 7 -8 2 11 2 14 -4 3 9 -12 19 5 10 0 -8 9 -4 2 15 -2 7 -6 11 -8 5
6608 5 25 -8 -1 -1 9 6 -15 9 -4 -14 -3 2 14 -14 4 6 -15 10 -13 2 3 -11 30 -12 -9 17 -7 6 -20 25 2 -11 18 -2
6642 -2 13 7 3 31 -28 14 15 -10 18 -21 36 -24 -13 32 -17 15 -4 4 23 -36 23 -1 -19 11 -19 11 -32 2 48 -39 19 6 10
6675 10 17 -27 56 -18 -27 37 -13 22 -26 11 28 -53 31 2 -5 10 -17 49 -39 -15 41 -26 11 -9 32 3 -65 64 -17 -27 0
6706 0 -10 31 -56 8 27 -54 14 -2 16 -6 -32 79 -43 -3 36 1 19 -40 49 22 -75 53 -14 0 -8 -20 68 -72 2
6735 2 49 -34 4 -25 40 -11 -62 70 -31 -19 8 6 44 -74 36 29 -66 25 -15 36 -35 -32 70 -58 0 28 1 22 -57
$$ packed form
6501b1K9j2MJ7l8L9k7RK0l3K3k3NK5m6M8k4MJ1l0L9k4MOk3K3j9PL8n8M2k5POk8
6536b5M5l0RJ5l4K8k6K9Jk3L1l6J1J1j5J9j5J1Rj6K0l2K8j1qK3k2NlKJ3k7K6q
6570Ej5J7k7K4lj4K3k7QjQ%kJ1j5J0RrJ2j8POk1L1j4Nj0qJ7j3OJ3j7Rj3J7j9J3
6608EK0l3P%J0lk1K4j3j0J1NJ2k8J8Kk1K5k3J5Jj4M1m2LK6k4J3k6M5k3j3K9k0
6642bJ5omK8n9M2Jk5K8l9N7o0J1M5m9L2j9QJ9n9N9k4j8L0l0L0m3L4M6q7N8j3M
6675A0Pm4Q3p4rO4n0L5m8L7J7q1Q4k9pJ5k7O6q8K4N6o7L7k0M1k9o8J29q1j0K7
6706@j0M1q7O4J9q1O8j6J8k2k6J11j22M0L9l5J8n9Q9k7r7J28o7J4qj2Q8j40P4
6735BM7q3L8k9O5n1n1J32j01J2K7kL8j18J10pr5R1m0N1p1LJ02j28N8K8k7K1p9
$$ plain form
6764 -57 70 1 -58 53 -4 6 -25 10 56 -74 32 39 -24 4 -23 55 -38 -53 68 -41 -11 -8 9 25 -78 57 11
6791 11 -42 34 -6 35 -45 -8 62 -69 13 19 3 8 -39 73 -22 -51 58 -16 8 -36 13 37 -83 38 24 -19 -1 -24 68
6820 68 -44 -20 57 -36 6 -16 20 1 -63 55 -6 -34 11 -12 27 -44 7 42 -55 7 -5 1 -9 -29 59 -35 -22 37 -6 13
6850 13 -32 27 19 -52 35 7 -15 -4 -2 37 -39 -1 37 -33 -1 -9 22 -9 -37 32 -22 0 -1 0 2 -38 15 15 -26 11 2 4 -10 -11 35
6885 35 -21 4 19 -5 4 -7 22 12 -17 20 -4 -6 4 -1 23 -26 4 22 -3 -1 -1 5 -2 -8 22 -3 -11 -7 -1 -7 -5 7 11 -8 12 6 -4 -7
6923 -7 -4 10 -3 -16 11 -1 -2 -3 17 8 -7 9 -3 -8 6 7 8 1 -5 16 -15 3 13 -8 -4 4 3 10 -18 5 -7 -19 1 -8 2 0 8 5 -7
6962 -7 4 -4 -18 4 -7 9 -5 -8 4 -12 0 -10 -2 16 -11 19 -3 1 15 -5 13 1 7 12 -11 18 8 0 16 -4 22 -2 -7 21 -16
6997 -16 4 2 7 14 -22 13 -5 0 8 -8 24 2 1 3 -30 11 -4 2 -1 -17 19 -8 4 13 -18 13 -7 3 8 -9 14 -15 0 -3 -10 13 -6
$$ packed form
6764e7J27o9n9J11n7J0l1L5M6j30J06Po3K8k7P8r3j5J21j09L0LJ7J6j03J35m6
6791A1n3P6m0M1q0L7P0j31Q2Oj6Nm7J12r5k9J09p4K4m4M9K4j20J21j4m3J8k3R2
6820F8j12K4P7r3M2k2L6j9o4J18o1k8M5k3L9p1N1L5r7O2j2Oj0k0Q8r4J3N9m3J9
6850A3m5N9qp1Q7k8k2J1KL9p6L8L8p0L2qL1l1k8O9n4K2jJKm0N3%m1L7rKj4jM6
6885C5n6K5J5k4Rj1K9j0k9L7k4kJ0nK4m9L0J8k5K%OpoL0k5qMOoKJ2Mj9K0oj0l
6923gLJ4j3j3K7j2jjK0rj5J6j2nJ4JJpoK1l1J8J0k1MQjPk8K3j2j2K0rJ0kQlj2
6962gJ1qj4K2j1J6j4lJ2j6J2j0QJ8k7L0k2MJ4k0J8j2ONk3K9j0qJ6k0K6k4nK8l7
6997a6K0kNPl6L5j8NQj6L2k2jKl3M1j5Olj6L6k7J2Rl1L1k0J0Nj7K3k9J5lpK3j9
$$ plain form
7034 -6 1 4 -17 23 -6 4 3 -13 6 -14 -2 0 -26 11 -13 12 8 -13 22 -6 11 10 -17 6 -20 12 3 -4 8 -6 13 1 4 14 -14
7069 -14 7 -8 -6 2 -15 14 -10 5 14 -17 8 -5 -11 5 -24 1 -6 1 2 -7 13 -5 -4 10 0 7 -11 1 8 -23 13 -6 1 -2 -6 16 -3
7106 -3 8 22 -14 2 -7 10 1 -9 8 -11 1 -3 -2 0 -20 13 1 0 8 -4 13 -6 0 12 -20 6 5 1 -3 -17 22 -17 1 23 -6 -6 -29
7143 -29 16 -7 -26 22 -9 6 -7 -7 30 -19 9 19 -14 10 -10 15 -1 -15 29 -11 6 -6 7 20 -37 17 6 -24 11 -11 21
7174 21 -18 2 26 -31 -6 -1 -2 4 -41 28 -16 -24 18 -12 11 -21 9 36 -43 14 3 4 2 -28 45 -18 -25 28 -20 6 -24 14 13 -50
7208 -50 45 -14 -13 1 -12 42 -40 10 33 -44 12 -4 27 -1 -43 51 -11 -15 17 -4 24 -46 27 21 -47 28 -1 13 -13 -13 58 -48
7240 -48 -7 29 -23 0 -17 36 -5 -51 52 -7 8 -8 -11 43 -55 8 44 -37 9 -19 36 -14 -27 64 -29 -7 12 13 24 -46 35
7271 35 19 -47 37 4 21 -29 8 59 -55 12 19 0 10 -29 60 -18 -33 46 -11 2 -11 14 43 -66 27 16 -28 6 -4 36
$$ packed form
7034fPLk1M0k9J0jj6J9k0J2Kk6L7k4K5mk1L5k8J7jk7K3k6L2rpJ2j4J9j2LJ0k8
7069a4K1j5KQj7K9k4J5Rl1K5j3oJ6k9K5pPJrK0j8JJ4j0Pj8J2Pl1L6j9PlmK2j9
7106cJ1J4l6J6rJ7rj0J7j9J2mJKk0L3j2jQj2J7j9OJ2l2K6jmmj4L9l9J8K2k9%k3
7143b9M5k3j9M8l1J5j3%L7m9K8J0l3K4k0K5j6j4M4m0J7j2J3J3n7N4j1l0L5k2L2
7174B1l9K0K4n7K5NjOm5O9m4qM2l0K3l2L0K7p9N7j1Jkl0P3o3pN3m8K6l0L8jo3
7208e0R5n9JJ4j3N4q2N0K3p7N6j6L1k8m2R4o2mL2k1K8p0P3oo8P5k9J4k6%P1j06
7240d8M1L6n2K3j7N3m1m6J03n9J5j6lN4r8O3L6q1M6k8N5n0j3R1r3K2J9JJ1p0Q1
7271C5j6o6Q4l3J7n0L7N1j14O7Pj9J0l9Q9p8j5P9n7J3j3K5K9j09R3j1m4L4j0M0
$$ plain form
7301 36 -32 -28 47 -35 -8 8 19 16 -48 41 7 -34 31 -4 11 -44 9 49 -43 19 9 -1 -1 -26 59 -27 -28 37 -20 -10 -26 16
7333 16 23 -45 27 11 -18 1 -7 35 -38 -8 40 -35 -3 1 14 -6 -35 42 -8 -23 27 6 4 -21 15 20 -43 17 14 -1 -12 -8 43 -21
7367 -21 -11 30 -6 11 -15 15 11 -27 27 0 -4 -8 1 23 -33 -7 24 -30 2 8 15 -15 -26 32 -15 -11 19 -1 2 -19 19 13 -21 8 9
7402 9 -1 -5 3 23 -7 -10 16 -5 -10 0 16 6 -19 14 5 -7 5 -2 20 -12 1 13 -9 -6 -10 -12 -5 -15 15 -15 -7 7 -14 2 2 10 11 -11
7440 -11 8 0 -14 0 -1 2 -2 4 12 -10 2 0 -1 15 -8 25 -3 -5 1 -10 -2 -5 -1 11 -12 0 7 -5 5 -14 7 -10 -6 16 -6 7 0 -10
7478 -10 15 -21 6 9 -10 17 -2 16 6 1 7 -7 9 -1 0 27 1 15 7 -12 11 -15 8 5 -10 4 -14 -5 1 -10 12 -4 6 3 -17
7513 -17 18 -14 11 6 -19 14 -18 6 -4 -13 22 -11 7 -2 -12 24 -12 10 -1 -9 10 -18 9 -6 -12 18 -9 7 8 -7 19 -17 -2
7546 -2 -5 -14 14 -15 10 -6 -12 13 -21 9 -9 -11 11 -21 13 -8 -12 13 -24 12 -4 0 25 -17 21 -13 2 21 -12 11 -3 -4 19 -16
$$ packed form
7301C6o8MP5q2K7J6J1lo4Q9l4m1O5l5J5n5N3M0r2O2j0j0%k5Q5q6jO5n7J0j6M2
7333A6Po8P2j6k9J9qM2p3L0M8p5L2MJ3k0k9P7n0j5N0k1kk5L6No3O0lj5j1MN1o4
7367b1J0M1l6J7k6L0ml8N4k7mmRK2n6K6L1n4L2OPl0j1N8m7ML0k0Lk1L8ol4K9J
7402Ij0mQK0l0lK6k1nJ0J6j0k5L3rj2J2pK2l2J3J2k2LmkPj0L0l0QJ4k1J6%QJk2
7440a1J9qj4J4jLmOQk2J2kjJ6k3L3k8kOj1QlMJ2k3J2Pj2J0j9K1j7MK2k2J3pj0
7478a0K5l6K7Lj9K7j9J8j0nOj4J6j0JK7k6J4qj9K3k6K3lj5J4j8ROj1K2j6J0lk0
7513a7L5l2K5nk5L3l2K4j0rL5l3J8rj0L6l6K2j1qJ9k8K7j5oL0k7J6Jj5K6l6J5
7546blrK8k9K5j6oK5l4L0j8kK2l2L4k1mK5l7L6j6MK5m2L8l4J5J9l3K3j4jK3l5
$$ plain form
7580 -16 13 -3 -4 7 -11 3 -8 3 4 -25 7 -7 9 -1 -27 11 -17 -8 1 -12 14 -16 0 0 -18 12 -22 4 2 -12 6 -20 12
7613 12 7 -4 18 -20 18 -4 -1 24 -17 3 -9 -9 25 -27 14 -1 -7 5 -17 19 -16 -14 15 -31 8 -16 2 21 -27 15 -11 -20 2
7646 2 -16 25 -29 4 19 -28 26 -1 5 2 -27 30 -20 -10 13 -10 14 -19 22 7 -30 33 -18 -4 -11 -18 37 -36 5 20 -30 -7 -19
7679 -19 26 -9 -37 25 -19 7 -12 -12 34 -49 22 7 -31 21 -17 23 -28 -19 46 -42 11 9 -4 17 -31 45 2 -23 36 -19 22 -31
7711 -31 2 34 -58 26 2 -17 19 -39 42 -40 -31 41 -34 4 -23 7 7 -57 33 10 -21 13 -20 38 -46 2 39 -47 13 -13 25
7742 25 8 -50 75 -28 -27 30 -7 32 -47 16 35 -68 31 -9 -1 -14 -18 67 -45 -10 33 -34 15 -43 32 4 -65 57 -21
7771 -21 -6 1 -8 46 -68 19 39 -52 22 -21 43 -24 -45 76 -37 -3 6 -10 34 -53 47 14 -55 34 -12 23 -19 -16 73 -67
7801 -67 3 37 -30 12 -36 49 -2 -54 65 -24 -2 -18 8 50 -81 32 27 -40 16 -24 36 -31 -26 74 -42 -2 9 23 31
$$ packed form
7580a6K9j6jJ1j8J4j1J1Jk9L2j4J6j0k6L8k8RRj3K6l0J6%j8L0l4K6kj4J8k6L2
7613A2nj1K2l8L8k2LK5m1K0j2%L4n2M1j5oJ2k2L6l5KK9m6L9k4J8J9m8M2k6rK2
7646Bj8M1n4L3J5m7N4k7Olk9N7n0J0K3k3K4l3M1j5l7O3n1J4ppN5p3M1J5n0K3j2
7679a9M5l5k8O2m4K6j9%M6q3P1j5l8N2l8M0n1RO5q8N3kj3K1m8P6m3k5N9n5M1n3
7711c1L3L2r2Q4k4j9L6n8Q1q2RP2p5L8k7L0%o4R0k3l1L4l3N8q4M8L7q6O0k6L8
7742B5j7n8J25j03JN7l7L9p9O3J9j03R9m0Qj3mQ5j12L5M3o7M9n8P5k8o9J22p8
7771b1J5PrN4j14Q7K0r1P4m3O4o7k1J21j13L4Rj6M4q7J00l3o9Q9m6L5m2LQ9j40
7801f7P0L4o7M2m8Q5n1n2J19q9K2j6K6M2j31J13no7N6m0O0o7NJ00j16M0J1J4Q
$$ plain form
7830 31 -53 49 -1 -51 44 -29 27 -35 -15 62 -74 15 22 -16 2 -48 58 -26 -37 50 -35 9 -18 14 32 -74 41 11
7858 11 -14 10 -27 45 -35 -10 59 -52 5 -5 6 9 -51 57 -4 -24 34 -4 22 -40 9 45 -71 13 3 -8 -5 -22 55 -33
7888 -33 -21 50 -23 6 -25 20 8 -52 42 -6 -27 10 -18 34 -41 -5 39 -36 5 -13 14 2 -33 49 -17 -19 26 -6 17 -29 14
7919 14 15 -45 34 5 -4 -7 -26 43 -28 -8 24 -24 8 -5 5 9 -39 32 -17 -13 15 -11 19 -32 11 33 -25 15 2 17 6 -24 29
7952 29 -11 -10 22 -16 13 -16 22 25 -27 30 -3 -1 -2 -12 18 -13 6 27 -11 16 -10 12 12 -17 26 -10 -4 1 -9 2 -22 8 9 -17
7986 -17 19 -7 9 13 -9 20 -15 2 13 -16 12 -9 0 14 -20 22 0 3 6 -3 22 -14 4 13 -25 8 -5 -5 0 -19 31 -10 -2 9 -18
8021 -18 19 -14 -1 10 -26 -2 -4 -2 8 -13 24 -12 -6 17 -9 19 -10 18 11 -18 22 -12 8 19 -12 23 -3 4 17 -17 15 -4 14
8054 14 20 -16 32 -14 -2 6 -13 24 -8 4 -6 -28 19 -17 -4 6 -23 19 -16 8 11 -25 24 -21 12 -8 -18 18 -19 7 6 -14
$$ packed form
7830C1q4J02n0n0R5p3N6o2K0P7j36Q9Pl8J8n0J06q4j1Q7q5M4k7L2J8j06J15l0
7858A1k5K4l7P2q0K5O9j11N7j0J1Lo0J08o1k0N8l8K6o2M9L6j16Q4j0j1Lj7P7q8
7888c3J2P1p3K9l1M5j2o0R4m8k1L7k8N2p5L6M4p5M1j8K7j2l5Q2o6kM5l2K3m6M3
7919A4Jo0P9k9rlj9O9p1K0L2m8L2j3J0Mm8P1m9MK8k6L0n1M3K2n8M0j3J5j1l0N3
7952B9m0JL2l8K9k9L8Ln2N7l3Kjj0L0l1J9K1l8K7k6K2%k9M3l6ONj0J1k4L0Jk6
7986a7L6k6J6Mk2K9l5J7J1k9K8k1RJ4l4M2k2LLrK5l6J8Rl8L3j3%Nj9N0m1QJ1k7
8021a8L7l3J3J1l6K4kKJ0k1L7l6OK3k6K8k9K8pk9M0l4K0J1l1L5k6PJ3l4L2j9J8
8054A4Ol6M8m6J2Qj9L7l2J2j0k2M7l6J3J0k9M2l5K4Ll6M9m5L3k0j0L6l7K6jk0
$$ plain form
8086 -14 10 -22 11 4 -22 30 -10 21 1 -15 14 -11 24 -5 -12 26 -12 16 -3 -17 9 -28 20 -3 -20 6 -22 14 -22 -11 20
8117 20 -15 13 -4 -5 10 -19 25 0 -14 13 -16 23 -14 -7 24 -31 34 -13 8 8 -25 29 -26 -4 20 -18 20 -9 11 8 -33 41
8149 41 -19 0 -5 -28 11 -47 11 8 -23 24 -19 24 -4 -32 50 -26 7 5 -12 28 -49 27 -1 -31 40 -19 38 -13 -24 49 -43 14
8181 14 6 -20 14 -51 68 -12 -47 44 -23 18
$$ packed form
8086a4K4l2L3pk6N2m0L1k0j6K9k5L5k9pL8l8K8j9j4K6l7M8k3j7K6k8L6l6J1L1
8117B0l5K8j7jJ5k9M4k5j4K7k9L9l7PL1n5O5m7K1%l3N4n5K2K4l8L8k9K0lm1P4
8149D1o0J9nk3L9n8N8ll1M7m3M3k8k8Q2p6L3kj7M0p7P6k8l0P1n9N7n1j1P3r2N7
8181A4qk6L4o5J19q0l5R1o7M1
8191A8
$$ Imaginary data points
##PAGE= N=2
##DATA TABLE= (X++(I..I)), XYDATA
$$ plain form
0 0 0 0 0 0 0 0 0 0 0 0 0 0 0 0 0 0 0 0 0 0 0 -1 4 -6 8 -8 12 -12 16 -20 24 -28 36 -42 46 -54 64 -72 84 -94 109
41 109 -121 138 -156 174 -194 216 -238 266 -294 325 -357 392 -429 466 -508 550 -590 633 -672
60 -672 702 -719 708 -645 478 -94 -776 2956 -9862 59651 266860 -188236 35109 -14411
74 -14411 10134 84750 -239585 239137 -6829 -163681 112539 -34112 97095 -144849 21041
85 21041 165728 -209552 72190 24045 17629 -29710 -106483 227831 -138208 -53536 142170
96 142170 -91079 63539 -122086 98774 72365 -222935 173786 -19890 -47650 24854 -51976
107 -51976 164596 -172312 7787 151885 -146153 49894 -33875 66949 -13922 -135594
117 -135594 193899 -78211 -46758 59265 -27641 81545 -151421 89519 77602 -167739
$$ packed form
0@%%%%%%%%%%%%%%%%%%%%%jNj0J4j6K0k4K8l6M4n2O4p8Q8j00J18j36J56j78K03
41A09k30K59k94L30l68M10m54N04n60O19o82P49q21Q95r74J058j140J223j305
60f72J374j421J427j353J123n72o82L732j2818O9513K07209m55096K23345m9520
74a4411K4545P4616l24335M78722k45966j56852K76220j46651J31207k41944J65890
85B1041J44687l75280K81742m8145o416m7339p6773L34314l66039Q4672J95706
96A42170k33249J54618j85625K20860k6409k95300L96721j93676k7760P2504p6830
107e1976K16572l36908J80099J44098k98038J96047q3769J00824q0871j21672
117a35594L29493k72110L1453J06023q6906J09186k32966K40940j1917k45341
$$ plain form
127 -167739 96696 -20181 28715 -33485 -60086 169979 -138163 -2261 92379 -64130 42342
138 42342 -89789 92908 10560 -130685 128264 -37310 -11149 -7942 -7930 100170 -134781
149 -134781 49196 63492 -86329 41694 -38656 67803 -40328 -65820 127068 -76722
159 -76722 1256 20656 -9612 48606 -104128 81463 19914 -91352 66111 -27723 29715
170 29715 -35321 -16313 92258 -95011 26144 33527 -28421 23397 -57753 71056 -21282
181 -21282 -55855 74667 -40670 12889 -17074 7935 49893 -84475 51254 13806 -40132
192 -40132 29252 -31366 43638 -34430 -20497 63936 -51196 14708 1564 1666 20962 -51376
204 -51376 50130 -8314 -32955 32030 -20087 20522 -26582 4095 36182 -47165 25761 2768
$$ packed form
127a67739K64435j16877M8896o2200k6601K30065l08142J35902R4640j56509J06472
138D2342j32131J82697q2348j41245K58949j65574K6161L207J2J08100k34951
149a34781J83977J4296j49821J28023q0350J06459j08131k5492J92888k03790
159g6722P7978J9400l0268N8218j52734J85591o1549j11266J57463r3834N7438
170B9715o5036J9008J08571j87269J21155P383o1948N1818q1150J28809r2338
181b1282l4573J30522j15337N3559k9963K5009M1958j34368J35729l7448n3938
192d0132O9384o0618P5004p8068J3933Q4433j15132O5904j3144J02J9296p2338
204e1376J01506n8444k4641O4985n2117M0609m7104L0677L2087q3347P2926k2993
$$ plain form
216 2768 -6633 10217 -27347 36646 -21053 -15050 30086 -23083 12190 -12474 8373 16892 -32561
229 -32561 27390 -4128 -10348 10795 -13744 18592 -19001 -1364 18146 -19626 12666 -4915
241 -4915 4045 5663 -16090 20169 -9167 -5507 8027 -10092 8929 -9933 3910 7265 -12462
254 -12462 11170 -2571 1034 3081 -7246 8079 -7199 -820 4099 -6076 3706 -3373 2817
267 2817 2790 -3131 5551 -2550 -30 1188 -2650 1479 -3105 -586 -110 -1036 2689 81 538 1285 380
284 380 473 520 -558 -1410 -1701 -1451 1813 -1411 -448 2297 -1251 2459 421 1087 1009 -4247 2629 -1525
302 -1525 -2098 1320 -2889 2620 -1824 1079 4191 -3287 3071 -736 -222 893 -4142 3151 -3337 -1424
318 -1424 2684 -2437 3497 -1472 1614 2807 -3537 3656 -1754 -1287 331 -3460 2535 -2613 33
$$ packed form
216B768r401J6850l7564O3993n7699O003M5136n3169L5273k4664K0847Q519m9453
229c2561N9951l1518o220K1143k4539L2336l7593J7637J9510l7772L2292j7581
241d915Q960J618k1753L6259k9336L660J3534j8119J9021j8862J3843L355j9727
254a2462K3632j3741L605K047j0327J5325j5278O379M919j0175R782p079O190
267B817k7n921Q682q101K520J218l838M129m584K519M76r26L725k608M57P47r05
284C80R3M7j078q52k91K50L264l224R63K745l548L710k038O66p8n256O876m154
302a525n73L418m209N509m444K903L112p478O358l807N14J115n035P293o488J913
318a424M108n121N934m969L086J193o344P193n410M67J618l791N995n148K646
$$ plain form
333 33 2687 -1912 2753 -114 1122 1208 -2435 1450 -1604 -1530 226 -1135 404 -621 650 1948 142
350 142 463 1301 -645 -497 -188 -1277 285 -2620 454 1812 -2560 3201 -226 925 1732 -3205 4743
367 4743 -3922 -1525 3170 -5442 3660 -3848 1780 4515 -7448 8391 -2218 -1054 3722 -6301
381 -6301 8067 -8867 -276 7366 -10756 7848 -4629 3344 4295 -11326 15822 -8062 -2346
394 -2346 7046 -9725 10994 -14304 5468 9354 -18905 16144 -6213 2894 3395 -12834 22837
407 22837 -18905 202 13002 -16314 13368 -16468 12540 5992 -24816 28688 -12274 -312
419 -312 4755 -10952 24702 -30929 10470 15664 -27194 19583 -14194 15671 -2835 -23109 41287
432 41287 -26627 19 11742 -12661 20408 -36309 26189 9375 -38156 34093 -14376 10421
$$ packed form
333C3K654m599M665k867J236Q6l643L885l054P4J756j361J539j025J271J298j806
350A42L21Q38j946J48L09j089J562k905L074J358m372N761l427J151Q07m937P948
367D743q665K397M695q612R102p508N628K735j1963J5839j0609J164M776j0023
381f301J4368j6934Q591P642j8122J8604j2477P973R51j5621K7148k3884N716
394b346R392j6771K0719k5298J9772L886k8259L5049k2357R107N01j6229L5671
407B2837m1742J9107J2800k9316K9682k9836K9008o548l0808N3504m0962J1962
419c12N067j5707L5654n5631M1399N194m2858M6777l3777K9865j8506k0274O4396
432D1287o7914K6646J1723k4403L3069n6717O2498j6814m7531P2249m8469K4797
$$ plain form
444 10421 -7615 -13018 44564 -46118 11216 19072 -23277 17772 -30977 37341 -7905 -37747
456 -37747 53420 -27128 4914 -3268 -3037 35657 -61283 35794 14957 -40326 28092 -22708 35839
469 35839 -25769 -22349 66152 -52875 9486 10050 -5186 19519 -58666 60158 -6201 -49248
481 -49248 50578 -22720 21348 -30699 3256 57986 -78524 32882 17096 -23309 13472 -39464
493 -39464 67051 -36447 -37209 73247 -41941 10345 -15930 17733 31096 -84579 66411
504 66411 2986 -43312 27864 -22292 52441 -57133 -4362 76511 -74811 22156 3068 9944
516 9944 5638 -67555 91191 -32047 -45803 57131 -25463 27717 -53962 31210 51921 -98333
528 -98333 56131 6079 -14446 -456 -35354 88553 -71191 -18541 78060 -52775 16473
$$ packed form
444A0421j8036n403N7582r0682N7334P856m2349M1049m8749O8318m5246k9842
456c7747R1167q0548L2042q182K31L8694r6940R7077k0837n5283O8418n0800N8547
469C5839o1608L420Q8501j19027O2361N64j5236K4705p8185J18824o6359m3047
481d9248R9826p3298M4068n2047L3955N4730j36510J11406j5786m0405L6781n2936
493c9464J06515j03498p62J10456j15188N2286k6275L3663J3363j15675J50990
504F6411o3425m6298P1176n0156P4733j09574N2771Q0873j51322R6967j9088O876
516I944m306p3193J58746j23238j3756J02934q2594N3180q1679Q5172K0711j50254
528i8333J54464n0052k0525J3990l4898J23907j59744N2650R6601j30835O9248
$$ plain form
539 16473 -29018 43810 11880 -91973 92732 -17511 -35943 21214 -13362 57054 -83721
550 -83721 24639 67191 -83268 32327 -5346 26910 -17755 -56859 106010 -58882 -28043
561 -28043 50734 -21323 26219 -66676 57732 29708 -95905 68762 -6579 -3271 -16706 -18276
573 -18276 87046 -91350 7927 62632 -49865 17017 -34431 62888 -15817 -75557 100013
584 100013 -37705 -18594 8987 -844 49115 -93924 51471 42759 -76178 37250 -11576
595 -11576 36902 -37968 -33344 98221 -73587 -4970 34551 -11960 17168 -64457 73185 697
607 697 -73584 66949 -17472 7786 -28334 1113 67871 -90662 28691 37746 -37396 12863
619 12863 -29464 63347 -34609 -44721 81997 -43266 -2427 -3280 11659 29318 -79480 61237
$$ packed form
539A6473m5491P2828l1930j03853J84705j10243j8432N7157l4576P0416j40775
550h3721J08360M2552j50459J15595l7673L2256m4665l9104J62869j64892L0839
561b8043P8777p2057M7542r2895J24408k8024j25613J64667p5341L308j3435j570
573a8276J05322j78396R9277N4705j12497O6882n1448R7319p8705n9740J75570
584A00013j37718J9111K7581r831M9959j43039J45395q712j18937J13428m8826
595a1576M8478p4870M624J31565j71808O8617L9521m6511K9128q1625J37642p2488
607F97p4281J40533q4421K5258l6120K9447O6758j58533J19353R055p5142N0259
619A2863m2327R2811r7956j0112J26718j25263M0839q53J4939J7659j08798J40717
$$ plain form
631 61237 12772 -51969 31672 -13449 37204 -46387 -7578 71215 -69447 13518 15617 -2908
643 -2908 6515 -48493 68885 -20401 -41944 51083 -20596 13524 -31572 15935 39513 -71719
655 -71719 37779 12054 -20193 7093 -20672 51448 -39756 -15688 53074 -37337 7995 -9826
667 -9826 15863 11136 -51773 50528 -6063 -25032 19199 -9703 27030 -38515 8492 36829
679 36829 -47015 18253 1052 3766 -1380 -26644 47022 -24642 -14442 28195 -15165 11843
691 11843 -24131 18198 14550 -41137 29756 -2866 -5816 1180 -9489 30970 -30604 2372 23659
704 23659 -22836 10352 -10832 13520 -23 -24798 30770 -11855 -5959 7914 -5355 14975
716 14975 -22549 10941 11742 -22141 12858 -4446 4742 -3468 -9338 21272 -15440 88 9066
$$ packed form
631F1237m8465o4741Q3641m5121N0653q3591L8809P8793j40662Q2965K099j8525
643b908R423n5008J17378q9286k1543R3027p1679L4120m5096M7507K3578j11232
655g1719J09498k5725l2247K7286k7765P2120r1204K4068O8762r0411M5332j7821
667i826K5689m727o2909J02301n6591j8969M4231k8902L6733o5545M7007K8337
679C6829q3844O5268j7201K714n146k5264P3666p1664J0200M2637m3360K7008
691A1843l5974M2329l648n5687P0893l2622k950O996j0669M0459o1574L2976K1287
704B3659m6495L3188k1184K4352j3543k4775N5568m2625N896J3873j3269K0330
716A4975l7524L3490Q01l3883L4999j7304R188q210n870L0610l6712J5528Q978
$$ plain form
729 9066 -6696 6475 -11870 10684 1344 -14413 13478 -5087 504 -776 -2064 10697 -12566
742 -12566 4987 5050 -7450 4747 -5072 5527 -2452 -5620 9259 -5796 1028 1100 -832 3941
756 3941 -6259 4707 370 -4404 3557 -2559 1644 -1379 -905 3354 -2966 1640 592 -717 1089
771 1089 -1336 930 -500 -827 395 -392 -261 537 283 -656 1483 -460 39 597 -1073 1315 -2301
788 -2301 873 978 -2897 2632 -1332 853 703 -1998 3971 -3285 589 1744 -3039 2634 -3322 2154
804 2154 550 -3851 5190 -3064 1165 995 -2445 4524 -5172 2389 1238 -4440 4382 -3989 2748
819 2748 110 -3441 6198 -4978 2261 1143 -3239 4516 -5506 3284 158 -4085 5450 -4695
833 -4695 2897 88 -2552 5415 -5458 3242 -6 -3228 4550 -5173 3324 -715 -2679 5128 -4903
$$ packed form
729I066j5762J3171j8345K2554r340j5757K7891j8565N591j280j288J2761k3263
742a2566J7553O3j2500J2197r819J0599p979l168J4879j5055O824P2j932M773
756C941j0200J0966m337m774P961o116M203l023M74M259o320M606j048j309J806
771A089k425K266j430l27J222p87J31P98k54r39K139j943M99N58j670K388l616
788b301L174J05l875N529l964K185j50k701N969p256L874J155m783N673n956N476
804B154j604m401R041q254M229j70l440O969r696P561j151n678Q822q371O737
819B748k638l551R639j1176P239j118m382P755j0022Q790l126m243R535j0145
833d695P592k809k640P967j0873Q700l248l222P778r723Q497m039j964P807j0031
$$ plain form
848 -4903 3469 -184 -2314 4363 -4735 3215 -951 -2463 4106 -4563 2819 -339 -1686 3583 -3659
863 -3659 3069 -581 -1762 3065 -3268 1944 -962 -1102 2485 -2966 2083 -48 -897 1828 -1675 1622
879 1622 -707 -878 1418 -1655 558 -95 -563 926 -546 282 698 -364 162 253 -619 627 -843
896 -843 -481 1254 -1659 1067 -236 -305 1982 -2791 2610 -45 -2380 2732 -2526 2149 -1812 -1316
912 -1316 4636 -5329 2933 507 -1662 3272 -5459 6102 -1941 -4346 6519 -5336 3408 -3016
926 -3016 -13 6770 -10770 7469 446 -4418 4985 -6676 9130 -6489 -3760 11608 -10677
939 -10677 4786 -2074 1032 5703 -14158 14352 -2774 -7992 9024 -6910 8964 -10734 1219
952 1219 13684 -18707 9799 80 -1262 3545 -13173 20248 -10805 -7940 16143 -11203 7051
$$ packed form
848d903Q372l653k130O677r098P950m166j512O569q669P382l158j347N269p242
863c659O728l650j181M827o333N212k906j40L587n451N049k131q49K725l503L297
879A622k329j71K296l073K213o53m68J489j472Q28M16j062N26R1q72J246j470
896h43L62J735k913K726j303o9K287m773N401k655k335N112n258M675l961M96
912a316N952r965Q262k426k169M934q731J1561q043k405J0865j1855Q744o424
926c016L003O783j7540J8239p023m864R403j1661J5806j5619K729J5368k2285
939a0677J5463o860L106M671j9861K8510j7126n218J7016j5934J5874j9698J1953
952A219J2465l2391K8506r719j342M807j6718L3421l1053K865K4083k7346J8254
$$ plain form
965 7051 -10607 7270 10201 -25032 19844 -1815 -6783 5143 -9166 20910 -20770 -498 20984
978 20984 -21190 9389 -6515 9263 2300 -24781 31620 -11543 -10349 12830 -7939 15182
990 15182 -25423 12617 17648 -32425 19103 -2854 3594 -3581 -15399 36265 -27248 -4915 22539
1003 22539 -15037 9053 -20092 22109 4996 -36078 34625 -7444 -6386 577 -4861 28661
1015 28661 -38099 10407 24217 -28510 11552 -9668 20872 -9743 -26615 46045 -23656 -7758
1027 -7758 12077 -3587 15911 -38551 28912 12971 -39734 26550 -5950 9575 -15214 -9338
1039 -9338 44993 -42894 3918 21963 -14169 7109 -26079 38266 -8540 -36991 44909 -15386
1051 -15386 -1816 -7369 4551 29253 -52187 25957 19195 -30740 12372 -10875 30167 -24636
$$ packed form
965G051j7658J7877K931l5233M4876k1659m968J1926j4309L0076m1680K0272K1482
978B0984m2174L0579j5904J5778o963k7081N6401m3163J194K3179k0769K3121
990A5182m0605L8040N031n0073N1528k1957O448p175j1818N1664o3513K2333K7454
1003B2539l7576K4090k9145M2201j7113m1074P0703m2069J058O963n438L3522
1015B8661o6760M8506J3810n2727M0062k1220L0540l0615j6872P2660o9701J5898
1027g758J9835j5664J9498n4462O7463j5941n2705O6284l2500J5525k4789N876
1039i338N4331q7887M6812J8045l6132K1278l3188O4345m6806k8451Q1900o0295
1051a5386J3570n553J1920K4702q1440P8144o762m9935M3112k3247M1042n4803
$$ plain form
1063 -24636 -19212 52033 -34159 -2021 8290 3940 9680 -43104 43178 1022 -37351 28740
1075 28740 -7333 13610 -26149 2501 42382 -50796 13853 16314 -10037 1729 -24406 45986
1087 45986 -21898 -27838 44250 -19155 2160 -13801 15374 20305 -53429 36800 7677 -24486
1099 -24486 9527 -9144 33352 -36298 -5262 46166 -38733 5884 2241 10520 835 -38193
1111 -38193 49235 -12437 -26805 25426 -7252 14105 -31532 15181 29788 -48367 21556 7052
1123 7052 -3838 -4145 -17454 44083 -30634 -13568 35350 -18943 4641 -15652 20879 8580
1135 8580 -42699 36897 -2068 -14973 4684 -4322 27155 -36542 6636 30576 -32155 9501
1147 9501 -2756 13773 -6683 -25611 42533 -19662 -12863 17195 -5585 11415 -28372 20774
$$ packed form
1063b4636N424P1245q6192L2138J0311m350N740n2784Q6282m2156l8373O6091
1075B8740l6073K0943l9759K8650L9881r3178O4649K461k6351J1766k6135P0392
1087D5986o7884n940P2088o3405K1315j5961K9175M931p3734R0229k9123l2163
1099b4486L4013j8671M2496o9650L1036N1428q4899M4617l643Q279r685l9028
1111c8193Q7428o1672j4368N2231l2678K1357m5637M6713J4607p8155O9923j4504
1123G052j0890l07j3309O1537p4717J7066M8918n4293K3584k0293L6531j2299
1135H580n1279P9596l8965j2905J9657r006L1477o3697M3178K3940o2731M1656
1147I501j2257J6529k0456j8928O8144o2195O799L0058k2780J7000l9787M9146
$$ plain form
1159 20774 14366 -35859 22079 -823 1262 -7748 -8097 32912 -30480 -117 20950 -14368 5536
1172 5536 -14116 20909 -1823 -26378 29622 -8612 -5179 534 -765 17578 -28259 11945 14453
1185 14453 -20614 8856 -4403 11887 -8929 -12026 26989 -17334 -2420 7767 -2521 6547
1197 6547 -18641 17256 2929 -19017 15224 -3995 3283 -7026 -1598 17659 -20387 5325
1209 5325 8151 -7597 3815 -8583 14041 -5576 -10780 16471 -8222 656 -1679 1209 7754
1222 7754 -15648 10161 3107 -8901 5551 -3793 7230 -6493 -2994 11670 -9968 1964 1562
1235 1562 -586 2592 -8022 8696 -1370 -5883 6358 -2938 2316 -3436 508 5454 -7664 3563
1249 3563 1340 -2313 1558 -2730 4578 -2609 -2036 4512 -3056 847 -602 440 1366 -3517 2901
$$ packed form
1159B0774o408n0225N7938k2902K085r010l49M1009o3392L0363K1067l5318J9904
1172E536j9652L5025k2732k4555N6000l8234L433N713j299J8343m5837M0204K508
1185A4453l5067K9470j3259J6290k0816l097L9015m4323J4914J0187j0288R068
1197F547k5188L5897j4327k1946L4241j9219P278j0309N428J9257l8046K5712
1209E325K826j5748J1412j2398K2624j9617n204K7251k4693Q878k335K888O545
1222G754k3402K5809p054j2008J4452r344J1023j3723L499J4664k1638J1932m02
1235A562k148L178j0614J6718j0066m513J2241r296N254n752L944M946j3118J1227
1249C563k223l653L871m288P308p187N73O548p568L903j449J042R26m883O418
$$ plain form
1264 2901 -125 -1577 1401 -837 1157 -1155 11 1350 -1555 548 156 -367 286 -261 201 111 -233
1281 -233 228 140 -537 830 -547 -445 1118 -1094 686 -438 -16 1163 -2201 2029 -256 -1289 1657
1298 1657 -1666 1863 -1439 -529 2733 -3315 1945 -229 -627 1747 -3206 3491 -1395 -1624 3207 -3074
1314 -3074 2288 -1665 -112 2933 -4595 3574 -894 -1284 2567 -3427 3877 -2491 -867 3742 -4389
1329 -4389 3242 -1684 -184 2595 -4628 4663 -2102 -1055 3116 -3986 3989 -2774 -11 3118 -4866
1344 -4866 4303 -2224 -193 2573 -4307 4584 -2911 -61 2868 -4395 4216 -2768 281 2369 -4172
1359 -4172 4490 -2983 314 2410 -3993 4119 -2846 613 1774 -3793 4362 -2989 422 1905 -3247
1374 -3247 3706 -2994 1157 1539 -3600 3758 -2370 638 874 -2512 3608 -3076 862 1558 -2603 2521
$$ packed form
1264B901l026j452K978k238J994k312J166J339k905K103l92n23O53n47M62r0l44
1281b33M61q8o77J367j377J02J563k212J780j124M22J179l364M230k285j033K946
1298A657l323L529l302R10L262o048N260k174l98K374m953O697m886k29M831o281
1314c074N362l953J553L045p528Q169m468l90L851n994P304o368J624M609q131
1329d389P631m926J500K779p223R291o765J047M171p102P975o763K763L129p984
1344d866R169o527K031K766o880Q891p495K850K929p263Q611o984L049K088o541
1359d172Q662p473L297K096o403Q112o965L459J161n567Q155p351L411J483n152
1374c247O953o700M151L82n139P358o128L008K36l386O120o684L938O96m161N124
$$ plain form
1390 2521 -2114 1320 392 -2394 3052 -2005 346 607 -1154 1966 -2256 1164 697 -1718 1528 -974
1406 -974 698 -348 -753 1609 -1339 306 297 -336 440 -679 673 -104 -363 235 24 29 -289 333 -344
1425 -344 363 -217 -171 703 -892 861 -744 132 1062 -1956 1607 -618 -223 757 -1731 2726 -2196
1442 -2196 -153 2292 -2589 2034 -1913 1335 1111 -4147 4570 -1931 -760 1476 -2069 4091 -4889
1457 -4889 1687 3470 -5539 3686 -1919 1871 -241 -4600 7966 -5235 -797 3794 -3122 3786
1471 3786 -6275 4837 2540 -8794 7490 -2331 324 -703 -2840 9365 -9904 1770 6023
1484 6023 -6267 3743 -5316 7277 -1493 -9243 12816 -6060 -816 970 -1144 7890 -13740
1497 -13740 7982 5157 -11200 7017 -3749 6501 -5651 -5623 16336 -13096 818 5001 -2518
$$ packed form
1390B521m635L434r28k786N446n057K351K61j761L120m222L420m67k415L246k502
1406i74J672j046m05K362k948J645ro33P76j119J352p77k59N98k11Nl18O22o77
1425c44P07n80M6Q74j595J753j605Q76R30l018L563k225L95R80k488M457m922
1442b196K043K445m881M623l947L248k24n258Q717o501J171K236l545O160q980
1457d889O576J783r009R225n605L790k112m359J2566j3201M438M591o916O908
1471C786j0061J1112k297j1334J6284r821K655j027k137J2205j9269J1674M253
1484F023j2290J0010r059J2593q770p750K2059j8876N244J786k114R034k1630
1497a3740K1722k825j6357J8217j0766J0250j2152K8K1959k9432J3914M183p519
$$ plain form
1510 -2518 4179 -12710 14153 -768 -13730 13691 -4782 2516 -5977 525 14316 -20019 7611
1523 7611 7271 -8560 3627 -7523 15083 -8563 -10595 20197 -10988 -255 -849 3339 7430
1536 7430 -21173 16715 3166 -14318 8562 -3753 10677 -13673 -1866 21190 -20552 3885
1548 3885 4658 69 1313 -16039 23095 -7067 -14602 17194 -6007 4057 -11942 7403 14029
1561 14029 -26897 14415 4949 -7525 999 -7187 21496 -17997 -6389 23103 -15260 1817
1573 1817 -3836 9417 3095 -24261 24730 -2297 -13583 8269 -2208 12133 -20685 5550
1585 5550 19875 -24497 7431 2892 3444 -3819 -14301 27872 -14143 -10989 17165 -5995 3991
1598 3991 -15103 13783 9406 -27595 18273 1812 -5286 -2379 -3713 21865 -23380 46 19903
$$ packed form
1510b518O697j6889K6863j4921j2962K7421j8473P298q493O502J3791l4335K7630
1523G611l40j5831J2187j1150K2606k3646k032L0792l1185J0733n94M188M091
1536G430k8603L7888j3549j7484K2880j2315J4430k4350J1807K3056m1742K4437
1548C885P73m589J244j7352L9134l0162p535L1796k3201J0064j5999J9345O626
1561A4029m0926M1312r466j2474Q524q186K8683l9493J1608K9492l8363J7077
1573A817n653J3253o322k7356M8991k7027j1286K1852j0477J4341l2818K6235
1585E550J4325m4372L1928m539N52p263j0482M2173m2015L154K8154k3160R986
1598C991j9094K8886m377l7001M5868j6461p098K907j334K5578m5245K3426J9857
$$ plain form
1611 19903 -15284 2861 -5828 14135 -3219 -20965 27292 -8114 -8964 5782 -48 10896 -23468
1624 -23468 12503 13511 -23056 9834 242 5970 -8468 -8645 26241 -18716 -4211 13063 -4605
1637 -4605 2852 -14878 17678 1949 -22182 18720 -2010 -2225 -4669 207 17500 -23157 5424
1650 5424 13496 -12484 2722 -5290 14130 -7311 -13633 22693 -9907 -4134 2604 2117 6963 -19828
1664 -19828 14531 5868 -16512 8941 -1538 6458 -9812 -2823 19068 -17415 1294 7250 -2579
1677 -2579 1291 -11114 16215 -3743 -13067 14463 -4142 580 -5500 3244 10291 -17912 8356
1690 8356 5640 -7616 2222 -4066 11124 -8327 -5893 14705 -8819 -257 317 2595 3045 -12539
1704 -12539 11435 604 -8688 5747 -1674 4686 -7456 589 10034 -11217 2992 2575 -820
$$ packed form
1611A9903l5187J8145q689J9963j7354j7746M8257l5406q50J4746n830J0944l4364
1624b3468L5971J008l6567L2890r592N728j4438j77L4886m4957J4505J7274j7668
1637d605P457j7730L2556j5729k4131M0902k0730k15k444M876J7293m0657K8581
1650E424Q072k5980J5206q012J9420k1441o322L6326l2600N773O738m87M846k6791
1664a9828L4359q663k2380K5453j0479P996j6270O989K1891l6483J8709N956r829
1677b579L870j2405K7329j9958r324K7530j8605M722o080Q744P047k8203K6268
1690H356k716j3256R838o288J5190j9451K434K0598k3524Q562N74K278M50j5584
1704a2539K3974j0831r292J4435p421O360j2142Q045R445k1251J4209m17l395
$$ plain form
1717 -820 254 -6022 10104 -4399 -5319 7843 -3418 1265 -3700 3022 3999 -9397 6131 856
1731 856 -3026 1123 -2031 5816 -5600 -817 6203 -5064 1294 -722 1809 594 -5223 5885
1745 5885 -1402 -2669 2461 -1129 2174 -3415 1076 3140 -4345 1901 315 -145 69 -1896 3362
1760 3362 -1841 -1189 2364 -1334 552 -901 711 932 -2255 1603 69 -882 582 -477 807 -740
1776 -740 -239 1071 -893 148 310 -315 295 -306 128 238 -525 444 -136 -371 770 -708 197 395
1794 395 -604 682 -804 629 298 -1383 1515 -731 -80 415 -861 1628 -1740 508 1233 -1910
1810 -1910 1480 -1003 697 251 -1934 2750 -1784 -61 1183 -1518 1946 -2222 1191 1079 -2810
1825 -2810 2664 -1469 450 399 -1857 3166 -2767 646 1531 -2341 2359 -2223 1466 541 -2810 3479
$$ packed form
1717h20J074o276J6126j4503r20J3162j1261M683m965O722R77j3396J5528n275
1731H56l882M149l154P847j1416M783P020j1267O358k016K531j215n817J1108
1745E885p287j267N130l590L303n589M491K064p485O246j586m60K14j965N258
1760C362n203O52L553l698J886j453J612K21l187L858j534r51J464j059J284j547
1776g40N01J310j964J041J62o25O10o01M34J10p63R69n80k35J141j478R05J98
1794C95r99J286j486J433l31j681K898k246O51M95j276K489l368K248P25l143
1810a910L390k483J700m46k185M684m534J723J244k701L464m168L413j12l889
1825b810N474m133J919n1k256N023n933L413Q85l872M700m582L689r25l351O289
$$ plain form
1841 3479 -2332 579 746 -1940 3031 -3104 1478 1045 -2725 3025 -2455 1414 282 -2323 3514
1856 3514 -3071 1283 713 -2176 3020 -2986 1824 314 -2352 3295 -2964 1581 206 -1989 3094
1871 3094 -3096 1882 86 -2003 3141 -2993 1775 -34 -1663 2845 -3136 2103 -96 -1847 2797
1886 2797 -2653 1888 -539 -1242 2825 -3100 1840 -84 -1238 2018 -2586 2321 -771 -1328 2572
1901 2572 -2306 1474 -673 -378 1855 -2794 2094 -342 -1057 1472 -1649 1827 -1260 -388 1951 -2097
1917 -2097 1191 -437 15 689 -1798 1980 -824 -616 1106 -901 983 -1074 480 794 -1468 1058
1933 1058 -364 125 -37 -534 1124 -968 197 345 -315 316 -565 715 -341 -236 453 -446 383 -445
1951 -445 326 -54 -230 552 -757 706 -290 -169 425 -738 1060 -1042 183 847 -1249 991 -786
$$ packed form
1841C479n811K911J67k686M971o135M582m33l770N750n480L869j132k605N837
1856C514o585M354n70k889N196o006M810j510k666N647o259M545j375k195N083
1871C094o190M978j796k089N144o134M768j809j629M508n981N239k199j751M644
1886B797n450M541k427p03M067n925M940j924j154L256m604M907l092n57L900
1901B572m878L780k147K95K233m649M888k436p15K529l121L476l087Q72K339m048
1917b097L288j628M52O74k487L778k804K08J722k007J884k057J554L14k262K526
1933A058j422M89j62m97J658k092J165J48o60O31q81J280j056J05O89q99Q29q28
1951d45P71l80j76P82j309J463r96J21N94j163J798k102J225O64k096K240j777
$$ plain form
1968 -786 793 32 -1532 2352 -1424 -129 719 -700 1382 -2391 1778 718 -2604 2269 -1046 920
1984 920 -836 -1084 3630 -3665 735 1647 -1614 1248 -2641 3459 -746 -3470 4600 -2111 218 -688
2000 -688 140 3269 -5803 3244 1632 -3358 1873 -1894 4124 -3335 -2185 6697 -4993 541 537 644
2016 644 1518 -6401 6820 -637 -4962 4387 -1603 2710 -4721 1067 6418 -8627 3146 1862 -1194
2031 -1194 7 -4236 8723 -4997 -4151 8019 -3995 792 -3013 3516 3297 -10440 7863 938
2045 938 -4643 1684 -1480 6946 -8298 -266 9543 -8447 1345 248 3097 -760 -8478 12006
2059 12006 -3654 -5868 5709 -1244 3412 -8660 4993 6930 -12478 5695 1696 -269 -2557
2072 -2557 -3635 12445 -9784 -2675 9343 -4687 715 -5129 8064 577 -12382 11864 -1275
$$ packed form
1968g86J579p61j564L884l776J295Q48j419K082l773M169j060l322M873l315J966
1984I20j756k48M714p295M400R12l261K862l889O100m205k724Q070o711K329r06
2000f88Q28L129r072R047j612m990N231l767O018p459J150Q882j1690N534mJ07
2016F44Q74p919J3221p457m325R349n990M313p431N788N351j5045J1773j284l056
2031a194J201m243J2959j3720Q46J2170j2014M787l805O529k19j3737J8303o925
2045I38n581O327l164Q426j5244Q032R809j7990R792j097K849l857p718K0484
2059A2006j5660k214J1577o953M656j2072J3653J937j9408J8173l999j965k288
2072b557j078J6080k2229P109J2018j4030N402n844J3193p487j2959K4246j3139
$$ plain form
2085 -1275 -4020 170 309 8202 -13024 3828 9301 -10365 2356 -332 5644 -4457 -7476 14973
2099 14973 -7331 -4461 5515 -140 2612 -10812 9303 4380 -13406 7700 819 594 -4998 -1320
2113 -1320 13079 -13018 -41 8812 -4680 84 -5339 10602 -2711 -11114 13036 -2932 -2923 -1372
2127 -1372 2652 6872 -14555 7302 6558 -9601 2574 -723 7053 -7559 -4366 14354 -9514
2140 -9514 -1753 3832 1156 986 -10306 11677 292 -10772 7803 -335 1424 -6548 1896 10173
2154 10173 -13388 3235 5809 -3614 -484 -4289 10671 -5520 -7310 11482 -4089 -1470 -1926
2167 -1926 3824 4111 -12386 8301 3266 -7187 2127 -417 6073 -7955 -1117 10583 -8689 258
2181 258 1960 1840 -417 -7557 10497 -2332 -6609 5995 -906 1557 -5968 3504 5843 -10241
$$ packed form
2085a275k745M190J39P893k1226J6852N473j9666J2721k688N976j0101l019K2449
2099A4973k2304K870R976n655K752j3424K0115m923j7786K1106o881k25n592L678
2113a320J4399k6097J2977Q853j3492M764n423J5941j3313q403K4150j5968RJ551
2127a372M024M220k1427K1857p44j6159J2175l297P776j4612L193J8720k3868
2140i514P761N585k676j70j1292K1983j1385j1064J8575q138J759p972Q444Q277
2154A0173k3561J6623K574r423L130l805J4960j6191j790J8792j5571K619m56
2167a926N750K87j6497K0687n035j0453R314k544O490j4028O838J1700j9272Q947
2181B58J702j20k257p140J8054j2829m277J2604o901K463p525R472K339j6084
$$ plain form
2195 -10241 4430 2425 -1830 -915 -2412 8072 -6159 -2699 7318 -3826 36 -2092 3832 1197
2209 1197 -7910 7068 128 -3778 1409 -253 3973 -6060 954 5682 -5900 1212 577 1532 -905
2224 -905 -4009 6688 -2632 -2881 3392 -833 1065 -3748 2745 2390 -5613 3251 511 -694 -559 -997
2240 -997 4173 -3859 -367 3242 -2252 418 -1245 2208 -162 -3263 3731 -880 -1125 588 -115 1597
2256 1597 -2893 1160 1687 -2496 1011 -131 692 -513 -1191 2487 -1348 -618 1149 -485 359 -1126
2272 -1126 872 540 -1617 1096 28 -313 149 -333 878 -733 -206 799 -691 139 -19 -66 295
2289 295 -518 417 86 -429 523 -302 -56 311 -479 292 -170 -65 325 -635 653 -83 -515 751 -502
2308 -502 328 -243 -240 919 -1230 522 330 -695 677 -773 972 -329 -873 1562 -1175 300 40
$$ packed form
2195a0241J4671k005m255R15j497J0484j4231L460J0017j1144L862k128N924k635
2209A197r107J4978o940l906N187j662M226j0033P014M728j1582P112o35R55k437
2224i05l104J0697r320k49O273m225J898m813O493l55q003Q864k740j205J35m38
2240i97N170q032L492L609n494K670j663L453k370l101O994m611k45J713p03J712
2256A597m490M053N27m183L507j142Q23j205o78L678l835P30J767j634Q44j485
2272a126J998l32k157K713j068l41M62m82J211j611N27J005j490Q30j58m7L61
2289B95q13R35l31n15R52q25K46L67p90P71m62J05L90r60J288p36m32J266j253
2308e02Q30n71LJ159k149J752j92j025J372j450J745j301n44K435k737J475k60
$$ plain form
2325 40 -415 1017 -1702 1214 180 -1242 1346 -1001 942 -537 -664 1881 -1986 772 251 -772
2341 -772 1119 -1710 1654 -333 -1252 1968 -1527 924 -430 -526 1700 -2345 1452 14 -1081 1492
2357 1492 -1662 1663 -701 -852 2084 -2098 1243 -354 -603 1504 -2217 1825 -525 -906 1786 -1887
2373 -1887 1624 -770 -524 1740 -2273 1694 -664 -620 1543 -2045 1829 -857 -425 1636 -2115 1818
2389 1818 -828 -439 1388 -1990 1815 -1097 -244 1521 -2043 1764 -844 -86 1113 -1909 1988 -1164
2405 -1164 -318 1265 -1646 1531 -1231 341 1085 -2005 1857 -806 -71 648 -1327 1774 -1516 113
$$ packed form
2325D0m55J432k719K916j034j422K588k347J943j479j27K545l867K758n21j023
2341g72J891k829L364j987r19L220l495K451j354r6K226m045L797j438j095K573
2357A492l154L325k364j51K936m182L341j597k49K107l721M042k350l81K692l673
2373a887L511k394K46K264m013L967k358M4K163l588L874k686M32K061l751L933
2389A818k646L89J827l378L805k912Q53J765l564L807k608P58J199l022L897l152
2405a164Q46J583k911L177k762J572P44l090L862k663P35P19j975L101l290J629
$$ [...]
8191H
##END NTUPLES=NMR FID
##END=
