##TITLE=1H_DE-80H_X3
 200.13MHz, d2o
 8 sc
 
 19ns.26.2.2025
##JCAMPDX= 6.0         $$ Bruker NMR JCAMP-DX V2.0
##DATA TYPE= NMR FID
##DATA CLASS= NTUPLES
##ORIGIN= UXNMR, Bruker Analytische Messtechnik GmbH
##OWNER= pz
$$ XWIN-NMR		Version 3.5
$$ Tue Feb  3 11:34:51 2026 Russian Standard Time (UT+4h)  Yarkov@DPX200
##.OBSERVE FREQUENCY= 200.1313
##.OBSERVE NUCLEUS= ^1H
##.DELAY= (6, 6)
##.ACQUISITION MODE= SIMULTANEOUS
##.ACQUISITION SCHEME= undefined
##.AVERAGES= 8
##.DIGITISER RES= 18
##SPECTROMETER/DATA SYSTEM= spect
##.PULSE SEQUENCE= zg30
##.SOLVENT NAME= CDCl3
##.SHIFT REFERENCE= (INTERNAL, CDCl3, 0, 14.3821)
##AUDIT TRAIL= $$ (NUMBER, WHEN, WHO, WHERE, WHAT)
$$ ##TITLE= Audit trail, XWIN-NMR		Version 3.5
$$ ##JCAMPDX= 5.01
$$ ##ORIGIN= Bruker BioSpin GmbH
$$ ##OWNER= Yarkov
$$ C:/Bruker/XWIN-NMR/data/yarkov2/nmr/H-C/1/audita.txt
$$ ##AUDIT TRAIL=  $$ (NUMBER, WHEN, WHO, WHERE, WHAT)
(   1,<2026-02-03 11:33:46.40 +0400>,<Yarkov>,<DPX200>,
      <created by zg, POWCHK disabled, PULCHK disabled
       configuration hash MD5:
       00 E9 B6 7A A2 85 ED C7 34 08 36 98 17 FE 4E 26
       data hash MD5: 16K
       B3 1D 40 4A 6C FB 3E 23 77 0C E8 40 0F 18 E6 A9>)
$$ ##END=
$$ 
$$ hash MD5
$$ 8E 91 01 FC C3 E9 40 8C 1A 6E 5E 05 62 10 BF E2
##$RELAX= 
##$RELAX= 
##$RELAX= 
##$RELAX= 
##$RELAX= 
##$RELAX= 
$$ Bruker specific parameters
$$ --------------------------
##$DU= <C:/Bruker/XWIN-NMR>
##$EXPNO= 1
##$NAME= <H-C>
##$PROCNO= 1
##$TYPE= <nmr>
##$USER= <yarkov2>
##$AMP= (0..31)
100 100 100 100 100 100 100 100 100 100 100 100 100 100 100 100 100 100 
100 100 100 100 100 100 100 100 100 100 100 100 100 100 
##$AQSEQ= 0
##$AQ_mod= 1
##$AUNM= <au_zg>
##$AUTOPOS= <>
##$BF1= 200.13
##$BF2= 200.13
##$BF3= 200.13
##$BF4= 200.13
##$BF5= 200.13
##$BF6= 200.13
##$BF7= 200.13
##$BF8= 200.13
##$BYTORDA= 1
##$CFDGTYP= 0
##$CFRGTYP= 5
##$CHEMSTR= <none>
##$CNST= (0..31)
1 1 145 1 1 1 1 1 1 1 1 1 1 1 1 1 1 1 1 1 1 1 1 1 1 1 1 1 1 1 1 1 
##$CPDPRG= <>
##$CPDPRG1= <>
##$CPDPRG2= <>
##$CPDPRG3= <>
##$CPDPRG4= <mlev>
##$CPDPRG5= <mlev>
##$CPDPRG6= <mlev>
##$CPDPRG7= <mlev>
##$CPDPRG8= <mlev>
##$CPDPRGB= <>
##$CPDPRGT= <>
##$D= (0..31)
0 0.7 0 0 0 0 0 0 0 0 0 0.03 0 0 0 0 0 0 0 0 0 0 0 0 0 0 0 0 0 0 0 0 
##$DATE= 1770104025
##$DBL= (0..7)
120 120 120 120 120 120 120 120 
##$DBP= (0..7)
150 150 150 150 150 150 150 150 
##$DBP07= 0
##$DBPNAM0= <>
##$DBPNAM1= <>
##$DBPNAM2= <>
##$DBPNAM3= <>
##$DBPNAM4= <>
##$DBPNAM5= <>
##$DBPNAM6= <>
##$DBPNAM7= <>
##$DBPOAL= (0..7)
0.5 0.5 0.5 0.5 0.5 0.5 0.5 0.5 
##$DBPOFFS= (0..7)
0 0 0 0 0 0 0 0 
##$DE= 6
##$DECBNUC= <off>
##$DECIM= 32
##$DECNUC= <off>
##$DECSTAT= 4
##$DIGMOD= 1
##$DIGTYP= 9
##$DL= (0..7)
0 120 120 120 120 120 120 120 
##$DP= (0..7)
150 150 150 150 150 150 150 150 
##$DP07= 0
##$DPNAME0= <>
##$DPNAME1= <>
##$DPNAME2= <>
##$DPNAME3= <>
##$DPNAME4= <>
##$DPNAME5= <>
##$DPNAME6= <>
##$DPNAME7= <>
##$DPOAL= (0..7)
0.5 0.5 0.5 0.5 0.5 0.5 0.5 0.5 
##$DPOFFS= (0..7)
0 0 0 0 0 0 0 0 
##$DQDMODE= 0
##$DR= 18
##$DS= 0
$$ [...]
##$SUBNAM2= <"">
##$SUBNAM3= <"">
##$SUBNAM4= <"">
##$SUBNAM5= <"">
##$SUBNAM6= <"">
##$SUBNAM7= <"">
##$SUBNAM8= <"">
##$SUBNAM9= <"">
##$SW= 18.0517328524113
##$SWIBOX= (0..15)
0 0 2 0 0 0 0 0 0 0 0 0 0 0 0 0 
##$SW_h= 3612.71676300578
##$TD= 16384
##$TD0= 1
##$TE= 0
##$TE2= 300
##$TE3= 300
##$TEG= 300
##$TL= (0..7)
0 120 120 120 120 120 120 120 
##$TP= (0..7)
150 150 150 150 150 150 150 150 
##$TP07= 0
##$TPNAME0= <>
##$TPNAME1= <>
##$TPNAME2= <>
##$TPNAME3= <>
##$TPNAME4= <>
##$TPNAME5= <>
##$TPNAME6= <>
##$TPNAME7= <>
##$TPOAL= (0..7)
0.5 0.5 0.5 0.5 0.5 0.5 0.5 0.5 
##$TPOFFS= (0..7)
0 0 0 0 0 0 0 0 
##$TUNHIN= 0
##$TUNHOUT= 0
##$TUNXOUT= 0
##$USERA1= <user>
##$USERA2= <user>
##$USERA3= <user>
##$USERA4= <user>
##$USERA5= <user>
##$V9= 5
##$VALIST= <valist>
##$VCLIST= <CCCCCCCCCCCCCCC>
##$VD= 0
##$VDLIST= <DDDDDDDDDDDDDDD>
##$VPLIST= <PPPPPPPPPPPPPPP>
##$VTLIST= <TTTTTTTTTTTTTTT>
##$WBST= 1024
##$WBSW= 4
##$XGAIN= (0..3)
0 0 0 0 
##$XL= 0
##$YL= 0
##$YMAX_a= 93725
##$YMIN_a= -131933
##$ZGOPTNS= <>
##$ZL1= 120
##$ZL2= 120
##$ZL3= 120
##$ZL4= 120
##$ABSF1= 10
##$ABSF2= 0
##$ABSG= 5
##$ABSL= 3
##$ALPHA= 0
##$AQORDER= 0
##$ASSFAC= 0
##$ASSFACI= 0
##$ASSFACX= 0
##$ASSWID= 0
##$AUNMP= <proc_1d>
##$AZFE= 0.1
##$AZFW= 0.1
##$BCFW= 1
##$BC_mod= 2
##$BYTORDP= 1
##$COROFFS= 0
##$CY= 83.5205535888672
##$DATMOD= 1
##$DC= 2
##$DFILT= <>
##$DTYPP= 0
##$F1P= 10.8118882576601
##$F2P= -7.23987719738617
##$FCOR= 0.5
##$FTSIZE= 0
##$FT_mod= 4
##$GAMMA= 1
##$GB= 0.15
##$INTBC= 1
##$INTSCL= 1
##$ISEN= 128
##$LB= 0.25
##$LEV0= 0
##$LPBIN= 0
##$MAXI= 10000
##$MC2= 0
##$MEAN= 0
##$ME_mod= 0
##$MI= 1.114404
##$NCOEF= 0
##$NC_proc= 0
##$NLEV= 6
##$NOISF1= 3.799351
##$NOISF2= 2.8
##$NSP= 1
##$NTH_PI= 0
##$NZP= 0
##$OFFSET= 14.38212
##$PC= 1
##$PHC0= -5296.548
##$PHC1= 6.821927
##$PH_mod= 1
##$PKNL= yes
##$PPARMOD= 0
##$PSCAL= 0
##$PSIGN= 0
##$REVERSE= no
##$SF= 200.129724274929
##$SI= 16384
##$SIGF1= 3
##$SIGF2= 2
##$SINO= 400
##$SIOLD= 16384
##$SREGLST= <1H.CDCl3>
##$SSB= 0
##$STSI= 0
##$STSR= 0
##$SW_p= 3205.1282051282
##$SYMM= 0
##$S_DEV= 0
##$TDeff= 0
##$TDoff= 0
##$TI= <>
##$TILT= no
##$TM1= 0
##$TM2= 0
##$TOPLEV= 0
##$USERP1= <user>
##$USERP2= <user>
##$USERP3= <user>
##$USERP4= <user>
##$USERP5= <user>
##$WDW= 1
##$XDIM= 8192
##$YMAX_p= 0
##$YMIN_p= 0
$$ End of Bruker specific parameters
$$ ---------------------------------
##NTUPLES= NMR FID
##VAR_NAME=  TIME,          FID/REAL,        FID/IMAG
##SYMBOL=    X,             R,               I
##VAR_TYPE=  INDEPENDENT,   DEPENDENT,       DEPENDENT
##VAR_FORM=  AFFN,          ASDF,            ASDF
##VAR_DIM=   8192,          8192,            8192
##UNITS=     SECONDS,       ARBITRARY UNITS, ARBITRARY UNITS
##FACTOR=    0.0002768,     1,               1
##FIRST=     0,             0,               0
##LAST=      2.2672688,     0,               0
##MIN=       0,             -131933,         0
##MAX=       2.2672688,     93725,           0
$$ Real data points
##PAGE= N=1
##DATA TABLE= (X++(R..R)), XYDATA
0@%%%%%%%%%%%%%%%%%%Qj6J6j6J6j6K3l1L2l6M4m9N7o5P3q5R4j06J22j38J54j72
40i1J92k13K38k65K91l21L57l94M34m78N26n82O42p05P76q57R49j054J172j310
60f93J472j662J895k186K560l060L763m832O645j4879J03921l0090j42499N7729
74b1916R6339n5074q2627M6273N3908j8890l6637j0447M419L8809L6995k3530
86B7622o4526j5666N8502O3936k9991r8590j6214J03649M7160q4293n1924O2354
98B019L4203m9388j7041M5219J4711l3657k6363J0434M4177K8788m8911o5459
110f1268L3561P9534j2140o9434r864L7901K2664L269k3099l7919J6050N8761
122C8016p458o5373k995N8014J3417l8897j8041K1320K4109q216l3645R37M5999
$$ plain form
0 0 0 0 0 0 0 0 0 0 0 0 0 0 0 0 0 0 0 0 8 -8 8 -8 8 -8 15 -16 16 -20 24 -25 32 -33 40 -45 49 -57 65 -73 81 -91
40 -91 101 -112 126 -139 152 -169 188 -206 228 -250 276 -306 336 -369 407 -450 499 -555 617 -693
60 -693 779 -883 1012 -1174 1386 -1674 2089 -2743 3902 -10977 92944 62854 -79645 -21916
74 -21916 74423 19349 -63278 -17005 36903 18013 -18624 -29071 -24652 14157 51152 27622
86 27622 -36904 -52570 5932 69868 39877 -58713 -74927 28722 75882 -8411 -60335 2019
98 2019 36222 -13166 -30207 15012 29723 -3934 -30297 -19863 24314 53102 4191 -61268
110 -61268 -27707 51827 39687 -29747 -39611 -1710 20954 24223 1124 -36795 -20745 38016
122 38016 30558 -34815 -37810 20204 33621 -5276 -23317 -1997 22112 13896 -19749 -18812 27187
135B7187j9o4677o422P7180K0697p0783l4333M2751L5728k963j9431l1900j0663
148c7648M6608M0195l5192m9344J3770L9492L831k1213j1416P276R141j0319j1370
161a6189K4213K4268l5900m3023L4277N5867j9054n3010k657L3361K1145k587
173B0711k4819k3131J9330L7248q969l8233l435K4766R020p953r714n388Q719
186a848J1775q800j0700J3721N809k3856n047L3389J2949l1396k2542J8144K9103
199B0701N358k5514k9369Q462L8314R966l1024k0799J2459J7847O210l901j5204
212f494j0138J2401J4629m531o142K796n785p961J4090J8456j1356k6451k765
225a9251K1682J7663q049k5992r920K2878K2433j0065k3228m314J2919J2589K836
$$ plain form
135 27187 27168 -37509 -43931 33249 53946 -16837 -51170 -8419 27309 24346 4915 -26985 -37648
148 -37648 8960 49155 13963 -35381 -21611 17881 21712 499 -10917 -3641 5500 -4819 -16189
161 -16189 8024 32292 -3608 -46631 -12354 43513 24459 -28551 -31208 2153 23298 20711
173 20711 -4108 -27239 -7909 29339 20370 -17863 -21298 3468 12488 4535 -5179 -10567 -1848
186 -1848 9927 1127 -9573 4148 9957 -13899 -18946 14443 27392 -4004 -26546 -8402 20701
199 20701 26059 545 -28824 -20362 17952 27918 -3106 -23905 -11446 6401 12611 8710 -6494
212 -6494 -16632 -4231 10398 5867 -275 2521 -3264 -11225 2865 21321 9965 -16486 -19251
225 -19251 2431 20094 12045 -13947 -23867 -989 21444 11379 -11849 -16163 -3244 9345 12181
238A2181j0719j3237L816J5612L994q228n381k813k579P530J1725m789j7767m764
252a5419J4153J4361j653j5939j2792P928K0705N782j6720j5777N213J7533Q799
265A6174q839j5212l776J0318J0617l45r453r640p19J1281J1563l936j5246o851
279a4064R364J3764L012j0435j3128O28J5653J2015p786j7373m860J2424J2518
292A1732k104j2826r284L495J2238Q313o107j4010m590J1767J2442j355j2066
305b355q692M018J2738P963p206j4307l762J1865J1740k663j3363q801N227J3258
319E660N432q455j2437k183J1222J1974j359j3964q853P842J4207L548r696j1125
333h187q88J0175J0556k797j4016q033P705J2766K478r199j0339p04J0727J0791
$$ plain form
238 12181 1462 -11775 -7959 7653 11647 3419 -1962 -4775 -7354 176 11901 7112 -10655 -15419
252 -15419 -1266 13095 11442 -4497 -17289 -9361 11344 17126 406 -15371 -10158 7375 16174
265 16174 7335 -7877 -11653 -1335 9282 8937 -516 -10156 -10875 406 11969 8033 -7213 -14064
279 -14064 -4700 9064 12076 1641 -11487 -10859 4794 16809 9023 -8350 -13210 -786 11732
292 11732 9628 -3198 -12482 -8987 3251 11564 5457 -8553 -13143 -1376 11066 9711 -2355
305 -2355 -11047 -7029 5709 13672 6466 -7841 -11603 262 12002 9339 -4024 -12825 -7598 5660
319 5660 11092 2637 -9800 -11983 -761 11213 9854 -4110 -12963 -5121 9086 12634 2938 -8187
333 -8187 -9075 1100 11656 8859 -5157 -13190 -5485 7281 9759 560 -9779 -10483 244 11035
347A1035k687j3676p315Q903J3925J968j1272j0686K185J2011P399n896j2489
360f595m489P874J0209J518q899r699P12J1144Q798m029j1960o211P312J3951
374I636M042j2764j3539M725J5937N285j0360j1784j164R187R829k148j1935n714
388a0767P231Q215O05k909m907n076L205J1510M266j0100j0995J477J2407J0520
402A4682o937j9129m400J8327J3333j0203j5993j968R866J0674J166j1569r527
415a1678P522J0976j259m457L33l713m729P487J0764l385j2653p255N381J5677
429I011P583j8088k0896J1820K6949j219k2501o931J1088J0272K110o972j0124
442g898K821J1986m73r098J594M505n778k543P346K480m702m769m028N223J6887
$$ plain form
347 11035 8348 -5328 -12643 -3740 10185 12153 881 -9805 -7620 4391 11790 5894 -6595
360 -6595 -11084 -3210 6999 8517 -382 -10081 -9369 1775 10573 6544 -5416 -11627 -4315 9636
374 9636 13678 914 -12625 -7900 8037 13322 2962 -8822 -9986 -799 9030 6882 -5053 -10767
388 -10767 -3536 4679 5284 2375 -2532 -7608 -4403 7107 11373 1273 -9722 -8245 4162 14682
402 14682 7745 -11384 -15784 2543 15876 5673 -10320 -12288 -2422 8252 9418 -2151 -11678
415 -11678 -4156 6820 5561 1104 1437 -2276 -7005 482 11246 7861 -4792 -12047 -6666 9011
429 9011 16594 -1494 -22390 -10570 16379 15160 -7341 -14272 -3184 7088 9198 2226 -7898
442 -7898 -5077 6909 6436 -2662 -1068 3437 -2341 -4884 2462 4942 240 -4529 -8557 -3334 13553
457A3553j308k8228o686L3321J6892k7250k2687J3277K1420L650j2133j5835P4
470a1940J7902O745j3600n772O844k158m505Q653N525p075m515k156k853J4326
484E421J8145j9250l3622J4555M1369j969l6438j1150K0712J8046l577k0060r005
497a6823J7973J3553j6946j2107J7114Q272j5742l432J2355n16m499M690n346
510a454p506J5653J0427k4563j4565K8005J9692k4036k5986R199K8752J1366k4946
523C8l0943J5092M1294l862l7915n81K6563k913j3636J0556O998j4249m210P754
537a4n67M399J0295j4515k4071J2756L2050N26k7875j8016J1596L1703R465l5384
551g652k4476L3353K9926k9435k6068K6399J9087k3463j3395J6660Q231o449m891
$$ plain form
457 13553 12245 -15983 -22669 10652 27544 294 -22393 -9116 12304 15954 3821 -12014 -11940
470 -11940 5962 12707 -893 -6665 179 -1979 -6484 2169 7694 619 -3896 -6052 -8905 5421
484 5421 23566 4316 -29306 -14751 26618 24649 -11789 -22939 -2227 15819 12242 -7818 -16823
497 -16823 1150 14703 -2243 -14350 2764 11036 -4706 -8138 4217 3701 -798 3892 -1454
510 -1454 -8960 6693 17120 -7443 -22008 5997 25689 1653 -24333 -15134 13618 24984 38
523 38 -30905 -15813 25481 21619 -16296 -16877 9686 6773 -6863 3693 10691 -3558 -7768 -14
537 -14 -581 3818 14113 -402 -24473 -11717 20333 20859 -7016 -25032 -13436 18267 27732 -7652
551 -7652 -32128 1225 31151 1716 -24352 2047 21134 -2329 -15724 936 9167 2718 -2173
564b173n328O93J4239K212j7709l603J6577N048r102p281l140J0910K0928j1760
578A0511l9495P465N1482J529n1581j0830L8003J3459k0060r750N480M035P04
591I52m009o07J2309K097k2005o977K5365J3480j5959j2951k463J724J9664J6113
605B6733k8091l2720K5079L8407j6761l3986Q375K3612k345j4276k438J0162R872
618A1623q651j7943Q379K4714p137k6275N873K1548m978j3030L001J487j060J0553
632H104j540k2451R18L0480M514k9984j1933K0612J8212l959j8747j0989J5127
645a636J8210j1845j6730J2806J1531j8922r146K2724J0112j9535j2058P055R030
658A596Q558R02j8129j2375J8386K0075r298j8738k306J0869J0631j119j5085
$$ plain form
564 -2173 -7501 -6808 7431 9643 -8066 -11669 4908 9956 854 -6427 -9567 1343 22271 10511
578 10511 -28984 -21519 29963 31492 -20089 -30919 7084 20543 483 -9267 -3787 248 952
591 952 -3057 -3664 8645 10742 -11263 -18240 7125 20605 4646 -8305 -10768 -9044 10620 26733
605 26733 -1358 -34078 -8999 29408 12647 -21339 -12964 10648 8303 -5973 -8411 1751 11623
618 11623 2972 -14971 -6592 18122 10985 -15290 -9417 12131 7153 -5877 -2876 -1389 -2449 8104
632 8104 6564 -15887 -14969 15511 20025 -9959 -21892 -1280 16932 12973 -5774 -16763 -1636
645 -1636 16574 4729 -12001 805 12336 -6586 -15732 6992 17104 -2431 -14489 -7434 1596
658 1596 10154 11056 -7073 -19448 -1062 19013 9715 -9023 -11329 -460 10171 9052 -6033
671f033m779J6406M696j7973k404J9153q38j9336J293J7051L33j0666k693L448
685b342N890N086p611j1845O851J5692l322j4434k679P324P890K623j0213j2842
699a3932P765J7360m311j5389K721R787l563l829O581K634o439m361J466N901
713B391P226m443j4919j335J6922O995j2345r683K498O575O130m88j0116n214
727i806J0299P644o283n469L666J499k473J500K609j531k861j592P80N646K346
742E974q530p079P930R513m350r058o77N630N237J127o008o320M210Q722o16p117
758a412k062K516J586J642M61l054l045O28K111K593J156m453n253L058Q500J388
774F360o621m937K232N871L503l432p260q73O629L821l130m456j180J390K969
$$ plain form
671 -6033 -10812 5594 10290 -7683 -10087 9066 8228 -11108 -9815 7236 7569 -3097 -5790 -2342
685 -2342 3548 8634 1023 -10822 -3971 11721 8399 -6035 -8714 -1390 6500 9123 -1090 -13932
699 -13932 -6167 11193 6882 -8507 -5786 4001 438 -3391 3190 5824 -615 -4976 -3510 2391
713 2391 9617 5174 -9745 -11080 5842 12837 492 -9191 -6693 -118 6012 5524 -4592 -9806
727 -9806 493 8137 1854 -3615 51 1550 -923 577 3186 1655 -1206 -2798 -2018 3628 5974
742 5974 -2556 -9635 -1705 7808 3458 -5600 -6277 -647 4590 5717 -291 -6611 -2401 6321 5705 -1412
758 -1412 -3474 -958 628 2270 2731 -323 -3368 -2740 -629 1964 3120 -1333 -6586 -3528 4972 6360
774 6360 -261 -5198 -2966 2905 6408 2976 -4284 -5157 1472 5293 2163 -2293 -3473 -2083 886
789H86J819k210l752n54L082L265P05k839l578P24N103K546l097n132r93M360
805C35M292j066n770k768L436M566r5l836l073M28L702L315j000m037j658K647
821e82L654J009k826l711o46L594L454j132m587k669K407M598R69m378l832J263
837c415M265K615j757l750j364L277M066q3m095k630J488L221J274j780l124j599
853c391K175L490L21l416l210P74L891K718j712m182j273L809M320l37m468k967
869c458J988M376J221l820l687P96L526J051r86k123j744L57L075J876j748k659
885a959l59J996K872J760l389m780J397N893J420m844l945J159L856K693k442
900A328n091n59M846K183k317j955N8M62J578J924n59j934n69m60J150L785M4
$$ plain form
789 886 2705 495 -3257 -3811 -729 2536 3241 402 -3176 -2452 2651 5197 2100 -3032 -4025 335
805 335 4627 3561 -2209 -4977 -1541 3025 2930 -906 -3979 -3551 151 3466 2466 -1571 -3229 -582
821 -582 3072 4081 1255 -2456 -3102 492 3946 2814 -1773 -4442 -2035 2563 3532 -846 -4678 -3415
837 -3415 850 3465 1708 -2042 -3406 -129 3937 3854 -241 -2871 -1383 1838 3112 1332 -1792 -3391
853 -3391 -1216 2274 2595 -821 -4031 -3257 634 3352 1640 -2542 -3815 -6 4314 3977 -491 -3458
869 -3458 -1470 2906 4127 307 -3380 -2584 942 1993 1007 -1116 -2860 -2503 572 2448 700 -1959
885 -1959 -2318 -322 2550 4310 921 -3859 -2462 3431 4851 7 -3938 -2779 1077 3770 1328
900 1328 -3763 -4322 524 2707 390 -1565 -1507 -1045 533 2457 1898 -36 -605 -1065 85 3870 3914
917C914p194l063P094N476m504o097N5L180L867J072n286m426M663N726k087l739
933a349R46J245n06N61L73j070M76p36l369K184O548k989r209K117R465k33p241
950b787j814L328L559K291l664o258L213Q325j696p360j12L746K65O33l50m323
966c004J25N349j659n165N003N015q733n880J0335Q218p078q621R74O576O372
981G827k159j0910k620J0612L965p740k067L733k202j015N164j165n385M230L451
996C719q096j018J2532R25j4079j656J1940L543o936n436O26O701M105q609p913
1011i652J0150R319j0382r094Q542N900m842K84J752o434O69J0767j195j0941
1025e157K488P876m471n328N354M309l573n343l535N244J2979k686k0564j324
$$ plain form
917 3914 -3280 -6343 751 6227 1723 -4374 -4319 -1139 2728 3800 -1486 -5912 -1249 4477 2390 -1349
933 -1349 -403 842 336 897 1270 200 676 -60 -3429 -1245 5303 2314 -6895 -4778 4687 4454 -2787
950 -2787 -4601 -1273 2286 4577 913 -5345 -2132 6193 4497 -2863 -2975 771 1036 1669 1319 -3004
966 -3004 -2879 2470 811 -4354 649 5664 -3069 -8949 1386 9604 2526 -6095 -5121 1455 7827
981 7827 5668 -5242 -7862 2750 6715 -1025 -3092 641 -1561 -2576 2588 1423 -3962 268 3719
996 3719 -4377 -5395 7137 8062 -6017 -7673 4267 7810 874 -4562 -3936 2765 6870 -1739 -9652
1011 -9652 498 9817 -565 -9659 -1117 4783 -59 225 1977 -4457 -3788 6979 5784 -5157
1025 -5157 -2669 5207 736 -4592 762 5071 1498 -3845 -7380 -2136 10843 8157 -12407 -13731
1039a3731K1903M561j7088l099J0042j102l699N740M06o540J286L433m346Q36
1053a398O631k889p711Q58M251L070K936o309j0781Q020J6354q762j7474J0579
1067b625J6439j1683j3742J0674J0458o464o511J74Q34M167L869o009n268M696
1081i91K092k706L376J385p045P53P634n030n116J2657L685j9695n148K2407P730
1096A5988j8361r234Q686O877L17l120n618R52O516k896n238P729M684j0824m077
1111g619J0397K088n730L554L32j0581K778J5298l382j6414K427J2697j985p991
1125d131N57M320K572j619p572m9J2852K438j5131l278J3853J733r517K392N141
1140D561p050k248Q400m69o746L409L149p410j084R483K229p225m505N07O413
$$ plain form
1039 -13731 8172 12733 -4355 -7454 2588 1486 -2213 3527 3933 -2607 -1321 2112 -2234 -1398
1053 -1398 5233 2344 -5367 -4509 -258 2812 5748 -561 -11342 -3322 13032 4270 -13204 -2625
1067 -2625 13814 2131 -11611 -937 9521 3057 -3454 -3280 -2446 1721 5590 -419 -5687 -991
1081 -991 1101 -1605 1771 3156 -3889 -3136 4498 -532 -5648 7009 10694 -9001 -14149 8258 15988
1096 15988 -2373 -11607 -2921 3956 4273 1153 -4465 -3513 3003 107 -5131 2598 7282 -3542 -7619
1111 -7619 2778 4866 -864 2690 3022 -7559 -4781 10517 7135 -9279 -6852 5845 3860 -4131
1125 -4131 -3574 746 3318 1699 -5873 -5922 6930 9368 -5763 -9041 4812 6545 -2972 -580 4561
1140 4561 -2489 -4737 3663 3194 -3552 -143 3006 -4404 -5488 3995 6224 -1001 -5506 -4999 1414
1155A414P828n091j3162L236J4084l215j0910N245O662q386m130Q525K586n968
1169a282p32Q43k356L529N516m719o203L609M339o92o0j700l217L713M965o315
1185g62n250Q603M338j0371l858R048K879n903j089J742p39J630J991k955p52
1200a448L762j452m103L773M338m168l239K168k41m5M536j464q448J110R065j50
1216C994o816j18L367m18j13J453j062m11J304j906j116M646J210n968j831N126
1232A341R37l006K13K7j959J949L182l225k984L661K685l288j395K673N69p40
1248F40M0j075n81K397L29l179p4K946j176k754J969K111j984j303J262N7N45
1265A70J643j244k972J892L278r30k510J85N94J15P19k26j966J14J520n37j034
$$ plain form
1155 1414 9242 4151 -9011 -5775 8309 5094 -5816 -571 6091 -2295 -6425 2100 4686 -1282
1169 -1282 -2014 -1171 -3527 2 5518 799 -5404 -1795 2544 1852 1792 92 -3125 588 5553 -762
1185 -762 -6012 2591 6929 -3442 -7300 1748 4627 -1276 -2365 -623 -1362 268 2259 -696 -1448
1200 -1448 2314 862 -3241 532 4870 702 -2537 -369 -610 -655 3881 2417 -6031 -4921 4144 3994
1216 3994 -2822 -2940 427 9 -104 1349 287 -124 1180 -726 -1842 2804 4014 -1954 -3785 1341
1232 1341 2278 -728 -515 -488 -2447 -498 2684 -541 -3525 136 2821 -467 -1862 811 1380 640
1248 640 680 -395 -976 1421 1750 -1429 -1503 1443 267 -2487 -518 1593 -391 -1694 -432 -375 170
1265 170 1813 569 -2403 -511 2767 1837 -673 -488 106 221 940 714 -1252 -1138 382 -155 -1189
1282a189J295M82j844j29K100L80r47m25o3M24J423j02j994l70J827L87j246q02
1300g93K86j5N19K01r88m62J187M72q93J30R25l07n92P76P02n10n10j35R6N08
1320E97K69j219r23P79R13k95q52m10L76R32N82p74o63N51P76l3l64J55J05l31
1340A71J99Q8k71k85l21j65J95M68j92q04k34J120N47l36q12J37R09N66l83o78
1360h1K0N88J43l29l69j54O2j35k9j36r6J88j79n9O52M78o84n40P01Q93j25p72
1382C7r3K29M68J70n94q22L50O18l41p47M5K25J48K17k79j26N55L38o48m2J215
1403I23j32j110K20J162j58r37r5p9j36N45J00j560j80J652K82j218J81M80j45
1422b05N90L61p83l28J374j38j478P49J591j542j623J449Q67j096m33J86o61N36
$$ plain form
1282 -1189 106 588 -1256 -1385 715 1095 148 -277 -340 84 1507 1405 -589 -959 868 1255 9 -793
1300 -793 -507 -522 -3 198 -790 -1252 -65 407 -486 -356 569 262 -330 446 1148 638 128 -7 89 597
1320 597 866 -353 -1276 -497 416 121 -731 -1141 -765 167 749 -25 -688 -137 639 606 242 397 502 171
1340 171 370 458 187 -98 -419 -584 -389 79 -113 -917 -1151 -31 516 180 -632 -495 414 980 597 -81
1360 -81 -61 527 670 341 -28 -182 -120 -255 -284 -420 -516 -328 -507 -566 86 564 -120 -660 41 934 809 37
1382 37 -56 173 641 811 217 -605 -255 363 22 -725 -680 -455 -307 -90 -369 -495 60 398 -250 -292 923
1403 923 791 -319 -99 1063 905 -32 -127 -206 -342 203 303 -1257 -1437 215 497 -721 -540 -60 -205
1422 -205 385 746 -37 -365 1009 871 -607 142 1733 191 -1432 17 884 -212 -645 -459 -1120 -584
1440e84J375q02j215J436N82j191K70J247q57n49J498o70j835J812J851k917j885
1457b434K820J007k663o0K086r93j070J211N03k55P51o59j817J639K400j997j446
1474i77J835n25j916K382J915m080j901M178P02l675J110K635k208j878K631J513
1490A741j247j80o98j108K624J775l257j462L310q55l261K984K940m790k271M692
1506I37M85l577J770L073l494k238L825J826k057l56m84j020K290J659l435l95
1522a191L292k399l820M907L990o459l277N756J403m226J841L391m021k699M330
1537H18J929k028n37o66j466K686K193l558o42L188l070l660O469L810p998l112
1553e644P350J010n322K564M197m882l456M926K562k374q92p70j366K899J756
$$ plain form
1440 -584 791 -11 -1226 210 792 -399 -129 1118 261 -288 1210 540 -1295 517 2368 -549 -2434
1457 -2434 386 1393 -1270 -1330 756 -237 -1307 -96 407 152 903 244 -1573 66 2466 469 -977
1474 -977 858 333 -1583 799 2714 -1366 -3267 911 1613 -2062 -952 1683 -525 -2403 228 1741
1490 1741 494 314 -384 -1492 1132 2907 -350 -1812 1498 643 -2618 366 3306 -1484 -3755 937
1506 937 1422 -2155 -385 2688 -806 -3044 781 2607 550 194 -290 -1310 980 2639 -796 -1191
1522 -1191 2101 -298 -4118 789 4779 -1680 -4957 799 2202 -2024 -183 3208 -813 -3512 818
1537 818 2747 719 182 -484 -1950 736 2929 -629 -1271 1917 -1153 -4813 1656 5466 -2532 -5644
1553 -5644 1706 2716 -2606 -42 4155 -727 -4183 743 3305 931 39 -731 -2097 802 2558
1568B558l486j77L346l805l720P183L946q286k937P491L89n395L630M088n914
1583a089l542N463K696k782o11o43j773K391K012k986K67K776m566l258Q274L843
1599F472q837l043P803K20n285L588L803n911l390N466K145k493j44q29k271K296
1615d10K371k451Q7K111m350k435Q163L022r064j675P823r41n796M321M474o104
1631h54l688N023K012k047K18j140k663K332K821k201n13K238l345k312O647K472
1647E000o817j351N996j738m478M936L799o594l449N081K064k062J0j250j955
1662b808K604K186k771N6K857l263k804N863K927n999j377M594j581l218M701
1677A967K156o161j953N136P39k563N23m2j718J354J472j646R42K269l693k384
$$ plain form
1568 2558 -928 -1105 2241 -1564 -5284 1899 5845 -2441 -5378 2113 2502 -2893 737 4825 -1089
1583 -1089 -4631 832 3528 746 135 -508 -2281 110 2122 -864 -597 2179 -2387 -5645 2629 6472
1599 6472 -2365 -5408 2395 2615 -2670 918 4721 -1190 -4580 886 3031 538 394 -435 -2706 -410
1615 -410 1961 -490 -403 1708 -2642 -5077 3086 6108 -2956 -4631 3192 2251 -3545 776 5250 -854
1631 -854 -4542 481 2493 446 664 -476 -3139 -807 2014 -187 -700 1538 -1807 -4119 2528 5000
1647 5000 -1817 -3168 2828 1090 -3388 1548 5347 -1247 -4696 385 2449 387 397 -853 -2808
1662 -2808 -204 1982 -789 -733 2124 -1139 -3943 1920 4847 -1152 -2529 2065 484 -2734 1967
1677 1967 4123 -2038 -3991 1145 1884 -679 -156 -198 -1916 -562 910 -736 206 2475 -1218 -3602
1693c602N431K590n287j322L923j197k653L439J640m695r47L609l43j812J807
1708E81J28k538N33K144m00Q2J162k908j238M394J313m305p81L417j202k439K758
1725G01J371l381p03K277l00o65J541n91k209J313K206j187o08J381j314j054
1741a222K459N54k720J13K312j586j896K268J373k563p96J728o8m67J078k83j401
1758a117J112R99j035OJ437j231j333J587Q26j629p3J206j304r73J963O51k225
1775a133k05J774l17m72P77O9r86M66Q71o57O9M56p56o98J281M80j520k21R72
1794B50m63m14P04P1j046M34R99n72l55P93J82o24M72K61n46l11O57k71n08L01
1814A4Pm59J70M60m43n00N98K62k50n1J56m6L31L83j49m56K11K10k61L5J6k89
$$ plain form
1693 -3602 1829 4419 -868 -2190 1733 536 -2117 1322 2962 -1733 -2680 929 586 -1226 581
1708 581 709 -1829 -1296 848 448 530 1692 -1216 -2454 1940 3253 -1052 -1833 1584 382 -2057 701
1725 701 2072 -1309 -2012 265 -35 -700 841 250 -1959 -646 1560 373 -235 1146 -168 -1222
1741 -1222 1237 1791 -929 -816 1496 -90 -1986 282 1655 -908 -1704 24 -44 -511 567 284 -1117
1758 -1117 -5 994 -41 -35 1402 171 -1162 425 1251 -378 -451 755 -549 -1522 441 1092 -1133
1775 -1133 -1338 436 119 -353 424 493 -493 -27 844 187 256 712 -44 -742 539 1019 -501 -722 250
1794 250 -213 -627 77 148 -898 -464 535 -37 -392 401 583 -41 431 692 146 -165 492 221 -287 14
1814 14 21 -438 -268 192 -251 -751 -153 109 -141 -192 -36 -82 249 632 483 27 238 448 187 222 238 -51
1836e1n10L75L43k95k37nq1J49L45J32m24O7M90J47k46J00j61J7K32r0j97l59
1858b59O2k1J29j02j09k04J71L45K6j14j41J30J17M56K05o72n6K00K19l8k23k55
1880a34j39J36J40k0m36j28L15J30O1k2k19N1N76M30m66j55N0J39O0Kk47k70l8
1903a84J76j50J19m1m39j5O10K38n72l15O17J59J81K05l47o26P06Q69q30p50J24
1924b65M65j6k08k40k00K10J66l01L9P25l53r20P48J183m02j044L37N13j10K66
1944E93J35j318j34J266K60j493j05Q02J14k95j82l87O58J074r75j080J315J260
1962A508j464r59J821L97j761l13J200r7l72L33j130n03J620J119j824j238J110
1979e53J075J51J51j346r19K176J116k395m57K589n59l077J041K996j022k340
$$ plain form
1836 -51 -561 -186 157 -138 -375 -380 -461 -312 33 165 -259 -192 298 445 199 299 138 155 387 297 100 -259
1858 -259 -197 -218 -89 -191 -300 -504 -333 12 38 -76 -217 -87 30 486 691 19 -37 163 382 344 121 -134
1880 -134 -273 -137 3 -17 -453 -581 -266 -136 -75 -97 -316 -265 311 741 275 120 170 309 369 371 124 -146 -184
1903 -184 -8 -158 -39 -80 -519 -534 76 314 -258 -573 44 203 384 589 242 -384 322 1191 361 -389 -265
1924 -265 200 184 -24 -264 -464 -254 -88 -389 -350 375 22 -898 -150 1033 631 -413 -76 437 327 593
1944 593 728 -590 -724 542 802 -691 -796 6 120 -175 -357 -744 -86 988 13 -1067 248 1508
1962 1508 44 -915 906 1303 -458 -771 429 332 -40 293 -837 -1340 280 1399 -425 -1663 -553
1979 -553 522 673 824 -522 -1441 735 1851 -544 -1001 1588 1029 -2048 -1007 1989 967 -1373
1995a373K71O70L97J124p57k026P35K308o89j308Q79J16n47P89L15k009R26K785
2013B606k259l650K828L510k736k981J959J670j227k43M07j44R87l2k368Q28L667
2030B822o83l937J67K753m30oQ36k895j947M241K566m335k227L660P69k915O81
2047h80K542o34j428q25o7K802K311l891m084L731M073l038k580K162m7j876K023
2064B94J257l070J39L320j676l453L053L504k541k737Q10J429J380M00l284j527
2080b702M280R95n008J08N556j353n826J512M518n51j529J16k043l42M705J326
2096C762m722j690K791P93l58O24j256j571K006K44l002K464M052m664n572N206
2112h93O136l715m553J798J609p1J312o99k560J429K156k499j007L032P1k972
$$ plain form
1995 -1373 -1102 -432 -35 1089 332 -1694 -959 1349 660 -648 231 347 -200 589 904 -1105 -179 2606
2013 2606 347 -3303 -475 3035 299 -2682 -723 947 -280 -523 -116 -260 727 695 -1673 -845 2822
2030 2822 2139 -1798 -1631 1122 692 686 1522 -1373 -3320 921 3487 -848 -3075 585 1354 -1561 -880
2047 -880 1662 1028 -400 -1225 -1292 1510 3821 -70 -4154 -423 3650 612 -1968 194 147 -1729 294
2064 294 1551 -1519 -1380 1940 264 -3189 -136 3368 827 -1910 -1100 329 1709 2109 -1175 -2702
2080 -2702 1578 2573 -2435 -2327 3229 1876 -3950 -2438 2080 1529 0 116 -1927 -2269 2436 3762
2096 3762 -960 -2650 141 934 576 1200 -56 -1627 379 623 -2379 85 4137 -527 -6099 -893
2112 -893 5243 1528 -3025 -1227 382 311 1623 924 -1636 -207 1949 -550 -1557 1475 1546 -1426
2128a426M07R10j132J981K030m388k785N579K978n444j514M864R3l988N44K819
2144A528R0o47j636k342K285M711k226n257J304L199q33KJ336k600j852L806J544
2161B412l559L98L434k639l432L494L868k695l290j3J311K488R37l967k400M017
2177C64K342l802q15L439p62k438J602J340j562N76J667k754j694L820J323l484
2193h38r82K142R4q27L73m63q9J826j091l173K424M542k612m726J979L438q37
2210A180j010M35j689k27K634L32k583m7J508j363m21K147K00j818k66L79J74
2227d35J929Q75l593j873M159K287l375j744J965M03q16N51j46j140P49P46j361
2244h19j56J855l55j752R45J105q01n4N95p21j56J656p90k118J166K553j414k696
$$ plain form
2128 -1426 -1019 -109 -1241 740 2770 -1618 -4403 1176 4154 -1290 -2804 2060 2153 -1835 -1291 1528
2144 1528 1618 971 -665 -3007 -722 3989 1763 -3494 -2190 1009 176 178 1514 -1086 -2938 868 2412
2161 2412 -1147 -749 2685 46 -3386 108 3976 1281 -2009 -2022 -711 1777 2714 -1253 -3653 364
2177 364 2706 -1096 -1911 1528 766 -1672 -70 1270 -292 284 1951 -803 -2497 1323 2646 -838
2193 -838 -1820 322 416 -411 -38 -501 -590 1236 145 -3028 -604 3938 1326 -3400 -1421 2017 1180
2210 1180 170 605 -1084 -1311 1323 1655 -928 -975 533 -830 -1251 896 1096 -722 -988 -609 -435
2227 -435 1494 2369 -1224 -3097 1062 3349 -26 -1770 195 598 -218 333 187 -953 -204 542 -819
2244 -819 -975 880 525 -1227 -282 823 22 -32 563 -158 -314 1342 552 -1566 -400 2153 739 -1957
2262a957O95J859P6n26p77q25R80J766o20j542N61P14p07L71J160q86j262O26
2280b94P60l36M26r4j701l70K384P12j971j026Q30J018L16j56j096k74J386N89
2298A103j031l90O74k80l02P45kr81j10M73K14j90K02o27o25J173J055q43j248
2317i90M32Q97N33j98q97n33O16J148l45r47k51L72L3L46O5o46n37M99P09R7l05
2338I8l42m13O12J155j50j231m42P28Q39jq68q26J09J071M23p48q22M3M86O15
2358C36J50m79n42J55P70L62k71m31m77K05R59J75q79q04KJ022M43m10j065j95
2378i74R43Q13l16q57l40M70P92J25l53o58j11O75N51k18n92n16J52O51L60m26
2398A71q56l27Q83N29L24r93q12O16J142N59j199p69M64Q36K12l35q18k14N73
$$ plain form
2262 -1957 -1262 597 673 147 -630 -1455 -475 1291 671 -871 -310 404 -303 68 1228 342 -920 -294
2280 -294 466 130 556 462 -1239 -1609 775 1487 -484 -1510 -680 338 654 498 -598 -872 514 1103
2298 1103 72 -318 356 76 -226 519 517 -464 -574 -101 113 -77 125 -502 -1127 46 1101 258 -990
2317 -990 -558 339 872 674 -223 -756 -140 1008 663 -284 -535 -163 -130 216 281 -365 -902 -403 306 403 98
2338 98 -244 -657 -45 1110 960 -271 -713 15 854 853 -15 -841 -732 339 762 14 -808 -765 -279 336
2358 336 486 7 -535 -380 390 752 481 50 -427 -222 737 912 33 -771 -769 253 696 286 -779 -974
2378 -974 -31 782 466 -391 -731 -261 531 656 303 -355 -466 209 760 542 -50 -566 -414 237 597 171
2398 171 -685 -1012 -129 400 724 -269 -1081 -465 677 1236 37 -732 -268 568 780 445 -373 -587 -14
2417a4N24k30m06m18j73M30O87R3r08n01N87P89M36l18j166l36J143J257p09j489
2437g22l82J027R29j38j342n38Q54R78m61o18J76J20m11O66O83o17o59K20N12
2456B77M04J62p60r89K78J619J8j554p23N67J256M75j099j608O93K165q9j699
2474f07jJ001j05l15P50o1j202J6N31L36L52l13j541m36J944J062j266j384n7
2493a296J008J538J77k198j164K276J912j917j578J435O54j141j93R07j05m66
2509a51k44l02O04J000p54j696R72K005q25j485M44N23L90R90r84k589J136L435
2527B469o84l648N8K264M42p43n93m69K60R47l53l63J272K8k611J50L392N79k893
2546d96q96J018N13J143O32k937k064L081K461k206k057J192R48j52j1m78j53
$$ plain form
2417 -14 510 280 -126 -544 -717 -287 400 493 -415 -916 -329 460 896 578 -588 -924 219 1476 767 -722
2437 -722 -1104 -77 852 714 -628 -1166 -312 666 205 -413 -237 -117 -528 138 821 204 -455 -235 277
2456 277 681 843 83 -906 -628 991 1009 -545 -1268 -701 555 1030 -69 -1677 -984 1181 1092 -607
2474 -607 -608 393 288 -27 723 662 -540 -524 7 343 695 382 -1159 -1595 349 1411 145 -1239 -1296
2493 -1296 -288 1250 1427 -771 -1935 341 2253 336 -1242 193 847 -294 -487 420 315 -151
2509 -151 -395 -697 -93 907 153 -1543 -571 1434 609 -876 -432 91 481 1471 487 -2102 -966 2469
2527 2469 1785 -1863 -1805 459 901 158 -435 -904 -644 303 -50 -413 859 887 -1724 -1574 1818 2397 -496
2546 -496 -1392 -374 139 1282 1914 -1023 -3087 -6 2455 249 -1808 -616 332 180 169 -309 -462
2563d62J448n02k022J172K873j509l202J552K646j479j579Q67K24k40R00o90j998
2580b001J455K808j452k960Q35K082O04j95j386j762J624K895j722k587J989J237
2596A464k944j63L364J10l278o22J371J209J333n81l563m17M205J312k744j239
2612a183N27L65J121P94k064j352K602M18k980M90L441j223l452J143K921n99
2628I69j403r8j72R76J348j658j771K204K025k494j869J943Q31m89M72j354k079
2645b619K238L255k069l247J738J928j451j56J541n07j450J81M85Q00J399j246
2661H20l858R95M693j57l672o28J191K72J305O64k516j461K911J110k120j04J850
2678A295q87j576J141R65l02l53r37p48J906J604k616k109K780K009k620j110
$$ plain form
2563 -462 986 484 -1538 -366 2507 998 -2204 -652 1994 515 -1064 -197 27 -213 687 -3 -2001
2580 -2001 -546 2262 810 -2150 -1315 767 1371 1176 -210 -1972 -348 2547 825 -1762 227 1464
2596 1464 -1480 -1643 1721 1831 -1447 -2069 -698 511 1844 1263 -2300 -2717 1488 2800 56 -1183
2612 -1183 -656 -291 830 1624 -440 -1792 810 1228 -1752 -1262 2179 956 -2496 -1353 1568 969
2628 969 -434 -532 -704 272 1620 -38 -1809 395 2420 -74 -1943 0 831 342 814 -540 -2619
2645 -2619 -381 2874 805 -2442 -704 1224 -227 -383 1158 651 -799 -618 -133 667 2066 820
2661 820 -3038 -2043 2650 2493 -1179 -1807 -616 -344 961 1625 -891 -2352 559 1669 -451 -555 1295
2678 1295 408 -1168 -27 938 636 283 -654 -1402 504 2108 -508 -2617 163 2172 -448 -1558
2694a558J669N28l46L45j016j223J926J980j872k102J268J062l40J35j68j102
2710h14J95R53o09M9J456j150k596J403L640p48l185j59J530Q12Q05p33k309l8
2728a498K479N44j851k40M75n34K66J042m75q09M81r1o01J397J044k061j323K230
2746D75J425j687j365P59P94K49o5j344o27J709R26j467j015Q48M18P7N84m06
2764B88j311P07J114l76n32P52n05j299J149J604p14k063j88J213J086J86j331
2781b20j579J069K036k95j446k24M27J32P01L58j066p29Q38M64l08O6P6j173m4
2800i17J487L61j231o99L67Q93N72m57j173r0J544N96j124p35M17K69K95K25n67
2819C3q41M96O39r5k05j39n24l2R58N00o85r44L02P71O62j84j220n29R73J175
$$ plain form
2694 -1558 111 639 293 638 -378 -1601 325 2305 433 -1669 -401 661 321 456 288 -814
2710 -814 -619 334 -275 -226 1230 80 -2516 -1113 2527 1779 -1406 -1565 -35 777 1582 849 -1460 -1498
2728 -1498 981 1525 -326 -566 -91 -625 -359 683 208 -601 -120 -211 -812 585 1629 -432 -1755 475
2746 475 1900 213 -1152 -393 401 650 585 -759 -1386 323 1249 -218 -1233 -385 33 110 694 288
2764 288 -1023 -316 798 422 -110 642 137 -1162 -13 1591 877 -1186 -1374 -161 925 1111 -220
2781 -220 -1799 -730 1306 1011 -435 -659 -232 -100 601 959 -107 -836 2 466 158 224 300 -873 -917
2800 -917 570 931 -300 -999 -632 261 833 376 -797 -887 657 1253 129 -606 -189 80 375 600 33
2819 33 -808 -312 327 232 27 -112 -636 -668 290 790 105 -839 -537 234 896 712 -508 -1037 -64 1111
2839A111l43j154l59L72O50L73n19p35q6O62N06j53l97l47j0N04Q49l20j030l05
2859g31O40Q41J5p77r30L65J097K59p90q13J53P85L69n7q66k93O13Q04n0m73n39
2880c78m7N57O12j23o83o10K71Q25K89n65r41j28R19P33l30r81k86P17P61J37
2900G49o30p27J52R38K56l93p03j95L53M43J83m80n84n8O39N27qp61n94N85J000
2921F92K29r08o82L08R46L00n02j064n8Q89M76l68o60k14J76O31L56n64m86L9
2941d64M31N04P2l02n04k60P76O91l59j067l75P35Q80J7j242o03O62J105k07q16
2961c26j56K73K74M20o6o45k04L97M75l0k07m38k56L48P82j48o95o20J18J027
2981C23P18p41j543K77J689L30j116n83K64M79L87K17p39m26J43N64J2j01k00
$$ plain form
2839 1111 768 -386 -745 -373 277 650 131 -604 -690 -28 478 325 -72 -419 -429 75 924 604 -426 -731
2859 -731 -91 750 765 -12 -942 -577 520 779 -11 -824 -671 114 483 426 -440 -733 -120 684 634 161 -378
2880 -378 -425 132 744 621 -62 -672 -401 424 713 148 -793 -921 -2 731 401 -580 -866 -149 612 749
2900 749 119 -608 -456 482 738 345 -358 -553 -200 243 426 -54 -638 -696 -57 470 462 -299 -893 -308 692
2921 692 921 13 -669 -361 585 885 383 -681 -739 150 626 258 -402 -616 -440 191 547 -17 -503 -464
2941 -464 -33 471 543 241 -263 -523 253 944 585 -482 -857 -122 758 775 -467 -1070 -408 697 490 -326
2961 -326 -482 -209 65 485 419 -226 -430 -33 442 412 205 -233 -489 -141 641 493 -202 -822 -704 323
2981 323 1041 300 -1243 -966 723 1053 -63 -646 -382 97 484 701 -38 -464 -321 243 255 154 -46
3000d6n87j9R67L60o91l90j33J71R38N97j423j068J311J389q06j260K44O24L50
3019E28p0o38m87N57N34m62l19M82l14m87Q96N82q20o53N12K45L6Q45m39j905
3039a377M74K120K30j697q83N41J006N56n88j339K02J155J15r24O47L00j242o1
3057g65J483K74j140r5J28j51P57M92j297j131J403J018p73q58L7L57O38L40j249
3076e32n27J680N27j580m13J283J7p77M89M63p54m86P47q0J32L38q21j175J147
3095c22J637o59j388j02N00Q24J008p80k272N41K345l22j533L57M77j006K44J133
3113F82j73r02m2j21K82J206J2j743l97J744N18j032k17L1l05Q11O76j286q81
3132a137J608P88k008l98J449J86o56J44j61k52N60L75r06K75R20r10r04J359
$$ plain form
3000 -46 -633 -652 315 675 -16 -406 -539 -368 570 1167 -256 -1324 -13 1376 570 -690 -446 178 528
3019 528 458 -180 -667 -110 424 -38 -357 125 -189 -676 220 802 -18 -671 -159 86 122 967 528 -1377
3039 -1377 -903 1217 1447 -250 -1133 -592 414 970 382 -957 -755 400 515 -409 238 538 -704 -765
3057 -765 718 992 -148 -243 -115 -266 491 983 -314 -1445 -42 976 203 -655 -618 -261 377 717 -532
3076 -532 -1059 621 1148 -432 -845 438 455 -322 167 630 -124 -610 137 57 189 527 -294 -1469 -322
3095 -322 1315 656 -732 -834 -334 490 1498 718 -1554 -1013 1332 1010 -523 -166 311 -695 -451 682
3113 682 509 -393 -435 -556 -274 932 944 -799 -1196 548 1066 34 -183 -152 -457 354 1030 -256 -1137
3132 -1137 471 1259 -749 -1147 302 488 -168 -24 -185 -437 123 498 -408 -133 787 -123 -1027 332
3150C32J236j419j171O60L51L75P49r68k063J040K266m33j630o5N98j36P41L79
3168H42j135n6M41l59P5J256j79k089O7K008R5j333m8O3j23Q16N87j371n97J536
3188D96K88j127j88P99%j83K31p28p1J085k9j258L15R97p68p76J189O76j329n11
3208h92Q19J99L18K42r05r23J065J495q32j122j1K79N38M51l31j216K30R90m45
3227e1j58P33k39j374N37J635l12j133l3K01L48N76j29j165O3R68J26q31J9K16
3247ck62M93N9p17k59J120l8q60K25P57n20n10Q56L18p56k42M16J88P1J7p96m15
3269h58J203M65r45n41K46L27L32M94o26q98O01P45p2n69K27k20l30N25M93k87
3289C12p77q1L39M26L29o44q18M50J048j72o64k3K47L9M07L4p08n4N03J27l21
$$ plain form
3150 332 1568 149 -1022 -362 -11 364 1113 145 -1918 -878 1388 955 -675 -740 -142 -278 463 842
3168 842 -293 -349 92 -267 -192 1064 885 -1204 -1137 871 966 -367 -415 -352 -475 341 928 -443 -1040 496
3188 496 784 -343 -531 268 268 85 316 -412 -483 602 573 -685 -370 627 -141 -917 272 948 -381 -892
3208 -892 -73 126 444 686 -219 -1142 -77 1418 586 -536 -547 -268 270 721 390 -826 -596 394 -51
3227 -51 -209 524 285 -1089 -552 1083 771 -362 -395 -194 154 730 601 -564 -501 467 593 -238 -219 -3
3247 -3 -265 228 287 -430 -689 431 393 -467 -242 515 -5 -515 341 659 -97 -339 77 265 336 353 -443 -858
3269 -858 345 810 -135 -676 -430 -103 229 723 97 -801 -200 545 473 -96 131 -89 -419 106 599 312
3289 312 -465 -546 -207 219 548 -96 -914 -464 584 412 -252 -275 -28 11 418 452 -256 -310 193 320 -1
3310ao7K10m52P9M86j9m23j10J58K34K57k11o03OP80L89n86m69O3L43L07j14m87
3333b30k23L10N05j82l11J6o6KL57Ll21j74R6L80J95n8m60k76M98M74k51n12j34
3356c62K30M14L8l49l08l0N50M9k06r9q1ML11Q3j06l65j0L17K43m4l33k12J53
3379a13L66J27m32l31J42L29J68j47l83j42N16L00j13k88k13J07K46J48j50k80
3399a43k6J33K31l0j75l83O5M36K37k63l92K3L29K67l2k60l24J21O04j07k18l29
3421b36j00M01P1nl54l9J13K46J12k48j66j19K99K69k9k98q0Q4K60J61k08l65
3443b31r1M66R9j43l28o1P9K94K27l15k30MM30J03k27o2R6j15J45P2j69k00m4
3466b01J03L77k9m94k44M29L91j69l78rQ8K06K51j73m52N6L72K60n6m38j3O4K98
$$ plain form
3310 -1 -68 142 -310 -231 255 236 -187 -297 -139 95 352 141 -462 -456 324 713 127 -342 -279 64 371 257 -230
3333 -230 -453 -143 362 180 -131 -115 -181 -179 178 181 -140 -314 -218 162 357 299 -161 -437 61 535 284 -228 -362
3356 -362 -132 282 320 -29 -337 -367 183 232 26 -73 -154 -150 161 244 138 -227 -237 80 323 279 -54 -266 -113
3379 -113 253 380 -52 -383 -241 88 256 109 -274 -416 100 400 287 -1 -214 -107 139 287 137 -143
3399 -143 -169 -36 195 165 -10 -393 -328 108 345 82 -310 -287 42 309 277 17 -307 -186 418 311 93 -236
3421 -236 -336 65 136 131 -223 -262 -149 97 209 -39 -205 -324 -25 244 215 -83 -163 -79 181 342 134 -231
3443 -231 -322 144 243 100 -228 -289 -210 84 311 -4 -234 -230 200 303 76 14 110 -5 140 212 43 -157 -201
3466 -201 -98 279 250 -244 -488 -59 332 163 -215 -224 -136 70 321 148 -304 -248 124 384 328 -110 -123 -59 239
3489B39N3l08Lj37L5N7M72l70m65O5O59J10l50k62J68P7K10pk54j91J72J59p0
3512F5jj61j30K07K18k27j86J58J41k95L22J69k83l72M82M22l22l62M1J08L56
3533C50n3m28l54L67L94k01k76K46k55p1N68P7o30k2L23J09o8J65j00n28J17O28
3555C58n2m69o2r2J83M02M9n81j72N48Q0m31L17J10l96J70L62j67m02L90J16m02
3577a41M3L21l04j11L10P3k91j38J99j27L68J50n67m92P90N56n36o13L82J40P0
3598H2L31j73o30J73L40j68J4L04l24o21M16P09l82k22Q9j19n4P41J14r85K6O23
3620B84N5n59J80J13k48J20J95k50k2M19l12m63M07M15m82j62N44j82k96L43K36
3641C35l59Q9J00l47l29O96L90o73k63K95M3M4K55l70n24M97M93k58r5K64j53
$$ plain form
3489 239 292 -16 -13 -150 -115 -58 414 44 -421 -356 303 413 63 -199 -31 46 256 249 -5 -196 -24 135 65
3512 65 64 -97 -227 -20 198 -29 -215 -57 84 -211 111 280 -3 -375 107 529 207 -155 -114 -6 350
3533 350 297 -131 -485 -118 276 75 -201 45 -210 -281 287 364 -266 -288 35 144 76 241 141 -387 -270 358
3555 358 306 -163 -225 -317 -134 268 317 -264 -436 112 192 -239 78 188 -208 -38 324 157 -245 145 261 -141
3577 -141 -98 223 -81 -192 118 191 -100 -238 -39 -166 202 352 -215 -707 83 639 103 -510 -128 12 82
3598 82 413 240 -390 -217 123 -45 -31 273 -51 -672 -256 453 71 -151 -62 -181 -235 506 620 -365 -339 284
3620 284 339 -220 -40 73 -175 -55 140 -110 -132 287 -25 -488 -81 334 -148 -310 234 52 -244 99 335
3641 335 -24 65 165 -182 -511 185 575 -98 -361 -66 -23 21 276 -94 -618 -121 372 114 19 283 130
3662A30n25N48N18q21j87K89j06P0M70j85q57K01P38r7j68m1r2k15M51K51n04
3683a32L5M14l48l83O69J54n69j42N13k44k73M37jl36J08K74l42j64O25P8o65
3704b92R9J81O7J09J54n30l62Q06K60n29j59K85k21p9M33L9n16p1L09k7O4L39
3726C59k57n59N01M13l17k53J50k31J08K70q4m09J06L47r7l60M66Jm05R4M32j05
3748A70l19J53l3j12K39J30l02q2M44j43m24K43P4k12Q9J58l39j51O14j3l18j7
3770a51K99j69K7K34p1k51j00K40p2J67l1k96j34L55K43m33nJ10p0O8L62j68m08
3793b54J47N13l42j33J47j10j25O2K33j48m9K1j8p1K52j05j86J75J70p7l22K33
3815A3J00n1P0r1l6n4K01r8k27M2J46Pp3O4n9j55P3J63j88K02m6k55J13L61o0
$$ plain form
3662 130 -395 153 671 -150 -337 -48 -154 -84 386 201 -656 -455 283 186 18 -23 -115 -330 121 372 -132
3683 -132 -97 317 -31 -414 255 409 -160 -302 211 -33 -306 131 130 -206 -98 176 -166 -330 295 373 -292
3704 -292 -193 -12 55 164 318 -212 -574 232 492 -37 -196 89 -132 -211 222 261 -255 -326 -17 -44 20 359
3726 359 102 -457 44 457 140 -113 37 -194 -86 184 100 -309 -203 144 47 -313 153 154 -251 -157 275 170
3748 170 -149 4 -29 -141 98 228 -74 -156 288 145 -279 -36 38 -174 -85 73 -266 -417 197 184 -134 -151
3770 -151 148 -21 6 240 169 -82 -182 58 -14 153 122 -174 -308 47 290 -143 -148 -38 -108 -40 322 154 -254
3793 -254 -107 406 64 -69 78 -32 -157 -95 138 -10 -59 -38 -56 -127 125 20 -166 9 179 102 -220 13
3815 13 113 62 132 41 5 -49 152 54 -173 -131 15 22 -51 13 -46 -201 -128 35 -153 49 3 -252 -139 222 162
3840A62k44j1qQ8J3J77j32k34K31N0j0j72R7j8M1n7J37q8j34J34N2m9Q9j70J9
3865c7N3J39q1j58L9j05J08J11Q1k53Q6N9P3l37J98m7R0J08n3j53PO8L5P6L4j48
3891gn7L1J63m1j82R5j7r0P4O3j26OJ47L6j17%r6J49J8J52m7k18N4o2K2j3R2j31
3919a02q3J70Q8k16j1J5K48q2rk3jm7R2j2j01J37k40K48Oj04o3N1n2M7N3K0o9
3946d0R4pL0m1j1p9rJ14J1Qr3O5j6L6j34R5l9n6n8O7K8Ml6J07nj06J11j99J75
3975A6k4M1J2k8q0Q5n1M2j57L0N3l5J49r5rm6J79j39J19l0p4Q3Q0j67m5N0K2J22
4003A03j43o3m2J24M5%K5J9j31m1J09L9j9j59K33j53k4J19l6mJ10j32M2Q7n0j00
4029d2p7J98j77j01Q6J88j16J3K5n6m5P3J85p4j90J03j20J30J59j94j48J25N5
$$ plain form
3840 162 -82 -93 -101 -13 0 177 45 -189 42 92 82 -90 7 -11 30 -27 110 22 -112 22 74 25 114 -56 -37
3865 -37 16 155 74 -84 -45 -150 -42 69 150 -103 -17 42 115 -222 -24 -71 19 127 74 -79 -72 -4 31 107 141 -7
3891 -7 -64 -33 130 89 -93 2 -15 -105 -31 32 -94 -88 59 95 -22 -22 -118 31 49 201 154 -64 -10 -72 -50 -63 29 -102
3919 -102 -185 -15 73 -143 -154 -139 109 27 18 -5 -6 -53 39 27 -74 63 -177 71 77 -27 -90 -39 -91 -44 9 29 -40
3946 -40 54 47 77 36 25 -54 -63 51 62 70 -23 42 26 62 -72 23 -16 -72 -130 -63 -35 -31 -67 40 35 -71 40 -159 16
3975 16 -8 33 45 17 -63 22 -29 13 -144 -114 -61 -96 53 -42 -51 -97 82 -57 62 32 -42 41 121 -46 -91 -41 -19 103
4003 103 -40 -103 -145 -21 24 24 49 68 -63 -104 5 44 25 -134 99 -54 -78 41 5 1 111 -21 21 108 58 -42
4029 -42 -119 79 -98 -199 -113 75 -41 -28 -3 -59 -104 -31 154 80 -110 -7 -127 3 162 -32 -180 -55 0
4052@K1j27J13j53L5K33K5q2j72Q3Q2j82K83kj84n3J05J1j69K54p9j42R5M8j72
4077a29J2K46r0k17J63R6j68R3J66k03q9K23L3j95j35J96L5J7R5m1k27M1J76j65
4101f7P3J75k45j07J14J56n8j42M5k6PK52j09%j71M9m6NK22k54k7J41J32o0p4
4126a5J08j11j53J97J00k39J25N4j21J20N8q5q3N1J20k66l5K41R1k58M9J54j83
4149h1J06J46j01l12J61J18o2J4J39j51p6Q8O8o2L9p8j2o6K67L5l86J58J07r1
4173c2R2J25l23kJ65J71k01J01l7m7j06J66M4k69K00j5p9M1J85j36j68J40Q2j74
4197g7J33N3r7j02J75lj91J15P8j02k00J72R4o1k3J1j02M6J66m3o6Lr1J16N8J09
4223A71k03j81J77J09j43J14l1rj61K18Nk40Q2J26n0K5J86j11k15J49R0q1L6M5
$$ plain form
4052 0 21 -106 7 -146 -111 122 147 65 -107 -24 58 -124 159 157 -27 -80 25 36 -133 121 42 -100 -5 43 -129
4077 -129 -117 129 39 -178 -15 81 -87 6 172 -31 -120 103 136 -59 -194 2 37 54 149 108 -119 -78 98 -67
4101 -67 6 181 -64 -171 -57 99 41 -101 -56 -82 -75 177 68 68 -103 -54 -100 -95 127 -127 -154 -13 119 59 -15
4126 -15 93 -18 -171 26 126 -113 12 66 -55 65 123 38 -45 6 126 -140 -175 66 157 -101 -52 102 -81
4149 -81 25 171 70 -242 -81 37 -25 -11 128 -23 -99 -11 57 -5 34 -44 -56 -122 145 180 -206 -48 59 -32
4173 -32 60 185 -138 -140 25 196 -5 96 59 12 -94 72 116 -153 47 32 -47 -6 179 43 -125 15 97 -77
4197 -77 56 109 12 -90 85 82 -109 6 84 -18 -218 -46 48 -13 -36 -25 -127 -81 85 42 -24 -21 -112 4 62 171
4223 171 -32 -213 -36 73 -70 44 13 4 -157 61 66 -174 -92 34 -16 9 195 84 -131 18 108 27 63 108
4247A08j41k07K31l1J7O4Q9j15Rk5n7j5M2k9J8L0L4L3q5J42J0j75J4K1L6k88L40
4274G0j2n9kM5j12j25K87j66k1Q7Ll6m9J90k39J10N0j52O8OJ36Pj57M8M2N1j76
4301a06K04k45L4J76rj32J48j6J4o9K3M8j73J02o4Q4q9P3r8l3K41j19n2RlR9j4
4328C3k3R5m9NnMj04J0J34j62R6qj7O0p4j43J62LK3j57J03M3j28J23k7J49j27
4355A9m0J13j36KQ2Pj35Q0L1m0m2M4Ql9o6J01J08q0PR8k04M0L5l8KN8j9oj07P1
4385d6N6mk4M9j1m8P2p2J1l9J24r6Q2m0m6P5p9K6o3J02m9j05J64n8j14J28M1m8
4413a2KL5J5Mn2MK6r4K4J2O9k7j8K0n7P1J7j74rM7K06j34KN8r7N0R5o8J0j62N7
4444h0M6n5P1M2M6n6j46J14J14j34LoM2j17J61op7j8qM6M2q7J28J1l8l7q6J63
$$ plain form
4247 108 -33 -240 -9 -40 -23 41 130 15 24 -1 -58 -73 -31 -60 -42 -12 22 55 -30 112 122 -53 -39 -18 18 -270 70
4274 70 58 -1 -3 42 -70 -195 92 -74 -95 -8 -5 -41 -90 100 -139 -29 21 -131 -63 -57 79 86 -71 -23 19 70 -106
4301 -106 98 -147 -113 63 54 -78 70 54 68 -1 22 70 -103 -1 -65 19 -70 3 -95 -128 113 -6 -58 -49 -52 47 33
4328 33 10 105 56 61 56 60 -44 -34 100 -62 34 26 9 69 -5 -148 14 17 40 -117 -14 29 -99 24 -3 146 19
4355 19 -21 92 -44 -42 40 47 -88 -8 23 -17 -59 -15 -7 -46 -112 -11 97 17 24 122 -82 -42 -7 -45 -43 15 -4 -10 -117 -46
4385 -46 10 6 -18 31 20 -28 44 -28 -17 -56 68 -28 54 14 -32 43 -36 -10 -73 29 -20 -125 39 -19 -133 -5 36 -12
4413 -12 -10 25 40 44 -8 -4 22 -72 -48 -36 33 6 -12 8 -49 22 39 -135 -144 -97 109 -25 -23 35 -62 -12 83 15 25 -137 -80
4444 -80 -34 -89 -18 24 70 14 -132 -18 96 -38 -35 -41 1 -116 45 39 -38 -56 -64 -18 24 -63 65 76 38 1 -85 78
4472G8J1r3Q5l0q8Q1r5J38j04Pr2J09j35J19J3Q1j83R9L8j63Q6r9J42L3j20MP0
4499hM2K5o8n1O6RJnr4M5o0M3J04k0k0lJ2m4O6J0j19O3R6j97J6O8j0nm5M7J22
4530H6j19K2k3L7Q9o2j8j7N2q5qP9M7j24K17k35J32j17O5j1n1J44j04J09j18P5
4556F2O1j38K1J9q5J37p5kp3P7l4K5J47j48l1j8J06o4J38o4r4k2Q9O8j44M1q7
4583h8M2K7N7r5J3N6o1o1J85j22PKN2m6j01J84o6P7o4L9j09J06P8j52q0J03N0
4610C3J5m2O6n9j80J09J43j02L7j15Q1l4R6r8M1j8rK5p0m4J05L9j27J09N3q7j1
4637d4Q7j42J31k0l2J4N6o1N3l3k7l4Qj50J36r2K14j16%N5k3J27r0k8R5j52N4
4664a4m2O0k2O2O7l4j14j1oR9j21O1J4M9p0P2L3j05L6j03J16r2P8l1Q6k29J46
$$ plain form
4472 78 89 -4 81 51 -37 44 -51 87 -17 -10 -102 7 -128 -9 4 85 -98 1 39 -124 -38 -137 5 38 -82 -78 -8
4499 -8 34 59 -9 -60 6 15 16 11 -83 -38 -98 -55 49 29 9 6 18 -26 40 50 -69 -6 90 -107 -91 -23 -33 -38 -83 -36 86
4530 86 -33 -11 -34 3 92 30 12 -5 47 -38 -46 33 80 -44 173 -62 70 -47 18 7 -44 100 -4 105 -13 62
4556 62 123 -15 6 25 -60 77 2 0 -73 4 -30 -5 142 -6 -37 -55 51 -13 125 61 -33 -55 34 102 -42 -1 -88
4583 -88 -46 -19 38 -57 -44 12 -49 -110 75 -47 -40 -38 14 -32 -133 51 -15 62 -2 37 -72 34 112 -40 -120 -17 33
4610 33 48 6 72 13 -167 -58 85 -17 20 -95 -14 -48 48 -50 -9 -27 -36 -11 -81 -125 -20 19 -108 1 54 -33 -44
4637 -44 43 -99 32 12 -20 -6 50 -11 42 9 -18 -52 -44 -194 -58 -150 64 -52 -52 3 -20 107 17 -11 84 -68 -14
4664 -14 -56 4 -18 44 111 77 -37 -48 -54 45 -76 -15 -1 48 -22 50 83 -22 14 -89 27 -65 13 -18 68 -161 -15
4691a5N1j2k9r7Q3k1Q5j28J23J2q0m0L6K5k3J10j74J63j37P9q0L5K8m0JL9PKK1
4720B4n9l2P2j5JL2on1J11j27qJO1r5J66Jj07L7O4j77J76n5mk05K09K8q8K5J11
4749I0Jk3j48k5J96q3J5k0p7J03j09Q3J6m2j8J57P9j84N0j26L3J15j06Q0O0j78
4775f1N4M5m2k7RQ8j64J23r2Q4j16P1n1J88j35n4Q0J8M1j49K5J81p2j09O5J9j9
4802@j6m3M1Pp7KR3J31n8o7r3J89j44O3r8J49m5j13J03J3l7Q9j15N4l0O6n8K2
4830B8o5Ql2J25n7l3ln%pQ4j3J9M1o1J1p6m9J69j06L5j45K16Lp3K1j2K2m8%j7
4861b0j00J42Q0k1o3Lj8K2Om9j1j3J7q2J90p7q4L7k4P2p0M5J4l8p8J63j78J83
4889D8n7l4m7J08j8l1L6k1K2k4mKM6R5n5n8mNPMj4n3mK0J07j50MJ23j25R5J3k4
$$ plain form
4691 -15 36 24 -5 -102 -19 -40 45 -83 40 52 -28 -68 -32 -7 -30 80 -94 69 -68 11 -69 -34 -6 -46 -45 -6 1 3 24
4720 24 -35 -67 5 -10 -9 23 17 -34 77 -50 -58 -57 4 -91 75 76 -31 6 70 -107 69 14 10 -195 14 42 -46 -21 90
4749 90 91 68 -80 -105 91 8 23 3 -74 29 -80 3 19 -23 -41 116 195 11 61 -65 -32 83 -23 57 117 -61
4775 -61 -7 38 -4 -31 -22 66 -98 25 -67 17 -99 -28 -79 109 -26 -80 0 18 59 -90 -65 116 44 -65 0 19 0
4802 0 -16 -59 -18 -11 -88 -86 7 138 80 13 -80 109 -35 28 -70 79 34 -79 24 37 0 89 -26 28 -2 64 6 28
4830 28 -37 -29 -61 64 7 -26 -29 -34 -34 -41 43 30 49 90 29 40 -36 -85 84 -22 13 -132 84 87 14 35 23 45 -3 -3 -20
4861 -20 -120 22 102 81 18 21 3 25 31 -18 -29 -42 -25 -107 83 6 -78 -41 -65 7 -63 -18 -4 -42 -120 43 -135 48
4889 48 -9 -43 -90 18 0 -31 5 -16 6 -18 -22 -20 26 121 66 8 4 9 16 20 6 -47 -51 -31 76 -74 -70 53 -72 23 36 12
4921A2r7MR8Klk9O1Jnj62J30P7j2l0Qr7j0P7j40M2Q7k7n2P4Kp3J03n3O4pj37P4
4953a8N1q0R4JN6j51M6r5M1N9o1P5Rn3j7O3J1p1O6J53j60L9%p1K8Rm3j8p2J61
4983E2j26P8J02j41N2K5p1M7k0k3J70k30J2J50p0k2m4Q5ok7oj1l3J02j2o2P3k1
5011B3J6K4n2nQk6L4j42J52p7R4l9m4m5J13j47J36p3r8J21L6P8n6j68J89j2q7
5038d7J03r2j0m3J8J14K5j38K6j1Q6l5lN6o6Q6j52R2R3jj90Q4Q2l1k3N9k8r6N7
5067A5j23lJ09M7n2j26J84o6K4Lp6M7M7l2n2J71j37L0j51Q7j6R8om6l8J4J03L2
5095H7k2l2Ln3l4l6J03N7m7R2n1j93J37j23N1p8K26j05l5N9M2J6j47O7m0J48m
5122H8j33p5O1J29Pr6k4m3O8J20o7k20K21l1%o1J39p1o2l2J68l2r4M9PO1n4O8
$$ plain form
4921 12 -85 -81 17 19 16 -13 48 49 44 -118 12 89 77 47 55 -42 -52 25 -115 -73 14 -13 -65 9 11 -62 41 -12 52 45 -92 -18
4953 -18 33 -47 47 48 104 -47 -1 -96 -55 4 -57 18 27 -26 -43 20 31 -40 26 179 19 58 58 -13 15 24 -19 -37 -109 52
4983 52 -74 4 106 -35 17 42 -29 18 -2 -25 145 -85 -73 77 7 -15 -59 26 20 -7 -13 -24 -57 45 33 -29 44 23
5011 23 39 63 11 6 14 -12 22 -120 32 -45 49 10 -34 -79 34 -113 23 -50 -148 -27 9 87 31 -137 52 40 -47
5038 -47 56 -36 -46 -89 -71 43 68 -70 -44 -55 31 -4 -7 49 -17 69 -83 9 102 101 -89 -5 77 46 23 82 54 -42 15
5067 15 -108 -111 -2 45 -7 -133 51 -15 9 12 -64 -17 30 -2 -54 117 -20 10 -141 -54 -70 28 22 -24 -62 -48 55 87
5095 87 65 33 36 -17 -51 -87 16 73 26 118 67 -126 11 -112 -61 -139 87 -18 -53 6 48 64 -83 -16 -56 92 88
5122 88 -45 -120 -59 70 77 -19 -43 -86 -18 102 35 -185 36 5 5 -56 83 12 -50 -82 86 54 -40 9 16 77 23 91
5150I1j48M4J51l0j21QJ96j59o8K7m0r7J12J30kj49J10k1q6J86m5k51J03K2j30
5175a67L44o5j08j12N9J38j14P5m9q2k2K10m5j51J79m6r4J9j1K66k67J4O8K2k1
5200D0P4j83K0J6O4%KJ7j08l5O0O7j53J48Qp3l8M4J10r5M3qj27J75M1k17L2O3
5228a3K2n6R5K8j34l0J24%m2lJ5j28J21J38l9j10K2O6j11J28j1k0j80O0J40p2
5254A0j09J14M2j36J04n3M7K8O3j00k6n6RN1P0j2k86J76J00l6o2Q2J5PRJ03j67
5281a3q6k7J61o6MJ03j30k3J17P8j15Mk1j48K32J9k17qP1J30o6K1K7l2j57K54
5307A12j28l4J53o5j19J1K20k02o5J6J02k0l0P6k7l6J18j12Q0m3k8Q4Pj01Q3k6
5333B6q9J22k4n2k8j01J48P7k10N5Q9L3L9j14j7K1K5N4n5j53J15Q2Pr0o3N9J4
$$ plain form
5150 91 -57 -13 138 108 -13 -5 191 32 -36 -9 -49 -146 -34 96 94 -55 55 34 -52 134 89 -162 -59 -37 -167
5175 -167 177 112 4 -108 -49 89 -25 50 1 -81 -103 107 62 -89 90 44 -50 -31 -42 224 -43 -29 39 61 40
5200 40 114 -69 -49 -33 31 31 33 50 -58 -93 -33 34 -119 29 37 -36 -74 -30 80 -15 28 20 -107 68 109 -108 -76 -13
5228 -13 9 -47 48 76 -58 -88 36 36 -6 -9 6 -122 -1 137 98 -12 10 76 -35 93 82 62 -118 -58 82 10
5254 10 -99 15 57 -79 25 -28 19 47 110 10 -16 -72 -63 -12 58 46 -240 -64 36 0 -62 20 35 42 51 154 -13
5281 -13 -99 -126 35 -31 -27 76 -54 -77 40 118 3 7 -14 -162 70 89 -128 -136 -65 65 -1 20 47 15 -142 112
5307 112 -16 -50 103 38 -81 -70 150 -52 -117 -101 1 -19 -49 27 0 -36 82 -30 50 7 -21 63 70 -31 52 26
5333 26 -63 59 35 -17 -45 -146 2 79 -131 -76 13 46 85 -29 -46 -25 0 54 -1 -154 -39 43 50 -40 -103 -44 -30
5360c0J5P2Lj41J71j68m8J03R2l5q7L9K1N3m5n6J26j75J31o4K8j11N4P9p4O3k4
5387hl4K0P0r1Q0p4R0j07P9j16j9J84r6O1o3QQJ9L8r6ON2k8J06o1O4j81R6J1J9
5417C7O0j48pJ93n7j61J39j60J06pQ9j34N8J2p0R3j3j03j5J34qM0o0k00K13k2
5443IQ2k09J04N1JJ5J1m0o3m2N4K04k56J02k0MK0L5O7k34K0J01p0J45j43p0P4
5470d8J37j44Q5j57J24%K2M6j26J39j3o9M7j71J96o1R8q1K5o1p5K2Q4m9J00o8
5496Bl5M8Q6j35m7R1M1p4%J7j06J76j64K36j70lM4l5M6Q8m2k52J88oK8J4o6r3
5524a23R2K8Jl7M7k8M0J6n8q5P0p6J74q0N0n4M4Q9j58O3q1j0R5Rl0k1K0J11o7
5553D1m0K9J1q6K3J06r1Lo5M2PJ16k24k3K03o2k9J22n4j33M7R1K9J8r8m7J6R8
$$ plain form
5360 -30 -15 57 60 -81 90 -78 -126 -23 69 34 -53 -14 7 60 15 -41 85 -90 41 -23 5 -106 -52 27 -47 16 -8
5387 -8 -42 -22 48 -43 37 -37 53 -54 25 -91 -110 74 -22 39 -24 -16 -8 11 49 -47 -41 11 -17 89 28 92 -89 7 18 37
5417 37 97 -51 -58 135 78 -83 56 -104 2 -5 84 -50 8 20 -50 43 30 -73 -88 46 38 78 18 -182 31 9
5443 9 91 -118 -14 37 38 53 64 24 -39 -81 -27 177 -79 23 3 7 27 62 129 -105 -85 16 -54 91 -52 -122 -48
5470 -48 89 -55 30 -127 -3 -3 19 65 -61 78 65 -4 43 -128 68 7 105 24 49 -12 -87 -65 19 -30 70 2
5496 2 -33 15 101 -34 -81 10 51 -23 -23 -6 -112 64 -100 136 -34 -37 7 -28 18 106 64 -188 0 -6 22 36 -30 -123
5524 -123 -31 -3 -2 -39 8 -20 20 36 -22 -107 -37 -113 61 -19 31 -23 21 110 -48 15 -66 -76 19 28 -2 -23 -3 108 41
5553 41 1 30 41 -45 -22 84 -7 -4 -69 -27 -20 96 -128 -151 52 -10 -39 83 29 -104 -57 34 63 81 -17 -64 -48 50
5581E0k0j94jJ70Q4r6j22J17j17L25l20N3L5O7Pj63K14m9j27J37N8l9k03R5k4
5606f3M9J66j61j13R7J51j42%J5pJ3R2J01j47p2N2j17N4L3J32r2k66K96l4M8o6
5632A9j23J28J8rl5j08J98Q0k79PJ16j3Q0mJ8k69J97J29j49j01J10J7k25K30l0
5657BO2j64K65k50J62O3Ll30J72J82l7k15N1N8r3J31J00k15r9J12n9P5k3J49j71
5682f9K9o4J64Oq4K6k36L32J14j60k88J30J77j73O5J06k3q6J37j80l9K14P6k17
5706d3L7N5K4j18J20N9k53K5J99j81K6J52j77k88L38K47j88m7n1N4P0Q1N7k05
5730gk49K17Q7p5L6N2j92J41M0qo3olj44K44J01j32j79J77N4j33L1m5P2R9K4j99
5757f0o4K68N7m09J39N7o8l1J73l9j75J71K9n0j1O7j61N3J08L2r6J7n1R0p0K12
$$ plain form
5581 50 30 -164 -165 5 89 -7 -129 -12 -129 196 -124 -71 -36 31 38 -125 89 40 -87 50 108 69 -134 -39 -63
5606 -63 -14 152 -9 -122 -25 126 -16 -16 -1 -8 5 97 198 51 -21 31 -86 -32 1 133 41 -225 71 37 85 19
5632 19 -104 24 42 33 -2 -110 88 168 -111 -104 12 -1 79 75 93 -176 21 150 1 -100 10 27 -198 32 2
5657 2 64 -100 165 -85 77 140 143 -187 -15 167 130 -85 -34 24 -69 62 162 -53 -152 -40 -99 -24 -47 102 -69
5682 -69 -40 -104 60 66 -18 8 -228 104 218 58 -230 -100 77 -96 -31 75 52 -34 103 -77 -116 98 174 -43
5706 -43 -6 49 73 -45 75 134 -119 -94 105 -76 -50 102 -75 -363 -25 222 34 -13 -64 -10 60 141 198 -7
5730 -7 -256 -39 48 -27 9 61 -131 10 50 42 -21 -27 -30 -174 70 171 39 -140 37 91 -42 -11 -56 16 115 139 -60
5757 -60 -124 144 201 -208 -69 -12 -80 -111 62 23 -152 19 48 -2 -13 54 -107 -54 54 86 -10 7 -44 46 -24 188
5783A88k25j45%K05N0j09rM4o0L7L8L2no1Q7n7R1K0k31J2J30O8j30Q6o5j14J49
5810B6J23k16r8J41J22k49J11K11n0j29O2k09J50O0k8p5j8M7j22J3J13O3k0Qj
5835C5r3P7O4m3j76R6K56j96j25J33o6M7J42q5j05j25J06M7q9K30j20j13P4J41
5859A12L4j16l0q4J29O2J8l8j90J72pj3n2m6K4M1j4m6m5J58K9j92J22j8N0p7O9
5886E2K7Nj17P6p7J16p5j26k3J44j2q7Q2J3p8JK39r7k42J28J15O8%o6j07N9K1
5913C9K3j61P7O6j13P3J04r0j73K35k7l7O0o9J8%%l8K1j6R1N1j91J69o5k4n5J50
5941A18m6j87R2J7rO5o1N5k45J61J33j15Orj31K57j19o1Q9L2K8p1j3J7j02k6K49
5968A24n9j2j28n1M7O5M2m3Q8o9J3n0O2j16QJ32j2J4m4m9o4M9j1p0K1Q4J3J44
$$ plain form
5783 188 -37 -182 -182 23 73 -36 -45 -1 -61 -24 14 46 41 -20 67 10 101 121 -110 -98 32 100 -30 56 -9 -123 26
5810 26 149 -67 -165 -24 98 -151 -40 171 121 -8 54 -155 -5 55 27 -48 -66 -19 -141 -128 -15 48 28 36 35
5835 35 -58 19 83 40 -136 -40 216 20 -105 28 -38 9 151 66 -39 -164 -58 -11 -100 130 10 -103 -29 112
5859 112 146 30 0 -84 45 107 125 87 -103 69 62 49 -3 -49 -25 16 2 -44 -89 69 98 -94 28 10 60 -17 52
5886 52 79 84 -33 43 -34 82 7 -119 -142 2 -10 -97 -15 -2 -80 -79 160 63 -179 -51 64 132 132 66 -41 18 39
5913 39 62 -99 -22 44 -69 4 108 18 -155 80 53 16 76 7 25 25 25 -13 8 -8 83 134 -57 112 47 23 -32 118
5941 118 72 -115 -23 -6 -15 50 -11 44 -201 -40 93 -22 -16 -25 -156 101 -18 -79 10 42 70 -1 -14 3 -99 -125 124
5968 124 65 53 -75 -126 -79 -14 28 -15 73 4 17 -33 29 -87 -79 53 41 55 11 -38 -102 -53 -64 -134 -113 -29 -16 128
5996A28p2m4n5k7J64j10jQJ4Q9p5J4j17j3J69r6Q5j3p6j18K44r9p1O8P7o7J09
6023A15n9o1j45Q8P0M3n9j2j73K42j9q7P3J9n3M6J7k9m6j3J16O0j01k6j34J96
6049F8l1p1o2Q4J4Q3p8m4O3o8n9K18m7m5j23J11KQk0M5m0j19J35k2l7j21P6P0
6077a0K5j29n8J27J23j01k6J67p6l3k1K6m3Oj27J67N3Pp8o7J01Q7j80N5M7r9M1
6104a6J51j5k51n0L45j65m0R8J08j59l2j2MJ16k09N1j04L12k39J9J6K11j65j35
6128a61J46l2L8J2Q8qj50R5l0k4l8J64j7J9j60Q1o5K14k02r4J57N8l1j31O4K72
6154B65k85k1J45j85O7Q0j69j19J90J23r5k4R2k59K43rj7r7J05L3j95J61K05j36
6178I8j89r0L29k2k58P3O1q3lJ05r7k6K26j25n7J32o6o6L2J37p1r0J50J1l33J87
$$ plain form
5996 128 56 12 -43 -70 94 -16 -17 -9 5 94 19 33 -84 -97 72 -24 61 48 -28 -146 98 -1 -72 -4 73 6 115
6023 115 56 -5 -150 -62 8 51 -8 -20 -193 49 30 -57 16 35 -18 28 45 16 -30 -43 73 133 32 6 -128 68
6049 68 37 -34 -96 -12 2 85 7 -37 26 -42 -101 117 70 25 -98 13 15 23 3 48 8 -111 24 2 -35 -156 -80 -10
6077 -10 15 -114 -172 -45 78 -23 -49 118 42 9 -12 14 -29 -23 -150 17 70 77 -1 -68 33 120 -60 -5 42 -57 -16
6104 -16 135 120 -131 -181 164 -1 -41 57 165 6 -26 -38 -34 82 -127 -76 -180 132 -107 -88 -72 139 -26 -161
6128 -161 -15 -47 -9 3 91 83 -67 28 -2 -26 -64 100 83 102 -58 23 -42 172 -30 -124 33 91 60 -71 -7 265
6154 265 -20 -41 104 -81 -14 66 -103 -222 -32 91 -4 -28 64 -195 48 39 22 -75 30 63 -132 29 234 98
6178 98 -91 -181 148 126 -132 -59 2 -81 -84 21 -76 -102 124 -1 -58 74 8 -58 -26 111 40 -50 100 111 -222 -35
6204c5J76j19p8M9J02j44o5P0M7M1rr9j01K56P9q1j75J51q3L1J46p2k42K8K84
6229A57k01j5K10k9l00P0K41l1l9j74L2J81J2m5j34N2Q0r0j15L03j13j78K03L3
6253A10j18L8j0p3o8L8O2o0N5P4P7j40J18n2n9M6P9j21j24K43L7j58j39J60K8
6278D3q8O6P1j73m5J51o1N3Q5j02m9J94j3n8j6j97P8J03P9j12k32l7L38K3j30
6303b9m0N8qK4J39n4o5R4n3j79K09M4j79K8R3k08qK14p1o2OQ8k52Q9Q1N7p2J21
6331F5j31M0R3J7j98j01L98j28j35J94p6j01P5R1p8j53J70q6PK4J09l2k37J29
6355d4J20r1J06k8p4O1M5o7k00Q6P9j4n5J33j19J7j9J80o0r7P4J7j88J87m9N3
6381E3mMj3j45R8n4N9j13K42j98j00K24M5j9j07J25l0q0J56j67o8K0Q5OJ1l6m
$$ plain form
6204 -35 141 22 -56 -7 95 -49 -114 -44 3 44 35 -64 -165 91 170 89 -86 65 -18 13 159 87 -155 -127 157
6229 157 -44 -59 151 122 -178 -108 133 102 63 -111 -79 102 114 69 -65 -13 67 -23 -138 165 52 -126 77 110
6253 110 -8 30 20 -53 -121 -83 -21 -81 -26 48 125 -15 103 51 -8 38 117 -4 -128 115 152 -6 -145 15 43
6278 43 -45 21 92 -81 -126 25 -36 17 102 0 -49 145 132 74 58 -139 -61 42 121 9 -223 -260 78 101 -29
6303 -29 -69 -11 -19 5 144 90 25 119 66 -113 96 140 -39 -11 82 -126 -134 80 9 -53 -47 41 -211 -122 -41 16 -56 65
6331 65 -66 -26 67 84 -114 -215 183 55 -80 114 38 -63 12 103 25 -128 42 -44 -37 -13 96 64 -173 -44
6355 -44 76 -15 91 63 -11 50 95 28 -172 -86 -7 -21 -76 57 -62 -45 -64 116 56 -41 33 50 -138 49 0 53
6381 53 49 53 40 -105 -7 -61 -2 -115 127 -71 -171 53 98 79 -28 97 67 -13 143 -24 -92 -72 13 19 30 -6 -10
6408a0o2O1N0m7K9%r8J3J71l4k23K5K46k9j9j7J8j51J87Q4k88M6R5j39M5J7J48
6435A18p2OR6j46q2J35n9L2q5R0n8L6J84j44j44O0j2p2J27%rj07J7Q0RK3k0k2
6463a9J3k9M6K0p8J68n2K6o7oj9m0Q3M8j14l4N2j2K9j0n5k3K7J04N2j48J63j62
6491c7J24L1j67O8J6L3j36K1j3j01J34Km7j3N9l0n0J02l0M6R3j44k0K17q4n9J1
6518B6M2n7Q0k02O2N4M7m8J2J6j14J08Q4j3j47n7J12K9K1l4K9k4j00O8P0pj31
6545g4n6J01J11n1j25Q4N0J15p0r4k9n5J46j12P1L4q5j3L9m1O6k2M3R2j95K3P1
6572B4p2J3K02p3o9J5p1k8P5J04k09J08j4l6L4O5j8r6LJ54k42P0J42n2n8rJ21
6599H3o0o8j2P1J2k3r7J70q8J89k24m3K5K32k28l0M4k1M0J68r6j70N6J06M4j85
$$ plain form
6408 -10 -72 -11 39 -8 21 21 -77 -64 107 73 -150 -125 121 92 73 56 74 -77 110 194 -94 -48 47 -92 -47 -30 118
6435 118 46 52 148 2 -80 55 -4 28 -57 33 -25 11 195 51 -93 -33 -45 -117 10 10 1 -106 -89 -9 0 23 3 -19
6463 -19 -6 -35 11 31 -47 121 69 95 28 22 3 -37 46 94 -20 -54 -2 -14 15 5 -50 -73 -46 58 110 -38 125 -37
6491 -37 87 118 -49 19 35 68 -68 -47 -60 -161 -27 -25 -72 -85 -26 -56 -106 -4 -34 12 105 -39 -59 158 74 15 26
6518 26 68 11 91 -111 -49 5 52 4 16 32 -82 26 110 97 -50 -107 5 34 55 21 50 26 -74 -6 64 57 -74
6545 -74 -130 -29 82 31 -94 -10 40 155 85 -9 -38 -93 53 -59 12 46 -39 -52 -13 -54 12 -10 33 125 -70 -47 24
6572 24 -48 -35 167 94 25 40 -31 -59 16 120 -89 19 5 -31 3 68 50 -46 -43 111 -131 -61 81 29 -29 -38 83
6599 83 23 -45 -57 14 26 3 -94 76 -12 177 -47 -90 -65 167 -61 -91 -47 -68 -28 140 44 -126 -70 36 80 -105
6625a05J01O3%l8m0P2q2L3q4N5M1P4j37O5n0K1L8j35K36j06rJ40j55J7N8j73J08
6652Hpo3J69p7m8o0M3O3j3j1p1J21n6j33J31R9j08O3r5L4L2J5j29j44K27Nm2%
6680d7O5q8O%K05k28Q4J71k62O2P8J01j14m9J00rK6j28j25J38O7J2k09J93q6j11
6706a48J05Q6j04O0R6J3j56r5K38J92k02n5J60j47j01K2jl3Q8Q9j63K00r5j29
6730h0p4K95j7k13J02k1n5j1K11L5k81R9Q2j76O3j2O5q9L3O1j18K10p3k16Q4K21
6756A25M5k68M7K76k48m0J5J25n7r0P6om1Q8N2j14K1L2M8m6L6j35m2J04N6j6m2
6783AJ23j28j71K86p2j99J95n2m2Q8k7M6l7j16J62j36P7O4pk14J83R2j80N6j5
6808b3nj05K47j50o7P4K4o1R7m4j7j44R8J03j3l9M2j00R3R6o4j58J86l9j63L1
$$ plain form
6625 -105 -4 59 59 21 -19 53 -29 4 -80 -25 16 90 -47 18 -32 -11 27 -108 128 22 13 153 -2 15 73 -100 8
6652 8 1 -62 107 30 -18 -78 -35 28 15 4 -67 54 -2 -135 -4 95 -13 50 -45 -11 21 36 -93 -237 -10 -5 -47 -47
6680 -47 18 -70 -64 -64 141 -87 -3 168 -94 -32 46 147 33 -16 84 75 101 -27 -152 -14 53 65 -144 49 -37 -148
6706 -148 -43 43 -61 -1 95 108 -48 -143 95 287 85 30 190 43 -58 -36 -37 -70 18 107 -56 144 49 -80
6730 -80 -154 141 124 -89 13 -8 -63 -74 137 172 -109 -10 72 -104 -41 -53 12 -77 -44 17 -101 109 36 -180 -96 125
6756 125 170 -98 -51 225 -23 -63 -48 77 20 -70 6 0 -41 47 99 -15 6 38 86 40 76 -59 -101 3 59 43 1
6783 1 124 -4 -175 111 39 -160 35 -17 -59 29 2 48 11 -105 57 -79 -2 62 55 -159 24 116 -64 -8 -23
6808 -23 -28 -133 114 -36 -103 -29 -5 -66 31 -13 -30 -174 -76 27 14 -25 17 -83 10 106 42 -116 70 31 -132 -101
6834a01lJ84j55P5j04nRJ33n6M7m8J4o9P0P3k82K13k2M7p4J33p0q0r3K74r2j01
6861h3K4J11j2J9Lp2r1J07j5j05M7J11l9j19J85n7p0p6J27j19J50k00J39j6J07
6886E6L6j71o8K30l4L2j51N8p1J10j21O3q3J9J52k07J23J2M2j06N3r6P1J97p7
6911F9j24P0J67j36j09J56n0o2O4k8k9n9J51M3k03R3j01O9n7P5nq3N3N3OK1K7
6938G1q2n2J48j21R4j10L2M4p4j1J20q9m4J57k00Q1J47j07J1J2J11j24o4j7K6
6963d1K7J36l7L7k74J42k8r6K3J47N4j05j20J08O7q5R3j45j8R6O0J4m1M5q1J22
6989A00q4r8K0K7K4pJ18n5r2M4o6M0Q8n7Mj02L5J40O0q5o9m7O9M6jk54J78j2Q4
7018D8p5r2J42q5J35j14L8P3q3M3j18J41m8L4k2Q5p4Pj46Q1k3Q8K5n3j01L3J34
$$ plain form
6834 -101 -104 80 -75 0 -104 -109 -100 33 -23 24 -24 -10 -79 -9 64 -218 -5 -27 20 -54 79 9 -71 -164 110 18 -83
6861 -83 -59 52 40 59 62 -10 -101 6 -9 -114 -67 44 5 -114 71 14 -56 -132 -5 -124 26 -174 -35 -51 56
6886 56 92 -79 -147 83 49 81 -70 -12 -83 27 -94 -31 -114 -95 57 -150 -27 -15 27 -79 -26 -122 -51 146 69
6911 69 -55 15 182 46 -63 93 43 -19 45 17 -12 -71 80 123 -80 13 -88 -19 -76 -1 -6 -89 -36 17 23 44 71
6938 71 -11 -63 85 -36 58 -52 -20 24 -50 -61 59 -30 -74 83 -117 -36 111 4 15 27 138 14 -50 -67 -41
6963 -41 -14 122 85 122 -152 -10 -38 -134 -111 36 90 -15 -135 -27 40 -45 48 -97 -115 -19 41 55 14 59 -22 100
6989 100 16 -82 -62 -35 -11 -18 100 45 -47 -3 -69 -29 59 2 6 -96 -61 79 139 54 -15 -62 7 53 52 -202 -24 -36 48
7018 48 -27 -119 23 -62 73 -41 -3 70 -13 30 -88 53 5 39 17 102 28 35 -111 -30 -53 35 60 7 -94 -61 73
7045G3j43P5k4m3J4R2l2r4l7J23qO0m1m4l6J17J5r8J11k33J57K2j16P4J6mM6m6
7073dJ1J76k09K1R9j40j28J51N1n1r0J70k5j55NO6J23M5K5o6o2lO4j02M3Q1j44
7100d8p4J36r6L1R6mj10o7P0J63k4j27Q5j06O3N6r8Q1RL5j08M4J34j52j4O6j12
7127g1m2J61q8J27n3k1n5R3L4q7k5P9j7j9q3J70p0j01L5J05r2j28J29J21k12J91
7153H1n8J2l1m6P5l1L7q5J18n3J41j61P5r3n8n6K09j6q6o0N3Nj9J22j02J12j93
7180a08J84n7j00N0O6J3K6K0k04R4oon2K1R8p4j54J34N4j33J94P5o7q9J59j75
7206c7Q0r6J95j40L9M3j26J02l2m0j61K23L8k21J5J95m0j02Q2O7p5Jn7J52m8p6
7232a9N3n2l8J60k53J07J2k7q7J54Q0j36m5J60q5jJ48nk08q3K39j62R7j4N4p1
$$ plain form
7045 73 -70 5 -19 -62 -48 44 12 -82 -119 4 -4 56 15 -29 -65 52 67 -31 80 -153 4 26 -90 -16 0 -4 42 -4
7073 -4 7 183 -26 -5 94 -46 -174 -23 28 -23 -113 57 32 -123 -118 -52 71 116 141 75 13 10 74 -28 15 96 -48
7100 -48 -122 14 -82 -51 45 41 -69 -136 -66 97 73 -54 31 -75 -12 44 -54 27 36 71 -37 7 141 -11 -25 41 -71
7127 -71 -113 48 -40 87 34 13 -42 51 85 -2 -27 52 35 16 -67 103 33 -68 -33 72 -20 -148 -19 102 -110 81
7153 81 23 35 4 -42 33 2 39 -46 72 19 160 -1 74 -19 -77 -133 76 60 -26 -86 -33 -28 -47 75 -27 85 -108
7180 -108 76 19 -81 -31 35 48 74 94 -110 -16 -22 -28 -80 -59 39 -35 -189 -55 -1 -134 60 135 68 -21 138 -37
7206 -37 43 -53 142 2 41 84 -42 60 28 -12 -173 50 88 -133 -118 77 37 -65 17 84 9 10 -47 105 57 -19
7232 -19 34 -18 -56 104 -149 -42 -30 -57 -144 10 90 -46 -91 69 -16 -17 131 126 -82 -165 74 -88 9 -5 49 -22
7258b2p5J41o6J2qO6J6j29J02r6J22j18Q6j14P2J64k93l8J56K0Rrp6N4N6L8j25
7285e5O9L2j91L8R6O3o3k5J16l9q4J14o0j42M1R8N5r1k0o2M7P4R8r7q0J42k51
7312a77J38J1J14j46J6O6j4j05O3N6q1k7J54q8l1J45j36o4N5m8J10m7Q3j15J05
7337C7l8N6q5J5J69q7j51J38j5q7Lk6j8J39N0j08j47R6J35o7o6JJ3m3K56j32l0
7364Hn4J41j76Q0K3Q3p8j7M7M2m3P2j92J8M2L9r3J4J02m7j23J5K05j05r8J21l1
7391ep8J03J5K8o3J4qj05NO7k2l1J77j23R7%o1kp3R0j45R7m1J7No1J99k04L7J25
7421E4q5l4O6L2q8L9P7m7K5ko0m3J4J24j47N6k9N2p6M8J10m6n1M6j15P7QM4p2
7450b3l4J39l8L5Op6m8M3O3j12J0J26j26lj8O1Ml5RLN9M0j56L0qJ4J45j13L3o8
$$ plain form
7258 -22 -97 44 -22 -10 -18 48 64 -65 37 -59 63 -55 31 -83 -11 153 -140 -178 -22 -2 7 -2 -78 -24 32 70 -55
7285 -55 14 46 -145 -107 -11 52 -11 -36 80 41 -43 71 11 -131 -90 8 63 -28 -48 -110 -63 11 109 12 -68 74 -177
7312 -177 -39 -28 86 -60 -44 22 8 -97 -34 22 -59 -86 68 -20 -51 94 -42 -106 -51 -99 11 -36 47 -68 37
7337 37 -1 55 -30 -15 154 67 -84 54 39 -48 -45 -71 -89 50 100 -8 -155 -59 76 9 -57 -56 -43 -86 170 38 8
7364 8 -46 95 -81 -1 22 105 27 10 57 99 56 128 -64 -46 -4 35 -58 -44 58 11 -112 -97 108 3 -95 26 -5
7391 -5 -83 20 35 63 0 14 6 -99 -94 -27 -49 -80 97 -26 71 71 10 8 -65 25 -120 -23 -64 -47 -42 -103 96 -108 -71 54
7421 54 -31 -65 1 33 -55 -16 61 14 39 37 -23 -66 -52 72 -75 -19 -48 4 -72 -24 86 40 -11 35 -80 -3 5 49 -23
7450 -23 -57 82 44 79 85 9 -39 4 67 -45 -35 91 -35 -38 -56 5 9 -26 -17 -14 45 85 -71 -41 -49 -35 110 -3 30 -38
7480c8J1N7q4L3K1j21J33Mj1l4r1J36K9j21R1J3j1N8p3J03M3j38k2NRr0M9Q5p6
7509c0p3M0O9l6m6J62j6mn7r8l2J23J1q5J54p1M9nj01J40J0q3O4j43kO8r8P6L4
7538B0j2n4M0K8L4M5j6q2K5J01j69L3l7J21Or6J8k5m8J61j53lQ6o4n7K18q1o6
7566b7k8J24Mo3N4j32R7o6M1j00L4m9N5M9O2j3q0j23J57K6Ll9L6L7j11O2J7J9
7594D6m0k8N3lm8m8J9j4MK1J74j25nj9O0p3j91K59J56j43j10o5j4K15j74R7K8
7621C2p5J18q0o1K58j94m0K9J08j61R0j24J44n7P4L8j56N3J7j6K7j49J05N8l1
7646Gl2N1K8p6L0o0J23n4J5r7K20k64O3j6J56j00j19R9n8j4Q3L3l9q1R7j4O0Q9
7674A30k32Q7J21j0j03L8L0J1j64J71j20J62j20j7Q7m8K8m0j00L4k3J61n9o6Q2
$$ plain form
7480 -38 -27 30 -54 -21 0 -121 12 16 5 -29 -120 16 45 -76 15 28 17 75 2 105 148 10 -12 -7 2 -88 -39 46 -30
7509 -30 -103 -63 6 -30 -76 86 70 66 9 -89 -121 2 13 -72 82 11 60 55 -46 94 104 21 85 -58 -60 8 -90 -14 20
7538 20 8 -46 -6 22 56 101 85 3 28 129 -40 -7 -44 77 83 -13 5 -20 -68 93 -60 -63 23 -41 -98 120 39 -27
7566 -27 -55 69 73 10 64 -68 29 -37 4 -96 -62 -111 -56 -7 55 42 -38 -161 -4 22 25 -14 22 59 -52 10 27 46
7594 46 6 -22 31 28 -20 -68 -49 -63 -59 -38 136 11 6 -13 47 -26 -217 42 198 55 -55 -120 -134 81 -93 4 32
7621 32 -43 75 -5 -66 192 -2 -42 -13 95 -66 24 -100 44 -13 61 99 -57 -4 13 -3 24 -125 -20 38 7
7646 7 -25 26 54 -22 8 -52 71 17 32 -65 155 -109 -46 -62 94 -6 -125 -26 -84 -98 -15 18 -21 -102 -5 -19 41 130
7674 130 -102 -15 106 96 -7 31 61 72 -92 79 -41 121 1 -16 71 23 51 11 -89 -55 -78 83 24 -42 40
7699D0m1J12j37p7J23K9L6k52K16l7m4n5N1K1o6J37m4r7M3J26j55M2R8k7Ll0K1
7726C6rqN8j85q1K12R6j63r2J47m2q7J09Q3j2M1k05J62P8j40j7jjR4o2j44K04
7753G1p5NJ12j13j51K6J05mo6NJ13n8kM2L8j7Q6j24r7O7J49k45L0J98l0p0q9J94
7781A00j54oK22k95J35J19M4j40r9J29p5N0p2R0r3k5O2k6j6J65k14O2J73j35P6
7806G7j07O2j99J67J00j11J06j11R7o0n6Q6p4QQ9j15K2n1J16j01o8P6J45k46K36
7831H8l1nj78J23R3j45J02jj33K0J07j4j12k1O3K8j10J52o6N5K6J8o9J8J23j5
7857A16j78J34p9J02j45%P5n3N3j63Q2OL1M6lQ8k0k0Nq6k5j2j7kJ2J6M1L4j56
7886a18J15p2P5j01J50l0N3j06k3P9j5P4j29K0P4k02K00m2l8N4mK7p1K7j4p7o4
$$ plain form
7699 40 -1 111 -26 -103 20 49 85 -167 49 12 -32 -87 -36 -15 -81 56 12 -85 -42 84 -71 -29 69 42 45 15 36
7726 36 27 19 77 -108 -189 23 119 -44 -136 11 -31 -118 -9 74 62 103 -102 60 138 -2 -19 -20 -21 73 11 -133 71
7753 71 -4 1 113 0 -151 -125 -20 -24 -90 -85 28 -30 -32 10 48 31 117 -7 -104 -37 112 -133 -103 95 65 -5 -94 100
7781 100 -54 -60 162 -133 2 121 165 25 -74 55 -20 30 -42 48 -45 -70 -8 -34 -50 115 -99 -37 136 1 77
7806 77 -30 32 -167 0 100 -11 95 -16 81 21 -35 51 -23 -15 74 -41 -19 -70 46 -55 -123 -47 98 -148 88
7831 88 57 52 -126 -3 90 -55 47 46 -87 -67 40 26 -86 -107 -44 -16 -126 26 -40 15 41 59 -10 8 131 116
7857 116 -62 72 -7 95 -50 -50 25 -28 25 -138 -56 -50 -19 27 24 112 92 72 77 -9 -34 -46 -63 -65 -53 -37 4 38 -118
7886 -118 -3 -75 0 -101 49 19 72 -34 -57 22 7 81 -48 -28 46 -156 44 2 -36 18 14 41 -30 -3 -17 -94 -158
7913a58J86n8j1m6J12j87K31q9kr6K73j83j8K1N4Rm2J33j11p6J27l0J9r4l0J01
7939C5m9L9Q5o7k2J7o5j2PJ29Kj72Ln7J24o7m6J68K2j30L7Rj0J26q7J7j9j19P1
7968c1J96j36J6K2j7q6j1J6K9k9R5K4q9m0OJ34l4j5J3l2j3J9Q6j75J8J20j41J06
7996E1l8N5j33J19q3J6L7M3j31P9kL5Lk5l7J5O2r4K3j2L1J7n3n3J67j94J74j26
8024e4K2m2R8lm9R8q1P8J5K6j54M0M0J9j20P4j0J1q2Q6n5J17o9J5j5M6k4j23N5
8053d1R0%Kp4J13j07j04N2J04q3k2J05MJ2q5N7k08J69J11k0l3n3l8J14j37J05
8079C3j36O2NQ9p0r4O1n7P3q1J16l4J9l6p8J01Q7m0q4J05J9j61Q9J23j10kJ40
8106A39j83P5NO0o8j00k0J52m8om8J36q3m5L6r2L4Q3j17RJ09jqj07j01K54p0l8
$$ plain form
7913 -158 28 -30 -41 -87 25 -162 69 -20 -22 -118 155 -28 -46 -25 29 38 -4 129 18 -58 69 39 58 -36 -66 35
7939 35 -14 25 110 43 21 38 -27 -39 -32 97 99 -73 -70 -127 -3 -70 -116 52 74 -56 -19 -10 -20 106 19 36 17 -102 -31
7968 -31 165 29 45 67 50 -36 -47 -31 -2 -31 64 88 -1 -41 -35 99 65 50 63 31 18 37 123 -52 -34 86 -55 51
7996 51 13 68 -65 54 -29 -13 24 67 -64 15 13 48 51 26 -11 4 66 -28 -5 -17 14 31 -22 -75 92 -102 72 -54
8024 -54 -32 -74 24 21 -28 70 -11 67 82 108 -46 -6 34 53 -67 7 -3 8 -74 12 -43 74 5 20 5 51 27 -96 -41
8053 -41 49 49 51 -23 90 -17 -121 -69 35 -48 -70 35 39 51 -34 23 -185 -16 95 75 42 -11 -49 65 -72 33
8079 33 -103 -41 -36 53 -17 -111 -50 -107 -34 -115 1 -33 -14 -50 -128 -27 60 20 -64 41 60 -101 -12 111 1 -1 139
8106 139 -44 31 36 96 28 -72 -92 60 12 6 -42 94 11 -34 2 -90 -56 27 -90 -81 28 27 19 -88 -189 65 -5 -43
8134d3q1O4Q6J6K5o5O9j01j9M2L0J2m3m5K1n9J33m1mO0j1k2p2K0J20j15K6j90
8162a87J53J00n0r0Q1L1K6j9L9j06K7J58k41K9J28j76R0K3j64Q9MJ16j42N8J12
8187H9Jm4j61J29
$$ plain form
8134 -43 -124 -60 26 42 67 2 71 -30 -49 -7 23 35 -8 -53 -32 -91 42 1 -3 57 46 24 -48 -28 92 -23 3 -187
8162 -187 -34 66 16 -74 7 38 64 45 84 -22 5 163 -78 -49 79 -97 -7 16 -148 -59 -55 61 -81 -23 89
8187 89 90 46 -115 14
8191A4
$$ Imaginary data points
##PAGE= N=2
##DATA TABLE= (X++(I..I)), XYDATA
0@%%%%%%%%%%%%%Qj6J6j6J6k4L2l2M0m8N6o8P7r0J06j22J39j61J84k10K39k68
35a42L03l41L83m29M78n30N87o53P24q01Q86r78J078j187J308j442J589j751J931
54A013k133K359k616K912l254L654m132M718n448O388p656R465j2275J7261k8713
69a8457J02601R581k25658O2114J48696j3288j14204R430L8086K23j665J9364
81A6823j8780r868J8826J1667k4253r928J7176K2199j8244l8833J1902O7288m298
94D1677q7539j0269J00476K2475r9216m1065P9278N5031l7780n8893j0249M6674
106F00N2545k3814p1505o30O3684J0222l7099J35J5896j4557m769J7690q74n142
120B382P996k2102l0769L8823O0736k9824p7358p36P0448L9335l8843o6904k330
$$ plain form
0 0 0 0 0 0 0 0 0 0 0 0 0 0 0 8 -8 8 -8 8 -16 16 -16 24 -24 32 -36 41 -49 57 -65 74 -87 97 -113 126 -142
35 -142 161 -180 203 -226 252 -278 309 -344 380 -421 465 -513 565 -622 686 -756 833 -918 1013
54 1013 -1120 1239 -1377 1535 -1719 1935 -2197 2521 -2927 3461 -4195 5270 -7005 10256 -18457
69 -18457 84144 93725 -131933 -69819 78877 65589 -48615 -39185 -1099 -876 -2541 16823
81 16823 -1957 -11825 7001 18668 -5585 -15513 1663 23862 5618 -33215 -21313 45975 41677
94 41677 -45862 -56131 44345 66820 -32396 -73461 5817 60848 23068 -35825 -46074 600
106 600 53145 29331 -42174 -42804 20880 31102 -5997 -5862 10034 -4523 -9292 8398 7524 2382
120 2382 10378 -11724 -42493 -3670 57066 27242 -50116 -50852 19596 58931 20088 -46816 -49146
133d9146P2730L3297o0652m0068M7131K9883l8098j4142L1296m64k6813M323J4626
146C903l655M511M779k2968q590L6836J7753l8881l0194K6454M1498n36m4570
159a3660k8763L8019N3288k3076o3891L677N3002O257l1005n177Q879k771M545
172f76J0468n409o399K089r221n154K5506J7676k7982k9754J4069L3303J1798
185C0314k1461l7041n115M4432K8395l6037l9153J8744L4353j581j7219m747R66
198e150L241N373r3j281K659o764j0056J2764J9846j0819k6338k68K0221J1036
212A4371n660j7488j3747J5673L0536m138l5199r201K7225J7833j0858j6474m428
225a1555P921J1993K182q129n829j585j606O570J2206m663j9582n309J6201J5257
$$ plain form
133 -49146 23584 56881 -3771 -43839 3292 33175 -4923 -19065 12231 11767 -15046 -10723 3903
146 3903 248 4759 9538 -13430 -22020 14816 32569 -6312 -36506 -10052 31446 30910 -13660
159 -13660 -42423 -4404 48884 25808 -38083 -34406 18596 24853 -6152 -11329 -2450 -5221 -676
172 -676 9792 4383 -2016 73 -9148 -14302 11204 28880 898 -28856 -14787 18516 30314
185 30314 8853 -28188 -33303 11129 39524 3487 -35666 -16922 17431 15850 -1369 -6116 -5150
198 -5150 -1909 3464 3371 2090 4749 -2015 -12071 693 20539 9720 -16618 -16886 3335 14371
212 14371 8711 -8777 -22524 -6851 23685 19547 -15652 -24853 2372 20205 9347 -7127 -11555
225 -11555 -3634 8359 10541 2412 -3417 -5002 -6608 -38 12168 7505 -12077 -17386 -1185 14072
239A4072j265j5390j5489N340K5389J0182k2092k1027R339K1666N904j0954j3643
252g968m063R786J2171j241j2186p491L129Q403P835o85j1213q698O204J4757
266H740N373j1544j5116P82J7484J1844r988j7713l129J2824J1887j644j3560
279c760j1067N177J5850O788j0132j2795n54J0388J0049p3j0632j0317K664J4681
293F267Q682q849j5600k438J2744J1132l333j2960q898M604J4005O783r560j3775
307a1196j18J3201J0117l387j2181p495N755J3419N226j0116j3141n15J2605J0375
321A2549m842j4395o807Q455J2432K489r262j1014r5J2197J0980m412j4483n544
335a1752R436J2169J568r980j1054N59J2519R226o688j4326m299R827J0768J92
$$ plain form
239 14072 12807 -2583 -18072 -12732 12657 22839 747 -20280 -10941 10725 16629 5675 -7968
252 -7968 -12031 -2245 9926 8685 -3501 -10992 -7863 540 8375 7690 -3523 -12221 -6017 8740
266 8740 14113 2569 -12547 -11765 5719 17563 7575 -10138 -13267 -443 11444 9800 -3760
279 -3760 -14827 -9650 6200 12988 2856 -9939 -10493 -105 9944 9871 -761 -11078 -8414 6267
293 6267 14949 6100 -9500 -11938 806 11938 8605 -4355 -13253 -8649 5356 12139 2579 -11196
307 -11196 -11314 1887 12004 8617 -3564 -11059 -5304 8115 13341 3225 -9916 -10431 2174 12549
321 12549 7707 -6688 -13495 -5040 7392 9881 619 -10395 -10490 1707 12687 8275 -6208 -11752
335 -11752 -2316 9853 11421 1441 -9613 -9054 3465 12691 6003 -8323 -12622 -2795 7973 8165
349H165r660q910J716J1586Q508m780j2723m986Q948J2533J480j2033j1208L487
363g877J4064O772r080j3551k226J1004J0823k622j2568o345P036J0424K354n429
377B779p491l524O203J1302J715j1711r683L930J1794O805o005j5105o108J3868
391a231J5619n797j8110m762J1773J1582J68j0124q426L910J0456K458m692l001
405a77l062k554O677R765m550j3538l510Q636J0076J779j1104j4300N764K1780
419A1682M276j9940j2066J1228J4985J707j0746j1460L084J5220K343j2857l144
432e688P508k643n406R207O791j1980j0967O624J2927N468o897j7057m704K1914
446E097J7993j5351k3793J699J8721J1572n313j8782r365J7396J6378j3915j5282
$$ plain form
349 8165 -1495 -10405 -8689 2897 11405 6625 -6098 -11084 -2136 10397 11877 -156 -11364 -7877
363 -7877 6187 12959 3879 -9672 -11898 -894 9929 7307 -5261 -11606 -4570 5854 8208 2779
377 2779 -4712 -8236 -2033 9269 10984 -727 -10410 -6480 5314 12119 6114 -8991 -15099 -1231
391 -1231 14388 8591 -9519 -14281 -2508 9074 9242 -882 -9308 -5398 5058 7516 2824 -177
405 -177 -3239 -5793 884 10649 6099 -7439 -10949 -2313 7763 9542 -1562 -15862 -10098 11682
419 11682 15958 -3982 -16048 -4820 10165 11872 1126 -10334 -7250 7970 10313 -2544 -5688
432 -5688 1820 -823 -6229 2978 9769 -2211 -13178 -6554 6373 11841 4944 -12113 -16817 5097
446 5097 23090 7739 -16054 -14355 4366 15938 10625 -8157 -17522 -126 16252 2337 -12945
459a2945J2067Q657j4415l455J8354M038j6988q521R432J3559M778j4266j8119
472a7824R773K5643k261k4622n761J4483J0031K2j1284j5867Q006K7740l152l1832
486a6905p16K9211K496k1230k54J4261j198j0457j859R371J1759o823k5815j729
500a9888L4674J2886l2722k1378J7606J9101K785n275j8126j2672K3596K6306
512B6893j9026k7993J2921K1125r613j2723Q460R973n208j4571n809K0046K1433
525B5908k2479l5838J8092M1762j0069l6669L177K3794K019o371m197r231M801
538e301K1807l079k8445j322K6626O972j7857j2579M250J5106O857j7837j2430
551a7232K3281J3115l1888j3562M1101J8638m1252k5087K9470K7124p288j9290
$$ plain form
459 -12945 -878 7779 -6636 -10091 8263 12301 -4687 -13208 -3776 9783 14561 295 -17824
472 -17824 -8051 17592 15331 -9291 -15052 -569 9462 9484 -1800 -17667 -9661 18079 14927 -16905
486 -16905 -17621 11590 14086 -7144 -7398 6863 5665 -4792 -6651 2720 14479 7656 -18159 -19888
500 -19888 14786 27672 -5050 -26428 -8822 10279 13064 7789 -10337 -23009 587 26893
512 26893 7867 -20126 -7205 13920 4307 -8416 44 10017 4809 -9762 -15571 4475 25908
525 25908 3429 -32409 -14317 27445 17376 -19293 -16116 7678 9697 3326 -871 -10102 -5301
538 -5301 16506 13427 -15018 -16340 10286 17258 -599 -13178 -8928 6178 13035 -4802 -17232
551 -17232 6049 19164 -12724 -26286 14815 33453 -7799 -32886 -3416 23708 16420 -2870
563b870j4532K830K4975J2707k2154j9344R371J3757K107k405r141m622J3246
576C925L585j9311M314L1050r705m2743Q486M7968m08m2387r371K6770J5705q951
590H927j8581o354J8414J4813j7037j7682J3511J4787o742n790p68o121P976J8602
604A7955j1593k5768J3621K5896j6422k2453J9293J9716j9950k1612J2031K4436
616A5150M058k3241k3537J4735L6651j601l5746o903K3167P341o033J233o461
629a187j0851J1283J3656j2569q884J4158P58j9211K583K2343J798j9900j1379
642a7402R743K1060N252k5103j7448K4657K4239k0405k3576J4793J7610r303r019
655d902K677m99K378Q071n939j2520O493J1857n660p751N162M051l201k702n31
$$ plain form
563 -2870 -17402 -14572 10403 23110 956 -18388 -9017 4740 6847 4442 -4699 -9321 3925
576 3925 7510 -11801 -7487 23563 13858 -28885 -20399 27569 27161 -15226 -24597 2173 17878 8927
590 8927 -9654 -16008 2406 17219 182 -17500 -3989 10798 4056 -1734 -2502 -8623 -647 17955
604 17955 6362 -19406 -5785 20111 3689 -18764 529 20245 295 -21317 -9286 15150
616 15150 19208 -4033 -27570 -12835 23816 22215 -13531 -20434 2733 10074 4041 5274 -1187
629 -1187 -12038 -755 12901 332 -8552 5606 6364 -12847 -10264 12079 13877 -6023 -17402
642 -17402 -7659 13401 18653 -6450 -23898 759 24998 4593 -18983 -4190 13420 4117 -4902
655 -4902 -2225 -2724 -346 7725 1786 -10734 -4241 7616 1956 -5795 -633 3418 217 -2485 -3016
670c016N163R524p252k1298N575L0080L80l1247q457K2196J1733p903q720n335
684h577J364J1232M035r422l774N756n93k974O128L955o367m815M15K291P503
699F157L873j4216j1951J4927J7298j0908j7955M161J3004K496n685o663r80Q943
713B501O019q109o500O384M460n052n22L737k720l733K711K105m80J520k813p529
729h021L599J2587o01j3608m350R663Q968o94q937p114N380J0993n20r782k427
744d864M411O33J77K529j769n228Q4M228J831J48j820n161m06Q621M988o993p519
761f110K474P425K915m128p163j029O947M560m443n467M73K868J745J004j516
776E55l693k49L424K647m6j662l347n59N012M200l718o738m61N286L867j596n635
$$ plain form
670 -3016 2147 11671 4419 -16879 -11304 18776 19156 -12091 -20548 1648 13381 5478 -3242 -8577
684 -8577 -7213 4019 8054 -1368 -5142 614 21 -2953 3175 7130 763 -4052 -3637 -1346 6157
699 6157 10030 -4186 -16137 -1210 16088 5180 -12775 -8614 4390 6886 1201 -5462 -6442 2501
713 2501 8520 411 -6089 295 4755 -297 -819 2918 198 -3535 -824 1281 801 2321 -492 -8021
729 -8021 -4422 8165 7564 -6044 -10394 -731 8237 7543 -1394 -8508 -3128 7865 7345 -2437 -4864
744 -4864 -453 180 357 2886 1117 -4111 -4027 201 2032 2180 360 -4801 -5207 3414 8402 1409 -6110
761 -6110 -3636 3789 6704 2576 -4587 -5616 1331 5891 1448 -4019 -3546 -678 1067 2071 555
776 555 -3138 -3387 37 2684 2638 976 -2371 -2930 2082 6282 2564 -4174 -4635 651 4518 2922 -2713
793b713k986L558N644K12m913l410J593M120K634j619l696j093K564L210P00k543
809A262l693j059L575M054j623n137k142L137M364P16l973m062Q42N038L071k424
825A946m439o83L560L867n50l866k713Q79L407J825j892l764j660K894L953j15
841B649l826k653J024L803K413j448m335j312M043M375q92m563k648K029L840
856B499R97l208l826N4L646K570j313l252j457J433L145J466j879k874l94K457
872F4L345M87l460m044J235N556J146m502m023R81L891K666j681m767j500M448
888a58L609j875l141j12J047J102J894L84k834j931J241K189J481j062m200k609
904d975M284N303k155n975j257L661M340L02m719l948M055O056j980n035J052
$$ plain form
793 -2713 -5699 -2141 3503 3715 -1198 -4608 -3015 1105 3739 2120 -1576 -2669 -105 3105 3805 1262
809 1262 -2431 -3490 85 4139 2516 -2621 -4763 -1626 2738 3454 -519 -4581 -3739 1299 4370 1946
825 1946 -2493 -3176 384 4251 3701 -165 -2878 -1999 1408 3233 1341 -2423 -4083 -1189 2764 2649
841 2649 -1177 -3830 -2806 997 3410 1962 -2373 -3685 358 4733 3841 -722 -3370 -1341 2499
856 2499 3496 288 -3538 -3484 162 2732 1419 -1833 -3290 -1857 1288 2754 875 -1999 -2393 64
872 64 3409 3896 436 -3608 -2373 3183 4329 -173 -4196 -3215 676 3342 1661 -3106 -4606 -158
888 -158 3451 1576 -1565 -1677 -630 472 2366 2750 -84 -2015 -774 1415 2896 1834 -2366 -4975
904 -4975 -691 4612 2457 -3518 -4775 -1114 3226 3528 -1191 -5139 -1084 4972 2992 -2043 -991
919i91K753j236m54J767j294k634Q36J139L6J244o44m468K16O767J823o353l741
936e234L193N159K531l646p624Q94J0205J917r455l376N918J349k887J163R68
951A075k933n32J747L57J822J959n318m858O622P498m091o676L9K702L946K905
967F264o340q091O208J0137o250r858N386P719m120n048K172K783R79p64l887
982b710J85O763l10q310J699Q762k776p653K238L481j278K585q6j0157o68J5718
998G483L332j6294o014J2252O890n045m802p73K807L783k847m025O327L819j1310
1013d417n732J3518O956j1536n976N066J343J457N865n193j1585N963J3500m225
1027E004j0762K661O862m89l425k952J296P998n59j4146o96J7454J022j7643j18
$$ plain form
919 -991 1762 526 72 1839 545 -2089 -1253 -114 -78 1166 522 -3946 -3730 3037 4860 -1493 -5234
936 -5234 -2041 3118 5649 2003 -5621 -4727 5478 7395 -2060 -5436 482 1831 -1056 107 1075
951 1075 -1858 -2390 -643 -286 1536 3495 -1823 -6681 -59 7439 3348 -3328 -3289 -587 3359 6264
967 6264 -76 -8167 -1959 8178 1928 -7930 -2544 5175 1055 -3993 -1821 962 1941 1177 -2710
982 -2710 -2525 4238 3928 -4382 -2683 6079 3303 -4350 -2112 1369 91 2676 2590 -7567 -8235 7483
998 7483 10815 -5479 -11493 759 7649 2604 -2198 -2971 -164 3619 772 -3253 3074 6893 -4417
1013 -4417 -10149 3369 10325 -1211 -7187 -2121 -778 679 6544 1351 -10234 -4271 9229 5004
1027 5004 -5758 -3097 3765 3276 -149 -3101 -1805 6193 5634 -8512 -9208 8246 9268 -8375 -8493
1042h493J4522j778j0332M221N758l507p84J302m385J508R373j537j1037j413
1056f582O985M754J454o760j1346N747J6722m729j7019O376J4099j0251j1050
1069a1600J3781J0481j2477r850O366P254K381j626q556m154R134N812n950l287
1083b291J012k646K585P537n825q818R988P799j4629o144J8635N936j8169n818
1097a0848J3360N187o153l685m11K658M065m717o227P787P380j0420p680R542
1111a62N258n058J378Q71r860J747J6468j071j7278k04J3218m53p532J958L278
1126B558k128k849k108K839R289j764j5833q81J7912L350j4071k117P913k089
1140B1j671O977j954q992L744P458n546m349O441J869o473j843K778L111K855
$$ plain form
1042 -8493 6029 4251 -6081 -1860 3898 391 -393 909 -3476 -1968 7405 5868 -5169 -6582
1056 -6582 403 5157 6611 -149 -11495 -5748 10974 6245 -10774 -4398 9701 -550 -11600
1069 -11600 2181 12662 185 -9665 -3299 3955 6336 4710 -3846 -8000 1134 6946 996 -2291
1083 -2291 -1279 -3925 -1340 6197 372 -8446 1542 9341 -5288 -11432 7203 13139 -5030 -10848
1097 -10848 2512 7699 1546 -2139 -2550 108 4173 -544 -6771 1016 8396 -2024 -9704 -162
1111 -162 5096 38 1416 2287 -7573 -5826 10642 9571 -7707 -7911 5307 4854 -2678 -720 2558
1126 2558 430 -2419 -4527 -1688 7601 5837 -9996 -10877 7035 10385 -3686 -5803 2110 21
1140 21 -1650 5327 3373 -5619 -1875 5583 37 -4312 2129 3998 -2475 -4318 -1540 1571 4426
1155D426l757q674M494J1962m889j1669O712J0137q337p809Q327N470n691k179
1169a477Q94k704K509O557l667p822K011N284r6k52p54l933J501N567k475m265
1185c122N993K466r683k182J1629K899j0124l623M766K338N53p3m711j456N407
1200A077J524m441P51L384k850j684L824K12k794K525J050n593N44P031j549p289
1216d278J725N470j965l295J368J192K73M83k530j517M632L164n220l145M370
1231G27J905k438M22M72k931L02L945j179l437J760J503l021l33M112K7l216n94
1248a974J455J134J847q53m015M55M812L0m023L0J819p52o10J239p84j481J558
1265a13M32j625O26J897j367j601K000J419j470m48N94j05N34O83j679j493K076
$$ plain form
1155 4426 669 -8005 -3511 8451 3562 -8107 -1395 8742 405 -7404 923 6393 702 -1477
1169 -1477 -583 -3287 -778 5779 2112 -5710 -3699 1585 1489 1237 483 -3450 -1949 3618 1143 -3122
1185 -3122 2871 5337 -4346 -6528 5101 8000 -2124 -5747 -981 1357 1910 1837 -2874 -4330 1077
1200 1077 2601 -1840 -1089 2295 -555 -2239 1585 1797 -997 1528 2578 -3015 -2471 4560 3011 -4278
1216 -4278 -2553 2917 952 -2343 -975 217 490 973 -1557 -3074 1558 4722 -498 -3643 727
1231 727 2632 194 616 1088 -1843 -1541 2404 1225 -2212 -452 1051 -1970 -2303 1809 1836 -1380 -1974
1248 -1974 -519 615 2462 1609 -2406 -1951 2861 2891 -1132 -1102 717 -35 -645 594 -190 -1671 -113
1265 -113 319 -1306 -680 1217 -150 -1751 249 1668 198 -250 344 239 773 1456 -223 -1716 360
1282C60J528k124j728J291R44m23L4m83n28R75J123q10p18J146p2p30O05J022
1300A412r24p15K4K87J24M98q79j499N13J868j04j697m6R10N88K59k85o33K79
1319b0P04K97o95p7R9k44j14K23jl89j45l41K34M99k5r93L3J216P25q38o32L74
1341a10P27L56k43p59k53O49N19o03p66M6J80m1o5O8r6j44l5L06O22J25l89l74
1363b80N35O20l8n27n70L21L64L43r07q53M22J039m05r29JO79J1m2J94k3m1L41
1385B55K25j93L23J95o26n05P56L92o51q80J13K75N35%j234l95J375P50j123j96
1405f09R16J11m47N09J94n69J27M47p67l07J034j47j396J59J100n32n49K61j58
1424f23L4J081j67j350R27J912q91j983J136J353j041m48M18p03p0J039l53j296
$$ plain form
1282 360 1888 -236 -1964 -673 271 -152 -118 -601 -1129 -154 969 159 -559 587 515 -215 390 1412
1300 1412 488 -227 -203 84 208 706 -173 -1672 -1159 709 605 -1092 -1138 -228 360 619 334 -299 -20
1319 -20 684 981 286 209 308 64 -50 173 172 -217 -362 -703 -469 30 5 -988 -955 261 986 148 -484 -110
1341 -110 617 973 730 -29 -282 367 886 283 -483 -437 -257 -298 -363 -295 -391 -535 -570 -264 358 483 94 -280
1363 -280 255 875 837 310 -260 61 425 768 -139 -992 -570 469 64 -865 -864 -185 -174 -216 -22 -45 -86 255
1385 255 480 287 610 805 179 -326 430 822 171 -709 -596 -321 214 214 -1020 -1415 -40 710 -413 -609
1405 -609 307 418 -29 480 674 105 232 679 -88 -395 639 492 -904 -745 355 -177 -726 -465 -623
1424 -623 -589 492 325 -1025 -98 1814 923 -1060 76 1429 388 -60 358 -345 -415 624 271 -1025
1442a025N73N84j256Q7J800n85j449J341M61j189J381J669k754j962L370J565
1458B611k927j131K034m35j199J111L28j128K45L45j124R27J999j707j608K239
1474E80P82k082J181K165l133j921L997J007m198L41L244k002k639K473J780j865
1490b90o94J46m90J714K129k773j740L161L01l104K110L214m228l118M680J874
1506B892m246K23L091l050k419M223J954l170j144P54j3J974J639l199j438L624
1522A695n05l590L527L583o026l844O469K364n473M6L853l021k854M345K307l144
1538b68j150R17m12J787K060l060j502L428j526l535N069L761p723l850P667K081
1554C744o326R84M765m205l843N513L314l677j739O30l12K398K084l476j515L242
$$ plain form
1442 -1025 -452 132 -1124 -1037 763 178 -1271 70 531 -658 723 2392 -362 -2324 1046 2611
1458 2611 -316 -1447 587 152 -1047 64 392 -736 -491 -146 -1270 -343 1656 -51 -1659 580
1474 580 1362 -720 461 2626 -507 -2428 1569 2576 -1622 -1281 1963 -39 -2678 -205 1575 -290
1490 -290 -984 -838 -1328 386 2515 -258 -1998 1163 1464 -1640 470 3684 -544 -3662 1018 2892
1506 2892 -1354 -1131 1960 -1090 -3509 714 2668 -502 -1646 -892 -905 1069 2708 -491 -1929 1695
1522 1695 1190 -2400 1127 4710 -1316 -5160 1309 3673 -1800 -1754 2099 -922 -3776 569 2876 -268
1538 -268 -1418 -501 -913 874 2934 -126 -1628 1800 274 -3261 1808 5569 -2154 -6004 1663 3744
1554 3744 -2582 -1598 3167 -1038 -4881 632 3946 269 -1470 -840 -1152 1246 3330 -146 -1661 1581
1570A581j758l342N496L774q373l877Q280J955o403J527M555m920l568O342L401
1585D670m558j592J223n21J710J898k964j199K985k583l074O166L828q866l752
1600f629Q483J827o504J900M691n041l658O287K868m027r58P85j482J684K638
1615B864k436j621K172k528k398O702K742q899k930Q664Q49o466K737M960n554
1630a142l813O193K990l589j134K53j587J993K905k576k231K217j435k328N290
1645B006K428p223j998O958M9n270L441M306n962l357N977K841l760j078K66j295
1661a671J982J975k700j159K773j890k912M742L095n972k268N389%l602L560K676
1677D018n798k155O002J389l728m89R62j520Q97J983j745n23J883k466k196N002
$$ plain form
1570 1581 -177 -3519 1977 5751 -2622 -6499 1781 3736 -2667 -1140 3415 -1505 -5073 1269 4670
1585 4670 112 -1480 -257 -778 932 2830 -134 -1333 1652 -931 -4005 2161 5989 -2877 -6629
1600 -6629 1854 3681 -2823 -923 3768 -1273 -4931 1356 4224 197 -761 24 -1458 226 2864
1615 2864 428 -1193 979 -1549 -3947 2755 5497 -3402 -6332 2332 3181 -3285 -548 4412 -1142
1630 -1142 -4955 1238 4228 639 -495 -242 -1829 164 3069 493 -1738 479 -956 -3284 2006
1645 2006 4434 -2789 -4787 2171 2220 -3050 391 4697 -1265 -4622 1355 4196 436 -642 -376 -1671
1661 -1671 311 2286 -414 -1573 1200 -690 -3602 1140 4235 -1737 -4005 1384 1384 -2218 1342 4018
1677 4018 -1780 -3935 2067 3456 -272 -761 201 -1319 -422 1561 -184 -707 1176 -1290 -3486 1516
1693A516K497n551k214M974M67l065K321K087m312j270M312K94l087R47Q45k259
1709a498L52K310q65j048Q61j352j124L708J511m428p67M238m89k944K175K086
1725B726l356j275K765J67j622R81l5k344R46K479j207j062J022o46r63K202J233
1742B011k704n24K582p28j930K287J319l042j203K445M37j290K04j40j061Q22
1758e15J465j227o84J353k93r46J337R69j683l38J592l22j452J352O24k100k08
1775a076J709l14j292P37N05q47O2P99m86J2Q32m63r33J084P94r74l30Q12m16
1794B15q65R57K55j208r3Q16l91k38O16Q0r89L53Q61L5m32Q6O4j96O48M23r20
1815G7l35N47r7m47K45k1n46J84M86j71l37J24J23j01N97J31n32j04N90K29k36
$$ plain form
1693 1516 4013 -1538 -3752 1222 1689 -1376 945 3032 -1280 -2550 1762 2056 -1031 -84 761 -1498
1709 -1498 -1146 1164 299 -749 112 -1240 -2364 1344 2855 -1573 -2340 1898 1409 -1535 640 2726
1725 2726 -630 -1905 860 1027 -595 386 351 -1993 -1047 1432 225 -837 185 -461 -1424 778 2011
1742 2011 -693 -1217 1365 637 -1293 994 2313 -729 -1932 513 950 -340 -136 -276 -1337 -515
1758 -515 950 -277 -961 392 99 -847 490 1459 -224 -562 1030 708 -744 608 1232 -868 -1076
1775 -1076 633 319 -973 -236 269 -578 -516 283 -203 -191 641 178 -755 329 1123 149 -181 631 215
1794 215 -650 307 562 -646 -739 77 -314 -552 64 144 -845 -492 369 404 -28 58 122 -74 574 997 77
1815 77 -258 289 192 -255 -10 -31 -577 -393 93 -78 -415 -291 -168 -269 328 459 -73 -177 413 642 406
1836D06j37o6j62P8J26l61l03J18K02k22p2J29r5j08K64N14j49l43J61L55J13
1857D48mj28l81K38J93j18l68k02p4J38L45j94m50O8L43J81k9N4j09j11M11L41
1879E92j27m68J10K44r9o8j69m65O1L68l7k26r3P5m0K80L80k39l14P7O13J4r0
1902C79l64j74L33N06l07p52J44L07k45N0J18m24k15M84L17m05J03M90k81m18
1922c54P70M20q30k28L55L52Km17q27L00J051j62j387l2J229j16n71L79O3m75
1942d78M79Q09n87o79R44K19q13J97P16n84r07J88N62L30M4j323q45J757J602
1961A631j630j749J518J522j277k91J138o05n31Q23p8r03P26O20j499p07J415
1978A23M82r82n9j55k08J429L84k322j00L198o4l443L33L411l10k532J36P60Q9
$$ plain form
1836 406 269 203 41 119 245 -116 -419 -301 -99 -321 -393 -264 -359 -467 -203 311 162 -181 -20 335 448
1857 448 444 316 -65 173 366 248 -120 -322 -396 -258 87 -107 -557 -489 -146 35 6 60 -49 -160 251 592
1879 592 465 -3 107 351 252 184 15 -450 -389 -21 -58 -284 -377 -302 -342 -62 318 79 -235 -158 455 469 379
1902 379 15 -159 174 680 373 -379 -235 72 -173 -123 -5 -429 -644 -160 157 -248 -145 345 64 -354
1922 -354 416 836 6 -222 133 485 487 70 -757 -457 594 432 -955 -987 242 126 -445 -66 -3 -478
1942 -478 1 810 223 -456 488 707 -106 91 807 223 -684 -496 66 396 440 -883 -1728 29 1631
1961 1631 1 -1748 -230 1292 15 -276 862 257 -274 549 471 -432 294 914 -585 -1292 123
1978 123 605 -377 -436 -591 -799 630 1014 -1308 -1408 1790 1726 -1717 -1384 2027 1717 -815 -679 81 170
1997A70O30m4k085p1J942l01j130J027L11j510L61J419p26J25J558j910k725L502
2015E43L675l469m213K479K980j252j171j57l24O10J011j289m96K415m28l134
2031b220J121L259r98j727J092o55j372K913J738m474j748M460R77m307m0L283
2047A302j7k185o37J61K207K151k853l894L058M216k704k450K494J99k882J704
2063a30K517k401j470K295j129k449L335L248l957l672K268L183N65r18l217j157
2079c089M731K253m967j417M699l41m863J715M528k144l242J314K35m72K671M95
2095B106m363n11M181N88k504P9O43m68J190j75k681J853M358l804n904M231O107
2112D926l613m825K155J958j063R02P88k089l6J832j523m04L352j14m171l01K958
$$ plain form
1997 170 800 756 -1329 -1400 542 241 -889 138 449 -1061 -700 719 -7 118 1676 -234 -2959 543
2015 543 4218 749 -3464 -985 1995 743 -428 -585 -909 -299 712 -577 -1073 1342 914 -2220
2031 -2220 -1099 2160 1162 -565 527 -128 -1500 1413 3151 -1323 -3071 1389 2366 -1941 -1981 1302
2047 1302 1285 -900 -1537 -1376 831 2982 129 -3765 -707 3509 805 -1645 849 1048 -1834 -130
2063 -130 2387 -14 -1484 811 -318 -2767 568 3816 -141 -3813 -1545 1638 2203 1285 -1932 -3089
2079 -3089 1642 3895 -1072 -2489 2210 1869 -2994 -1279 3249 1105 -2137 -823 -588 -1060 1611 2106
2095 2106 -2257 -2768 1413 2001 -503 -424 219 -249 941 766 -1915 -62 4296 492 -5412 -1181 4926
2112 4926 1313 -3512 -1357 601 -462 440 1228 -861 -897 935 -588 -992 2360 2246 -1925 -2226 732
2129G32L50K91L25m041k257O308L479o334l539N050J763l310L66K382j106j269
2145h10L94l85J510K423k360m369K613M112k141k406J502m60j335K607Q05l837
2161b137M66M348j881m386K747M495k215l345N86J451J228R65k560k405K756K130
2177B243l262o74L628j096l959J609L300r06j043N58j931q50M683J639n029k094
2193c184L061J945q99m41j086q33J935O92k499N60L045k395l514L180L540k636
2209D71k450J700P41l94J225m07k446J029K588j556k282J672J395j260m83j22
2225e79o60J509J673k555k207K917K160k454j021K377j95k099Q34J620n74n56
2241A90l30j205P10K638o53l201p6K167M26j50l59j309l91K645O91k449k54J995
$$ plain form
2129 732 1082 1373 1698 -2343 -4600 1708 5187 -1147 -4686 364 2127 -1183 -817 1565 459 -810
2145 -810 -416 -801 709 3132 772 -3597 -984 3128 987 -1419 83 -377 -1712 895 1700 -2137
2161 -2137 -1671 2677 796 -3590 -843 3652 1437 -1908 -1322 129 1357 2322 -238 -2643 113 2243
2177 2243 -1019 -1693 1935 839 -3120 -1511 1789 883 -160 398 -1533 -2383 2300 3939 -1090 -3184
2193 -3184 -123 1822 923 482 -604 -1437 498 1190 -1309 -749 2296 -99 -3613 -433 3107 471
2209 471 -1979 -279 462 68 1293 886 -1560 -531 2057 501 -1781 -109 1286 26 -457 -579
2225 -579 -1239 270 1943 -612 -2819 98 2258 -196 -1217 1160 965 -1134 -300 1320 746 190
2241 190 -140 -1345 -635 2003 1350 -1851 -1927 240 666 516 157 -1152 -1543 1102 1793 -656 -910 1085
2259A085o60j389J448J049j772r38J013M92J79k0j321q49J846J306j848j038J433
2276A6O35m13o0o1p85Q66J456j353j387J045J054r85l16N88n03n36N69K36k5j68
2296a27l20n46J007J586j042j813N39J567J40m24o25p77L99J368m3j445l91P73
2314a74L14j22K14l86p15K88Q92K20l41k80l75M13R84J75j431n42Q06Q66j74o81
2334d9p32q7R46O82q10r32J81Q96L15k15k02k88j41Q42M26l39o45k33J42P53L56
2355H66q92q86K03R85L46n64q91n9P03J074j12j071m21O78P32J77n73o53n4O15
2375B03L68lo82m56j2N66P41n85r53j41P09R06p3q25m65L17J185K02q01r79J93
2396e85J073L22m77p81m75P43O96j79o15m13J61L18O98M2o39o88M08Q75O31p49
$$ plain form
2259 1085 425 -964 484 1533 -239 -1177 -164 328 507 487 -834 -1683 163 1469 -379 -1417 16
2276 16 651 238 178 117 -668 198 1654 301 -1086 -41 1013 28 -288 300 -203 -739 -170 66 41 -127
2296 -127 -447 -993 14 1600 558 -1255 -716 851 991 567 -58 -835 -436 932 889 -556 -947 -174
2314 -174 140 18 232 -154 -869 -581 311 531 190 -90 -465 -52 932 1107 -324 -866 -60 806 632 -49
2334 -49 -781 -868 78 760 -50 -982 -801 95 410 195 -7 -295 -436 406 832 493 -152 -385 -243 510 866
2355 866 -26 -912 -709 276 622 58 -833 -892 -189 885 773 -298 -719 -41 691 868 295 -358 -412 203
2375 203 571 568 -114 -570 -582 -16 725 140 -813 -954 -245 661 588 -237 -702 -385 800 1002 201 -778 -585
2396 -585 488 810 333 -448 -923 -180 516 337 -278 -691 -530 -212 486 528 -111 -799 -391 484 1115 366
2416C66r82M7J024P40n71j405k26R63P23k29p22p49M92J023R0q82k92M48K24K37
2436C19J79j76o29m2N30N77L1r54j168O82J700R6j892p72J197J043j24n82q67
2455h52m4J313R12j020r11L50O01L4Nj33m04j39Q1N9N75J11j256j072J662J982
2475A854j346k148N60J786K64n96o87n33J013J191p45j467L34J036j93l75p8m57
2493e87J22P89k53o04Q06L45j701j81K869K67k847r05K238J501o96j571j243P37
2511i14K394J79k466p48J415K85j80M99n89j037P37J185q78K4J333j020k140J713
2529b08K819j508k690J75J729P85k45j861r60K339J519k343j573K217J048j417
2545a74k44P88p30L67J393j035j716J286J461j678p77J928K06k271j95J402J137
$$ plain form
2416 366 -616 -569 455 1195 624 -781 -1007 -44 679 450 -272 -1021 -529 494 584 -298 -590 -142 82 319
2436 319 498 322 -307 -349 181 758 789 -165 -1333 -651 1049 1145 -747 -1519 -322 721 597 15 -852
2455 -852 -896 417 1329 309 -602 -252 349 383 388 255 -149 -288 -207 -148 427 538 -718 -1790 -128 1854
2475 1854 508 -1640 -1080 706 970 374 -313 -846 167 1358 613 -854 -520 516 323 -52 -130 -587
2493 -587 -465 324 71 -533 273 618 -1083 -1264 1605 1872 -975 -1880 358 1859 1163 -408 -1651 -914
2511 -914 1480 1659 -807 -1555 -140 145 -35 464 -125 -1162 -425 760 -118 -94 1239 219 -1921 -208
2529 -208 2611 1103 -1587 -1412 317 1102 857 -1004 -1964 375 1894 -449 -2022 195 1243 -174
2545 -174 -418 370 -360 7 1400 365 -1351 -65 1396 -282 -1059 869 1075 -1196 -1391 11 1148
2562A148M0j808k375J911M348j122m562K15L231M31j045J95q35j096J545J171
2578A392j451m61J148j076j402K090J816j849j606Q5O93J864Q68k917k191L487
2594D90K753l202k429K853J373k057n52P13p9L95P41j829r90K270Q83k157lJ599
2612G72q12o86J158J93n80R98o68k772J575M372j413n215L12M023P59j613j013
2629f10j154O42K533j71k120K70J353j443k14K492K00k751j92J112K7J014J096
2646B084l056k412L559L042l153k524J840J531m98k97o41k63J826K97k612j26
2662a403L082p4k711M94J496j070n03J390m23j186J247rj986R99K935j262l469
2679b453P78K794O46o84j947j372K061K961j404l220J085J607j215l14J963p91
$$ plain form
2562 1148 1188 -620 -2995 -1084 3264 2142 -2420 -2205 1026 1457 412 607 -228 -1324 221 1392
2578 1392 -59 -520 628 -448 -1850 240 2056 207 -1399 -1314 -621 1243 2111 -806 -2997 490
2594 490 3243 41 -2388 465 1838 -219 -771 -58 -137 258 999 -830 -1820 450 1333 -824 -827 772
2612 772 -40 -726 432 625 45 1043 375 -2397 -822 3550 2137 -3078 -2766 1257 2016 403 -610
2629 -610 -1764 -1122 1411 1240 -880 -610 743 -700 -914 1578 1778 -973 -1165 -53 -26 988 2084
2646 2084 -972 -3384 175 3217 64 -2460 -620 911 413 116 -525 -788 1038 1335 -1277 -1403
2662 -1403 1679 1605 -1106 -612 884 -186 -689 701 278 -908 339 330 -1656 -657 2278 1016 -2453
2679 -2453 -1675 1119 1765 1081 -866 -2238 -177 2784 1380 -1840 -755 852 -363 -677 1286 495
2695D95k310P80J489q1J64K03k040o28L122J388k670j539J015J088O54j19j836
2712h25p37K540N84k794j69K293k71j797O51J205p68k68P59k14n47R42l71j146
2730i33J315J265j570j495R80J133J41l54j362j242J992K463j681k598Q46J990
2746H90m05m41N00o06o62Q46O26k03j16n22j179P33K107m10k133m93J272O17L95
2765H16k60j871n9K276O99k011o57J174N45n81J74j51m31J68M43k68NP8o74j76
2785g61J267M39j427p38J149P85j56l20p83l58J327J228j159j628L96J189L25
2802G75m65m59p43L57Q86J04n49j76l42j26R48R05q05j271K87J119N48l82q28
2821b17p62P21J228p9j439m94O88P08N0l97n90j59P33M07j11m37p2l1L43P42p9
$$ plain form
2695 495 -1815 -1035 454 373 537 740 -1300 -1928 1194 2582 -88 -1627 -612 476 1130 1011 -825
2712 -825 -1562 978 1562 -1232 -1401 892 621 -1176 -525 680 -88 -356 403 189 -358 584 213 -933
2730 -933 382 1647 77 -1418 -438 695 836 482 -880 -2122 -130 2333 652 -1946 -1100 890
2746 890 485 44 544 -62 -724 122 748 545 429 -93 -1272 -539 1568 1158 -975 -1468 -196 421 816
2765 816 556 -1315 -1374 902 1601 -410 -1067 107 652 71 245 94 -337 -169 274 6 11 89 -585 -761
2785 -761 506 945 -482 -1220 -71 714 558 238 -545 -903 424 1652 493 -1135 -739 450 775
2802 775 310 -149 -892 -535 351 455 -94 -270 -612 -738 210 1115 310 -961 -674 445 993 611 -217
2821 -217 -979 -258 970 891 -548 -1042 -354 354 404 7 -583 -742 -9 398 287 -150 -222 -253 90 832 753
2842G53j095l44O36P72L3q45p39R5J170M57r77r50L49Q98N04l80p80k69O14N42
2862D44K08n97n04J19L22N05J64q55o62N36P44K26o69o99j54Q99Q65l09j044n01
2882i62P58J022k4q70n60L41P91K26l99o52k40L59N84K92p69o45J38P18M83j87
2902D04q43j59K82J006K03q78p75K79R59L79n65q82k22Q48N07k10p34l90N16N50
2922B75M8k08n09r2N14N62N0n01o29%R93L80n66r99j27P86O61r1j031m79M60J143
2944F40O3r61n62L92Q09J34k36m63j66L60L97M3k19m13n17M58R74r9j240l51O45
2965c12P43J56m40q31j41J066P98n79j036M2P01N49j22o33o01N84N05k50l51K01
2985D9l63m39O69Q91o86q89J53R77M01l19p96m69Q40J107m80j193r9N64N16L16
$$ plain form
2842 753 -342 -686 -50 722 755 -90 -829 -734 436 893 -84 -1034 -685 213 717 337 -443 -712 -98 444
2862 444 652 55 -449 -330 -8 497 661 -194 -856 -320 424 650 -19 -718 -872 27 892 583 -461 -962
2882 -962 -204 818 794 -76 -636 -295 496 722 323 -329 -569 -210 374 666 -103 -748 -610 108 591 404
2902 404 -439 -598 -316 690 893 15 -760 -481 478 857 292 -590 -812 36 543 333 -401 -791 -275 275
2922 275 323 115 -394 -486 28 590 640 139 -490 -490 503 883 317 -682 -809 -23 638 547 -484 -963 -503 640
2944 640 703 -258 -820 -428 381 515 279 -184 -350 10 407 450 231 -182 -699 -241 733 634 -606 -957 -312
2965 -312 431 587 147 -684 -825 241 1039 460 -576 -534 167 716 594 -39 -640 -56 449 199 -152 49
2985 49 -314 -753 -84 807 121 -768 -615 362 763 444 -352 -821 19 1126 646 -547 -646 -82 434 750
3005G50p07j042K33J318N4j127J14L86l05k0J095J61j359m20P95Q89J22q25j356
$$ plain form
3005 750 43 -999 -766 552 606 -521 -407 -21 -326 -346 749 910 -449 -869 -74 815 937 112 -1244
$$ [...]
8191A01
##END NTUPLES=NMR FID
##END=
