##TITLE=1H_DE-80H_X3
 200.13MHz, d2o
 8 sc
 
 19ns.26.2.2025
##JCAMPDX= 6.0         $$ Bruker NMR JCAMP-DX V2.0
##DATA TYPE= NMR FID
##DATA CLASS= NTUPLES
##ORIGIN= UXNMR, Bruker Analytische Messtechnik GmbH
##OWNER= pz
$$ XWIN-NMR		Version 3.5
$$ Tue Dec 23 10:39:08 2025 Russian Standard Time (UT+4h)  Yarkov@DPX200
##.OBSERVE FREQUENCY= 200.1313
##.OBSERVE NUCLEUS= ^1H
##.DELAY= (6, 6)
##.ACQUISITION MODE= SIMULTANEOUS
##.ACQUISITION SCHEME= undefined
##.AVERAGES= 8
##.DIGITISER RES= 18
##SPECTROMETER/DATA SYSTEM= spect
##.PULSE SEQUENCE= zg30
##.SOLVENT NAME= CDCl3
##.SHIFT REFERENCE= (INTERNAL, CDCl3, 0, 14.3821)
##AUDIT TRAIL= $$ (NUMBER, WHEN, WHO, WHERE, WHAT)
$$ ##TITLE= Audit trail, XWIN-NMR		Version 3.5
$$ ##JCAMPDX= 5.01
$$ ##ORIGIN= Bruker BioSpin GmbH
$$ ##OWNER= Yarkov
$$ C:/Bruker/XWIN-NMR/data/yarkov2/nmr/H-C/1/audita.txt
$$ ##AUDIT TRAIL=  $$ (NUMBER, WHEN, WHO, WHERE, WHAT)
(   1,<2025-12-23 10:38:04.26 +0400>,<Yarkov>,<DPX200>,
      <created by zg, POWCHK disabled, PULCHK disabled
       configuration hash MD5:
       00 E9 B6 7A A2 85 ED C7 34 08 36 98 17 FE 4E 26
       data hash MD5: 16K
       83 27 6A 35 37 FB 1A 45 DA 27 C9 6C BE 26 D5 02>)
$$ ##END=
$$ 
$$ hash MD5
$$ 8B 3B 73 07 EA 29 EC 42 4A 35 44 09 62 38 03 EE
##$RELAX= 
##$RELAX= 
##$RELAX= 
##$RELAX= 
##$RELAX= 
##$RELAX= 
$$ Bruker specific parameters
$$ --------------------------
##$DU= <C:/Bruker/XWIN-NMR>
##$EXPNO= 1
##$NAME= <H-C>
##$PROCNO= 1
##$TYPE= <nmr>
##$USER= <yarkov2>
##$AMP= (0..31)
100 100 100 100 100 100 100 100 100 100 100 100 100 100 100 100 100 100 
100 100 100 100 100 100 100 100 100 100 100 100 100 100 
##$AQSEQ= 0
##$AQ_mod= 1
##$AUNM= <au_zg>
##$AUTOPOS= <>
##$BF1= 200.13
##$BF2= 200.13
##$BF3= 200.13
##$BF4= 200.13
##$BF5= 200.13
##$BF6= 200.13
##$BF7= 200.13
##$BF8= 200.13
##$BYTORDA= 1
##$CFDGTYP= 0
##$CFRGTYP= 5
##$CHEMSTR= <none>
##$CNST= (0..31)
1 1 145 1 1 1 1 1 1 1 1 1 1 1 1 1 1 1 1 1 1 1 1 1 1 1 1 1 1 1 1 1 
##$CPDPRG= <>
##$CPDPRG1= <>
##$CPDPRG2= <>
##$CPDPRG3= <>
##$CPDPRG4= <mlev>
##$CPDPRG5= <mlev>
##$CPDPRG6= <mlev>
##$CPDPRG7= <mlev>
##$CPDPRG8= <mlev>
##$CPDPRGB= <>
##$CPDPRGT= <>
##$D= (0..31)
0 0.7 0 0 0 0 0 0 0 0 0 0.03 0 0 0 0 0 0 0 0 0 0 0 0 0 0 0 0 0 0 0 0 
##$DATE= 1766471883
##$DBL= (0..7)
120 120 120 120 120 120 120 120 
##$DBP= (0..7)
150 150 150 150 150 150 150 150 
##$DBP07= 0
##$DBPNAM0= <>
##$DBPNAM1= <>
##$DBPNAM2= <>
##$DBPNAM3= <>
##$DBPNAM4= <>
##$DBPNAM5= <>
##$DBPNAM6= <>
##$DBPNAM7= <>
##$DBPOAL= (0..7)
0.5 0.5 0.5 0.5 0.5 0.5 0.5 0.5 
##$DBPOFFS= (0..7)
0 0 0 0 0 0 0 0 
##$DE= 6
##$DECBNUC= <off>
##$DECIM= 32
##$DECNUC= <off>
##$DECSTAT= 4
##$DIGMOD= 1
##$DIGTYP= 9
##$DL= (0..7)
0 120 120 120 120 120 120 120 
##$DP= (0..7)
150 150 150 150 150 150 150 150 
##$DP07= 0
##$DPNAME0= <>
##$DPNAME1= <>
##$DPNAME2= <>
##$DPNAME3= <>
##$DPNAME4= <>
##$DPNAME5= <>
##$DPNAME6= <>
##$DPNAME7= <>
##$DPOAL= (0..7)
0.5 0.5 0.5 0.5 0.5 0.5 0.5 0.5 
##$DPOFFS= (0..7)
0 0 0 0 0 0 0 0 
##$DQDMODE= 0
##$DR= 18
##$DS= 0
$$ [...]
##$SUBNAM2= <"">
##$SUBNAM3= <"">
##$SUBNAM4= <"">
##$SUBNAM5= <"">
##$SUBNAM6= <"">
##$SUBNAM7= <"">
##$SUBNAM8= <"">
##$SUBNAM9= <"">
##$SW= 18.0517328524113
##$SWIBOX= (0..15)
0 0 2 0 0 0 0 0 0 0 0 0 0 0 0 0 
##$SW_h= 3612.71676300578
##$TD= 16384
##$TD0= 1
##$TE= 0
##$TE2= 300
##$TE3= 300
##$TEG= 300
##$TL= (0..7)
0 120 120 120 120 120 120 120 
##$TP= (0..7)
150 150 150 150 150 150 150 150 
##$TP07= 0
##$TPNAME0= <>
##$TPNAME1= <>
##$TPNAME2= <>
##$TPNAME3= <>
##$TPNAME4= <>
##$TPNAME5= <>
##$TPNAME6= <>
##$TPNAME7= <>
##$TPOAL= (0..7)
0.5 0.5 0.5 0.5 0.5 0.5 0.5 0.5 
##$TPOFFS= (0..7)
0 0 0 0 0 0 0 0 
##$TUNHIN= 0
##$TUNHOUT= 0
##$TUNXOUT= 0
##$USERA1= <user>
##$USERA2= <user>
##$USERA3= <user>
##$USERA4= <user>
##$USERA5= <user>
##$V9= 5
##$VALIST= <valist>
##$VCLIST= <CCCCCCCCCCCCCCC>
##$VD= 0
##$VDLIST= <DDDDDDDDDDDDDDD>
##$VPLIST= <PPPPPPPPPPPPPPP>
##$VTLIST= <TTTTTTTTTTTTTTT>
##$WBST= 1024
##$WBSW= 4
##$XGAIN= (0..3)
0 0 0 0 
##$XL= 0
##$YL= 0
##$YMAX_a= 254815
##$YMIN_a= -218332
##$ZGOPTNS= <>
##$ZL1= 120
##$ZL2= 120
##$ZL3= 120
##$ZL4= 120
##$ABSF1= 10
##$ABSF2= 0
##$ABSG= 5
##$ABSL= 3
##$ALPHA= 0
##$AQORDER= 0
##$ASSFAC= 0
##$ASSFACI= 0
##$ASSFACX= 0
##$ASSWID= 0
##$AUNMP= <proc_1d>
##$AZFE= 0.1
##$AZFW= 0.1
##$BCFW= 1
##$BC_mod= 2
##$BYTORDP= 1
##$COROFFS= 0
##$CY= 83.5205535888672
##$DATMOD= 1
##$DC= 2
##$DFILT= <>
##$DTYPP= 0
##$F1P= 10.8118882576601
##$F2P= -7.23987719738617
##$FCOR= 0.5
##$FTSIZE= 0
##$FT_mod= 4
##$GAMMA= 1
##$GB= 0.15
##$INTBC= 1
##$INTSCL= 1
##$ISEN= 128
##$LB= 0.25
##$LEV0= 0
##$LPBIN= 0
##$MAXI= 10000
##$MC2= 0
##$MEAN= 0
##$ME_mod= 0
##$MI= 1.114404
##$NCOEF= 0
##$NC_proc= 0
##$NLEV= 6
##$NOISF1= 3.799351
##$NOISF2= 2.8
##$NSP= 1
##$NTH_PI= 0
##$NZP= 0
##$OFFSET= 14.38212
##$PC= 1
##$PHC0= -5299.955
##$PHC1= 10.82193
##$PH_mod= 1
##$PKNL= yes
##$PPARMOD= 0
##$PSCAL= 0
##$PSIGN= 0
##$REVERSE= no
##$SF= 200.129724274929
##$SI= 16384
##$SIGF1= 3
##$SIGF2= 2
##$SINO= 400
##$SIOLD= 16384
##$SREGLST= <1H.CDCl3>
##$SSB= 0
##$STSI= 0
##$STSR= 0
##$SW_p= 3205.1282051282
##$SYMM= 0
##$S_DEV= 0
##$TDeff= 0
##$TDoff= 0
##$TI= <>
##$TILT= no
##$TM1= 0
##$TM2= 0
##$TOPLEV= 0
##$USERP1= <user>
##$USERP2= <user>
##$USERP3= <user>
##$USERP4= <user>
##$USERP5= <user>
##$WDW= 1
##$XDIM= 8192
##$YMAX_p= 0
##$YMIN_p= 0
$$ End of Bruker specific parameters
$$ ---------------------------------
##NTUPLES= NMR FID
##VAR_NAME=  TIME,          FID/REAL,        FID/IMAG
##SYMBOL=    X,             R,               I
##VAR_TYPE=  INDEPENDENT,   DEPENDENT,       DEPENDENT
##VAR_FORM=  AFFN,          ASDF,            ASDF
##VAR_DIM=   8192,          8192,            8192
##UNITS=     SECONDS,       ARBITRARY UNITS, ARBITRARY UNITS
##FACTOR=    0.0002768,     1,               1
##FIRST=     0,             0,               0
##LAST=      2.2672688,     0,               0
##MIN=       0,             -218332,         0
##MAX=       2.2672688,     254815,          0
$$ Real data points
##PAGE= N=1
##DATA TABLE= (X++(R..R)), XYDATA
0 0 0 0 0 0 0 0 0 0 0 0 0 0 0 0 0 -8 8 -8 8 -8 15 -16 16 -24 24 -32 36 -40 48 -55 63 -72 84 -93 107 -121 137
37 137 -153 171 -191 212 -237 264 -292 323 -356 394 -435 479 -527 582 -641 704 -780 858 -947
56 -947 1050 -1164 1298 -1453 1631 -1848 2112 -2443 2870 -3443 4247 -5446 7270 -14055 240380
71 240380 167263 -120488 60498 233053 8648 -173284 -10398 44084 -105855 -111634 23417
82 23417 15626 -11260 97427 137543 -29017 -129533 -3903 111401 -1963 -146680 -67699
93 -67699 104785 88929 -26872 -6365 58621 -19574 -98223 -28294 33305 -14094 -29286 12597
105 12597 20321 45606 102169 38211 -101485 -88825 29860 27718 -56248 -52368 15265 55022
117 55022 60891 28654 -16346 -8272 7602 -42840 -72244 -11597 29663 5414 7938 37307 33531
130 33531 27834 16675 -47173 -71451 6621 27010 -61540 -49657 83682 98366 -13423 -38572
142 -38572 16465 12002 -22299 -26701 -43014 -48236 13271 63979 34577 732 10563 11687 -8352
155 -8352 -17326 -17366 -13924 -12365 -24593 -8374 61992 78867 -16325 -75115 -8176 41837 -9959
168 -9959 -51802 -28094 -141 25151 55106 37909 -9012 -10676 5601 -16591 -33345 -15304
180 -15304 -9945 -16566 5955 34122 37891 29350 2332 -35464 -24268 15311 -7607 -59464 -28555
193 -28555 40034 44019 13820 8674 7952 -658 3988 -6405 -39158 -34344 8709 20161 8716
206 8716 17865 20929 -545 -9593 -1042 -8356 -24389 -23982 -15473 4965 38517 40962 421 -17417
220 -17417 6943 16828 -7399 -31137 -35167 -18667 17260 36919 16655 -3754 5093 10386 -2018
233 -2018 -9490 -13579 -26934 -23574 7511 28498 24297 11912 -1101 -5145 5939 8498 -17343
246 -17343 -37862 -19068 12156 24923 21705 9038 -3811 1541 12492 -2139 -29582 -30861 -11536
259 -11536 3071 13592 21743 14796 2187 4913 12606 3248 -16998 -27674 -19990 1459 19291
272 19291 16627 2010 -2477 5733 10757 2329 -16685 -29885 -19127 7944 21469 13478 3981
285 3981 4485 7788 8783 3281 -13216 -29079 -22001 3272 18663 13947 3898 2385 8017 11338
299 11338 3815 -13948 -28132 -22493 -392 15858 12778 2073 2398 11597 14863 5553 -10369 -22598
313 -22598 -19897 -1555 14774 12092 -535 -1715 9453 14199 3430 -13635 -23530 -19157 -2623
326 -2623 12428 12503 2166 158 11144 18399 8024 -10873 -21842 -17611 -3196 9325 9378 -71
340 -71 -2720 7843 17022 7871 -12009 -22376 -15655 -2190 6994 8281 2941 143 7724 17502 11560
355 11560 -8624 -21549 -16286 -2513 7200 6922 -388 -2268 8432 18288 9904 -10487 -21888 -15566
369 -15566 -2201 5029 2737 -918 2859 10885 14825 11269 -1629 -17154 -18576 -3168 7852 3117
383 3117 -3691 -1359 6558 15346 14975 -4934 -25136 -17499 3997 6748 -4118 -4514 3894 10795 15531
398 15531 11714 -3549 -13873 -11510 -6098 -497 5992 2179 -6577 1254 18195 15527 -3038 -16302
412 -16302 -18292 -7651 9140 7336 -11648 -8805 17590 23068 3579 -6111 -5230 -7688 -5818 -343
426 -343 -4197 -4043 7690 8833 504 7481 11562 -10162 -23692 -4511 9510 -1688 -9364 -2683
440 -2683 7292 20371 20310 -7277 -24427 -3068 14337 -1393 -14977 -7817 985 11296 19564 5448
454 5448 -11899 -3460 1229 -15546 -9901 15691 3933 -24303 -5439 31271 25083 -3035 -15997
467 -15997 -16228 -1555 17807 4804 -23765 -12388 18099 16060 1807 1978 -4336 -12313 -2152
480 -2152 -830 -13130 754 19911 -2865 -18337 17919 34272 -7681 -29857 -3635 10306
492 10306 -1644 -7183 -7014 1062 21662 16661 -17177 -16136 16457 10329 -20336 -16994 -1214 -168
506 -168 13270 21743 -5586 -16204 15273 16326 -19264 -13207 15974 -2176 -27040 -1048 28851
519 28851 20299 -2602 -22576 -21716 16128 33392 -14873 -45565 -1994 30202 8138 531 11848
532 11848 -5615 -16208 8067 9345 -13052 -2974 9619 -14537 -14478 27422 30598 -12102 -27296
545 -27296 -9280 7217 15896 435 -29901 -12850 35386 21501 -24915 -5587 30757 221
557 221 -31566 -5759 12770 -733 1670 5966 -10240 -2095 23920 7775 -21640 -9079 5177
570 5177 -8296 -7990 6425 5336 8463 12280 -13967 -20206 28695 36087 -32207 -50377 13255 37023
584 37023 311 -10343 1380 -4801 -1281 12539 219 -12700 -1973 -5629 -16479 9857 32134
597 32134 4865 -18061 -6525 259 5526 20918 -1765 -42888 -14912 42441 23056 -24893
609 -24893 -9300 18205 -853 -14573 -74 2237 -3490 -857 -7484 -6099 21485 23435 -14039
622 -14039 -19387 10427 7819 -11291 -1285 3763 -9096 3214 18184 -6072 -15358 17654 16708
635 16708 -26568 -26804 12544 19158 143 -7098 -8043 1298 20869 11581 -17396 -10082 10466 -6593
649 -6593 -16304 14397 22086 -10376 -16450 5523 7589 3658 6760 -12433 -29634 540 30461
662 30461 9503 -15568 -6080 6080 7089 7774 -2534 -14405 -2703 7113 -7193 -4078 20286
675 20286 9947 -20417 -9256 17125 6184 -12739 -7904 -4130 -3101 10666 11150 -8183 -5675
688 -5675 13990 6763 -11492 -5997 3129 44 1015 938 -6557 776 15563 3132 -15052 -3108
702 -3108 7804 -6914 -10575 6909 8011 -4665 -2515 4622 4371 7077 3392 -13849 -13975 8833
716 8833 13971 -3404 -8329 273 2871 5562 7260 -5090 -14190 -2871 5095 -2239 -985 7172
730 7172 936 -6214 3784 10987 1822 -6692 -7319 -5082 3711 9750 -526 -9854 916 11075 2783
745 2783 -5382 -3956 -4127 -3263 2788 2192 -4375 -337 7333 3228 -1339 2448 849 -6420 -3586 4012
761 4012 2839 -1728 -1380 278 2957 5712 -57 -9363 -6997 2650 3754 -1512 -2579 -596 2324
776 2324 6531 5439 -2174 -5530 -1466 643 10 1365 794 -2766 -948 5180 5011 -1388 -5631 -5232
792 -5232 -2041 2334 2461 -2473 -3787 2038 6832 4551 -538 -3899 -3165 498 2708 465 -2366 -1491
808 -1491 1496 3534 3179 -48 -4648 -5066 -1022 1915 487 -2148 -2207 1046 5145 5531 532 -4293
824 -4293 -3492 961 2841 516 -2387 -2212 1225 4222 3408 -1009 -4567 -3919 -873 981 -134 -2119
840 -2119 -1867 1417 4677 4624 883 -2924 -3220 309 2557 656 -2713 -2914 1035 4526 3534 -893 -4341
857 -4341 -3464 207 1767 -660 -3213 -1978 1602 3958 3538 565 -2316 -2296 275 1985 1093 -985
873 -985 -2259 -330 4013 4675 -519 -4976 -3634 136 1371 -438 -3213 -3482 1594 6172 3473 -1463
889 -1463 -1651 329 69 245 726 -1377 -2569 490 3133 2460 1264 -1668 -4912 -2590 3183 1620
905 1620 -4533 -4233 1247 4428 4145 986 -3505 -2126 3759 2460 -3935 -2593 2353 727 -679 2719
921 2719 1757 -2621 -1575 560 -2161 -1698 1409 -1962 -3938 3814 7125 -1081 -5081 218 3426 2355
937 2355 358 -4789 -4878 5341 8728 -2076 -6279 1328 1853 -3280 -228 1753 -4425 -4318 2570 2605
953 2605 1501 4997 384 -8194 -1186 9597 3124 -7033 -4524 163 2774 7039 2228 -8854
967 -8854 -4317 7618 822 -8737 335 6090 -4183 -5307 5454 5261 -623 261 -1901 -4797 3682
982 3682 6842 -4776 -6120 5585 4225 -4004 347 2879 -3519 -815 2940 -7691 -7584 11097
996 11097 9838 -11270 -8755 10192 7492 -3942 -1360 173 -4291 302 4300 -736 1623 5379
1010 5379 -5884 -9506 7528 10722 -6764 -9843 -705 -1649 2201 13028 1207 -16591 -2066
1023 -2066 16265 2604 -9705 1202 2997 -6582 -1354 7209 2907 394 -1258 -9840 -3562 14638
1037 14638 5791 -16715 -7988 10470 2770 -3663 6643 1924 -9958 904 9160 -4469 -5365
1050 -5365 9232 2258 -12176 -1069 11410 3637 -3274 -4460 -8403 -179 12219 -98 -13728
1063 -13728 2683 11588 -7684 -7615 15094 8547 -14598 -7913 6979 2262 1988 7227 -5828 -13326
1077 -13326 5261 14073 -1102 -7429 -3222 -5125 -21 9621 926 -7498 3852 3476 -11020 1259
1091 1259 20439 -68 -23167 -3620 16172 4162 -3555 1335 -4825 -6084 7433 5982 -7129
1104 -7129 -2790 3047 -6279 -3675 10297 4646 -6200 190 696 -7365 4664 14897 -6242 -17342
1118 -17342 5876 14200 -4506 -5757 6888 -145 -8843 -817 2607 -386 3721 -239 -11550 -1058
1132 -1058 15463 4616 -9362 -1075 2068 -5688 3181 11326 -4935 -11592 5437 6996 -5891
1145 -5891 814 9358 -5849 -13728 2046 9330 2104 -1401 -4922 -7016 5963 12974 -2996 -10333
1159 -10333 2963 3607 -6356 2455 10493 -3440 -9003 3699 3917 -4193 2373 4403 -9468 -8351
1173 -8351 7986 7153 -3758 -2070 1093 -1659 2447 4844 -3571 -3563 5592 -72 -7995 3546 10726
1188 10726 -3105 -8502 1837 2567 -3255 1426 2035 -6471 -3061 6470 2132 -2768 3096 2282 -5680
1203 -5680 -1513 5413 771 -1848 1413 -2686 -4275 6626 7599 -6268 -7786 3161 2542 -3086 924
1218 924 2031 -3733 -1590 4128 1125 -771 2548 -1177 -5355 1627 6454 -557 -3303 1129 378
1233 378 -1113 3202 1269 -6066 -3168 3775 -70 -3761 1954 3371 -1980 -1081 2803 657 -787
1248 -787 935 -910 -2515 1954 3186 -1772 -1075 2622 116 -2939 6 971 -2140 -1137 827 -1717
1264 -1717 -1016 3707 2192 -2664 -1031 2254 394 -655 857 -278 -1437 1241 2056 -685 -443 781
1280 781 -1576 -2527 777 1247 -1630 -1492 772 747 989 1457 -539 -1851 518 1749 -343 -768 674
1297 674 649 162 1056 446 -1122 -883 -375 -1259 -1179 465 -18 -1005 480 1958 625 -352 -47 249 135
1316 135 406 193 -572 147 1350 733 -401 -580 -341 -517 -599 -749 -844 -323 239 484 390 680 408 -265
1336 -265 -194 510 276 -89 -170 279 841 1003 511 -672 -969 -368 -142 -890 -1285 -646 138 588 519 410 301
1357 301 262 100 104 6 99 43 126 396 833 580 -175 -787 -806 -282 -335 -1000 -1183 55 967 550 201 283 163
1380 163 225 391 -84 -513 48 675 398 119 638 356 -735 -854 -177 -445 -662 -617 -798 97 1303 741
1400 741 -670 -92 879 164 -478 265 349 -178 733 1114 -228 -193 1017 -231 -2067 -856 253 -837
1418 -837 -872 503 221 -107 1004 715 -660 654 1330 -1365 -1052 1713 1513 -854 -34 736 -760 -354
1436 -354 1096 -1218 -2687 -16 1242 -792 53 1790 -363 -1345 1205 1033 -869 317 520 -2050
1452 -2050 -23 3639 1179 -2908 -143 1803 -1483 -1280 1618 -857 -3077 530 1891 -832 483
1467 483 1734 -1538 -1966 1946 1463 -1235 622 752 -2144 681 4295 -367 -3793 892 1354 -3699
1483 -3699 -1015 3652 -1129 -4610 655 2370 -494 647 2102 -2755 -2411 2942 1374 -1285 1327
1498 1327 648 -3532 962 4689 -1306 -4563 1340 788 -3906 1116 5696 -1993 -5495 2336 3207 -1007
1514 -1007 854 1502 -3475 -1974 3776 1785 -941 1523 -875 -4954 1422 5516 -2050 -5262 1511
1529 1511 514 -4330 2707 6476 -3229 -5963 2878 3227 -1731 1225 2073 -3940 -1998 4203 1816 -755
1545 -755 1885 -2195 -5907 2333 6018 -3377 -4711 3113 -284 -4721 4497 7184 -4838 -6400 3422
1560 3422 2840 -1958 2318 2198 -4985 -1960 4724 1654 -776 1406 -3388 -6084 3362 6072 -3679
1575 -3679 -3601 3371 -1645 -4594 6187 6756 -6354 -6177 4387 2488 -1744 3210 2013 -5370 -1897
1590 -1897 4314 888 -707 1183 -4316 -6045 4469 6215 -3715 -2742 3631 -2276 -4194 6739 5607
1605 5607 -7090 -4746 4893 1384 -1946 4122 1711 -6163 -2022 4015 620 -237 1150 -4714 -4803
1620 -4803 5646 5389 -4246 -1666 3631 -3354 -3936 7125 4767 -6932 -3398 4560 196 -1233 4792
1635 4792 485 -7066 -1547 4278 377 -449 958 -3927 -3600 5097 4018 -3667 -466 2739 -4287
1650 -4287 -2841 7780 3919 -6526 -2458 4016 -175 -892 3823 -960 -6530 -225 3777 -575 86
1665 86 1930 -3262 -3018 4637 3145 -3169 132 1674 -4364 -1425 7406 2248 -6208 -988 3759 -1196
1681 -1196 -983 3396 -929 -4997 149 2493 -576 1130 1877 -3682 -2763 4119 2550 -2545 475 1323
1697 1323 -3414 -154 5923 808 -4967 29 2143 -2385 -701 3520 -979 -4499 334 2311 -12
1712 -12 1135 989 -3232 -1530 3686 1463 -2104 498 1427 -2443 39 4111 -133 -3682 160 894
1728 894 -2217 215 2858 -1357 -3189 1399 1893 -595 474 906 -2369 -1020 2943 528 -1322 1691
1744 1691 979 -2026 -281 3300 -460 -2182 37 456 -1932 361 2011 -1340 -1723 2042 502 -297
1760 -297 899 976 -1474 -883 1932 461 -615 988 202 -1943 -27 1888 -848 -2067 269 432
1776 432 -949 466 1378 -763 -1020 841 483 -503 619 396 -934 43 1547 289 -713 315 -60
1793 -60 -964 8 481 -996 -934 516 218 -658 448 644 -480 -395 835 249 -458 436 573 -159 201
1812 201 687 -267 -555 182 -138 -849 -449 160 -351 -175 387 -38 -147 353 348 -241 -41 323 77 188 524
1833 524 421 -96 -253 155 -220 -416 -340 -555 -562 9 350 -101 -195 180 213 191 253 121 -72 -24 269 384 340
1856 340 86 29 -79 93 -77 -382 -577 -491 -126 121 252 -113 -112 162 183 236 -297 -67 184 261 336 449 53
1879 53 -62 -6 34 -214 -358 -455 -404 -175 259 80 -154 23 240 79 215 107 -131 -71 303 562 235 295
1901 295 128 -73 -93 -22 -485 -718 -309 21 -175 -41 96 -151 30 633 123 -679 2 615 18 -137 508
1922 508 331 -114 162 386 -260 -513 -226 -648 -415 529 166 -838 -300 572 258 37 92 -490 -594 946
1942 946 1168 -670 -390 944 367 -681 278 466 -949 -1047 102 20 40 706 -378 -1098 627 1399 -638
1961 -638 -873 543 165 -338 896 794 -901 147 1312 -610 -1699 949 909 -1574 -1242 614 258
1978 258 -55 625 -300 -926 830 725 -1154 109 1809 -379 -1717 1054 1959 -511 -564 145 -1533
1995 -1533 -911 2190 842 -2597 -933 1594 304 -421 962 -143 -1366 164 715 -304 1328 1540
2011 1540 -2332 -1973 3064 2415 -2200 -1761 789 -831 -505 1927 27 -2468 100 1781 -1010 -522
2027 -522 2023 -164 -2317 173 1615 200 1063 575 -2779 -960 3498 817 -3653 -324 2227 -1595
2043 -1595 -2164 2406 1613 -1736 -508 350 -1141 1205 3000 -1233 -3327 1089 2265 6 463 117
2059 117 -2698 -675 2651 449 -2958 1388 1151 -3838 -908 4833 1931 -3888 -1837 1185 605 1628
2075 1628 1635 -2654 -2275 2398 1593 -1359 914 1072 -2976 -1851 2716 986 -1562 752 -235 -3388 1004
2092 1004 5165 -459 -4721 203 2644 -409 -10 1518 -921 -1066 1249 -392 -1146 2553 1095 -4424
2108 -4424 -2130 3774 1416 -1790 474 -68 -2629 990 3726 -1042 -2974 1522 1082 -2153 1168
2123 1168 3496 -908 -3109 -201 596 805 2346 -1245 -5067 -264 4825 314 -2797 827 537 -2848
2139 -2848 1013 3776 -357 -1940 575 -115 -1285 2940 2780 -2947 -3387 1470 1674 -155 427 -1196
2155 -1196 -2839 1277 3059 -1346 -1715 2405 132 -3607 595 3987 -230 -2100 298 179 -544 2062
2171 2062 1054 -3056 -1564 1892 -130 -1183 1271 772 -2545 -13 1594 -789 316 1939 -1676
2186 -1676 -3539 2226 4337 -879 -2426 608 409 -826 1272 905 -1997 -1109 656 -662 65 2573
2202 2573 -176 -3315 -251 2665 416 -317 335 -1470 -1236 2811 2448 -2266 -1412 1513 -19 -1440
2218 -1440 863 857 -1432 -972 632 -28 444 1409 -1028 -2107 1118 2039 -939 -862 1324 -4 -915 887
2236 887 824 -1088 119 1076 -1292 -1323 1497 1203 -1299 -802 531 62 249 991 -462 -1172 698 705 -595
2255 -595 484 1537 -902 -1808 860 1295 -415 -647 -376 -943 -42 1702 43 -1797 -425 887 193
2272 193 34 402 -348 -767 754 825 -281 181 336 -976 -518 1143 412 -1454 -836 406 26 -47 267
2291 267 -329 -502 622 601 -543 -364 626 308 -171 378 222 -338 246 600 -373 -354 121 -267 -355 413
2311 413 405 -569 -757 402 486 -45 -120 -369 -206 603 921 -110 -507 169 350 211 96 -196 -660 -340 305
2332 305 232 -105 -135 -190 -249 392 557 -188 -655 -58 581 570 280 -87 -321 89 586 211 -494 -683 -91 234
2354 234 209 -15 -441 -397 93 412 219 -141 -263 -63 194 669 323 -239 -258 213 420 131 -308 -519 -361
2375 -361 239 377 -95 -422 -324 142 367 186 -225 -403 5 348 262 224 -5 -158 -35 329 241 -232 -712
2396 -712 -412 163 387 26 -439 -617 145 593 123 -376 -311 -39 336 518 56 -338 -88 371 344 74 -160
2417 -160 -335 -321 84 285 146 -424 -548 105 464 455 -231 -800 -358 708 708 -167 -351 -74 368 459 236 -444
2439 -444 -520 -78 303 -186 14 -73 -419 -354 383 365 -90 -239 -156 -84 652 725 -374 -743 461 997 8 -588
2461 -588 -237 67 100 279 -327 -524 183 533 -248 -319 307 -57 -395 388 525 -328 -232 356 -23 118 826
2482 826 -38 -1428 -297 1293 587 -991 -716 -102 354 720 151 -1049 -373 804 154 -186 567 331
2500 331 -975 -77 1103 19 -734 -459 -791 -563 813 1036 -896 -1542 334 923 -165 -265 -322 -531
2518 -531 337 584 -725 -452 1176 597 -1333 -119 1364 -152 -841 296 188 -652 97 402 -678
2535 -678 -125 963 -435 -1296 569 1334 -353 -712 -88 -250 797 1552 -555 -1937 122 1577 -659
2552 -659 -1176 503 -351 -1156 332 1251 -155 -795 -263 -964 218 1867 769 -1891 -929 1249 764
2569 764 322 229 -1538 -2046 1283 1294 -1209 -793 1118 -349 -1692 789 1723 -628 -1091 36 21 279
2587 279 1171 -224 -1408 512 1398 -662 -744 1067 150 -1216 22 401 -527 613 1537 -1100 -1569
2604 -1569 1915 1768 -1064 -869 352 -80 -300 940 434 -761 143 -59 -1091 579 2096 -793 -2682
2621 -2682 -15 1813 313 -84 -148 -1677 -800 2068 1265 -1657 -705 938 -248 -162 1593 471 -1219
2638 -1219 -542 58 -260 983 918 -1683 -1765 1551 1576 -1232 -598 579 -374 -587 1008 403 -801 470
2656 470 676 -1093 -325 1770 391 -1363 -339 247 -354 420 815 -1037 -881 944 163 -1057 781
2673 781 1417 -1336 -1702 849 1506 -79 16 -533 -1242 570 1917 -218 -1743 -177 431 -190 505 800
2691 800 -963 -1089 569 417 -140 861 254 -1485 -205 2217 1101 -1160 -657 347 45 495 611
2708 611 -893 -803 662 292 -689 393 794 -742 -711 560 267 -331 467 197 -796 163 1297 -200
2726 -200 -925 686 689 -801 -650 609 234 -183 70 -688 -522 861 989 -868 -922 555 274 -9 620
2745 620 253 -834 -209 704 201 -202 348 -352 -1085 303 1215 -56 -983 -251 167 377 654 -205 -1090
2764 -1090 -171 976 277 -330 243 151 -524 120 617 -59 -620 -114 -154 -315 423 155 -617 -399 547 330
2784 330 -275 -181 82 157 333 182 -469 -266 653 463 -450 -170 178 -106 -107 274 38 -434 -37 219 63
2805 63 47 180 -381 -409 503 631 -16 -371 24 182 356 412 -238 -583 101 452 44 -250 -205 -206 -235 338 251
2828 251 -286 -266 -62 131 247 289 -90 -380 190 453 143 -269 -313 -171 213 184 178 -161 -168 224 262 -117 -271
2851 -271 114 -253 577 859 182 -233 321 -41 207 231 -137 -465 -158 182 300 -182 -388 -180 121 310
2871 310 160 -262 -273 -32 485 -92 -496 -183 355 371 311 367 -141 -267 -132 74 82 87 -355 -309 -8 220 235
2894 235 -317 -226 -452 -93 395 -76 -233 -123 502 191 77 -199 -152 29 277 132 66 -326 -204 -4 107
2915 107 105 -109 -337 -80 371 365 98 -191 3 177 381 161 -325 -380 66 136 153 -172 -351 -121 95 187 -38
2938 -38 -255 -83 -169 52 295 77 -190 -304 229 350 230 -170 -287 -194 282 178 -124 -479 -74 185 216
2959 216 -24 -371 -141 117 312 -17 -273 -37 171 126 233 224 -126 -414 -28 234 79 -220 -401 -359 139
2980 139 408 141 -519 -260 92 220 137 129 -284 -227 396 420 -219 -143 87 -53 -219 254 253 -252 -306 110 166
3003 166 136 50 -311 -229 355 368 -293 -208 255 271 -34 200 59 -201 136 418 -178 -418 190 100 -98 -47 196
3026 196 -253 -221 174 92 -71 134 -243 -344 406 862 -59 -683 28 410 144 134 -26 -537 -253 451 291
3047 291 -251 -71 31 -263 64 501 166 -275 -175 -47 -62 502 376 -737 -537 446 492 -615 -320 76
3067 76 -83 -60 265 -56 -332 218 232 -420 -14 493 83 -352 265 193 -310 14 278 -208 -154 271 -52 -483
3089 -483 367 620 -518 -640 264 367 -34 108 -309 -568 226 856 -56 -486 40 107 -170 300 532 -399
3109 -399 -627 100 144 -12 417 -3 -949 -284 862 409 -446 -193 -100 14 442 371 -319 -486 395 49 -396
3130 -396 399 400 -461 -405 246 286 -135 182 43 -412 -49 451 35 -358 239 237 -372 -112 327 109 1 127
3152 127 -281 -396 481 538 -499 -494 319 -45 -50 273 170 -523 -244 385 64 2 297 -189 -586 233 786 145
3174 145 -521 -280 -260 23 600 85 -744 -301 486 67 -260 238 12 -512 -147 449 73 -140 174 -308
3194 -308 -115 423 452 -288 -224 206 -34 -228 87 154 -293 34 237 -358 -171 590 254 -594 -76 452 77
3215 77 -131 334 -178 -309 97 295 -169 35 257 -300 -221 412 418 -303 -179 -1 -105 211 394 -147 -536
3236 -536 -81 429 68 -136 13 -217 -331 76 458 -10 -204 6 -196 -57 321 37 -387 -223 254 69
3256 69 -95 94 -109 -175 165 238 -266 -118 224 142 -261 25 184 -57 16 23 -96 -104 93 56 -184 162 232 -182
3280 -182 -43 304 93 -240 -81 71 -85 145 155 -154 -275 154 371 -141 -84 -112 -131 -28 204 76 -197
3301 -197 -14 113 44 194 173 -20 -320 -31 223 126 -118 51 -71 19 234 -48 -231 -110 190 103 -97 138
3323 138 41 -42 157 134 -74 -36 -17 18 -59 -20 -11 -210 -98 215 86 -201 -68 -209 5 37 157 -35 -93 224
3347 224 156 7 -94 2 -166 38 182 23 -176 -82 72 -1 99 -24 -147 -33 189 173 -68 -2 0 16 209
3370 209 116 34 -230 -7 98 29 -75 -14 14 89 33 -36 -25 -6 33 -11 -28 254 0 -4 80 151 38 17 -109 23
3396 23 57 3 -38 -140 -83 -18 161 30 -44 -116 -69 -13 76 21 -41 17 30 116 150 -28 -26 -9 40 61 -56 -142 -139 53
3424 53 97 78 -201 -117 39 -6 137 29 -85 20 163 78 36 -73 -40 9 34 102 -15 -102 -93 -70 26 39 -40 -103
3450 -103 -9 82 45 -68 -154 111 145 96 97 79 -196 -123 97 41 -178 -40 -52 -45 63 90 -10 -84 -56 21 -11 -84 38
3477 38 -120 -16 220 197 -106 -81 53 84 -106 -37 -178 -199 77 88 -32 -52 -10 4 -10 40 60 -70 -78 159 202
3502 202 36 34 69 -83 75 140 -47 -325 -53 158 91 179 -82 -189 -13 171 -40 -168 -168 -32 -7 189 169
3525 169 -35 -222 100 142 -66 18 125 -106 -184 138 171 -110 -111 22 -83 75 161 -57 -80 131 89 -124 -66
3548 -66 322 -50 -181 11 126 -218 34 167 -95 -133 -27 75 -105 47 121 -320 -247 70 146 52 170 37
3570 37 -332 74 373 -52 -372 14 91 -142 243 163 -228 -234 77 91 -25 91 55 -373 0 388 74 -133
3592 -133 79 -97 -39 287 302 -227 -173 161 39 -215 -32 205 -278 -187 128 -71 -174 137 62 -224 17 365
3614 365 -120 -121 140 83 -448 107 281 -76 -213 156 -70 -348 265 326 -310 -404 76 88 79 156 -94 -464 8
3637 8 366 112 -170 133 -139 -411 143 559 -8 -194 42 -44 -42 194 193 -394 -236 363 96 -74 116 -14
3659 -14 -403 -19 314 -62 -112 210 -152 -199 352 361 -189 -172 169 6 -178 267 231 -309 -188 192 -134 -70 239
3682 239 76 -457 0 366 -69 -42 277 -88 -386 271 357 -265 -124 85 -191 -164 357 291 -226 -212 58 18
3704 18 140 371 -129 -473 -14 309 -13 -114 99 -295 -283 287 333 -241 -8 64 -165 -139 500 203 -441 -138
3726 -138 202 -25 -61 108 11 -346 125 217 -93 -158 94 -66 -359 248 183 -49 -1 104 -89 -37 376 48
3748 48 -259 81 205 -171 -144 151 21 -294 -50 110 146 109 213 -161 -277 208 255 -151 -77 67 -251 -41
3770 -41 315 101 -320 22 121 -102 51 134 -166 -403 -21 118 -59 47 -25 -155 -2 304 76 -219 44
3791 44 91 -210 10 248 -69 -171 -40 96 -211 -109 115 -94 -194 52 82 -22 -32 161 -101 -37 251 42
3813 42 -47 200 32 -291 -54 196 36 -154 -69 -43 -15 73 325 -13 -192 -15 58 -45 65 114 -122 -34 162
3836 162 98 32 -90 -72 -195 -6 190 -31 -222 -125 67 -69 38 35 -53 -47 -66 27 -221 13 51 79 -7 74 -15
3861 -15 43 86 -19 -8 -146 45 -151 -72 61 59 -36 -73 -1 18 124 29 -34 15 83 153 1 -55 22 59 51 25 70 -31
3889 -31 -64 118 -93 -78 -20 9 -44 115 77 16 -49 61 19 -5 -15 39 -159 22 71 -4 -76 33 -19 -16 1 -15 -66
3916 -66 -4 54 126 52 -26 -48 -7 13 135 10 -10 83 10 29 19 39 -107 -121 -3 129 -87 -74 -43 70 -32 70
3942 70 -4 46 47 30 -27 17 -102 -69 -62 22 106 -78 5 54 7 -7 -51 -138 -159 54 -113 -190 -28 92 -25 -23 204 111
3970 111 -3 -165 73 45 -88 -24 -89 74 -16 -5 -134 -64 25 -38 -13 188 8 -130 -64 177 22 -103 33
3993 33 -40 -64 -39 37 -145 -199 -22 -18 -31 63 51 -68 -38 145 -50 -96 59 -56 -147 99 164 -36 -159 133 14
4018 14 -179 16 109 -50 -137 130 -110 -234 20 63 -189 43 141 -89 -47 216 58 -196 -22 345 55 -58
4040 -58 4 66 -383 530 349 -174 -218 200 44 -19 224 38 -248 37 174 -19 -54 122 -53 -108 58 115 -34
4063 -34 -202 69 -117 -193 152 145 -234 -129 133 -66 -39 241 36 -177 165 433 -212 -419 -207 -42 59 177
4085 177 343 -204 -18 5 6 -180 192 109 -166 -212 266 -172 340 1089 -275 -119 -452 135 181 -58 -57 -96 -453
4108 -453 242 295 -176 -841 -472 67 -270 413 232 -322 -177 183 -112 128 349 -70 -482 158 245 -131 -47
4129 -47 233 -187 -363 297 653 -273 -221 143 -274 -110 461 128 -338 -13 149 -158 120 390 -254 -488 213
4150 213 242 -197 -47 140 -264 -333 298 138 -223 -51 13 -256 -65 410 102 -328 44 126 -135 158 443
4171 443 -133 -307 103 207 -283 78 228 -406 -475 311 259 -187 1 0 -316 -93 570 115 -290 86 3 -282
4193 -282 211 397 -196 -518 143 62 -272 70 111 -469 -322 417 236 -278 167 151 -298 -51 535 61 -368
4214 -368 90 122 -218 184 423 -102 -347 143 87 -223 260 130 -343 -126 449 55 -165 282 123 -431 -25
4235 -25 521 0 -308 153 61 -273 13 363 -263 -332 104 68 -205 299 205 -428 -99 300 -13 -135 190 -106
4257 -106 -305 104 498 10 -299 149 70 -246 174 255 -251 -297 203 -27 78 269 74 -341 -18 332 -10
4278 -10 -78 112 6 -344 232 327 -182 -234 216 -64 -205 86 135 -157 -225 95 58 -148 255 12 -279 75
4300 75 204 -75 -43 207 -114 -236 70 313 -94 -129 119 -66 -161 168 227 -179 -251 76 -7 -89 156 18 -174
4323 -174 -24 132 -1 44 156 39 -263 113 103 -61 -75 -42 -144 -100 50 133 -144 -31 128 -14 -80 205
4345 205 33 -96 56 106 -104 32 157 70 40 114 121 -99 -82 160 -21 -84 114 -22 -146 -46 105 -52 -15
4368 -15 88 57 -81 31 72 2 57 42 -73 -168 -81 35 -150 -6 26 -43 -7 82 0 -60 78 74 92 96 117 4 -90
4395 -90 36 56 -113 -47 53 -83 -75 80 -63 60 -47 110 2 35 145 99 -48 18 59 -69 -15 190 15
4418 15 -112 20 52 -23 -24 68 51 -41 -114 -176 -95 -72 9 11 96 34 110 51 28 86 -31 85 11 -64 -173 -13 65 46
4446 46 -55 -135 27 -84 106 -4 28 21 -285 -570 -266 20 214 430 244 204 -346 164 570 144 -191 138
4468 138 -184 -66 -96 195 -7 26 8 -9 0 124 97 -30 49 174 -34 45 102 89 -129 -110 118 8 -106 1
4492 1 -116 -62 69 1 -141 -135 30 -70 -10 60 76 -57 90 101 17 -121 45 -13 -180 -154 134 2 -42 -15 -47
4517 -47 -95 21 37 -102 149 149 -63 -100 44 160 -127 -63 25 -145 -55 116 29 -201 19 -41 -122 -56 199 26
4541 26 -163 142 123 5 97 32 -52 -55 290 271 -145 -62 141 -40 -121 197 -94 -175 -18 196 -126 98 104 -157
4565 -157 -185 93 142 -72 101 224 -116 27 246 92 -145 -13 80 -238 -61 228 44 -134 94 28 -206
4586 -206 121 241 -85 -115 145 57 -81 202 182 -233 -155 377 22 -91 69 -86 -307 71 364 -22 -256
4607 -256 208 62 -217 225 251 -257 -151 125 74 -40 189 87 -380 -146 392 46 -258 49 -123 -315 160
4628 160 558 209 -853 74 341 27 383 -127 -179 -533 587 126 420 538 242 -328 -339 679 -41 -123
4648 -123 52 -153 -438 129 268 -92 -164 253 -174 -232 380 311 -270 -212 179 -49 4 337 6 -542 -88 357
4670 357 -80 -115 192 -191 -365 206 425 -205 -223 184 -124 -194 410 227 -375 -142 214 -110 18 322 -172
4691 -172 -545 -1 619 -428 15 77 -428 -366 779 394 -12 187 371 -279 209 405 629 -323 234 446
4711 446 -311 75 310 -60 -613 10 325 -154 -53 342 -264 -312 314 459 -87 -25 202 -140 -165 473 171
4732 171 -275 -177 54 -130 148 287 -258 -326 103 125 -98 43 283 -276 -249 485 317 -201 -139 -344 -361 -345
4754 -345 742 197 619 -220 230 -12 -104 480 -49 313 -335 -290 83 -92 146 -309 -137 811 477 -317
4774 -317 363 245 -965 -37 80 88 113 368 291 -131 219 28 -353 -234 440 198 -196 226 82 -303 -122
4795 -122 375 243 -188 -4 -107 -226 -32 386 80 -274 66 -54 -123 150 272 -112 -190 239 117 -158 142
4816 142 171 -158 -118 59 641 -347 -276 -255 -300 -152 86 377 -827 -95 -135 326 249 162 -61 8 414 77 187
4839 187 -20 161 -217 154 643 -382 -556 118 9 38 140 70 10 -126 52 50 -141 161 184 -108 -334 467
4861 467 -57 -601 632 300 -258 283 749 119 -167 182 -34 -332 15 328 -131 -203 163 -129 -22 -76
4881 -76 174 -258 -136 91 -175 73 -15 62 -164 74 183 31 -44 18 85 -32 71 116 -248 1 74 39 32 53
4905 53 62 -26 156 103 10 -90 33 -6 -130 6 45 -8 -161 61 56 -99 -31 -32 20 55 97 -12 -15 70 38 -3 -143
4932 -143 76 -45 -67 5 68 -106 189 186 -284 -127 40 188 331 158 200 105 -73 266 230 -39 103 -82 -122
4955 -122 -107 116 32 -178 21 -83 58 -40 33 -41 51 110 68 -79 268 97 195 156 -46 63 -176 60 -74
4978 -74 76 48 107 -195 32 68 108 -29 -402 -373 174 -282 211 -38 -55 -27 154 -5 50 77 -52 16 73 54
5002 54 -71 -175 26 6 134 118 -157 -107 17 67 283 100 211 -106 -9 756 231 -27 489 669 331 -584
5024 -584 435 -91 -266 32 -25 -162 -68 -36 -170 58 110 12 -196 171 -132 108 -69 261 381 -333 306
5045 306 394 178 6 -36 50 -61 140 3 -140 -54 114 24 -39 35 -55 -159 285 225 -77 -21 157 53 -170
5068 -170 76 160 -145 -69 248 -41 -100 113 192 -209 64 33 -132 -85 178 -111 -192 177 36 -24 91 196 -270
5091 -270 -328 158 156 -89 -175 -6 -253 13 424 97 -275 6 206 30 200 189 -20 -345 122 141 -57 19
5113 19 126 -267 -97 315 95 -194 54 49 -116 -86 278 27 -196 3 205 -169 46 200 -216 -237 150 181
5135 181 -165 63 121 -235 -168 256 114 -382 65 184 -190 -163 449 155 -235 76 -60 -192 200 293 -151
5156 -151 -332 137 154 -135 227 135 -496 -283 261 93 8 480 -120 -249 141 386 -181 -401 -92 101 -121
5177 -121 178 185 -241 -247 264 43 -137 176 -12 -461 5 397 111 -234 118 1 -227 230 460 -145 -311
5198 -311 160 69 -221 126 239 -230 -143 260 -56 -258 293 48 -460 -148 264 -19 -264 97 106 -401 189
5219 189 371 -32 -124 208 -214 -236 397 291 -438 -187 -115 39 -347 197 230 -583 166 242 177 -78 267 -448
5241 -448 57 476 409 -892 -35 -115 -201 609 178 -685 -536 -7 330 408 568 724 -611 523 -309 295
5261 295 153 47 323 -147 -190 52 279 -243 -78 -243 -559 -561 -280 -23 281 148 195 -103 127 706 174
5282 174 -309 58 136 273 -276 -69 7 -238 408 88 87 -232 314 -337 42 77 163 -171 -39 -78 33 75 319
5305 319 -89 -452 252 244 -256 218 267 -117 -88 43 198 -559 -185 61 -149 39 162 1 -280 59 148 -21
5327 -21 39 129 -305 -288 335 155 -249 -153 418 143 184 -67 -112 290 115 -378 -251 -182 8 -281 -171 312 -139
5350 -139 -361 -223 58 38 -168 -76 194 175 478 229 -174 -141 268 69 190 -150 164 108 304 695 -530
5371 -530 -187 671 712 245 68 -103 164 224 -152 66 405 -292 -128 -628 -143 317 46 -172 -76 153 132
5392 132 68 -3 48 22 107 151 -65 -38 204 5 32 -44 19 -58 9 -38 17 -59 11 -102 -6 165 71 -22 -125 76
5418 76 137 64 -17 -50 -64 143 72 -93 -86 40 91 -8 -105 -88 -75 -99 -11 103 9 -21 37 -22 72 313 -76 -68 141 145
5446 145 -29 -27 -124 -70 19 94 -66 -110 7 46 -17 96 82 2 75 27 110 64 -9 21 -64 153 201 125 -93 -104 61
5473 61 -11 16 -173 -256 -12 -28 57 -52 -3 113 -8 -37 175 213 -122 -50 65 5 -80 -7 -2 -136 120 62 -80
5498 -80 -98 -40 40 -126 -2 -64 -140 105 80 -44 -79 169 -210 -3 204 402 -510 -42 -357 -649 86 303 389
5521 389 27 388 582 -206 -55 498 403 351 242 -153 -280 316 -261 211 -290 -43 182 50 0 -118 -67
5542 -67 -55 -67 68 -6 147 -114 -174 -29 247 90 -148 -38 52 -31 193 170 11 -49 146 26 -158 -61 86
5565 86 24 -130 9 -21 -28 -24 141 -225 91 0 159 -317 140 258 -335 -13 43 178 -26 -54 -126 -235 24 265
5589 265 -12 -63 63 9 87 97 -20 -23 -53 140 -116 55 274 -162 -375 110 336 40 -180 -107 -77 -92 46
5612 46 21 -186 -80 140 71 -40 182 -113 -221 92 200 -26 82 167 -38 -103 137 296 -254 -115 153 -63
5634 -63 -168 -40 53 -88 87 -20 -87 -18 308 135 -241 19 149 -151 194 98 -184 -17 224 403 123 66
5656 66 223 -97 -489 105 112 205 2 -319 -635 448 251 -256 -704 69 16 -20 114 146 -337 -184 202 207 -237
5679 -237 29 81 -220 -66 335 122 -266 -49 271 -26 50 217 -109 -242 212 142 -179 -41 225 -139 -274
5700 -274 174 145 2 -16 57 -150 -48 277 29 -184 104 148 -196 11 367 -20 -237 -29 -190 -165 286 213
5722 213 -311 -264 210 72 59 -20 -15 -332 -75 376 121 -67 15 -23 -234 142 360 -175 -326 77 154 6 162
5745 162 125 -282 -211 356 112 -163 162 56 -259 206 238 69 -196 97 -52 -182 -13 90 -162 140 129
5766 129 77 -289 366 158 -413 -478 -251 -428 217 176 36 -43 -38 440 -5 -165 35 96 -126 372 135 167 96
5789 96 58 192 -468 394 37 -355 20 227 561 283 235 -346 4 -186 94 -82 446 247 318 -248 59
5810 59 526 -293 -20 285 132 -340 284 57 457 58 304 -82 243 1007 545 125 58 251 -388 111 3
5831 3 -215 -228 209 314 -161 -1 114 -67 147 220 -1 -135 -52 218 112 -342 234 -38 -127 -80 139 115 -158
5854 -158 69 -382 183 321 -262 -75 35 213 12 -242 35 -214 146 482 741 1044 176 -452 -685 0
5874 0 963 70 551 929 398 553 -162 -164 295 134 887 -342 641 260 -845 -558 -120 355 861 -396
5894 -396 313 273 215 262 315 474 -342 274 297 -761 -252 751 -202 -300 7 -167 -556 235 49 241 -100
5915 -100 -99 69 -89 -49 171 -166 -84 -87 61 72 110 -2 -14 -5 80 69 29 7 74 -60 20 76 -146 -169 -12 190
5941 190 65 -91 5 -85 51 8 5 -34 12 -67 -47 -30 118 100 -73 145 92 80 37 8 80 -25 -69 -69 -69 -157 47
5968 47 57 -65 -191 -50 63 -75 58 34 -15 162 -36 73 57 110 -256 -74 53 12 -66 -63 49 86 20 11 -23
5993 -23 -59 104 85 -58 70 32 -1 -13 103 72 -47 34 11 28 107 -86 -42 0 9 43 -24 -41 -51 -32 39 117 8
6020 8 -77 7 -27 -77 19 225 87 -39 19 15 17 -97 65 -24 48 -24 -17 -186 -10 180 -4 6 20 19 -3 164 22
6047 22 -100 -44 104 99 -37 40 23 -93 -87 36 -15 -94 23 -30 -8 23 47 -49 70 108 -81 -63 157 -70 -135 -2
6073 -2 99 -109 -16 -78 149 -43 -18 -312 -18 65 51 -156 -58 -7 0 -203 -348 -12 -34 28 -7 272 -150 45 -283
6098 -283 -108 229 70 59 26 81 44 54 111 135 -56 -116 253 -111 -114 188 34 -135 39 24 29 -93 72 99 -113
6123 -113 2 21 -72 -12 -41 -41 -202 50 99 -78 71 -73 -4 -1 174 74 -168 -1 231 -47 -173 45 -64
6146 -64 -206 -125 175 114 -59 -86 -108 -157 177 167 -172 -69 180 89 41 190 0 -122 32 199 -1 -63 52
6169 52 -119 -192 47 182 -52 -80 -73 -83 87 232 2 -262 22 170 -92 -15 154 -15 -201 -27 169 -1
6191 -1 61 124 -180 -316 144 219 -21 -105 82 -5 -120 234 143 2 103 77 -191 -229 329 -5 -378 -79 271
6214 271 2 -100 42 -196 -194 128 249 53 61 -28 -164 -2 253 34 -166 -56 22 -79 10 202 -140 -188 111
6237 111 187 -8 -7 204 -114 -131 142 124 -77 21 96 -186 -34 325 -3 -110 1 7 -73 6 91 -145 -127 100
6261 100 117 -68 -13 156 -31 -290 -15 159 -5 181 39 -275 15 200 79 -143 17 -33 -90 24 67 -54
6283 -54 -175 -48 38 -92 108 210 -174 -194 117 72 26 215 -30 -101 151 210 -90 -202 27 -5 -49 60 142
6306 142 -67 -202 -7 80 24 66 135 -25 -15 124 -8 -68 -17 115 -155 10 162 -156 -113 205 -36 -105 33
6329 33 50 -85 -259 225 15 -129 49 157 -135 36 -9 22 -28 56 -27 -225 12 91 -67 -3 -125 -123 -108 176
6353 176 57 -150 -118 32 17 -150 38 -82 -115 41 86 27 -90 65 85 -129 91 146 -8 -204 10 -14 13
6376 13 23 32 -156 -32 143 132 63 27 -5 -77 49 1 -2 -64 93 -57 -144 -36 -107 -51 -40 79 12 -100 81 77 -39
6403 -39 -67 85 -160 -31 155 -78 -89 -93 71 -101 -42 89 -21 -35 34 35 12 -68 67 73 12 3 -27 -34 -43 19 59 66 23
6432 23 4 -170 36 -61 -49 -45 27 -43 -41 82 70 -11 -85 -21 33 -48 -8 -60 -70 37 92 25 -115 -76 90 65 -43 -49
6460 -49 -7 63 74 -131 -87 -91 6 15 -18 59 43 -18 51 -55 -32 93 45 -104 -49 72 94 -150 -11 72 71 -35 -86 17
6488 17 8 -23 12 -21 36 19 23 -39 131 -8 111 -59 -1 -43 -76 -16 -48 -14 27 104 -83 35 20 -47 -92 2 -29 48
6516 48 84 96 -138 85 -11 -199 3 29 -116 -63 -93 17 -40 -129 -3 -32 -94 59 97 77 -120 51 37 81 135
6541 135 -61 -110 62 93 54 -157 -55 -13 6 44 67 73 16 51 23 63 -45 63 36 131 57 83 -77 57 -19 -9
6567 -9 35 19 15 4 117 13 -214 -50 41 50 22 -34 32 -99 111 13 36 31 34 57 -123 -121 -2 24 74 -21 -21 68 12 -80
6597 -80 -135 32 28 -2 109 40 23 -32 63 47 -133 2 68 -11 6 99 -23 -64 11 -64 -67 -21 -13 -31 41 171 -72 -28
6625 -28 147 122 -7 -148 120 14 -143 130 17 -119 125 122 28 -103 28 65 -100 45 108 87 -71 36 25
6648 25 -25 54 147 -165 -135 171 65 -54 10 -47 -203 -106 106 -57 -10 10 -32 -71 21 171 -60 -108 -47 62 -98
6673 -98 65 222 -67 74 113 79 -92 104 111 -119 -130 2 -153 -76 87 -123 -120 81 156 -21 -26 73 -49 -153
6697 -153 146 67 -66 -69 12 111 -149 147 4 -93 -117 94 21 27 37 -7 27 107 156 -44 -5 51 -32 -62 284 52
6723 52 -230 -133 -14 63 -68 -12 10 -31 -63 123 15 7 9 -125 -20 -9 147 -88 25 33 -133 -5 151 -52 -133
6748 -133 -86 36 -44 -136 115 28 -32 76 100 -51 -10 75 -78 -65 139 169 27 30 58 -63 -90 231 9 -158 -72
6773 -72 -45 -81 101 92 -44 -207 112 108 -119 73 35 -79 9 133 92 -66 22 7 -46 -54 131 -22 -42 47 124 -53
6799 -53 26 121 -76 -170 99 161 9 56 38 -166 31 161 62 -67 -94 -32 -216 -40 207 -86 -141 126 45 -40
6823 -40 4 196 20 -214 -23 59 -132 71 29 -109 1 262 49 5 3 -35 -106 7 15 -31 -135 -3 28 -47 213
6848 213 132 -26 -110 137 87 -78 57 -24 -155 14 61 51 -146 -82 9 -196 -35 153 91 -180 87 167 49
6871 49 77 28 -32 -124 138 80 -31 -71 -35 -120 -59 20 -55 -27 115 -85 -69 47 164 -2 -97 108 -34 76 74 100
6897 100 -40 176 74 -69 -3 -20 38 0 -17 78 -146 128 -150 174 344 347 443 -113 438 -505 114 435 312
6920 312 -413 538 631 33 -73 -424 127 31 -253 57 -35 -65 3 35 -15 1 74 111 -15 -70 82 51 -108 58
6944 58 -17 -46 138 203 -37 348 -214 -721 284 -476 -40 -66 -102 90 30 5 -12 99 92 -50 64 -47 16 -95
6968 -95 -45 -104 -79 60 42 74 2 -10 5 -37 43 -30 -79 26 22 90 -23 92 61 -198 42 -5 52 -30 -19 -76 -58 -5
6996 -5 -82 -111 34 54 6 -10 106 9 145 23 71 55 14 -10 -92 -157 -22 -28 -30 -33 2 4 -19 -18 0 66 165 71 67 41 -48
7027 -48 -11 -37 14 0 19 33 -31 -111 -33 -11 -35 -26 -118 -15 -103 4 9 -88 -118 -33 -25 -73 -126 74 89 17 83 73 -22 36
7057 36 -112 -60 28 26 -32 -83 73 81 67 -41 70 -59 74 37 23 22 -19 24 49 69 -28 30 -51 -46 8 60 -77 -5 -114
7086 -114 -57 26 -116 -61 83 -40 3 67 203 57 -29 12 97 49 31 61 52 -8 52 -6 11 96 52 -204 9 74 -112
7113 -112 -57 -89 0 -159 8 3 24 70 0 -22 31 -29 -98 21 -55 -23 -84 41 -51 0 -88 -48 28 -77 34 222 118
7140 118 -114 -17 72 40 4 34 84 -108 58 -35 1 36 -45 -56 -66 69 2 -190 -19 39 -123 -58 219 -46 -124
7165 -124 -95 149 40 -76 65 78 -76 -64 73 -9 15 -46 -28 -40 23 62 104 -12 -78 -72 -12 123 -18 -55 13 33
7191 33 -46 -107 54 -69 14 -58 72 14 -35 16 -48 -70 120 41 16 76 -15 -92 14 210 -85 -82 76 152 26 60
7217 60 23 -148 -45 36 -41 -73 42 -93 -59 46 85 -7 14 123 70 54 78 141 -93 -85 137 29 -133 0 65
7242 65 -52 -71 -37 50 76 -9 -95 -12 123 16 11 -5 -8 -73 -104 -6 31 -19 -199 8 76 -19 106 80 -180 119 81
7269 81 -155 -16 49 -64 42 93 170 1 -23 64 -118 -57 163 143 3 -30 47 37 -50 28 37 -145 -73 104 -17
7294 -17 -101 37 8 5 21 123 19 -54 68 44 -72 118 75 15 71 31 24 -196 116 -3 -49 106 77 -90 -30 -2
7320 -2 -23 -98 38 67 -17 17 13 -38 -124 -61 -5 -215 -73 -36 -19 15 72 7 -85 64 117 0 9 8 59 2 31 117 -93
7349 -93 23 15 -23 -63 67 90 -231 53 48 -64 8 -23 54 -120 -37 29 31 66 -40 -15 -69 105 39 -42 -16 127 -103
7376 -103 -52 51 -118 -49 -38 20 -33 5 152 40 -171 60 92 41 -41 42 -42 5 58 -112 1 -17 23 -75 9 63
7402 63 -111 -81 65 61 107 42 -11 -105 -8 44 101 -50 42 36 -21 -45 105 145 18 -92 60 13 115 167 -37 31 103
7429 103 19 132 64 30 69 57 -50 58 -100 -4 43 -21 31 0 67 -68 12 66 14 -16 -50 -37 -129 -1 81 143 35
7456 35 32 41 14 -4 110 -20 63 -90 -109 23 -32 38 -10 15 -1 41 -79 87 18 -39 1 65 40 72 26 14 -61 -19
7484 -19 17 98 44 4 15 -75 4 -90 -89 9 0 -20 -110 26 35 -33 -58 55 -13 -4 -89 -19 48 3 -131 -7 21 -37 -121 38
7514 38 -15 -42 82 9 144 83 -62 125 -14 13 75 -14 -9 -45 -14 32 37 17 144 -25 13 14 33 -31 0 47 97 -36
7542 -36 -28 -16 69 44 -13 -28 47 -2 16 -35 -50 22 -34 52 3 -3 -171 158 -90 -116 214 279 214 286 -593 -41 -499 274
7570 274 204 -55 338 -14 53 284 46 -134 -23 155 214 62 354 -55 94 -18 234 -392 -577 7 -41
7591 -41 -544 -282 168 -280 359 185 -583 174 -50 -390 197 -528 -454 232 214 187 -44 -103 110 -13 166 -281
7613 -281 220 230 154 -20 126 -9 222 31 16 -20 72 13 36 133 -30 -50 7 28 -119 17 20 -41 14 26 30 57
7639 57 16 161 30 125 -147 294 -208 77 16 -117 -436 30 255 295 -177 374 193 505 -118 -148 -272 28
7661 28 -392 626 469 348 170 -207 107 250 532 -312 176 -42 69 -87 -41 1 -13 -1 14 -108 75 46
7683 46 88 -59 15 -165 59 87 -12 -20 -38 1 -7 51 17 2 -63 -516 70 289 -108 48 55 34 90 -44 -96 -39 99
7710 99 -12 19 -49 -77 -165 113 -16 -46 72 53 -17 -1 233 41 -65 -70 24 -65 55 33 -59 -4 -107 -42 -76 143
7736 143 -118 -61 -67 166 -46 413 -104 -568 -327 -178 536 -213 90 9 0 -57 -61 -29 -12 11 -107 -53 91 47 -51
7761 -51 -80 -12 23 168 86 22 67 -80 -95 30 -45 8 47 -27 -126 78 26 -92 -133 -71 110 127 8 81 -49 216
7787 216 -31 -319 -54 161 21 19 20 232 149 -242 -8 254 -131 -711 35 -393 -252 -36 -69 169 180 151 -61
7810 -61 -33 110 -50 76 121 -119 -49 11 69 69 -117 -17 -114 15 110 -68 -19 -23 118 -37 -42 19 -22 -40 89 35
7836 35 34 -19 53 101 -107 54 114 -48 -22 0 -16 -29 57 -67 -59 -6 50 20 1 136 83 -139 -6 41 79 -12 2 43
7864 43 -37 40 63 -98 42 -5 -12 29 87 103 -69 13 19 87 15 39 32 72 101 11 61 -39 6 97 -27 63 40 -5 24
7893 24 -2 -51 -94 34 -7 43 -30 109 -97 40 27 -256 -29 -87 -351 148 471 196 -19 174 422 -108 72
7916 72 -81 34 -85 90 -108 -72 -490 -99 -348 8 240 -151 53 -124 -16 205 75 -317 357 -590 -2
7937 -2 288 71 218 210 27 33 10 -138 -99 258 294 220 238 243 -169 -338 317 -413 185 -296 261 -154 -298 -200 -335
7962 -335 -537 418 183 -135 -171 -539 504 -543 -125 -327 -47 57 100 119 -89 -89 -124 210 -21 67 -42 196
7984 196 -552 -726 -281 94 559 34 25 -105 37 89 -67 92 38 24 3 -54 9 -19 44 5 -65 -14 34 -79 -80
8009 -80 42 -34 -37 86 3 25 57 43 -57 -162 674 102 155 338 -257 490 -289 -277 -438 -218 66 -202 115
8032 115 -332 148 99 -183 166 -33 -20 -150 100 107 23 66 119 -119 -57 24 -89 -299 -76 0 -7 -46 -155 147
8056 147 -145 -103 324 -116 -135 191 56 -174 -145 552 62 714 -69 49 96 -74 -213 -53 157 -112 33
8077 33 -141 118 87 57 -56 -14 51 16 -122 -27 -53 44 -38 10 -50 14 -159 -36 -26 15 -28 -25 24 1 20 15 -14 1
8105 1 -107 58 22 3 -19 -4 61 7 -155 -100 -22 50 -69 -45 50 -52 -30 -21 60 146 92 -59 5 -2 51 -8 15 14 -3
8134 -3 48 29 -25 0 12 -41 -99 -25 -78 -5 35 -29 -2 33 -49 48 82 -74 21 -27 -127 84 102 -42 -73 -66 -76 -42 -19
8163 -19 23 86 -75 -58 -22 63 -72 24 -74 -101 37 12 -31 -32 18 38 50 62 19 -59 63 54 120 48 16 8 23 11
8191A1
$$ Imaginary data points
##PAGE= N=2
##DATA TABLE= (X++(I..I)), XYDATA
0 0 0 0 0 0 0 0 0 0 0 0 -8 8 -8 8 -16 16 -24 24 -32 38 -42 51 -64 72 -88 98 -114 136 -153 176 -201 230 -259
33 -259 297 -332 375 -420 472 -528 587 -654 726 -806 891 -987 1089 -1202 1326 -1462 1609
50 1609 -1769 1953 -2153 2375 -2624 2909 -3230 3600 -4029 4538 -5152 5905 -6860 8112 -9832
65 -9832 12355 -16418 24056 -43342 195384 254815 -211924 -62238 160269 670 -218332
76 -218332 -58670 24206 -81469 -51441 132537 95198 -23246 19900 86759 -32701 -115095
87 -115095 -19316 67598 -25680 -97893 18204 151439 58130 -94709 -48425 71981 5390
98 5390 -109809 -55785 49140 42646 24208 36571 3475 -13940 43474 23017 -94738 -100250
110 -100250 13519 39837 -7063 18052 64204 36819 -2331 -7239 -8505 -6709 -20971 -73265
122 -73265 -66688 44556 103744 31472 -31112 -11154 16008 24170 5800 -66720 -96025 4242
134 4242 79450 17406 -12674 59913 52509 -44403 -40012 29537 -3611 -72226 -46739 10559 32320
147 32320 49650 40590 -12998 -26188 20179 23398 -34325 -61600 -27648 23922 45072 14254
159 14254 -14512 21189 50368 -9283 -62055 -19512 14522 -23375 -26536 30511 42835 9518
171 9518 6198 11387 -5439 -11281 -17387 -48495 -41903 22878 53036 18351 -5084 8883 26083
184 26083 29269 -1791 -57815 -61211 -312 24491 -2526 3313 31708 16536 -5479 14147 16735
197 16735 -25961 -45724 -27475 -5252 21908 39788 12161 -18762 6909 38055 10253 -33630
209 -33630 -40799 -23265 1989 24127 17231 -2293 7443 24630 9284 -12977 -15007 -21655 -30440
222 -30440 -10539 17661 20038 12892 12689 9990 11119 13589 -9794 -42948 -33274 5533 18240 3976
236 3976 -979 6856 16285 21438 5481 -25485 -33390 -13437 1554 6039 10987 10950 6180 14737 23102
251 23102 6617 -19708 -28863 -24676 -11469 10007 16753 88 -4571 18074 30525 9523 -18640
264 -18640 -28854 -21181 -3845 9138 6142 -1632 3734 17583 22202 10949 -10499 -26204 -21313
277 -21313 -2886 7269 4489 242 1617 9673 19371 13994 -11632 -31064 -21868 -148 8115 3771
291 3771 1229 5650 15568 23113 14975 -8750 -26665 -21713 -4678 3677 -371 -4352 1670 13649
305 13649 20927 14064 -5434 -22464 -20263 -2963 7021 723 -5602 1917 15640 21130 13211 -4484
319 -4484 -20344 -20037 -4785 5867 -19 -8305 -1760 14483 21941 12802 -5280 -18756 -18184 -5305
333 -5305 4654 568 -7470 -2034 14605 23526 14448 -3212 -15115 -15264 -6063 2431 82 -8266 -6119
348 -6119 10638 22576 13624 -5986 -16407 -12814 -4149 1291 -851 -6646 -2892 12815 23303 15036
362 15036 -2148 -12784 -12978 -5824 213 -2179 -9402 -7079 7987 21290 17607 -1517 -16984 -12941
376 -12941 780 2385 -6988 -10113 -1722 10238 19394 16883 79 -12201 -7631 -1726 -5020 -6347
390 -6347 -3613 -4797 -59 16604 20622 1199 -14964 -11338 -904 2389 -3089 -12638 -9288 12843
404 12843 25626 11418 -5223 -6156 -2622 -1543 -1793 -8620 -14332 -2675 12002 10514 7007 8474
418 8474 -3189 -17108 -5645 10362 -964 -17369 -10847 6939 20736 23218 2479 -21023 -9365
431 -9365 15011 5114 -19064 -15212 440 4594 10171 14172 2702 -6268 -2488 -5190 -9170 1806
445 1806 3385 -13650 -9969 17754 24324 6158 -5575 -9698 -6629 8169 4976 -23668 -21287 19043
459 19043 24886 -7893 -10374 12774 8537 -8255 -8143 -8149 -8886 4190 8498 -2318 4844 17391 866
474 866 -13457 3175 9685 -9460 -16146 -8464 -2078 17836 28442 -8230 -35320 4287 36555
487 36555 -607 -34842 -14451 6796 5857 10609 11537 200 1072 3594 -9127 -4102 15349 -3577
501 -3577 -34347 -12021 26165 20153 1965 -3072 -15297 -10334 22730 15494 -33034 -28667 21021
514 21021 21845 -9377 -1665 17722 7031 -6237 -9663 -10909 4589 14787 -13961 -27212 15425
527 15425 33519 -6860 -19090 11095 7281 -16653 -7514 1687 -6646 8878 21515 -10473 -22850
540 -22850 20641 34651 -9254 -32639 -13902 5126 16024 10818 -15425 -14439 20079 14823 -20004
553 -20004 -2912 25400 -12768 -44282 981 38391 13122 -9681 -7189 -8163 7399 30543 3901
566 3901 -39164 -22438 15138 12947 1648 2329 -5126 -2942 12992 112 -17637 7907 16759
579 16759 -29085 -31329 32341 41096 -15713 -25180 10975 13570 -2521 -3290 -10073 -11571 9744 9912
593 9912 -13596 -2550 23143 6684 -17002 -8706 -3571 -3846 13879 8619 -25382 -11669 34914
606 34914 20096 -22665 -5428 19818 -9534 -27274 3473 19793 3254 -8642 -12895 -4401
618 -4401 25149 25702 -20725 -36065 1882 17507 1298 2246 2502 -13519 -346 25942 7091
631 7091 -18263 -557 5764 -20641 -11367 25699 16924 -17336 -15528 5211 13899 13369 -6505 -29634
645 -29634 -9113 25087 8486 -18071 2460 19539 -2447 -9165 7520 1652 -9810 1817
657 1817 784 -14543 396 21527 3471 -14787 408 8444 -4791 -7279 -1418 -1864 4127 5714
671 5714 -9468 -4150 25259 17170 -22552 -20634 11579 11219 -6199 -4100 -3093 -7357 7190 17160
685 17160 -1107 -11032 -46 -2060 -10058 3365 12142 -2748 -9468 1230 6906 10391 10915 -8707
699 -8707 -23471 -627 20523 1602 -15946 -2345 8151 2261 2914 3011 -6803 -6448 2093 -2336
713 -2336 -5321 6426 7428 -5339 -1464 11133 4852 -6050 -4001 -2422 -3516 3308 3182 -7933
727 -7933 -3468 13022 8186 -9181 -8107 2175 1796 -1106 -1840 -5019 -1337 8664 7630 -1237 89
742 89 2582 -4932 -5085 4217 2514 -6651 -4392 2487 4288 5972 3865 -7430 -10230 2689 8427
757 8427 -2197 -8024 -1382 4526 6235 6121 388 -5253 -2115 1878 -538 -1856 -288 -2298 -2472
772 -2472 4233 6967 362 -4911 -3993 -1737 1173 2260 -2528 -5734 1540 9106 5769 -1356 -2720
787 -2720 -1081 137 1204 -673 -4470 -3349 1927 4351 2430 3 -2435 -3531 -986 1801 -111
802 -111 -3350 -3074 1248 5665 6178 1204 -3822 -2626 1973 2485 -1613 -4370 -3430 746 4479 3988 -609
819 -609 -3829 -2374 477 979 -780 -2998 -2720 915 5146 5359 1291 -2494 -2076 969 2109 -457
835 -457 -3891 -3871 459 4472 3949 -433 -3490 -2419 806 1390 -1601 -3891 -2584 1525 4519 4209 1140
852 1140 -1393 -1086 1302 2032 -464 -3522 -3515 -427 3264 3751 -19 -3770 -2859 1126 2295 -875 -3802
869 -3802 -3131 1610 5393 4081 -243 -1762 330 1341 447 -779 -2745 -3028 30 3132 2554 281
885 281 -1027 -2043 -1228 1826 1003 -4423 -4992 1496 5513 3415 52 -1502 -661 3004 3441 -2432 -5631
902 -5631 -1186 2536 1375 635 749 -1410 -1502 999 651 -1502 -1600 -2590 -3071 3415 8007 896 -5769
919 -5769 -391 5288 2569 -1141 -3129 -5312 -950 6470 3021 -5019 -2543 3040 98 -2434 648
934 648 -276 -3328 -977 1678 1686 4248 3251 -5027 -3955 6713 4732 -6773 -5544 3074 2249 -35
950 -35 1751 -1302 -2900 3586 3134 -7038 -5522 4843 2716 -3729 -174 2701 263 2907 3653 -3606
966 -3606 -3083 4360 -1148 -7722 3792 9986 -4886 -10630 3088 7927 281 -3155 -5290 -6794 3737
981 3737 10884 -761 -7978 1850 4811 -1025 2687 4077 -6013 -5981 3807 579 -2535 7564 4432
996 4432 -13752 -7246 14522 8065 -11700 -8686 2291 2451 3389 3991 -3408 -2119 6529 386 -6920
1011 -6920 3629 7179 -7150 -7562 5035 2614 -1986 6132 1323 -12735 -2235 13096 -932
1024 -932 -12838 2442 8511 -5350 -4494 7582 5762 74 -1805 -8211 -3962 13496 8244 -14573
1038 -14573 -9594 9952 4228 -4583 4826 1978 -12934 -3917 10727 1020 -5050 5693 890 -11481
1052 -11481 2081 16497 2819 -10890 -7145 -2203 5285 12798 -1441 -17032 -457 14764 -2438
1065 -2438 -9842 8145 4681 -15540 -5650 13432 4585 -4643 2150 -1386 -7181 6880 12126 -5775
1079 -5775 -10857 1308 2485 83 4948 -294 -7546 2919 5039 -10385 -3525 16496 1428 -21334
1093 -21334 -2822 18554 4437 -6938 1399 -731 -6077 5045 7530 -5082 -3748 3255 -4710
1106 -4710 -4166 10700 6331 -9710 -5836 880 -3342 4842 12772 -7043 -18838 6110 19248 -1729
1120 -1729 -9368 3611 371 -7582 2432 7555 -1321 -2343 -1030 -6245 1742 13788 137 -15859
1134 -15859 -3397 7468 -989 -18 6949 -4518 -9678 8151 10649 -6899 -4383 8158 -1931
1147 -1931 -10871 3114 9875 -893 -4485 -2417 -3566 3103 8454 -4444 -10722 3567 6050 -6030
1161 -6030 -110 11192 -518 -9837 2232 5749 -3100 1266 5018 -7899 -8767 8844 9735 -4563
1175 -4563 -5597 -128 -2071 739 5087 -2369 -5788 2827 1806 -4514 4607 10345 -4904 -11228 3144
1190 3144 7705 -1500 -1338 744 -5041 -1578 8393 2486 -6946 -1552 2339 -3574 -1334 4865 -330
1205 -330 -3875 2054 1680 -1975 4120 5474 -5902 -6380 5554 4382 -4543 -1226 3553 -1596 -2482
1220 -2482 2245 -146 -2651 1505 92 -5134 270 6481 740 -3202 1359 1033 -1790 2185 2723
1235 2723 -4162 -3260 3573 1251 -2767 2204 3216 -3884 -3795 2349 1639 -1813 -951 -1182 -1924 3116 4898
1252 4898 -1111 -2767 1782 1495 -1574 779 1225 -2556 -1353 2567 596 -1225 1243 155 -3532
1267 -3532 -1161 2581 -229 -2803 168 1498 342 1404 1413 -1270 -489 2048 68 -2132 375 1640
1283 1640 -551 -755 721 -266 -1128 129 -472 -1798 -460 836 -399 0 1996 1218 -641 136 902
1300 902 187 -380 -171 -1069 -617 1607 1265 -929 -1025 319 -116 -941 -565 -681 -1049 63 946 569 635
1319 635 909 338 -133 374 545 -331 -803 -335 484 663 224 -683 -755 -48 54 -911 -1311 -588 120 586
1339 586 812 809 398 566 656 172 -315 -144 -244 -368 -70 472 460 -269 -758 -283 -9 -497 -1036 -1089 -344 636
1361 636 856 280 292 508 751 463 -199 -635 -186 192 162 -100 288 309 -351 -468 -226 -338 -927 -821 -333
1382 -333 119 689 964 210 81 973 1057 -238 -643 -219 227 276 291 -205 -340 392 157 -1107 -842 -152
1402 -152 -776 -1106 486 922 133 447 974 156 149 1186 -166 -1792 -241 1574 259 -729 289 64
1420 64 -526 310 -45 -1545 -924 592 -1346 -1002 1778 1321 -1133 -147 1554 61 -547 871 -168
1437 -168 -1651 925 1964 -723 -986 1008 -284 -2166 134 369 -1374 -266 1032 -1085 8 2788
1453 2788 1141 -1802 -191 2698 -730 -1325 1878 157 -2693 471 2238 -879 -941 875 -1901 -2648
1469 -2648 1597 1951 -1537 -354 1040 -1177 608 4176 -195 -4357 471 2894 -1992 -633 3901
1484 3901 -388 -4372 1193 3809 -816 -1854 725 -2352 -1960 2765 2030 -1939 65 1658 -1921
1499 -1921 756 4633 -997 -5073 994 2452 -2706 119 4937 -1732 -5670 1919 4135 -1814 -1607
1514 -1607 897 -2254 -1706 3809 2466 -1683 843 761 -3441 510 5952 -1453 -5959 2248 2082 -3296
1530 -3296 1082 5508 -3568 -7163 2628 4581 -2590 -1106 1707 -2795 -1889 4946 2703 -2226 21
1545 21 -786 -3863 2758 6665 -2802 -5956 3047 2308 -3881 2297 5555 -5641 -7791 3980 4837 -2825
1561 -2825 -189 2182 -3544 -1495 5800 2325 -2677 -139 -1250 -3745 3774 6530 -3667 -5330 3339
1576 3339 881 -4265 3583 5363 -7126 -7188 5459 4738 -2740 801 2196 -4410 -1705 5507 1953
1591 1953 -2427 187 -1996 -3906 4599 6610 -4376 -5167 3067 -373 -4062 4601 4510 -7795 -5808
1606 -5808 6400 3801 -2985 1867 1838 -5386 -1572 5844 1746 -2280 -107 -2593 -2957 5524 5348 -5467
1622 -5467 -4443 3336 -1287 -3879 5307 4339 -7487 -4099 6303 2552 -2313 2719 793 -6105 -744
1637 -744 6108 1224 -2435 77 -2124 -2562 4558 3736 -4955 -2980 2859 -2243 -2844 6283 3707 -7214
1653 -7214 -3213 5645 1481 -1948 2528 -130 -5485 565 5459 145 -1852 978 -2319 -2975 3803
1668 3803 3051 -4317 -2128 1964 -2390 -1119 6560 2145 -6896 -1720 5403 459 -1958 2610 -215
1683 -215 -4587 694 4073 -437 -1085 816 -2950 -2748 3801 2570 -3869 -1448 1927 -1586 -327 5158
1699 5158 732 -5443 -35 4028 -899 -1444 3039 -74 -4020 675 3191 -552 -1028 255 -2789
1714 -2789 -1716 3298 1493 -3118 -74 2255 -1420 -386 3846 285 -3797 272 2229 -1127 -26
1729 -26 2841 -1110 -3497 1145 2409 -1231 -1018 274 -2029 -891 2809 916 -1611 608 1048 -1646
1745 -1646 -185 3070 196 -2544 442 1774 -1127 -180 918 -1217 -2001 936 746 -1712 -241 728
1761 728 -885 -432 1913 633 -1311 536 812 -1095 29 1917 -535 -1644 809 1214 -857 -250
1777 -250 843 -878 -1470 244 86 -996 144 626 -698 -199 1467 534 -504 305 317 -720 102
1794 102 1151 -235 -667 480 347 -785 133 412 -892 -1158 283 394 -343 307 454 -142 106 991
1812 991 146 -626 118 216 -282 123 601 -148 -561 95 47 -452 -251 -336 -618 -297 383 170 -117 195 532
1833 532 206 231 262 -62 -155 349 302 -27 85 141 -152 -250 -2 -336 -609 -464 -71 -3 64 90 214 350 455
1856 455 308 -95 -192 160 228 147 27 6 -4 62 12 -236 -419 -454 -532 -248 105 71 -81 85 405 511 272
1879 272 -56 23 -168 118 423 147 -56 -9 95 37 -15 -333 -667 -561 150 20 -93 -17 132 319 430 435
1901 435 -140 -198 141 205 -23 105 165 -278 204 294 -164 -614 -328 -330 -523 135 547 -329 -579 546 972 59
1923 59 -158 135 -233 119 564 61 -377 398 320 -418 -201 215 -402 -794 -47 -144 -578 435 600 -514
1943 -514 -181 1380 393 -1060 32 1230 -178 -744 212 102 183 773 -226 -1578 -271 954 -534
1960 -534 -981 335 105 -708 666 1275 -582 -448 925 -347 -857 1346 1331 -1605 -1452 1373 1183 -385
1978 -385 -434 -868 -1275 717 998 -1130 -888 1189 -38 -1210 1211 2011 -1094 -1240 815 -12 -395 1687
1996 1687 586 -2380 -493 2264 24 -1863 -125 116 -1195 -121 551 -680 553 1522 -1499 -2011
2012 -2011 2527 2499 -2160 -1746 1534 165 -766 1665 729 -2233 -552 1422 -901 -889 1758 -192 -2974
2029 -2974 -146 2443 665 99 -32 -2202 -639 3999 1668 -3589 -1124 2629 -322 -1660 2283
2044 2283 1300 -2973 -1487 1206 -14 256 1503 -1936 -3047 1861 3480 -777 -1094 367 -1766 -121
2060 -121 2436 450 -3286 900 1996 -2178 -1985 3608 1266 -4495 -1832 2288 549 -93 706 -1626
2076 -1626 -1732 2481 1728 -1737 201 1801 -2080 -2070 2958 1976 -1684 8 22 -2849 490 4895 -593
2093 -593 -5836 -354 3444 150 -612 1501 -878 -1932 1395 1326 -413 1409 463 -3962 -1221 5015
2109 5015 2007 -3465 -1492 585 -1181 939 3072 -1955 -4162 1471 2635 -1502 -136 2565 -1052
2124 -1052 -2780 1038 2002 160 740 -654 -3312 677 4622 -385 -4006 448 1766 -2557 -557
2139 -557 2813 -155 -1995 421 842 -1251 1987 2727 -2629 -3464 1883 2457 -185 161 -441 -2248 452
2156 452 3043 -840 -2208 1320 -139 -3587 702 4651 -253 -3781 -285 1483 341 1809 773
2171 773 -3277 -1664 3046 1553 -1350 193 167 -2145 -217 2435 35 -1796 494 -722 -2158 2415
2187 2415 3544 -2023 -3286 1685 1976 -810 114 679 -1324 -326 1689 -195 -885 1456 161 -2788
2203 -2788 -453 2197 -28 -1259 431 -546 -1236 1867 2137 -1704 -1491 1763 186 -1554 1171 1912
2219 1912 -1268 -1619 525 445 532 1003 -1212 -2890 627 2654 -315 -1458 395 -81 -898 1334 1462
2236 1462 -1318 -997 898 -95 -418 1746 716 -2196 -1101 1575 813 -591 -455 -975 -788 1222 1143
2253 1143 -1244 -752 1283 149 -1081 611 1038 -833 -432 726 19 -381 865 54 -1034 11
2269 11 851 -713 -1043 547 185 -608 -133 268 -384 537 812 -824 -1175 911 1260 -528 -545 319 -205
2288 -205 -153 718 36 -1080 -415 153 -289 81 660 -426 -1034 409 1152 192 -241 -328 -323 271 980 187
2308 187 -869 -148 670 199 -405 -179 -420 -653 32 407 -151 -278 86 -7 25 524 157 -568 -247 608
2328 608 494 75 -230 -214 -79 514 264 -583 -561 26 275 -94 -86 -286 -348 166 487 240 -280 -191 52 114
2350 114 470 350 -295 -347 296 562 204 -419 -723 -390 322 335 -157 -519 -135 276 435 126 -163 -350 -34
2371 -34 395 370 82 -164 -206 138 243 159 -210 -649 -312 190 322 -96 -408 -319 193 622 267 -421 -513 134
2393 134 546 436 21 -300 -28 315 374 21 -260 -378 -407 -90 226 -17 -431 -423 115 452 205 -178 -416
2414 -416 -150 497 718 -11 -435 -114 334 384 -58 -331 -432 -72 320 -37 -389 -6 -50 -150 274 570 -49
2435 -49 -510 -125 498 308 238 -222 -576 271 832 153 -693 -341 132 237 191 -206 -772 -174 693 304 -536
2456 -536 -143 199 -256 -100 593 338 -593 -356 106 467 593 -11 -1136 -552 792 613 -606 -695 -17
2475 -17 -27 547 598 -450 -811 386 850 -374 -176 691 -9 -724 240 598 -35 -369 -200 -455 281 670
2495 670 -564 -1106 596 1062 -436 -862 466 249 50 34 -186 -644 -93 1682 -96 -1178 345 508
2513 508 -398 153 382 -565 -758 113 -271 228 1202 -3 -1815 -207 2201 673 -1342 -556 297 137
2531 137 872 794 -1104 -1116 638 369 -722 188 360 -982 -730 835 452 59 243 -730 -1255 1097 2097
2550 2097 -921 -2255 1006 1368 -963 -316 769 342 -564 273 -664 -579 958 702 -1365 -518 1014
2567 1014 207 -158 490 -92 -852 334 965 -2 -338 1389 -478 -2037 539 2290 -298 -1891 -595
2584 -595 75 645 1387 -184 -1998 -278 1694 93 -476 754 -248 -1465 503 1607 52 -1219
2600 -1219 -21 -1150 -955 1959 2100 -1717 -1950 861 1126 159 321 -226 -1219 537 1084 -704 -344
2617 -344 1344 -231 -1785 574 1766 -444 -802 263 -502 -713 1199 628 -1592 -372 1270 -366
2633 -366 -1081 1142 1144 -902 -680 106 21 1068 1262 -1223 -1994 1223 1977 -751 -826 425 -652 -1027 1201
2652 1201 1074 -975 -551 159 -623 281 2084 127 -2301 -647 1383 806 275 -105 -1464 -681 1669
2669 1669 888 -1492 -504 786 -728 -932 1263 1025 -1186 -573 392 -133 365 1062 -633 -1300 733
2686 733 1298 -526 -439 697 -185 -728 314 -21 -670 531 809 -1611 -554 1399 1033 -989 -376 464
2704 464 -358 107 857 98 -797 357 92 -398 729 1128 -1111 -1655 555 939 0 7 -379 -1271 268
2723 268 1810 346 -1436 -322 600 -146 83 865 -149 -975 159 485 82 321 95 -1317 -580 1230
2741 1230 405 -927 -403 451 -145 87 511 -410 -574 681 558 -656 -202 650 -75 -689 107 36 -417
2760 -417 79 130 -563 -180 428 -321 -473 660 610 -676 -683 582 535 10 86 -239 -521 435 911 -268 -862
2781 -862 -64 211 -10 222 24 -606 -249 359 336 35 97 -247 -625 260 951 107 -708 -156 264 219 268
2802 268 -78 -540 -270 458 116 -452 -58 35 7 140 361 -94 -239 155 152 52 141 113 -219 -52 485 244
2824 244 -402 -450 35 224 138 -105 -375 -230 228 324 -311 -229 -118 22 7 235 -133 -321 -204 152 412 160
2846 160 -320 -938 -173 753 125 -359 -327 -494 292 446 338 -314 -521 -192 -39 170 -146 -185 -58 198 199
2867 199 219 -224 -268 -85 127 157 13 -289 -333 560 337 193 -268 -428 97 321 363 -39 -269 -24 377 275
2889 275 108 -327 -274 36 127 169 -71 -25 -202 165 182 152 25 -308 -163 196 443 108 -197 -131 265 353 107
2912 107 -216 -361 71 276 72 -279 -157 -92 160 317 118 -183 -101 45 196 162 68 -115 -182 313 247 120
2934 120 -218 -344 -19 212 251 -136 -458 -106 342 253 -14 -157 -123 84 346 217 -55 -208 30 184 187 175
2956 175 -126 -183 -154 113 137 -121 -143 -327 -52 414 129 -303 -498 188 424 -80 -126 -134 36 217 340 -76
2978 -76 -257 -30 104 23 110 170 -202 -298 329 272 40 -86 -82 -185 170 444 -159 -566 34 399 238 -193 -137
3001 -137 -51 78 356 -69 -392 -204 123 -41 32 291 -180 -505 36 447 37 -8 83 -381 -63 740 434
3022 434 -453 -392 265 298 19 -27 -332 -318 313 363 -294 -139 337 -160 -284 357 310 -254 -232 249 72 -121
3044 -121 157 145 -342 82 326 -243 -374 309 285 -184 -57 -127 -258 360 566 -384 -604 327 469 -179 -65
3065 -65 286 -217 -281 252 352 -315 -166 -276 -446 259 716 -31 -818 -217 378 183 204 77 -548 -256 707
3086 707 521 -426 -3 350 -284 -208 469 234 -386 -228 104 -102 177 388 -397 -535 305 428 -350 -207
3106 -207 443 -50 -375 293 100 -188 299 455 -673 -437 455 236 -362 -134 108 -268 27 373 -34 -273
3126 -273 208 -93 -237 374 645 -514 -713 260 444 34 109 -94 -788 -103 830 280 -455 -97 34 -76
3146 -76 63 538 -63 -457 39 145 -3 497 325 -632 -238 777 466 -451 -137 157 -284 -41 372 -10
3166 -10 -411 234 141 -431 -18 499 -111 -262 79 80 -114 377 326 -428 -222 292 -80 -368 404 309 -633 -367
3188 -367 516 249 -32 82 -271 -426 282 589 -125 -484 105 114 28 276 160 -465 -280 211 36 -78 301
3209 301 -36 -617 24 685 128 -478 -132 135 -131 376 211 -353 -309 294 -13 -208 96 106 -301 -104 294
3230 294 10 -100 72 28 -279 127 404 -122 -242 364 151 -287 -13 298 2 -36 3 -281 -311 280 255 -391
3252 -391 -242 242 17 -62 274 151 -396 -91 301 -48 -24 43 -78 -268 297 508 -149 -461 -130 -24 114
3273 114 279 -99 -382 67 307 123 -208 89 15 -169 118 301 18 -72 79 16 -8 85 117 -175 -168 134 77
3296 77 -131 -35 -11 71 1 105 -93 -86 218 30 -191 -121 126 49 69 152 -84 -134 -38 84 -21 -120 116 -203 -144
3321 -144 122 29 -181 -146 91 -6 22 106 -196 -254 15 184 13 -130 23 -75 -51 94 36 -97 -209 -110 41
3344 41 22 173 -10 -131 149 213 98 -95 -104 32 172 177 110 -173 -17 98 52 -23 -87 -54 72 87 57 -45 -170
3369 -170 22 120 136 32 -31 -225 26 152 164 -70 -133 -45 -1 -71 -44 -171 -27 157 201 84 18 -6 -108 42
3393 42 94 169 -23 -150 59 187 142 -40 -29 -51 231 86 -21 -74 -31 -85 117 136 -118 -110 45 154 116 46 0
3418 0 63 1 207 32 -24 -87 -41 116 34 27 -42 -146 99 84 105 -96 -212 54 -37 48 32 -74 -6 54 106 57 -160
3445 -160 -35 -34 8 77 -29 -17 -39 89 101 121 -23 -92 -86 60 85 134 -110 30 -50 156 91 -8 -139 -6 59 3
3471 3 -124 -177 -92 3 118 -7 -221 19 61 -2 -16 46 -8 -31 87 90 41 54 16 -124 92 189 36 -282 -138 54
3497 54 39 -19 -74 -30 -244 127 177 -99 -175 89 21 7 92 147 31 24 61 -95 20 -56 -83 -103 233 145 -147 -11
3523 -11 57 54 -52 -39 -10 9 70 246 -55 -285 11 213 -28 -83 -11 -103 -75 101 -77 -82 86 -70 -168 63 236
3548 236 -49 -340 -27 320 -71 30 -5 -288 -116 221 228 -162 -258 -3 -111 60 136 58 -96 68 151 -79
3570 -79 85 243 -93 -309 236 240 -67 -49 78 -39 -173 -1 -86 -195 89 151 -297 -102 260 77 -194 16
3592 16 64 -333 208 256 -143 -263 125 172 -130 131 125 -195 -405 136 247 77 32 -185 -330 40 479 122
3614 122 -316 -14 15 -205 74 287 -150 -233 81 125 -97 138 243 -355 -273 304 150 -233 -28 36 -282 102
3636 102 246 -134 -195 202 80 -328 137 277 -187 -246 109 -56 -162 48 178 -383 -212 233 19 -93 116
3657 116 152 -336 -78 411 189 -83 102 -73 -379 195 490 -241 -326 72 12 -218 229 194 -464 -174 363
3678 363 16 -48 207 -29 -361 131 547 -25 -220 -40 -136 -201 198 339 -349 -277 281 57 -226 252 173 -259
3700 -259 -189 160 -20 -126 179 30 -423 0 454 -24 -233 188 -15 -240 142 303 -131 -124 160 -294 -123
3721 -123 344 227 -379 -225 186 58 83 127 -118 -254 129 285 130 -84 60 -269 -354 230 294 -180 -339
3742 -339 68 63 19 323 127 -435 -66 328 38 -137 204 -48 -277 47 223 -150 -146 137 -194 -215 183 129
3764 129 -200 -154 279 -85 -162 288 -26 -215 42 244 -100 -63 302 40 -405 -11 175 -142 -44 27 -225 -169
3786 -169 277 210 -135 69 68 -71 -21 350 202 -360 -48 199 -115 23 124 -107 -274 102 127 -62 -103 -57
3808 -57 -110 -37 84 73 -179 -83 89 -9 -52 202 7 -144 29 228 -12 -39 116 -25 -70 101 92 -146 10 93
3832 93 -54 -180 19 97 -71 114 40 14 -2 79 37 -70 141 5 12 -55 71 -173 -128 20 -74 -110 34 78 -11
3857 -11 -95 113 48 -47 -67 49 61 66 206 -65 -136 39 -24 -20 -1 31 -56 -29 -54 14 -134 5 22 1 49 96 58 -25
3885 -25 110 58 -29 -28 -9 41 -164 42 11 -76 -131 -136 -39 117 123 -100 -51 -4 77 -90 -62 -12 85 30 221 50 -23 -138
3913 -138 -73 26 34 -44 -146 -101 63 75 -67 -21 148 10 -30 44 -73 -2 -68 153 107 -58 -38 91 20 15 18 -41 -164
3940 -164 -28 47 -66 23 -15 -63 -43 30 -32 -75 -29 8 11 85 126 94 -97 -48 -34 -107 -263 -242 -454 -77 135 -38
3966 -38 -224 -12 -90 93 -14 81 36 -106 35 -12 -132 -23 -21 -88 9 16 -69 -126 -1 -13 49 -19 96 28 65 51
3992 51 151 40 -35 201 2 69 147 57 34 -68 49 -75 -179 105 -57 -22 98 111 -99 -12 219 -163 -157 89
4016 89 -21 -132 122 178 -28 -195 -20 13 -28 85 6 -156 -31 243 15 -204 12 -33 -22 59 312 -313 -187
4039 -187 -67 407 -161 -367 691 -286 -68 -21 24 -162 74 -12 -65 -51 248 -104 -202 81 121 -197 103 279
4061 279 -54 -99 209 100 -11 158 186 -109 -318 207 82 -122 100 29 -439 35 148 -35 -59 96 -118
4082 -118 -389 -3 367 -133 -187 112 -41 -181 164 132 -291 -241 57 -25 -98 -503 644 -9 -615 365 -142
4103 -142 -460 -92 -709 -35 547 795 -6 93 190 -382 -383 498 77 -338 -78 135 99 -159 125 -26 -474 107
4125 107 468 -81 -150 106 -171 -364 277 266 -359 -40 269 -105 -101 304 194 -416 -112 209 -62 6 249 -123
4147 -123 -482 44 384 -35 -165 160 -142 -309 350 392 -242 -134 99 -59 -105 366 180 -482 -97 170 -86
4168 -86 25 359 -163 -342 86 314 34 -153 66 -326 -358 500 353 -288 -155 128 -165 -129 473 54 -504
4189 -504 -73 238 -111 30 350 -132 -489 194 323 -123 -13 155 -276 -252 349 199 -320 -160 19 -303
4209 -303 -151 319 31 -390 55 263 -77 119 297 -189 -299 290 273 -83 14 65 -291 -187 404 147 -408
4230 -408 -30 112 -382 3 512 -43 -435 34 116 -112 225 277 -203 -313 246 166 -230 20 155 -371 -154
4251 -154 258 106 -183 9 80 -263 6 414 -134 -363 86 233 -160 274 269 -117 -290 102 122 -158 196
4272 196 98 -296 -39 357 119 -210 134 123 -250 139 339 -112 -187 111 205 -95 105 241 -111 -190 9 151
4294 151 -99 42 -29 -257 30 432 -64 -187 158 27 -157 167 197 -225 -176 110 192 -113 6 44 -317 -225
4316 -225 92 120 -46 116 88 -250 -21 225 -112 -160 137 9 -117 69 279 -41 -85 69 -37 -28 87 181
4338 181 -123 -84 66 -49 -103 55 125 -121 -56 115 -10 -65 115 40 -98 107 100 -153 -64 168 -177 -103 149
4361 149 -39 -257 -42 24 -86 -43 51 73 -64 78 64 71 -135 64 94 -41 100 123 80 -41 103 -53 -36 37
4385 37 -94 -96 -125 79 30 -139 108 -7 -37 28 107 9 -70 54 77 -19 24 114 -3 -63 -20 -101 -167 8 -55 -56 -52 -134
4413 -134 27 -22 177 24 -8 73 103 10 -51 46 -43 106 25 79 -173 -88 -6 -73 -9 -53 -6 -131 114 -8 14 40
4439 40 102 -22 -17 -26 64 -69 76 81 48 -100 41 -161 29 38 89 -130 -279 -270 -181 -232 109 287 626 89 -87 450
4465 450 -412 11 -98 11 -100 45 -64 -120 -53 -41 -35 -115 -109 22 -37 17 95 -148 125 143 -136 -43 111 11
4489 11 -30 73 -100 -25 -76 -64 -128 -31 77 72 -24 7 17 7 1 27 60 -3 170 27 -62 -38 199 89 -26 13 -76
4516 -76 -111 23 18 20 5 -36 -141 -142 81 84 -60 -34 68 -92 -45 133 15 -66 33 140 -124 -195 99 83 -262 53
4542 53 175 -108 -21 126 -189 56 181 61 -249 85 169 -8 -28 181 63 -145 -106 100 -100 103 18 -162
4564 -162 -174 107 81 -94 45 23 -323 -145 249 17 -149 24 122 -99 -69 284 159 -297 -33 40 -145 134
4586 134 153 -229 -214 178 103 -42 87 46 -167 -277 275 108 -217 -81 6 -215 -47 340 -27 -343 -30 102
4608 102 -162 69 109 -194 -194 139 85 -167 110 137 -211 -159 280 98 -128 116 78 -299 11 395 -247 -317 1224
4631 1224 116 -17 315 5 -520 -429 259 522 51 224 -77 -724 -165 1270 -4 -501 224 -94 -266
4650 -266 85 345 -332 -286 87 17 -122 298 374 -406 -178 365 114 -83 189 54 -398 -79 400 -2 -185
4671 -185 124 -128 -380 207 284 -219 -326 183 -45 -131 261 262 -458 -172 264 188 -31 313 6 -172 -72 493
4693 493 9 -163 -377 -880 -234 112 755 -438 -221 428 65 279 244 50 -368 -113 369 161 -9 239
4713 239 57 -363 18 277 -50 -168 103 -128 -252 273 298 -383 -242 182 -82 -116 322 157 -392 -90 334
4734 334 -84 7 219 -50 -449 214 322 -191 -107 219 -268 -469 379 483 -432 57 85 85 126 618 -197 -279
4756 -279 -457 143 311 -107 142 -376 -204 367 435 -363 -300 -59 -16 -509 692 -42 361 439 48 -49 520
4777 520 504 481 154 -73 -104 227 400 -26 -148 -314 -343 420 -69 -54 248 -317 -28 190 234 -158 3 225
4799 225 -35 106 285 -62 -219 -30 189 -211 -33 150 -75 -96 211 130 -203 -8 99 -146 -217 605 -241
4820 -241 -60 578 136 -423 -38 393 -32 145 90 -108 3 81 131 -266 -489 623 -352 -16 716 73 -29
4841 -29 -41 -73 188 68 -603 564 396 -40 409 -237 -176 102 26 -74 -102 86 -367 43 400 -607 127
4862 127 -77 504 -128 -907 -350 221 -273 78 -134 -57 -111 73 -55 66 49 239 -226 322 951 -90 113
4883 113 -326 197 -35 212 266 -105 -87 121 54 -132 -86 -23 -139 2 82 -47 -105 -52 11 -122 -6 36 -134
4906 -134 -77 159 64 -90 137 38 -156 14 151 27 -107 -2 -20 61 14 -19 -94 -23 120 54 8 61 129 -36
4930 -36 -13 211 156 -55 -122 -98 138 -13 -23 -475 -297 -41 415 -77 -720 390 250 -233 289 29 37 10 -18
4953 -18 165 -48 52 5 19 34 52 9 -106 -67 74 77 -43 -98 -67 -8 421 -334 -359 184 86 175 116 92 41 17
4979 17 23 3 115 -22 -78 44 -41 246 -332 187 347 -219 -15 32 -74 -175 60 264 94 -47 -78 64 -17
5002 -17 44 -52 -50 -60 19 7 28 11 9 -170 113 -37 -437 45 282 185 149 364 5 -557 -496 436 42 -226 -171
5027 -171 13 -83 20 -4 -59 -106 64 -16 -70 -58 309 -357 18 52 389 -49 113 1021 -3 445 431 -128 -94
5050 -94 83 184 -39 53 -62 -57 48 126 -60 -216 31 74 -22 10 168 16 -97 224 190 -162 -136 -20 -179
5073 -179 63 152 -57 -246 -118 72 115 -100 -105 -182 -119 187 211 -158 -167 112 -98 -70 277 190 -275 -162 112 9
5097 9 -68 142 -5 -177 -29 160 -83 -100 149 40 -106 100 162 -142 -78 172 -134 -228 331 182 -195 -199 7
5120 7 -289 -131 205 79 -308 -104 128 16 120 118 -274 -386 133 271 24 0 -67 -188 -54 471 110 -260
5142 -260 -200 50 -206 22 446 37 -508 66 236 -81 156 274 -126 -273 318 242 -177 -43 85 -335 -116
5163 -116 398 12 -275 -306 -616 134 -36 121 -20 -194 91 201 -169 71 395 -48 -166 283 180 -149
5183 -149 106 92 -407 -157 408 161 -329 -93 36 -229 189 446 -130 -348 57 143 -57 102 145 -375 -317
5204 -317 244 119 -19 114 -83 -522 -28 405 -63 -292 -20 184 -170 206 328 -83 -267 203 208 -87 247
5225 247 40 -383 -193 377 -81 -183 -97 -124 -126 80 491 -318 -356 -128 325 -473 125 679 57 -161 105 121
5247 121 -129 85 -170 -329 154 4 579 -421 -425 197 -143 -15 311 792 41 424 174 -85 206 292 -289
5268 -289 -516 47 -229 -214 -9 -164 -230 -260 122 -374 -4 121 -586 -1081 364 331 81 -658 170 163 744 1041
5290 1041 -799 1 -35 448 169 -127 -167 175 -282 60 268 -188 -53 373 -17 -328 74 92 -76 -77 -50
5311 -50 73 -56 361 46 -156 140 -18 -71 6 364 151 -191 -331 2 -68 98 214 -181 -68 237 408
5332 408 18 -124 711 4 23 403 666 349 -227 145 896 260 570 -79 -730 468 263 -88 72 -220
5352 -220 210 -235 117 112 -281 -263 46 -33 113 31 -265 -505 375 356 -159 -635 253 132 347 793 -61 508
5374 508 99 380 -183 -458 404 362 -67 250 105 -84 237 94 122 -11 19 -5 -177 27 117 -16 -48 -26
5396 -26 -116 -67 87 56 -130 -89 15 88 80 -125 -22 -174 72 155 -77 -143 38 58 -164 9 -36 -45 -111 -85 236
5421 236 68 -83 -118 -22 106 109 -86 -105 -77 173 69 64 -129 -66 -34 10 1 -72 -60 61 30 -117 107 99 11 -78 20
5448 20 105 75 -81 -62 -116 17 46 -152 -125 121 71 -44 91 -59 -106 75 60 45 -15 27 35 -62 88 -39 -36 44
5474 44 47 68 36 -4 26 75 88 -7 -136 -127 68 174 47 -70 -63 89 64 110 -2 -33 -63 98 56 29 -39 -90 -21 -37
5502 -37 -5 44 -262 -141 -86 136 16 -27 -248 71 478 -285 -363 -142 -7 123 245 48 -315 -622 -153 -90
5524 -90 -370 130 118 402 412 285 -69 -244 384 -439 170 196 389 158 -94 -30 273 -18 -105 -150 -36 29 92
5547 92 -115 -148 47 103 -64 72 147 -122 -6 171 84 43 20 -24 -62 26 102 -68 -272 -64 -51 136 101 18 -191
5572 -191 11 172 21 -70 -91 56 -233 254 90 -53 0 111 61 -24 0 0 -247 -114 19 78 -83 -47 -7 -41
5596 -41 24 34 -115 -77 147 -15 -158 25 184 -50 -142 156 45 -181 -40 65 -196 -101 52 -29 -65 195 134
5619 134 -233 -251 24 51 -34 136 -137 -176 157 274 -45 -132 26 -19 -86 48 132 -214 -250 -8 6 77 169 -68
5643 -68 -366 89 544 -24 -264 46 -86 12 -45 -143 -6 194 350 304 -44 369 510 85 -500 238 -492 146
5665 146 -249 120 102 -358 140 -288 45 151 -187 -189 108 114 -114 132 108 -356 -123 160 58 -213 -251 34
5687 34 -42 -32 202 -85 -202 106 205 101 144 210 -266 -318 268 325 -181 -209 12 -67 33 283 16 -399 -52
5710 -52 363 21 -64 229 37 -310 218 160 42 23 27 -301 -183 313 117 -320 -43 174 -56 -166 85 99
5732 99 -176 -58 28 -97 92 256 -62 -320 123 84 58 26 90 -298 -192 222 129 -110 107 113 -231 -55 300
5755 300 389 -269 -216 67 30 392 313 13 -48 6 153 -197 137 227 -619 -62 -197 123 -530 348 221 -372
5777 -372 -258 139 -203 -541 -110 136 -82 -89 117 -141 -464 371 132 -223 24 121 -380 -209 135 -28 -340
5798 -340 -60 -171 191 -118 -5 -804 405 47 -447 41 -54 -70 92 -181 682 -313 -58 1063 -93 -79
5818 -79 -59 345 -133 -240 316 229 162 313 13 71 -191 171 -273 -465 91 162 -152 36 186 82 -124 -33
5840 -33 -7 -172 -192 266 34 -63 -4 78 -133 194 70 29 248 260 -43 178 -53 115 22 1 259 78 150 -588
5864 -588 212 544 -362 149 -235 7 212 -324 -421 -271 144 -351 -382 549 -300 -183 363 -45 -271 337 423
5885 423 -358 -829 470 191 -200 -371 341 -22 -15 214 -680 -294 313 63 -217 -248 358 -41 -404 -244 217
5906 217 94 114 83 -601 81 -189 -89 -170 146 391 146 45 31 -48 84 2 -127 -68 -52 182 -42 -111 -9
5929 -9 -62 -35 32 71 -67 -11 70 -12 9 -1 -69 -14 59 98 -37 -53 43 144 35 -8 -1 -112 -20 11 52 -46 -98 39
5957 39 62 90 139 55 -14 49 157 -56 165 -64 -218 -107 247 211 20 -142 65 85 -36 -4 -97 -70 59 195
5981 195 -31 5 15 141 -13 163 -51 -15 102 56 16 39 -15 28 -66 -43 -58 -28 9 -142 -73 110 155 84 44 -51
6007 -51 30 111 -72 -2 -29 -10 1 55 58 -91 -16 5 -42 -23 -40 -128 38 124 63 -63 -54 3 63 130 51 -48 -88 40 58
6036 58 -79 -15 -4 -43 67 -126 -97 -122 54 110 -34 61 -68 -10 -99 3 70 25 -26 -59 48 40 85 6 -89 99
6062 99 -21 -37 -143 5 -20 -106 36 -56 -17 -57 101 -32 129 47 180 -270 64 155 44 -195 -3 -75 -171 77
6086 77 -107 -178 -95 138 -691 -27 -117 155 -95 83 18 12 -32 107 25 -179 36 73 -49 60 67 123 -179 -197 -315
6111 -315 -171 216 -171 -221 -207 315 155 -99 -44 107 79 64 146 -126 -137 -29 33 28 276 183 -255 -150 -14 88
6135 88 -50 -64 -39 -155 164 201 24 -174 -26 107 10 78 36 -48 -85 24 -10 -40 73 80 -166 -21 199 27
6159 27 -71 100 24 -220 -84 40 45 -122 158 117 -184 -31 218 -38 -171 17 -23 -37 113 126 -148 52 211
6182 211 -45 9 202 -7 -207 -19 180 213 -132 108 -126 -89 180 267 -79 -87 39 56 47 140 44 -145 23 172
6206 172 -54 -83 228 -47 -247 96 287 73 -67 73 -10 -120 64 130 -47 -171 141 -156 -141 215 42
6227 42 -117 -2 108 -172 -34 218 6 -349 -45 181 94 -81 123 -181 -186 108 137 -15 19 31 -92 -115 244
6250 244 92 -132 -68 -82 -37 65 243 -180 -117 57 194 -68 -58 15 -123 -143 164 71 -53 -185 79 -101 89
6273 89 299 -119 -288 38 202 -97 68 97 -12 -202 73 -37 -89 41 99 -128 -242 155 57 -122 -60 -26
6295 -26 -10 104 159 -40 -96 88 115 -136 13 288 4 -241 1 73 -37 65 46 -250 -198 206 122 -129 21
6318 21 104 -71 52 243 -7 -191 96 102 -73 87 148 -239 -199 31 132 7 -5 4 -113 26 83 96 21 -34
6342 -34 136 40 73 56 -10 -116 59 -52 30 -104 82 -210 -197 112 113 -36 -16 226 20 91 122 25 -79 145
6366 145 123 -134 21 154 -73 -105 60 -12 -91 107 131 -86 -98 17 40 -29 34 37 -106 -80 148 57 -123 -53 -110
6391 -110 6 91 116 -71 -126 24 46 58 50 -7 -5 -21 41 28 10 91 27 40 -24 147 26 -81 11 -17 -74 21 -61 -160
6419 -160 -76 -12 58 -8 7 -28 12 25 114 -104 -24 -47 73 -34 0 59 -76 -95 43 -41 -142 78 91 11 -20 -14 -79
6446 -79 -135 -14 74 7 23 136 97 1 64 -27 -6 25 -51 -88 1 19 -116 -51 11 -123 -38 -62 42 15 -39 17 -22 -21
6474 -21 36 32 0 -98 19 26 1 28 -46 -111 -49 80 -64 -40 -164 35 28 74 106 -65 9 20 26 -7 22 -45 -61 50 14
6503 14 55 -30 -53 -95 7 -38 -108 -8 -119 -37 -25 49 77 37 35 50 52 73 -9 137 24 52 -4 -57 -37 27 -21 -68 -110
6532 -110 4 127 -79 -6 82 -26 -25 25 -40 36 59 -56 17 29 181 91 -28 -121 -64 2 -99 114 -114 -129 52
6557 52 82 -92 -117 55 26 -53 146 48 -32 26 -8 -9 -53 67 -86 -121 -3 162 11 -113 2 -87 -53 -65 -10 69
6583 69 -36 194 116 -43 9 44 91 -3 9 119 27 -69 -174 65 -20 61 -113 -86 21 87 -180 38 125 -6 101
6608 101 67 41 -139 94 8 -60 17 80 -18 86 66 -131 -74 71 10 -43 46 96 -119 -101 82 179 -39 -59 69
6633 69 16 36 104 59 -215 -119 -7 -84 18 60 -151 -55 -6 158 -7 -47 59 -121 -47 159 203 -127 -23 79
6657 79 54 -48 119 55 35 32 -77 -73 -21 171 -81 -85 75 -41 -65 18 9 -41 -54 190 109 43 31 6 -108 -72 69
6684 69 -25 24 11 -137 -185 24 117 -12 -190 147 145 -138 182 46 -160 -81 138 146 -6 -14 -44 -29 25 44 33 -127
6710 -127 -36 -15 -117 112 -4 -109 -41 76 19 -204 174 160 -131 -81 35 43 8 63 -24 -134 -45 161 -138 -132 53
6735 53 -123 -76 140 187 -165 -166 -21 1 55 149 112 -99 -131 106 -17 -19 -14 -43 -190 32 182 4 -49 -8 -37 -53
6761 -53 166 128 -80 57 102 -116 2 172 -66 -201 -7 136 53 -33 121 -39 -15 19 106 -89 -162 106 -77
6784 -77 -85 145 129 -133 -2 112 -30 59 32 -5 -47 -85 -9 -85 -155 -18 -110 -151 0 156 -5 -92 145 -117 -40
6809 -40 108 70 46 -22 37 -102 134 49 45 -183 26 143 19 -72 62 -127 -46 58 186 -107 21 111 30 -63
6833 -63 176 -4 -27 45 -9 -12 -10 40 -53 -110 -45 108 30 47 -39 -5 -83 -71 91 -54 7 -35 -135 83 134 16 7 -26
6861 -26 -33 -105 -4 96 24 -74 -75 -58 11 -70 -26 -92 -79 84 16 -79 62 111 50 -28 106 38 -114 -93 -67 -40 55 -10
6889 -10 -53 -251 -30 55 -20 -82 43 -46 11 -5 70 9 80 28 -59 -8 103 -4 -92 -92 -76 136 187 204 -359 -131 -403
6916 -403 56 191 652 313 -233 -351 680 293 -15 58 27 41 -26 337 70 -95 13 -44 20 -141 11 -99
6938 -99 -126 25 1 -123 67 16 -19 110 -56 288 20 104 -470 27 -379 208 94 54 21 26 57 0 -34 -8 -76
6963 -76 25 19 -58 -3 22 -6 60 126 28 81 -83 50 -1 -45 -61 9 -67 13 38 -12 6 62 50 -58 11 -52 63 97
6991 97 -4 78 -44 99 99 39 65 26 79 106 -49 -62 -96 -60 -22 -44 -35 7 25 -5 35 16 152 26 24 -105 -50 44
7019 44 -69 -27 57 -64 -117 82 66 95 -142 -46 -38 -36 -42 -12 -84 69 -33 106 -41 51 -3 38 -82 -15 -138 6
7045 6 30 1 -145 95 -31 -36 0 31 41 -71 -110 -33 58 45 81 40 -64 -58 81 44 -17 -46 -145 19 70 2 65 -56
7073 -56 -67 41 -6 -10 -29 -27 47 6 53 118 -24 -109 44 -22 116 -115 -77 30 -77 -130 -67 -133 -36 59 -33 -48 22 -30
7101 -30 45 -5 27 -54 -6 -27 -36 -211 -4 102 -13 14 25 -3 -96 -28 117 27 -157 72 118 74 -54 -46 -26 -9 91
7128 91 71 59 15 -56 -101 30 101 97 -40 -33 -6 -86 12 146 -99 -56 45 48 21 -18 43 -49 15 -103 -135 167 83 17
7156 17 -151 38 -79 -113 -21 101 -67 -162 52 -35 -2 -48 29 -68 -81 -52 233 127 -34 -82 -58 -78 205 -6 -104
7181 -104 -28 0 13 69 8 -105 -53 22 12 -29 101 160 -48 -76 -79 -12 -68 -93 -104 -80 75 55 -76 -154 -24 -43 32
7208 32 77 13 -45 -69 -95 41 71 -144 73 -32 -131 83 1 -72 -40 5 -92 13 50 -35 -33 61 -100 -48 137 140 -116
7235 -116 -116 41 139 20 114 98 -23 15 -49 -36 52 41 -144 -110 15 8 -53 -103 -40 64 -82 -23 47 -35 -89 14 22
7262 22 -18 -81 -10 -68 -62 49 -67 -32 -34 -31 -32 -82 -17 -13 -13 110 61 -132 101 206 -69 -68 47 40 -22 33 110 -92 -53 30
7292 30 69 -36 -82 33 -56 -107 44 36 -59 58 -11 -83 33 111 3 20 41 78 145 14 -97 -29 -133 83 23 50
7318 50 18 -39 -180 122 74 77 -6 2 56 -120 -12 -37 -169 19 126 -25 3 0 13 -36 -38 53 -44 23 71 -137 -87 99
7346 99 131 56 -86 49 10 -156 85 85 -65 12 63 -17 -82 20 16 -156 -65 75 7 -46 -20 -47 14 125 60 -67
7372 -67 -10 10 101 50 61 118 -173 -61 7 -43 -24 36 -60 -133 24 79 -52 96 6 -62 -37 -26 106 -35 -87 78
7398 78 9 57 -6 -58 -73 -39 77 -21 -26 29 -91 -9 -7 10 -2 25 64 87 133 63 108 -37 75 22 -29 99 16 -37 -7
7427 -7 17 67 21 11 38 10 -8 16 72 -32 81 69 7 -25 -26 -51 -36 -27 66 80 -3 111 -47 -96 -120 -4 -43 122 -21
7456 -21 -65 67 31 71 64 -23 79 -69 -39 75 -51 -14 -39 14 -49 -75 54 35 -16 -86 132 30 -16 -70 -115 19
7482 19 27 -62 -83 47 -103 -22 31 -26 -15 65 -94 9 -25 -38 -55 6 -17 94 40 -77 -40 60 117 -59 109 -62
7508 -62 40 65 52 38 17 111 -32 -136 -7 26 7 20 -154 -38 73 -47 107 -52 49 -21 -189 -33 1 -43
7532 -43 57 90 -48 25 -9 -14 -9 -109 10 25 46 -55 38 34 13 119 128 -13 96 135 66 70 -11 -105 -79 -10 180 124
7560 124 12 -219 88 -114 -206 42 -160 -381 -203 188 121 -258 109 -71 -122 -655 -130 197 -237 -332 -492
7581 -492 247 249 -707 -406 95 -511 111 -46 435 -94 690 150 52 -261 106 -569 216 -105 71 -16 108
7602 108 242 -461 92 -306 -3 176 82 69 -512 -547 179 -174 -73 -16 58 144 -68 161 -11 -13 44 91 -45
7625 -45 43 7 -3 -63 29 101 -34 -96 -11 -62 75 -37 83 21 0 -216 150 -317 -164 -9 234 -108 -261 -434
7649 -434 -220 25 -273 -290 23 -167 268 -75 109 577 -171 -41 345 310 -254 -341 -336 112 88 548 176 1
7671 1 104 -98 61 -27 -7 -116 90 114 39 -7 49 -23 110 88 -57 66 25 -43 7 78 -58 5 -31 95 -57
7696 -57 104 401 -129 -407 -420 189 -102 75 52 77 -38 -75 -9 -11 -27 -21 -80 102 31 59 -15 -26 -70 -74 -114 165 -5
7723 -5 -46 -15 -47 8 74 51 82 82 63 -51 -28 -50 -63 -130 -74 -127 -266 -23 336 53 216 334 -167 -134 17 118
7749 118 -44 59 36 124 58 -56 23 57 -2 89 -80 -120 -15 37 -50 51 -88 65 -67 -92 113 20 -84 69
7773 69 94 -28 -60 49 -91 -7 -1 -36 186 -111 45 -105 68 -9 -6 460 -65 68 84 42 198 -26 -92 107
7797 107 184 260 347 556 -45 -538 -155 38 -35 46 25 -84 -131 38 -257 -50 28 -33 40 88 92 -115 -30 14 -57
7822 -57 -9 -64 69 -24 1 58 -78 -104 -32 -50 -17 57 49 58 65 99 -7 117 38 20 21 24 56 48 22 27 60 -67 -72 -21 37 -101
7854 -101 16 72 -81 21 76 -62 23 -5 -60 -5 79 11 -44 -34 -23 -92 -43 17 91 76 -56 -9 24 -60 -8 -58 52
7881 52 32 87 20 52 58 62 -23 0 55 70 33 -28 -39 71 -23 14 -122 34 -14 41 -196 -226 -377 -55 567 -24 -364
7908 -364 31 493 -316 -16 -503 -85 53 501 75 -65 -53 64 -35 -83 188 157 -504 239 171 -39 35 -325
7930 -325 122 -110 -130 257 9 89 290 495 -460 -61 266 -417 235 -444 -340 -47 477 -165 -67 83 72
7951 72 -134 -250 54 272 -247 155 284 574 188 601 603 101 -389 -125 -525 100 -212 -213 -10 303 -49 59
7973 59 -124 -90 -132 129 -150 -28 -98 23 -22 32 -145 114 -215 895 390 -802 22 -114 194 -71 -86 -30
7995 -30 -62 -103 61 -22 73 82 50 48 -68 -87 138 -137 -65 -87 70 -7 -46 71 -62 -229 110 0 44 -197 -264 -237
8021 -237 -370 -170 271 335 24 103 253 352 243 -276 193 398 -81 -291 -63 -147 -35 197 96 -5 54 -28
8043 -28 64 -78 -337 38 -120 -5 -148 -45 -62 -21 53 188 -94 -88 -39 -440 -117 -81 494 -152 64 -86 58
8066 58 -849 -607 258 174 197 -32 79 19 64 -146 31 -153 62 -49 -44 -210 -59 -78 -71 6 -30 -38 -45 18 3 30
8092 30 54 -59 -7 16 -14 18 -86 89 88 -5 32 17 -19 -13 -32 -101 -4 -68 65 116 -148 48 24 82 11 -59 15 5
8120 5 44 -25 -101 -116 27 47 -8 36 19 53 -19 100 -49 -39 10 -98 65 20 0 10 -96 39 34 -41 -67 -23 -73 10
8148 10 18 -10 -39 -54 82 -57 -40 -50 22 -130 -3 -52 -45 117 38 -3 -6 39 -4 -22 12 24 -57 -68 4 66 56 131 90
8177 90 -25 -17 65 3 28 63 24 1 -59 -138 42 -27 33 -48
8191d8
##END NTUPLES=NMR FID
##END=
