##TITLE=1H_DE-80H_X3
 200.13MHz, d2o
 8 sc
 
 19ns.26.2.2025
##JCAMPDX= 6.0         $$ Bruker NMR JCAMP-DX V2.0
##DATA TYPE= NMR FID
##DATA CLASS= NTUPLES
##ORIGIN= UXNMR, Bruker Analytische Messtechnik GmbH
##OWNER= pz
$$ XWIN-NMR		Version 3.5
$$ Fri Feb  6 11:11:44 2026 Russian Standard Time (UT+4h)  Yarkov@DPX200
##.OBSERVE FREQUENCY= 200.1313
##.OBSERVE NUCLEUS= ^1H
##.DELAY= (6, 6)
##.ACQUISITION MODE= SIMULTANEOUS
##.ACQUISITION SCHEME= undefined
##.AVERAGES= 8
##.DIGITISER RES= 18
##SPECTROMETER/DATA SYSTEM= spect
##.PULSE SEQUENCE= zg30
##.SOLVENT NAME= CDCl3
##.SHIFT REFERENCE= (INTERNAL, CDCl3, 0, 14.3821)
##AUDIT TRAIL= $$ (NUMBER, WHEN, WHO, WHERE, WHAT)
$$ ##TITLE= Audit trail, XWIN-NMR		Version 3.5
$$ ##JCAMPDX= 5.01
$$ ##ORIGIN= Bruker BioSpin GmbH
$$ ##OWNER= Yarkov
$$ C:/Bruker/XWIN-NMR/data/yarkov2/nmr/H-C/1/audita.txt
$$ ##AUDIT TRAIL=  $$ (NUMBER, WHEN, WHO, WHERE, WHAT)
(   1,<2026-02-06 11:11:00.59 +0400>,<Yarkov>,<DPX200>,
      <created by zg, POWCHK disabled, PULCHK disabled
       configuration hash MD5:
       00 E9 B6 7A A2 85 ED C7 34 08 36 98 17 FE 4E 26
       data hash MD5: 16K
       82 12 41 BB 98 5D 35 AE 09 14 C1 AB 2E 61 6D 29>)
$$ ##END=
$$ 
$$ hash MD5
$$ 75 DE 3D F2 CD 43 6C 58 18 00 D7 52 52 C5 A9 A0
##$RELAX= 
##$RELAX= 
##$RELAX= 
##$RELAX= 
##$RELAX= 
##$RELAX= 
$$ Bruker specific parameters
$$ --------------------------
##$DU= <C:/Bruker/XWIN-NMR>
##$EXPNO= 1
##$NAME= <H-C>
##$PROCNO= 1
##$TYPE= <nmr>
##$USER= <yarkov2>
##$AMP= (0..31)
100 100 100 100 100 100 100 100 100 100 100 100 100 100 100 100 100 100 
100 100 100 100 100 100 100 100 100 100 100 100 100 100 
##$AQSEQ= 0
##$AQ_mod= 1
##$AUNM= <au_zg>
##$AUTOPOS= <>
##$BF1= 200.13
##$BF2= 200.13
##$BF3= 200.13
##$BF4= 200.13
##$BF5= 200.13
##$BF6= 200.13
##$BF7= 200.13
##$BF8= 200.13
##$BYTORDA= 1
##$CFDGTYP= 0
##$CFRGTYP= 5
##$CHEMSTR= <none>
##$CNST= (0..31)
1 1 145 1 1 1 1 1 1 1 1 1 1 1 1 1 1 1 1 1 1 1 1 1 1 1 1 1 1 1 1 1 
##$CPDPRG= <>
##$CPDPRG1= <>
##$CPDPRG2= <>
##$CPDPRG3= <>
##$CPDPRG4= <mlev>
##$CPDPRG5= <mlev>
##$CPDPRG6= <mlev>
##$CPDPRG7= <mlev>
##$CPDPRG8= <mlev>
##$CPDPRGB= <>
##$CPDPRGT= <>
##$D= (0..31)
0 0.7 0 0 0 0 0 0 0 0 0 0.03 0 0 0 0 0 0 0 0 0 0 0 0 0 0 0 0 0 0 0 0 
##$DATE= 1770361860
##$DBL= (0..7)
120 120 120 120 120 120 120 120 
##$DBP= (0..7)
150 150 150 150 150 150 150 150 
##$DBP07= 0
##$DBPNAM0= <>
##$DBPNAM1= <>
##$DBPNAM2= <>
##$DBPNAM3= <>
##$DBPNAM4= <>
##$DBPNAM5= <>
##$DBPNAM6= <>
##$DBPNAM7= <>
##$DBPOAL= (0..7)
0.5 0.5 0.5 0.5 0.5 0.5 0.5 0.5 
##$DBPOFFS= (0..7)
0 0 0 0 0 0 0 0 
##$DE= 6
##$DECBNUC= <off>
##$DECIM= 32
##$DECNUC= <off>
##$DECSTAT= 4
##$DIGMOD= 1
##$DIGTYP= 9
##$DL= (0..7)
0 120 120 120 120 120 120 120 
##$DP= (0..7)
150 150 150 150 150 150 150 150 
##$DP07= 0
##$DPNAME0= <>
##$DPNAME1= <>
##$DPNAME2= <>
##$DPNAME3= <>
##$DPNAME4= <>
##$DPNAME5= <>
##$DPNAME6= <>
##$DPNAME7= <>
##$DPOAL= (0..7)
0.5 0.5 0.5 0.5 0.5 0.5 0.5 0.5 
##$DPOFFS= (0..7)
0 0 0 0 0 0 0 0 
##$DQDMODE= 0
##$DR= 18
##$DS= 0
$$ [...]
##$SUBNAM2= <"">
##$SUBNAM3= <"">
##$SUBNAM4= <"">
##$SUBNAM5= <"">
##$SUBNAM6= <"">
##$SUBNAM7= <"">
##$SUBNAM8= <"">
##$SUBNAM9= <"">
##$SW= 18.0517328524113
##$SWIBOX= (0..15)
0 0 2 0 0 0 0 0 0 0 0 0 0 0 0 0 
##$SW_h= 3612.71676300578
##$TD= 16384
##$TD0= 1
##$TE= 0
##$TE2= 300
##$TE3= 300
##$TEG= 300
##$TL= (0..7)
0 120 120 120 120 120 120 120 
##$TP= (0..7)
150 150 150 150 150 150 150 150 
##$TP07= 0
##$TPNAME0= <>
##$TPNAME1= <>
##$TPNAME2= <>
##$TPNAME3= <>
##$TPNAME4= <>
##$TPNAME5= <>
##$TPNAME6= <>
##$TPNAME7= <>
##$TPOAL= (0..7)
0.5 0.5 0.5 0.5 0.5 0.5 0.5 0.5 
##$TPOFFS= (0..7)
0 0 0 0 0 0 0 0 
##$TUNHIN= 0
##$TUNHOUT= 0
##$TUNXOUT= 0
##$USERA1= <user>
##$USERA2= <user>
##$USERA3= <user>
##$USERA4= <user>
##$USERA5= <user>
##$V9= 5
##$VALIST= <valist>
##$VCLIST= <CCCCCCCCCCCCCCC>
##$VD= 0
##$VDLIST= <DDDDDDDDDDDDDDD>
##$VPLIST= <PPPPPPPPPPPPPPP>
##$VTLIST= <TTTTTTTTTTTTTTT>
##$WBST= 1024
##$WBSW= 4
##$XGAIN= (0..3)
0 0 0 0 
##$XL= 0
##$YL= 0
##$YMAX_a= 12815
##$YMIN_a= -13349
##$ZGOPTNS= <>
##$ZL1= 120
##$ZL2= 120
##$ZL3= 120
##$ZL4= 120
##$ABSF1= 10
##$ABSF2= 0
##$ABSG= 5
##$ABSL= 3
##$ALPHA= 0
##$AQORDER= 0
##$ASSFAC= 0
##$ASSFACI= 0
##$ASSFACX= 0
##$ASSWID= 0
##$AUNMP= <proc_1d>
##$AZFE= 0.1
##$AZFW= 0.1
##$BCFW= 1
##$BC_mod= 2
##$BYTORDP= 1
##$COROFFS= 0
##$CY= 83.5205535888672
##$DATMOD= 1
##$DC= 2
##$DFILT= <>
##$DTYPP= 0
##$F1P= 10.8118882576601
##$F2P= -7.23987719738617
##$FCOR= 0.5
##$FTSIZE= 0
##$FT_mod= 4
##$GAMMA= 1
##$GB= 0.15
##$INTBC= 1
##$INTSCL= 1
##$ISEN= 128
##$LB= 0.25
##$LEV0= 0
##$LPBIN= 0
##$MAXI= 10000
##$MC2= 0
##$MEAN= 0
##$ME_mod= 0
##$MI= 1.114404
##$NCOEF= 0
##$NC_proc= 0
##$NLEV= 6
##$NOISF1= 3.799351
##$NOISF2= 2.8
##$NSP= 1
##$NTH_PI= 0
##$NZP= 0
##$OFFSET= 14.38212
##$PC= 1
##$PHC0= -5292.348
##$PHC1= 6.821927
##$PH_mod= 1
##$PKNL= yes
##$PPARMOD= 0
##$PSCAL= 0
##$PSIGN= 0
##$REVERSE= no
##$SF= 200.129724274929
##$SI= 16384
##$SIGF1= 3
##$SIGF2= 2
##$SINO= 400
##$SIOLD= 16384
##$SREGLST= <1H.CDCl3>
##$SSB= 0
##$STSI= 0
##$STSR= 0
##$SW_p= 3205.1282051282
##$SYMM= 0
##$S_DEV= 0
##$TDeff= 0
##$TDoff= 0
##$TI= <>
##$TILT= no
##$TM1= 0
##$TM2= 0
##$TOPLEV= 0
##$USERP1= <user>
##$USERP2= <user>
##$USERP3= <user>
##$USERP4= <user>
##$USERP5= <user>
##$WDW= 1
##$XDIM= 8192
##$YMAX_p= 0
##$YMIN_p= 0
$$ End of Bruker specific parameters
$$ ---------------------------------
##NTUPLES= NMR FID
##VAR_NAME=  TIME,          FID/REAL,        FID/IMAG
##SYMBOL=    X,             R,               I
##VAR_TYPE=  INDEPENDENT,   DEPENDENT,       DEPENDENT
##VAR_FORM=  AFFN,          ASDF,            ASDF
##VAR_DIM=   8192,          8192,            8192
##UNITS=     SECONDS,       ARBITRARY UNITS, ARBITRARY UNITS
##FACTOR=    0.0002768,     1,               1
##FIRST=     0,             0,               0
##LAST=      2.2672688,     0,               0
##MIN=       0,             -13349,          0
##MAX=       2.2672688,     12815,           0
$$ Real data points
##PAGE= N=1
##DATA TABLE= (X++(R..R)), XYDATA
$$ [...]
1392I01j676l39J651p55j076K058K4k032J239J755j973m71J945m55j428J277O
$$ 901 -775 -1114 537 -218 -1294 764 788 -1244 -5 1750 -223 -694 1251 796 -632 645 651
1409F51j878J139J287k162o02K251m63j671J337M33j332R34J223j608k52K399
$$ 651 -1227 -88 1199 -963 -1565 686 223 -1448 -111 322 -1010 -76 1147 -461 -713 1686
1425A686r88j660J573P46j849K94R65j286l60J740j088j609K006N68j943M07J705
$$ 1686 698 -962 611 1357 -492 -198 767 -519 -879 861 -227 -1836 170 738 -1205 -798 907
1442I07j355k17J691o58j082J761K59k162O81J656j462r17J596o23j310J379K36
$$ 907 -448 -665 1026 368 -714 1047 1306 -856 -175 1481 19 -898 698 75 -1235 144 380
1459C80j979R68J588j420p64J910k17j263J374M31j538Q14J321j869n63K034n20
$$ 380 -1599 -631 957 -463 -1227 683 466 -797 577 1008 -530 284 1605 -264 -827 1207 687
1476F87j836R64Q70j687L57J347j716k49K193n32j801J547R44j692L18J437j048
$$ 687 -1149 -185 685 -1002 -645 702 -1014 -1263 930 398 -1403 144 1088 -604 -286 1151 103
1493A03l64J615r08j439J640M32k126L04J467j098o38J343m35j232J546O01j808
$$ 103 -261 1354 446 -993 647 1079 -1047 -743 724 -374 -1012 331 -104 -1336 210 811 -997
1510i97N37J839j272q12J599q5j255J018M73j724M68J368j430q81J291K4j393
$$ -997 -460 1379 107 -705 894 809 -446 572 1045 -679 -211 1157 -273 -1154 137 161 -1232
1527a232J097M74j460P72J290j137n55J710j57j468R82P67j230Q5J027j373l65
$$ -1232 -135 339 -1121 -349 941 -196 -751 959 802 -666 316 1083 -147 -62 965 -408 -773
1544g73J606p50j511J139R97j585O5J294r06l17J589n64j120J381P83j803K21
$$ -773 833 83 -1428 -289 708 -877 -812 482 -424 -741 848 284 -836 545 1328 -475 -254
1561b54J609j124q27J111l61j216J255L14j721M26J442j120o23J434J5j157J070
$$ -254 1355 231 -596 515 154 -1062 193 507 -1214 -788 654 -466 -1089 345 360 -797 273
1578B73M76j324M27J494j221p34J420k6j502R48M36j420L31J109j310o28J616
$$ 273 749 -575 -148 1346 125 -609 811 785 -717 231 667 -753 -422 687 -623 -1251 365
1595C65j38j464J107Q70j149J42J202r19l69J447m49j409J196O57j491j24J149
$$ 365 227 -1237 -130 740 -409 -267 935 16 -353 1094 645 -764 432 1089 -402 -526 623
1612F23q73n74J188m50j262J302O33j531K87J509p65n61J202j51j043J083M27
$$ 623 -250 -824 364 -86 -1348 -46 587 -944 -657 852 87 -474 728 577 -466 617 1044
1629A044j561K78J437j254j020J480j75j190R14M28j434M69J277j028p54J675
$$ 1044 -517 -239 1198 -56 -1076 404 229 -961 -47 381 -1053 -584 693 -335 -1089 586
1645E86J0j246J056O02j280K18J147j076o96J437k43j464O52Q34j388K10J047
$$ 586 596 -650 406 1008 -272 -54 1093 17 -679 758 515 -949 -297 537 -851 -641 406
1662D06q13n76J507j66j340J232Q56j338M8J321r07o05J230l94j243R52P04j803
$$ 406 -407 -983 524 358 -982 250 1106 -232 -184 1137 230 -375 855 461 -782 170 874 -929
1680i29J08J332p96p02J058J44j052R18O56j211K89J429r79p81J297p2j109P44
$$ -929 -821 511 -285 -987 71 215 -837 81 737 -474 -185 1244 265 -516 781 709 -400 344
1698C44M38j239J29R67j117o95J474q7j354R66N67j034K87J147r14n14J514j23
$$ 344 782 -457 -328 639 -478 -1173 301 214 -1140 -174 393 -641 -354 793 -121 -635 879 756
1716G56j365P59Q92j252j03J057j007o39J328k19j284Q16Q92j518J07J454p37
$$ 756 -609 150 1042 -210 -313 744 -263 -902 426 207 -1077 -261 631 -887 -780 674 -63
1733f3o74J342Q2j197R42O19j401qJ334o95j044J179p3j227O16Q07j391J30J334
$$ -63 -737 605 687 -510 432 1051 -350 -358 976 281 -763 416 343 -884 -268 539 -852 -722 612
1752F12p39r11J360K02j185P67Q87j169m3J199o98q79J289l5j445P06P52j141
$$ 612 -127 -1038 322 524 -661 106 993 -176 -219 980 282 -597 692 657 -788 -82 670 -471
1770d71k34J065n99p59J122L09j376P16R80r67j15J248o51o58J176k00j253P27
$$ -471 -705 360 -239 -998 124 433 -943 -227 753 -214 -329 919 268 -390 786 586 -667 60
1788F0P66j189k97J114n19p61Q35K17j167P60P96j141L8J360n05q43J015J84j083
$$ 60 826 -363 -660 454 -65 -826 9 226 -941 -181 615 -526 -488 872 367 -476 539 723 -360
1807c60N45P21j186r5J046o76q95J001K30j196L90Q55r28r2J186n09o68J133L41
$$ -360 185 906 -280 -375 671 -5 -900 101 331 -865 -475 380 -548 -640 546 37 -631 502 843
1826H43j289N25Q30q95k02R50n95q73Q95J21j082M43Q36j037k82J146k58q16R83
$$ 843 -446 79 909 14 -188 762 167 -706 189 310 -772 -329 507 -530 -812 334 76 -740 243
1845B43L95j124N24R77j069k18J056l92q22O74L67j246K64Q85q80l84J066l38
$$ 243 638 -486 38 1015 -54 -272 784 392 -430 244 611 -635 -371 514 -366 -750 316 -22
1863b2q19Q64M34r16L51P48q55J25Q16k20r53R19K94j182L83N61q29m51J023m88
$$ -22 -841 23 457 -459 -108 640 -215 -90 726 506 -447 472 766 -416 -33 528 -301 -752 271 -217
1883b17p38J003J17r26L69Q90o85j95R84k25o86Q04L25j287N25O96q33l44Q92
$$ -217 -955 48 165 -761 -392 498 -187 -382 602 377 -309 495 820 -467 58 754 -79 -423 469
1902D69m99p68Q22K79j116L64R45q58k42J002j99o47Q09K48q87L18Q43q92l82
$$ 469 -30 -798 24 303 -813 -449 496 -362 -604 398 199 -448 361 609 -278 40 883 -9 -391
1921c91Q87l44q53P83K63j000L27O46p73k09Q99k42o92P82N03q50J21O88n36j39
$$ -391 496 152 -701 82 345 -655 -328 318 -455 -664 235 -7 -699 83 586 -264 -143 545 9 -130
1941a30O92j38q70O67K20q56P2P73p78m54J016k05o69O26L58r24M73R57r80m3
$$ -130 562 424 -446 221 441 -415 -343 430 -348 -802 214 9 -660 -34 324 -600 -127 830 -150 -193
1961a93Q69l33o29N69L34j055L36N41o83l98P95k37o98Q41J69p94L63P58p62M
$$ -193 676 343 -286 283 617 -438 -102 439 -244 -642 153 -84 -782 59 228 -566 -203 555 -207 -203
1981b03P95k27p18P29K73q67K89N35p24l55Q83m78o72O84K64q35K67P09o24j61
$$ -203 592 365 -353 376 649 -218 71 606 -118 -473 410 -68 -740 -56 208 -627 -360 349 -275 -436
2001d36Q75j72p44P31N14r77J72P45p34k96Q40l76p62O31K34q00K14O73p70j77
$$ -436 439 267 -477 254 768 -209 -37 708 -26 -322 518 142 -620 11 245 -555 -341 332 -438 -615
2021f15R71j61o69N96M88q52L13O53o16l28P48k53q23O81K88r16P2P75p03k67
$$ -615 356 195 -474 122 610 -242 71 724 108 -220 528 275 -548 133 421 -495 -423 352 -351 -618
2041f18P66j02n97N89M29p79K14P12o45j82P58k6q41N75K49q91M8O75m74m34O95
$$ -618 148 46 -551 38 467 -312 -98 614 -31 -213 545 519 -322 253 502 -389 -341 334 -140 -574 121
2062A21j25p30O75L81q28K40P32m26m27J014k01n59M36L67p40M0N39o77m78Q93
$$ 121 -4 -734 -59 322 -506 -266 466 40 -387 627 426 -133 303 670 -70 -30 509 -168 -646 247
2082B47j72p85N24N45q58k1Q59n47k41P61J71q00N58L27p68J78O23n92n18Q67
$$ 247 75 -710 -186 359 -499 -520 339 -208 -449 312 483 -317 241 568 -200 -22 601 9 -509 358
2102C58j70p23M41L35o52o8P08n20k82Q27l2o11M32N90o95j04R03n30l34M13J2
$$ 358 188 -535 -94 241 -411 -479 229 -291 -573 254 222 -389 43 633 -62 -166 737 207 -127 286 298
2123B98p08M75K95q91J28O73n11m04Q26N7o74L84N05o87l8Q68m10n53Q63Kp34
$$ 298 -410 65 360 -531 -403 270 -241 -645 181 238 -436 -52 453 -234 -272 596 186 -367 496 498 -236
2144b36K97L60o64j49N76l45m10O11no97N38N17p21O0P27k40m35N97N6o15L03
$$ -236 61 421 -243 -392 184 -161 -571 40 35 -662 -124 393 -328 -268 459 219 -216 381 437 -178 125
2165A25M83p89j24P38l92o03O27J14p78K20N45n17j23P45k73m11O29K97p57L34
$$ 125 608 -181 -305 433 41 -562 65 179 -599 -379 166 -351 -474 271 -2 -413 216 513 -244 90
2185I0O17p45p7O66l29o27N47Lp85M76L64n62o5O53k23m73O69K14p55M11N05o18
$$ 90 707 -38 -115 551 222 -405 142 145 -640 -164 200 -362 -427 226 3 -470 199 413 -342 69 574 -44
2207d4m0N72j52n37M32J4n87K67L14n39j67N42k02l33M11K53n05K41M33m23r8
$$ -44 -84 488 336 -201 231 245 -342 -75 239 -300 -467 75 -127 -460 -49 204 -301 -60 373 -50 -148
2228a48O17k37m93O06J05o66K13K73n12j18N61l61m05O15J13n62J98N14l65k65
$$ -148 469 232 -261 345 450 -216 -3 270 -242 -360 201 -160 -565 50 163 -399 -201 313 -52 -317
2248c17O50j13m35O04K1o43L40M50p18j31N62k17n36L75J79n46J34O93p50J12
$$ -317 333 220 -215 389 410 -233 107 557 -161 -292 270 53 -483 -108 71 -475 -341 352 -398 -286
2268b86O22k75l59N68R7m67J32M34n25q1N49l38l36L49l0n40K54L63l87k00O20
$$ -286 336 61 -298 270 367 -100 32 466 -59 -140 409 71 -265 84 54 -486 -232 131 -256 -456 164
2289A64j74l53M80J64n19K88K90k64j76N56k59m07L47K08o36J49M35n45j46M76
$$ 164 -10 -363 117 281 -238 50 340 76 -100 456 197 -210 137 345 -291 -142 293 -252 -398 78
2309G8k58k85M70J46n31L91L95m75o0O60k85m46M90n9l56L2M00o50M8M74r0n74
$$ 78 -180 -465 5 151 -380 11 406 -69 -129 531 246 -200 290 231 -125 -93 307 -343 -295 179 89 -485
2331d85L87K74n37J76L66k40j7M46o9n07M76K83o83Q6L33n06p3N66k21n63M38
$$ -485 -98 176 -361 -185 181 -59 -76 370 301 -206 270 553 -130 -44 289 -217 -290 276 55 -508 -70
2352g0J69n13Q9M23k09j86O03n6l32K99J52m26N1M87m49k17M47k79l90M14P9m78
$$ -70 99 -414 -325 98 -111 -297 306 250 -82 217 369 -57 -6 481 32 -185 262 -17 -407 7 86 -392
2374c92J96M28m38j33N26j40l27L88K10m27J81L42l72k36O15k49m00K81J79n37
$$ -392 -196 232 -206 -339 187 47 -280 108 318 -109 72 414 42 -194 421 172 -228 53 232 -305
2394c05P1N11m21l92P07m9n13L04K33l48J13O04n36l2N04j26m75L40J08m50J3
$$ -305 -234 277 -144 -536 171 122 -391 -87 146 -202 -89 515 -21 -53 451 325 -150 190 298 -152 -139
2415a39M06m56j88N20l27k46L90Q4l68J25N36l02k81N08m4l15L35J31n50J36M02
$$ -139 267 -189 -377 143 -184 -430 -40 44 -324 -199 337 35 -246 262 218 -97 238 369 -181 -45 357
2436C57k88n73N20q9l56L24J64m29l5O30m38n4M99L4n06M50K19n12M8M41l58k76
$$ 357 69 -504 16 -73 -429 -105 59 -370 -405 225 -213 -267 232 266 -240 210 429 -83 -35 406 48 -228
2458b28M57r0m96K85K23m79R4M54n29j06N90p8l23L97K30m93N3L38k24o5K78J25
$$ -228 229 139 -357 -72 151 -328 -234 220 -309 -415 175 97 -226 171 401 -92 -39 299 75 10 288 413
2480D13o85L40K18n67j4M24m58K9L37o8k30L67K08m47M0M80j94l82M24M6m51J97
$$ 413 -272 68 286 -281 -295 129 -329 -300 37 -31 -261 106 314 -133 -93 387 193 -189 235 281 -170 27
2502B7K75m76L4J96j45k18M27r5l93L30K19l38J19L55k61j82L79j2l52K45K48
$$ 27 302 -174 -140 56 -89 -307 120 25 -368 -38 181 -157 -38 317 56 -126 253 241 -111 134 382
2523C82m85M5K71k06j33J37j8m05K41L39m38l9M56j83j99M10L5l45K38K65l59
$$ 382 -103 -58 213 7 -126 11 -7 -412 -171 168 -270 -309 147 -36 -235 175 210 -135 103 368 9
2544Ij72M38k04l71M59n2l31J69J17k75q8M00o1k87K70J18k46J27K86l43N6L28
$$ 9 -163 275 71 -300 159 107 -224 -55 62 -213 -301 99 38 -249 21 139 -107 20 306 -37 19 347
2566C47l84p8L23j3m25R6L16l60n1K81j04k33K87L2l01K70J86k76L6M55m15n1
$$ 347 -37 -115 208 195 -230 -134 182 -178 -229 52 -52 -285 2 34 -267 3 189 -87 -51 404 -11 -62
2588f2K11O1k76P9L61n01l7L75n8m58M03j03j97J5L43l13JM15p7m10L80J91m21
$$ -62 149 210 -66 13 374 -127 -164 211 153 -305 98 -5 -202 -187 156 -157 -156 259 182 -228 152 343 -78
2611g8J62J58l46L9L42l73j47K80r4k33K47J74l31P0L01k01j22L02Q3m54L09L54
$$ -78 84 242 -104 -65 277 -96 -243 37 -57 -290 -43 131 -200 -130 171 -30 -152 150 233 -221 88 442
2633D42l97k5J31j45n9J14n5k84J28K58k76r0K36n6j23L32mk11J66J39k60k9L43
$$ 442 45 20 151 6 -53 61 6 -278 -150 108 -168 -258 -22 -78 -201 131 127 -84 82 221 -39 -68 275
2656B75q2l73L55ll54J05J67k28j33K94K1m44L63K22l13K2L45j90o5K99k05j81
$$ 275 193 -180 175 172 -182 -77 90 -138 -271 23 44 -400 -37 185 -128 -106 239 49 -16 283 78 -103
2678a03L48Nl38J00J93l33k08L80k12r2K38J20l32P5M30k57p4K18q2j73L23Q7
$$ -103 245 250 -88 12 205 -128 -336 44 -168 -260 -22 98 -234 -159 271 14 -60 158 76 -97 226 313
2700C13m13J10K99m26L3K54k12l48L69R3l83J57J92k38k9L53j3k23J90J58k63
$$ 313 -100 10 309 -117 -84 170 -42 -390 -21 72 -311 -154 38 -200 -229 124 111 -112 78 236 -27
2721b7J13K31l15pK25j23k38R3J04l40K28O8k81n2M23l1l90M43K17k48K4J42k12
$$ -27 86 317 2 -5 220 97 -141 -48 56 -284 -56 12 -269 -321 102 71 -319 124 341 93 117 259 47
2744D7j01K85j26k54K32j0l52J00K18k67PK17j03j48K40Oj45J04K12j60q7L04
$$ 47 -54 231 105 -149 83 73 -279 -179 39 -228 -221 -4 -107 -255 -15 -9 -154 -50 162 2 -85 219
2766B19l1j80O1O7k43J33J25k62j88M04p6k60J38J79l68J44L12k24o1L12Q4l54
$$ 219 188 8 69 136 -107 26 151 -111 -299 105 29 -231 -93 86 -282 -138 174 -50 -111 201 285 -69
2788f9J37J24l01J64J24k61o6K86j00l45L60j9k31J25K86k13m2J97o1k18J81J66
$$ -69 68 192 -109 55 179 -82 -148 138 38 -307 53 34 -197 -72 214 1 -41 156 95 -123 58 224
2810B24k55P2J49j48k03K52oj78J24L2l14J32J71n7k30L45j10j54K48K27m42N
$$ 224 -31 41 190 42 -161 91 85 -93 31 63 -251 -119 52 -5 -235 110 0 -154 94 321 -121 -116
2832a16K63j48o6J86J08l14J03Q3j84n2L18k82j49K84l6k44J73K88k90J2J58k0
$$ -116 147 -1 -67 119 227 -87 16 99 -85 -137 181 -101 -250 34 -2 -246 -73 215 -75 -63 95 75
2854G5o9K01j08k18J86L7k06M0J24j8j66K20n5l32L13o9r0J13K06k39j46L35J6
$$ 75 6 207 99 -119 67 104 -102 -62 62 44 -122 98 43 -289 24 -45 -135 -22 184 -55 -201 134 150
2877A50k0r4J53k48l9K91k80m4J71K0k16L1J91j54k0J58n9k43M55j02j88J96J15
$$ 150 130 36 189 -59 -98 193 -87 -131 40 60 -156 -125 66 -88 -108 50 -9 -252 203 101 -87 109 224
2900B24j63o5O2rj63J57N7m67L45K7q7j43L07j91p7L07j4k39J82J43j32p1J18
$$ 224 61 -4 58 49 -114 43 100 -367 -22 5 -82 -225 82 -109 -186 121 107 -132 50 193 61 -10 108
2923A08o8n7J34K1j44j51K91j63j78L05j40j74J16J08j39K10L5k23O6J80p7k4
$$ 108 40 -17 117 138 -6 -157 134 -29 -207 98 -42 -216 -100 8 -131 79 114 -109 -43 137 60 36
2945C6J43J9m01K40P5k12jJ22j07p2J64n3j88J89R3j44Q1J80j22j33L87j13k10
$$ 36 179 198 -203 37 112 -100 -101 21 -86 -158 6 -47 -235 -46 47 -97 -16 164 42 -91 296 183 -27
2968b7J20J17k88RR2j39L1J29l7j66RK99k50O2J39q8j8J21r7n8M1K32k62n6K34
$$ -27 93 210 -78 -69 23 -116 -85 44 7 -159 -150 149 -101 -39 100 12 -6 115 18 -40 1 233 -29 -85 149
2993A49j62p2J07on6N2R7k83r9L54m5j72J17J30l11K72K20k83n3L04k15p1K0J71
$$ 149 -13 -85 22 16 -40 12 109 -174 -273 81 36 -136 -19 111 -200 72 292 9 -44 260 45 -26 -6 165
3017A65l08J56M8k91O5J82n8j64K11N3j35J39O2j43p9K35p7j50J29Q5k72Q6R6
$$ 165 -143 13 61 -230 -165 17 -41 -205 6 59 -76 63 125 -18 -97 138 61 -89 40 125 -147 -61 35
3040C5j81R7R1o8k43K24P4j57qK54k47J12J22M3k72K90J5k77J59L7k08Q3J23j21
$$ 35 -146 -49 42 -26 -269 -45 29 -128 -136 118 -129 -17 105 148 -124 166 181 -96 63 100 -108 -25 98 -23
3064b3j36J83l0k6p8M9J1r8J50pNJ22J58l33M6J46k22J54J07j72J2J34j22k35
$$ -23 -159 24 -6 -32 -110 -61 -50 -148 2 -5 0 122 280 -53 -7 139 -83 71 178 6 18 152 30 -205
3088b05L09N6k45k9N1J7j18J54J25k92K09R2o5k21M04j55k45K37l5k17J15J29
$$ -205 104 160 -85 -114 -63 -46 -164 -10 115 -177 32 124 59 -162 242 87 -158 79 44 -173 -58 71
3110G1k52N7J81j14k2J01l8r2P9J59k12J05P3m1o2J80j4k64J3K02j6k23K12r6
$$ 71 -181 -124 57 -57 -79 22 -16 -108 -29 130 -82 23 96 55 -7 173 159 -105 -92 110 94 -129 83 -13
3134a3o2J08j1j92L0J06j04j11L26O3k15J45Qjq2J00l4o4P1P5l04N1j4OP3J01
$$ -13 -75 33 22 -170 -140 -34 -138 -249 77 140 -75 70 78 77 -5 95 61 -3 68 143 -161 -110 -124 -118 -45 56
3160E6j44p9K04P7j68Q8%L8p3J50k21RJ03lj89J26J71j90m6J09k5j24J45R4k17
$$ 56 -88 -167 37 114 -54 34 34 72 -1 149 -72 -63 40 37 -152 -26 145 -45 -91 18 -7 -131 14 108 -109
3185a09P5K46j96j7P7k8j4J26n8j37K2Np5kJ55j45m2J00q5M6J03k1p9JK04j84
$$ -109 -34 212 16 -1 76 48 34 160 102 -35 -13 -8 -83 -85 70 -75 -117 -17 -102 -56 47 26 -53 -52 152 -32
3211c2K7K52k32j00O8J87k23p5J94j12m9J98m3p9kR1j77J70m6j7J6j7Q1k03J54
$$ -32 -5 247 15 -85 -17 170 -53 -128 66 -46 -95 103 60 -19 -21 70 -107 63 17 0 16 -1 80 -123 31
3236C1J17p9K6O5p1j84J58n7j19J69m8q9kJ98p0p9J26j08m9J32j2J7l1R4n9j27
$$ 31 148 69 95 160 89 -95 63 6 -113 56 8 -81 -83 115 45 -34 92 -16 -65 67 55 72 41 135 76 -51
3262e1J38q3j11l5J27J3Q4J1j51o8O2J24j55J03R2j15QO4L7j54K66j00k06J75
$$ -51 87 4 -107 -142 -15 -2 82 93 -58 -126 -64 60 -95 8 100 -15 -7 57 94 -60 206 106 -100 75
3286G5L2k56L1Q6j1o0J73p4j31L7K08q4L1L1j3j05K25j41r7N0J10j63NJ5M2j11
$$ 75 107 -149 -118 -32 -43 -103 70 -4 -135 -98 110 26 57 88 75 -30 195 54 -43 7 117 -46 -41 -26 16 -95
3312i5Q7P9k02J83l8o2R4l2j11J5nJ91n6Nl2n8JJ46j26P7l5M3j96N3J91k14K6
$$ -95 -8 71 -131 52 14 -48 46 14 -97 -82 -87 104 48 53 21 -37 -36 110 -16 61 26 69 -127 -74 117 -97 -71
3339g1R1M5n7J17j11N8O7p4k1j27K48k01r7J49J27k89P9K7M7j39K17k06J11M2
$$ -71 20 65 8 125 14 72 139 65 44 -83 165 -36 -133 16 143 -146 -67 -40 7 -132 85 -121 -10 32
3363C2Mj07K22m9j98J05n1N8R4j6l7%q5L8o4J7P8j41j0K19m2r0k0J80j30K8J34
$$ 32 36 -71 151 102 -96 9 -42 16 110 94 57 57 -28 10 -54 -37 41 -100 -110 109 67 -23 -43 137 7 35 169
3390A69j62j33K33n4j11k3M4j07O8J86q9j05Q4P2r1J04J2k09J55J4m7m2L0J24
$$ 169 7 -126 107 53 -58 -81 -37 -144 -76 110 21 -84 0 72 -19 85 97 -112 43 57 10 -32 -2 122
3414A22r0O2k9p4p5J80j80Q9m5P2k43K17%Nn1J35M2j92Q4L3l2n1J22j14P1M7o
$$ 122 32 94 65 -9 -84 96 -84 5 -40 32 -211 6 6 11 -40 95 137 -55 29 62 30 -21 101 -13 58 105 99
3441I9q5Rr4M4l7K07k41L3J25r7j6Q6Q4j13J1P1j04O7J3j06J11P1m1j42J8J23
$$ 99 14 23 -71 -27 -64 143 -98 -65 60 -37 -53 33 117 4 15 86 -18 49 62 -44 67 138 97 -45 -27 96
3467I6j75RR1k7%j13J66j03M8J78k95J14O3j8j21K41j41j15P4J08j59m3J41n0
$$ 96 -79 -70 21 -6 -6 -119 47 -56 -8 170 -125 -11 52 34 -87 154 13 -102 -28 80 -79 -122 19 -31
3491c1Np4J35p7q0L5O6R9mj34R7P8l2j18R0J2r3J2j1N7o0J02n7o0m4J37p7k0M2
$$ -31 -26 -100 35 -42 -122 -87 -21 78 74 -60 37 115 83 -35 55 67 -26 -14 -25 32 -28 74 17 -43 -87 50 -27 -47 -5
3520eM7j03P5J07j11j14K60q7j38J32j07j97J72J33k05O5JN6q1K3J29j10J50R
$$ -5 42 -61 14 121 10 -104 156 69 -69 63 -44 -241 -69 64 -141 -76 -75 -19 -100 -77 52 -58 92 101
3544A01p6L7P6j92L7Q5p8J2P4Q9k61qJ21n3o1J51J1r6LJ3l6NO4l4k2P2J2j11K8
$$ 101 25 62 138 -54 -17 68 -10 2 76 165 -96 -104 17 -36 -97 54 65 -31 -28 -15 -51 -46 18 -16 -38 34 46 -65 -37
3573c7P8nK5oj7n3m4J91k10K4J77j07j06J62j05k2J14J1l3jK8r2J56lj09J17j50
$$ -37 41 36 61 55 38 -15 -59 132 -78 -54 123 16 -90 72 -33 -55 59 70 37 36 64 -28 128 125 16 133 -17
3600a7qNP2M4j96J4J71j3j14O6o2lO2K9Q3j04J2n9q1J53J95k00l9K7o9m0J56j8
$$ -17 -25 -20 52 96 -100 -86 85 72 -42 24 -38 -41 21 50 133 29 41 -18 -99 54 249 49 10 37 -32 -72 84 66
3628F6k04J74m6M4N2k11P1J30o9jO4l2k0n6N2qo9J47o2j08Q8r5N0K5k6J17j31
$$ 66 -138 36 -10 34 86 -125 -54 76 7 6 70 38 18 -38 14 6 -63 84 22 -86 2 -93 -43 -18 -44 73 -58
3655e8O8NN9r2kM6o4P4k4l7p4J01p0P7mP2k6j12P6pj21J79j20R8m8M5q1J13Oj56
$$ -58 10 15 74 -18 -20 26 -38 36 12 -25 -99 2 -68 9 5 77 51 -61 15 8 -113 66 -54 44 -4 41 -40 73 79 -77
3685g7LJ84j80J0P8q5M1j6P5J1n1M2r0N1lQ4k00J67O2j34N7J10j58q7K3R3p8O3
$$ -77 -74 110 -70 -60 18 -67 -26 -42 33 44 -7 35 -55 -4 -7 77 -123 44 106 -28 29 139 -19 -106 -83 10 -68 -5
3713ej9l2j8J02j12K2O8O2j00P6m6m7L0L3p0M9M0m1R1j25j3Q3Nj0j30J44q0N3
$$ -5 -24 -56 -74 28 -84 -62 6 68 -32 44 -2 -49 -19 14 -56 -7 33 -8 83 -42 -55 28 33 23 -107 37 -43 10
3741A0j32J90r8l1Q8n4M8l9L9n4n1J15p4j2J57j14O0j76J13K8n9o8J91j08NJJ2
$$ 10 -122 68 -30 -61 27 -27 21 -18 21 -33 -84 31 -43 -55 102 -12 48 -128 -15 13 -46 -114 77 -31 -26 -25 -13
3768a3K7j7L4N1j4j9o9m7P8L3p4j47J33k8J17l4Q5j43J40j23L4o9J06J04j17n
$$ -13 14 -3 31 82 68 49 -20 -67 11 44 -30 -177 -44 -72 45 11 96 -47 93 -30 4 -65 41 145 28 23
3794B3j36Q9J65j62j2k7J91j52qJ06j66L3J00j03j9J09r5N3m7l3OM2rO5l9M5k6
$$ 23 -113 -24 141 -21 -33 -60 131 -21 -29 77 -89 -56 44 -59 -78 31 -64 -11 -58 -91 -85 -43 -52 13 -26 19 -7
3821gL9k1M3K1o8l6O5p5J9l9o7J50j8k0o1J11j19R9k6N7J1k1j4l5m0%J12j11N
$$ -7 32 11 54 75 7 -29 36 -39 -20 -59 -126 24 6 -14 -75 36 -83 16 -10 47 58 37 23 -12 -52 -52 60 -51 -46
3850d6N5m4Q0J32j04M7L0j91L1n1P1k8L4K1l8j11J65p4n4J53j52p8J74p2j06Q3
$$ -46 9 -35 45 177 73 120 150 -41 -10 -61 10 -18 16 37 -1 -112 53 -21 -75 78 -74 -152 22 -50 -156 -73
3876g3J20lo6m7J19l5l1R4p5M4l5q2J41n3Q6q9L7r6M7l2O0o6l3j7O7L9j19J68
$$ -73 47 44 -22 -69 50 15 -16 78 3 47 12 -70 71 18 104 15 52 -44 3 -29 31 -35 -68 -85 -18 21 -98 70
3904G0p5o5N8Q8k28P3J12P2j26N2L8n4l5l2n1J15Rm3Q3PK7n1r7J20J7j37k7k9
$$ 70 -5 -70 -12 76 -152 -79 33 105 -21 31 69 15 -20 -52 -103 12 21 -22 61 68 95 44 -53 67 84 -53 -80 -109
3932a09J94n2j50R2K2J01j26Q6mj1q3k6L1m8K37j90J04M6j95O5k7P3M4j86Q0l0
$$ -109 85 33 -117 -25 -3 98 -28 58 54 43 -40 -66 -35 -83 154 -36 68 114 -81 -16 -43 30 74 -112 -32 -62
3958f2J17p1L8L5J3m9k0m4J5pM6K0J1j09J11nj38J57j1N4j48J78j46m9k1n3J71
$$ -62 55 -16 22 57 70 21 1 -43 -28 -35 11 31 42 -67 44 39 -99 58 47 101 -47 131 -15 -64 -85 -138 33
3985C3r4N8j24M4J32n2RK3n5K1l4Q5k1K1o0M1j16M3m6J26r1J32q3L6P0j51J29
$$ 33 -61 -3 -127 -83 49 -3 6 29 -26 -5 -39 46 25 46 -14 27 -89 -46 -92 34 -57 75 -8 28 98 -53 76
4012G6j06O7l2O4l4o6k4K8lL5k1j09Q6m1J07q6L8j8P1P7Nl8L7j60LJ65o0j09P5
$$ 76 -30 37 5 69 35 -31 -55 -27 -30 5 -16 -125 -39 -80 27 -59 -21 -39 32 109 114 76 113 -47 -44 121 61 -48 27
4041B7J2J3l2L3k7j31O9J43j09K4q8J00K0m9P3r6LQ2J1j1L7l9q5J48j74k0L6l0
$$ 27 39 52 20 53 26 -105 -36 107 -2 22 -66 34 54 5 78 -18 -15 67 78 67 104 65 -20 128 -46 -66 -30 -60
4069f0M8M5m7K3J2m9k2J09k0m6M4L2r3L7LK4j34J33m6Rj03J50q4O6p5M5l1q6K5
$$ -60 -12 33 -14 9 21 -28 -50 59 39 -7 37 69 -24 13 16 40 -94 39 -7 2 -101 49 -35 31 -44 1 -30 -116 -91
4098i1R5PJ27j26j96J11J05j9p8K4R1n4o4N8%L8p7m2J02j25N6P1n3J51j83J29
$$ -91 4 11 138 12 -184 -73 32 13 -65 -41 50 -4 -68 -10 -10 28 -49 -91 11 -114 -58 13 -40 111 -72 57
4124E7j07J10m6m7J23j45K7K7m1R4q2k5P7j13O8M6P4q9Kr0J44l5n9P4j74J39r9
$$ 57 -50 60 14 -33 90 -55 -28 -1 -42 52 -30 -55 22 -91 -23 23 97 8 10 -80 64 29 -30 44 -130 9 -90
4151i0J28Qp2j0l3Qq3J13R5j53J26p0J16q4r5O6J06n5j17m5J21M6NKj8j1j18J39
$$ -90 38 46 -26 -36 -69 -61 -144 -31 64 -89 37 -33 83 -1 -96 -30 76 21 -96 -141 -20 26 31 33 15 4 -114 25
4179B5N4p4J4K5l6p5L5j2O3J4l7R1j14M2l7l6k2j9M4J31k01J14R3p9rJ22j90n4
$$ 25 79 5 19 44 8 -67 -32 -44 19 33 -4 87 -27 15 -22 -58 -80 -99 -55 76 -125 -11 82 3 -6 116 -74 -128
4207a28J77k5j01J65p2m0ok1R3l0l5o1K8J16qj2k6J2L1J2pj32J37j14P3J3j29
$$ -128 49 24 -77 88 16 -24 -30 -51 42 12 -23 -84 -56 60 52 40 14 26 57 69 62 -70 67 -47 26 39 -90
4234i0O2j2K4Lk4KL0J0j3J2j7n4J09n5R9j86K34L8j98P0q7J10m7M8j22p5K16p3
$$ -90 -28 -40 -16 -13 -37 -35 -5 5 -8 4 -13 -67 42 -13 86 -100 134 172 -26 44 -43 67 20 68 -54 -129 87 14
4262A4k9L5K9p6R6j44O2N6n9Q6n4q2m6K4j6Q9O7m4K7q3j5K0M6j11J19l2Mp8L1
$$ 14 -15 20 49 -27 69 -75 -13 43 -16 70 16 -66 -112 -88 -104 -15 52 8 35 -48 -63 -43 3 -108 11 -21 -17 -95 -64
4291f4m9J32l5L9o3PJ06l6j17J75j50kM3O9n8ln5J8L4J0m4l3J27o6J33p0p5lj5
$$ -64 -113 19 -16 23 -40 -33 73 37 -80 95 -55 -57 -14 55 -3 -6 -61 -43 -9 1 -43 -76 51 -15 118 48 -27 -30 -45
4320d5L5J52j48M5o2O4O1j18K3n5M2K6J6m6R3Nl1j22O4M0M7Nq4N8q1KJ12j71n
$$ -45 -10 142 -6 39 -23 41 102 -16 7 -48 -6 20 36 -10 83 88 57 -65 -1 39 86 91 7 65 -16 -14 98 -73 -78
4349g8J57r8J31j56Q8r8J87j41K4q1O9p9N3l7m7R7N8m6n4J16m5K4j18O7J3l4P1
$$ -78 79 -19 112 -44 44 -54 133 -8 16 -65 4 -75 -22 -59 -106 -9 49 3 -51 65 20 44 -74 -7 6 -28 43
4376D3m9O5p2Qk4K4M3L8N9j66j4RK3J2J66j92R6j31n5Q7k0Q1o7j8Q9k7J8nJ3Q2
$$ 43 -6 59 -13 -5 -29 -5 38 76 135 -31 -45 -36 -13 -1 165 -27 69 -62 -117 -30 -50 31 -36 -54 35 8 26 21 34 116
4406A16k04Q5K7K7n8J8m6J34j11N9m9j39R6J48r9n9N5j0j00J46k9N6q9J8OO0O4
$$ 116 -88 -3 24 51 -7 11 -35 99 -12 47 -2 -141 -45 103 4 -55 0 -10 -110 36 7 63 -26 -8 -2 58 122
4433A22j70r0R0kN1J58j71q1K8L6K0l1J32j72J31j05J17m4l0k5q8R3N7j4l9pp5
$$ 122 -48 -138 -48 -50 1 159 -12 -93 -65 -29 -9 -40 92 -80 51 -54 63 19 -11 -36 -124 -31 26 12 -27 -34 -109
4460a09J25K2k8k1m2k4P3J09j30K2k3M5J20j04n0qJ04j77K08M3j75P9j5n9M7J
$$ -109 16 38 10 -11 -53 -77 -4 105 -25 -3 -26 19 139 35 -15 -23 81 -96 112 155 -20 59 44 -15 32 33
4486C3p3m2J58o9j56K18k1q4K1Q7j55J51k3p6rP1m3J9JN4M6j79Q5r4J5P6NO5m0
$$ 33 -40 -82 76 7 -149 69 48 -36 -15 72 -83 68 45 -31 -40 31 -12 7 8 62 108 -71 14 -80 -65 11 16 81 41
4515D1p5N9q8Q0J1j74P1m6J4OJ02Q4j55J07rmj27J41m7J01q1j6Jj02J12q1N2r2
$$ 41 -34 25 -63 17 28 -146 -75 -121 -107 -101 1 85 -70 37 28 24 -103 38 -9 92 11 -5 -4 -106 6 -75 -23 -115
4543a15L1l5M4K9k8J67j09P7L5j14j6j0J18m7r9J33Oj34J7J84j43NM8m6K8q3R9
$$ -115 -84 -119 -75 -46 -74 93 -16 61 96 -18 -34 -44 74 27 -72 61 67 -67 -50 134 -9 -4 44 -2 26 -57 42
4570D2Q5j14L2j07N8q4J28j20J16r6k2J22n6q4K20oj54K8QN4l0MRl8P7Op3K7p1
$$ 42 127 13 45 -62 -4 -88 40 -80 36 -60 -82 40 -16 -100 120 114 -40 -12 -4 50 20 24 33 -5 72 78 5 32 -39
4599c9J07l8o8K7m6N8k0j9jJ59o1r1l1J20k9Kk4K9j32K54k24p9o1K30P0j19l9
$$ -39 68 30 -38 -11 -57 1 -19 -38 -39 120 59 -32 -63 57 28 30 6 35 -97 157 -67 -146 -207 23 93 -26 -65
4626f5J28L0j16J59j48m1J01nr8L4p2k0K04L8j40j20K1M2J29j30O6Jlj07J71r0
$$ -65 63 93 -23 136 -12 -53 48 43 -55 -21 -93 -113 91 129 -11 -131 -110 -68 61 -69 -3 -2 -5 -112 59 -31
4652c1Q2r4P7l1M1K3j08LJ0K6j08M2K8J8Q8j65L5MO5j9k7J08q2m1Q0kPq4j13K70
$$ -31 51 -43 34 3 44 67 -41 -38 -28 -2 -110 -68 -40 -22 66 -99 -64 -60 5 -14 -41 67 -15 -56 24 22 29 -55 -168 102
4682A02K4j85O5K3J02k50O6R4J3j13J00L8q4N3k3j5J10q3N9mn9l9R6j84O2o9M7
$$ 102 126 -59 6 29 131 -119 -53 41 54 -59 41 79 -5 48 25 10 120 37 96 92 33 -6 90 -94 -32 -101 -54
4709e4N1M5m5j3J7n9R0m3p4N0P3Qj44J97j58N1Q1j91N6o5K22j41n0J36J3j33J09
$$ -54 -3 42 -3 -16 1 -58 32 -11 -85 -35 38 46 -98 99 -59 -8 73 -118 -62 -127 95 -46 -96 40 53 -80 29
4736B9k2O6r4J26j52Q4K8j53J69j61Q0J13Nj24O2j17J59j16K2j9n1R6j9k0q3J26
$$ 29 7 73 -21 105 -47 37 65 -88 81 -80 0 113 118 -6 56 -61 98 -18 4 -15 -66 30 11 -9 -92 34
4762C4n1q3J44L1j09N8p7J5J3o6O2nR7m7o3p8K05j01K5o1Q5m7R1o9j2p4K8p3J93
$$ 34 -17 -100 44 75 -34 24 -53 -38 -25 -91 -29 -34 63 16 -47 -125 80 -21 4 -57 28 -19 72 3 -9 -83 -55 -128 65
4791F5m5q7J10r0J66j53L0j36N1J12n5R5j78J19J7Qj2j2J54k18Q1K1j17J39r9
$$ 65 20 -67 43 -47 119 -34 -4 -140 -89 23 -32 63 -115 4 21 29 17 5 159 -59 22 43 -74 65 -34
4816c4q2K6J63n5L3j74Q7j8L9k7j08J89j03O6M1j35J13n6Rp3J16Oj7r4RJ30p3
$$ -34 -116 -90 73 18 51 -123 -36 -54 -15 -42 -150 39 -64 2 43 -92 21 -35 -26 -99 17 23 6 -88 -79 51 -22
4843b2J6L1j8L6o0O2qp5rL7j3J05o2M0j54J75l3k6P6q9n8O5P9j87Q9%m2m8M1M7
$$ -22 -6 25 7 43 -17 45 37 -38 -47 -10 -23 82 20 60 -94 81 48 22 98 9 -49 16 95 -92 -3 -3 -45 -93 -52 -5
4873ek8J53O3j12j16J34r6l1Q8q6K9O1p2p1N0M5o4L8k9J14p1j23J94j16P5N2k5
$$ -5 -33 120 183 71 -45 89 -7 -38 50 -36 -7 54 -18 -89 -39 6 -58 -20 -49 65 -6 -129 65 -51 24 76 51
4900E1j15K7N2Pno3j0J18j5j27J96k48K02o5O9l1k71K55l3j2O7k2M7Pp0j4n6R4
$$ 51 -64 -37 15 22 17 -46 -56 62 47 -80 116 -132 70 5 74 43 -228 27 -6 -18 49 27 74 81 11 -3 -59 35
4928C5n0RO0m4p1J00p7M0k3%m1J59j62O6m1K0L9K7L7o2L1j56L9J63%q5O6K5j66
$$ 35 -15 -6 54 10 -61 39 -38 2 -21 -21 -62 97 -65 1 -40 -20 19 46 83 21 52 -104 -65 98 98 13 79 104 -62
4957f2JK0n0J3KJ79o3R4j10M5j5j74K09j84J87p6rn5k8Q6m4jn3L5J78j66R5j15
$$ -62 -61 -41 -91 -78 -76 103 40 134 24 69 54 -120 89 -95 92 16 7 -48 -76 10 -34 -35 -88 -53 125 -41 54 -61
4985f1M6L7j8R2L6j49K2o2P1J2m2R9j9j7k8L3j7O7j76m0J34j11Q3Q3q6kl4J4J
$$ -61 -15 22 4 96 132 -17 5 -57 14 26 -16 83 64 47 19 52 35 102 -74 -114 20 -91 -8 75 -11 -13 -47 -33 -32
5014c2L5N1j5j13J5J01q2L5J44j73mk0P6p1R8K8m0N6Qj19N1Q9j7n4LK1j69J39
$$ -32 3 54 39 -74 -59 42 -40 -5 139 -34 -38 -58 18 -53 45 73 33 89 97 -22 29 118 101 47 50 71 -98 41
5042D1j06P3k7P5l6n7oo8L8N1K7J3nqn0k1J56j73J13k6k8J2RPJ0L9j1n9J6M4k7
$$ 41 -65 8 -19 56 20 -37 -43 -111 -73 -22 5 18 13 5 -45 -66 90 -83 30 4 -24 -12 -3 4 14 53 42 -17 -1 43 16
5073A6j28M9N6P4m5k5J31j42O8j0P6j8j09j7L6p1J12k01J51M1j23J23j00L3kJ01
$$ 16 -112 -63 -7 67 22 -3 128 -14 54 44 120 102 -7 -24 12 -59 53 -148 3 44 -79 44 -56 -23 -25 76
5099G6j08K4j19J84n5rJ12j11R6j05J0Mlm3lk2J18j79K5J28l9J7L5o8N3m4J31
$$ 76 -32 -8 -127 57 2 -7 105 -6 90 -15 -5 -1 -4 -47 -50 -72 46 -133 -108 20 -19 -2 33 -35 18 -26 105
5126A05k3l7r9K2Q2m7J1j01R8J5j07P4J25j74Q8k7K9N8l3K9n0j8L1Rm7K8j1J1
$$ 105 82 45 -54 -32 50 3 14 -87 11 26 -81 -7 118 -56 32 5 34 92 59 88 38 20 51 60 13 41 30 41
5154D1qm4O0J8%q8lN7j85J35P3k2J15j95L7L0M2k1j4p6K5P5r6l2j5O4q1J80j26
$$ 41 33 -11 49 67 67 -21 -24 33 -152 -17 56 34 149 -46 -9 21 63 42 28 -48 -23 52 -44 -76 -91 -27 -108 72 -54
5183e4RM7k2o5pN0R3l6k2Q1J8j29L8kj18k2K52k43J96l9O5j79J11Qp9J62j36J05
$$ -54 -45 2 -20 -85 -92 -42 51 15 -7 74 92 -37 1 -1 -119 -141 111 -132 64 25 90 -89 22 30 -49 113 -23 82
5211H2j07J2J32j19m4Q7q9J8K6n0M3O0j32J4R4o6M3L3L6r6R3l6k0pJ13j11jn0
$$ 82 -25 -13 119 0 -44 43 -46 -28 -2 -52 -9 51 -81 -67 27 -39 4 37 73 -23 70 34 14 7 120 9 8 -42
5239d2K5K1l1P3q8J40o3j04J6J29o8jL1jq3O7n3N9R5j24J18p9j87J28K0m7N8j07
$$ -42 -17 4 -27 46 -42 98 35 -69 -53 76 8 7 38 37 -46 21 -32 27 122 -2 116 37 -150 -22 -2 -49 9 -98
5267i8L0K8n1Q3o4j3R8rp0J08j39J16k7J7j7O8q9J1M4l3l3K0qN1L3p5NK5K7N7
$$ -98 -68 -40 -91 -8 -72 -85 13 4 -66 42 -97 19 -8 9 -8 60 -29 -18 26 -7 -40 -20 -28 23 56 -19 -14 11 38 95
5297I5j6p3m4K5O8Qm5p9O9R1p8O0qn5k8Mr5j6J26j78J47K2R5j6nMj02J3J06K7
$$ 95 79 6 -38 -13 55 63 18 -61 8 99 21 81 73 18 -10 -6 -101 -117 9 -169 -22 0 95 79 74 78 -24 -11 95 122
5327A22j14L7l9J6J28q7j12P2j9J41k62N9J04j4L6k6n4Op4K00j35R2J2j61J18
$$ 122 8 45 6 22 150 63 -49 23 4 145 -117 -58 46 32 68 42 -12 -6 -80 120 -15 77 89 -72 46
5352D6j23j7J38l3m0mN5Oj21N1j05J35kL8L4j17Q6Q6p3J34n1lk11J76j37k2Q1
$$ 46 -77 -94 44 11 -29 -33 22 28 -93 -42 -147 -12 -14 24 58 -59 27 113 40 174 123 120 -91 85 -52 -74 7
5379GJ0n3K7J17r3j36N5o4J78r7P8nM8r9M2q1J63n7j18n9J95p3j35J89j21O7J7
$$ 7 17 -36 -9 108 15 -121 -66 -130 48 -49 29 24 72 -27 15 -66 97 40 -78 -137 58 -15 -150 39 -82 -15 2
5406BL4r1NJ13j41J35p2o1Q2K1O7j07L4p0L7r8K34j85J09K5p3J15j29M7p4P4j11
$$ 2 36 -55 -50 63 -78 57 -15 -76 6 27 94 -13 21 -49 -12 -110 124 -61 48 73 0 115 -14 33 -41 33 -78
5433g8M0O4MO2j08j9J26p4q7R5p2K9m0OM8M5n9r7J85p3q8J44n5J1l5L6p9J28m8
$$ -78 -38 26 30 92 -16 -35 91 17 -70 25 -47 -18 -58 -52 -4 41 -18 -115 70 -3 -91 53 -2 9 -26 10 -69 59 11
5462A1m3nO4j4Kq4J73r5m4n7J63K3j38P0L9q6J11l2l7r7J30j11M8r8R0J9j1P3
$$ 11 -32 -37 27 13 15 -69 104 9 -35 -92 71 94 -44 26 65 -21 90 58 21 -76 54 -57 -9 -107 -17 2 -9 64
5490F4j04l8l0J32q7Q0m1O4M7j66J14M0p1O5J8m9j5j0j8L0r3l9N2J45Jj54O5N
$$ 64 -40 -78 -108 24 -63 17 -24 40 87 -79 35 75 4 69 87 38 23 13 -5 25 -68 -107 -55 90 91 -63 2 7
5518GQ3j31l2L2R2L4j47Q4J6N3j46R0kL3j38J01j58L5KL0J12j16l4J90j27M6J10
$$ 7 90 -41 -73 -41 51 85 -62 22 38 91 -55 35 33 66 -72 29 -129 -94 -92 -62 50 -66 -100 90 -37 9 119
5545A19j40Q8j56j3K29j52o1K49j38l6N6j00k2J33km9%l1o5p4J42k7J22j34O1
$$ 119 -21 67 -89 -102 127 -25 -86 163 25 -11 45 -55 -77 56 54 5 5 -26 -91 -165 -23 -50 72 -62 -1
5570aP9j74J16m3L2K5r2KK07j10j12n1J50Q4j73Q3Pm7L3J04p4J0M5j40J6PJ18
$$ -1 78 -96 20 -23 9 34 -58 -56 151 41 -71 -122 28 112 -61 22 29 -18 15 119 45 55 100 -40 -24 -17 101
5597A01j19j9M6o4N3j9K6n7P1N5l6k7O6p6p2Q9k6J1P1k2J5n6M2j38M9N3n5rk2
$$ 101 -18 -37 9 -55 -2 -21 5 -52 19 74 38 11 77 1 -71 18 -8 3 74 52 67 11 53 -85 -36 17 -38 -47 -69
5626f9k2L5M8P1j56J14p1j78K35r6J46j00P5M4m3j70K05r4p1O1J05j74J0J23n4
$$ -69 -91 -56 -8 63 -93 21 -50 -228 7 -89 57 -43 32 76 33 -137 68 -26 -97 -36 69 -105 -95 28 -26
5651b6R2j21L4rj8K3R8p9m0KL2Q4m8q9P7j41N8J00nO0p7k4o3j3P6M3j09Q8O9m
$$ -26 66 -55 -21 -30 -48 -25 73 -6 -46 -44 -12 72 24 -65 12 -129 -71 29 24 84 7 -17 -80 -93 -17 26 -83 5 74 70
5681G0l9J30q6j34R1j2q8J19L4L8j80Pq5rK17l4j03P2j5k8L6M9r8J03Q4j23mp0
$$ 70 31 161 75 -59 32 20 -68 51 85 123 -57 -50 -135 -144 73 39 -64 8 -7 -35 1 50 -48 55 139 16 12 -58
5709e8O8k0l7KQL1k9L1o6m5J06N8m8Qo8J38o1Q5j10l1P7q7K6M4p1O1j15L7N7J56
$$ -58 10 -10 -47 -45 -37 -6 -35 -4 -70 -115 -9 49 1 9 -59 79 18 103 -7 -38 39 -48 -22 22 -49 12 -103 -66 -9 147
5739A47j53n7Q8Lj44J23O5j67J57p5J42j57L3J1nr8l1O5M6m9O2m9m0J81j72J4
$$ 147 -6 -63 25 28 -116 7 72 -95 62 -13 129 -28 5 16 11 -87 -118 -53 -7 -56 6 -43 -83 98 -74 -60
5765f0Q3j8o2R1K8o8L1P2l1l6m7O5j09Q0m4N8j54OJ00j05J37L4j97O6O6j0%J19
$$ -60 23 5 -57 34 62 -6 25 97 66 30 -17 48 -61 19 -25 33 -121 -115 -15 -120 17 51 -146 -80 -14 -24 -24 95
5793I5r5NL0K0m0PJ3j5j7pq3kP0O4m0n7Kk3N8l4pK3J28J14k18%N5M6j36O9k3K4
$$ 95 0 5 35 55 15 22 35 20 3 -4 -87 -89 -19 45 5 -52 -50 -73 -15 -49 -56 -33 95 209 -9 -9 46 92 -44 25 2 26
5825B6m0j1J08n9j07RQJ02Lj9P8l4j3p2j3Q6p8M4k1qJ12mj63RmK2o6J30j09O7
$$ 26 -14 -25 83 24 -83 -74 -66 36 39 20 98 64 51 -21 -34 52 -26 18 -3 -11 101 97 -66 -57 -61 -39 -105 25 -84 -17
5855a7N6q4J7l1J53o0N7o7K4r0P7j8k1l9N5r0j01J86q7M7P4j2p2o2J89j37N1J41
$$ -17 39 -45 -28 -59 94 34 91 24 48 -42 35 17 -4 -43 12 -78 -179 7 -80 -33 41 29 -43 -105 84 -53 -2 139
5883A39k10J93q2k0P2j16mJ4l1N5Oj4L9l2j12J46j88K28j21P3j37N2K4O2j00M5
$$ 139 -71 122 40 20 92 -24 -28 -14 -45 10 16 2 41 9 -103 43 -145 83 -38 35 -102 -50 -26 36 -64 -19
5909a9K1m2n0O2no1Q7J5k9M6j17N2O5n5R1j13K2M1Nj6QN0k02K27p9Q1j6p6JJ9
$$ -19 2 -40 -90 -28 -33 -94 -7 8 -21 25 -92 -40 25 -30 61 -52 -30 11 16 0 8 58 -144 83 4 85 69 -7 -6 13
5939A3q4O1om3N5P1j22Q0k7o3O1nN5K2m0j36J00P9o2l5N2j50J8J09L9p9J02k8
$$ 13 -71 -10 -16 -59 -4 67 -55 25 -2 -65 -4 -9 46 68 28 -108 -8 71 9 -26 26 -124 -106 3 42 -37 65 37
5967C7j0l6p3N2O6K7Op0J3k1J3N2o%l0o9O0r5Q4p1l9J10%O8l7N2j27Q6MJ8j04
$$ 37 27 -9 -82 -30 36 63 69 -1 12 -9 4 56 50 50 20 -49 11 -84 0 -71 -110 0 0 68 31 83 -44 42 46 64 -40
5998d0J21j2j6n2Q6j88l3J22rk3M1Q7r3k0K2Q3k1O8r0p6O8K3Lj01O4N3p7n2J7
$$ -40 81 69 53 1 87 -101 -134 -12 -21 -44 -3 84 -9 -29 -7 76 55 123 33 -43 25 48 51 -50 14 67 -10 -62 -45
6027d5l0n7K11m8J9p3M2p9QrL7k4R7N4o3j9l3o0J30k9j16J4K6n6J59j17K7K9p
$$ -45 -75 -132 79 31 50 -23 19 -60 -52 -61 -24 -48 49 103 40 21 -12 -72 58 29 -87 -73 -47 -103 56 -61 -34 -5 -12
6056a2L3o8P4Jk3r5J95p5jk2P4r5J16j13o7J76r7p2M9L7k8J0Rk4MJ1k3K06k09
$$ -12 21 -47 27 28 5 -90 105 30 29 7 81 -14 102 -11 -78 98 1 -71 -22 15 -13 -3 6 -18 -14 -3 -26 180 -29
6085b9N0rj33J01J5K1r0M3R7o4j9Jo0O1J5n2P7KN6j50P7P0o8n2J32k3k5pj31Q5
$$ -29 21 12 -121 -20 -5 16 -74 -31 66 2 -17 -16 -76 -15 0 -52 25 27 83 -67 10 80 12 -40 92 69 44 37 -94 -9
6115ikK7o3jp2Q2l3J60j61Q6OQ3j38J5L3l6l3J2R9J6m0l9r2Q6j51J42%L3J9R1
$$ -9 -11 16 -47 -48 -120 -38 -71 89 -72 14 20 103 -35 -20 13 -23 -56 -44 55 71 31 -8 -100 -14 -165 -23 -23 10 29 120
6145A20j22N1o8J00q5K1j07J65k8LJ3N1j67L5l1M1o1J7J04r2n0N3L0r8J39J9r2
$$ 120 -2 49 -19 81 -4 17 -90 75 47 50 63 114 -53 -18 -49 -8 -69 -52 52 -40 -90 -37 -7 -105 34 53 -39
6172c9lR2j0m7O7k0lr4M2L5p1P0k5k3j2O3p2p0J23j23J54k9n8O1L5l2j5N8j4M6
$$ -39 -42 50 40 -7 60 40 37 -57 -15 20 -51 19 -6 -29 -41 22 -50 -120 3 -120 34 5 -53 8 43 11 -4 54 40 86
6202H6rk5Lj08K1M0j18N0n1J22O2m8k2K4o3J08j92N6L0J12j08J2L2J30j37n1J25
$$ 86 77 52 55 -53 -32 8 -110 -60 -111 11 73 25 3 27 -36 72 -120 -64 -34 78 -30 -18 14 144 7 -44 81
6229H1j12jPO0M2k1n2L5k4n1N1o1%J07r2P0n8N5o3J27J4j02n6p7J90q6j09J26
$$ 81 -31 -32 -25 35 77 56 4 39 15 -36 15 -46 -46 61 -31 39 -19 36 -27 100 114 12 -44 -121 69 -17 -126 0
6257@J3l2Pj01MK19j49J27O9j35o1R3j13J06j59J01k0lj2m5J42j08j8J43r3Q5
$$ 0 13 -19 -12 -113 -109 110 -39 88 157 22 -39 54 -59 47 -112 -11 -31 -34 -46 -91 51 -57 -75 68 -25 60
6283F0o5N9L5nl6Nk2o5P5M6j32j1J07o5j4qj0M5oo0M4N9L1j05O7j5k8rM5j00P8
$$ 60 -5 54 89 84 48 53 31 -34 41 87 -45 -56 51 -14 -28 -36 -46 -1 -7 -67 -23 36 67 -38 29 14 -14 -23 22 -78 0
6314@r9J04N3r0J16q2j09J15O0j1j57RJ47R7k09N2o4J43j19L7l7M3K5j75J92p4
$$ 0 -99 5 58 -32 84 2 -107 8 68 57 -100 -91 56 153 -56 -4 -68 75 -44 -7 -44 -1 24 -151 41 -33
6340c3q6l3m9J35o8J26L3o5M8l9l9L3J03q7M0j06K8R4pK9l1j4j25J54N0m0m7j17
$$ -33 -119 -152 -201 -66 -134 -8 25 -40 8 -31 -70 -37 66 -21 19 -87 -59 35 28 57 26 12 -113 41 91 51 4 -113
6368a13L1J45j24O7J2M1q4O8k6jO9k7K0j49k9O8j7j7P0j02J09m0l2RJ07j7n0n0
$$ -113 -82 63 -61 6 18 59 -25 43 17 16 85 58 78 -71 -100 -32 -49 -66 4 -98 11 -29 -61 -52 55 38 -12 -62
6396f2M8J35j45J5J32l7n9n3N2r2N4p0L7L1J09j74n7J39j40P2J75j0r4J34j36
$$ -62 -14 121 -24 -9 123 86 27 -26 26 -66 -12 -82 -45 -14 95 -79 -136 3 -137 -65 110 100 6 140 4
6421DNJ33k06O3R3j70J88j77M9Q8j05l7j3N2Rq7J06j6m1K09j39m6O1j5L9r5O4
$$ 4 9 142 -64 -1 92 -78 110 -67 -18 70 -35 -72 -85 -33 -24 -111 -5 -21 -62 147 8 -38 23 8 47 -48 16
6448A6n2R9j3M8j51R2p0J8O2r9M4M3K4Mj15J62r2J2n1O6M9q6P2j23J02p6n8N4
$$ 16 -36 63 50 98 -53 39 -31 -13 49 -50 -6 37 61 65 -50 112 20 32 -19 47 96 10 82 -41 61 -15 -73 -19
6476a9N3oj17J03q5MM7o3L8J40O1q7r8Q4Jq2M6o4J57j85l0J19p3J73q9l6p7J97
$$ -19 34 28 -89 14 -71 -67 -20 -83 -45 95 156 69 -29 55 56 -26 20 -44 113 -72 -102 17 -56 117 28 -8 -85 112
6504A12j27j6L5j7K8M2M0k5k1k2l6l3J06j32J80q6k2l8M3o6P2p5J58j77O7k3J04
$$ 112 -15 -31 4 -13 15 57 97 72 51 29 -7 -40 66 -66 114 28 6 -32 11 -55 17 -58 100 -77 -10 -33 71
6531G1k6K0m1L6L1k1lj22j3O6K9mj15J24O0l2p1J09j70J0o7R1P4j3j7N7j32Q5
$$ 71 45 65 24 60 91 70 67 -55 -68 -2 27 23 -92 32 92 60 -11 98 -72 -62 -129 -38 36 23 6 63 -69 16
6559A6n3k0J4J3O4LL2r9M3r8M0J23K7p0l7M4l2Nk8Q7n4L2r0J3N8j1j4J72k77J3
$$ 16 -37 -57 -43 -30 34 37 69 -30 13 -85 -45 78 105 35 -2 42 10 15 -13 74 20 52 -38 -25 33 22 8 180 -97 -84
6589h4J1j2J12rm2K5J6O7l3q3Q3l5k1L7o9N5j14J15q7k7Q2k6l8O6L4o9p5J72P5
$$ -84 -73 -85 27 18 -24 1 17 84 51 -32 51 16 -5 32 -37 18 -96 19 -68 -95 -13 -39 -77 -11 23 -46 -121 51 126
6618A26j56P9n6K1qo8Q3P8o1J4M3q8j0K0j10J55o2KL8K2k5m0N5q0l1Ml6J52j5
$$ 126 -30 49 -7 14 6 -62 21 99 38 52 95 7 -3 17 -93 62 0 2 40 62 37 -3 52 -28 -59 -55 -91 61 46
6647D6j17J56j67J22Lo8O3j20m9J45L7m0n7K0j1N7K4k6j7J87k45P5N8q8l8Q7l
$$ 46 -71 85 -82 40 43 -25 38 -82 -131 14 51 11 -46 -26 -37 20 44 18 1 188 -57 18 76 -12 -50 37 34
6674C4j52J71o4n7OK7o5R1Mkj1k7j1K15j76M8o7k7L7J3m2k0Q5n9L5P2p9lM1o1
$$ 34 -118 53 -11 -68 -62 -35 -100 -9 -5 -7 -18 -45 -56 159 -17 31 -36 -63 -26 -13 -55 -75 10 -49 -14 58 -21 -24 17 -44
6704d4j5K5J02p8R4J8j08L7j6k1mR9m1L4p1m7j1M7j37J33p4K2M3j0m7O9m2l3P0
$$ -44 -59 -34 68 -10 84 102 -6 31 15 -6 -10 89 48 82 11 -36 -47 0 -137 -4 -78 -56 -13 -23 -70 -1 -43 -76 -6
6733fp1J40q8M7M5j73J27p3K7L6L1oj28O0M7L7r5N6p3J8K3J50r6M6k0l0k3J33
$$ -6 -77 63 -25 22 67 -106 21 -52 -25 11 42 36 -92 -32 15 52 -43 13 -60 -42 -19 131 35 81 61 31 8 141
6761A41j11j32pP9J29j53O8o1m9J05j19J32o0k5K3P5r4J52pp6o8J32j0j10P1J2
$$ 141 30 -102 -109 -30 99 -54 14 -47 -96 9 -110 22 -38 -63 -40 35 -59 93 86 10 -58 74 64 -46 25 37
6787C7k8Kq0m1J11O7q6O6Kl6j51N8Q3P0n9O4QK4l1p2L9j35L8P7n3p7O0L5J00q6
$$ 37 9 11 -69 -110 1 68 -18 48 50 14 -137 -79 4 74 15 79 87 111 80 8 47 -88 -50 27 -26 -103 -43 -8 92 6
6817Fo6O2r2P7j20J27Q1r3J04m7r0J12j81M3J04q5J7J16qj32J86k05O2M2j66J19
$$ 6 -60 2 -90 -13 -133 -6 75 -18 86 39 -51 61 -120 -77 27 -58 -41 75 67 -65 121 -84 -22 20 -146 -27
6843b7L1R1j07k7J21j27J82r4k7N0j07p5P0J15k9qm0N3j25N9n3J92r1QJ2j48P7
$$ -27 4 95 -12 -39 82 -45 137 43 16 66 -41 -116 -46 69 40 32 -8 45 -80 -21 -74 118 27 35 47 -101 -24
6870b4k4O8q6K5R0Q5r2j3Kk3n1j6KJ24j59J71m6nJ6p4n6M8K1J47j86k3P2K1L9
$$ -24 -48 20 -66 -41 49 134 42 29 31 8 -43 -59 -57 67 -92 79 33 28 44 -30 -86 -38 -17 130 -56 -79 -7 14 53
6899E3j40pP5j2k7R0P9j39P3j26J13o2l4J86m7m2m7Q0J03k81J33m2K3k6p7J42
$$ 53 -87 -94 -19 -31 -58 32 111 -28 45 -81 32 -30 -64 122 75 33 -14 66 169 -112 21 -21 2 -24 -101 41
6925D1p7j5J31q0Qn9JJ14r9L6q7j9J36k4l1n2m6J22J3p5k1Om9J38k1Mj35J14m2
$$ 41 -36 -51 80 0 8 -51 -50 64 -35 1 -86 -105 31 7 -24 -76 -122 0 13 -62 -83 -77 -126 12 -9 -5 -140 -26 -68
6954f8J32o4MR2m9J4n0j88J53K8j4R2q4j89J25N6j8J17r4O1mM6j13P7nj5m4L1
$$ -68 64 0 4 96 47 61 11 -177 -24 4 -10 82 -2 -191 -66 -10 -28 89 -5 56 52 98 -15 62 57 42 -2 29
6982B9q4P7K8P1j69J9m1K9K1p6M4O8l6j29Q8PL7l8J04j38R6K0mJ3k0k00J92l6
$$ 29 -55 22 50 121 -48 -29 -70 -41 -20 -96 -52 16 -20 -149 -61 -54 -17 -55 49 -89 7 27 23 36 16 -184 8 -28
7010b8n7R8j04J82j41l4J14M7l5L5m5l4O4k01J96n2j4r4J32n7l5J10r8J9%L3o8
$$ -28 -85 13 -91 91 -50 -84 30 77 42 77 32 -2 62 -139 57 5 -9 -103 29 -28 -63 47 -51 -32 -32 1 -67
7037f7Q6l4Q0n1p6K2O8l8L6k3J1J5l6Pj1l7l4R3P1j08N5q3M3L9K4P1j40j0J5M
$$ -67 19 -15 65 14 -62 -40 28 -10 26 3 14 29 -7 0 -11 -48 -82 11 82 -26 29 -54 -11 28 52 123 -17 -27 -12 -8
7067hM4J8o6K3n2M0j8Jl9Q2L7p5n5nn7J45j2k1L4j2K4o6M9N3m6o4P5l0J21o9j09
$$ -8 36 54 -12 11 -41 -1 -19 -18 -57 25 62 -13 -68 -73 -130 15 3 -18 16 4 28 -38 11 64 18 -46 29 -1 120 51 -58
7098e8mNM4m5J47j40l4R1L6Nq1J34r9J6O2J2O8r6n2rL9K9j58J04K1j07J02j30
$$ -58 -62 -57 -13 -58 89 -51 -85 6 42 47 -34 100 1 17 79 91 159 63 11 2 41 70 -88 16 37 -70 32 -98
7126i8J54j50Q1ML7q0k3J05P4k0n7mm3J08L1k24O3N6Qj00L3N4j0ml7P8j6O8p8
$$ -98 56 -94 -13 -9 28 -52 -75 30 104 84 27 23 -20 88 119 -105 -42 14 22 -78 -45 9 -1 -5 -42 36 20 88 10
7155A0n1L1k8J04Kj25L3rK0N1j35K69j83R1n9n9k0J07k7l6L2j9m9N2mJ7m2m7N5
$$ 10 -41 -10 -38 66 68 -57 -24 -33 -13 38 -97 172 -11 80 21 -38 -58 49 22 -14 18 -1 -50 2 -2 15 -27 -74 -19
7184a9P2n3j8n3O2l9L6P6o1o4O7Km8M5j8n6J20r6K05m1k05K7R2M6p7p7P6M1j51
$$ -19 53 0 -18 -71 -9 -48 -12 64 3 -61 6 8 -40 5 -13 -69 51 -45 160 119 -86 -59 33 79 2 -75 1 42 -109
7213a09J8L5J03j9o9j4J4J71j10O2p0m4M7lj7oj11L0P2n6K1K6J5L5m1l2O4J9O
$$ -109 -91 -56 47 28 -41 -55 -41 130 20 82 12 -32 15 12 -5 -11 -122 -92 -20 -76 -55 -29 -14 21 -20 -52 12 31 37
7242C7j2o0Q9p0J16n0K6j14N9K5nP9j79O1P5j37Oj9J06n8j6O5J5j12Q1J1J36j84
$$ 37 25 -35 54 -16 100 50 76 -38 21 46 41 120 -59 2 77 -60 -54 -73 33 -25 -41 24 39 -73 8 19 155 -29
7270b9n1J39j19J20nP7j59Q1p3K9R3q6r1RM9M5K4K3k5oKj5J8j20NR4j04J16j05
$$ -29 -80 59 -60 60 55 132 -27 54 -19 10 103 17 -74 -65 -16 29 53 76 51 45 47 32 50 -70 -65 29 -75 41 -64
7299f4J30j27O1n3j6J12j16QO6k4M8L1j09P5Rl1O3j45J65j60N2P7RMj17K3kj07
$$ -64 66 -61 0 -53 -69 43 -73 -65 1 -23 25 56 -53 22 31 0 63 -82 83 -77 -25 52 61 65 -52 -29 -31 -138
7327a38J81j08J16j6j45K49j10p3R5O1j4Oj04j2P1j1r4j11J33Jr8M1N2n4J39k0
$$ -138 43 -65 51 35 -110 139 29 -44 51 112 98 104 0 -12 59 48 -46 -157 -24 -23 -121 -80 -28 -82 57 37
7353C7Nm4l2O5J31j27N0Km3L3q8Q1j01l8J11k5P4j50P1j2n6N8q7J35o9RM2j30
$$ 37 42 -2 -34 31 162 35 85 87 44 77 -11 70 -31 -69 42 17 91 -59 12 0 -56 2 -85 50 -19 -10 32 -98
7381i8J68j35J45j2j76kP6J66j86k3J77p7j23L9N7J49k03Q6p8J28j14J5L8LP2
$$ -98 70 -65 80 68 -108 -110 -34 132 -54 -77 100 23 -100 -61 -4 145 -58 28 -50 78 -36 -21 17 20 92
7406I2j85J28q6j6J76j71L0m1J03O3j38p4K52n7pq4J16o2o7k7M3K6Q2n8N2r3k7
$$ 92 -93 35 -51 -67 109 -62 -32 -73 30 93 -45 -119 133 76 69 -15 101 39 -28 -55 -12 14 96 38 90 -3 -30
7433c0O1l6O6j34Jj9M5l9R1N2j75J71j5p6Q7K0j31J9P9l8K9j09P9P5p1l6j20J6
$$ -30 31 -5 61 -73 -72 -91 -46 -85 6 58 -117 54 39 -37 50 70 -61 -42 37 -1 28 -81 -2 73 2 -34 -154 -138
7461a38J65j12K7m0J18j17J03o9J82k2j26QKNk9J59j37J55j36m8M3J07r2K0p8
$$ -138 27 -85 -58 -98 20 -97 6 -63 119 97 -29 -21 -19 -14 -43 116 -21 134 -2 -50 -7 100 8 28 -50
7486e0k9R0M2j59K19j17R3n2Q9j28J21j37r9K4M4R7n0mR5K6o0j12j2L7n4R3M5
$$ -50 -79 11 53 -106 113 -4 89 37 126 -2 119 -18 -117 -93 -49 48 -2 -6 89 115 55 -57 -69 -32 -86 7 52
7513E2J2Ml3R1j82P5J5m9o0l2J86q2r4J08poo1k0O0N8R1k2n5J5j45j1J51o3l5
$$ 52 64 68 35 126 -56 19 34 -15 -75 -107 79 -3 -97 11 4 -2 -63 -83 -23 35 126 104 49 64 -81 -92 59 -4 -39
7542c9M3n1M4n5J4J05j41k5Q3J61j36lj10M8J03o9qJ0L9pN4o3P2p3j7j3K0j12
$$ -39 4 -47 -3 -58 -44 61 -80 -105 -22 139 3 0 -110 -62 41 -28 -36 -26 13 6 60 -3 69 -4 -21 -34 -14 -126
7570a26O9P1l7RR9J8j01N5rj12J10q7R2J7J3k2N3q0o7N3L9J9j29N9k9O0pl3lM0
$$ -126 -57 14 -23 -14 85 103 2 57 48 -64 46 -41 51 68 81 59 112 32 -35 18 57 76 -53 6 -23 37 30 -3 -6 34
7600C4j8Nk7M8n7N8qL4n9o6J21o8l9N1O9n1p6J8l0mk5K25m7r1P5k3l6j7J24j17
$$ 34 16 21 -6 42 -15 43 35 69 10 -56 65 -3 -42 9 78 27 -49 -31 -61 -65 -90 135 88 -3 72 49 13 -4 120 3
7630CP0j01J02j38k3M9j7r7J41j0jQ4n8O9j94J13M4J2j7P1o8Nj5N7j12Jm4j8R9
$$ 3 73 -28 74 -64 -87 -38 -55 -152 -11 -21 -22 62 4 73 -121 -8 36 48 31 102 34 39 24 81 -31 -30 -74 -92 7
7659Gl7J01K0p1j9k9K0J23n1r3j19K77j71l5P0rLNJ5j7O2r1m5O6Nn3J9Q7o9K7
$$ 7 -30 71 91 20 1 -28 -8 115 64 -29 -148 129 -42 -77 -7 -16 -13 -8 7 -10 52 -39 -84 -18 -13 -66 -47 40 -29 -2
7689bjp6J47m4J8q7L8M2N6n6l9Mm5k8o1J98j06L6r9J30k08J90P7m7M0l1km5P1
$$ -2 -3 -79 68 24 42 -45 -7 35 91 35 -4 0 -45 -73 -134 64 -42 -6 -105 25 -183 7 84 37 77 46 44 -1 70
7718G0o7j53J87m6m2P1j08J46j17M0J35j95J09O1j20M9k4o5O2N7K5l4O8r6kq2
$$ 70 3 -150 37 -9 -51 20 -88 58 -59 -19 116 -79 30 91 -29 20 -4 -69 -7 50 75 41 109 13 11 -71
7744g1O1J04Rj53LL5Q6m0n6J6q1J06m7J45l8m8l1kL3J1Moj39N9K8L5M7j20p0J55
$$ -71 -10 94 103 -50 -47 -12 74 34 -22 -6 -87 19 -28 117 79 31 0 -2 31 42 46 40 -99 -40 -12 23 70 -50 -120 35
7774C5M9j49k9J54J4l9l6R0j4k6M6p1p4J26j09J0j8K4k7l8L9n7J4J31j1j63J27
$$ 35 84 -65 -94 60 74 35 -1 89 75 49 95 24 -50 76 -33 -23 -41 -17 -44 -82 -43 -100 -86 45 34 -129 -2
7801bk6P1n1J5R1m3m3L6k1r1m1LJ18p3P9m5j2n7P7Q1p1M6rj14J86j19M6p7N6K3
$$ -2 -28 43 -8 7 98 55 12 48 27 -64 -105 -102 16 -57 22 -23 -35 -92 -15 66 -5 41 32 -82 104 -15 31 -46 10 33
7831C3p5J01l4p2P5l8J9Oo0j41J16L7j08J61K1L4K2j42Q6mq0Q3K0k64J23J07p8
$$ 33 -42 59 25 -47 28 -10 9 15 -45 -186 -70 -33 -141 20 41 75 97 -45 41 37 -43 40 60 -204 -81 26 -52
7858e2J22No8o3L1N4n8PJ41Lo7m2K4j3J3N1j16J18j22K3q0J21M7n4O3o3r5m6J30
$$ -52 70 75 7 -56 -25 29 -29 -22 119 122 55 13 37 24 37 88 -28 90 -32 -9 -89 32 79 25 88 25 -70 -116 14
7887A4q3mM8k6N0k8O6qr1J58j23J11k2r7j10J85m9l3j3Q7%NJ8k2O8o6P1j23j10
$$ 14 -69 -73 -25 -51 -1 -29 37 29 -62 96 -27 84 62 -35 -145 40 -9 -42 -55 32 32 37 55 33 101 35 106 -17 -127
7916a27K01j62O5O6k7l7p6J07l4J17m1j19J54j43J7j8P1o9n0R7R6j09N6r7N8o0
$$ -127 74 -88 -23 43 16 -21 -97 10 -24 93 52 -67 87 -56 -39 -57 14 -55 -105 -8 88 -21 35 -62 -4 -64
7942f4M3l8M5p1M7J79k03P5K7k4q4Q5m8q2J33l9jQ5r4mo2J13J44j74O9K4j98J00
$$ -64 -21 -59 -14 -85 -38 141 -62 13 40 16 -68 17 -31 -113 20 -19 -20 65 -29 -33 -95 18 162 -12 57 81 -117 -17
7970a7K5pl9pk5J1l2M9J01p2l4Q9o5m5RJ81j73Q8L1j59J22k8M9j4L0q5K7p6P7
$$ -17 8 1 -38 -45 -70 -59 -91 -42 59 -13 -47 42 -23 -68 -59 122 -51 37 68 -91 31 3 52 38 68 -17 10 -66 11
7999A1Q6qj92K25m7J7K0j31P3l6m3k0M5N5j27JJ00m5L3o0L7J8o8K5l6n0J57j00
$$ 11 97 89 -103 122 75 92 112 -19 54 18 -25 -45 0 55 -72 -71 29 -16 17 -43 -6 12 -56 -31 -67 -117 40 -60
8027f0J93p5o6RN2Qp1L5N6j71P3J2o0J09o5K5P1p0k5J4p5J50n7k1Pk1J04j90P2
$$ -60 133 58 -8 1 53 61 -10 25 81 -90 -17 -5 -65 44 -21 4 75 5 -20 -6 -81 69 12 -9 -2 -23 81 -109 -37
8056c7K0J26j54J51j36L9l2Q7j41J86j99J06m3p1J52j31P6K3n1m8J09K3n1K5o5
$$ -37 -17 109 -45 106 -30 9 -23 64 -77 109 -90 16 -27 -98 54 -77 -1 22 -29 -77 32 55 4 29 -36
8081c6n5J95p5Mk0k6M2K7q7L3LN6q9P7J7o2j05M0M9j8J22j7j23l5L0O7Q6j16p7
$$ -36 -91 104 29 33 13 -13 29 56 -31 2 5 61 -28 49 66 4 -101 -61 -12 -30 92 75 -48 -83 -53 14 100 -16 -93
8110i3K01j32k6J06j78J92p1p4M8P8q0M5jL0p2j49K68j33J09m3J4m6LJ08m0j69
$$ -93 108 -24 -50 56 -122 70 -1 -75 -27 51 -29 16 15 45 -27 -176 92 -41 68 25 39 -7 -4 104 64 -105
8136a05J57q9N6L3kn4p9P6M3r3N4%j01J20mRr1O9k9Q4k3r3P5L5kj08N1P2q8K9
$$ -105 52 -37 19 52 50 -4 -83 -7 36 -57 -3 -3 -104 16 12 21 -70 -1 -30 54 31 -62 13 48 46 -62 -11 61 -27 2
8166Bp8J39Rj8m9RJ33p1k45J57k0Q4N2l1j9k38J73p0P7O2j87K19p5J4l6
$$ 2 -76 63 72 54 5 14 147 76 -169 -12 -32 52 104 73 54 -184 -11 -81 -4 58 -129 90 15 29 -7
8191g
$$ Imaginary data points
##PAGE= N=2
##DATA TABLE= (X++(I..I)), XYDATA
0@%%%%%%%%%%%%%%%%%%%%%%%Oj4J6j6J6j6J6j7K5l2L2l3M1m8N0n8O5p2Q0q8R7
$$ 0 0 0 0 0 0 0 0 0 0 0 0 0 0 0 0 0 0 0 0 0 0 0 0 6 -8 8 -8 8 -8 8 -9 16 -16 16 -17 24 -24 26 -32 33 -39 41 -47 50
44E0j07J20j32J45j60J76j94K14k36K60k85L16l52L92m38M91n55O34p32Q58j029
$$ 50 -57 63 -69 76 -84 92 -102 112 -124 136 -149 167 -185 207 -231 260 -295 339 -393 465 -564
65e64J271j645K310l844J4807l32k5352J1095J0114q528l097O339p750n66R449
$$ -564 707 -938 1372 -2472 12335 12003 -13349 -2254 7860 -668 -3765 2574 -5176 -5742 3707
80C707l817q563J0910M314j1163J48R414k704j129L512p388l267J4401Q96j6319
$$ 3707 -110 -8673 2237 6551 -4612 -4464 4950 2246 1117 4629 -2759 -6026 8375 9271 -7048
95g048Q97J1988m533n389N290k283m775P312R95r046M690R164q287n941R290L320
$$ -7048 -6151 5837 1304 -4085 1205 -1078 -5853 1459 2454 -6592 -1902 7262 -1025 -6966 2324 5644
111E644m573J052k439m118Q594N297j2497m883J0759O04p518K794J867m959L538
$$ 5644 1071 2123 -316 -4434 4160 9457 -3040 -7923 2836 3440 -4078 -1284 583 -4376 -838
126h38L470p074J628J0013n557r619Q360P417o027k205J145l771M311P485r026
$$ -838 2632 -4442 -2814 7199 1642 -7977 383 7800 1773 -432 713 -3058 1253 8738 -288
141b88q873J0020M782r680O9O449m550j883N792k760k851Q495k88j1305M422J1405
$$ -288 -9161 859 5641 -4039 -3970 2479 -2071 -3954 1838 -922 -3773 4722 4434 -6871 -2449 8956
157H956n028p036L764j93j554O309k339j0588M466R222p304n244P979K18o066
$$ 8956 3928 -3108 656 463 -1091 5218 2879 -7709 -3243 5979 -1325 -6569 1410 1628 -4438
172d438L741K579m331L991M351r103k091J2093L54j0360R67M103k205K308J363
$$ -4438 -697 1882 -2449 1542 5893 -3210 -5301 6792 7146 -3214 -2247 1856 -349 1959 3322
187C322q160o40R481k519q195N525N150o325j160M900j117M15M121n761m658R752
$$ 3322 -4838 -5478 4003 1484 -6711 -1186 3964 -2361 -3521 1379 262 677 4798 -963 -5621 4131
203D131M222r902k707O030p24j289K313m165l256O964Q73q028L038P196n293m505
$$ 4131 8353 -1549 -4256 1774 1050 -239 2074 -2091 -5347 1617 2490 -5538 -2500 4696 -597 -5102
219e102O078J566k406K836k126n772O380P373q492o155O872J528m181K408n45
$$ -5102 976 2542 136 2972 846 -4926 1454 8827 335 -5820 1052 2580 -1601 807 262
234B62n449L903M807o773j567Q791j721p876M704N544l604j16J388n231J670R093
$$ 262 -5187 -1284 3523 -3250 -4817 3974 2253 -5623 -919 4625 1021 905 2293 -2938 -1268 7825
250G825m555j0054N078O145n307j495L142l411m14N409k996m563P333K718q929
$$ 7825 3270 -6784 -1706 4439 -868 -2363 779 -2632 -3046 2363 -633 -5196 2137 4855 -4074
265d074K30Q676j136m243J625j636j168O681l78r598J201P868l332m799L938K98
$$ -4074 -3844 4832 3696 -547 1078 -558 -1726 4955 4577 -5021 -3820 4048 716 -4083 -145 153
281A53l424L131Q26m267M056M816p261l195Q823J932o252K40J098k443M169K825
$$ 153 -3271 -140 686 -3581 475 5291 -1970 -5165 3658 5590 -662 -422 676 -1767 2402 5227
297E227q232k515Q241l94o594K916L097m478Q85L437l517P11O273m476o507P612
$$ 5227 -3005 -5520 2721 2327 -4267 -1351 1746 -2732 -1847 1590 -1927 -1216 5057 581 -5926 1686
313A686N683o997k706L464j493O69M299n484n762P392L493q098l0O615l061l639
$$ 1686 7369 372 -2334 1130 -363 306 4605 -879 -6641 751 4244 -3854 -3884 2731 -330 -3969
329c969M692p8k148M811n76p713M079Q904n589o816M575K163l238K716n62o458
$$ -3969 723 645 -1503 3308 2732 -4981 -902 8002 2413 -4403 172 2335 -903 1813 1251 -5207
345e207L006O463n995l858P422O67o706K719M175k894J171K514n828o99R169j209
$$ -5207 -2201 4262 -1733 -5591 1831 2498 -4208 -1489 2686 -208 963 3477 -2351 -3050 6119 4910
361D910q994J933N234l244n65K372m510r36O351j940n963N155M342o491j170N930
$$ 4910 -4084 -2151 3083 -161 -726 1646 -2864 -3800 2551 611 -5352 -197 4145 -2346 -3516 2414
377B414l63j918K385l064k902P165K636r099j599P054j139l553K552j206l228
$$ 2414 2051 133 2518 -546 -3448 3717 6353 -2746 -4345 2709 1570 -1983 569 -637 -3865
392c865M468J252o230K471O745n246m910O846K789m376P09N85l912M091N123p345
$$ -3865 603 1855 -4375 -1904 4841 -405 -5315 1531 4320 -56 653 1238 -2674 1417 6540 -805
408h05m981P369J865o351J459K634m008P56M278m148j573P079j351p357M523O403
$$ -805 -5786 1583 3448 -2903 -1444 1190 -2818 -2062 2216 -1932 -3505 3574 2223 -5134 -611 5792
424E792m615k468K982k085l17N700l041p702M521N668n788k435M911j491k770
$$ 5792 1177 -1291 1691 -394 -711 4989 1948 -5754 -1233 4435 -1353 -3788 1123 -368 -3138
439c138L775l73l348M720K343p239K19Q194j153o173K024J343j904L236L72o984
$$ -3138 637 264 -3084 1636 3979 -3260 -3041 5153 4000 -2173 -149 1194 -710 2526 2898 -4086
455d086O38P104l113n350M563K167m589J086K830k509J560L585n220k715P997
$$ -4086 -3448 3656 543 -4807 -244 1923 -2666 -1580 1250 -1259 301 3886 -1334 -4049 3948
470C948J645p399j60L929j832K82K256m691k196O357j65o334K761M332m383j501
$$ 3948 5593 -1806 -1966 1963 131 413 2669 -2022 -4218 2139 1974 -4360 -1599 2733 -1650 -3151
486c151M498p24j444L511j842m611N301M776o509l205M929m6k404K377j649m241
$$ -3151 1347 623 -821 2690 848 -3763 1538 6314 -195 -3400 1529 1483 -921 1456 -193 -4434
502d434M366L060o123n89O516j964m837L841K710k835J566P47m708K264O638m355
$$ -4434 -68 2992 -3131 -3720 2796 832 -4005 -164 2546 -289 1277 2024 -2684 -420 6218 1863
518A863o424M512L358m163p0J759l489O73M222l446l050N957J116o279J480N430
$$ 1863 -4561 -49 3309 -854 -924 835 -2654 -1981 2241 -1205 -4255 1702 2818 -3461 -1981 3449
534C449j993j888K041k258o17N481j045o885J816N070l155k444K889j321j999
$$ 3449 1456 -432 1609 -649 -1266 4215 3170 -3715 -1899 3171 16 -2428 461 -860 -2859
549b859L579l97l725L531L096n184j134N998k3l311J167k00j912L876J442o507
$$ -2859 720 323 -3402 129 3225 -1959 -3093 2905 2882 -429 738 538 -1374 2502 3944 -2563
565b563q57N882r81m351K259J070k999J936J697l690J557M524l752l805N794K755
$$ -2563 -3420 2462 1481 -2870 -611 459 -2540 -604 1093 -2597 -1040 3484 -268 -4073 1721 4476
581D476m770o17K130j785J373K982m771l332N696J305n731P34L815k685j390L289
$$ 4476 -294 -911 1219 -566 807 3789 -982 -4314 1382 2687 -3044 -2310 1505 -1180 -2570 719
597G19j199j112M092r20n198L716N152m293l242L524j90j463K628j369m626L008
$$ 719 -480 -1592 2500 1580 -3618 98 5250 957 -2285 1239 1049 -414 2214 845 -3781 -773
613g73L559m534j850M778p46l379K593J481k395K505J175m708N12O453j837n345
$$ -773 2786 -1748 -3598 1180 434 -2945 -352 1129 -1266 1239 2414 -2294 -1782 4671 2834 -2511
629b511K097K540j951Q87O85m909J600M620l041l728M614J273m143l81L625p50
$$ -2511 -414 2126 175 1062 1747 -3162 -1562 3058 17 -3711 903 2176 -1967 -2348 1277 527
645E27l31K316l499j013N360L92o089L97M074j290j536J890k203j737M009k03
$$ 527 196 2512 -987 -2000 3360 3752 -2337 -1940 2134 844 -692 1198 -1005 -2742 1267 1064
661A064m984K967L908m719j023M393L29k822J712n2k679M160K461n773k084N341
$$ 1064 -3920 -953 2955 -1764 -2787 1606 1935 -887 825 773 -1906 2254 4715 -1058 -3142 2199
677B199O8m625K201Q59l363J965K852m320L64N140l169l734M063L318m010M07
$$ 2199 2267 -2358 -157 702 -2661 -696 2156 -2164 -1800 3340 171 -3563 500 3818 -192 215
693B15J644k932J075M386l436m694M384K525m462q20L227k656o5K567j962k173
$$ 215 1859 -1073 2 4388 952 -3742 642 3167 -1295 -2115 1112 -1544 -1609 958 -1004 -3177
709c177M426R47n392J678N341k052l232K676q45q98L627j088n474J850M952m033
$$ -3177 1249 2196 -3196 -1518 3823 1771 -1461 1215 370 -528 3099 2011 -3463 -1613 3339 -694
725f94k690L812o67k097K090J076k826K328K417m537o77N832n59m481J679J645
$$ -694 -3384 428 -239 -2336 -246 830 -1996 332 2749 -1788 -2465 3367 2808 -1673 6 1651
741A651k140J740J118m627k85M820j496m260K980J969l705P08K771k259NL572
$$ 1651 -489 1251 2369 -2258 -2543 2277 781 -3479 -499 1470 -2235 -1527 1244 -1015 -1010 2562
757B562k632k924N099K263n351o06L574j376q45K302k662k858M386J201n342R02
$$ 2562 -70 -2994 2105 4368 -983 -1589 1985 609 -236 2066 -596 -3454 932 2133 -3209 -2307
773b307M426k553k442L518L15j965K405R2l732K526M452m207l501M063J163l123
$$ -2307 2119 -434 -2876 642 957 -1008 1397 1489 -2243 283 4735 528 -2973 1090 2253 -870
789h70J140L61l194J636K948l656j598M673l45m178K422K880k163j63J787k459
$$ -870 270 631 -2563 -927 2021 -1635 -3233 1440 1095 -3083 -661 2219 56 -107 1680 -779
805g79RM465j623m952K528K970l019o73J991k230o76L235j340l090L376J788m083
$$ -779 -770 3695 2072 -2880 -352 2618 -401 -1074 917 -1313 -1989 1246 -94 -3184 192 1980 -2103
822b103J74M072r00j861J776q81j422L565N29n056L41M360j906k733K187k41j899
$$ -2103 -1929 2143 1243 -618 1158 277 -1145 2420 2949 -2107 -1766 2594 688 -2045 142 -99 -1998
839a998K196M07l105J664L362l441j894M451J061l474Q33J172j846J690K017m047
$$ -1998 198 605 -2500 -836 2526 -915 -2809 1642 2703 -771 62 1234 -612 1078 3095 -952
855i52j707M428p4m123J501J926k610K14K183j856n98L566j345l502L420L239
$$ -952 -2659 1769 1695 -2428 -927 999 -1611 -1397 786 -1070 -1668 1898 553 -2949 471 3710
871C710l656j229K691j045n93K434j827l329K993J953l756n95L101j229j787K349
$$ 3710 54 -1175 1516 471 -122 2312 485 -2844 149 2102 -1654 -2249 852 -377 -2164 185
887A85k0j635K283Q28l558J194M252k017l207K202R53j620J206q9l300J456L102
$$ 185 165 -1470 813 1641 -1917 -723 3529 1512 -1695 507 1460 -160 1046 957 -2343 -887 2215
904B215k895k310L396M99k984J135J869j453M79J741k722l55M289n88m040J369
$$ 2215 -680 -2990 406 905 -2079 -944 925 -528 -49 1692 -1030 -1385 2904 2316 -1724 -355
920c55K406j955k29J420k544n97L330j220l198K473K095l331j53L089q76j077
$$ -355 2051 96 -133 1287 -1257 -1854 1476 256 -2942 -469 1626 -1705 -1858 1231 355 -722
936g22K158j132j879L374J489m324m62L478j148j804J628p76k037K292R11l342
$$ -722 1436 304 -1575 1799 3288 -1036 -1498 1980 832 -972 656 -120 -2157 135 1046 -2296
952b296P34L315k074k192L108J021k198J075O54k216J580K868l283k416L401Q20
$$ -2296 -1562 1753 -321 -2513 595 1616 -582 493 1147 -1069 511 3379 96 -2320 1081 1901
968A901l146N84J205k013N36J938k322q23L484n08l200J995K825k251q00J809
$$ 1901 -1245 -661 544 -1469 -933 1005 -1317 -2140 1344 836 -2364 -369 2456 205 -595 1214
984A214j134k49K640j438l500K448K375l151r27K469j320j138K119n82j919K487
$$ 1214 80 -169 2471 1033 -2467 -19 2356 -795 -1722 747 -573 -1711 408 -174 -2093 394
1000C94J274l475M76L794j209k390J865K31j465J871M66l632N65L353j930k556
$$ 394 1668 -1807 -1331 2463 1254 -1136 729 960 -505 1366 1832 -1800 -1235 2118 188 -2368
1016b368K431L41k332J406J298k406J113K570k617j561M117O55l660Q25J884j714
$$ -2368 63 404 -1928 -522 776 -1630 -517 2053 -564 -2125 1992 2647 -1013 -188 1696 -18
1032a8L18J636k744j263L482j58l841J493K459k622n09K577r43j075K577p20k659
$$ -18 300 1936 -808 -2071 1411 1253 -2588 -1095 1364 -1258 -1767 810 -133 -1208 1369 649 -2010
1049b010K858K512l638j316L241n85j799J650m31k609K126J684l383l97L339j216
$$ -2010 848 3360 -278 -1594 1647 1062 -737 913 482 -2127 -1 1683 -1700 -2097 1242 26
1065B6k324K360R83j994J253J183k558O81L360k062k753K535J065k293M75R57
$$ 26 -2298 62 1045 -949 304 1487 -1071 -390 2970 908 -1845 690 1755 -538 -63 894
1081H94k333K64K656k136j907L063N36l012J077K369j689j83J716j448p42L191
$$ 894 -1439 -1175 1481 -655 -2562 501 1037 -1975 -898 1471 -218 -401 1315 -133 -875 2316
1097B316n04l699J529K560k190j193J930j162j244K188k41k794K033K221l072
$$ 2316 1812 -1887 -358 2202 12 -1181 749 -413 -1657 531 290 -2504 -471 1750 -1322
1112a322m99L389m50k080J738J37j720J914J194l426l36L319r31k772J812O12
$$ -1322 -1821 1568 1118 -962 776 913 -807 1107 2301 -1125 -1461 1858 927 -1845 -33 579
1128E79k208R72J397k277J90K934j664k260L062J476k880L22J728j480O0K283
$$ 579 -1629 -657 740 -1537 -1347 1587 -77 -2337 725 2201 -679 -357 1371 -109 -49 2234
1144B234k068k286K851Q77l040K32K145j753o33K092r65j283K532N3k838J500
$$ 2234 166 -2120 731 1608 -1432 -1200 945 -808 -1441 651 -314 -1597 935 988 -1850 -350
1160c50K948k274j494K265k54j182J567m17k525J558J964k632j216K710m87j924
$$ -350 2598 324 -1170 1095 841 -341 1226 809 -1716 -158 1806 -826 -2042 668 181 -1743
1176a743J477P17j642J214J153k174Q6L201r65k648J662J221j767M00R01k051
$$ -1743 -266 451 -1191 23 1176 -998 -912 2289 1324 -1324 338 1559 -208 192 1093 -958
1192i58k48K532j240k300K255O98k324M93J979j370l41K124j190j414K787O80
$$ -958 -1206 1326 86 -2214 41 739 -1585 -1092 887 -483 -824 1300 110 -1304 1483 2163
1208B163l076M16K224j472p37J453j204j322K170J30k810R73K324k059j049K479
$$ 2163 -913 -497 1727 255 -482 971 -233 -1555 615 745 -2065 -1092 1232 -827 -1876 603
1224F03K1j419J443J29j681J441J914k631j303K823j00k124R80M34j782R19J168
$$ 603 624 -795 648 777 -904 537 2451 -180 -1483 1340 1240 -884 96 530 -1252 -333 835
1241H35k155l96K717p52k156J910J341j693K13J238j318J12K128j312k116J909
$$ 835 -1320 -1716 1001 249 -1907 3 1344 -349 -136 1102 -216 -104 2024 712 -1404 505
1257E05J084k360J05J326j282o01J852r50j414K079N19k331O55K384j352q79J612
$$ 505 1589 -771 -666 660 -622 -1223 629 -321 -1735 344 863 -1468 -813 1571 219 -660 952
1274I52m51j097J944m8k590Q33K166j888j208J797l59j472J558P1j727J104J675
$$ 952 501 -596 1348 1300 -1290 -457 1709 -179 -1387 410 51 -1421 137 208 -1519 -415 1260
1291A260j995o00K587j8k055J155Q28j420O61J068k056n26K407q08k278J431J066
$$ 1260 -735 -1335 1252 1234 -821 334 1162 -258 403 1471 -585 -1111 1296 488 -1790 -359 707
1308G07k025L96J376j198l37K189j021j568K185J155k409J33J941j142o06J381
$$ 707 -1318 -922 454 -744 -1081 1108 87 -1481 704 1859 -550 -417 1524 382 -224 1157
1324A157j012j581J845O74k599M98J826j211j054J842k55j237J704K81j994J050
$$ 1157 145 -1436 409 1083 -1516 -1018 808 -403 -1457 385 130 -1107 597 878 -1116 -66
1340f6K132j788j276K072P9j721J052K45j774P82J541k117q45K275j86k015J409
$$ -66 2066 278 -998 1074 1153 -568 484 729 -1045 -263 1278 -839 -1684 591 405 -1610 -201
1357b01R54j416M55J387j564l05K495p33k317J694J144j962K8J225j345o14J905
$$ -201 753 -663 -208 1179 -385 -690 1805 1072 -1245 449 1593 -369 -341 884 -461 -1075 830
1374H30q88j839J916Q88k237L89J847q06r03J741m61j302J732Q18k584L37K085
$$ 830 -58 -1897 19 907 -1330 -941 906 100 -803 938 477 -825 907 1725 -859 -522 1563
1391A563j297j452J714m07j458J219O20j963N99K054j602j065K200J26j524R69
$$ 1563 266 -1186 528 121 -1337 -118 502 -1461 -862 1192 -410 -1475 725 851 -673 296
1407B96R50j703O64J519j776j045K170j07k200R14J036j641J26J369j384n20K056
$$ 296 1246 -457 207 1726 -50 -1095 1075 968 -1232 -318 718 -923 -797 572 -812 -1332 724
1424G24k73j969J577J400j713j00J648r30p43J586o13j744J483J108k403j90J971
$$ 724 451 -1518 59 1459 -254 -354 1294 364 -379 1207 594 -1150 333 1441 -962 -1152 819
1441H19j111r61J442p9j474J466Q13j911M30K060j164j080J706Q1j536J125M87
$$ 819 -292 -1253 189 110 -1364 102 915 -996 -566 1494 330 -750 956 1037 -499 626 1113
1458A113j890K10J897j477j501J991J00j758Q63J105j477K21J758j220r28K062
$$ 1113 -777 -567 1330 -147 -1648 343 443 -1315 -452 653 -824 -603 1155 -65 -993 1069
1474A069K62j984O88J439j613j15J203j139q67J729j05k199J093J241j523l51
$$ 1069 1331 -653 35 1474 -139 -254 949 -190 -1057 672 567 -1632 -539 702 -821 -1172
1490a172J722n44q80J362K3j396J344J139j949k82J946q56j268J407j75j455R63
$$ -1172 550 6 -874 488 511 -885 459 1598 -351 -633 1313 457 -811 596 421 -1034 -71
1507g1P90j758pJ800q36j280J578M11j453R47Q50j236k3J769j217j116J552L02
$$ -71 719 -1039 -1046 754 -82 -1362 216 627 -826 121 971 -265 -288 1481 264 -852 700 1002
1525A002j735M97R38j491J12J263r44j197J862J88j802R07J368j126k59J345p33
$$ 1002 -733 -236 702 -789 -677 586 -358 -1555 307 495 -1307 -400 968 -158 -417 928 195
1542A95o40J661k65j724Q41J184j578n25J417o29j014J443k88j447J170J002j557
$$ 195 -445 1216 951 -773 68 1252 -326 -851 566 -63 -1077 366 78 -1369 -199 803 -754
1559g54k19J806l78j195J231K78j196P70Q49j553j14J568q73j354J264K80j412
$$ -754 -973 833 455 -740 491 769 -427 343 1192 -361 -475 1093 220 -1134 130 410 -1002
1576a002O58P22j230k2J513o18j048J649K97j347N73R38j163j69J329r87j002
$$ -1002 -344 378 -852 -874 639 21 -1027 622 919 -428 145 1083 -80 -249 1080 93 -909
1593i09J460J44j778O28J002j184l84J397n95p93J471J41j428R15J230j335l68
$$ -909 551 695 -1083 -455 547 -637 -1021 376 -219 -1012 459 600 -828 87 1317 -18 -386
1610c86J366m97j056J113k3j412Q74Q36j482l20J466n47q88R94J19q83O61R62
$$ -386 980 483 -573 540 517 -895 -21 815 -667 -987 479 -68 -956 38 157 -726 -65 897
1628H97j356J8J648p74j275J434L98j425M57Q49j343k30J456r42r59J302K35j442
$$ 897 -459 -441 1207 433 -842 592 990 -435 22 871 -472 -702 754 -188 -1147 155 390 -1052
1646a052N64J136r88j47J223n19r07J501J95j524N48J159j370k46J077o15j020
$$ -1052 -488 648 -340 -487 736 217 -690 811 1006 -518 30 1189 -181 -427 650 35 -985
1663i85J163J43j542O92J175j241m64J664l81q42J115K31j212O67J125j360n32
$$ -985 178 321 -1221 -529 646 -595 -1059 605 224 -618 497 728 -484 183 1308 -52 -584
1680e84J647p18j136R62J87j158M98Q61j407o1J528o62j004J256M64j095L66R32
$$ -584 1063 345 -791 171 358 -800 -302 559 -848 -909 619 -43 -1047 209 673 -422 -56 876
1698H76r13k12J295o63j024J211K50j546K46J107j203l51J320o40q58J206M04
$$ 876 -37 -249 1046 383 -641 570 820 -726 -480 627 -576 -927 393 -247 -1105 101 505
1715E05j236N95J039r37k72J193m02j000J186K52j493N11J031j343m95J276m13
$$ 505 -731 -136 903 -34 -306 887 485 -515 671 923 -570 -59 972 -371 -866 410 -3
1732cr79Q61M95j298O02J107j180m59J674l04j102J112M23j308L51Q34r26m44
$$ -3 -982 -121 374 -924 -322 785 -395 -854 820 516 -586 526 949 -359 -8 826 -100 -544
1750e44J276o12j195J122L58j124J3J091p59l16J362m12q92J033O18j408K79J229
$$ -544 732 120 -1075 47 405 -719 -706 385 -374 -690 672 260 -632 401 1019 -389 -110 1119
1768A119j013n10J059l22j164R16L30j225J47J234r77n52J377l80p46R53N78j334
$$ 1119 106 -404 655 333 -831 85 415 -810 -663 571 -406 -958 419 39 -707 246 824 -510
1786e10L44J175r55m89J293k02j164P08L96j219K31J005j086n50J465l44r53P15
$$ -510 -166 1009 54 -435 858 656 -508 200 596 -623 -392 613 -473 -1023 442 98 -855 -140
1804a40O33j062L64J058q43m31J269k66j148Q48O78j357Q8Q22p43m96J041l27
$$ -140 493 -569 -205 853 10 -421 848 582 -566 282 960 -397 -309 513 -230 -726 315 -12
1822a2r51R51M06j131K77J150p44n40J257k1j063Q62M60j212J03J055r04o39R99
$$ -12 -963 -12 394 -737 -460 690 -54 -594 663 642 -421 441 901 -311 -208 847 -57 -696 303
1841C03j01j077P99M17j033K61R78p37n40J243m7r11O52O68j076J37R38p10o55
$$ 303 202 -875 -76 341 -692 -431 547 -190 -730 513 466 -445 207 875 -201 -64 874 164 -491
1860d91J084j51j089N83M59r26o5Q79o40m48J103p6q76O72P69q93j1R17m35p94
$$ -491 593 442 -647 -64 395 -531 -596 283 -357 -805 298 222 -654 18 787 -106 -117 800 365 -429
1880d29R78p8r37O25L72j069j5J043o99n42Q78n9p54P60M07r00J51R73n53n87
$$ -429 549 471 -466 159 531 -538 -553 490 -209 -751 127 68 -686 74 481 -419 -268 705 152 -435
1900d35J010K4q57N44M33r66j25Q45o02n99R86j86q84N54N45q25K15R69n86m21
$$ -435 575 599 -258 286 719 -247 -372 473 -129 -728 258 72 -812 -258 287 -538 -323 646 60 -361
1920c61R94N0q56L46N13p37k49R49o81l68O94j1j020M89O68q96m1Q87l44n16R04
$$ -361 633 683 -173 173 686 -51 -300 649 -32 -400 294 283 -737 -248 420 -476 -517 370 26 -490 414
1941D14q0p25O82N90q62j35Q04m93o56O50J30j045M76M96p99L1Q08l64o12Q62
$$ 414 334 -391 291 881 19 -116 688 195 -461 189 319 -726 -250 246 -553 -522 286 -78 -690 172
1961A72J24p29N00N49q35Q4Q94n28n33P57nr78M65M37p44nO58n87m62R31n1p95
$$ 172 296 -433 67 616 -219 -135 759 231 -302 455 450 -528 -63 374 -370 -375 283 -304 -766 165 114 -681
1983f81N38O25o35l2P73l27n61Q49N6j005M82M52p76j38Q20o46l54O35M8q33M48
$$ -681 -143 482 -153 -185 588 261 -300 549 605 -400 82 534 -242 -380 440 -206 -560 75 123 -710 -262
2004b62P03q85N9R27l93n69R34m6q16N36N74q65k00Q47m78p08P92J7q69M36N47
$$ -262 441 -444 -385 542 149 -420 514 468 -348 188 762 -103 -303 544 66 -642 150 167 -702 -266 281
2025B81o44N2O79l69n64R74J73r74N65O08q50j75R08m80n80P00l7q40L04N93p44
$$ 281 -363 -311 368 -1 -565 409 582 -392 173 781 -69 -244 664 184 -396 304 267 -573 -269 324 -420
2046d20j98Q45l48m68Q15K7o92M82N68p13J4P12l18o06O99n3p51L33M37p86j47
$$ -420 -618 227 -121 -589 226 253 -439 43 611 -102 -88 624 306 -300 399 346 -405 -72 365 -421 -568
2067e68Q88l69p13R17L9o62M48M78n51j47Q99l47o54O84J70p50J78M52o42j52
$$ -568 320 -49 -762 155 194 -468 -20 458 -93 -240 659 312 -342 342 512 -238 -60 392 -250 -402
2087d02O45l44o16P36J77p77L70O19p04n8R12k65n63O93R2p38K70M68n70l76Q66
$$ -402 243 -101 -717 19 196 -581 -211 408 -296 -354 558 293 -270 423 515 -223 47 515 -55 -431 435
2108D35k80p37N48L19q76L14N32l86l60P64k64l86P05K21q65M83N17o43l07O78
$$ 435 155 -582 -34 285 -591 -277 255 -131 -491 273 9 -377 328 549 -316 167 684 41 -266 412
2128D12j72p18N52K02o63J01M76m30k53P96k60n75O41L55o68J30P24n95j96P16
$$ 412 240 -478 74 276 -387 -286 190 -240 -493 303 43 -532 109 464 -204 -74 650 55 -141 575
2148E75k77n63M18K06o50O0O11o76l64Q29j81o47O51L16o26K07O44o00j81P57
$$ 575 298 -265 153 359 -291 -231 380 -296 -660 169 -12 -659 -8 308 -318 -111 533 -67 -248 509
2168E09j78n81O48J06p34L0P20n97l71N21p3o26M94K78n67R8O82m64j76P24k20
$$ 509 331 -250 398 504 -230 -200 520 -77 -448 73 0 -626 -132 146 -421 -323 359 -105 -281 443 223
2189B23m10N00J44o02J08N72o59k52O01n7o75M16K46p92K55P07m86k25N96l1n17
$$ 223 -187 313 457 -145 -37 535 -124 -376 225 168 -507 -91 155 -637 -382 325 -161 -386 210 179 -338
2210c38M20M00n66J08N78n18m87O85m6o39M73Q8n48L7N67n37j61O04l6m28M04
$$ -338 82 482 -84 24 602 84 -403 282 236 -403 70 158 -390 -353 214 -323 -484 120 84 -344 60
2231F0L68m99J03M52l25k28M76n9p07M84K48o21KM61m72j70N71r9m94L74K57l99
$$ 60 428 -71 32 484 159 -69 407 348 -359 125 373 -248 -246 215 -257 -427 144 45 -449 -75 182 -217
2253b17J34M24k56k84O63j89l73J69L62p26P0O32n41l69M64O2m32K98L08n31J38
$$ -217 -83 341 85 -199 464 275 -98 71 433 -293 -223 409 -132 -501 -37 25 -407 -109 199 -332 -194
2274a94M22k14k87P06j01m03L43K19n29q9N04m23k63L97k1o68M72K40n40M2N58
$$ -194 228 14 -273 433 332 -71 272 491 -38 -127 377 -46 -309 88 67 -601 -129 111 -429 -387 171
2295A71l27r0N03R0n15L09L69n23n9N52l36m12M68pn30L10K27o06O5N95m99k60
$$ 171 -156 -246 257 347 -168 141 510 -13 -72 480 144 -268 200 193 -337 -27 200 -406 -341 254 -245 -505
2317e05O12kl66K80M03n13R7N16l61j92K28L09o93J96J17m98J08K97q3m25N47
$$ -505 107 105 -261 19 422 -91 6 522 161 -31 197 506 -187 9 126 -372 -264 33 -50 -475 72
2338G2Jn37M74K54m09j4N12k46j87M80o8n44K95L02n68r5N31l51k77M15K7n39
$$ 72 73 -464 10 264 -145 -159 353 107 -80 400 332 -212 83 385 -183 -278 253 -98 -375 40 67 -472
2360d72L40K80l18J38M53l37k40N45n1m44J99L62m89o1M83m47k63M37j07m15L28
$$ -472 -132 148 -170 -32 421 84 -156 389 338 -106 93 455 -34 -95 388 -59 -322 115 8 -407 -79
2381g9J92m06j03N25k21q3K55K83m93K46L32m88j9L24j73k98L85Rn84L39K40m68
$$ -79 113 -293 -396 129 -92 -175 80 363 -130 116 448 -40 -59 265 92 -206 179 188 -396 -57 183 -285
2403b85k3M03j35l08M29J91o51M22L24m37MN32j61m64M59p1n92J59O23p87Q2M35
$$ -285 -308 95 -40 -348 81 272 -379 43 367 -70 -66 466 305 -159 300 229 -363 -204 419 -368 -286 149
2425A49k97k57L24K38l44K18K93l90j16O16k32m28N66l2m97K21K67m14j40M48
$$ 149 -148 -405 -81 157 -187 31 324 -66 -182 434 202 -226 340 308 -189 32 299 -115 -255 193
2445A93l86k49M50J43m83K26L57m43kM44j68k44M51r4m07L20K42k67k60L94k29
$$ 193 -193 -442 8 151 -332 -106 251 -192 -194 250 82 -162 289 195 -212 108 350 83 -177 217 -12
2466a2m29M31K3n25L33M02l85o4M10o2l36L41J16m17J94L83l75j00L67o8o40L66
$$ -12 -441 -10 13 -512 -179 223 -162 -226 184 122 -214 127 243 -174 20 403 28 -72 295 227 -413 -47
2488d7K51l94M7K08l39o1N82l71k22N42l1l50K21L50m04j36M12j20l52L66jm80
$$ -47 204 -190 -143 65 -274 -335 247 -124 -346 196 165 -185 36 386 -18 -154 258 138 -214 152 151 -329
2510c29J46M12m28j64M51n6m32M47J27n41J93L95j93l11N55q5k11J95J36n24K52
$$ -329 -183 229 -199 -363 88 32 -400 47 174 -367 -174 221 28 -283 272 187 -24 171 307 -217 35
2531C5K85n49o4K99n2k95K04J30j87P0K83k04j65N00P4m83L16K16m68P9K50k84
$$ 35 320 -229 -293 6 -46 -341 -137 -7 -194 -124 159 -45 -210 290 364 -119 197 413 -55 24 274 -10
2553a0k06M11j80l34K23J33l33m8M61l38j44N44j48k20L89N6l27O4L49l49o7L07
$$ -10 -216 195 15 -319 -96 37 -296 -344 117 -221 -365 179 31 -189 200 256 -71 -7 342 -7 -74 233
2575B33j53l39L13Pl14J14K22l54L1K86o6j72K52R8k84J68L59l55j47K13p0j03
$$ 233 80 -259 54 61 -253 -139 83 -271 -240 46 -20 -192 60 158 -126 42 401 46 -101 112 42 -61
2597f1K34%m72M7L25j71j63L79j85l42M15K06m19N4L46j72j30N01k33k15J41J32
$$ -61 173 173 -299 -252 73 -98 -261 118 -67 -409 6 212 -207 -153 193 21 -109 392 159 -56 85 217
2619B17l45l1L53k33k87K84J35m02K10J89l28Q6N01k66k16L81J1l41L03nk26K3
$$ 217 -128 -159 194 -39 -326 -42 93 -309 -99 90 -238 -152 349 83 -133 248 259 -82 221 216 -10 13
2641A3K40k86l52M93p9l19K50J28l99N9M18j79k39M51j33k58L12J80l02m6L61
$$ 13 253 -33 -385 108 29 -290 -40 88 -311 -252 166 -13 -252 199 66 -192 120 300 -2 -48 313
2662C13l02k34M67q9l33R6K66l34J5J31j56j9L14j51j04J02K71l49l2M23k82o4
$$ 313 11 -223 244 155 -178 -82 184 -150 -135 -4 -160 -179 135 -16 -120 -18 253 -96 -128 295 13 -51
2684e1J93J0l43K33N3k93J22L26l51j45L59m8l97L46N3k41J28K73j82k10L53M1
$$ -51 142 152 -191 42 95 -198 -76 250 -101 -246 113 65 -332 14 67 -174 -46 227 45 -165 188 229
2706B29l57K18K27m18J8K08k79j10L14m2k55J18K10k67L4L40j72JK15m4j93J25
$$ 229 -128 90 317 -101 -83 125 -154 -264 50 8 -247 -129 81 -186 -152 188 16 17 232 188 -5 120
2728A20J31k52j09L00j50k93L43ml82J63K05l01J28K69k55o5K76O3l28K68J49
$$ 120 251 -1 -110 190 40 -253 90 86 -296 -133 72 -229 -101 168 -87 -152 124 187 -141 127 276
2749B76j73j17J72n4l08L65j7l45J18J03k76LL49j58j59K49L6k00lL70k59k9M31
$$ 276 103 -14 158 104 -204 161 144 -201 -83 20 -256 -253 96 -62 -221 28 64 -136 -139 231 -28 -57 374
2772C74k18k99J90J42l96J70J43k98Q8O3k4k21L06Pk68K22K19l02J06J52o4j64
$$ 374 156 -143 47 189 -207 -37 106 -192 -104 -41 -65 -286 20 27 -241 -19 200 -102 4 156 92 -72
2794g2K25rl08J75J62l42K1L21k41j57K54Nl39J71K01j06k2L77m01J3L73k28k51
$$ -72 153 144 -164 11 173 -169 -148 173 -68 -225 29 34 -305 -134 67 -39 -61 316 -85 -72 301 73 -178
2817a78K86J01l63N2K60k33k28M20p0k68K6L11k69o3L02q0j23K38J24m10J99J82
$$ -178 108 209 -154 -102 158 -75 -303 117 47 -221 -195 116 -153 -216 86 6 -117 121 245 -165 34 216
2839B16p6k30K21Qm07L38Q5l71O6K09k48m0L12j75q1J45K00k30J01R6j87MK77
$$ 216 140 -90 131 139 -268 70 155 -216 -150 59 -189 -229 83 -92 -173 -28 172 -58 43 139 -48 -44 233
2862B33j26l16K13J16k43O0K35m27lL02j17r1L34p7k40M8K59k14K9L01k23j19
$$ 233 107 -209 4 120 -123 -63 172 -255 -258 44 -73 -164 170 93 -147 -99 160 -54 -25 276 53 -66
2884f6K07P5k69j1K31k12n7J79j15k49L01O2k85O9J66k6j28L24p6j90J44J75l88
$$ -66 141 216 -53 -64 167 -45 -102 77 -38 -287 14 76 -209 -140 26 0 -128 196 120 -70 74 249 -139
2907a39J00K18l15m3L54k13k13K01J9j18R5J20k27o3K56n7k1K05P0k13J29Q7j82
$$ -139 -39 179 -136 -179 175 -38 -251 -50 -31 -149 -54 66 -161 -224 32 -25 -46 159 229 16 145 232 50
2930E0j83K48m0k08J85Nk01N3J25j50O2R3p2j33J37J78k18J35J00p7j15K13j31
$$ 50 -133 115 75 -133 52 57 -144 -91 34 -116 -54 39 -33 -166 -29 149 -69 66 166 89 -26 187 56
2953E6j69K43r0j59PJ75j16p1K45l5k38J07O5j03J18J01j01q6J78p5j82K14k5
$$ 56 -113 130 40 -119 -112 63 -53 -124 121 86 -152 -45 20 -83 35 136 35 -51 127 52 -130 84 59
2976E9j60O3J24j12n3K08j91r9J42N2k01P7K86k80kL23j11j60K04q3j24M3K06
$$ 59 -101 -38 86 -26 -79 129 -62 -161 -19 33 -168 -91 195 -85 -87 236 125 -35 169 86 -38 5 211
2999B11l22k3J79j27PQ6L5j77m6K93k36j3K12R8l39K37J96k93J85O2j27j63J22
$$ 211 -111 -134 45 -82 -75 11 46 -131 -177 116 -120 -133 79 177 -162 75 271 -22 163 225 98 -65 57
3022E7k4j87J24J09k82N6K50j73l1J89m5j47R9K14j93M0ml7o8J11j22%J12O0j69
$$ 57 33 -154 -30 79 -203 -147 103 -70 -101 88 43 -104 -5 209 16 56 52 15 -53 58 -64 -64 48 108 -61
3047f1K8J54k29Q3J02o9k13L42l7j35n4K16j40LJ89j41j20J86R0k51K3J43j0j04
$$ -61 -33 121 -108 -25 77 8 -205 137 100 -35 -89 127 -13 -10 179 38 -82 104 194 -57 -34 109 99 -5
3071eJ01j32j23K43jj78J30O4o6k08L64o9j00Q9P9j10j40J00j33o5K40k31N1K6
$$ -5 96 -36 -159 84 83 -95 35 99 33 -175 189 120 20 109 188 78 -62 38 -95 -160 80 -151 -100 -74
3095g4J16j66L3J83j36l9N7J24q1N1J66j87p3K56j65j44K9J15j23J33l2j52m1
$$ -74 42 -124 -91 92 -44 -83 -26 98 17 68 234 47 -26 230 65 -79 -50 65 -58 75 43 -109 -150
3118a50J89j17j31K05J11k62J32J76k32J12K52k07j70L66k83j25J40L1o2l2J00
$$ -150 39 -78 -209 -4 107 -155 -23 153 -79 33 285 78 -92 274 -9 -134 6 37 -25 -57 43
3139D3k07%K62k9k31K35om3q5K55j23j22O4J48j39n0J13j69J44O3j66j07K31n5
$$ 43 -164 -164 98 69 -162 73 67 24 -61 194 71 -51 13 161 22 -28 85 -84 60 123 -43 -150 81 26
3163B6j44J29J37j53j6J03j34o9K44l8r1J3M7j33rK08k06LJ42k1p2J55l0j14j06
$$ 26 -118 11 148 -5 -21 82 -52 -121 123 85 -6 7 54 -79 -88 120 -86 -83 59 38 -34 121 91 -23 -129
3188a29K69l6k55K86j42J7j0J39j62o0K21j57j65K10K3l43K53R4j85mJ96l4j77
$$ -129 140 104 -151 135 -7 10 0 139 -23 -83 138 -19 -184 26 49 -294 -41 53 -132 -136 60 26 -151
3211a51K53o3J0j0Q3rj11J85M7k44M1Jp4K6J8j7n2J15k1j94Q8J30j90J51J28j20
$$ -151 102 39 49 39 122 113 2 187 234 -10 31 32 -42 -16 2 -15 -67 48 27 -167 -79 51 -139 12 140 20
3237B0l6J38j8l3J22j11j71J6J42j74M6K15o0k31J44R5k07J19N1r6o2K00j35q5
$$ 20 -16 122 104 71 193 82 -89 -73 69 -105 -59 156 96 -135 9 104 -103 16 67 -29 -91 109 -26 -111
3261a11K46Q1k77J59J18k03q7J98k00n3J62J78l57L4J75j55p4K78l3r6M0P3k08
$$ -111 135 216 -61 98 216 13 -74 124 -76 -129 33 211 -146 -112 63 -92 -166 112 79 -17 23 96 -112
3284a12J70O0j34J50p9M3j18R3j01j07J66q2j26O3J64p9o0Q8M7j31Q6J36j94Q7
$$ -112 58 118 -16 134 55 98 -20 73 -28 -135 31 -51 -177 -114 50 -29 -89 -1 46 -85 1 137 -57 30
3308C0P4m6r2L1L1k23J46R3%j66J79q7QL2K8JPJj24l5J80p8k0PK1k2o2J54j30
$$ 30 104 58 -34 -3 28 -195 -49 44 44 -122 57 -30 -22 10 38 39 46 47 -77 -112 68 -10 -30 -23 -2 -24 -86 68 -62
3337f2j11K98l03P9J05J7j17J27n1n2J02Q6j08r5J75L5r4K8K7j99J08O6q3L2j5
$$ -62 -173 125 -178 -99 6 23 -94 33 -18 -70 32 118 10 -85 90 125 31 59 86 -113 -5 61 -22 10 -5
3362eK9r0O0K0j03J7J55k22J81l4J5j25J51Q4j17MJ65k68P6n9O8q4k4J53j27o
$$ -5 24 -66 -6 14 -89 -72 83 -139 42 8 23 -102 49 133 16 20 185 -83 -7 -66 2 -82 -106 47 -80 -86
3388h6J18K6j18J49N0r9n0K58j79j5M2p4j83K09q0p5J43nq2rPmK4oO1J9oL9j23
$$ -86 32 58 -60 89 139 40 -10 248 69 54 96 22 -161 48 -32 -107 36 31 -51 -60 -53 -57 -33 -39 22 41 35 74 -49
3417d9J27pq6M2L1j33j04J31Q4q6J1J15j40m0m4K65j70NK05k00o8J95K8j93J40
$$ -49 78 71 -15 27 58 -75 -179 -48 36 -50 -39 76 -64 -104 -148 117 -53 -48 157 -43 -111 84 112 -81 59
3442E9O2n7q1no6O8P8k16J12L1Om7NJ92j19j82K26o9j6q0K90j63NJ35l10J03J06
$$ 59 121 64 -17 -22 -88 -20 58 -158 -46 -15 -9 -56 -51 141 22 -160 66 -3 -19 -99 191 28 33 168 -142 -39 67
3469F7r0k7P7l6j19J00K7q8O7J6M1j13J26Nj10K6J02%j44P7L1m3l9o5O9j1J52
$$ 67 -23 -50 27 -9 -128 -28 -1 -89 -22 -6 35 -78 48 53 -57 -31 71 71 -73 4 35 -8 -47 -112 -43 -54 98
3496I8j77m5O7L4K7K9m9q2J88l6p3k0J33j37J29k05K94j05o8P0j8j23J73j45N4
$$ 98 -79 -124 -57 -23 4 33 -16 -98 90 54 -19 -39 94 -43 86 -119 175 70 2 72 54 -69 104 -41 13
3521A3q4L9L1r4J14P8j76J76j0j82J33L9p2P5m4l3j01J30m7p8L5J74k38n7K15
$$ 13 -71 -32 -1 -95 19 97 -79 97 87 -95 38 77 5 80 36 3 -98 32 -15 -93 -58 116 -122 -179 36
3546C6m0m7J2J48j35J0Q7l8o7M8P0j1j22J45k10N3P0P0q0o5k2P5L6j48M9NO6L2
$$ 36 -4 -51 -39 109 -26 -16 71 33 -34 14 84 73 -49 96 -114 -61 9 79 -1 -66 -88 -13 23 -125 -76 -71 -5 27
3574B7j03L0j9J2O4oK4k0Km5KM3n7q6R9Q9j23m8K10o0j42J76r7P7L5Rj40J1J09
$$ 27 -76 -46 -65 -53 11 5 29 9 11 -34 -32 11 -46 -132 -33 56 -67 -115 95 35 -107 69 -28 49 84 93 -47 -36 73
3603G3j39O2O0j69P0j8K8k5P5Q0j79M7J41o6j25J23r1L8R4j3j02k7J24o2j0n4
$$ 73 -66 -4 56 -113 -43 -61 -33 -58 17 97 -82 -35 106 40 -85 38 -53 -15 79 66 -36 -63 61 -1 -11 -65
3629f5qk0K6Q7n8p3R1RoO7r6Q8J0L4q1L9L2j41J11o3J42l0n3r1J27n8o2J5o6J03
$$ -65 -73 -93 -67 20 -38 -111 -20 -11 -17 50 -46 42 52 86 5 44 76 -65 46 -17 125 95 42 -49 78 20 -42 -27 -93 10
3659A0k0o1J6Q3ro4KJ26J5q8q1P9L7n1P4k01qj3O8J12P2j67J8QLJ9J37K9j58J72
$$ 10 -10 -71 -55 28 19 -45 -43 83 98 10 -71 8 45 -6 68 -133 -141 -154 -86 26 98 -69 -51 -43 -40 -21 116 145 -13 159
3689A59j05l8j3q1N8K4K2j06P0m0M5n3J36l3j03J06K6o3J4m2J45r6l9njJ6M4r5
$$ 159 54 16 3 -78 -20 4 26 -80 -10 -50 -5 -58 78 45 -58 48 74 11 25 -17 128 32 -7 -12 -13 3 47 -48
3717d8p2OJ16l7L4J6q8O9L0M0j11Q5m7J1k0O3r1R0n3O0j34J52N0l8q8K4j17Q4
$$ -48 -120 -114 2 -35 -1 15 -73 -4 26 66 -45 40 -7 4 -16 47 -44 46 -7 53 -81 71 121 83 -5 19 -98 -14
3745a4Qrj13J76p8J7K9L9r0J01q4M3q7N7O0j61J44j7pP2q0j7j06J46m8K7K2k9
$$ -14 -6 -15 -128 48 -30 -13 16 55 -35 66 -18 25 -62 -5 55 -106 38 21 14 86 6 -11 -117 29 -19 8 30 1
3773Ak2R5qm6P0j36N5n8J18j57n1J11L6Q4j24j9J05k1o3O1j9j31K29n1p9kQ5j41
$$ 1 -21 74 66 20 90 -46 9 -49 69 -88 -139 -28 8 92 -32 -51 54 33 -30 31 12 -119 110 59 -20 -22 63 -78
3801g8K1J24j2J0o6O4n7k3J3L5J6Ol8r4J10J26o8n2N3j20k2J36j17N5k4j1J01
$$ -78 -57 67 55 65 -1 63 6 -17 -4 31 47 53 15 -79 31 157 89 37 90 -30 -52 84 -33 22 -2 -13 88
3828H8j48J07rp0O7n8J5L4K5l7o9L7J26o0K8p3j12J26n4l6K5m2R8q9J25o6l4K9
$$ 88 -60 47 38 -32 35 -23 -8 26 51 14 -55 -18 108 48 76 3 -109 17 -37 -73 -48 -90 8 -81 44 -22 -56 -27
3856b7O7k0n9p7R8K0O1j59J13J5J4P3q7j9j3QJ28j62PK7lR9j64MK0J34j8q2k3
$$ -27 40 20 -39 -116 -18 2 63 -96 17 32 46 119 32 13 0 8 136 -26 -19 8 5 104 -60 -56 -36 98 80 -2 -25
3885b5J8Qo7J58mk30J29L2k4O0jo3l2N8k4jJ14R4k32J17j16k0K9j0K2O3q0N2q5
$$ -25 -7 1 -66 92 88 -142 -13 19 -5 55 54 -9 -41 17 -7 -8 106 200 -32 85 -31 -51 -22 -32 -10 53 -27 25 -60
3914f0j9Jj6M1n3J15n3M8P5m3l4j03O5J25k0J10j79O1oo1p4oO0r7J20M4J3L3j05
$$ -60 -79 -78 -94 -53 -106 9 -44 4 79 36 2 -101 -36 89 69 179 0 61 55 -6 -80 -86 -26 -123 -3 41 54 87 -18
3943a8OQ2n8r8R4kJ91k52l7K22r3r0R8Pj29R4r1J05l3r3L0K2R6p9p1M1J28jp5
$$ -18 -12 70 12 -86 8 6 197 -55 -92 130 37 -53 45 52 -77 17 -74 31 -2 -95 -65 -43 53 -26 -97 -56 72 71 -4
3972dj0R3j02N9m4m3k6J23n6PO0m5N3q8K1n8M2Q2r0JN6qo4jN1q1J35j23J44j62
$$ -4 -14 79 -23 36 -8 -51 -77 46 -10 -3 57 12 65 -23 -2 -60 -18 64 -26 -25 31 23 -41 -42 9 -72 63 -60 84 -78
4002g8Q8q2L1Q0j25K3lko1J62r5mj8L9J33j02j0O6r0k7N5m2M6r9O7PJ94j88K3
$$ -78 10 -72 -41 39 -86 -63 -66 -68 -129 33 -62 -66 -84 -45 88 -14 -24 42 -48 -75 -20 -62 -16 -115 -48 -41 153 -35 -12
4031a2O9q2ll0k2L0J47r5Q7M2j19K5j0P5j75J45o6p9M6l8J62k6p1J9MK7j00O9
$$ -12 57 -25 -28 -58 -80 -50 97 2 89 131 12 37 27 102 -73 72 6 -73 -27 -65 97 71 0 19 23 50 -50 19
4059A9%j1r4L4M8PN7O2j05m2LJ13l9K5m4m0r9J12R4j02M5j06j9K4L1%L4J3j08
$$ 19 19 8 -86 -52 -4 3 60 122 17 -25 -22 91 52 77 33 -7 -106 6 100 -2 43 -63 -82 -58 -27 -27 7 20 -88
4088h8Q7m9NK2j5LO1n5N1jn3J54j37n2J48o8m4k7J53j67J3N9j12j2J16lOJ9L5
$$ -88 -1 -50 -45 -23 -38 -35 26 -29 22 21 -32 122 -15 -67 81 13 -31 -58 95 -72 -59 0 -112 -124 -8 -11 -5 14 49
4117D9M2m9j22K5J71j28j4L3M2p8O7p2J5OO2J7K0j25J05m6lj05pL4J05j6l9L7
$$ 49 91 42 -80 -55 116 -12 -26 7 49 -29 38 -34 -19 -13 49 66 86 -39 66 20 17 -88 -95 -61 44 28 -11 26
4145B6M1j43J35j9m7OM3j02K4j3J18q3j2r6M6k0J66j62J30M6j44O4N5l6j2k8r7
$$ 26 67 -76 59 40 -7 -1 42 -60 -36 -49 69 -14 -26 -122 -76 -96 70 -92 38 84 -60 4 59 23 11 -17 -114
4172a14j6J63Rj26J37m8P7L3k06J5O9J25j91O1M2l0m5Q3j06Q2M0L9l9r2O7j53
$$ -114 -130 33 42 -84 53 5 82 115 -91 -76 -7 118 -73 -12 30 0 -45 38 -68 14 54 93 54 -38 29 -124
4198a24J50L3p7k9J20j0P8j55o8P1J29j38lR9m2Nm4P0P8k31rJ52j7k1K3p8m0R1
$$ -124 26 59 -18 -47 73 63 141 -14 -82 -11 118 -20 -23 76 34 39 -5 65 143 -88 -97 55 38 17 40 -38 -78 13
4226A3j8K4jr4P1n5J27k18J41K5N1l9r2N6M4L7j09K6p8J00k2P6k1l3j0q2J06q2
$$ 13 -5 19 18 -76 -5 -60 67 -151 -10 15 66 27 -65 -9 35 72 -37 -11 -89 11 -11 65 44 11 1 -81 25 -57
4254e7K4J87k75J8K39r7j20J49M0l5o8j09K17j55p7R3l3J41j38J16Q5l45K68m4
$$ -57 -33 154 -121 -103 136 39 -81 68 108 73 5 -104 113 -42 -119 -26 -59 82 -56 60 145 -200 68 24
4278B4o1j6N5l1O2j01PP6j54K21j63J01q8K03k28m1N1J4q7L37j18k3j9N5j35P9
$$ 24 -37 -53 2 -29 33 -68 -61 15 -139 82 -81 20 -68 135 -93 -134 -83 -69 -156 181 63 40 21 76 -59 20
4304B0j0j04P7P9q2O5K3jn2k6j11P9L5n6J1o7K1N0L0N3j6pM0j15N3n9N8N2L0j86
$$ 20 10 -94 -17 62 -20 45 68 67 15 -11 -122 -43 -8 -64 -53 -120 -99 -49 -19 34 18 11 51 -64 -11 -70 -12 40 70 -116
4334a16Q9N2n9pl3J20Pp1M6N9m9r2J2J90j73LJ68j90Q4j20m3J83L7j08m4P4n8
$$ -116 -27 25 -34 -41 -74 46 53 -18 28 87 38 -54 -42 148 -25 -22 146 -44 40 -80 -123 60 97 -11 -55 19 -39
4361c9QN9j21K9M3nnJ3j8R1l4j9Q2j9j17kQ1Kq0O7N7j09j9P6o2o5J85l2M2q3k0
$$ -39 -31 28 -93 -64 -21 -26 -31 -18 -36 55 21 2 84 65 -52 -54 27 29 -51 16 73 -36 -55 21 -41 -106 79 47 89 6 -14
4392a4rM4qpP3j56J61j11k0P2j13K80k48N1r7j4J94j38J68k27N8pR9N1j04K08
$$ -14 -23 21 13 6 79 -77 84 -27 -47 25 -88 192 -56 -5 -102 -116 78 -60 108 -119 -61 -68 31 82 -22 186
4418A86k01M4M3l0J8p0Q0j75R4J9q1J91j89P0M0q7Q1j23J21M4k20N8J05k1k8K7
$$ 186 -15 29 72 42 60 -10 70 -105 -11 8 -73 118 -71 -1 39 -48 33 -90 31 75 -145 -87 18 -3 -31 -4
4444dr8L5j6K07j43j20J70l9j19P6J09p8KJ11j38J31k8k5k5J06k9k5o1q6M0nP2
$$ -4 -102 -67 -83 124 -19 -139 31 -8 -127 -51 58 -20 -18 93 -45 86 58 33 8 114 85 60 -1 -87 -47 -52 20
4471B0jp9j0R8J2LJ4L9J0j62Q4r1l9J00j20J47P4l2p4J6o3jM6lr8Q6q9J86n7P
$$ 20 19 -60 -70 28 40 43 57 96 106 -56 28 -63 -102 -2 -122 25 99 67 -7 9 -54 -55 -9 -12 -110 -24 -113 73 16 23
4501B3M9j7k7j20J57j8K3KO6k89K14j56l9J93p5O6n2o1P0J89k41m6K14j65N6M
$$ 23 72 55 28 -92 65 47 70 72 138 -151 63 -93 -132 61 -14 52 0 -61 9 198 -43 -89 125 -40 16 20
4527B0lPl6j4K0q1j0M4K8l5kJ20r8o9J43l8mR5k5k0K8J8m4Kk8krN2r3p4Q4J54
$$ 20 17 24 -12 -26 -6 -87 -97 -53 -25 -60 -62 58 -40 -109 34 -4 -8 87 62 42 70 88 44 46 18 16 7 59 -34 -108 -24 130
4559A30l7o0l4M3o4K6l7K1L3n7NL0M0m4M1P3p7N8j14J00j64J59Nj18n7J58n2j12
$$ 130 93 33 -1 42 -22 4 -33 -12 21 -36 -31 -1 39 -5 36 109 32 90 -24 76 -88 71 76 -42 -99 59 7 -105
4587a05J47j42J70l7m5p1R1J43k18M5O2m1rQl7O5L5n2p0K9J16j39P0N1O7k18J06
$$ -105 42 -100 70 33 -12 -83 8 151 -67 -22 40 -1 -10 -2 -39 26 61 9 -61 -32 84 -55 15 66 133 -85 21
4614B1j4m7N4R8m2j69K9mO1N2j38LJ37q5O2rJ1n3Q1r6R4J21k52M1R3rO2n3j15
$$ 21 7 -40 14 112 70 -99 -70 -74 -13 39 -99 -96 41 -44 18 9 20 -33 48 -48 46 167 -85 -44 49 40 102 49 -66
4643f6K0K7q5J59j40O5R1m8J3j27J11l8kLJ6L2j74J49K7J0K1m4Rj1m8k1k2J9J66
$$ -66 -46 -19 -104 55 -85 -20 71 23 36 -91 20 -18 -20 -17 -1 31 -143 6 33 43 64 20 29 18 -30 -51 -73 -54 112
4672A12k24J00m5j3P5o0J20r7J73l9n1j22R8k4M4L0j44L7nl4P4m0R1r9QN4o5M1
$$ 112 -112 -12 -57 -70 5 -55 65 -32 141 102 51 -71 27 3 47 77 -67 -30 -35 -69 5 -35 56 -43 -35 19 -46 -5
4700eJ03k5q0j8J37r8J0J8Q6j14j13P6M8p7M3j3M3k5J6j5N8O4k0p1QM5k2J0lm7
$$ -5 98 73 -7 -25 112 14 24 42 128 14 -99 -23 25 -52 -9 -22 21 -4 12 -3 55 119 99 28 36 81 59 69 66 19
4730A9P9j7j63N3p1J58j06l6P2OJ8m3j0n5QM8M7j2l2L3K7q4J88m1rq2o9K60k44
$$ 19 98 81 -82 -29 -100 58 -48 -84 -12 -6 12 -31 -41 -96 -88 -40 7 -5 -37 -4 23 -61 127 86 77 -5 -74 186 -58
4759e8m0J28m3m0K8k3O5L7Oj69L1J45l6q7O6M1j03J02k2r8%q2R4L8m7J9R1l3l6
$$ -58 -98 30 -13 -53 -25 -48 17 54 60 -109 -78 67 31 -56 10 51 -52 50 28 -70 -70 -152 -58 -20 -67 -48 43 10 -26
4788b6KJ8L0q3N1k5pK7k4L5M8Kq0LnM7Q1j74PJ33j40L9J41j13j13L7J47Jj05L8
$$ -26 -24 -6 24 -59 -8 -33 -40 -13 -37 -2 46 48 -32 -29 -34 13 94 -80 -73 60 -80 -41 100 -13 -126 -89 58 59 -46 -8
4818hK7m6m4J47q0Q1j9qj62J45j17M8m4P1P3j34N3Oj28K05k3p1k4J22j63J00M0
$$ -8 19 -27 -71 76 -4 77 58 50 -112 33 -84 -36 -80 -9 64 -70 -17 -11 -139 66 43 -28 -52 70 -93 7 47
4845D7o6M8nr4j3J27l2r0Q3nm3o7J13k4k9P8j00L5N3K8o6J4j7Q8m7l4Q4p6r2J76
$$ 47 -19 29 24 -70 -83 44 12 -78 5 0 -43 -110 3 -21 -50 28 -72 -37 16 44 -22 -8 -25 63 16 -18 66 -10 -102 74
4875G4Kj30KOK4J9R3m0J1K3p1l9J36r3L8q4m0k4Q0P1q4JK8J13j15l7M1OK4Q9k7
$$ 74 76 -54 -52 -46 -22 -3 90 50 61 84 13 -26 110 17 55 -29 -69 -93 -13 58 -26 -25 3 116 1 -36 5 11 35 124 97
4906I7j25Q8M5l9j00P0j07M5RL5L7L8j06n7Q7R5Rj30M6q0J00o1J74j83QJ9k6N4
$$ 97 -28 60 105 66 -34 36 -71 -26 -17 18 55 93 -13 -70 17 112 121 -9 37 -43 57 -4 170 -13 -5 14 -12 42
4934D2Mn0k3P8r1MJ3J8J8Mn1M1mNN2n7O7q0K3L7m3N5o2K8mr7KP7j13Q6K9p8R4
$$ 42 46 -4 -27 51 -40 -36 -23 -5 13 17 -34 7 3 8 60 3 70 -10 13 50 7 62 0 28 24 -73 -71 6 -107 -21 8 -70 24
4967B4o2NO9j01RJ18j15N3R5J2nK5qr4l0J11p7MK2j9Oj03Q2N2n3n3Q0np5J50p7
$$ 24 -38 -33 36 -65 -56 62 -53 0 95 107 102 127 119 25 -5 106 29 33 55 36 42 -61 21 73 20 -33 47 42 -33 117 40
4998D0k2k9L3K1l3K7j5k4l3l9j31K14L7j32J41M9j08P9n4j2k5j31J40J28j21M4
$$ 40 18 -11 22 43 10 37 22 -2 -35 -74 -205 9 46 -86 55 104 -4 75 21 9 -16 -147 -7 121 0 44
5024D4r1K6P4n0q7j3K9M1p2O0J75j80R4O6n5j03J05j34J3M5q3O0K5q9J07M5rp1
$$ 44 -47 -21 53 3 -84 -97 -68 -27 -99 -39 136 -44 50 116 61 -42 63 -71 -58 -13 -96 -36 -11 -100 7 52 43 -28
5052b8O2n3O7l0P8j33O2n1L7p7J56l9m4p5oP7Q4j10l5jK2J76r1n2p3O9j31J63
$$ -28 34 -19 48 18 96 -37 25 -26 11 -66 90 51 7 -68 -74 3 87 -23 -58 -59 -37 139 48 -4 -77 -8 -139 24
5080B4N5p1P0J2o7j47J01J18o3J5l8o1M4l1P6k4j5r2R9J0j0l2O4o0P8j48P9M8
$$ 24 79 8 78 90 23 -124 -23 95 32 47 9 -52 -8 -39 37 13 -2 -94 5 15 5 -27 37 -23 55 -93 -14 34
5108C4O2j31N5Q8j90N7Q6j8j73J15M9L3k23J62Q7m6p7p0N3J54n0j69J88j21oQ
$$ 34 96 -35 20 108 -82 -25 61 43 -130 -15 34 67 -156 6 93 47 -30 -100 -47 107 57 -112 76 -45 -51 -43
5134d3J07q1Nn4O7kj04O8J6mJ30l9m3q5K4O5m1Q4p6Q0K0j37O1Pm7j1k0r8J66j02
$$ -43 64 -17 -12 -66 1 -1 -105 -37 -21 -25 105 66 23 -62 -38 27 -14 70 -6 74 94 -43 18 25 -22 -33 -53 -151 15 -87
5164h7Q8N5n6K9n2k6J26m8P5j38J25q2%P5j41j7l2R0k1l1R1q7k9L2JK2k6Q2r1
$$ -87 1 56 0 29 -23 -49 77 29 104 -34 91 9 9 84 -57 -74 -106 -16 -37 -68 23 -64 -93 -61 -60 -38 -64 18 -73
5193g3O2Q3j9o7J74o3L1j11K1r4M8j44J30m4J34o4n9N2nQ0j20J71l5pk4j65J32
$$ -73 -11 72 53 -14 160 97 128 17 38 -56 -8 -152 -22 -66 68 4 -55 -3 -8 72 -48 123 88 81 57 -108 24
5220B4q3O8q8o6J51M9m9KJ0o9p5J91j17R0m1L7lL0j07L2K9oJm3N2K7j27J21j8
$$ 24 -59 9 -79 -145 6 55 6 8 18 -51 -126 65 -52 38 -3 34 31 61 -46 -14 15 9 10 -33 19 46 -81 40 22
5249B2l6R5M7k83J92r1j0Q8q9N5KN4Ln1Q9l4j7j12J28j73J49p3J99r5j39O7q2
$$ 22 -14 81 128 -155 37 -54 -64 24 -65 -10 -8 46 49 -2 87 53 36 -76 52 -121 28 -45 154 59 -80 -13 -95
5276i5J18o4M6Kj50K30m4k8l7L2O4K6p7J9q4J1R3p5K1j86J66j05O0j1jN9o7J65
$$ -95 23 -41 5 7 -143 87 43 15 -22 10 74 100 23 42 -42 -31 62 -13 8 -178 -12 -117 -57 -68 -69 -10 -77 88
5304H8m0J0m4N2p3j30J84j2r7J70qj41o3J06j40oP3J06j2j09J71j00j3J03k0o8
$$ 88 48 58 14 66 -7 -137 47 35 -62 108 100 -41 -104 2 -138 -144 -71 35 23 -86 85 -15 -28 75 55 -13
5330a3Q6o6L9J6m1q3P8j10J15n8n7K08j87N9J16l5j42O0J21j79J38q5J06q8J12
$$ -13 73 7 46 62 21 -62 16 -94 21 -37 -94 114 -73 -14 102 67 -75 -15 106 -73 65 -20 86 -2 110
5355A10j44P8j9o0r1J25m4J16j6k31J89n9J2N2o5R9L3j23P2L0j3o5k6J85k11L9
$$ 110 -34 44 25 -35 -126 -1 -45 71 55 -176 13 -46 -34 18 -47 52 85 -38 34 64 51 -14 -40 145 -66 -27
5381b7L7l4q2J18j17N6p8K5J21j1j1R3Kj75J71j98J06L1N3m1m0l6J31l6j47N2
$$ -27 10 -24 -106 12 -105 -49 -127 -102 19 8 -3 90 92 -83 88 -110 -4 27 80 39 -1 -37 94 58 -89 -37
5407c7J06q1K7j6p9J63j63MN0Q0N3k3j04K0K3r4J46J1k4n7L5j04L2m1L4pl2M4
$$ -37 69 -12 15 -1 -80 83 -80 -76 -26 54 107 84 -20 0 23 -71 75 86 62 5 40 -64 -32 -73 -39 -46 -78 -34
5435c4J8O4q8J0j5l0J56m7N5K7l6j39j9Q9l0l7K6k7q5M5J71K1p6O4j30J03M4q8
$$ -34 -16 48 -40 -30 -45 -75 81 34 89 116 80 -59 -78 11 -19 -56 -30 -57 -142 -97 74 95 19 83 -47 56 100 12
5463A2J53j11j8O3j11L9n2o3L5N4l3j0k9o2P4J27j11J9Jqm3n4J62p8R6n8J3L1
$$ 12 165 54 36 99 -12 27 -25 -88 -53 1 -32 -42 -71 -133 -59 68 -43 -24 -23 -31 -74 -128 34 -44 52 -6 7 38
5491C8k6pk6J05p7mmk6kj8J36p5n3L8lK5P0q6k7R8l2j05J35q3LJ00j22O7p1j22
$$ 38 12 5 -21 84 7 3 -1 -27 -29 -47 89 14 -39 -1 -4 21 91 5 -22 76 44 -61 74 -9 -6 94 -28 39 -32 -154
5521a54Q6J04j09R2r2L9K0J8K4k4N7Km0J0r5Q0m8k1K0mJ13m6Kr1J33l2l4L4K0
$$ -154 -68 36 -73 19 -73 -34 -14 4 28 4 61 63 23 33 -62 18 -30 -51 -31 -35 78 32 34 -57 76 44 10 44 64
5550F4j73J52m9Ql2M5K0r4J9JJ0pn2J24M4j21N6J4r9O0j26J20J35j11N7r6p4J54
$$ 64 -109 43 -6 2 -30 15 35 -59 -40 -39 -29 -36 -88 36 80 -41 15 29 -70 -10 -136 -16 119 8 65 -31 -105 49
5578D9K4j09J6j2M6j23J50k3j26J10q9J11l5PP4o3pL5lj5K5j21O5j00J29mn8N2
$$ 49 73 -36 -20 -32 14 -109 41 18 -108 2 -87 24 -11 -4 70 7 0 35 32 17 42 -79 -14 -114 15 11 -47 5
5606ER5q7p3N7P4j09R6q7J9P1j14J30n8o1K1N3Nl0R4j24m5L7M9m8P7J0mj20rQ6
$$ 5 100 13 -60 -3 71 -38 58 -29 -10 61 -53 77 19 -42 -21 32 37 7 101 -23 -68 -31 18 -30 47 57 53 -67 -76 10
5636A0j11J54k5j43P0N2q1M8k1J4L3J43j08Rq2P0j17Q2p4O3m1QP0m1k3P0j2m6
$$ 10 -101 53 28 -115 -45 7 -74 -26 -47 -33 0 143 35 44 -38 32 -85 -3 -77 -14 -55 -47 23 -18 -41 29 17 -29
5664b9P4nN5j80K28q5q4JJ4LO3r0N0pj7j04j8K43q9m4L0l4n9M7j7Q7p4j6P6j7
$$ -29 45 40 95 -85 143 58 -26 -25 -11 -8 55 -35 15 8 -9 -113 -131 112 23 -21 9 -25 -84 -37 -54 33 -41 -57 19 2
5694Bm6P0l2ljj9J30lj45L7J09j35L1l8M8J2k6K7o4L0L5L6j09O1p0J62j02N4j66
$$ 2 -44 26 -6 -9 -10 -29 101 98 -47 -10 99 -36 -5 -43 5 17 -9 18 -46 -16 19 55 -54 7 -63 99 -3 51 -115
5723a15N1J83p2q2j1J21j61R6Nj9p6J31P2k9j17K4pJ8j31J05J2j20R0j10J85l1
$$ -115 -64 119 47 -35 -46 75 -86 10 15 -4 -80 51 123 94 -23 1 -6 12 -119 -14 -2 -122 -32 -142 43 12
5749A2r7L4J00r8O4j45J89j8k7R0j00Rj36J62o4P2j69R8p2M6j16J51k5j8N7P4
$$ 12 -85 -51 49 -49 15 -130 59 41 14 104 4 13 -123 39 -25 47 -122 -24 -96 -50 -166 -15 -40 -58 -1 73
5775G3l1k6J3j18Q5j6n1J13m7O0k00P1Q3q1M3n8J10l8Ll2k7J04J3k9K7mJ1J7l5
$$ 73 42 16 29 -89 -4 -20 -71 42 -5 55 -145 -74 9 -72 -29 -87 23 -15 -12 -44 -71 33 46 17 44 40 51 68 33
5804C3k0n9M6J2j3j2l3J9Rm4k4L4J75o8n1Q3j41P6j1j4l6J1%m8R3p1K7K3j03K00
$$ 33 13 -46 0 12 -1 -13 -46 -27 -18 -62 -86 -52 123 55 4 87 -54 22 11 -3 -39 -28 -28 -76 17 -54 -27 -4 -107 93
5834I3k07J22O7M9p8p4K8m0j0L7J48j36Q1j21n0K6NJ33k7j19P8j7p0J36%q2j7
$$ 93 -114 8 75 124 46 -28 0 -40 -50 -13 135 -1 80 -41 -91 -65 -60 73 46 -73 5 -12 -82 54 54 -28 -45
5861d5nN1o5n8N3K8K3J46k2j27L8p5PK7m7MR9j06M0R2r1R6Lq6M4l6k1K4J28j3
$$ -45 -50 1 -64 -122 -69 -41 -18 128 106 -21 17 -58 -51 -24 -71 -67 32 -74 -34 58 -33 63 66 -20 24 -12 -33 -9 119 106
5891A06n2L0Km6J04r3l2k3Lp6J09r5K5j0n5oJ2J63Rk1r2M8j32R1nP8q6P7%nK9
$$ 106 54 84 86 40 144 51 19 -4 -1 -77 32 -63 -38 -48 -103 -109 -97 66 75 54 -38 10 -122 -31 -36 42 -44 33 33 28 57
5922E7k1o6l2Q8Jj57J48j7K2l0R8QJj08J58k52J16R5mj20Q4j12k0l1J03%j9n4
$$ 57 36 -30 -62 26 27 -130 18 1 23 -7 91 99 100 -8 150 -102 14 109 105 -15 69 -43 -63 -94 9 9 -10 -64
5950f4nJ59p2l8N2j0m6J90j18j22j0Q8Ko5R7o4KPLj29J67k4l7M5M9ol1L9r1O1
$$ -64 -69 90 18 -20 32 22 -24 166 48 -74 -84 4 6 -59 38 -26 -24 -17 -14 -143 24 0 -37 8 57 51 20 59 -32 29
5980B9PR1k04J00p2OJ3OJ4n2J07J4o4K0Kl5M3l0j00R1J4NK3j06N7OP5q9j9j1N0
$$ 29 36 127 -77 23 -49 -43 -30 -24 -10 -62 45 59 -5 15 17 -18 25 -5 -105 -14 0 5 28 -78 -21 -15 60 -29 -48 -59 -9
6011im6L0M8p1J94j39l0M1P3j50J81r4K9q4R8n0Om8L4p8K9L4r8J07p0M2n7J05
$$ -9 -55 -25 23 -48 146 7 -23 18 91 -59 122 28 57 -27 71 21 27 -21 13 -65 -36 -2 -100 7 -63 -21 -78 27
6039B7j22N0l1J48q6R4q5M6M0P7k55M5O1k4J38k27N1M6q2M5m7O1K0KJ9n8k3N9
$$ 27 -95 -45 -76 72 -14 80 -5 41 81 158 -97 -52 9 -15 123 -104 -53 -7 -89 -44 -91 -30 -10 -8 11 -47 -70 -11
6067a1mN5p3J4Q1J5j54K1m7J48j57J60n3PL5j60R9j6J82o3j41Q0J08r7K0j54K7
$$ -11 -15 40 -33 -19 62 77 -77 -56 -103 45 -112 48 -5 2 37 -123 -24 -40 142 79 -62 18 126 29 49 -105 -78
6094g8J56J9j8k4qm9r5K8m7O3j32J17L9o7J16j3j8Q1k9j2j00J19R2r4j50L8M1
$$ -78 78 97 79 55 47 -2 -97 -69 -116 -53 -185 -68 -29 -96 20 7 -11 70 41 29 -71 48 140 46 -104 -66 -25
6121b5l3n6J16M1M0q7J4j04J51p5N1J0j5M1N5o5n2oK8m7N6p8L3l4m5ko7O6Q0p3
$$ -25 -58 -114 2 43 83 -4 10 -94 57 -18 33 43 28 69 124 59 7 1 29 -18 38 -40 -7 -41 -86 -88 -155 -89 -9 -82
6151h2N5R0j73N4N2P6j23M1Q7j20PJ2L3q2P1M2j21J27j2r1n8O4R2p9M2l2R6n0
$$ -82 -27 63 -110 -56 -4 72 -51 -10 77 -43 -36 -24 9 -73 -2 40 -81 46 34 -57 -115 -51 41 -38 4 -28 68 18
6179A8r9J39m3K6Q9j17J9k50J62M6j13R9L3k3J1j37J21P1j50J60J1j8q9N2P8j78
$$ 18 -81 58 15 41 130 13 32 -218 -56 -10 -123 -24 9 -14 -3 -140 -19 52 -98 62 73 55 -34 18 96 -82
6205h2j5J47l6n5k1m0J05j01J03P5j65K9N4l4K8j01J59k1k0o1J24j5r9J10j67
$$ -82 -97 50 14 -41 -62 -102 3 -98 5 80 -85 -56 -2 -36 -8 -109 50 29 9 -52 72 57 -42 68 -99
6230i9Q7N8o2n0R0R8j35o1J43rMj8l0rl0J19j54RJ13j3Kj26K26j20j01O7l6k4
$$ -99 -12 46 -16 -66 24 122 -13 -74 69 60 64 46 16 7 -23 96 -58 -49 64 51 53 -73 153 33 -68 -1 -37 -61
6258f1J9lP5k0n3O8lK9L2o1j12J60j5o8P5j17J16j00J2M0n6P0j4k1R7j07m0J24
$$ -61 -42 -45 30 10 -43 25 22 51 83 22 -90 70 55 -13 62 -55 61 -39 -27 13 -43 27 13 -8 89 -18 -58 66
6286F6j42L9M3q5J30jn0M3l7j47J84j12P2O1j40J01l0L8r1K8l6J01K1l6j35J63
$$ 66 -76 -37 6 -79 51 50 0 43 6 -141 43 -69 3 64 -76 25 -5 33 -58 -30 -66 35 56 20 -115 48
6312D8n6k6K0O2j17M5n7J16j35m1J08j04J10O5k1n3j7Q4j15N4M4r3K8K9J20j14
$$ 48 -8 -34 -14 48 -69 -24 -81 35 -100 -141 -33 -137 -27 38 17 -36 -53 31 -84 -30 14 -79 -51 -22 98 -16
6338a6R5r2N5j9j06J49o1J4j10J29j37J21j09J06NNm2k7O5N7m1Nj9M9q9P1K3q4
$$ -16 79 -13 42 23 -83 66 5 19 -91 38 -99 22 -87 19 24 29 -13 -40 25 82 41 46 27 76 -13 58 81 -3
6366cM4q5lK2n4O2J7qQOk6n4L2K1JK1J39k01K8j9J71k80J21M6l7M2j13J02M3J6
$$ -3 41 -44 -47 -25 -79 -17 0 -8 0 6 -20 -74 -42 -21 -20 1 140 -61 -33 -52 119 -161 -40 6 -31 11 -102 0 43 59
6396E9R2j24Q6l1j56M2m0O3L2N9Kj08J01n1k9l4N1q2O2n1K5J4m1O6k6k7K5J2M9
$$ 59 151 27 113 82 -74 -32 -72 -9 23 82 84 -24 77 26 -3 -37 14 -68 -6 -57 -32 -18 -59 7 -19 -46 -21 -9 40
6425D0J02m8p2o2J06p3n6J23j46j8J58j46P4RK0L7r2Q3q2K6%K3M2KN9r7l1j2j3
$$ 40 142 94 22 -40 66 -7 -63 60 -86 -104 54 -92 -18 -9 11 48 -44 39 -43 -17 -17 6 48 50 109 12 -19 -31 -44
$$ [...]
8191a1
##END NTUPLES=NMR FID
##END=
