##TITLE=1H_DE-80H_X3
 200.13MHz, d2o
 8 sc
 
 19ns.26.2.2025
##JCAMPDX= 6.0         $$ Bruker NMR JCAMP-DX V2.0
##DATA TYPE= NMR FID
##DATA CLASS= NTUPLES
##ORIGIN= UXNMR, Bruker Analytische Messtechnik GmbH
##OWNER= pz
$$ XWIN-NMR		Version 3.5
$$ Mon Feb 16 10:52:03 2026 Russian Standard Time (UT+4h)  Yarkov@DPX200
##.OBSERVE FREQUENCY= 200.1313
##.OBSERVE NUCLEUS= ^1H
##.DELAY= (6, 6)
##.ACQUISITION MODE= SIMULTANEOUS
##.ACQUISITION SCHEME= undefined
##.AVERAGES= 8
##.DIGITISER RES= 18
##SPECTROMETER/DATA SYSTEM= spect
##.PULSE SEQUENCE= zg30
##.SOLVENT NAME= CDCl3
##.SHIFT REFERENCE= (INTERNAL, CDCl3, 0, 14.3821)
##AUDIT TRAIL= $$ (NUMBER, WHEN, WHO, WHERE, WHAT)
$$ ##TITLE= Audit trail, XWIN-NMR		Version 3.5
$$ ##JCAMPDX= 5.01
$$ ##ORIGIN= Bruker BioSpin GmbH
$$ ##OWNER= Yarkov
$$ C:/Bruker/XWIN-NMR/data/yarkov2/nmr/H-C/1/audita.txt
$$ ##AUDIT TRAIL=  $$ (NUMBER, WHEN, WHO, WHERE, WHAT)
(   1,<2026-02-16 10:49:47.21 +0400>,<Yarkov>,<DPX200>,
      <created by zg, POWCHK disabled, PULCHK disabled
       configuration hash MD5:
       00 E9 B6 7A A2 85 ED C7 34 08 36 98 17 FE 4E 26
       data hash MD5: 16K
       9B E2 73 B2 C8 AC 64 DE D4 DD D9 31 37 99 8E 13>)
$$ ##END=
$$ 
$$ hash MD5
$$ FF AB F4 7E AD 21 E2 AD 1F 9A 7B D8 B6 9D 0C 0A
##$RELAX= 
##$RELAX= 
##$RELAX= 
##$RELAX= 
##$RELAX= 
##$RELAX= 
$$ Bruker specific parameters
$$ --------------------------
##$DU= <C:/Bruker/XWIN-NMR>
##$EXPNO= 1
##$NAME= <H-C>
##$PROCNO= 1
##$TYPE= <nmr>
##$USER= <yarkov2>
##$AMP= (0..31)
100 100 100 100 100 100 100 100 100 100 100 100 100 100 100 100 100 100 
100 100 100 100 100 100 100 100 100 100 100 100 100 100 
##$AQSEQ= 0
##$AQ_mod= 1
##$AUNM= <au_zg>
##$AUTOPOS= <>
##$BF1= 200.13
##$BF2= 200.13
##$BF3= 200.13
##$BF4= 200.13
##$BF5= 200.13
##$BF6= 200.13
##$BF7= 200.13
##$BF8= 200.13
##$BYTORDA= 1
##$CFDGTYP= 0
##$CFRGTYP= 5
##$CHEMSTR= <none>
##$CNST= (0..31)
1 1 145 1 1 1 1 1 1 1 1 1 1 1 1 1 1 1 1 1 1 1 1 1 1 1 1 1 1 1 1 1 
##$CPDPRG= <>
##$CPDPRG1= <>
##$CPDPRG2= <>
##$CPDPRG3= <>
##$CPDPRG4= <mlev>
##$CPDPRG5= <mlev>
##$CPDPRG6= <mlev>
##$CPDPRG7= <mlev>
##$CPDPRG8= <mlev>
##$CPDPRGB= <>
##$CPDPRGT= <>
##$D= (0..31)
0 0.7 0 0 0 0 0 0 0 0 0 0.03 0 0 0 0 0 0 0 0 0 0 0 0 0 0 0 0 0 0 0 0 
##$DATE= 1771224586
##$DBL= (0..7)
120 120 120 120 120 120 120 120 
##$DBP= (0..7)
150 150 150 150 150 150 150 150 
##$DBP07= 0
##$DBPNAM0= <>
##$DBPNAM1= <>
##$DBPNAM2= <>
##$DBPNAM3= <>
##$DBPNAM4= <>
##$DBPNAM5= <>
##$DBPNAM6= <>
##$DBPNAM7= <>
##$DBPOAL= (0..7)
0.5 0.5 0.5 0.5 0.5 0.5 0.5 0.5 
##$DBPOFFS= (0..7)
0 0 0 0 0 0 0 0 
##$DE= 6
##$DECBNUC= <off>
##$DECIM= 32
##$DECNUC= <off>
##$DECSTAT= 4
##$DIGMOD= 1
##$DIGTYP= 9
##$DL= (0..7)
0 120 120 120 120 120 120 120 
##$DP= (0..7)
150 150 150 150 150 150 150 150 
##$DP07= 0
##$DPNAME0= <>
##$DPNAME1= <>
##$DPNAME2= <>
##$DPNAME3= <>
##$DPNAME4= <>
##$DPNAME5= <>
##$DPNAME6= <>
##$DPNAME7= <>
##$DPOAL= (0..7)
0.5 0.5 0.5 0.5 0.5 0.5 0.5 0.5 
##$DPOFFS= (0..7)
0 0 0 0 0 0 0 0 
##$DQDMODE= 0
##$DR= 18
##$DS= 0
$$ [...]
##$SUBNAM2= <"">
##$SUBNAM3= <"">
##$SUBNAM4= <"">
##$SUBNAM5= <"">
##$SUBNAM6= <"">
##$SUBNAM7= <"">
##$SUBNAM8= <"">
##$SUBNAM9= <"">
##$SW= 18.0517328524113
##$SWIBOX= (0..15)
0 0 2 0 0 0 0 0 0 0 0 0 0 0 0 0 
##$SW_h= 3612.71676300578
##$TD= 16384
##$TD0= 1
##$TE= 0
##$TE2= 300
##$TE3= 300
##$TEG= 300
##$TL= (0..7)
0 120 120 120 120 120 120 120 
##$TP= (0..7)
150 150 150 150 150 150 150 150 
##$TP07= 0
##$TPNAME0= <>
##$TPNAME1= <>
##$TPNAME2= <>
##$TPNAME3= <>
##$TPNAME4= <>
##$TPNAME5= <>
##$TPNAME6= <>
##$TPNAME7= <>
##$TPOAL= (0..7)
0.5 0.5 0.5 0.5 0.5 0.5 0.5 0.5 
##$TPOFFS= (0..7)
0 0 0 0 0 0 0 0 
##$TUNHIN= 0
##$TUNHOUT= 0
##$TUNXOUT= 0
##$USERA1= <user>
##$USERA2= <user>
##$USERA3= <user>
##$USERA4= <user>
##$USERA5= <user>
##$V9= 5
##$VALIST= <valist>
##$VCLIST= <CCCCCCCCCCCCCCC>
##$VD= 0
##$VDLIST= <DDDDDDDDDDDDDDD>
##$VPLIST= <PPPPPPPPPPPPPPP>
##$VTLIST= <TTTTTTTTTTTTTTT>
##$WBST= 1024
##$WBSW= 4
##$XGAIN= (0..3)
0 0 0 0 
##$XL= 0
##$YL= 0
##$YMAX_a= 832900
##$YMIN_a= -871563
##$ZGOPTNS= <>
##$ZL1= 120
##$ZL2= 120
##$ZL3= 120
##$ZL4= 120
##$ABSF1= 10
##$ABSF2= 0
##$ABSG= 5
##$ABSL= 3
##$ALPHA= 0
##$AQORDER= 0
##$ASSFAC= 0
##$ASSFACI= 0
##$ASSFACX= 0
##$ASSWID= 0
##$AUNMP= <proc_1d>
##$AZFE= 0.1
##$AZFW= 0.1
##$BCFW= 1
##$BC_mod= 2
##$BYTORDP= 1
##$COROFFS= 0
##$CY= 83.5205535888672
##$DATMOD= 1
##$DC= 2
##$DFILT= <>
##$DTYPP= 0
##$F1P= 10.8118882576601
##$F2P= -7.23987719738617
##$FCOR= 0.5
##$FTSIZE= 0
##$FT_mod= 4
##$GAMMA= 1
##$GB= 0.15
##$INTBC= 1
##$INTSCL= 1
##$ISEN= 128
##$LB= 0.25
##$LEV0= 0
##$LPBIN= 0
##$MAXI= 10000
##$MC2= 0
##$MEAN= 0
##$ME_mod= 0
##$MI= 1.114404
##$NCOEF= 0
##$NC_proc= 0
##$NLEV= 6
##$NOISF1= 3.799351
##$NOISF2= 2.8
##$NSP= 1
##$NTH_PI= 0
##$NZP= 0
##$OFFSET= 14.38212
##$PC= 1
##$PHC0= -5296.148
##$PHC1= 6.821927
##$PH_mod= 1
##$PKNL= yes
##$PPARMOD= 0
##$PSCAL= 0
##$PSIGN= 0
##$REVERSE= no
##$SF= 200.129724274929
##$SI= 16384
##$SIGF1= 3
##$SIGF2= 2
##$SINO= 400
##$SIOLD= 16384
##$SREGLST= <1H.CDCl3>
##$SSB= 0
##$STSI= 0
##$STSR= 0
##$SW_p= 3205.1282051282
##$SYMM= 0
##$S_DEV= 0
##$TDeff= 0
##$TDoff= 0
##$TI= <>
##$TILT= no
##$TM1= 0
##$TM2= 0
##$TOPLEV= 0
##$USERP1= <user>
##$USERP2= <user>
##$USERP3= <user>
##$USERP4= <user>
##$USERP5= <user>
##$WDW= 1
##$XDIM= 8192
##$YMAX_p= 0
##$YMIN_p= 0
$$ End of Bruker specific parameters
$$ ---------------------------------
##NTUPLES= NMR FID
##VAR_NAME=  TIME,          FID/REAL,        FID/IMAG
##SYMBOL=    X,             R,               I
##VAR_TYPE=  INDEPENDENT,   DEPENDENT,       DEPENDENT
##VAR_FORM=  AFFN,          ASDF,            ASDF
##VAR_DIM=   8192,          8192,            8192
##UNITS=     SECONDS,       ARBITRARY UNITS, ARBITRARY UNITS
##FACTOR=    0.0002768,     1,               1
##FIRST=     0,             0,               0
##LAST=      2.2672688,     0,               0
##MIN=       0,             -871563,         0
##MAX=       2.2672688,     832900,          0
$$ Real data points
##PAGE= N=1
##DATA TABLE= (X++(R..R)), XYDATA
$$ [...]
943 -154979 64911 200230 -11871 -135604 73333 182716 -30767 -145460 33105 94491
953 94491 -108872 -156570 59402 101107 -111532 -127504 109168 140883 -65606 -60601 146681
964 146681 107974 -117288 -70284 147542 62976 -188056 -118299 118030 38362 -178787 -62526
975 -62526 170631 53507 -161873 -4665 238692 80563 -175783 -33657 198423 28793
985 28793 -217571 -53758 173356 -19873 -256597 -40652 227607 34303 -215425 -3059
995 -3059 259463 56365 -191958 17617 246033 -1529 -259992 -27795 220211 -20740
1005 -20740 -274558 -39908 212098 -3570 -217102 31845 259502 15604 -205569 41482
1015 41482 260071 6297 -229614 -12189 183922 -49797 -238953 85 184955 -49729
1025 -49729 -214672 43090 231742 5965 -157557 62383 202112 -24854 -158946 51619
1035 51619 146524 -93727 -201972 24607 127502 -76699 -147933 63738 133244 -51800
1045 -51800 -77748 125729 140956 -72549 -94099 97368 90622 -111199 -108347 67036 29841
1056 29841 -145923 -76184 125324 63297 -122443 -33529 167414 81912 -106233 -8916 157833
1067 157833 16202 -175458 -34139 149165 -16515 -213382 -42684 161579 2474 -169533
1077 -169533 28444 215024 11870 -170083 49614 233356 -7329 -218469 -2815 182259
1087 182259 -51119 -236114 4778 188552 -55234 -224862 49182 249885 -2213 -191738
1097 -191738 59394 240078 -17052 -201564 40052 193973 -78381 -250558 15766 191589
1107 191589 -60929 -221053 39793 209563 -24347 -158991 91358 220204 -40241 -177953
1117 -177953 65304 181887 -74082 -204889 21601 127863 -91163 -167373 69138 154071
1127 154071 -65349 -126142 106583 175343 -42769 -107894 83985 111840 -94347 -121704 69091
1138 69091 69879 -131969 -125144 84140 88575 -88094 -58167 125293 87728 -83399 -22454 144779
1150 144779 55083 -135377 -59317 106533 8553 -156321 -48006 108791 -8517 -144748
1160 -144748 11876 174149 26571 -125390 30546 177863 8402 -144603 15087 138815
1170 138815 -58155 -196243 6662 150907 -52526 -190378 31233 186342 -16063 -144558
1180 -144558 79782 206619 -36127 -173518 65460 189015 -74341 -218340 24761 156369
1190 156369 -84579 -196929 63802 183592 -64373 -165996 102961 219671 -43557 -163667
1200 -163667 78939 173357 -80874 -182630 53201 133752 -113095 -189750 67502 161631
1210 161631 -67141 -139562 96668 170268 -49324 -106845 104592 138338 -95298 -142646 66971
1221 66971 97562 -112525 -140302 60726 83936 -90091 -75874 117465 107477 -74611 -53632
1232 -53632 123353 90494 -89846 -66682 80566 23810 -131218 -63286 89432 13674 -130891
1243 -130891 -32374 128719 45925 -87433 16713 143304 18537 -112546 15224 129297
1253 129297 -30566 -164512 -12717 110089 -43830 -149245 25900 136360 -33639 -122147
1263 -122147 77547 178605 -25199 -132849 60025 148591 -61621 -161261 38212 116914
1273 116914 -98653 -172315 61848 153334 -66766 -142596 91299 176568 -46466 -121277 99371
1284 99371 153997 -92038 -161923 71101 128658 -114760 -177835 62928 131514 -87885 -126536
1295 -126536 113210 158728 -74521 -111617 124400 154130 -90829 -136929 79976 98787 -123616
1306 -123616 -138385 79725 89531 -119344 -107672 116886 125835 -74360 -69999 120091 103942
1317 103942 -84576 -70674 97260 55571 -127812 -96032 77069 44970 -111823 -64767 95848
1328 95848 56116 -77367 -7955 130606 52226 -89762 -17388 104368 11885 -116869 -31021
1339 -31021 72061 -30443 -121180 4504 103626 -16002 -96540 42097 132161 -1595 -79390
1350 -79390 55844 109363 -53048 -118671 39437 91498 -85608 -141948 41158 105820 -65384
1361 -65384 -104774 88663 135172 -59976 -93982 112436 141351 -84204 -130983 76324 103379
1372 103379 -116252 -142537 76715 99328 -115927 -119545 118437 141903 -81337 -98495 123201
1383 123201 135551 -87727 -105500 99541 93283 -128647 -134194 82026 90217 -117276 -115393
1394 -115393 98676 110873 -77767 -67179 125209 110216 -87359 -78933 103376 79634 -112676
1405 -112676 -101169 69208 46043 -113814 -71560 95000 58069 -89683 -32212 124322 73236
1416 73236 -73072 -24585 97181 24298 -102910 -34422 73760 -12256 -121259 -27309 85811
1427 85811 4276 -83146 17810 107603 8555 -65373 44870 108719 -22549 -100715 17408
1438 17408 75565 -56763 -112851 20957 70804 -62508 -90857 69769 111213 -42417 -74753
1449 -74753 85927 113310 -53866 -85582 69226 75345 -101571 -114268 65267 75608 -103408
1460 -103408 -104053 89165 104316 -71986 -67206 118152 107290 -86669 -80821 108152 87051
1471 87051 -118555 -113333 79427 66189 -122001 -94682 103614 84361 -101037 -63962 136390
1482 136390 106176 -89541 -67404 113681 74389 -113834 -83257 87211 42805 -131130 -81887
1493 -81887 96152 61771 -94445 -46285 113926 74073 -70068 -24361 108588 44952 -99126
1504 -99126 -49958 74941 15804 -109258 -51344 66462 13256 -82372 -5016 99416 27833
1515 27833 -64143 15621 101961 13945 -75151 1162 62195 -35716 -95763 5460 58778 -46085
1527 -46085 -85052 36830 83998 -23862 -49894 68226 85153 -41542 -56084 67312 63398
1538 63398 -81286 -89341 47403 47750 -88942 -76455 73177 66583 -74205 -48012 111606
1549 111606 90383 -73860 -57576 98840 68159 -101544 -79440 78914 40999 -124863 -80507
1560 -80507 97170 64371 -100096 -53441 121828 83922 -81501 -39450 117887 60260 -111536
1571 -111536 -65726 93917 38190 -127093 -75904 86971 42571 -102680 -39952 116651 61941
1582 61941 -84217 -23022 121819 55251 -96141 -44533 84140 16991 -113688 -47020 76736
1593 76736 9242 -101890 -19563 101159 33390 -68534 6638 100858 20915 -70148 3511
1604 3511 73343 -19358 -97547 -12260 56894 -25680 -81214 10896 69123 -12116 -48560 48339
1616 48339 84683 -16067 -52305 42268 62958 -44907 -71664 25276 33891 -70692 -68581 49152
1628 49152 52431 -57558 -43632 80890 72151 -47103 -31176 84024 49803 -81532 -53225
1639 -53225 70756 27591 -107846 -65255 73758 35813 -90569 -33265 106760 54728 -79093
1650 -79093 -18127 117737 49147 -98532 -42742 89956 21322 -117574 -51115 84576 17514
1661 17514 -111036 -30653 112153 45559 -85510 -13112 117794 43361 -89352 -22924 93816
1672 93816 11064 -116143 -40622 81075 7132 -106167 -25083 93458 25070 -73685 7096
1683 7096 106311 24463 -74113 833 84240 -2231 -93322 -19624 55231 -21755 -85713 1319
1695 1319 68869 -8936 -59482 31522 86312 534 -47535 33583 64200 -29968 -64343 21528
1707 21528 38552 -58268 -72663 28123 44530 -44974 -41643 59356 58072 -36219 -22384 74327
1719 74327 49518 -58647 -41535 54637 22535 -81409 -49866 51424 16195 -79167 -27341
1730 -27341 84182 41078 -62726 -10775 96426 39951 -73008 -21725 79143 9669 -103211
1741 -103211 -36245 75325 5196 -103450 -23663 94746 24523 -79531 4291 112086 25140
1752 25140 -85075 -1417 98745 1910 -109511 -23090 78290 -11429 -107576 -10559 91609
1763 91609 2868 -86201 14698 112223 17465 -77623 11877 95295 -4163 -94858 -6527 69875
1775 69875 -26707 -102328 -3222 76537 -10669 -74276 21874 89454 2508 -54044 32572 78244
1787 78244 -16891 -69256 13450 50657 -38477 -76038 9077 42261 -34329 -49824 39463 59663
1799 59663 -21499 -30447 53213 55722 -31748 -36387 38733 24233 -60662 -45171 36290 13706
1811 13706 -65723 -30343 59434 30501 -46532 -2190 78945 28390 -55983 -4757 71592 3836
1823 3836 -85487 -23255 59703 -9134 -89929 -11360 76712 2971 -74222 14929 102241 14901
1835 14901 -72831 12250 92170 -3857 -93609 -6304 72736 -23344 -104281 -4136 83226 -9083
1847 -9083 -86473 15781 101931 7597 -71765 23721 96664 -7827 -89391 5393 75463 -27778
1859 -27778 -101751 -1022 72256 -20917 -79909 23763 88708 -6867 -61869 36263 86919
1870 86919 -13978 -68628 19395 57807 -37751 -77370 12685 46182 -40164 -61743 33444 61861
1882 61861 -20673 -36013 49000 59497 -26144 -35616 41415 34690 -53151 -50560 30226 19933
1894 19933 -58646 -39019 44899 28628 -43283 -10339 69935 35941 -43991 -9292 63725 16239
1906 16239 -65418 -23840 47537 -5314 -78165 -18359 59758 3198 -66036 4308 82776 16848
1918 16848 -55987 14272 81542 -742 -76440 741 66154 -22526 -92865 -3193 68033 -17813
1930 -17813 -78226 19324 86547 -5716 -64672 33639 90918 -12682 -76253 18198 69666 -33826
1942 -33826 -89565 10144 62297 -35247 -78609 28732 80891 -17104 -60539 41387 84519
1953 84519 -18196 -62975 31799 63863 -41600 -79903 19258 52264 -46116 -72351 31363
1964 31363 63121 -28568 -45891 52202 69175 -27636 -43185 46347 50383 -46144 -56153 28840
1976 28840 28223 -56705 -49607 37763 33208 -43655 -25352 59302 44479 -34000 -15278 57020 26337
1989 26337 -51989 -25105 43138 3311 -68450 -25747 46493 4826 -57031 -2444 65432 13938
2001 13938 -45264 14659 71427 3084 -59576 3205 54805 -18974 -74824 -1898 50956 -23019
2013 -23019 -67842 18113 70802 -9876 -54689 33494 79266 -12045 -60052 26069 62557 -36014
2025 -36014 -78823 16780 55357 -42262 -76288 29139 69994 -26688 -56569 47932 79072
2036 79072 -26382 -56963 44748 66669 -45013 -74184 29097 50492 -54742 -72299 36652
2047 36652 57660 -42628 -51626 56949 70546 -33348 -44726 53885 57172 -46451 -54973 38082
2059 38082 36112 -60586 -58037 38030 38362 -48362 -38186 54294 49137 -34252 -22543 58435 39230
2072 39230 -46763 -32659 43003 17975 -61332 -36498 38964 12244 -54812 -15723 57151 21384
2084 21384 -41958 2675 65401 15934 -47574 -1759 49508 -9217 -64445 -6774 42842 -18558
2096 -18558 -63103 7286 57144 -7104 -46185 27396 67732 -8029 -47086 27987 58340 -28814
2108 -28814 -66517 15515 45982 -40617 -67601 24913 55222 -32052 -51310 46523 69971 -26544
2120 -26544 -48143 46769 61497 -40450 -60908 33397 44429 -55389 -66274 35997 49934
2131 49934 -45914 -51243 52260 63341 -33944 -40277 56096 56630 -45659 -51130 43710 40039 -60287
2144 -60287 -58700 38955 36714 -54487 -42043 55439 47549 -41506 -25612 63751 44253 -46575
2156 -46575 -31122 48360 21873 -61153 -36760 40148 12540 -58706 -23215 52581 23122 -41598
2168 -41598 -3720 61488 22015 -41362 -3122 50579 917 -58567 -13010 39427 -10545 -59287
2180 -59287 -3062 48108 -4404 -44899 18616 62163 -1677 -42320 22647 56478 -17432 -56092
2192 -56092 12869 41429 -35034 -62107 18706 47050 -30703 -49495 37774 61034 -22600 -40274
2204 -40274 44385 55741 -35726 -50785 35315 41044 -52363 -59972 33190 41069 -47561 -46611 49666
2217 49666 53541 -37374 -34824 58631 53509 -44190 -43512 46804 37444 -58650 -52262 40371 31117
2230 31117 -58876 -42901 53386 43229 -44635 -26673 63363 45123 -44265 -27803 53396 27138
2242 27138 -59620 -37851 42148 16521 -60772 -30876 48752 23741 -45653 -11510 60999 28235
2254 28235 -41386 -8458 54384 13306 -54431 -18522 40188 -2483 -59029 -12121 45105 582
2266 582 -46736 7081 57293 5760 -37971 15534 52526 -8246 -47046 9330 37975 -26444
2278 -26444 -55368 9772 37582 -24777 -43419 26970 49189 -17278 -32214 38239 50334 -25432
2290 -25432 -40897 29943 36658 -42119 -51356 25843 31993 -44936 -43825 41635 45369 -34574 -31023
2303 -31023 53769 48716 -37761 -34034 47209 34111 -54535 -44774 40090 25942 -58681 -40472
2315 -40472 48324 34526 -46490 -24282 61305 40389 -43846 -22734 56764 28650 -56312 -33716
2327 -33716 44193 16001 -61597 -30912 47813 20095 -50783 -14854 60045 27669 -42219 -8242
2339 -8242 56699 16648 -51286 -16295 42392 472 -58840 -16297 42398 2323 -47707 -246
2351 -246 53308 9683 -36784 10113 53323 1524 -43961 3477 39531 -15527 -53343 574
2363 574 34679 -18991 -45389 16311 46178 -11280 -33011 29567 49743 -15633 -35484 26167
2375 26167 36693 -33171 -46116 20962 28432 -40135 -42607 31317 37162 -30611 -27530 45773 42667
2388 42667 -30566 -26591 43607 31860 -44544 -37240 34144 21341 -51373 -35860 39464 26444
2400 26444 -42998 -21940 53231 35207 -37563 -18023 52068 26844 -48164 -27357 41453 13881
2412 13881 -57280 -28817 42968 16112 -50012 -15682 55158 24285 -40990 -6267 57155 17795
2424 17795 -48127 -12858 44816 2150 -57876 -16663 40684 219 -50707 -3603 50991 8524
2436 8524 -38572 8208 54512 5922 -41005 3592 42055 -9510 -51112 -2743 34056 -15272
2448 -15272 -47188 7168 42266 -6823 -33413 20884 46863 -7281 -31320 20191 36593 -21268
2460 -21268 -40393 12848 25415 -29952 -38922 19421 29346 -23988 -24899 34479 36915 -20982 -20979 35582
2474 35582 29067 -33021 -29300 28024 17058 -44107 -31274 31902 19567 -39694 -19258 46075
2486 46075 28148 -33673 -11276 50274 22339 -43280 -18508 41268 8983 -54216 -22614 39643
2498 39643 7964 -49881 -12221 50408 16987 -40070 -2426 55401 16417 -43330 -8165 45552
2510 45552 3929 -54139 -15901 38901 152 -51458 -8065 47110 8512 -39852 3521 52814
2522 52814 9745 -38545 2386 43766 -3059 -47495 -5035 33354 -11441 -46481 1037 37766
2534 37766 -4988 -33406 14788 44142 -2475 -28809 16369 36948 -13705 -36510 9253 24318
2546 24318 -24343 -38059 13085 26183 -20816 -25617 27017 33446 -15204 -18102 30889 27196 -26105
2559 -26105 -23256 23844 15569 -37329 -27750 23343 14356 -34277 -17811 36133 22658 -26933 -8434
2572 -8434 42638 21407 -32547 -13541 34914 9028 -44116 -19886 30814 5058 -43506 -12433
2584 -12433 40089 12465 -34577 -1339 47870 14206 -35396 -2985 41390 2631 -46001 -10246
2596 -10246 34400 -4369 -47532 -5023 40880 1840 -37812 6674 48217 4657 -34920 7967
2608 7967 42756 -5016 -43039 497 32457 -13855 -44918 2247 33987 -8875 -33735 13902
2620 13902 41581 -2871 -27054 16804 37311 -9979 -33390 8950 25716 -20527 -38026 7867
2632 7867 24688 -18511 -28495 19747 32701 -11477 -18869 26347 30338 -17223 -22593 20090 17721
2645 17721 -28956 -27193 17215 12564 -29388 -19122 26724 18698 -21900 -7514 35056 19224
2657 19224 -24202 -8781 30094 8039 -35396 -15202 25233 1398 -38133 -10411 32314 6956
2669 6956 -30671 648 41436 10367 -29342 1757 37756 1128 -39071 -5744 29851 -6850
2681 -6850 -42241 -3797 33256 -2167 -33701 7008 41634 3302 -29150 9387 38917 -3298
2693 -3298 -36146 1955 29348 -12771 -41099 1155 29511 -10506 -33581 11562 37725 -3822
2705 -3822 -25572 17372 36596 -8894 -29220 11942 25858 -19756 -34955 8572 21280 -20462
2717 -20462 -28305 17382 27678 -13079 -17627 25403 29017 -14806 -18928 20651 18746 -24839 -25248
2730 -25248 15033 12555 -27003 -21037 21380 17708 -19666 -10539 29688 20869 -18384 -9577 26197
2743 26197 11657 -27602 -15756 19437 3734 -31520 -13287 23543 6870 -24795 -2156 32403
2755 32403 10750 -21225 2223 31474 3386 -29089 -3754 23336 -7282 -34962 -3301 24414
2767 24414 -6162 -28801 7485 33169 -628 -22511 13302 33584 -5381 -27710 8384 25161
2779 25161 -15720 -34906 5222 23370 -15725 -30156 13400 30993 -9246 -22545 20660 33451
2791 33451 -10979 -25328 16111 25740 -19748 -31692 10964 20273 -22008 -28597 16228 25563 -14679
2804 -14679 -19027 23739 28995 -12864 -18262 20162 20723 -21141 -24342 13916 13376 -25240 -22607 17479
2818 17479 16448 -18997 -12164 26455 20495 -15792 -8245 25499 12874 -23609 -13281 18033 3037
2831 3037 -28983 -12351 19452 3629 -23364 -2263 27521 8463 -17663 3402 28281 4030
2843 4030 -22627 -1153 20600 -5667 -29632 -3777 19115 -6543 -26080 4054 26918 -865
2855 -865 -19382 11479 30002 -2860 -22065 8497 23258 -12932 -29516 3587 18440 -15090
2867 -15090 -27206 10916 25136 -9270 -19358 18828 28218 -9550 -19041 16483 21594 -17889
2879 -17889 -25424 11424 15687 -22025 -24660 14990 19506 -16611 -15886 23404 24009 -13922 -13227 23010
2893 23010 18546 -20933 -19218 16395 10539 -26209 -19843 17164 11822 -21546 -11354 24962 17341
2906 17341 -15874 -6159 26068 13593 -20766 -11086 18633 4284 -27159 -13316 17439 3731
2918 3731 -23616 -5666 24359 8813 -17305 1275 27061 6514 -19888 -1173 20606 -2803
2930 -2803 -26479 -4374 16922 -6054 -24554 2176 22518 -1664 -17649 10226 26315 -2037
2942 -2037 -17881 9392 20772 -10877 -24391 5377 15278 -15866 -24115 9579 19511 -11227 -16241
2955 -16241 18082 24466 -9483 -14824 17925 20052 -16303 -21235 11929 13471 -21495 -22729 13351
2968 13351 15807 -17469 -15854 21310 21862 -13090 -11969 22542 18867 -17954 -16472 16809 11002
2981 11002 -24452 -19003 15695 9853 -22104 -12206 22164 14544 -16025 -5167 25111 12798 -18364
2994 -18364 -7670 19288 4224 -24874 -10883 16041 1527 -23228 -5351 21532 5930 -17235
3006 -17235 2134 25697 5525 -18085 1196 20957 -2654 -24551 -2669 16265 -7125 -24443
3018 -24443 1560 20549 -3047 -17696 9282 25122 -1538 -16286 9517 21217 -7930 -22090
3030 -22090 4323 14930 -13441 -23769 5956 17022 -10205 -16990 14078 22600 -6945 -13445
3042 -13445 15933 19715 -12312 -17585 11473 12275 -19226 -19956 11578 11864 -17464 -13669 18628 16464
3056 16464 -13069 -7798 21973 14729 -16481 -10750 17358 7662 -22740 -14033 15224 5775 -22194
3069 -22194 -9569 20779 10170 -17110 -3421 25014 10966 -18005 -4995 21033 3953 -24549
3081 -24549 -9185 17215 452 -25080 -5786 21207 4309 -18995 1295 26231 6192 -17934
3093 -17934 1431 22649 -31 -23526 -3180 16753 -5591 -25016 -1122 18942 -2828 -18580
3105 -18580 6471 23602 -100 -15060 8929 21063 -5363 -18874 4783 14211 -12004 -21516
3117 -21516 4786 14074 -10614 -16368 11713 18893 -7086 -11403 15304 18050 -10455 -14278 11807
3130 11807 11681 -17117 -17599 10337 9725 -17314 -13338 16494 14188 -13052 -7599 20831 14705 -14671
3144 -14671 -9237 17366 8372 -20969 -13287 14662 5375 -22156 -10495 18932 9304 -17162 -4279
3157 -4279 23938 11003 -16482 -3813 21357 5326 -22387 -8152 16483 364 -24108 -6298
3169 -6298 18693 2503 -18911 587 23548 5130 -15923 2895 21766 416 -20014 -1013
3181 -1013 15949 -5575 -22863 -1192 16131 -4382 -18313 5316 20956 -1062 -14190 8882
3193 8882 20764 -4337 -17208 5690 14948 -10850 -20816 4611 13292 -11368 -17051 10624 17826
3206 17826 -7691 -11916 15053 18423 -9547 -13291 12338 12755 -15805 -17154 9951 9879 -17111 -14859
3220 -14859 14042 13560 -12788 -8757 19147 15097 -12716 -8623 17315 9773 -18590 -12363 13466
3233 13466 5215 -20831 -10819 16052 7079 -16693 -4341 21528 9745 -14660 -2275 20534
3245 20534 5571 -19066 -6186 15591 154 -22234 -6342 16435 1483 -18696 -721 21300
3257 21300 4616 -15491 2387 21654 1768 -18655 -453 16855 -4059 -22233 -1329 15658
3269 15658 -4661 -19167 4047 19782 -1484 -14499 8208 20568 -3202 -15649 6100 15329
3281 15329 -9181 -19325 3919 12402 -10898 -17099 8231 15860 -6957 -11291 13354 17405 -7247
3294 -7247 -11357 11994 12481 -13218 -15061 8709 8439 -15902 -13873 11664 10724 -12565 -8238 17360
3308 17360 13558 -11475 -6891 16966 9961 -16243 -10510 13469 5087 -19915 -10672 14795 6234
3321 6234 -17082 -5587 19593 9155 -14241 -2259 20195 6368 -17444 -5134 15902 944
3333 944 -21178 -6259 15230 770 -18593 -1289 19610 3788 -14866 2474 20783 2113
3345 2113 -16658 475 16436 -3241 -20478 -1463 14482 -4787 -18754 2748 17781 -1674
3357 -1674 -13899 7366 19289 -2252 -13918 6310 15501 -7204 -17665 3498 11756 -10162
3369 -10162 -17232 6011 14171 -7170 -12163 11575 17144 -6116 -10924 11551 14030 -10621 -14460
3382 -14460 8473 9280 -14476 -14646 9913 10189 -12252 -9735 14755 12885 -10101 -6630 15616 10293
3396 10293 -13576 -9170 12214 5368 -17188 -10212 12048 5107 -15309 -5861 16385 8038 -12423
3409 -12423 -2433 18138 7047 -14590 -4387 14680 1704 -18655 -6160 13111 107 -17523
3421 -17523 -2332 16915 3212 -13728 2313 19137 2714 -14143 1444 15757 -2445 -18204
3433 -18204 -1166 12915 -4821 -17916 1432 15492 -2401 -13708 6139 18303 -1557 -12989
3445 -12989 6405 15613 -5696 -16073 3853 11847 -9402 -16602 5090 12671 -7677 -12360 9991
3458 9991 15335 -5836 -9840 11209 13429 -9119 -12246 8512 8999 -12955 -13526 8303 8707 -11779
3472 -11779 -9548 12673 11585 -9043 -6302 14561 10702 -11313 -8458 11496 5828 -15322 -9982
3485 -9982 10607 4816 -14653 -6736 14417 7567 -11560 -2640 16705 7278 -12466 -3525 14102
3498 14102 2541 -16609 -5831 11791 125 -16597 -3281 14327 2208 -12856 1491 17135
3510 17135 2909 -12074 1846 14853 -1189 -15270 -687 11031 -4598 -16027 590 12625
3522 12625 -2879 -12325 5250 15584 -1469 -10719 6416 14061 -4807 -13607 4124 10591 -8518
3535 -8518 -14885 4697 10915 -7764 -11679 8895 13853 -5756 -9111 10636 12974 -8055 -11004
3548 -11004 8224 8977 -11650 -12679 7341 7923 -11352 -10119 10827 10721 -8314 -6385 13371 10775
3562 10775 -9435 -7283 11065 6456 -13412 -9682 9126 4284 -13601 -7252 11633 6294 -10278
3575 -10278 -2732 14333 6876 -9854 -2462 12512 2865 -13130 -4728 9568 -277 -14008 -3214
3588 -3214 11034 1056 -11006 977 14116 2412 -9840 2377 13315 -696 -12859 293
3600 293 10299 -4375 -14582 794 10941 -3694 -11900 4993 14002 -2055 -9747 6999 13557
3613 13557 -4570 -11786 4918 9840 -8357 -13776 4330 9334 -7965 -11143 7697 12118 -5450
3626 -5450 -8029 10045 12206 -6599 -9289 8010 8709 -10153 -11610 6315 6907 -10579 -9838 8772
3640 8772 8882 -7857 -5975 11719 9827 -7627 -5646 10354 6336 -11011 -7789 7888 3423 -12117
3654 -12117 -6730 9606 4723 -9774 -2768 12440 5903 -8568 -1488 11927 2824 -11544 -3608
3667 -3608 9105 -433 -13195 -2950 9910 319 -10739 842 12792 1717 -9045 2714
3679 2714 12604 -487 -11166 698 9501 -4230 -13282 543 9252 -4061 -11040 3939 12045
3692 12045 -1808 -8215 6245 12157 -2952 -9454 4549 8942 -6549 -11737 3009 7407 -7096
3705 -7096 -10131 5614 9535 -4619 -6703 8446 10451 -4803 -6967 7176 7364 -8151 -8969 5467
3719 5467 5036 -9646 -7902 7473 6249 -7694 -4235 10568 7161 -7204 -3161 10185 4413 -9981
3733 -9981 -5014 8109 1411 -11692 -4536 8876 2127 -9749 -1174 11691 3575 -8382 214
3746 214 11795 2025 -10557 -1848 9079 -1083 -12669 -2252 9176 -890 -11017 787 12028
3759 12028 1050 -8692 2938 12326 0 -9858 1353 9395 -3346 -12071 101 7897 -3955
3772 -3955 -10494 2657 10033 -1874 -7474 5319 10771 -2161 -7526 4518 7956 -5350 -9505
3785 -9505 3095 5904 -6823 -8642 5022 7233 -5225 -5477 8028 8263 -4984 -4797 7765 5861
3799 5861 -7881 -6679 5931 3303 -9625 -6220 6949 4104 -7821 -3326 9841 5745 -6697
3812 -6697 -2167 9905 4096 -8974 -4012 7530 1166 -10968 -4461 7856 1543 -9536 -1686
3825 -1686 10465 3407 -7620 306 11222 2244 -8942 -843 8486 -913 -11140 -1878 7574 -1680
3839 -1680 -10116 583 9675 115 -7355 3177 10708 -323 -7561 2598 8299 -3602 -9796 1059
3853 1059 6377 -4822 -9117 2993 7923 -3078 -6409 5808 9115 -2791 -6009 5319 7144
3866 7144 -5346 -7822 3589 4960 -6869 -7687 4647 5857 -5571 -5032 7652 7274 -4722 -3815
3880 -3815 7727 5605 -7033 -5470 5853 2932 -9096 -5767 6259 3012 -7851 -3211 8780
3893 8780 4768 -6013 -1247 9604 3690 -7716 -2373 7527 495 -10163 -3310 6791 -51 -9133
3907 -9133 -956 9105 1401 -7115 1620 10291 1072 -7745 848 8339 -1613 -9699 -245 6895 -2813
3922 -2813 -9512 1291 8395 -1317 -7159 3449 9637 -1009 -7079 3331 8182 -3238 -8936 1728
3936 1728 6266 -4875 -9030 2741 7272 -3669 -6351 5549 8651 -3045 -5369 5905 7085
3949 7085 -5200 -6924 4190 4381 -7366 -7279 4747 4532 -6248 -4529 7305 6152 -4892 -2661
3963 -2661 7901 4947 -6287 -3892 6254 2197 -8533 -4967 5771 1759 -8066 -2639 7956
3976 7956 3087 -6320 -757 9275 3130 -6942 -1315 7779 550 -9261 -2386 6642 -481 -9052
3990 -9052 -1218 8226 909 -6733 981 9220 858 -6555 528 7905 -1580 -9204 -319 5751 -3008
4005 -3008 -8174 1391 7079 -1654 -6403 3712 8330 -1519 -5260 4283 6925 -3579 -7600 3107
4019 3107 4570 -5687 -7487 3719 4700 -4696 -5259 6634 7171 -3954 -4132 7383 5898 -5869
4033 -5869 -5068 5576 3532 -8663 -4960 4807 3269 -6788 -4256 7481 4912 -5861 -2291 8695
4047 8695 4711 -6637 -3330 7077 2473 -8790 -4323 6277 1512 -8640 -2659 8163 2684
4060 2684 -6817 -461 9215 2558 -6989 -325 7906 90 -9275 -1574 6801 -1723 -8715 -244 7806
4075 7806 -601 -6916 2187 9416 35 -6468 2907 8338 -2368 -8080 1538 6357 -3828 -9269
4089 -9269 1517 6307 -3059 -7307 3840 8891 -2775 -5943 4528 8107 -3342 -6948 3465
4102 3465 5668 -5548 -7674 3547 5052 -5217 -6021 5197 6429 -3977 -4114 6311 6146 -4772
4116 -4772 -4762 5357 3829 -6800 -5641 4833 2965 -7086 -4176 6533 3984 -5705 -1895 8145
4130 8145 3855 -6009 -1879 7043 1455 -8153 -2740 6123 106 -8580 -1648 7369 1101 -6795 608
4145 608 8836 1614 -6600 557 7993 -212 -8326 -793 6498 -1791 -8938 -287 7316 -894 -7393
4160 -7393 1851 8965 -90 -6514 2951 8492 -1665 -7700 1761 6518 -3949 -8659 1861 6144
4174 6144 -3647 -6971 4041 7530 -2761 -5277 5174 7297 -3724 -5969 4325 5138 -5839 -6875
4188 -6875 3889 4443 -5946 -5553 5535 5562 -4933 -3644 7035 5493 -5510 -3884 6432 3781
4202 3781 -7369 -4928 5700 2701 -7919 -4038 7023 3660 -6588 -2261 8590 4224 -6401
4215 -6401 -2170 7903 2471 -8137 -3187 6679 958 -8810 -2693 7226 1348 -7525 -562 8796
4229 8796 2170 -6561 311 8451 650 -7917 -468 6712 -1495 -8958 -380 6803 -1411 -7433 1674
4244 1674 8161 -629 -6106 3023 8073 -1779 -6753 2464 6154 -3832 -7730 2207 5636 -4109 -6662
4259 -6662 3935 6839 -3306 -5255 5352 7138 -3801 -5599 4679 5480 -5693 -6785 4115
4272 4115 4782 -6280 -6110 5486 5918 -5095 -4533 7145 6260 -5257 -4441 6495 4694 -7053 -5348
4287 -5348 5504 3080 -7628 -4561 6361 3471 -6531 -2514 7818 3864 -5803 -1601 7503 2417
4301 2417 -7229 -2570 6251 652 -8007 -2281 6291 641 -7187 -287 7774 1240 -6087 902 7937
4316 7937 257 -7097 257 6586 -1734 -8047 216 6308 -2200 -7366 2064 7627 -1266 -6168 3398
4331 3398 7752 -2028 -6602 3020 6498 -3969 -7807 2500 5849 -4469 -7049 3873 6941 -3555
4345 -3555 -5501 5530 7252 -3860 -5666 5121 5763 -5730 -6527 4492 4529 -6632 -6120 5457
4359 5457 5078 -5659 -4193 7147 5720 -5295 -3648 6953 4432 -6818 -4552 5947 2938 -7783
4373 -7783 -4480 6345 3088 -7005 -2822 7830 3948 -6314 -1922 7886 2951 -7234 -2621 6783
4387 6783 1370 -8209 -2614 6738 1074 -7611 -1178 8036 1675 -6611 185 8211 840 -7042 -27
4402 -27 7062 -957 -8135 -283 6388 -1595 -7394 945 7192 -936 -5920 2715 7583 -1256 -5859
4417 -5859 2605 6228 -3078 -6933 2004 5106 -4039 -6587 3104 5774 -3425 -4998 4946 6517 -3329
4432 -3329 -4498 4909 5363 -4802 -5562 4223 4114 -6208 -5555 4855 4225 -5584 -4041 6502 4900
4447 4900 -5242 -3092 6833 4117 -6384 -3875 6129 2523 -7500 -3907 6141 2575 -7053 -2505
4461 -2505 7611 3149 -6318 -1297 8074 2502 -7054 -1821 6937 763 -8212 -2035 6519 421 -7571
4476 -7571 -595 7783 943 -6623 807 8031 514 -6912 544 7116 -985 -7829 -185 6303 -1888
4491 -1888 -7707 1018 7117 -1185 -6465 2402 7817 -1170 -6344 2691 6952 -2653 -7148 2055 5778
4506 5778 -3828 -7279 2740 6002 -3307 -5643 4237 6576 -3062 -4773 4640 5543 -4164 -5438 3959
4521 3959 4137 -5320 -5487 4016 4213 -5005 -4082 5629 4710 -4473 -3147 6161 3906 -5508 -3455 5405
4537 5405 2507 -6680 -3557 5447 2085 -6478 -2134 6537 2602 -5857 -1001 7492 2256 -6186 -1339
4552 -1339 6690 731 -7647 -1753 6255 -27 -7635 -722 7200 549 -6781 711 8151 632 -6695
4567 -6695 736 7309 -907 -7709 104 6500 -1710 -7687 808 6798 -1275 -6600 2181 7274 -1229
4582 -1229 -6065 2420 6605 -2270 -6451 1868 5491 -3254 -6517 2302 5274 -3055 -5223 3512 5869
4597 5869 -2637 -4280 4167 5276 -3552 -4694 3492 3938 -4771 -4978 3537 3433 -4688 -3678 5091 3939
4613 3939 -4266 -2581 5869 3629 -4967 -2678 5333 2054 -6274 -3096 5115 1350 -6472 -2034 6349
4628 6349 1815 -5733 -609 7112 1628 -5941 -373 6635 523 -7065 -995 6129 -476 -7288 -348
4643 -348 6493 -133 -6419 919 7264 96 -6142 1363 6926 -1045 -6977 643 6157 -2084 -7196
4658 -7196 1162 6535 -1797 -6492 2462 7162 -1589 -5839 2760 6685 -2413 -6288 2291 5596 -3259
4673 -3259 -6645 2362 5427 -3120 -5553 3428 6021 -2674 -4722 4123 5493 -3311 -4678 3668 4243
4688 4243 -4591 -5054 3505 3479 -4763 -4026 4329 3719 -3981 -2580 5256 3606 -4046 -2266 4783 2309
4704 2309 -5137 -2673 4315 1292 -5470 -2060 4833 1510 -4919 -690 5951 1493 -5005 -272 5694
4719 5694 479 -5900 -601 5280 -684 -6355 -161 5758 -541 -5940 1033 6534 -330 -5444 1597
4734 1597 6367 -1222 -6200 1151 5411 -2416 -6654 1447 5573 -2373 -5699 2496 6160 -1804 -4935
4749 -4935 3157 6003 -2490 -5346 2723 4968 -3529 -5820 2520 4475 -3597 -5022 3545 4965 -3078
4764 -3078 -4015 4249 4905 -3356 -3982 3944 3854 -4257 -4235 3539 3030 -4663 -3731 4111 3194 -4179 -2459
4781 -2459 4990 3118 -4164 -2118 5013 2277 -5022 -2315 4552 1126 -5531 -1881 4983 1266 -4892
4796 -4892 -661 5707 1365 -4764 -139 5669 483 -5602 -400 4803 -696 -5924 8 5016 -932
4811 -932 -5286 1167 5682 -620 -4608 1899 5712 -1182 -5116 1587 4828 -2396 -5713 1483 4582
4826 4582 -2642 -5163 2484 5196 -2226 -4448 3388 5403 -2439 -4549 3260 4488 -3707 -5084 2987
4841 2987 3957 -4077 -4629 3773 4345 -3778 -3687 4591 4445 -3797 -3435 4492 3656 -4704 -3800 4016 2930
4858 2930 -4882 -3504 4305 3048 -4314 -2512 4906 3170 -4212 -2113 4849 2335 -4714 -2337 4218
4873 4218 1383 -4921 -2036 4227 1026 -4406 -799 4836 1133 -3905 68 4863 535 -4438 -128
4888 -128 4032 -654 -4873 78 3853 -1107 -4412 1120 4462 -921 -3787 2092 4705 -1413 -4023
4903 -4023 2195 4091 -2611 -4625 2157 3773 -3353 -4201 3014 4165 -3046 -3580 3909 4314 -3365 -3712
4919 -3712 3960 3849 -4197 -4140 3654 3243 -4603 -3943 4099 3555 -4152 -3025 4973 3853 -4105 -2901
4935 -2901 4862 3289 -4741 -3360 4345 2325 -5259 -3154 4501 2538 -4826 -2264 5298 2774 -4350
4950 -4350 -1705 5186 2230 -4845 -1927 4432 1229 -5260 -1728 4408 904 -4789 -936 4800 911
4965 911 -4117 32 4855 427 -4256 240 4280 -527 -4534 132 3775 -1196 -4350 985 4081
4980 4081 -1192 -3650 1894 4272 -1416 -3630 2140 3777 -2363 -4023 2150 3137 -3020 -3741 2825
4995 2825 3479 -2871 -3053 3883 3723 -3094 -2920 3991 3139 -4115 -3353 3726 2336 -4696 -3319 4102
5011 4102 2597 -4335 -2486 4902 3104 -4230 -2070 5010 2619 -4844 -2354 4616 1748 -5332 -2411
5026 -2411 4520 1589 -5165 -1636 5325 1790 -4752 -922 5415 1531 -4751 -965 4740 460 -5301
5041 -5301 -1001 4490 179 -5021 -393 4793 544 -4355 406 5036 132 -4506 396 4414 -685
5056 -685 -4643 265 4086 -1189 -4520 954 4185 -1183 -3708 1848 4314 -1361 -3336 2194 3621
5071 3621 -2226 -3781 2062 2827 -2998 -3526 2617 2911 -2885 -2749 3537 3188 -2863 -2175 3758 2719
5087 2719 -3753 -2410 3637 1790 -4483 -2500 3852 1518 -4559 -1681 4817 2018 -4458 -1285 5385
5102 5385 1804 -4772 -1409 5001 997 -5596 -1394 4999 766 -5545 -1020 5527 1093 -5219 -410
5117 -410 5951 974 -5280 -460 5416 312 -5861 -620 4973 -174 -5671 -297 5348 129 -4875
5132 -4875 524 5567 -72 -4770 581 5010 -710 -5174 455 4395 -1266 -4956 825 4474 -1268
5147 -1268 -4165 1748 4499 -1166 -3597 2081 3934 -1922 -3724 1830 3121 -2612 -3644 2028 2859
5162 2859 -2624 -2919 2827 2961 -2557 -2069 3392 2619 -3085 -2134 3220 1699 -3839 -2250 3343 1367
5178 1367 -4041 -1555 4221 1542 -3868 -743 4815 1095 -4418 -629 4674 354 -5178 -563 4657
5193 4657 -4 -5333 -135 5270 172 -4908 517 5610 -22 -5110 568 5377 -632 -5800 233
5208 233 5106 -1049 -5775 697 5367 -976 -5321 1423 5827 -788 -5054 1613 5532 -1266 -5327
5223 -5327 1235 4811 -1995 -5390 1494 4767 -1822 -4801 1996 5081 -1666 -4229 2250 4669 -2034
5238 -2034 -4321 2121 4015 -2549 -4242 2150 3523 -2665 -3641 2840 3456 -2471 -2898 3138 3066 -2830
5254 -2830 -2547 3107 2243 -3493 -2438 3057 1662 -3577 -1743 3556 1591 -3474 -869 4004 1181
5269 1181 -3690 -497 4043 326 -4297 -654 3881 -188 -4742 -88 4349 -275 -4442 701 5001
5284 5001 -281 -4414 1023 4934 -941 -5147 939 4807 -1675 -5373 1307 4999 -1678 -5257 1907
5299 1907 5490 -1531 -5037 2305 5540 -1952 -5318 2099 5131 -2510 -5524 2107 4915 -2483 -4961
5314 -4961 2566 5158 -2381 -4668 2856 4998 -2615 -4709 2555 4310 -3072 -4622 2644 4056 -2993
5329 -2993 -4134 2987 4040 -2679 -3487 3248 3892 -2805 -3259 3034 3051 -3308 -3230 2886 2442 -3413 -2556
5346 -2556 3158 2142 -3117 -1715 3580 2083 -3007 -1189 3686 1188 -3509 -967 3238 224 -3994
5361 -3994 -447 3550 -114 -3855 390 4077 -189 -3652 1157 4249 -1104 -4243 1236 4013 -1789
5376 -1789 -4570 1565 4369 -2073 -4504 2354 4850 -2094 -4459 2787 4990 -2497 -4802 2678 4656
5391 4656 -2960 -5175 2673 4682 -3259 -5146 3155 5245 -2884 -4706 3381 5258 -2986 -4918 3237
5406 3237 4745 -3474 -5132 2850 4411 -3408 -4706 3159 4453 -3132 -3903 3505 4263 -2900 -3615 3266
5422 3266 3620 -3270 -3680 2995 2947 -3460 -3150 3096 2563 -3310 -2327 3551 2403 -3124 -1546 3566 1675
5439 1675 -3534 -1370 3333 837 -3756 -929 3432 452 -3564 -164 3772 174 -3425 496 3958
5454 3958 -341 -3758 637 3696 -1104 -4195 871 3860 -1559 -4107 1732 4248 -1623 -3894 2346
5469 2346 4456 -2066 -4030 2368 4119 -2870 -4600 2592 3948 -3071 -4422 3000 4214 -2939 -3939
5484 -3939 3478 4131 -3142 -3906 3671 3962 -3734 -4226 3395 3684 -3945 -4072 3631 3764 -3836 -3587 4140
5501 4140 4024 -3701 -3444 4087 3516 -3918 -3365 3898 3053 -4352 -3471 3828 3001 -3942 -2766 4155 2938
5518 2938 -3793 -2284 4125 2369 -4069 -2288 3805 1704 -4089 -1960 3768 1536 -3796 -1298 3916
5533 3916 1251 -3523 -530 3853 854 -3428 -385 3419 11 -3737 -84 3256 -658 -3722 600
5548 600 3434 -751 -3168 1490 3538 -1370 -3114 1890 3282 -2048 -3436 1985 3088 -2649 -3400
5563 -3400 2541 3231 -2903 -3088 3245 3553 -3013 -3184 3640 3375 -3604 -3338 3596 3092 -4080 -3492 3943
5580 3943 3233 -4124 -3365 4407 3451 -4105 -3053 4559 3311 -4477 -3186 4463 2894 -4786 -3313 4321
5596 4321 2884 -4527 -2834 4549 3133 -4184 -2339 4512 2680 -4290 -2639 4070 2184 -4345 -2553
5611 -2553 3953 1961 -4226 -1923 4117 1946 -3706 -1388 4079 1679 -3537 -1064 3788 839 -3938
5626 -3938 -857 3413 300 -3647 -353 3359 0 -3122 480 3404 -326 -2916 837 3140 -984
5641 -984 -3000 1067 2712 -1670 -2926 1683 2752 -2101 -2730 2448 2822 -2194 -2397 2702 2555 -2996
5657 -2996 -2635 3077 2349 -3493 -2584 3308 2429 -3666 -2432 4072 2541 -3834 -2293 4296 2412 -4147
5673 -4147 -2572 4212 2266 -4557 -2519 4391 2055 -4723 -2416 4738 2518 -4623 -2162 4891 2545
5688 2545 -4600 -2082 4746 2037 -4877 -2305 4511 1926 -4781 -2068 4430 1935 -4293 -1502 4470
5703 4470 1721 -4152 -1343 4263 1374 -4166 -1370 3735 796 -3905 -876 3553 640 -3405 -345
5718 -345 3611 327 -3005 103 2934 -294 -2952 289 2834 -805 -2935 668 2522 -1054 -2473
5733 -2473 1496 2421 -1472 -2133 2048 2391 -2033 -2231 2327 2025 -2673 -2212 2533 1688 -3206 -1843 3314
5750 3314 1934 -3299 -1629 3735 1952 -3632 -1543 3770 1374 -4258 -1733 3968 1481 -4365 -1669
5765 -1669 4261 1541 -4222 -1336 4600 1460 -4505 -1272 4734 1433 -4777 -1484 4515 1213 -4773
5780 -4773 -1356 4611 1235 -4658 -1005 4967 1256 -4484 -967 4436 1096 -4455 -1043 4199 684
5795 684 -4436 -1009 4143 657 -3994 -514 4003 667 -3412 -234 3745 226 -3572 -125 3263
5810 3263 -126 -3403 65 2837 -586 -2707 660 2829 -746 -2494 1068 2559 -795 -2163 1202
5825 1202 2009 -1499 -1907 1518 1625 -1951 -1709 1968 1626 -2071 -1161 2503 1178 -2478 -960 2927
5841 2927 904 -3165 -1063 3093 726 -3407 -710 3530 634 -3713 -442 3946 611 -4012 -478
5856 -478 4157 510 -4184 -480 4182 126 -4546 -429 4416 323 -4574 -260 4776 575 -4373
5871 -4373 -29 4803 261 -4608 -281 4624 79 -4713 -325 4277 217 -4399 8 4517 236
5886 236 -4127 164 4393 145 -3915 -114 3808 -17 -3832 -45 3359 -266 -3527 362 3392
5901 3392 -289 -2966 476 2876 -482 -2551 744 2371 -921 -2482 654 1989 -1160 -1928 1161
5916 1161 1695 -1300 -1395 1804 1584 -1671 -1180 2035 1061 -2181 -1023 1951 563 -2648 -473 2616
5932 2616 550 -2749 -219 3078 512 -2670 64 3152 -108 -3358 83 3341 -366 -3779 48
5947 48 3416 -399 -3707 454 3823 -524 -3801 704 4181 -397 -3978 464 4011 -659 -4165
5962 -4165 684 4020 -896 -4241 822 4403 -734 -4219 797 4221 -704 -4076 775 4083 -934
5977 -934 -4272 666 4070 -848 -4133 750 3827 -649 -3528 906 3586 -650 -3394 880 3324
5992 3324 -804 -3191 596 2629 -867 -2642 830 2524 -1011 -2201 1067 2162 -700 -1632 997
6007 997 1451 -1004 -1343 1072 1017 -1552 -1058 1286 669 -1546 -327 1692 277 -1662 230 2084 -121
6024 -121 -2136 383 2266 -597 -2401 575 2406 -1130 -2592 1220 2891 -1121 -2949 1474 3151
6039 3151 -1408 -3229 1585 3235 -1802 -3598 1678 3560 -1800 -3804 1599 3735 -1754 -3712 1925
6054 1925 3981 -1765 -3941 1888 4053 -1791 -4241 1456 3905 -1776 -4067 1692 3870 -1716 -3827
6069 -3827 1842 4118 -1324 -3765 1439 3645 -1369 -3580 1198 3195 -1507 -3489 1235 3155 -1147
6084 -1147 -3048 1181 2823 -997 -2340 1375 2371 -1136 -2150 1200 1865 -1257 -1792 882 1224 -1130
6100 -1130 -992 1234 866 -1311 -615 1407 538 -1318 -91 1349 -236 -1525 315 1619 -809 -1810
6116 -1810 689 1860 -856 -1746 1180 1998 -1187 -2011 1683 2120 -1831 -2517 1691 2359 -1817 -2599 1923
6133 1923 2422 -2152 -2619 2561 2991 -2228 -2904 2348 3138 -2452 -3090 2362 2911 -2863 -3199 2699 3287
6150 3287 -2625 -3363 2606 3408 -2419 -3090 2567 3210 -2483 -3358 2483 3297 -2514 -3370 2156 3029 -2122
6167 -2122 -2966 2114 2936 -1984 -2782 2216 2841 -1917 -2766 1499 2353 -1800 -2307 1624 1969 -1757 -1912
6184 -1912 1712 1993 -1377 -1405 1405 1234 -1147 -1015 1227 622 -1550 -623 1404 414 -1429 -42 1186
6201 1186 -132 -1243 595 1645 -577 -1519 937 1694 -1011 -1544 1188 1426 -1711 -1667 1814 1668 -2009
6218 -2009 -1867 2073 2037 -2084 -1793 2522 1882 -2544 -2030 2757 2204 -2930 -2427 2743 2299 -2912 -2373
6235 -2373 2982 2481 -3148 -2507 3361 2767 -3104 -2698 3057 2741 -3046 -2755 2901 2605 -3224 -2587 3246
6252 3246 2827 -2894 -2694 2863 2781 -2727 -2429 2725 2518 -2888 -2646 2665 2459 -2522 -2345 2299 2173
6269 2173 -2002 -1841 2298 1937 -2110 -1558 2098 1646 -1845 -1473 1536 1059 -1726 -1142 1642 722 -1561
6286 -1561 -628 1649 528 -1196 -86 1246 -161 -1010 443 1151 -810 -1288 760 1153 -944 -1194
6302 -1194 1324 1045 -1584 -853 2006 1229 -2044 -1217 2161 1274 -2328 -1283 2481 1070 -2931 -1153
6318 -1153 3253 1479 -3176 -1395 3292 1672 -3185 -1365 3542 1351 -3725 -1677 3734 1664 -3939
6333 -3939 -1935 3803 1950 -3580 -1675 4013 1860 -3759 -1853 4061 2007 -3803 -2302 3515 1966
6348 1966 -3681 -2013 3476 1793 -3579 -1862 3576 2152 -3216 -1920 3069 2070 -2925 -1667 2815
6363 2815 1502 -2980 -1605 2628 1657 -2544 -1413 2297 1302 -1921 -915 2114 716 -2094 -632
6378 -632 1752 436 -1675 -393 1322 -139 -1296 521 1346 -608 -1076 776 1273 -734 -943 1035
6394 1035 708 -1518 -733 1634 710 -2133 -985 2186 930 -2178 -728 2548 787 -2785 -738 3061
6410 3061 763 -3211 -1007 3165 804 -3402 -949 3359 772 -3720 -868 4038 1181 -3874 -1189
6425 -1189 4005 1272 -3848 -1124 3944 988 -4218 -1278 4206 1397 -4170 -1579 3876 1436 -3604
6440 -3604 -1166 3838 1283 -3765 -1290 3748 1327 -3809 -1448 3309 1143 -3113 -997 3155 1246
6455 1246 -3166 -802 3163 1145 -2865 -1002 2351 760 -2452 -652 2208 265 -2374 -335 2242
6470 2242 340 -1947 6 1706 82 -1374 451 1353 -780 -1502 727 1197 -938 -1119 1039 789
6486 789 -1470 -589 1922 788 -1900 -811 2118 756 -2166 -524 2289 337 -2756 -227 3046
6501 3046 448 -3172 -516 3185 587 -3152 -301 3403 263 -3603 -379 3936 335 -4077 -652
6516 -652 3919 589 -4030 -439 4089 450 -4241 -515 4514 729 -4458 -781 4248 754 -4175
6531 -4175 -755 4059 607 -4292 -742 4320 916 -4083 -858 4013 968 -3420 -682 3497 483
6546 483 -3713 -559 3434 658 -3445 -774 2994 689 -2591 -403 2814 166 -2536 -169 2579
6561 2579 180 -2205 -250 1695 -15 -1642 227 1385 -638 -1402 685 1493 -482 -1176 695 749
6577 749 -962 -633 1468 545 -1638 -604 1636 522 -1726 -367 1961 180 -2129 163 2698 82
6593 82 -2839 -51 2846 -112 -2910 76 2905 -483 -3349 414 3537 -199 -3717 291 3807
6608 3807 -148 -3461 362 3831 -440 -4038 311 4121 -261 -4403 93 4144 -55 -4072 273
6623 273 4143 -213 -4111 281 4361 -55 -4347 -211 4013 109 -4081 -47 3960 -111 -3936
6638 -3936 277 4076 121 -3793 -127 3542 160 -3384 -68 3023 -365 -3153 183 3207 -21
6653 -21 -2936 -23 2480 20 -2100 435 2087 -463 -1963 473 1700 -575 -1680 404 1065 -734
6669 -734 -791 1093 731 -1201 -686 1285 713 -1255 -352 1365 -4 -1676 156 2033 -369 -2350 185
6686 185 2306 -323 -2344 529 2430 -774 -2711 981 3185 -876 -3493 745 3416 -756 -3524
6701 -3524 939 3446 -1081 -3745 1206 4111 -1011 -4144 827 4166 -648 -4105 857 4023 -911
6716 -911 -4312 929 4340 -702 -4253 384 4250 -388 -3855 555 3879 -676 -3910 525 3853
6731 3853 -390 -3941 23 3526 -212 -3205 353 3093 -418 -3000 489 3166 -90 -2739 56
6746 56 2432 -147 -2205 307 2003 -671 -1875 644 1980 -496 -1653 402 1231 -541 -935 980
6762 980 809 -1083 -732 1261 532 -1127 -364 1181 3 -1379 503 1674 -449 -1853 477 2083
6778 2083 -520 -2056 627 1973 -1157 -2371 1123 2614 -1273 -2791 1198 2887 -1063 -2763 1394
6793 1394 2927 -1361 -3070 1604 3394 -1688 -3728 1336 3473 -1419 -3591 1324 3563 -1616 -3666
6808 -3666 1792 4118 -1432 -4086 1277 4118 -1183 -3841 1071 3592 -1344 -3999 1335 4051 -1082
6823 -1082 -3994 786 3783 -573 -3406 707 3234 -882 -3313 817 3410 -681 -3275 476 2931
6838 2931 -342 -2324 446 2278 -584 -2251 577 2127 -453 -2119 222 1561 -391 -1217 541
6853 541 1090 -797 -882 945 1026 -647 -523 624 227 -756 252 1108 -533 -1390 350 1353 -570 -1373
6871 -1373 745 1259 -940 -1257 1525 1762 -1519 -2012 1497 2254 -1429 -2170 1528 2176 -2053 -2423 2049
6888 2049 2619 -2104 -2987 1852 3084 -1801 -2881 1889 2889 -2142 -3037 2195 3197 -2204 -3605 1774
6904 1774 3374 -1698 -3280 1707 3227 -1795 -3355 2062 3684 -1689 -3572 1496 3399 -1362 -3352
6919 -3352 1344 3052 -1413 -2959 1519 3251 -1178 -3146 993 2825 -861 -2609 830 2202 -1211
6934 -1211 -2370 998 2346 -819 -2185 545 1822 -441 -1294 689 1142 -794 -1102 789 1190 -696
6950 -696 -1021 392 416 -454 -146 609 -266 -1079 336 987 -225 -880 392 658 -882 -869 1262 1207 -1422
6969 -1422 -1417 1431 1494 -1349 -1478 1565 1357 -1863 -1390 2179 1765 -2387 -2120 2163 2143 -2150 -2173 2163
6987 2163 2050 -2387 -2218 2758 2659 -2538 -2863 2412 2844 -2231 -2732 2172 2618 -2430 -2770 2400 2979
7004 2979 -2407 -3245 1908 3185 -1704 -2793 1731 2707 -1877 -2798 1815 2962 -1673 -3100 1115 2774
7020 2774 -1048 -2498 1025 2239 -1136 -2121 1253 2385 -912 -2192 631 1901 -451 -1522 569
7035 569 1149 -746 -1207 899 1303 -432 -1067 372 783 -91 -207 330 14 -515 124 498 -185 -506 312
7054 312 354 -698 -344 1161 579 -1274 -705 1405 870 -1310 -797 1446 543 -1868 -726 2223 851
7071 851 -2458 -1365 2335 1396 -2088 -1362 2382 1279 -2693 -1321 2852 1598 -3070 -1936 2717 2073
7087 2073 -2570 -1961 2616 1744 -2705 -1841 3026 2230 -2766 -2486 2572 2570 -2288 -2292 2356 2224 -2480 -2244
7105 -2244 2556 2489 -2315 -2569 2069 2630 -1722 -2285 1562 2045 -1800 -2100 1648 2085 -1455 -2161 1143
7122 1143 2117 -735 -1614 777 1249 -773 -1312 921 1544 -742 -1402 214 1017 -105 -541 89 185 -183
7140 -183 -124 335 176 -197 -44 2 -213 441 816 -250 -1162 -119 1160 113 -1185 -66 1266 -142
7158 -142 -1625 102 2062 174 -2306 -334 2276 624 -2256 -444 2350 374 -2649 -406 2938
7173 2938 725 -3057 -1031 2889 1229 -2720 -1078 2673 920 -2991 -1130 3178 1402 -3165 -1697
7188 -1697 2927 1819 -2540 -1570 2518 1584 -2645 -1427 2814 1682 -2695 -2077 2212 1873 -2000 -1697
7204 -1697 1718 1487 -1916 -1457 2031 1788 -1670 -1881 1448 1773 -956 -1413 924 967 -1188 -1043 1162
7221 1162 1073 -865 -1145 494 849 -157 -489 335 139 -386 56 376 13 -245 52 -73 -210 208 670
7240 670 -114 -880 71 1001 200 -1052 64 1011 -345 -1302 354 1611 -459 -2106 -83 2011 176
7257 176 -1899 109 1953 -202 -2140 388 2598 -66 -2808 -317 2718 408 -2587 -305 2479
7272 2479 -92 -2799 -91 2939 339 -3116 -628 3043 904 -2540 -632 2663 467 -2899 -501
7287 -501 2841 835 -2851 -1029 2654 1143 -2329 -1041 2270 754 -2237 -774 2414 1050 -2375
7302 -2375 -1288 1923 1235 -1535 -937 1363 725 -1473 -685 1564 861 -1372 -1061 908 824 -767 -628
7319 -628 404 234 -634 -236 649 373 -380 -420 80 224 452 233 -357 -576 144 658 -261 -637 303 588
7339 588 -743 -889 916 1418 -884 -1581 702 1831 -390 -1640 688 1607 -858 -1982 1042 2338
7355 2338 -994 -2561 638 2618 -469 -2439 364 2470 -717 -2732 768 2835 -582 -3163 294
7370 294 3180 -18 -2779 40 2645 -355 -2864 362 3175 26 -3077 -136 3001 361 -2689
7385 -2689 -317 2472 124 -2575 -147 2808 451 -2593 -767 2239 885 -1786 -497 1693 331
7400 331 -1839 -442 1763 519 -1770 -755 1229 694 -931 -459 673 221 -747 -35 868 265 -655
7417 -655 -367 159 154 258 18 -346 -472 379 497 -157 -382 392 361 -633 -513 1014 1011 -1103 -1365 1012 1448
7438 1448 -798 -1280 1065 1224 -1190 -1342 1354 1901 -1378 -2180 1284 2302 -1088 -2171 1050 2030
7454 2030 -1358 -2330 1393 2571 -1235 -2936 999 2908 -616 -2664 755 2533 -950 -2649 967
7469 967 3027 -764 -3113 460 2927 -259 -2616 239 2506 -284 -2517 540 2773 -215 -2621
7484 -2621 -73 2446 205 -2141 -42 1833 -43 -1840 121 1923 118 -1963 -396 1584 560
7499 560 -1176 -397 806 -1 -784 121 941 317 -764 -211 454 375 16 76 -301 -367 246 449 -223 -526
7519 -526 393 183 -627 -420 1119 678 -1092 -1040 1073 1284 -880 -1058 1127 927 -1317 -1196 1649 1490
7537 1490 -1636 -1801 1511 2021 -1358 -1741 1392 1741 -1661 -1894 1858 2276 -1664 -2514 1461 2525 -1251
7554 -1251 -2459 1196 2327 -1292 -2415 1555 2657 -1468 -2834 1021 2852 -854 -2539 708 2377
7569 2377 -969 -2422 1060 2591 -872 -2752 544 2594 -307 -2127 283 1987 -368 -1925 445
7584 445 2075 -268 -2142 -2 1855 179 -1359 3 1134 -80 -1117 261 1261 -65 -1149
7599 -1149 -94 740 230 -254 -104 24 -169 -98 380 70 -217 -77 -52 -370 16 847 288 -983 -684 926
7619 926 832 -915 -631 879 658 -1288 -718 1640 885 -1790 -1380 1627 1452 -1442 -1509 1490 1480 -1890
7637 -1890 -1426 2118 1848 -2107 -2140 2035 2259 -1638 -2030 1757 1925 -1936 -2116 2198 2216 -2031 -2558 1699
7655 1699 2632 -1390 -2391 1357 2187 -1415 -2224 1688 2513 -1531 -2641 1132 2503 -902 -2367 753
7671 753 2029 -1164 -1949 957 2123 -886 -2193 632 1957 -244 -1629 308 1473 -483 -1325 477
7687 477 1428 -316 -1399 56 1191 251 -655 53 324 -219 -280 393 381 -302 -299 4 -24 97 568 91
7707 91 -810 -437 853 485 -648 -472 757 283 -1133 -311 1376 516 -1752 -933 1660 1095 -1489 -896
7725 -896 1505 817 -1733 -875 2101 1192 -2246 -1559 2087 1680 -1950 -1589 1835 1445 -2007 -1529 2214
7742 2214 1871 -2300 -2192 1886 2271 -1755 -1962 1603 1944 -1740 -1948 1993 2067 -1854 -2394 1696 2356
7759 2356 -1308 -2072 1291 1829 -1507 -1875 1628 2109 -1336 -2151 983 1952 -800 -1679 727 1606 -771
7776 -771 -1433 917 1603 -718 -1599 453 1421 -180 -1105 46 745 -436 -603 341 663 -310 -690 -29
7794 -29 447 125 -27 -24 -344 -253 468 298 -424 -204 490 -20 -814 52 1155 86 -1422 -347 1464 668
7814 668 -1420 -425 1434 396 -1661 -353 2020 535 -2227 -906 2196 1035 -2076 -1103 1963 1008
7830 1008 -2316 -992 2357 1304 -2471 -1545 2332 1714 -2152 -1689 2158 1535 -2170 -1492 2291 1816
7846 1816 -2261 -2017 2051 2170 -1643 -2033 1636 1822 -1604 -1825 1638 1938 -1746 -2235 1211 2151 -1000
7863 -1000 -1824 814 1609 -887 -1429 1073 1552 -952 -1701 642 1550 -397 -1158 243 930 -431 -811
7880 -811 617 822 -342 -900 110 738 193 -401 -129 -84 -40 132 138 -41 -185 208 -113 -427 213 801
7900 801 -174 -1058 -92 1254 359 -1020 -174 1170 -20 -1293 7 1795 306 -1957 -395 1897
7916 1897 649 -1797 -582 1761 561 -1824 -534 2258 761 -2359 -1047 2289 1146 -2083 -1186
7931 -1186 2019 1012 -2027 -994 2411 1278 -2365 -1579 2200 1705 -2049 -1567 1685 1356 -1835 -1365
7947 -1365 1956 1462 -1940 -1785 1660 1795 -1435 -1637 1214 1320 -1318 -1406 1442 1486 -1306 -1656 1006
7964 1006 1653 -663 -1447 461 1083 -706 -997 714 1069 -703 -1197 388 1128 -5 -706 103 373
7981 373 -165 -350 261 221 -88 -339 -184 77 402 202 -387 -522 159 691 -13 -659 62 647 -242 -706
8001 -706 312 1213 -291 -1570 91 1448 34 -1392 -84 1411 70 -1539 45 1773 160
8016 160 -2083 -380 2090 688 -1905 -504 1790 504 -1996 -416 2116 571 -2354 -975 2142
8031 2142 1091 -2020 -1022 1908 880 -1939 -918 2012 1048 -2101 -1330 1841 1382 -1559 -1355 1489
8047 1489 1106 -1388 -1184 1674 1165 -1618 -1386 1224 1295 -1017 -1284 777 1091 -877 -839 996 995 -969
8065 -969 -1039 617 1160 -370 -877 140 636 -310 -502 326 456 -309 -678 3 448 237 -165 -370 -184
8084 -184 288 296 -153 -190 133 220 -396 -325 460 684 -547 -925 365 1037 -232 -1013 129 1025 -460 -1024
8104 -1024 564 1455 -412 -1695 307 1860 -4 -1509 -114 1530 10 -1647 113 1942 3
8119 3 -2077 -308 1996 378 -1898 -620 1723 476 -1882 -297 2039 529 -2112 -686 2022 963
8135 963 -1794 -968 1574 776 -1564 -762 1641 858 -1758 -1142 1553 1302 -1190 -1132 992 1040 -947 -874
8153 -874 1066 1046 -972 -1207 749 1148 -480 -1007 324 896 -319 -595 397 729 -269 -784 107 748
8171 748 201 -636 -331 197 323 -156 -198 248 273 -145 -447 179 609 81 -839 -592 606 694 -574 -589
8191e89
$$ Imaginary data points
##PAGE= N=2
##DATA TABLE= (X++(I..I)), XYDATA
0 0 0 0 0 0 0 0 -8 8 -8 8 -16 16 -16 24 -32 40 -48 62 -80 96 -111 129 -160 185 -217 253 -297 345 -397 455
30 455 -526 600 -682 773 -878 992 -1114 1251 -1404 1571 -1753 1950 -2173 2412 -2673 2958
46 2958 -3273 3617 -3995 4410 -4867 5375 -5933 6553 -7251 8034 -8925 9940 -11121
59 -11121 12506 -14161 16179 -18714 22009 -26488 32999 -43406 62803 -111478 490949 561540
71 561540 -712302 -322722 828168 309549 -760066 -353318 697563 130933 -871563
80 -871563 -374671 719532 282354 -671604 -258600 703254 334408 -504887 -96108 693585
90 693585 208926 -655562 -226634 558021 128145 -667563 -257913 433917 60053 -521301
100 -521301 -984 574993 86940 -461843 82480 589429 78443 -427604 29570 350102
110 350102 -177418 -485231 86593 329188 -255603 -469700 185297 429197 -122094 -262793
120 -262793 323285 380059 -236828 -258377 382553 318512 -419861 -423835 271391 233113 -433438
131 -433438 -324755 374412 239706 -430962 -185410 592186 370496 -427472 -234057 519545
141 519545 273009 -500779 -263321 446668 103167 -659075 -276695 552085 215403 -579231
151 -579231 -205885 621054 293819 -461228 -82876 641449 173591 -627231 -193400 586000
161 586000 122639 -696553 -279879 508758 121671 -576423 -100007 634704 165377 -548342
171 -548342 -42285 699546 202880 -566385 -154303 508393 44306 -602665 -129756 479809
181 479809 -22125 -608141 -55540 588149 118776 -448798 21329 538933 67180 -401097
191 -401097 66685 448742 -106770 -537437 -27345 372196 -106763 -449530 30804 349400
201 349400 -78593 -275835 231006 425322 -100689 -301250 195400 347916 -167806 -329434
211 -329434 115358 166981 -314414 -302673 241854 237290 -295524 -235169 348060 315630 -215482
222 -215482 -125976 377599 184760 -381010 -177017 382843 114555 -505968 -258783 354555
232 354555 121657 -423072 -103183 475117 143619 -416510 -20857 585488 173870 -489855
242 -489855 -144445 455270 64005 -543409 -145541 438167 -1494 -580733 -73687 587504
252 587504 138768 -489018 -32046 586115 135450 -457338 -15947 505101 -24733 -601061
262 -601061 -96099 477464 -6781 -561837 -85170 471406 56577 -402846 71599 532442
272 532442 40994 -431145 43960 494008 639 -484815 -70571 331940 -95839 -443756
282 -443756 26603 374280 -83755 -379495 130056 463901 5945 -291176 124977 335777
292 335777 -112420 -303406 122239 233796 -248938 -369576 111275 245045 -168725 -223887
302 -223887 205058 241574 -150063 -106046 314747 225914 -248012 -195587 229898 129143 -303038
313 -303038 -192638 203779 39209 -341087 -87932 365830 135097 -302232 -41904 407701
323 407701 143421 -295336 -30284 345776 -19936 -449409 -72906 367661 -27414 -480290
333 -480290 -68834 412947 45803 -362152 73410 490803 21248 -410140 73974 500851
343 500851 -28478 -518219 -51029 390071 -86372 -494084 17738 432269 -75267 -454228
353 -454228 113954 551162 21626 -413839 76391 464615 -41610 -430416 43239 366676
363 366676 -161258 -503008 33019 407437 -72496 -402552 83559 418536 -16358 -283439
373 -283439 164971 388522 -105594 -360523 93778 311928 -150336 -378087 35158 221437
383 221437 -153812 -251353 176706 282623 -125156 -194765 225902 293808 -113854 -188412 146870
394 146870 130183 -232442 -191694 166695 86337 -284528 -174247 229200 154855 -179797 -40665
405 -40665 291003 110325 -218928 -1433 315647 28448 -350646 -99118 244986 -24531
415 -24531 -340498 -34101 279477 -37850 -308967 89471 416169 27110 -308809 65227
425 65227 376278 -23924 -349282 27049 293389 -149042 -432783 44957 368516 -88298
435 -88298 -392770 89681 421329 -22096 -303743 160042 406551 -111975 -390732 111496
445 111496 367919 -162683 -451632 42264 318640 -136397 -345851 152856 376270 -108226
455 -108226 -305126 203876 416163 -91445 -334693 105468 286945 -168218 -340568 98594
465 98594 233868 -215974 -323959 164584 320011 -106277 -220415 193566 283996 -110028
475 -110028 -170451 195332 184569 -231844 -247643 138838 140383 -220232 -198189 146484 119393
486 119393 -163874 -51598 266711 145187 -176987 -56017 243518 94279 -216141 -90649
496 -90649 153071 -36098 -276840 -39230 226012 -15598 -263784 20832 302521 45661
506 45661 -192292 88568 287061 -57664 -276655 75637 268455 -139816 -369420 30095
516 30095 261280 -114387 -290289 133232 316682 -107988 -259331 212397 379960 -114944
526 -114944 -322694 127635 294724 -177578 -349122 109340 249858 -225601 -341146 187640
536 187640 356670 -134004 -285752 205125 359102 -114271 -257685 188207 273546 -225667
546 -225667 -341949 142794 257493 -219775 -333456 137404 269755 -138835 -202298 233409
556 233409 288522 -153024 -208688 219113 254596 -188246 -259155 116711 141449 -216856 -202056
567 -202056 161096 138485 -199725 -133655 235807 203003 -123701 -83166 195883 107757 -173203
578 -173203 -79830 162184 9539 -261246 -108052 166697 33074 -191802 -16509 207654
588 207654 31063 -146153 87345 264461 -11564 -220864 31410 200723 -83194 -254505
598 -254505 21282 154048 -142005 -234086 127394 255487 -94129 -205320 164253 284781
608 284781 -78389 -192508 151859 208596 -196565 -274505 137226 209631 -222058 -299791 148888
619 148888 255608 -148597 -199477 236791 278309 -173831 -208868 251217 268389 -229510 -291474
630 -291474 159635 193682 -248694 -257645 191633 197773 -233518 -197086 280196 281708 -174192
641 -174192 -186019 234264 219113 -203525 -195987 186670 128267 -281947 -224756 196618 166006
652 166006 -217909 -165700 219714 186324 -146266 -71848 249948 136951 -211684 -121323 195080
663 195080 81342 -240313 -145987 135785 32953 -197821 -36405 212679 55556 -167531
673 -167531 17678 247102 66354 -153905 1719 153638 -54939 -207434 10221 139127
683 139127 -105850 -226873 46414 193117 -42553 -135688 126994 201788 -77138 -130717
693 -130717 166207 189347 -162638 -222899 105379 141626 -190768 -204392 142364 147122 -191416
704 -191416 -144393 252380 228492 -172258 -155916 233601 199620 -203099 -181223 189825 117973
715 117973 -287655 -212344 219169 166174 -250465 -182656 255873 219527 -179281 -115225 277327
726 277327 178570 -248672 -170071 241893 143603 -292405 -222520 190680 127892 -243579 -136863
737 -136863 252931 154693 -213072 -87901 295483 177794 -209774 -128125 201731 86540
747 86540 -239473 -125481 170675 33331 -251185 -88972 219049 96490 -164254 -27571
757 -27571 214833 78935 -132636 10522 179894 -14097 -211642 -38833 134866 -40026
767 -40026 -193199 -10662 131251 -35739 -117153 104534 192711 -41986 -126499 110071 173647
778 173647 -83614 -154935 72821 85051 -175282 -164515 127327 118236 -172779 -136411 188387
789 188387 175476 -122059 -80929 212921 132402 -194034 -117169 206139 98669 -266100 -181673
800 -181673 179680 103303 -233415 -119241 243088 134672 -214714 -71230 308505 163804
810 163804 -241198 -129532 240936 102814 -276892 -146104 211702 58221 -296526 -115116
820 -115116 275804 130393 -232875 -78288 284788 141741 -202260 -63584 243609 60298
830 60298 -277725 -112954 214445 50814 -271325 -110737 209676 76624 -190529 -18304
840 -18304 253328 75527 -190719 -12397 238932 46068 -220421 -67050 146156 -23833
850 -23833 -210602 -21088 158714 -27023 -173366 45403 211875 20579 -118699 61731
860 61731 159314 -42300 -131131 60610 103239 -129581 -181734 52786 106761 -104164 -117303
871 -117303 113796 124227 -90000 -54713 186903 133683 -138925 -103558 149791 85605 -185309
882 -185309 -124675 128866 38194 -216933 -85788 212254 98118 -190088 -55497 250263
892 250263 121561 -179301 -50660 222508 45025 -262000 -89591 217179 32458 -285929
902 -285929 -99355 233308 74249 -218548 -24605 280120 81320 -223922 -19603 281971
912 281971 57681 -275944 -90027 211313 16594 -271323 -64384 222522 19765 -242885
922 -242885 -6244 285653 72785 -206302 -5874 246877 35489 -215159 -21979 184591
932 184591 -43183 -257782 -29046 191160 -13450 -202629 12592 204362 18046 -129200
942 -129200 71171 196520 -26898 -164139 39293 148760 -69756 -187849 5916 96911
952 96911 -86453 -131970 85982 137701 -70609 -94367 133890 157710 -68628 -90409 107004
963 107004 77178 -144839 -106341 112010 44632 -188300 -105077 147944 82766 -136185 -33361
974 -33361 194218 78387 -146421 -12565 209661 42051 -217276 -73886 167217 10822
984 10822 -227312 -58211 183326 12204 -210038 3858 262638 60057 -200346 -434
994 -434 251275 37406 -226348 -29601 200461 -32866 -276690 -33119 225267 -5873
1004 -5873 -250072 -4232 257369 39246 -190533 40402 255983 3083 -227989 10462
1014 10462 223066 -34790 -267544 -33340 186387 -32385 -217617 26105 219435 -11380
1024 -11380 -180972 68619 245260 -1447 -185270 29409 174279 -54916 -196969 17905
1034 17905 130776 -92457 -187820 54596 168892 -39608 -121939 88764 160790 -37931
1044 -37931 -89427 97392 108827 -108186 -132677 66520 72782 -123322 -116504 77044 65253
1055 65253 -100859 -39021 154586 90217 -104113 -31122 158118 64440 -138196 -55749 114400
1066 114400 -8550 -187461 -43246 148304 -398 -183996 -7656 201202 42417 -143100
1076 -143100 33846 208762 2541 -187732 17075 192246 -45462 -247597 -19813 181522
1086 181522 -37256 -215914 27560 218215 -17762 -188506 73994 258521 -9500 -211522
1096 -211522 33135 211505 -48324 -236563 8688 176950 -77449 -234459 43121 224936
1106 224936 -28540 -192203 67913 234686 -13279 -169640 65188 188713 -74379 -212887
1116 -212887 35692 161306 -88358 -209984 36639 163339 -50414 -134638 97591 179801
1126 179801 -48809 -123514 98929 157310 -75952 -151454 47156 90676 -108484 -134754 66920
1137 66920 86071 -103534 -92522 121333 125720 -65253 -54294 122362 83973 -99165 -56790
1148 -56790 104881 22685 -160158 -77628 103504 22091 -137844 -29309 137866 32052
1158 32052 -108623 30946 178304 22326 -142056 3640 147561 -20616 -176606 -15768
1168 -15768 122093 -52820 -178074 28128 176020 -21767 -158475 58099 207163 -6037
1178 -6037 -151091 55178 175720 -64895 -201893 34974 163664 -88385 -219594 38727
1188 38727 184578 -49238 -165747 88522 208011 -46547 -158379 97606 198707 -75277
1198 -75277 -200839 45277 149552 -97383 -196237 52638 149595 -85847 -156428 104405
1208 104405 193359 -49212 -132648 96898 165005 -68073 -139434 67990 106468 -118022 -157513
1219 -157513 65112 108673 -97534 -120617 91102 123551 -58922 -61028 121462 105653 -88023
1230 -88023 -78420 96554 63745 -120882 -96885 66632 30092 -115788 -47367 111859 45713
1241 45713 -97572 -6880 147903 56495 -95990 -8490 114793 -6345 -139173 -17552
1251 -17552 103667 -40678 -161056 -143 134970 -10071 -119728 48483 159332 -12602
1261 -12602 -113452 68139 156515 -52741 -164726 28948 125234 -77314 -170682 35982
1271 35982 130482 -71155 -140183 91554 177445 -47273 -131664 92553 171448 -62780 -149971
1282 -149971 64357 123349 -112413 -175008 66336 133455 -100701 -154749 94308 165864 -59307
1293 -59307 -110784 116910 155415 -86517 -132862 96983 123877 -121853 -162590 68806 104005
1304 104005 -110418 -122725 102701 119432 -88445 -82707 136064 133051 -84440 -92859 96329
1315 96329 81755 -112199 -100818 74378 46126 -126336 -84519 100476 75140 -85161 -42103
1326 -42103 119592 76573 -71004 -20232 109909 28263 -118037 -47674 81075 -1548 -126101
1337 -126101 -34416 85672 -1356 -91324 29668 126813 5262 -84813 43293 124677 -17912
1348 -17912 -107176 19656 80732 -69137 -129299 31789 93756 -69426 -118254 68282 134501
1359 134501 -39387 -89553 91647 130635 -67355 -111240 83723 109996 -110918 -152047 64675
1370 64675 104363 -106474 -127562 97381 127131 -85246 -93565 134101 146293 -88925 -114641
1381 -114641 102476 111150 -115275 -134568 77237 83407 -127124 -122162 104075 116750 -91452
1392 -91452 -91247 122293 129945 -73051 -78822 105938 87996 -114177 -105708 82059 63911 -123216
1404 -123216 -103713 82805 71584 -86949 -49333 116659 79379 -77411 -31192 117487 58092
1415 58092 -100585 -56175 72783 9783 -114631 -42907 77167 3847 -98935 -2264 114119
1426 114119 29941 -69884 20185 106817 3157 -83211 15864 78354 -46461 -120201 5105
1437 5105 75591 -45222 -98264 39437 97972 -30859 -66369 80863 114255 -46423 -87692
1448 -87692 65575 90370 -78390 -111874 46142 65292 -97816 -101487 81525 98085 -77110
1459 -77110 -79032 110596 119316 -67223 -75980 99385 85245 -109176 -104351 83561 69435 -128484
1471 -128484 -112441 91875 87757 -96699 -70821 124923 102937 -87035 -61234 128465 89947
1482 89947 -114524 -94749 89923 57207 -126997 -91629 89411 55980 -111026 -57747 123133
1493 123133 84465 -81966 -41527 115949 68098 -89268 -50800 82104 22989 -118135 -61354
1504 -61354 75592 24690 -96649 -33311 93536 42610 -61194 5090 103814 26273 -76290
1515 -76290 -5028 79221 -9336 -100901 -21129 54335 -30120 -86418 18763 80009 -18836 -60498
1527 -60498 55041 99033 -17453 -57884 50514 66537 -60273 -79622 42336 45823 -88434
1538 -88434 -87911 57553 66858 -64609 -54044 92098 84576 -60192 -44918 101961 73467 -94422
1550 -94422 -80191 76580 51151 -113168 -86095 79546 53795 -103483 -56658 119538 84002
1561 84002 -85587 -46671 122219 76419 -98304 -63953 92564 38978 -127430 -75793 91712
1572 91712 43987 -115140 -56881 112135 68793 -82603 -28223 121351 60104 -94887 -41094
1583 -41094 99875 31336 -120499 -63391 77460 20734 -105472 -34535 97004 34392 -79301
1594 -79301 -1974 115160 38631 -76367 -9003 84532 2626 -93987 -20438 58118 -24874
1605 -24874 -96334 -2994 75730 -3445 -61714 28876 87556 1521 -46778 38752 70556 -33344
1617 -33344 -74039 20161 46344 -56097 -79546 24934 46707 -49040 -47286 68020 71148 -41583
1629 -41583 -36410 79384 64924 -61279 -53664 58971 30731 -94062 -62809 66185 32655
1640 32655 -93720 -46468 95586 59398 -70891 -22427 109770 52708 -87550 -34969 95437
1651 95437 26078 -119083 -58396 82297 22048 -110535 -39034 102443 39812 -88267 -11862
1662 -11862 124614 49616 -90394 -24731 101955 24077 -111747 -44313 78949 4661 -115112
1673 -115112 -31926 97093 26562 -87221 -6621 111450 37307 -72694 -1119 93720 7961
1684 7961 -95056 -20046 68699 -13323 -100321 -18013 68759 -1985 -66917 18828 87134 5865
1696 5865 -53125 29993 79794 -12637 -68516 10643 46930 -42467 -75361 15674 43403 -44288
1708 -44288 -55672 47640 66979 -25762 -31765 62617 58113 -42531 -38906 52210 28930 -76533
1720 -76533 -56815 45737 22987 -74339 -39070 67723 38278 -56331 -10526 93419 44725
1731 44725 -65817 -21760 79709 21574 -92159 -41090 64200 4395 -100383 -28731 87343
1742 87343 22534 -84038 -5754 110255 35744 -76576 -2322 99929 10342 -102747 -20693
1753 -20693 81949 -9584 -115145 -21467 88513 4621 -90099 6682 108528 17033 -78245
1764 -78245 15066 105718 4220 -96525 -8206 78138 -17975 -105343 -10635 75046 -14037
1775 -14037 -85851 16193 97276 6068 -65178 25908 89730 -4597 -70289 12354 59721 -33902
1787 -33902 -84255 4851 51007 -32503 -66541 24602 63970 -13278 -35567 48113 64595 -22884
1799 -22884 -40695 38086 39931 -49403 -55818 24174 19534 -58526 -40419 46376 31185 -45796
1811 -45796 -13485 73089 41161 -43307 -9384 66088 14941 -71419 -23479 54536 -6032 -88513
1823 -88513 -21340 67895 6004 -72410 4405 91457 16660 -65805 14611 94536 2823 -88659
1835 -88659 -5983 75187 -17120 -102513 -10153 76038 -12627 -88821 13041 100303 6231 -75206
1847 -75206 21761 102087 1147 -85203 5723 78334 -24285 -103042 -3143 73981 -22790
1858 -22790 -91554 14338 91870 -1799 -66324 32373 93485 -8244 -71035 22114 71357
1869 71357 -31544 -86726 6602 53434 -36805 -73368 22690 63004 -21712 -46200 46431 71903
1881 71903 -18043 -42302 38609 48081 -40578 -53649 25338 25418 -56736 -50361 36681 33619 -42614
1894 -42614 -24654 59351 43032 -34584 -10936 62476 25653 -57923 -26983 46921 4230 -73711
1906 -73711 -28428 49972 5673 -62762 -3097 75124 18852 -54020 9165 81791 11119 -67860
1918 -67860 -3386 63388 -15246 -87882 -8401 63347 -17398 -82592 10255 84592 -426 -64492
1930 -64492 27810 91172 -5451 -70942 21119 75726 -28798 -91778 6035 63561 -34004 -85302
1942 -85302 19418 76835 -18282 -63140 41017 89353 -14489 -64375 32741 72842 -32792
1953 -32792 -79627 16896 54296 -45496 -79171 25899 64588 -30902 -57666 45687 76346
1964 76346 -21112 -46885 45789 59823 -40632 -59650 31078 39108 -54640 -61203 31229 38525
1976 38525 -43184 -36275 52428 48763 -32214 -20785 58752 39812 -44983 -31849 40554 13724
1988 13724 -62844 -34379 39760 8433 -58507 -13912 61380 21916 -43397 5327 69452 14777
2000 14777 -51238 1389 55859 -11386 -73342 -8757 48540 -18490 -69991 6377 63779 -6673
2012 -6673 -52906 28606 77848 -6176 -56640 25425 67835 -24928 -74702 11829 53028 -39224
2024 -39224 -77480 21819 65167 -28347 -61907 42028 81086 -19663 -56134 42420 70384
2035 70384 -37614 -71267 29899 54468 -53033 -78362 31015 59038 -42167 -58815 50898
2046 50898 72111 -31573 -46791 56478 65436 -43854 -59415 39214 44561 -57780 -63938 35017
2058 35017 40017 -52145 -47015 52443 53940 -35791 -30172 59203 50320 -39992 -34711 44525 26201
2071 26201 -59523 -43984 36801 18285 -57342 -29884 50536 27917 -40801 -6337 64084 26028
2083 26028 -43620 -5656 54454 4460 -61496 -15883 40554 -11483 -63343 -2963 52174 -4605
2095 -4605 -49026 19000 67413 290 -45064 22098 59406 -17981 -60147 13068 46052 -35808
2107 -35808 -69325 16675 53020 -28617 -54882 37088 67660 -21211 -45963 45502 64860 -35007
2119 -35007 -60221 32956 49060 -50612 -68738 30001 47288 -47381 -55172 48740 63550 -33841
2131 -33841 -42945 56589 63493 -39160 -50806 43122 43897 -57401 -61343 37195 38817 -56989 -51847
2144 -51847 50034 50882 -41263 -32423 62381 51841 -42916 -33001 53544 32953 -59585 -43909
2156 -43909 40475 19637 -60679 -33418 49125 25509 -46045 -12543 62342 30097 -40728 -8603
2168 -8603 54077 12834 -54141 -17438 39416 -4987 -61278 -12247 45838 808 -47396 8090
2180 8090 59841 6294 -39472 17381 57419 -8768 -53313 8594 43745 -26823 -63415 8589
2192 8589 43792 -26527 -51484 29800 59603 -18329 -41421 40958 60835 -26549 -49610 31980
2204 31980 44148 -45682 -59985 28673 39726 -48585 -53057 42950 53398 -35248 -37310 55671
2216 55671 56706 -38218 -40863 48850 42455 -55663 -54334 38851 34086 -58399 -48995 47562 42457
2229 42457 -46409 -31880 62529 49826 -43036 -30725 56448 35920 -56134 -40960 42857 20965
2241 20965 -62592 -37206 48058 26540 -49966 -19910 60177 33719 -40926 -12063 57097 21362
2253 21362 -52096 -21499 42827 4752 -61074 -22207 42600 5579 -49607 -2435 56548 12438
2265 12438 -39163 9800 57608 3029 -46423 3632 41748 -17403 -56399 1930 36261 -22512
2277 -22512 -49001 18324 49196 -12400 -34368 32449 52426 -17329 -37569 28626 39868 -35523
2289 -35523 -50938 21674 32722 -41249 -47840 32241 42225 -32618 -33211 49080 50669 -32756 -34149
2302 -34149 46434 39954 -47908 -45447 37169 28100 -56616 -43931 44277 34500 -48025 -29868 58619
2315 58619 43638 -41197 -24043 57664 33911 -53353 -34555 45478 19610 -62987 -36945 45837
2327 45837 22472 -53004 -21423 58755 31114 -42958 -11435 60619 24763 -49996 -19017 46124
2339 46124 7476 -60078 -22681 41367 4216 -52868 -8222 52815 13578 -39500 4630 56171
2351 56171 9754 -41899 1367 43930 -7642 -53525 -4801 35783 -14728 -50190 6264 44547
2363 44547 -6957 -35621 23026 51713 -8509 -35709 22749 41619 -24500 -46539 15772 30477
2375 30477 -34948 -45711 24334 36460 -29046 -32107 40462 45508 -25533 -27520 41567 36331 -39124
2388 -39124 -37456 32683 23898 -49749 -39778 35333 26868 -43147 -26728 49139 36182 -35389 -18343
2401 -18343 53136 32005 -43952 -27503 41833 17896 -55827 -32803 39367 16499 -51685 -21558
2413 -21558 52125 26244 -41443 -10251 58198 24629 -45136 -14313 47851 8976 -57128 -20824
2425 -20824 41075 2942 -54799 -10982 49931 10915 -41738 3045 56043 10776 -41154 1894
2437 1894 46787 -2887 -51155 -5811 36253 -11580 -50838 651 41692 -5086 -37650 15659
2449 15659 50091 -1543 -33073 17168 41837 -14395 -41578 9575 28851 -26353 -43779 12975
2461 12975 30453 -21946 -30474 28270 39164 -15999 -21720 33803 33979 -26559 -29859 25526 20688
2474 20688 -39411 -34569 25788 19649 -37890 -24226 39825 29024 -31172 -14242 47993 27942
2486 27942 -37211 -18771 41043 14035 -50875 -25211 37294 9331 -51016 -17475 47049 17257
2498 17257 -41292 -5595 55081 19375 -41446 -7544 48142 8025 -52680 -16810 39385 1217
2510 1217 -53782 -12522 45726 9221 -42430 93 54189 13270 -39231 531 47854 2535
2522 2535 -48078 -7516 36292 -7749 -50354 -4769 38211 -3482 -38291 9521 46642 2069
2534 2069 -30552 13950 41811 -7520 -37442 7233 29202 -19940 -41829 6863 26613 -19428
2546 -19428 -31434 20158 34818 -12219 -20702 28960 33656 -19134 -24988 22326 20516 -31192 -30899
2559 -30899 19208 16069 -33599 -22567 30305 23148 -24913 -11641 39599 24639 -28271 -13834
2571 -13834 34896 13186 -40749 -21560 29173 6935 -42955 -16598 36920 13455 -34639 -4965
2583 -4965 46260 17009 -33238 -3955 42632 7490 -43540 -11968 33877 -2120 -48229 -10111
2595 -10111 38007 2387 -39619 2689 48421 8289 -34642 6512 45819 186 -42134 -544
2607 -544 35074 -11243 -47745 -1464 34308 -9001 -38758 9687 42502 -1281 -29225 15909
2619 15909 41258 -6074 -33571 8974 29932 -16843 -39588 5062 25690 -17616 -33260 14371
2631 14371 33032 -10052 -22575 23467 34839 -12434 -23884 19314 23429 -24646 -30347 14441
2643 14441 16016 -27984 -24673 22448 20798 -20895 -12166 32378 23273 -20445 -10345 29674 12883
2656 12883 -31778 -17521 22732 3908 -36812 -14644 28511 8182 -30145 -2914 39046 13000
2668 13000 -27152 569 38581 5960 -35757 -6368 30333 -4455 -42782 -7624 31172 -2643
2680 -2643 -36369 2909 40413 4554 -29173 8552 41042 509 -34397 2409 32034 -9746
2692 -9746 -41583 -1622 28911 -10076 -36670 7169 37067 -2753 -27752 15020 39338 -4796
2704 -4796 -30055 10597 29755 -15788 -36419 6278 23793 -19058 -32575 13487 28940 -12351
2716 -12351 -21548 22935 32108 -11650 -20039 20625 23026 -21848 -26942 13823 14780 -26648 -25127
2729 -25127 17971 18262 -20055 -14232 27746 23590 -16295 -10488 27377 16891 -24468 -17277 18992
2742 18992 6448 -31183 -17635 20628 8013 -25610 -7034 30118 13685 -20134 -719 31939
2754 31939 8690 -26050 -5084 24317 -2496 -34138 -7425 22834 -4220 -30249 2353 31202
2766 31202 1070 -23164 10455 34407 -1441 -26341 7334 26953 -11597 -33723 3355 22684
2778 22684 -15174 -32060 9722 29776 -8387 -23667 18365 34445 -7952 -24419 16046 27819
2790 27819 -17491 -32349 9848 21543 -21741 -31634 13594 25595 -15469 -21962 22665 30988
2802 30988 -11570 -18839 21599 25059 -18584 -25354 13639 15903 -24522 -26092 14643 17329 -19826
2815 -19826 -16909 23481 22769 -14576 -10764 25637 18395 -20264 -14700 18877 7668 -27955 -16670
2828 -16670 17757 5684 -24760 -7574 25582 10639 -18019 576 28793 7935 -21095 -2339
2840 -2339 21721 -2105 -28654 -6303 18050 -5184 -26805 344 25159 716 -19646 8844
2852 8844 30041 649 -20883 7209 24602 -8662 -28734 2193 19824 -13761 -29001 6776
2864 6776 23911 -9024 -21280 16137 30119 -6769 -18775 15897 24555 -14510 -25374 10374
2876 10374 17001 -20785 -26745 12034 18950 -17052 -19185 20688 25137 -12204 -14134 22901 22090
2889 22090 -17883 -19329 16682 13290 -25132 -22280 15542 12765 -22273 -15344 22947 18184 -16372
2902 -16372 -8435 26239 16910 -19125 -11480 20018 7831 -26230 -15456 16580 5077 -24613
2914 -24613 -9512 22781 10215 -17766 -1485 27339 10236 -18627 -2592 22054 1387 -25907
2926 -25907 -7116 16586 -4168 -26205 -2326 21289 9 -18644 7243 26994 1580 -16972
2938 -16972 7973 22943 -6398 -23582 3086 15985 -13578 -25649 5707 18355 -11001 -18733
2950 -18733 14738 24610 -7353 -14875 17150 21976 -13190 -20052 12082 14960 -20047 -23457 11483
2963 11483 15496 -17766 -18002 18566 21329 -12653 -12788 22298 21170 -15789 -16782 16837 13606 -22962
2977 -22962 -20763 14394 11207 -22279 -15581 20806 16120 -16446 -8034 25203 16147 -17020 -8785
2990 -8785 20468 7781 -24173 -13198 15676 2940 -24384 -9011 20149 7076 -17802 -921
3002 -921 25468 8627 -16690 141 22276 1540 -23051 -4411 16586 -5077 -25765 -2431
3014 -2431 19106 -2517 -19566 6204 25147 670 -16107 8855 23040 -4767 -21022 4110
3026 4110 16430 -11384 -24600 3533 16503 -9717 -19132 10901 22573 -5324 -14296 14612
3038 14612 21954 -9264 -17931 10335 14738 -16573 -21353 9329 12685 -16775 -16504 15932 17386
3051 17386 -12243 -10009 21032 17526 -13940 -11061 17352 10124 -21338 -15619 13990 6401 -22393
3064 -22393 -12306 18554 10516 -16916 -5192 24437 12883 -16214 -4780 22130 6995 -22892
3076 -22892 -10065 16865 1521 -25593 -8731 19559 4541 -20288 -1352 25542 7774 -17609
3088 -17609 674 24171 3135 -22412 -3720 18290 -3219 -25651 -3875 18412 -2056 -20700
3100 -20700 3331 23831 1551 -16165 6988 23080 -2138 -19144 3744 16416 -9409 -22652
3112 -22652 2438 14345 -9791 -18578 8818 19413 -5430 -12410 14061 20187 -7375 -14107 10911
3125 10911 13552 -14961 -18836 8447 10548 -16679 -16074 13417 14408 -12213 -9197 19531 16481 -12467
3139 -12467 -9301 17703 11032 -18863 -13953 13691 6235 -21728 -12695 16702 9024 -17652 -6508
3152 -6508 22632 12471 -15573 -4558 21990 8285 -20510 -8573 17163 2250 -24353 -9010
3164 -9010 17816 3397 -20238 -2409 23220 6657 -16300 1411 22994 3335 -19601 -1901
3176 -1901 17339 -3195 -23190 -3062 15981 -3582 -19769 2778 20831 321 -14827 7310
3188 7310 21785 -1562 -16678 4787 16540 -8219 -21203 2460 13587 -10396 -19351 7219
3200 7219 17552 -6598 -13193 13521 20031 -6807 -13107 12385 15132 -13390 -17786 8660 10432
3213 10432 -16479 -16758 11814 13163 -12865 -10859 17683 16531 -11064 -9183 17255 12523 -16277
3226 -16277 -13294 13239 7092 -20062 -13018 14665 8117 -16984 -7135 19905 10964 -14244 -3667
3239 -3667 20749 7993 -17845 -6608 16151 2126 -21908 -8158 15433 1807 -19370 -2939
3251 -2939 20440 5738 -15223 1211 22027 4436 -17555 -1248 17738 -1857 -22415 -3511
3263 -3511 15375 -3653 -20719 980 19544 -269 -15207 6795 21699 -793 -15691 5663
3275 5663 17246 -6681 -19650 2625 13327 -9747 -19010 5551 15520 -6795 -13506 11269 18609
3288 18609 -5544 -11744 11380 14938 -10595 -15401 8093 9971 -14615 -15810 9614 11006 -12323
3301 -12323 -10317 15199 14214 -9918 -7495 16663 11923 -14303 -11050 12751 6558 -18686 -12390
3314 -12390 13074 6708 -17022 -7505 18485 10334 -13846 -3733 20230 8829 -16114 -5898
3326 -5898 16216 2921 -20849 -7871 14598 1322 -19498 -3978 18691 4506 -15188 1031
3338 1031 21375 4462 -15743 137 17836 -910 -20136 -2732 14449 -4043 -20052 -39
3350 -39 17177 -1284 -15362 5437 20038 -234 -14085 5556 17116 -4920 -17674 2801
3362 2801 13046 -8749 -18301 4139 14125 -6737 -13641 9608 17485 -4731 -11437 10810 15538
3375 15538 -8740 -14566 7802 10787 -13039 -16024 8098 10626 -12057 -11631 13097 13932 -9149
3388 -9149 -7756 15510 12673 -11708 -9661 12239 7018 -16464 -11753 10771 5695 -15824 -8190
3401 -8190 15074 8720 -12050 -3598 17907 8915 -13170 -4524 15287 3808 -17757 -7563 12493
3414 12493 1270 -18121 -4924 15639 3657 -14215 239 19038 4490 -13793 581 16906
3426 16906 89 -17485 -1856 13441 -3739 -18542 -455 14957 -1897 -14866 4424 18197
3438 18197 -202 -13026 5540 16749 -3672 -16129 2895 12793 -7804 -17648 3225 12892
3450 12892 -7008 -13974 8173 16203 -4587 -10693 10473 15029 -7127 -12575 7851 10361 -11906
3463 -11906 -14620 6888 9136 -11725 -11606 10969 12085 -8529 -7307 14024 12293 -9757 -8359
3476 -8359 11888 7866 -14145 -11079 9615 5527 -14802 -8931 12674 7842 -11652 -4314 16121
3489 16121 8808 -11396 -4150 14524 4868 -15378 -6762 11811 1265 -16879 -5284 13690 3095
3502 3095 -13447 -573 17075 4432 -11970 736 15566 677 -15036 -1553 11955 -3202
3514 -3202 -16635 -1080 12274 -2222 -13233 3419 15463 8 -10716 5611 14954 -2673
3526 -2673 -13164 3298 11262 -7180 -15532 2762 10802 -7188 -13117 6902 13713 -4822 -9607
3539 -9607 10073 14290 -6239 -10827 8274 10462 -10494 -13398 6450 8346 -11309 -11615 9294
3552 9294 10721 -8538 -7685 12613 11930 -8192 -7616 11145 8425 -12130 -10254 8856 5602 -13498
3566 -13498 -9067 10753 7031 -10696 -4878 13924 8226 -9644 -3451 13064 4968 -12433 -5464
3579 -5464 9835 1177 -14397 -5239 10460 1783 -11412 -659 13790 3676 -9485 1458 13705
3592 13705 1292 -11929 -709 10405 -2958 -14583 -1030 10212 -3229 -12626 2914 13699
3604 13699 -927 -9885 5910 14254 -2561 -11455 4554 11212 -6726 -13937 3334 9547 -7795
3617 -7795 -12483 6091 11751 -5443 -9068 9257 13007 -5405 -9317 8142 10015 -8877 -11844
3630 -11844 6065 7665 -10324 -11108 7716 9237 -7902 -7401 11048 10825 -6991 -6362 10549 7979
3644 7979 -10187 -8675 7671 4590 -12046 -8244 8823 5325 -9792 -4251 12054 6988 -8231
3657 -8231 -2436 12124 4808 -10490 -4135 9238 964 -13099 -4659 9128 790 -11546 -1164
3670 -1164 12164 2847 -9013 1744 13069 1404 -10369 700 10443 -2574 -13211 -698
3682 -698 8912 -3652 -12146 2237 11602 -1521 -8886 5379 12761 -1842 -9441 4301 10043 -5312
3696 -5312 -11851 2569 8006 -6568 -11130 4407 9650 -4472 -7815 7550 11154 -4034 -7363
3709 -7363 7018 8626 -7091 -9607 4857 5844 -8976 -9235 6224 6697 -7483 -5809 9664 8469
3723 8469 -6238 -3923 10152 6253 -8789 -5616 7591 2472 -11531 -6005 7938 2389 -10043
3736 -10043 -2603 10907 4276 -7953 -349 11939 3403 -9586 -1680 9499 -46 -12350 -3174
3749 -3174 8651 -658 -11494 -718 11234 1442 -9032 1871 12498 1037 -9680 1165
3761 1165 10433 -1939 -11986 -434 8422 -3503 -11507 1354 10054 -1552 -8365 4479 11557
3774 11557 -1060 -7824 4176 9125 -4202 -9873 2219 6487 -6244 -9781 3647 7565 -4822
3787 -4822 -6602 6932 9265 -3819 -5226 7488 7332 -6661 -6978 5603 4203 -9000 -7327 6054
3801 6054 4321 -7839 -4504 8870 6176 -6153 -2455 9863 5325 -7796 -4023 7867 2376
3814 2376 -10438 -5364 7040 1746 -9904 -2969 9601 3558 -7855 -445 11119 3589 -8404
3827 -8404 -1346 9163 458 -10865 -2572 7641 -1004 -10653 -673 9559 743 -8085 2041 10976
3841 10976 685 -7798 2008 9075 -2202 -9977 509 6930 -4136 -9888 1643 7803 -2792
3854 -2792 -7030 4765 9608 -1826 -5971 5251 8173 -4138 -7850 3185 5533 -6531 -8723
3867 -8723 3502 5715 -5500 -6228 6442 7709 -4107 -4193 7649 6886 -5670 -5682 5789 3944 -8342
3882 -8342 -6767 5428 3383 -7853 -4472 7875 5051 -6097 -2044 9316 4754 -6901 -2703
3895 -2703 7580 1895 -9420 -3916 6659 609 -9335 -2208 8516 2011 -7330 436 10143 2070
3909 2070 -7430 500 8727 -605 -9607 -920 6947 -2352 -9889 233 8087 -1028 -7569 2928
3923 2928 10079 3 -6910 3240 8835 -2270 -8666 1326 6634 -4416 -9591 1664 7020 -3588
3937 -3588 -7302 4368 8882 -2154 -5826 5573 8240 -3819 -7004 4000 5697 -6391 -7862
3950 -7862 3872 4887 -6263 -6072 6239 6358 -4723 -3687 7756 6118 -5466 -4144 6219 3436
3964 3436 -8122 -5606 5489 2507 -8140 -3853 7349 3830 -6244 -1366 8884 4030 -6488
3977 -6488 -1562 7822 1529 -8959 -3338 6248 -80 -9088 -2060 7824 1296 -7357 593 9445 2092
3992 2092 -6502 826 8505 92 -8421 -662 6111 -2036 -9115 101 7030 -2020 -7349 2486 8221
4007 8221 -447 -5760 3997 7623 -2701 -6883 2027 5340 -4995 -8024 2433 5162 -4723 -6046
4021 -6046 4691 7245 -3457 -3644 6404 7260 -4514 -5172 5419 4206 -6875 -6124 4600 3495
4035 3495 -6817 -4671 6377 4583 -5251 -3153 8509 5303 -6014 -3396 7097 3051 -8197
4048 -8197 -4813 6011 1972 -8666 -3764 7445 3107 -7043 -1276 9275 3645 -6592 -863
4061 -863 8458 1524 -8447 -2175 6562 -777 -9347 -1137 7940 -206 -7599 1174 8990 618 -6533
4076 -6533 1932 8392 -1022 -8066 618 6476 -3034 -9276 928 7036 -2380 -7990 2883 8061
4090 8061 -1671 -5673 4225 9320 -2853 -6597 3396 6170 -4828 -7700 2804 5532 -4835 -6894
4104 -6894 4469 6756 -3101 -5176 6011 7030 -3974 -5106 5074 4790 -6143 -6392 4104 3474
4118 3474 -6803 -5222 5741 4438 -5519 -2839 7705 4941 -5334 -2369 7158 2785 -7385 -3517
4132 -3517 5911 749 -8383 -2788 6711 1249 -7146 -565 8373 2092 -6253 431 8278 860 -7873
4147 -7873 -744 6814 -1163 -8992 -969 6889 -822 -7767 1002 8639 342 -6500 2199 8748 -636
4162 -636 -7633 1198 6909 -2881 -8790 1079 6396 -3250 -7702 2946 7865 -2133 -5908 4599 7910
4177 7910 -2867 -6132 3860 5856 -4925 -7196 3270 4852 -5557 -6407 4807 5748 -4453 -4270
4191 -4270 6665 6395 -4469 -4117 6315 4625 -6577 -5241 5206 3107 -7615 -4865 6231 3716
4205 3716 -6638 -3054 8142 4581 -6061 -2255 8052 3402 -7664 -3404 6642 1688 -8879
4218 -8879 -3444 6929 1860 -7784 -1620 8477 2561 -6780 -377 8596 1591 -7624 -1108 7069
4232 7069 -353 -8763 -1205 6792 -895 -7880 691 8104 152 -6434 2102 8485 -715 -6847 1841
4247 1841 6816 -2969 -8091 1214 5843 -3818 -7414 2818 6918 -2704 -5434 4841 7490 -2958
4261 -2958 -5604 4480 6065 -4836 -6923 3525 4910 -5907 -6686 4588 5749 -4982 -5197 6289
4275 6289 6710 -4617 -4587 6551 5588 -6150 -5643 5580 3825 -7391 -5474 5907 3920 -6576
4289 -6576 -3645 7351 4592 -5847 -2395 7604 3367 -6854 -3007 6247 1493 -8012 -2991 6206
4303 6206 1216 -7280 -1256 7617 1987 -6108 161 8017 1178 -6886 -197 6639 -857 -8058 -642
4318 -642 6169 -1520 -7576 978 7347 -895 -6381 2869 8138 -1096 -6401 2613 7116 -2932 -7682
4333 -7682 1919 5934 -4197 -7792 2813 6642 -3423 -6189 4748 7730 -3102 -5615 4912
4346 4912 6537 -4903 -6679 4137 5125 -6008 -6734 4842 5364 -5490 -5016 6418 6153 -4984
4360 -4984 -4124 6919 5094 -6183 -4847 5729 3508 -7331 -4950 5891 3533 -6966 -3506 7401
4374 7401 4368 -6076 -2329 7847 3848 -6917 -2979 6752 2014 -8288 -3386 6438 1438 -7953
4388 -7953 -1980 7742 2200 -6649 -482 8579 1966 -6767 -608 7382 28 -8138 -1062 6403 -1040
4403 -1040 -8006 60 7121 -425 -6452 1838 7821 -441 -6090 2314 6826 -2065 -6854 1576 5614
4418 5614 -3409 -6967 2228 5847 -2964 -5655 3905 6592 -2754 -4905 4480 6013 -4027 -5720 3728
4433 3728 4564 -5371 -5941 4122 4466 -5250 -4538 5899 5410 -4736 -3523 6597 4733 -5554 -4169
4448 -4169 5658 3174 -7141 -4593 5609 2781 -6946 -3159 7093 3493 -6157 -1859 7865 3242
4462 3242 -6629 -2064 7049 1641 -7997 -2536 6515 775 -7982 -1598 7332 1220 -6883 -109 8231
4477 8231 1335 -6679 153 7454 -261 -7727 -518 6413 -1163 -7728 150 6819 -816 -6591 1731
4492 1731 7808 -501 -6351 2104 7341 -1831 -7266 1473 6141 -3116 -7488 1914 6219 -2900 -6440
4507 -6440 3616 7120 -2523 -5414 4303 6422 -3469 -5676 3677 4929 -4910 -6120 3386 4380 -4937
4522 -4937 -5009 4973 5101 -4208 -3530 5934 4920 -4726 -3698 5261 3325 -6209 -4238 4962 2449 -6454
4538 -6454 -3367 6014 2962 -5573 -1658 7055 2933 -5873 -1525 6734 1722 -7067 -2122 6054 549
4553 549 -7441 -1374 6855 1013 -6679 -68 7895 1168 -6560 249 7476 -79 -7519 -334 6648
4568 6648 -1252 -7959 152 6907 -1041 -6950 1412 7790 -584 -6161 2194 7236 -1414 -6717 1526
4583 1526 5947 -2838 -7156 1584 5492 -2741 -5927 2896 6154 -2189 -4739 3845 5891 -2764 -5060
4598 -5060 3456 4498 -4040 -5332 3171 3866 -4438 -4447 4142 4261 -3955 -3195 5233 4350 -4296 -3062 4987
4615 4987 3000 -5558 -3413 4765 1934 -6047 -2777 5594 2236 -5557 -1446 6719 2232 -5519 -980
4630 -980 6567 1057 -6748 -1413 5761 145 -7165 -964 6286 236 -6404 452 7351 508 -6000
4645 -6000 944 7012 -372 -6808 367 6183 -1593 -7436 384 6234 -1554 -6696 1803 6972 -1055
4660 -1055 -5830 2558 6980 -1625 -6342 2120 6045 -2879 -6943 1785 5488 -3089 -6180 2768 6097
4675 6097 -2289 -5169 3688 6174 -2755 -5019 3459 5042 -3931 -5566 3108 4200 -4286 -4662 3940
4690 3940 4207 -3896 -3444 4927 4298 -3879 -2986 4719 2911 -4805 -3312 4171 1820 -5389 -2771 4669
4706 4669 2071 -4689 -1411 5517 2225 -4530 -757 5657 1117 -5540 -1024 4993 -54 -6314 -844
4721 -844 5212 -211 -6016 486 6365 117 -5353 1245 6646 -571 -5954 991 5529 -1699 -6610
4736 -6610 914 5496 -2017 -6152 1809 6235 -1665 -5292 2605 6272 -1903 -5443 2591 5269 -2910
4751 -2910 -5901 2314 4796 -3461 -5455 2998 5124 -2930 -4482 3907 5447 -2984 -4242 3688 4435
4766 4435 -4006 -4676 3219 3505 -4634 -4327 3811 3677 -3997 -3067 4853 3772 -3766 -2489 4878 2820
4782 2820 -4740 -2999 4162 1676 -5415 -2489 4477 1658 -5063 -1473 5422 1856 -4618 -634 5686
4797 5686 1262 -5248 -815 5019 -48 -5859 -715 4948 -461 -5531 337 5525 -191 -4895 1265
4812 1265 5739 -535 -5047 1337 5124 -1739 -5737 1090 4675 -2250 -5320 1904 5153 -1727 -4614
4827 -4614 2858 5481 -2172 -4652 2790 4849 -3171 -5065 2421 4123 -3650 -4985 3166 4519 -3370
4842 -3370 -4054 4381 4894 -3422 -3745 4361 4124 -4253 -4098 3858 3109 -4932 -4113 4054 3208 -4446 -3031
4859 -3031 4931 3596 -3980 -2380 5031 3080 -4369 -2762 4161 2002 -5041 -2531 4092 1611 -4699
4874 -4699 -1699 4671 1698 -4173 -677 5129 1306 -4329 -704 4338 22 -4865 -678 3903 -568
4889 -568 -4560 383 4406 -369 -3866 1285 4772 -706 -4017 1542 4263 -2005 -4578 1655 3618
4904 3618 -2701 -4514 2358 4237 -2630 -3854 3543 4707 -2696 -3573 3740 4129 -3672 -4175 3370 3384
4920 3384 -4547 -4270 3745 3583 -4071 -3474 4599 4016 -3876 -2925 4929 3653 -4450 -3352 4328 2864
4936 2864 -4940 -3579 4291 2607 -4936 -2856 4966 3071 -4400 -2109 5170 2602 -4759 -2221 4742
4951 4742 1780 -5229 -2261 4388 1354 -5015 -1571 4802 1429 -4256 -500 5134 1160 -4372 -414
4966 -414 4428 17 -4783 -402 3924 -660 -4541 367 4205 -435 -3920 1332 4541 -694 -3740
4981 -3740 1783 4017 -1708 -4044 1528 3262 -2668 -4096 1967 3361 -2552 -3268 3177 3823 -2533
4996 -2533 -2936 3548 3571 -3387 -3404 3457 2837 -4195 -3358 3541 2731 -4213 -2803 4493 3103 -3992 -2359
5013 -2359 4894 2994 -4415 -2572 4489 2190 -5095 -2700 4553 2008 -5106 -2182 5125 2246 -4562
5028 -4562 -1278 5366 1868 -4963 -1317 5067 1006 -5357 -1459 4568 503 -5184 -807 4918 731
5043 731 -4587 -6 5181 649 -4389 80 4713 -174 -4841 -147 4078 -938 -4939 263 4249
5058 4249 -655 -4140 1225 4708 -668 -3639 1669 4175 -1544 -3890 1610 3379 -2482 -3886 1942
5073 1942 3193 -2646 -3332 2904 3326 -2576 -2637 3415 3137 -3109 -2685 3329 2311 -4087 -2758 3499
5089 3499 2016 -4146 -2271 4403 2322 -3942 -1466 5035 1842 -4421 -1495 4734 1314 -5339 -1727
5104 -1727 4702 894 -5427 -1357 5244 1333 -5045 -566 5786 1381 -5206 -584 5527 628 -5738
5119 -5738 -997 5148 18 -5920 -616 5333 218 -5198 126 5812 436 -5011 431 5448 -161
5134 -161 -5151 164 4750 -936 -5251 441 4537 -896 -4634 1121 4860 -875 -4183 1618 4388
5149 4388 -1337 -4051 1469 3646 -2107 -4070 1638 3305 -2342 -3230 2474 3324 -2119 -2663 2937 3039
5165 3039 -2628 -2501 2847 2343 -3365 -2636 2908 1777 -3698 -1995 3681 1851 -3616 -1225 4411 1874
5181 1874 -3916 -939 4398 905 -4649 -1113 4180 190 -5130 -645 4774 341 -4833 105 5442
5196 5442 334 -4864 408 5361 -249 -5357 229 5070 -839 -5767 192 5297 -706 -5392 1017
5211 1017 5734 -628 -5176 1331 5738 -1089 -5473 1076 5095 -1630 -5519 1248 4994 -1554 -4996
5226 -4996 1780 5398 -1332 -4497 2101 5033 -1584 -4654 2001 4426 -2416 -4614 1766 3916 -2448
5241 -2448 -4136 2425 4139 -2249 -3402 2941 3763 -2387 -3114 2822 2975 -3164 -3007 2670 2130 -3398
5257 -3398 -2355 3141 2024 -3273 -1474 3753 1739 -3368 -1048 3840 1002 -4007 -980 3756 387
5272 387 -4450 -652 4069 180 -4354 236 4615 85 -4327 685 4934 -393 -4760 571 4698
5287 4698 -1198 -5190 712 4859 -1293 -5027 1504 5381 -1128 -4939 2012 5495 -1621 -5183 1812
5302 1812 5055 -2268 -5608 1780 5112 -2416 -5304 2316 5277 -2087 -4892 2728 5349 -2261 -4749
5317 -4749 2685 4734 -2764 -4975 2376 4290 -3064 -4667 2733 4293 -2683 -4037 3080 4347 -2651
5332 -2651 -3673 3115 3648 -3025 -3784 2752 2830 -3281 -3279 2902 2768 -3071 -2466 3335 2482 -3030 -1816
5349 -1816 3393 1768 -3409 -1754 3248 1103 -3687 -1154 3313 658 -3630 -173 3978 339 -3524
5364 -3524 480 4095 -288 -3958 704 3736 -1273 -4344 1032 3987 -1607 -4515 1641 4499 -1579
5379 -1579 -4175 2355 4975 -1921 -4451 2418 4605 -2626 -5059 2341 4679 -2930 -5151 2852 4878
5394 4878 -2791 -4717 3284 5402 -2847 -4962 3134 5174 -3262 -5229 2964 4634 -3433 -5039 3101
5409 3101 4776 -3084 -4497 3398 4656 -2978 -4086 3367 4197 -3254 -4034 3127 3509 -3430 -3685 3048
5425 3048 3227 -3118 -2860 3393 3016 -3145 -2175 3489 2401 -3383 -2090 3318 1421 -3725 -1846 3083
5441 3083 1064 -3598 -825 3565 934 -3350 -149 3981 344 -3391 106 3715 -509 -4016 224
5456 224 3558 -1086 -4100 1057 4010 -1274 -3848 1788 4381 -1523 -3928 2030 4180 -2145 -4336
5471 -4336 2036 3923 -2757 -4325 2720 4130 -2788 -4084 3141 4419 -2867 -3934 3276 4078 -3405
5486 -3405 -4280 3275 3908 -3823 -4259 3500 3840 -3535 -3771 3854 3981 -3564 -3530 4102 3852 -3951 -3782
5503 -3782 3733 3379 -4188 -3636 3709 3148 -4076 -3209 4268 3374 -3815 -2847 4189 3038 -3854 -2638
5519 -2638 4026 2399 -4221 -2479 3686 1901 -4091 -2034 3891 1762 -3615 -1194 4079 1323 -3512
5534 -3512 -816 3775 756 -3715 -624 3321 -28 -3596 -89 3381 -270 -3409 610 3531 -599
5549 -599 -3301 1109 3392 -1365 -3271 1575 3138 -2044 -3514 1935 3210 -2254 -3036 2801 3452 -2506
5565 -2506 -2985 3168 3312 -3143 -3336 3200 3202 -3777 -3505 3331 3112 -3896 -3285 4233 3540 -3947 -3148 4434
5583 4434 3476 -4162 -3255 4234 3108 -4596 -3427 4291 2914 -4641 -3232 4595 3173 -4247 -2723
5598 -2723 4651 3026 -4248 -2703 4571 2664 -4538 -2677 4030 2210 -4381 -2369 4164 2250 -3984
5613 -3984 -1694 4180 2032 -3883 -1571 3968 1434 -3986 -1353 3581 778 -3810 -938 3491 634
5628 634 -3379 -261 3597 209 -3130 193 3401 -493 -3259 462 2927 -1082 -3261 956 2701
5643 2701 -1381 -2780 1798 2927 -1726 -2589 2305 2920 -2261 -2551 2515 2464 -3059 -2624 2723 2330 -3450
5660 -3450 -2564 3400 2630 -3335 -2217 3822 2569 -3730 -2363 4061 2391 -4261 -2572 4111 2191
5675 2191 -4485 -2447 4561 2353 -4409 -2114 4955 2451 -4561 -2291 4699 2301 -4777 -2295 4512
5690 4512 1923 -4872 -2112 4672 2233 -4591 -1923 4811 2199 -4146 -1648 4353 1741 -4425 -1722
5705 -1722 4004 1152 -4319 -1520 3753 1049 -3618 -687 3716 951 -3294 -304 3630 386 -3240
5720 -3240 -220 2999 -250 -3236 260 2709 -711 -2807 920 2704 -847 -2470 1370 2569 -1420
5735 -1420 -2233 1699 2139 -2078 -2351 2040 1994 -2504 -2167 2554 2015 -2825 -1695 3287 1985 -3242 -1739
5752 -1739 3554 1666 -3761 -1936 3630 1478 -4102 -1766 4048 1648 -4118 -1480 4476 1734 -4221
5767 -4221 -1466 4505 1451 -4618 -1470 4493 1187 -4964 -1541 4536 1278 -4659 -1171 4797 1333
5782 1333 -4482 -878 4792 1326 -4637 -1235 4405 942 -4667 -1117 4230 717 -4328 -784 4398
5797 4398 1053 -3935 -544 4014 717 -3725 -464 3606 29 -3815 -203 3406 -23 -3374 94
5812 94 3065 -181 -2703 683 2992 -623 -2540 817 2426 -1070 -2492 924 2008 -1420 -1973 1570
5828 1570 1830 -1733 -1576 2161 1742 -1964 -1236 2297 1255 -2555 -1135 2501 913 -3212 -1058 2935
5844 2935 959 -3261 -686 3490 745 -3396 -388 3979 666 -3866 -531 3880 326 -4308 -520
5859 -520 4097 232 -4400 -342 4602 468 -4399 -287 4630 412 -4579 -323 4630 138 -4729
5874 -4729 -196 4552 215 -4726 -292 4699 296 -4297 -173 4443 122 -4243 -59 4263 105
5889 105 -4305 -277 3817 2 -3880 -27 3619 -92 -3189 373 3590 -113 -3007 336 2821
5904 2821 -490 -2754 525 2170 -1013 -2419 795 2289 -993 -1965 1198 1950 -973 -1428 1469 1480
5920 1480 -1676 -1380 1830 1086 -2107 -1141 1977 695 -2295 -485 2524 534 -2634 -298 2914 340
5936 340 -2796 -139 2901 -147 -3315 5 3273 -259 -3600 193 3669 -64 -3469 452 3731
5951 3731 -294 -3811 549 4052 -740 -4146 345 3939 -755 -4096 604 4082 -709 -4125 974
5966 974 4472 -602 -4153 783 4165 -718 -4279 719 3915 -974 -4242 744 4085 -776 -3955
5981 -3955 814 4026 -435 -3549 830 3630 -767 -3456 776 3480 -1062 -3336 600 2891 -757
5996 -757 -2669 805 2481 -961 -2203 1086 2284 -984 -1995 741 1532 -1133 -1531 1032 1063 -1386
6012 -1386 -934 1524 917 -1339 -579 1701 335 -1591 -24 1780 -243 -2238 181 2020 -563 -2304
6028 -2304 592 2333 -758 -2446 1200 2906 -1065 -2829 1372 3121 -1421 -3171 1428 3051 -1740
6043 -1740 -3449 1540 3668 -1771 -3622 1756 3824 -1450 -3616 1842 3838 -1857 -3892 1902 3858
6058 3858 -1972 -4266 1643 3980 -1550 -3926 1739 3981 -1627 -3734 1692 4029 -1567 -4028 1311
6073 1311 3717 -1332 -3564 1215 3400 -1475 -3308 1307 3451 -1264 -3006 1248 2994 -1050 -2644
6088 -2644 1036 2211 -1261 -2251 1069 1927 -1099 -1831 1126 1581 -867 -992 1284 928 -1153 -648 1394
6105 1394 497 -1499 -486 1180 -73 -1628 202 1567 -522 -1750 726 1872 -574 -1655 1026
6120 1026 1930 -1265 -1966 1370 2068 -1662 -2478 1666 2399 -1888 -2365 1892 2475 -2136 -2512 2414 2836
6137 2836 -2331 -2949 2240 2905 -2433 -3038 2343 2999 -2587 -3122 2763 3452 -2521 -3249 2597 3340 -2464
6154 -2464 -3156 2369 3029 -2736 -3282 2375 3239 -2459 -3319 2352 3316 -1932 -2880 2234 2968 -1979 -2735
6171 -2735 2082 2803 -1987 -2908 1621 2395 -1870 -2445 1625 2095 -1664 -1818 1834 2139 -1378 -1503 1346
6188 1346 1351 -1318 -1017 1225 646 -1496 -638 1340 424 -1398 -251 1395 -48 -1176 499 1396 -556
6205 -556 -1566 875 1503 -1091 -1653 1059 1537 -1420 -1567 1873 1795 -1983 -1825 2266 2006 -2083 -1978
6222 -1978 2251 1837 -2648 -2220 2580 2061 -2871 -2344 2859 2565 -2694 -2227 3010 2462 -3034 -2393 3177
6239 3177 2588 -3219 -2859 3033 2693 -3202 -2719 2955 2600 -3160 -2523 3224 2850 -3056 -2797 2972 2814
6256 2814 -2845 -2759 2585 2405 -2928 -2536 2839 2456 -2740 -2509 2456 2402 -2099 -1946 2129 1872 -2158
6273 -2158 -1754 2106 1628 -2050 -1622 1791 1287 -1580 -954 1578 886 -1415 -506 1656 561 -1481 -308
6290 -308 1127 -50 -1256 115 1003 -682 -1233 923 1413 -826 -1167 1247 1136 -1371 -997 1889 992
6307 992 -2033 -1419 2009 1153 -2290 -1357 2404 1099 -2807 -958 3065 1508 -3073 -1429 3383 1596
6323 1596 -3243 -1529 3261 1369 -3798 -1513 3741 1659 -3849 -1810 3912 2021 -3607 -1759 3722
6338 3722 1772 -4005 -1898 3799 1969 -3993 -2187 3690 2146 -3439 -1946 3538 1923 -3413 -1829
6353 -1829 3640 2084 -3449 -2045 3205 1919 -3156 -1931 2863 1563 -2890 -1517 2906 1657 -2655
6368 -2655 -1337 2568 1470 -2121 -959 2113 777 -2098 -729 1830 474 -1825 -511 1522 222
6383 222 -1175 438 1376 -396 -1181 754 1316 -863 -1117 905 926 -1330 -744 1490 768 -1969 -885
6400 -885 2245 1058 -1994 -825 2279 735 -2620 -576 2871 613 -3215 -991 3217 889 -3216
6415 -3216 -852 3454 881 -3595 -761 4017 1003 -3870 -1176 3958 1123 -4032 -1267 3783 1038
6430 1038 -4112 -1136 4368 1260 -4132 -1302 4159 1516 -3746 -1332 3636 1025 -3931 -1356 3827
6445 3827 1243 -3874 -1573 3395 1479 -3243 -1171 3269 1049 -3022 -920 3129 1110 -3066 -1216
6460 -1216 2736 859 -2497 -808 2356 539 -2343 -354 2243 441 -2101 -265 1730 140 -1550
6475 -1550 191 1325 -583 -1417 685 1394 -767 -1215 958 1017 -1123 -676 1659 733 -2036 -878 2058
6492 2058 706 -2247 -663 2084 485 -2491 -262 2866 400 -3192 -349 3337 618 -3189 -345
6507 -345 3302 225 -3567 -342 3703 225 -4136 -625 3994 725 -3943 -415 3949 568 -4093
6522 -4093 -318 4338 571 -4417 -1000 4269 769 -4241 -820 4114 655 -4138 -553 4316 851
6537 851 -4159 -791 3936 1015 -3664 -908 3473 532 -3625 -604 3536 592 -3353 -661 3197
6552 3197 756 -2819 -441 2698 132 -2605 -154 2561 149 -2480 -291 1948 34 -1747 181
6567 181 1587 -393 -1349 771 1527 -531 -1291 710 988 -984 -782 1217 413 -1677 -618 1633 496
6584 496 -1672 -355 1934 268 -1920 90 2517 -71 -2732 -171 2784 -32 -3017 90 2920
6599 2920 -293 -3167 364 3436 -289 -3721 329 3763 -199 -3792 84 3642 -360 -3880 457
6614 457 4055 -232 -4238 163 4284 55 -4051 235 4118 -259 -4110 299 4354 -236 -4440
6629 -4440 -89 4224 73 -4025 2 3912 28 -3875 198 4093 -53 -3870 -194 3658 100
6644 100 -3455 -183 3185 -135 -3130 291 3263 -11 -2960 48 2739 26 -2260 248 2099
6659 2099 -395 -1999 428 1977 -500 -1589 454 1367 -507 -971 915 919 -1078 -633 1320 678 -1316
6676 -1316 -627 1359 160 -1494 132 1873 -204 -2062 332 2277 -195 -2382 474 2507 -673
6691 -673 -2722 806 3026 -1028 -3274 693 3406 -812 -3526 839 3452 -988 -3515 1318 4072
6706 4072 -1014 -4165 868 4268 -808 -4211 728 3918 -952 -4116 882 4349 -796 -4304 639
6721 639 4374 -352 -4001 362 3824 -551 -3748 546 3960 -430 -4000 233 3689 -57 -3298
6736 -3298 143 3119 -463 -3094 440 3099 -434 -3092 153 2691 -117 -2406 273 2050 -511
6751 -511 -1948 785 2000 -548 -1712 393 1406 -514 -1130 714 716 -1089 -657 1135 635 -1127 -460
6768 -460 1189 208 -1052 382 1545 -494 -1772 475 2024 -476 -2029 408 1887 -921 -2151
6783 -2151 1164 2480 -1317 -2711 1206 2938 -1047 -2837 1130 2817 -1503 -3001 1563 3275 -1673
6798 -1673 -3599 1506 3689 -1289 -3548 1392 3674 -1552 -3694 1665 3822 -1683 -4221 1308 4111
6813 4111 -1190 -4001 1197 3759 -1233 -3715 1454 4001 -1226 -4089 940 3819 -690 -3545 645
6828 645 3273 -935 -3279 831 3358 -796 -3222 538 3199 -120 -2527 510 2372 -601 -2279
6843 -2279 689 2207 -572 -2246 300 1835 -291 -1352 385 1067 -681 -892 939 949 -637 -623
6859 -623 553 442 -710 -51 775 -507 -1087 382 1266 -341 -1466 573 1300 -948 -1309 1206 1642
6876 1642 -1485 -1918 1514 2129 -1455 -2173 1450 2067 -1735 -2207 1998 2613 -2198 -2808 2003 2933 -1926
6893 -1926 -3024 1835 2738 -2148 -3025 2229 3202 -2229 -3495 1994 3643 -1644 -3242 1809 3199 -1731
6909 -1731 -3232 1987 3310 -1878 -3702 1578 3629 -1209 -3382 1256 3187 -1428 -3046 1523 3113
$$ [...]
8191D13
##END NTUPLES=NMR FID
##END=
