##TITLE=1H_DE-80H_X3
 200.13MHz, d2o
 8 sc
 
 19ns.26.2.2025
##JCAMPDX= 6.0         $$ Bruker NMR JCAMP-DX V2.0
##DATA TYPE= NMR FID
##DATA CLASS= NTUPLES
##ORIGIN= UXNMR, Bruker Analytische Messtechnik GmbH
##OWNER= pz
$$ XWIN-NMR		Version 3.5
$$ Fri Oct 17 15:34:10 2025 Russian Standard Time (UT+4h)  Yarkov@DPX200
##.OBSERVE FREQUENCY= 200.1313
##.OBSERVE NUCLEUS= ^1H
##.DELAY= (6, 6)
##.ACQUISITION MODE= SIMULTANEOUS
##.ACQUISITION SCHEME= undefined
##.AVERAGES= 8
##.DIGITISER RES= 18
##SPECTROMETER/DATA SYSTEM= spect
##.PULSE SEQUENCE= zg30
##.SOLVENT NAME= CDCl3
##.SHIFT REFERENCE= (INTERNAL, CDCl3, 0, 14.3821)
##AUDIT TRAIL= $$ (NUMBER, WHEN, WHO, WHERE, WHAT)
$$ ##TITLE= Audit trail, XWIN-NMR		Version 3.5
$$ ##JCAMPDX= 5.01
$$ ##ORIGIN= Bruker BioSpin GmbH
$$ ##OWNER= Yarkov
$$ C:/Bruker/XWIN-NMR/data/yarkov2/nmr/H-C/1/audita.txt
$$ ##AUDIT TRAIL=  $$ (NUMBER, WHEN, WHO, WHERE, WHAT)
(   1,<2025-10-17 15:33:09.62 +0400>,<Yarkov>,<DPX200>,
      <created by zg, POWCHK disabled, PULCHK disabled
       configuration hash MD5:
       00 E9 B6 7A A2 85 ED C7 34 08 36 98 17 FE 4E 26
       data hash MD5: 16K
       F6 9E D4 D4 8C 5E E0 00 4F 0C EE 43 23 39 B2 59>)
$$ ##END=
$$ 
$$ hash MD5
$$ DA EA 80 08 2B 97 1C 99 E8 5B 82 02 E6 89 28 5D
##$RELAX= 
##$RELAX= 
##$RELAX= 
##$RELAX= 
##$RELAX= 
##$RELAX= 
$$ Bruker specific parameters
$$ --------------------------
##$DU= <C:/Bruker/XWIN-NMR>
##$EXPNO= 1
##$NAME= <H-C>
##$PROCNO= 1
##$TYPE= <nmr>
##$USER= <yarkov2>
##$AMP= (0..31)
100 100 100 100 100 100 100 100 100 100 100 100 100 100 100 100 100 100 
100 100 100 100 100 100 100 100 100 100 100 100 100 100 
##$AQSEQ= 0
##$AQ_mod= 1
##$AUNM= <au_zg>
##$AUTOPOS= <>
##$BF1= 200.13
##$BF2= 200.13
##$BF3= 200.13
##$BF4= 200.13
##$BF5= 200.13
##$BF6= 200.13
##$BF7= 200.13
##$BF8= 200.13
##$BYTORDA= 1
##$CFDGTYP= 0
##$CFRGTYP= 5
##$CHEMSTR= <none>
##$CNST= (0..31)
1 1 145 1 1 1 1 1 1 1 1 1 1 1 1 1 1 1 1 1 1 1 1 1 1 1 1 1 1 1 1 1 
##$CPDPRG= <>
##$CPDPRG1= <>
##$CPDPRG2= <>
##$CPDPRG3= <>
##$CPDPRG4= <mlev>
##$CPDPRG5= <mlev>
##$CPDPRG6= <mlev>
##$CPDPRG7= <mlev>
##$CPDPRG8= <mlev>
##$CPDPRGB= <>
##$CPDPRGT= <>
##$D= (0..31)
0 0.7 0 0 0 0 0 0 0 0 0 0.03 0 0 0 0 0 0 0 0 0 0 0 0 0 0 0 0 0 0 0 0 
##$DATE= 1760700789
##$DBL= (0..7)
120 120 120 120 120 120 120 120 
##$DBP= (0..7)
150 150 150 150 150 150 150 150 
##$DBP07= 0
##$DBPNAM0= <>
##$DBPNAM1= <>
##$DBPNAM2= <>
##$DBPNAM3= <>
##$DBPNAM4= <>
##$DBPNAM5= <>
##$DBPNAM6= <>
##$DBPNAM7= <>
##$DBPOAL= (0..7)
0.5 0.5 0.5 0.5 0.5 0.5 0.5 0.5 
##$DBPOFFS= (0..7)
0 0 0 0 0 0 0 0 
##$DE= 6
##$DECBNUC= <off>
##$DECIM= 32
##$DECNUC= <off>
##$DECSTAT= 4
##$DIGMOD= 1
##$DIGTYP= 9
##$DL= (0..7)
0 120 120 120 120 120 120 120 
##$DP= (0..7)
150 150 150 150 150 150 150 150 
##$DP07= 0
##$DPNAME0= <>
##$DPNAME1= <>
##$DPNAME2= <>
##$DPNAME3= <>
##$DPNAME4= <>
##$DPNAME5= <>
##$DPNAME6= <>
##$DPNAME7= <>
##$DPOAL= (0..7)
0.5 0.5 0.5 0.5 0.5 0.5 0.5 0.5 
##$DPOFFS= (0..7)
0 0 0 0 0 0 0 0 
##$DQDMODE= 0
##$DR= 18
##$DS= 0
$$ [...]
##$SUBNAM2= <"">
##$SUBNAM3= <"">
##$SUBNAM4= <"">
##$SUBNAM5= <"">
##$SUBNAM6= <"">
##$SUBNAM7= <"">
##$SUBNAM8= <"">
##$SUBNAM9= <"">
##$SW= 18.0517328524113
##$SWIBOX= (0..15)
0 0 2 0 0 0 0 0 0 0 0 0 0 0 0 0 
##$SW_h= 3612.71676300578
##$TD= 16384
##$TD0= 1
##$TE= 0
##$TE2= 300
##$TE3= 300
##$TEG= 300
##$TL= (0..7)
0 120 120 120 120 120 120 120 
##$TP= (0..7)
150 150 150 150 150 150 150 150 
##$TP07= 0
##$TPNAME0= <>
##$TPNAME1= <>
##$TPNAME2= <>
##$TPNAME3= <>
##$TPNAME4= <>
##$TPNAME5= <>
##$TPNAME6= <>
##$TPNAME7= <>
##$TPOAL= (0..7)
0.5 0.5 0.5 0.5 0.5 0.5 0.5 0.5 
##$TPOFFS= (0..7)
0 0 0 0 0 0 0 0 
##$TUNHIN= 0
##$TUNHOUT= 0
##$TUNXOUT= 0
##$USERA1= <user>
##$USERA2= <user>
##$USERA3= <user>
##$USERA4= <user>
##$USERA5= <user>
##$V9= 5
##$VALIST= <valist>
##$VCLIST= <CCCCCCCCCCCCCCC>
##$VD= 0
##$VDLIST= <DDDDDDDDDDDDDDD>
##$VPLIST= <PPPPPPPPPPPPPPP>
##$VTLIST= <TTTTTTTTTTTTTTT>
##$WBST= 1024
##$WBSW= 4
##$XGAIN= (0..3)
0 0 0 0 
##$XL= 0
##$YL= 0
##$YMAX_a= 1043683
##$YMIN_a= -1132299
##$ZGOPTNS= <>
##$ZL1= 120
##$ZL2= 120
##$ZL3= 120
##$ZL4= 120
##$ABSF1= 10
##$ABSF2= 0
##$ABSG= 5
##$ABSL= 3
##$ALPHA= 0
##$AQORDER= 0
##$ASSFAC= 0
##$ASSFACI= 0
##$ASSFACX= 0
##$ASSWID= 0
##$AUNMP= <proc_1d>
##$AZFE= 0.1
##$AZFW= 0.1
##$BCFW= 1
##$BC_mod= 2
##$BYTORDP= 1
##$COROFFS= 0
##$CY= 83.5205535888672
##$DATMOD= 1
##$DC= 2
##$DFILT= <>
##$DTYPP= 0
##$F1P= 10.8118882576601
##$F2P= -7.23987719738617
##$FCOR= 0.5
##$FTSIZE= 0
##$FT_mod= 4
##$GAMMA= 1
##$GB= 0.15
##$INTBC= 1
##$INTSCL= 1
##$ISEN= 128
##$LB= 0.25
##$LEV0= 0
##$LPBIN= 0
##$MAXI= 10000
##$MC2= 0
##$MEAN= 0
##$ME_mod= 0
##$MI= 1.114404
##$NCOEF= 0
##$NC_proc= 0
##$NLEV= 6
##$NOISF1= 3.799351
##$NOISF2= 2.8
##$NSP= 1
##$NTH_PI= 0
##$NZP= 0
##$OFFSET= 14.38212
##$PC= 1
##$PHC0= -3625.24
##$PHC1= 8.821912
##$PH_mod= 1
##$PKNL= yes
##$PPARMOD= 0
##$PSCAL= 0
##$PSIGN= 0
##$REVERSE= no
##$SF= 200.129724274929
##$SI= 16384
##$SIGF1= 3
##$SIGF2= 2
##$SINO= 400
##$SIOLD= 16384
##$SREGLST= <1H.CDCl3>
##$SSB= 0
##$STSI= 0
##$STSR= 0
##$SW_p= 3205.1282051282
##$SYMM= 0
##$S_DEV= 0
##$TDeff= 0
##$TDoff= 0
##$TI= <>
##$TILT= no
##$TM1= 0
##$TM2= 0
##$TOPLEV= 0
##$USERP1= <user>
##$USERP2= <user>
##$USERP3= <user>
##$USERP4= <user>
##$USERP5= <user>
##$WDW= 1
##$XDIM= 8192
##$YMAX_p= 0
##$YMIN_p= 0
$$ End of Bruker specific parameters
$$ ---------------------------------
##NTUPLES= NMR FID
##VAR_NAME=  TIME,          FID/REAL,        FID/IMAG
##SYMBOL=    X,             R,               I
##VAR_TYPE=  INDEPENDENT,   DEPENDENT,       DEPENDENT
##VAR_FORM=  AFFN,          ASDF,            ASDF
##VAR_DIM=   8192,          8192,            8192
##UNITS=     SECONDS,       ARBITRARY UNITS, ARBITRARY UNITS
##FACTOR=    0.0002768,     1,               1
##FIRST=     0,             0,               0
##LAST=      2.2672688,     0,               0
##MIN=       0,             -1132299,        0
##MAX=       2.2672688,     1043683,         0
$$ Real data points
##PAGE= N=1
##DATA TABLE= (X++(R..R)), XYDATA
$$ [...]
986A9920k7892K2128p524k3072K5330k4624N795K1936k3799K6734l396j9489K3608
999A5655k7741J090J6380k4771K7371L30j3327K6782k5538l55J1065k8886K2805
1012H60j112j0247L0368k0019L722J0781l0555J7952o719j2495K9489j7194R261
1025D092J4620k7258J7908j0707j6321K4535j9841J0786J7000k2051K2348r676
1037E435j6463K0547k4691P827J4578k0140K6094n943j2014K0832k6140M674R403
1050C999k2310K4965m347p433K3861k2852N221O541k4949K0566o861o773K4948
1063A4576j8639Q767P867k4022J7635j0331r282K2280j7789J1186J0408k0218
1075g562J8820j1170j0745J8428k0315J0410J0200j7316K1707r286q807J7050
$$ plain form
986 19920 -7972 14156 6632 -16440 8890 -15734 -9939 11997 -11802 14932 11536 -7953 15655
999 15655 -12086 -10996 5384 -19387 7984 8314 -5013 21769 -3769 -4124 6941 -21945 860
1012 860 -252 -10499 19869 -150 3572 14353 -16202 1750 -4969 -17464 12025 -5169 4092
1025 4092 18712 -8546 9362 -1345 -17666 6869 -12972 -2186 14814 -7237 15111 5435
1037 5435 -11028 9519 -15172 -7345 7233 -12907 13187 7244 -4770 16062 -10078 -5404 3999
1050 3999 -18311 6654 2307 -5126 18735 -4117 1104 7645 -17304 3262 -3599 -10372 14576
1063 14576 -4063 4704 12571 -11451 6184 -4147 -13429 8851 -8938 2248 12656 -7562
1075 -7562 11258 88 -10657 7771 -12544 -2134 8066 -9250 12457 3171 -5636 11414
1087A1414k2593Q324P000j7591K2627p803n238J8465k1911Q014L946j9362K0687
1100E979q858l433J9869j9281R985L723j9616J8208j1189m385J8739j7698J1917
1113C960N161j7337J7730j2090n717J5927j8220J1632N717j4765J8726j0764n211
1126e251J4143j9162R956M231j3977J9262r333l176J4215j8904R226K127j4536
1139a1179J8309r546j508J4787j7626J0209J196j4747J7076j0977j158J4340j6771
1152g595J1626J202j3708J6684j1920j202J3000j6700J1981J018j2372J6638j1754
1165c102p94J1975j6506J1503N17j1647J6114j1328l16J1371j5711J1237K87j1028
1179g428J5332j1187k74J0543j5084J1071L32j0024J5102j0912j03R452j5223
$$ plain form
1087 11414 -11179 -2855 4145 -13446 9181 1378 -3860 14605 -7306 708 4654 -14708 5979
1100 5979 -2879 -6312 13557 -5724 4261 7984 -11632 6576 -4613 -8998 9741 -7957 3960
1113 3960 9121 -8216 9514 -2576 -8293 7634 -10586 1046 6763 -8002 10724 -40 -5251
1126 -5251 8892 -10270 -314 3917 -10060 9202 -131 -3307 10908 -7996 1230 3357 -11179
1139 -11179 7130 -2416 -3924 10863 -6763 3446 4642 -10105 6971 -4006 -5164 9176 -7595
1152 -7595 4031 5233 -8475 8209 -3711 -4913 8087 -8613 3368 4386 -7986 8652 -3102
1165 -3102 -3896 8079 -8427 3076 3593 -8054 8060 -3268 -3584 7787 -7924 3313 3600 -7428
1179 -7428 7904 -3283 -3557 6986 -8098 2973 3305 -6719 8383 -2529 -2632 6820 -8403
1192h403J0640l40r110J5344j0282J020Q962j5243J0048j921r115J4892j0083
1205c591K668R395j4217J0474l100r605J3328j1051L111R476j2565J1816k695
1218C444q932J2025j2341K050Q051j2003J2498j477o946J2252j2109J187N957
1231C656j2730J1348j334n321J3131j0330J900N179j3282R442k756n396J2980
1244F487q895L619N904j2291Q767m214o378J1392r174M434O575j0522R799m338
1258A165o348R944j0475L982N790r599J0913l714n014R668j1007L503M361r842
1272f673J0786l516l805R946j0438L667L481r903J0054l913l357R694r651L955
1286C27L271r428R431l942l097R152r161L856K883r041Q847l799k636R004q457
$$ plain form
1192 -8403 2237 1897 -7213 8131 -2151 -1131 7831 -7412 2636 715 -8400 6492 -3591
1205 -3591 -923 8472 -5745 4729 1629 -7976 5352 -5699 -2588 6888 -5677 6139 3444
1218 3444 -5488 6537 -5804 -3754 4297 -7706 4792 3315 -3631 8621 -3488 -2301 3656
1231 3656 -9074 2274 940 -4381 8750 -1580 320 5499 -7783 1659 -1097 -6493 6487
1244 6487 -2408 1211 7115 -5176 3591 -623 -7001 4391 -4783 -349 6226 -4296 5503 1165
1258 1165 -5183 4761 -5714 -1732 4058 -5541 5372 1658 -3356 6312 -4695 -1192 3169 -6673
1272 -6673 4113 597 -3208 6738 -3700 -33 3448 -6455 3599 -314 -3671 6023 -3628 327
1286 327 3598 -5830 3601 -341 -3438 5714 -3447 409 3292 -5749 3098 -701 -3337 5667 -2790
1301b790M069K417q965Q019m487k625Q792p659N121K862q243P623n572l267P416
1316B711q026N799L499o470Q752n491l334N734r645M770K599n371J0213l791j461
1331D88N646j0315K977J41o462R674k750R31P581q348L109j327q431O726m191
1346d551R68Q672n299N547K04q040M565o824j662O581m766P437L013m798N870
1361F917p054l688L070p498N896L250k029R047m143j872J982r914K557j38k958
1376f575R770j586K048M602q600J647l363o222O684k708L685P184m697M402k808
1391C463p316L358o215J228O307k873P420O19m523L409p775j950K676m729O981
1406H0K460j197O301n465j884M35p543L718N68p32P996k284J081J731p591J628
$$ plain form
1301 -2790 1279 3696 -5269 2750 -1737 -4362 4430 -3229 1892 4754 -3489 4134 -1438 -4705 2711
1316 2711 -5315 484 3983 -2487 6265 774 -2560 3174 -6471 -1701 898 -4473 5740 1949 488
1331 488 6134 -4181 -1204 -1063 -7525 2149 -601 330 7911 -437 2672 1345 -7086 -360 -4551
1346 -4551 -3583 5089 -210 5337 5541 -2499 2066 -4758 -6420 161 -4605 2832 5845 1047 6917
1361 6917 -137 -3825 -755 -8253 -2357 893 -1136 7911 3768 1896 3878 -6036 -3479 -3617 -6575
1376 -6575 3195 1609 3657 8259 -341 1306 -2057 -8279 -1595 -4303 -618 6566 1869 6271 3463
1391 3463 -3853 -495 -6710 -5482 825 -2048 5372 5991 1468 4877 -2898 -4848 -2172 -6901 80
1406 80 2540 1343 7644 2179 295 730 -6813 -3095 -2527 -3259 4737 2453 3534 5265 -2326 -698
1422f98k429l098O441j921L317M185m964K802l288m677L702m046K621M524l057
1437e86N184j664l665K932n780P60K544l361N832k77j596M035n231K50R60m650
1453d313M455o51q48M976l743J251J050m822L287j716j518M416l221J906J817
1468B326l872L436j806j890L441l675J557J652l332L827j289j214L438l691J264
1483A72Q26l700L383j507o37L869l031J975P07l752K723k475j097L357k692K914
1499A035J488k724K959k948j769K046l516K566J754j442M070j875j287J228m518
1514b933J039N39j491M574l84L17K159m126Q4j030k935L264l81J426L686k255
1530A553J097j246l991J289k073O09L771p34L018L15k999P37l743j220J859j284
$$ plain form
1422 -698 -3127 -6225 216 -1705 1612 5797 833 3635 347 -4330 -628 -4674 -2053 2471 -586
1437 -586 4598 2934 -731 2201 -3579 -2819 -275 -3636 2196 1919 323 4358 -873 -623 337 -4313
1453 -4313 142 -509 -1357 3619 -124 1127 2177 -2645 642 -1074 -2592 1824 -1397 509 2326
1468 2326 -1546 1890 84 -1806 1635 -2040 -483 1169 -2163 1664 375 -839 2599 -1092 172
1483 172 998 -2702 681 -826 -1463 2406 -625 1350 2057 -1695 1028 -1447 -2544 813 -1879 1035
1499 1035 2523 -201 2758 -190 -1959 87 -3429 -863 891 -551 3519 1644 357 1585 -2933
1514 -2933 -1894 -1355 -2846 1728 1344 1661 3820 -306 -222 -1252 -4187 -923 -1304 122 3808 1553
1530 1553 2650 1404 -2587 -1298 -3371 -2762 1009 275 3293 3608 609 1346 -2397 -3617 -1758 -3042
1546c042L825J911p19K290l375j988k26l359K401J411O33M265j203l90l25m704
1562b595K16q32m70M276L87J923J643l331k56k607k696K003m68K565L411p56J547
1579C960j831l370j54k742O81K676L95L577N36j449J10l885j487K03j119L377
1595e22J779Q65K313k363j318j379l315J137L03J143L814q4R40l36l485m55k066
1612c029p71K624K87K689J794j440M61k667k312L12j522J973K267L69K471r33
1628B573j584m72l076j27O36o5L086Q17M08Q20k503r32j023j666J539N09J213
1645A53K275o75L02q87k367P7j120J97J948J35J689M62j222K22j901r68N43p88
1663a925J626J011l0J455j164o96j26j843O54J57o0J865k66L26M01j615J72o27
$$ plain form
1546 -3042 783 2694 1975 4265 890 -1098 -1324 -4683 -2282 -871 -238 4027 2824 2434 2109 -2595
1562 -2595 -2379 -3211 -3681 595 982 2905 4548 1217 961 -1646 -4342 -2339 -2807 -242 3169 2413 3960
1579 3960 2129 -1241 -1395 -4137 -3456 -780 -385 3192 3728 2279 2389 -1496 -2983 -2780 -3899 -522
1595 -522 1257 2122 4435 2072 754 -625 -3940 -2803 -2500 -1357 2457 2373 3313 2977 -508 -963 -3029
1612 -3029 -3800 -1176 -889 1800 3594 2154 2615 -52 -2364 -2052 -3574 -1601 666 1035 3506 2573
1628 2573 989 517 -2559 -2686 -2050 -2115 971 1788 2196 3016 513 -419 -1442 -3108 -1569 -1060 153
1645 153 2428 1753 2055 1168 -1199 -1122 -2242 -2045 -97 38 1727 2189 967 1189 -712 -1680 -1137 -1925
1663 -1925 -299 712 682 2137 973 277 151 -1692 -1038 -881 -941 924 658 984 1385 -230 -58 -685
1681f85p62J226l82P17R46q58O73n35r34O54q73K63P21n54R27o1m80O49q15K7
1701a36K71p78O43j28k46Q29n20L39L18p72N19m39n01N52n98M42N33m04Q63l51
1721D36l19L10j090J56J42m75J088NJ54P04q71J7l75r14N39l02L70J061j92O01
1741A045j23r04Mr13k67N95n1J008N26p6L51q04p33k84p55M34M80M12J124L0o4
1762A035k52j150l75m83j86Q69M37Q61P17l82q5r29j039j69m80O28J005N20J056
1781A598j7n99m68j475n55o7N7J384Q87P65N87q81p71j118j250Q0K47J043J585
1800A032N88N95m53j406j056j296l30P04Q92J680J120J76k66j466j526j022o81
1817b715Q36J231J552J531J26n18j306j954j034n19N89J758J476J487M73j036
$$ plain form
1681 -685 -1447 -221 -603 114 1060 202 875 340 -594 60 -813 -550 171 -383 544 483 3 652 -163 -136
1701 -136 135 -643 0 -128 -374 455 -65 274 592 -180 339 -100 -601 -49 -647 -205 328 -76 787 436
1721 436 117 427 -663 -507 -365 -840 248 253 407 1111 240 257 -118 -1032 -493 -795 -425 636 444 1045
1741 1045 922 18 22 -891 -1158 -563 -614 394 920 844 1195 391 -342 -626 -1381 -947 -467 -55 1069 1099 1035
1762 1035 783 -367 -742 -1225 -1411 -542 -105 756 1473 1091 1006 77 -962 -1131 -1611 -983 22 542 1598
1781 1598 1581 982 514 -961 -1516 -1583 -1526 -142 745 1510 2097 1216 445 -673 -1923 -1843 -1596 -553 1032
1800 1032 1620 2215 1762 356 -700 -1996 -2326 -1622 -730 950 2070 2246 1980 514 -1012 -2034 -2715
1817 -2715 -1879 -648 904 2435 2561 2043 737 -1217 -2251 -2770 -2181 -423 1053 2540 3013 1977
1833A977j263j992j444m5M86J800J908J058O08j001j784j581j614o8R80J424K197
1850A646J064J55p04k048j634j232l24J305J523J816J364k43p78j787j922q12
1866b611k46J170J794J467J241j44j215j379j931p47J34Q42J924J346Q16J33j383
1883A211j392j364j063M67Q44J428J619L77kr11j650r50q16R2J198R82J350O31
1901B051l99n09j422j116k75j70R82J124P70Q61m01o96p74j266k34P8M18J302
1919C24N10N75J11r40n36q64o61L58J99Q94R25J29K90n32q77l91p53N4N34L05
1939c46J081L37r2L2r85n21l63m44O36M23N16Q65k40p0m04j041j20k87P0R27K60
1960B34O49L26o11j72q13o21K17j59P42P30J09M90m31o30k50q69J38L09J81R98
$$ plain form
1833 1977 714 -1278 -2722 -2767 -2281 -481 1427 2485 3093 2092 308 -1273 -2887 -2955 -1975 -551 1646
1850 1646 2710 2865 2161 113 -1521 -2753 -3077 -1772 -249 1567 2931 2688 1910 123 -1799 -2611
1866 -2611 -2857 -1687 107 1574 2815 2671 1456 77 -1854 -2601 -2467 -1625 299 1645 2461 2594 1211
1883 1211 -181 -1545 -2608 -2141 -1297 131 1750 2127 2125 1214 -436 -1386 -2202 -2110 -912 70 1420 2051
1901 2051 1652 1143 -279 -1395 -1670 -1840 -858 266 1036 1897 1496 800 26 -1240 -1474 -1396 -978 324
1919 324 834 1409 1520 580 44 -820 -1481 -1123 -924 -30 895 1024 1314 782 -95 -486 -1239 -1185 -651 -346
1939 -346 735 1072 980 1012 27 -494 -857 -1301 -665 -242 274 1139 899 829 425 -616 -736 -1023 -953 -26 234
1960 234 883 1209 598 426 -387 -1008 -791 -950 -208 522 631 1121 690 60 -190 -1059 -921 -612 -431 567
1980E67K06N7O0r54l09l73m13P56K10N55P12m25K1n34q50J39l27L07P99J00N75
2001H79m1o20k0p86k66L85j20P72M15j10L76o68m17r0o01M10L03J47Q00j92j25
2022D31Jq88L1j58j17P74M4L10L89o01L2m45n10M04k37M25N42j72M46k52n43J08
2044A4o33J05L60j95P33N4j11K69o67j88J3n28N32J11J25O84l41N4p0p80K09k80
2066e30j27P44j14M61L22n48J53m84n10K81l51M49N68j03O03k54m64K6q16PK61
2087d26j70R23J86N2L50p66k38k75o57N04J20L52Q79k27K02k59r42j7n63m7Q32
2108a87R0Q24L96n36Q0r15o57J23l36P27P46J81P84m30n84k80j088PK37J24J184
2129D90L07K05K03j038l76n74o30O68K47O76R80k06J19n23j150j19n56J56R30
$$ plain form
1980 567 773 830 890 -64 -373 -746 -1159 -403 -193 362 1074 649 670 136 -714 -575 -902 -595 204 304 879
2001 879 838 218 198 -588 -854 -469 -589 183 598 488 864 196 -221 -311 -912 -502 -199 -52 748 556 431
2022 431 432 -456 -425 -583 -700 74 118 428 817 216 248 -197 -707 -303 -540 -115 427 255 701 449 -94 14
2044 14 -619 -514 -154 -349 384 438 327 596 -71 -259 -246 -774 -242 -131 -6 678 337 391 321 -459 -250 -530
2066 -530 -657 87 -27 434 756 208 361 -123 -633 -352 -703 -254 314 211 814 560 96 122 -694 -687 -426
2087 -426 -596 327 513 565 915 149 -89 -364 -1021 -517 -397 -45 834 607 809 550 -392 -409 -972 -1019 -187
2108 -187 -97 727 1123 587 667 -248 -905 -782 -1118 -391 355 536 1320 890 306 26 -1062 -1055 -818 -694 490
2129 490 797 1002 1205 167 -209 -783 -1413 -745 -498 178 1158 952 1071 548 -602 -721 -1277 -1121 -191
2148a91L05R24K53n41p5j137o29J01k74R63P65L04P20o12n95m39j077J11K40L19
2168e65J233K08K63N7j122l30o26n23P01K55P49Q94l28J62o19j023p1n56K51Q73
2188a17K30Q88J38m89p3j052m69R3k81R55N68K24O74n76m26l75r61J96Q3K23J113
2209E66O2L13O3r48j64o20m23O36L7O85P16k51K32n67p64k2n65K69O44K8Q88L4
2231H49l46Q2r13k80nl17P72K88K35O24n34j51l04p62K50j15J48Q36k2L24J08
2252G67p17Ln27l02M86j58N91M40k44L54m69m65J07n74K27L76j13P46r0j96K08
2273D50o82k8jl44N54K3J42M84m18O0p3n82L04k01k4N56k57L64R2m69K63l88k17
2296c92L76l47L77K20k51L80k28j98K51n28K00Q2k13M75j32l6L21m67J57om08
$$ plain form
2148 -191 114 1038 1291 750 675 -462 -1091 -990 -1264 -301 464 768 1488 876 281 -158 -1235 -1124 -884 -565
2168 -565 668 876 1139 1196 74 -256 -882 -1405 -704 -449 300 1194 866 1028 409 -614 -685 -1241 -990 -117
2188 -117 113 1001 1139 650 577 -475 -944 -851 -1132 -177 391 615 1289 713 287 -88 -1049 -853 -770 -547 566
2209 566 628 941 1004 56 -108 -728 -1151 -515 -478 207 923 672 904 337 -427 -449 -1014 -745 -101 -73 815 849
2231 849 503 585 -328 -608 -613 -930 -158 130 365 989 455 304 0 -762 -512 -627 -479 357 335 659 767
2252 767 50 53 -474 -776 -290 -448 143 583 339 693 224 -241 -134 -708 -481 -105 -218 528 438 242 450
2273 450 -232 -260 -261 -605 -51 -28 114 598 180 240 167 -415 -111 -312 -336 220 -37 327 419 -50 213 -175 -392
2296 -392 -16 -363 14 234 -17 363 135 -63 188 -340 -140 -58 -271 204 72 36 357 -110 47 41 -367
2317c67L93k11L5L87l30K61J7l39L42l55o7K93l49L72Q3k40M47k90j09J82m50
2338b95K33J9k31N00k06N0K99m81J80j14l09M14k21P2M00l45L00r3l69K84l32
2359b45rL17k44L56K3k08L20l84o2J69m33L62N6j14M60k64J0R7m65J97q2j60M72
2382A69j95J46K18l73J76j64k61L21l08J64L00k87L88j26k79K51l71L0K18k55
2402b38L45J0j53L32l47LQ1l48L12l8j04L89k47R1J38m14K08r7j41L01j95J23
2424A1K25k83K46j40k44K60k91J15K17k51L04p6j50K85l55N1J20l10L18r5n8L50
2446B49k84J00Q3l70K74j67p7L13k15J90J03k75K12j65j42K24k90J92J90k03L04
2467B46j53j08J70l49J13K9j68L48p7k6K21k76N2m4k76K60p1j0L18k13J85k1l03
$$ plain form
2317 -367 26 -185 -150 237 -93 168 185 -154 188 -167 -234 59 -290 82 165 -75 372 82 -27 155 -295
2338 -295 -62 -43 -274 226 20 70 369 -112 68 -46 -355 59 -162 -90 310 -35 265 172 -197 87 -245
2359 -245 -254 63 -181 175 198 -10 310 -74 -136 33 -400 -38 18 -96 364 100 110 207 -258 -61 -143 -303 169
2382 169 -26 120 338 -35 141 -23 -284 37 -271 -107 193 -94 294 168 -111 140 -231 -201 17 -238
2402 -238 107 117 -36 296 -51 -48 33 -315 -3 -41 -145 244 -3 88 226 -188 20 -77 -218 83 -112 11
2424 11 236 -47 199 59 -185 75 -216 -101 116 -135 169 93 -57 228 -127 -76 44 -266 52 -43 -101 249
2446 249 -35 65 148 -222 52 -115 -192 121 -94 96 199 -76 136 -29 -171 53 -237 -45 145 -58 246
2467 246 93 -15 155 -194 -81 -52 -220 128 51 25 246 -30 22 -22 -298 -38 -109 -119 199 -14 171 150 -153
2490a53J65j98m7K68j60K07J41k11J98k44j34J57k68K23J30r9K74j30r1Q2l63
2511b53J19N6j33L57q4K8K09l63Q9j22k22K71n0R0K69j99J01o6k89J48j95L3K73
2534F7j17K38K7k36J54k45j08J69k05K84J39j09K45k34j20L5k87K00O1l3L28p6
2556A77m6N6l37Koj20K98l1J26K24k82J5j30k47J63j27J55L03q6J85j01k55L1
2579c3k24k9K13n9L42Q0j38Q9k86j80M5j59K45J51N1K80j53r2o7l99O0J5K0L86
2603A58M8J07O1l64o7j89k31K76J8K35K72q7P2k20k97Jk22J37K77R1K68L6j74
2626B06j7l98j54O4q4L82K05J07J82k51k32j85k96J04J04J60M08O6Q2r1m13j56
2648b07k14r4L20J29L13K56j55k0l20l92j2j26K27L70J77K32l8k66j39m53o9J04
$$ plain form
2490 -153 12 -186 -233 35 -125 82 223 12 210 -34 -168 -11 -279 -56 74 -25 249 119 28 110 -253
2511 -253 -134 -78 -211 146 62 90 299 -64 25 -97 -319 -48 -98 -8 261 62 163 97 -192 -44 -239 -206 67
2534 67 -50 188 215 -21 133 -112 -220 -51 -256 28 167 58 303 69 -51 -16 -303 -103 -42 -75 253 177
2556 177 131 187 -150 -148 -154 -274 24 -7 119 343 61 76 -54 -301 -138 -265 -110 193 107 292 191 -64 -33
2579 -33 -257 -286 -73 -132 210 290 152 241 -45 -225 -180 -339 -94 57 108 388 235 143 76 -323 -263 -248 -228 158
2603 158 206 313 374 10 -57 -246 -477 -201 -183 52 324 237 309 89 -208 -207 -429 -292 -15 76 344 380 206
2626 206 189 -209 -363 -299 -383 -1 204 311 493 242 10 -175 -471 -367 -263 -103 305 371 453 362 -51 -207
2648 -207 -421 -515 -195 -66 247 503 348 328 8 -384 -396 -522 -295 75 252 484 446 180 41 -412 -481 -377
2670c77N4M49K21R8P9l54k78j88k73J79J97K59L96L5m1k13m69j11j90K2L91J98
2692H4L43J74k30j31l83l53L4n0L34L93J39K55j98k92k34l79k2J32J48M53K64
2713D81J2jm03l22j96j81K30K71K94L78o3r9k55m56j52j10J29M27K45K76J07k82
2735C30k29l79k82M3J03L60L82J12J42k23l84k48l13K2K20K62M26J89n2r2m16
2756b7k93j60j18L12L25K90K71q7j84k99m49p7k0J82M05K60K26j5k86k61l81k15
2778f01J42J55L65L60O7O3l11l59k57k38J29K92K40L63J59j45j57m18k99o3J6
2799d97L30L04K68K22j82k36l55l28l5R7K02M30K07J03p2l47k60l05j51K24K41
2820a40K92L37k6m6k82l89j76j31J59K97K44L45K0j95j90l69k15kO9L50K98J38
$$ plain form
2670 -377 -323 126 347 445 524 170 -108 -296 -569 -390 -193 66 462 497 456 243 -226 -337 -527 -505 -114 84
2692 84 427 601 371 240 -143 -496 -462 -512 -178 215 354 609 411 119 -115 -494 -516 -384 -236 217 481
2713 481 493 492 89 -233 -429 -610 -380 -109 185 563 500 401 146 -310 -462 -572 -443 -16 229 505 612 330
2735 330 101 -278 -560 -517 -414 -54 328 440 582 359 -25 -273 -586 -564 -344 -82 344 533 481 389 -27
2756 -27 -320 -480 -598 -286 39 329 600 513 329 30 -419 -496 -516 -334 71 331 557 542 256 -5 -386 -601
2778 -601 -459 -304 61 421 488 551 240 -119 -376 -614 -485 -193 47 410 569 424 267 -151 -450 -513 -497
2799 -497 -167 137 405 627 445 209 -146 -474 -509 -412 -210 220 427 530 458 111 -149 -454 -605 -381 -140
2820 -140 152 489 463 417 135 -254 -430 -561 -402 -105 139 484 504 309 119 -250 -465 -467 -398 -48 250 388
2842C88J44k10k52k87k69O3J24K05M07J16np1l81j88k17m8K53J86L03K16j01q7
2864B89l06l01o6m0J51L41J42J96k7k17j48l27r8N4J04L00K37L5P2j98k46j77
2886b30j84J23J20J70L18J6lj27k80j35q4m4K47J31K26J21j27j34k08k04OpJ51
2909a38K39Q7J46p8j78j42k14o2J04J18K12J36K6j5j88j93n0j13R3J46J42J96
2931B74l8m4j01k18q3j8M3J88R7J15L1j33j07j52r7N2M2J14J97K2O2j18j69o9
2955a10j24OJ40O4J67P4o1m3j89j11Mk2J52J13Q1J02r4j01j14j63N1P3N2J85K2
2980A54M4j8k15n9q6n8J57P8Q5J55j13mj47j47Rn8J31J64N8J07k2j67q0j85j0
3005b27J05QK02R4%M7k08j53n1j04J49R7J29J87k8j10o3k52m6rK1K68Q8R7M4j82
$$ plain form
2842 388 532 322 70 -217 -486 -423 -299 -94 313 429 424 353 -28 -216 -433 -481 -228 -42 261 477 376 289
2864 289 -17 -318 -384 -424 -273 68 210 406 379 162 14 -313 -411 -357 -253 47 284 319 391 193 -53 -230
2886 -230 -414 -291 -171 -1 317 333 330 203 -77 -212 -296 -340 -93 38 264 385 258 124 -84 -288 -282 -289 -138
2909 -138 101 188 334 256 78 -64 -278 -340 -236 -118 94 230 256 241 53 -140 -190 -303 -210 -64 78 274
2931 274 236 192 91 -127 -210 -228 -185 3 100 215 246 113 6 -146 -243 -191 -149 -35 162 184 246 128 -41 -110
2955 -110 -234 -228 -88 -24 143 217 156 113 -76 -187 -183 -205 -53 60 141 243 149 48 -66 -229 -178 -105 -53 132 154
2980 154 198 180 -35 -94 -180 -238 -81 -3 82 237 124 120 -27 -174 -165 -223 -92 72 130 237 215 48 -32 -217 -227
3005 -227 -122 -114 88 182 182 229 21 -132 -183 -287 -138 -41 88 275 247 137 74 -178 -224 -233 -212 56 144 241 285 103
3031A03j01j63j54J06M0J90J96mQ3j80k00j24j50R6J48J45K01R0r7o2k51j74%
3054b62o8K44J66J25J57j58r6j64k51J0O4J02K85R1O3m5k33j54j67r1J58J42J94
3077A12K06j9m0k04k67o8n7P0K47J14K47l3j57q2k87j08J3K9K71K15P0R7j42j99
3101B8j26k70Q0J02J71K75L7K7r3k80j30j30o5K32J27K11J69j27m5k01k42j2o7
3124c29J48K29J13J75p2j74r6k29p8O6K3K74J75M1P7j94j89j44j72R2J21J71K35
3147B63L0m1q2k63r4j23PK31J20J71J31j43o9k12k01J9m4J96K10M9J57q2j96j02
3171f8j89n2J00Q9K36J17qK3k38j11j05j18J37J20J39K07n0l1j25k56j0o6O4K36
3195D1M5J21M5j05j08j89r9O3J7J80J62j0J24j74j68p7j42M9J29K9K30N4o7lk10
$$ plain form
3031 103 2 -161 -315 -209 -169 21 217 213 296 116 -84 -208 -358 -262 -114 31 232 322 225 163 -88 -262 -262
3054 -262 -330 -86 80 205 362 204 108 -56 -307 -297 -233 -131 154 245 308 263 30 -124 -291 -382 -224 -82 112
3077 112 318 299 259 55 -212 -280 -337 -267 -20 94 341 308 151 69 -218 -326 -313 -284 -13 202 272 369 227 28
3101 28 -98 -368 -288 -186 -15 260 297 324 231 -49 -179 -309 -374 -142 -15 196 365 238 193 -8 -250 -262 -329
3124 -329 -181 48 161 336 264 90 -6 -235 -313 -247 -224 50 225 266 343 149 -40 -184 -356 -264 -143 28 263
3147 263 293 252 170 -93 -187 -310 -303 -72 48 219 350 207 138 -74 -275 -256 -300 -104 106 155 312 230 34 -68
3171 -68 -257 -309 -209 -120 116 233 225 248 10 -101 -206 -324 -187 -67 72 279 229 198 73 -183 -193 -259 -195 41
3195 41 86 207 252 147 39 -150 -249 -186 -169 11 173 163 287 113 -55 -132 -274 -225 -96 -67 163 217 150 147 -63
3220f3q2p1k6J86P6J47R3j01n6j24j79lNJ12J89M1R0j8j83r6j14q0J25N7J52J35
3246B12l6j2j50j26m9r8R0J69K9J50j1p1n5j65n6RjJ91N8R2L8j41k6j52q1P1J3
3273a08P8J88k5Q3r4j76j7j40M2Q7P0J17Q6j07j5j20q4on7J06J19K9J19m3j33
3298aj8j25KJ7nJ72N1N1L7j73l2p8r8J13J5Q6J02j4N0l6j73j0p2NJ17L5J09K9
3326A56q9Pj40p9L0l7J04O4M7R0q0p1rj47J5L2QJ75QJ8L0j52l3n0l5P8RP4J08
3355A31p6K8l9j19lj7K6J12l2J00j3r1K7j17k7M7j5J15K5l3P9j06k0k2p5P9lP
3383c2R6n0Joo4L3Kl6Q5j7L8K6o6Qk0n7O0j6K7L2m3J1ml7P7n9k9M7k5P4m1l0K9
3416A4p6L6L2n1Q0k6k2L6n2nkn0Q4K9j7P4p8l7rl8L3L9pQ8m5M4k0q3Nm9mR3k6
$$ plain form
3220 -63 -145 -216 -242 -56 20 167 260 159 103 -21 -200 -203 -198 -86 103 144 234 216 33 -63 -177 -257 -132 -75 77 212
3246 212 176 164 14 -112 -161 -259 -169 0 29 179 168 97 42 -123 -179 -170 -171 20 78 170 208 67 41 -111 -192 -121 -108
3273 -108 -30 158 133 216 122 -54 -71 -211 -169 -82 -12 105 191 84 69 -51 -135 -141 -198 -92 27 56 175 132 -1
3298 -1 -19 -144 -142 -125 -130 42 93 144 181 8 -24 -102 -200 -87 -72 14 116 102 152 116 -57 -67 -139 -134 -17 18 127 156
3326 156 67 74 -66 -145 -115 -152 -48 16 63 153 73 2 -7 -154 -139 -107 -99 76 84 102 132 -20 -53 -103 -138 -60 -51 23 131
3355 131 55 83 44 -75 -78 -95 -69 43 11 111 98 7 34 -83 -110 -63 -78 37 62 29 108 2 -18 -40 -115 -36 -39 -32
3383 -32 64 14 15 9 -55 -22 -20 -56 29 12 50 76 10 18 -2 -59 1 -15 12 44 1 12 8 -29 48 -11 -40 7 -18 56 15 -15 14
3416 14 -62 -26 6 -45 35 9 -13 23 -29 -34 -36 -86 -2 27 10 84 6 -31 -40 -78 -45 -6 -13 75 30 74 54 -29 -24 -73 -77 16 -10
3449a0M5N2m4k2rr8ROK9N6K9K1l5l1lr7L7L4oN7M8lJ5o6j4m5p6J3N2L9J01plj3
3483F1r4J8q1j4R7PO8N4o8Ol8j23L5m1Q6M5kJ06l1m2m2j19k3L5l7J46J0O2J7o5
3513C3m1n1p1J7N1L2R5J9L1o6p1rr2j7N1P5Q5L6J1j8r4o1n4k2N6R0L4Q1Lm9n5
3544B9j08n2j7RJ19N1P3L2n9p8o7r4K4N8O8Q8K7K3l7n6p9o7l4O7O8N0R4k8J4r4
3574B4r7l1n3Q5P9M9R0pp7m6q5o9K4PJ13L6N6j0o8n6k9o8J3K7Q3O3L6MOj13k8
3605d2o4n1Q6L4J18L0rl9m4o1m1l3L5O1N6N6Kn7Mq7m2NMN9N5L4J0k5q0k8n3L4
3637g3MM6L3L7K2j3p6lo0J1M2J6M1L2j2Qj7o4m1J2J0L7M7J2J0l5k0n4k2J4MK1
3669c1K5N0Kj6k0l4m7J9JoR6J2j3Pl8k7j4l5J2N5J6J6j3J4k2m1KLlL1L4J5J5m9
$$ plain form
3449 -10 35 87 43 21 12 -86 -77 -71 -42 14 43 64 29 -2 -5 -102 -65 -31 -37 20 68 65 80 14 0 -45 -121 -108 -56 -17 84 77 74 61
3483 61 -33 -15 -96 -110 -13 -6 62 116 48 54 16 -107 -72 -113 -27 18 16 122 91 49 7 -112 -135 -100 -137 9 19 81 98 33
3513 33 -8 -59 -130 -113 -62 -30 65 84 115 49 -22 -31 -123 -140 -89 -14 71 107 118 100 6 -55 -109 -131 -75 15 49 130 133 84 29
3544 29 -79 -131 -148 -139 -20 31 104 136 77 -1 -68 -162 -138 -80 -12 76 103 126 89 33 -46 -113 -147 -80 -12 38 132 104 118 24
3574 24 -73 -104 -157 -72 7 56 146 139 62 16 -69 -138 -114 -107 6 42 98 88 20 -36 -65 -133 -120 -93 -10 53 89 93 99 -14 -42
3605 -42 -106 -157 -71 -37 81 111 102 63 19 -42 -83 -116 -81 -20 36 92 94 37 41 -46 -88 -83 -79 -20 35 69 79 54 -26 -54 -107 -73
3637 -73 -69 -23 10 47 69 56 -20 -23 -83 -72 -30 -14 27 59 47 55 38 -26 -67 -55 -45 -8 39 51 61 26 6 -48 -70 -56 -52 -31
3669 -31 -6 44 46 30 10 -24 -71 -52 -51 -57 39 51 38 45 7 -20 -34 -69 -57 -2 14 30 17 31 9 -32 -30 -27 -30 1 35 50 65 16
3703A6J1m0m9L8rK5L6K8l4Mk9k7k8K6j2j6Q4oL1l3l4j8j3%J9J1LJ7J7J0j2pk4
3736a5l0J8K8K8K6j1j4k4k5k3MJ4K5L1QJ7j3p8L0m4J8L0k7K8lK3k3l3j6qlL5J5
3769a2K9k0M4j5p1jJ6l4L4L2J0M2k3j1k0n1M7Jj8K1N5k0Qj7m7k6k5O2j3J4K8J1
3801C0j1j1m9OQk5N1j7J1L7j5k8rl7L2jkL7J6J1Ql3k1Qk9J6j5M7J3J2j4kj8l3
3835b7QpJ5j0L3Oj9Lm2K8k2J1K5kk6J0Rj0J4k2j0qpK9MJ9K2m3L2ol1J0j8K4K1
3870A3k7N2j4llk6JOm1M1lj7Q1l9nj1l1Rk9j4N9j3K3K9n7L0k1m1K5rJ8O9l9K7
3904D0j6j5rn2K9pMP4j3n2O3n3qLm3M7%jL4j3K0lq0K5K0k6L3k2M1nk3L9o8J4k
3939b5k8N2K2k0N0jj1n3k6RJk1O8J4j0O7l3p3Ol2K0l1M0P9m2J2j6p5L2k9j1M5
$$ plain form
3703 16 27 -13 -62 -24 -33 -8 28 56 22 26 -3 -30 -58 -32 -44 -60 24 18 49 16 -18 -36 -49 -49 -30 -19 -16 1 18 28 16 9 -15
3736 -15 -45 -27 1 29 55 44 30 6 -19 -42 -38 -24 1 32 40 57 44 -34 -4 -48 -30 0 -27 1 -2 21 -2 -35 -51 -59 -62 -27 -12
3769 -12 17 -3 41 26 -45 -46 -30 -64 -30 2 12 54 31 20 0 -51 -4 -3 -21 0 55 35 43 26 -21 -47 -72 -10 -23 -9 19 30
3801 30 19 8 -41 -35 -27 -52 -1 -18 -7 30 15 -13 -22 -59 -27 -28 -30 7 23 34 42 9 -12 -4 -33 -17 -32 15 28 40 26 24 6 -27
3835 -27 -19 -26 -11 -21 12 18 -1 2 -40 -12 -34 -23 2 0 -26 -16 -7 -17 -3 -25 -35 -43 -50 -21 -17 2 24 -19 13 7 -24 -14 -32 -8 13
3870 13 -14 38 24 21 18 -8 -7 -1 -42 -1 -4 -21 60 21 16 5 -26 -17 -46 -60 -1 -14 9 38 -19 11 -10 -51 -26 -35 -17 52 13 40
3904 40 24 9 0 -52 -23 -30 -26 48 35 -17 46 -7 -15 -12 -55 -8 -8 -9 25 12 32 29 -51 -26 -6 -32 1 -21 20 15 -8 31 -37 -23 -25
3939 -25 -53 -1 21 1 51 50 39 -14 -40 -31 -30 -51 17 31 21 88 55 -18 -12 -44 -24 -55 -15 64 22 34 18 -57 -25 -54 -65 -20
3971b0pN1K9j6jn1m2J7j9J8K2K7M7k6oJp6qL6j6M6M1j8L4m0ok6l8K9m6O8L9l1
4004A2M2k0o5M4n9lM6j0J7J6j1K1k8p0M7m4K7L4nK9k8NK9o1qPRK2J2MJ6k9NK6
4038B9r9O7m2K2L3K4oL8n7K3m0n9N0k9M5K9j0N2o0o0O8p9L0J4j0M3L3k9K6n8j3
4069b5j8k9N7J1J7Q1n8j2%p3J1j2K5O2jL1J4r5K9m2l5L4j6R1J2l1N1n3p2J2m9
4100h3P2QLM5m3k1L0o1J4k4k1R9LJ6K0n7j2ml8L2lM6N2o2K5l9l0K2lj2N0l3N2
4133D3pm6L0n9JpQL5L7o5P2p4l0K0l8N4%L4Pk0j7K3p5N7%j0N9j3%Pm9K7k2kL0
4168A0j5J3N7p2K3k4k5M8l5k1P0n6Q2m9n7N7l5K1K4k1J3K9o5M3o5OK9k8P3j5k1
4199fK5k6k5mj9N0K7j4M2k8m2K0j6J0%j2N9l2MKn1J4Nk7M1k3K5lm2L6l6l3Q7j4
$$ plain form
3971 -20 -27 24 53 37 36 -15 -57 -40 -59 -41 -19 8 55 29 23 24 -52 -60 -24 -40 6 47 29 63 23 17 -9 -47 -18 -64 4 43 12
4004 12 54 34 -31 13 -46 -49 -3 -13 4 20 9 30 2 -68 -21 -65 -38 -4 -9 20 -8 -3 26 -35 -43 -36 -27 -5 7 11 27 -2 3 29
4038 29 -70 -3 -45 -23 10 34 28 66 9 32 -8 -67 -17 -46 -1 28 18 70 10 -50 18 -61 -31 -17 -27 16 49 20 46 -12 -25
4069 -25 -43 -72 -15 -4 13 94 36 24 24 -49 -38 -50 -25 37 36 67 81 -14 15 -27 -62 -28 -44 47 59 28 79 26 -46 -34 -83
4100 -83 -11 -3 0 45 2 -19 11 -50 -36 -60 -81 18 21 37 57 0 -12 -16 -54 -22 -25 21 73 11 36 -3 -33 -11 -14 -26 24 -9 43
4133 43 36 -10 20 -39 -38 -45 -37 -2 35 -30 42 -32 -62 -42 -80 -26 -26 8 15 -5 -22 1 -74 -17 -17 -27 32 19 19 26 -23 4 -18 -20 10
4168 10 -5 8 65 -7 16 -8 -33 15 -20 -41 29 -27 55 6 -51 6 -29 -8 16 -5 8 37 -28 15 -50 -44 -15 -43 30 15 -6
4199 -6 19 -7 -32 -36 -55 -5 22 8 50 22 -20 0 -16 -6 -6 -18 41 9 13 15 -36 -22 -17 -44 -3 -26 -1 -4 -46 -10 -46 -79 8 -6
4233fJ3K1j5ok4l3N6k9J0L0jM6m7k7Rj0rK2oO1j0j9Ko8L1J7o0R3j5jJ4m7J2l5
4267c1j9K9MrN7m4N3l4m9J8l7M4M0m2N7Rp6N5o1nP4m3J8K3l4M6n4m0K1qK5O2m7
4300BL1l1Nk5m4O2J5l7Q3m4j8K4o8J7Ok4P2k2k1O9q9M0m2k5K8J3N5Jl9Jmm5M6
4333hm0K8M1k0M8jp0K6n4J1N4j3K6J0QLo9l1L9j8J9K5l7P3m2nk4p1N2J3qN9k0
4366DJ0Mo3J5Lj4M9l1N2M8q8L3k4k4Jj0M2K4k9L6Km9Oo4M3M4j0Nk8jJ8m5M3Km3
4401c9J8K9j2k0j9L6%j5L7l0j6K8j8K8jm5O0j9j4K5lj5oNL4nn7P4m0pJ0l7L5L
4435Dk5M4o1K8M9p0M6m5jJ2MJ4K9l1J5m3l1P2l8L3JqL4om6M0l8JLLN4j0j6mk8
4470a5MJ1n3P5j4K5K3p9RJ9o4M0k1J4O2l8K1jn0L6l2j6K7kL8J6ql7Km3N6m0M2
$$ plain form
4233 -6 7 28 13 7 -17 -50 6 -23 -13 17 16 62 15 -12 -3 -13 -22 0 -6 55 45 26 28 -40 -9 8 -52 41 26 25 39 -8 4 -31
4267 -31 -50 -21 -17 -26 31 -13 40 6 -43 -25 -62 -18 22 -20 37 46 -30 25 -36 -41 33 -10 8 31 -3 43 -11 -51 -30 -38 -13 49 2
4300 2 33 2 7 -18 -62 0 15 -22 61 17 -1 23 -45 -28 -22 -46 26 4 -17 52 -37 3 -39 -64 -36 -23 32 33 -6 -5 -9 -54 -8
4333 -8 -48 -20 21 1 49 48 -22 4 -50 -39 15 2 28 38 46 49 -20 -51 -12 -30 -11 14 -23 50 8 3 -21 -92 -40 -27 -35 24 4
4366 4 14 18 -45 -30 -27 -41 8 -23 29 77 -11 22 -2 -26 -25 -35 7 31 2 38 40 -9 -3 -67 -24 20 10 15 -13 -14 4 -41 2 4 -39
4401 -39 -21 8 -4 -24 -43 -7 -7 -22 15 -15 -31 -3 -21 7 6 -39 21 2 -12 13 10 -5 -11 -6 28 23 -34 40 0 -7 3 -34 1 4
4435 4 -21 23 -38 -10 39 -31 15 -30 -31 -19 -15 -1 28 -3 12 -31 -62 10 -28 5 6 -2 32 26 -20 20 -18 -17 -14 -11 43 33 17 13 -15
4470 -15 -11 0 -53 22 8 33 56 -23 -14 5 -59 -19 -40 -26 36 -2 19 18 -32 4 -28 -44 -17 -19 19 35 27 -10 -8 -51 5 -35 7
4503GplJ7k8J2Pn8N0k4NM4Kj1%l4K1j0l8M7l2M1ok5L1ml8L3l2K9kj5L0k2%K7n2
4539c8K8J3j5L4nj6O5p9K9k5j4M5j4rO2o6jK4m2L8j7j1jJ1J0J4k5K5j7j8Lj6J2
4572a6PPK6l7K0ml0j4L5m3O1k0J6L2n1RJ4k9L1Jk5M2pj2K3o2M6l1pM8o3M5L9l1
4606B0j9k8oJ5OL2k1l2N6l2k3M2l9J4JjL3k3K6k9j3J8nqJ2KnN8o8L9l0k2O1n5
4640b4J6L8q4P1k4l0L1j6K4Nn4L0N8o7K1l1K2Qj9M7j7m3M0l6KO1q1P7lk9L5n0
4672b2J0K8l6M8j6l7N1m6JM5m3L3j2LL3n1j1J5l3P2m7oM4m1RJ2m3J4Ql4M8k2L2
4705FMjrj0k8RrL1K1j6MK0k3Nk9%K4j8O0nl0j0Pj5K2m2J9Oj9N1l7J7L0n5k6J6
4741c0j2O0Nn5M3l2K8k3l2N5k2L2l6LK3j6k5OJ2kO1m0J6k8j4L1m4N4j3j6M8k1
$$ plain form
4503 7 0 -3 14 -14 -2 5 -53 -3 -27 -22 22 24 13 13 -21 0 -10 -48 -1 -33 8 2 -23 8 4 -34 -1 -33 -4 -6 -21 9 -13 -13 14 -38
4539 -38 -10 3 -12 22 17 1 66 -13 16 -9 -23 22 8 -1 61 -5 -6 18 -24 14 -3 -14 -15 -4 6 20 -5 20 3 -15 -12 -28 -16
4572 -16 -9 -2 24 -13 7 3 -27 -41 -6 -49 12 -8 8 40 -11 -2 12 -17 14 15 -10 32 25 13 36 -26 20 -11 -18 30 -33 12 51 20
4606 20 1 -27 -33 -18 -12 20 -1 -33 23 -9 -32 10 -29 -15 -14 -15 18 -5 21 -8 -21 -3 -8 -16 -4 -2 -7 51 -17 22 -8 -30 31 -24
4640 -24 -8 30 -54 17 -7 -37 -6 -22 2 7 -47 -17 41 -26 -5 -36 -14 -6 -25 22 5 -38 2 -34 -32 29 -52 25 22 -7 28 -22
4672 -22 -12 16 -20 28 12 -25 26 -20 -19 26 -17 16 4 7 40 -11 -22 -7 -40 32 -15 -21 23 -18 -9 3 -40 -26 -18 -52 -4 -26 6
4705 6 10 9 0 -10 -38 -29 -38 -7 14 -2 2 22 -1 4 -25 -25 -1 -19 41 36 6 -4 3 -12 10 -32 -13 -7 -26 25 -12 5 35 -20 -46 -30
4741 -30 -42 18 23 -32 11 -21 7 -16 -48 7 -15 17 -19 -16 7 -9 -34 -28 -16 -18 43 3 19 -9 -23 8 -36 18 5 -11 37 16
4773A6j9j2l6J9K8k6K2K0k1L0Lk1k1qKJ8J2Kl4M6k7rj3nK3K9Mm2M0k0K2m3mJ0
4807a5K1j5K6k0K8ql9K9Nj3J7Nmj9%k5j4lJ8J4J1J3j6Oj5j4J0j8K1J4J7K0l1k8
4841b2K9m7J5J2L4k3J2Nnk9J2NoN4m9J6%k6J8lj3kPMK5k9L3k8j0j0lMmJ0qoL1
4878CNj2Rj9J8JMQj0jj6J7j4NJJ3J5k9J5Rk3RJ8k9K1nmOqlk6JJ7j6MNjJ7j1rj
4919a6J0joK1qOj1m9O4j1NK6j9Knj2j3KJ0j7mM7qj4Kk2L0rQLMm5J3j3K9kl1L2
4957bj8j3jM2kj2J7k0jj9M2l8K8k5K1L1n3nK6K4pm4J2L8l2Nk8OJ8J5LOqK4l8P
4993aLj5k4O1k5j1K7l1MjK5k0plRmK4mk8L2k3L4l0QL0k4m2O1k6K0jm8K0kJ8ok1
5030b1L9j0k1K8Qn6K5J5l2J5nJ0rl1K6KPJ3j8L2m0J4RJ5J5k8j6L2l6KjJ2kJ8j7
$$ plain form
4773 16 -3 -15 -51 -32 -4 -30 -8 12 -9 21 24 3 -18 -26 -24 -6 6 8 -26 20 -7 -16 -29 -34 -11 18 22 -20 20 0 22 -21 -25 -15
4807 -15 6 -9 17 -3 25 17 -22 7 12 -1 16 21 17 -2 -2 -27 -41 -44 -26 -12 -1 12 -4 2 -13 -27 -17 -35 -14 0 17 37 6 -22
4841 -22 7 -40 -25 -13 21 -2 10 15 10 -19 -7 -2 -8 46 -3 13 13 -13 5 2 -11 -13 -6 -2 23 -6 27 -1 -11 -21 -24 -20 -24 -14 -22 -28 3
4878 3 8 -4 5 -14 4 5 9 17 7 6 -10 7 -7 -2 -1 12 27 -2 13 22 -1 8 26 -3 18 13 9 15 7 4 -22 -21 -4 -20 -16 -11 -12 5 -6 -15 -16
4919 -16 -6 -7 -13 8 0 6 -5 -54 10 -1 4 30 11 13 8 -4 -17 -15 -5 -22 -26 21 13 -1 1 -21 9 0 8 11 15 -30 -17 -30 -1 -3 -34 -2
4957 -2 -20 -33 -34 8 6 -6 11 -9 -10 -29 13 -25 3 -22 -1 30 -23 -28 -2 22 15 -29 -17 21 -11 -6 -34 -28 -10 5 8 14 6 30 -8 -1
4993 -1 2 -13 -37 24 -1 -12 15 -16 -12 -13 12 -8 -15 -18 -9 -13 11 7 -21 11 -12 22 -8 0 30 6 -36 25 -1 19 18 -30 -10 -12 6 0 -21
5030 -21 18 8 -13 15 23 -33 -8 7 -25 -10 -15 -5 -14 -45 -19 -17 -10 3 -15 17 -23 -9 0 15 30 2 -14 18 -18 -16 -17 -5 -7 11 -6
5065fK8Jj6j3Rj8L0j4K3Lm9N0m9K0j8k3L9kkM5n2M9o5KL9Mk5L5m0rM6k7J0kJ2
5100A5J6l6J6J9m8OL3m8L2m1K4O2m6J6k7lJ3rj4K9j6K3mk0J5m0K1nj2K7l3K0K6
5133A1l3K9L0p3N7m7l1P8l3L0k5l6N2k2J7k4ML9jp2N3l0j8N8k5NMKj1qMK6l2J1
5167a1jj7M7k3l1M8k9J0J0m9L6J7jj2qK5jj6JJ6j8L3m3M1ll9L0k4l1K5K4jk0N
5201a0L7o3J0Mj6L7J4l0J6on3M9n6N3lRj6J6J8ql7N0J0m4J9%pL7m0kM8p9O3k8
5235hQL5l6J3K0n3M2l2RJ7k3K6nn9M9l0JK4n5P7j5l%J6qm2K9JJj1O7n1rL7n0M
5271a4J1mJ3NpM4m9J0l2rM5Jj2L1l6kLk3J8NOppJ6l2%K1l1K9j3pN7l8oM1J2m7
5308hNk7L8K3j2Knk7lJ1J0PnkK6Lnm6LL2rJj7LL8l2Pm2K4K4l3J2L8n8K0j5j6K9
$$ plain form
5065 -6 22 23 7 -6 3 -15 15 1 24 27 -22 28 -21 -1 -19 -42 -3 -5 -7 38 -14 35 -30 -28 11 15 -10 25 -15 -24 22 -5 5 3 15
5100 15 31 -5 11 30 -18 -12 21 -27 5 -36 -12 50 4 20 -7 -10 3 -6 -20 9 -7 16 12 -8 7 -33 -12 -17 -29 -2 -35 -15 11
5133 11 -22 7 37 -36 21 -26 -57 21 -12 18 -7 -43 9 -13 4 -20 -16 23 22 -50 3 -27 -45 13 -12 -7 -3 -1 -12 -20 -16 10 -22 -11
5167 -11 -12 -29 18 -5 -36 12 -17 -7 3 -46 -10 7 6 -6 -14 11 10 -6 -5 11 -7 26 -17 24 21 -18 12 -12 -43 -18 6 5 -15 -10
5201 -10 27 -36 -26 -22 -38 -1 13 -17 -1 -7 -60 -11 -67 -14 -17 -8 -24 -8 10 2 -35 15 25 -19 0 0 -7 30 -10 -12 36 -43 20 -8
5235 -8 0 35 -1 12 32 -21 21 -11 -2 15 -8 18 13 -46 3 -27 -26 -2 -57 20 5 2 2 18 10 -32 -3 -2 -1 -12 55 4 -5 32 -18 -14
5271 -14 -3 -7 6 11 4 48 -1 9 -23 -32 13 14 2 33 -3 -5 -2 -25 -7 -2 4 -3 -10 6 -26 -26 -5 -36 -7 -20 -27 30 -8 -14 27 39 -8
5308 -8 -3 -30 8 31 19 21 16 -11 -14 -3 7 14 9 7 33 36 31 -15 -12 20 11 12 -5 -2 36 4 11 -31 -7 17 -16 -4 34 -24 -4 -19 -35 -6
5346flk1M5j8J3lj7L6o3K3K2k5K0j3K5j3Qk2M4o1J9N4n0K3l8L2k1j6L7j1k8M8
5378B0l7J2j2k3K9kj4K2%oL0pk4j2LL8k5J6Rm0M2Ml4L1j6lj4lL5J5m1PpK8lk4
5414fK7k0RJ8l5j9J4nJ9k4lRnK4mk5L8m5RP3p7M8lj9J7ok1K0kjmj0M7k9k3L8k7
5451ck9L9l0K2PLll0J2jJ0J8k6j4M0m0M2m8j2M8j3k5lK1K7Nk6MRk5J2RM5j1k7
5486GqrJ2Pk0K3j5J7j%j4Nj4K6k6j9K9jopk4N6k6l7O4j7j4Qpj9J7lJ4l2lO1k2
5523Bqjk5K5NqMJ6J3k6PJ0m1QO0q6P0l3j6L3m2J1J9k7J0%k3N9l2jK8n4L5j4nK9
5559BNk5K8k6P%jK2LrOrNj2j7L1Jj5L5k9L4j0k5J2j8rOKJ5j4L3k0l4l1M4Orj5
5597c1PL9m7L2k6OPJ3oJ1J7j3Rn1K3L0m4K1kL1Ql8%K2k5J4j2J2L3n1K0j9J0qR
$$ plain form
5346 -6 -9 -30 15 -3 10 7 -10 26 -37 -14 8 -17 3 -10 15 2 10 -12 32 -29 -10 44 -6 17 -21 11 -10 -26 11 0 -28 20
5378 20 -17 -5 -17 -40 -11 -13 -27 -5 -5 -11 19 12 -12 -24 -21 17 -8 8 17 -23 19 23 -11 20 4 1 -13 -16 19 34 -7 0 -7 21 18 -6
5414 -6 21 1 10 28 -7 -26 -12 -17 2 -22 -25 -16 -21 3 -1 -26 12 -33 -24 49 -28 20 17 -2 15 9 -12 8 6 5 1 -9 38 9 -14 24 -3
5451 -3 -32 7 -23 -1 6 9 6 -24 -12 -13 -3 15 -11 -25 15 -25 17 -31 -43 5 -8 -33 -36 -15 12 17 -9 -5 4 -21 -9 0 45 34 7
5486 7 -1 -10 2 9 -11 12 -3 14 13 13 -1 4 -10 16 -10 -29 0 -1 -7 -14 -38 18 -8 -45 19 2 -12 -4 -11 -30 -13 -16 -2 -34 -37 24 2
5523 2 -6 -7 -32 -7 -2 -10 -6 10 23 -3 4 14 -27 -19 41 -45 25 -8 -24 9 -33 -22 -3 -30 -20 -20 -43 16 -16 -17 11 -43 -8 -22 -27 2
5559 2 7 -18 10 -16 -9 -9 -10 12 15 6 12 3 8 -4 -21 10 11 -4 31 2 36 26 1 13 -5 -14 -8 -6 9 -5 28 8 -26 -57 -13 -7 -16 -31
5597 -31 -24 15 -32 0 -26 -20 -13 0 -6 5 22 9 18 -33 -10 20 -24 -3 -5 26 34 -4 -4 18 -7 7 -5 7 40 -11 9 -10 0 -8 1
5632AlJ9l7K0NMJ3l1LQj3J2K2l2K8k0JLjj5j3K4J4k1J1J4k9K%lJ8NOmj8LRLnj8
5672a5K7j3k4J7NrL5l6k3M1m1K9k4J0J5nj3NJ0K4%l2M0l4nL5kQk2J8Jj9Oj1l8
5707d0N8pJL2m4J2k4m4K4M2l7L0mK7l7k5K2J7l8N4l4J5Nk0K2jm1mM2%J0j2PK0
5741B8l5J9nl8O1k2nJ8j7J5l1J3J5l9J3K0j4J5rj8lk6L0oKK2j5kmj3OJ3k6N1o
5776Gj1K7k9K1k1J1K5j3l3N1k8J5j4l5L3k2j1O2k7Jl7K0JJ0j8M0m0L7j6l3K9k6
5808b4NJ6m6M7kLJ5j8Lmj1K3klPNj3K7l2Oj4j4M5j9PkJ4k5olL5m3LL7J7rl9k4
5846c8L6k6J8mK2J4l6M9k9%m7M6k8N6j8Kl%%Rm4J3K8k9M6m4L3mn0L7m6J7M2nJ6
5881C3j1n2JL5m7M5l8O3j9pJ0l5j9L9pk5K4j2K4k6L3kk8j9M7pL1k1%K7n6J0J9
$$ plain form
5632 1 -2 17 -20 0 5 9 22 -9 -6 2 -11 1 23 -9 19 -1 0 3 2 -13 -26 -2 12 -9 2 16 -13 -11 -11 -14 4 9 15 11 -7 -4 5 8 3 -15
5672 -15 12 -1 -25 -8 -3 -12 23 -13 -36 5 -36 -7 -31 -21 -6 -11 -24 -19 -9 15 15 -17 23 -11 -16 19 17 25 3 21 22 3 9 -2 -40
5707 -40 18 11 12 44 0 12 -12 -56 -32 10 -27 3 -1 26 -11 -36 -14 3 -35 19 -15 0 5 -15 7 6 -35 -39 3 3 13 1 8 28
5741 28 -7 12 7 -31 30 8 3 21 4 19 -12 1 16 -23 -10 10 -4 11 2 -16 -19 -45 -15 -21 -19 3 -12 -14 -18 -31 -25 -12 -38 13 7
5776 7 -4 23 -6 15 -6 5 30 17 -16 35 7 22 8 -27 6 -16 -27 35 8 9 -28 -8 -7 3 -15 25 -15 22 6 -27 2 -24
5808 -24 -19 -3 -49 -2 -4 -1 14 -4 -1 -5 -16 7 5 2 9 14 1 28 -4 2 -12 -26 19 0 7 5 19 -6 -12 -15 20 -23 -20 17 34 25 -14 -38
5846 -38 -2 -28 -10 -14 8 22 -14 35 6 6 -41 5 -23 33 15 17 14 14 14 23 -21 -8 20 -9 37 -7 26 22 -28 9 -37 -20 22 17 33
5881 33 22 -30 -29 6 -41 4 -34 29 10 3 13 -22 -41 -2 -9 -34 -10 -22 2 -24 9 7 -21 -40 7 0 31 10 10 37 -19 -9 10
5914A0l0M3j7PL3l8j8Qk8K1knJ3JL7k3m4K8l1J8M4o9L6J7j9K0n3K9jNoN0j8j6
5948Bj7J2J4m9J5J8L%K2k1j1lK7k1j6J1K3j3K0qk3ol2L8j1K2J3j8J6j4onk5L0
5982a3K0kpJ6j7J6k2k5K7OOM8n4M3n7rK1j5L4roL8l0n7L9n3N7K8m5L3K2k1Mn0
6016c4mj5K6M0k8K0L0k9K1n2j6J7j3M8K1k4QL0q6M0j4j5P6n3M0Qm7J1k9oM0l4
6048b3L6K6j4rk7k8K3l0O5j7K3J6l7jno6N3jk5N7pNNn4M0k1m5O0J8L4l3jm4M4
6082A7n5KK4mN4J0oj4o7MqOL9PL4m0l2K9m3j7L0j1N0PL2m0mm0K7l3NL7j2O5k6
6117B7Ok2l3K0k8mO7j8pM8p0jj9J8K1j1oN5k5Ll6j1Km3M6RML4ok1Pp0J9L2mL4
6153A7J8lK4r4L1Ql4RL0KN1m1j0j1nqj3K3N0k4K0Ml4k1l6K3M7k2K8Qm2L1o6%O
$$ plain form
5914 10 -20 23 6 13 46 8 -10 -2 -30 -9 -11 -16 -3 -2 35 12 -32 -4 -35 -17 27 -42 -6 11 -8 12 -41 -12 -13 -8 -14 36 18 2
5948 2 -15 -3 11 -38 -23 -5 -2 -2 20 -1 -12 -15 12 -9 -25 -14 9 -4 16 8 -15 -21 -53 -15 -26 -4 9 -9 7 -7 -13 -18 -43 -13
5982 -13 7 5 -2 14 -3 13 -9 -34 -7 -1 5 53 -1 42 -15 -24 -3 -18 16 7 1 39 9 -48 -9 -62 -5 23 -22 11 33 12 16 -34
6016 -34 -38 -53 -27 13 -15 5 35 6 27 -25 -41 -24 -37 11 32 8 16 46 -40 0 -14 -29 47 -6 34 42 -5 6 -23 -29 11 -23
6048 -23 13 39 25 16 -11 -39 -16 -46 19 2 25 41 4 3 -2 -68 -15 -16 -41 16 9 14 19 -35 5 -16 -61 -1 17 51 18 17 -27 17
6082 17 -38 -36 -12 -16 38 48 42 28 -39 -35 -43 -37 2 9 43 3 -29 0 -43 -60 -30 -41 9 16 48 8 4 -36 -9 -42 -37 0 -12 53 27
6117 27 33 11 -22 -2 -30 -34 33 15 8 56 -14 -15 -34 -16 5 -6 -12 43 18 21 -15 -26 -24 -67 -21 -12 -8 26 20 -1 6 -64 -45 -13 -17 17
6153 17 35 32 56 -38 -7 1 -33 -24 6 8 59 18 8 -3 -8 -16 -29 -6 44 20 40 44 10 -11 -47 -24 23 1 29 37 -5 26 -40 -40 -34
6188c4JJ6K5m4O2l4J5Po0K1LK1K5J0k6Ql3mMJ0K3l8K1L1k2Qqk4J8j5J3LPK3k8
6223El0LJ9l8M0Ok8N1k6lol0L4rL7l8lJNj5K6l0L1j1%K7j5k1M1l8RMpJ9qLj4K2
6261A3%j3j1N3p0LK9pPJ1m1K6l8L9J8m5J9L3k3J0j8k3K5k2M0Ok9M2j7k1J5k1J1
6294Ak0J3rJ7RRj3Kpj9K1K4l5N2j9k7o%jj4J9J3l3K1j1POk2roK0K7lmL7q3M4K2
6332B3m1lL6k7N8nl8J2l0J0qRK8l3J9J4o5N3k5j8K2J4oJ3l5L1%o1N6j9pL9l1J7
6366Bjj2K0m3J6M3m8O3k8k1L5l4j1L7l5M0Rk8Pm2J2M5n6L3mMJ4Nj0J1k8k2OPM2
6401B8m1k7N5k5OMl6N0j0J2j6Mj3kj5K9mrK3LK2k2j7nj3NNPM2rk2Lm2M0j0k5J8
6438gj9L6pJ0k6Kpl0O4Krlj8J2l9J2K8k9N6k0j9K1j6L2j4l8N8l2J4K6j8Ok6l6
$$ plain form
6188 -34 -33 -17 8 -36 26 -8 7 14 -46 -25 -22 -1 24 34 8 16 -17 -21 -17 -7 16 -22 -1 30 8 16 8 -16 2 -13 0 3 10 33 5
6223 5 -25 -22 -3 -41 -1 5 -23 28 2 -1 -7 -37 -3 -12 25 -13 -16 -15 -10 -25 1 -29 2 -9 -9 18 3 -18 23 -15 -6 -2 -9 10 2 5 -9 13
6261 13 13 0 -11 42 -28 -25 4 -3 4 15 -26 0 -38 1 19 -26 -7 26 3 13 -5 -28 -3 -25 15 21 -8 34 17 -4 11 -10 1
6294 1 -19 -6 -15 2 11 20 7 9 2 -17 4 28 -7 45 26 -1 -7 -7 -8 -22 -3 10 -23 -2 -13 -6 0 -22 -31 -37 -17 10 7 3 40 -43 1 23
6332 23 -18 -21 15 -12 46 41 3 15 -15 -5 -13 -4 24 -9 10 24 -41 12 -13 -31 -9 5 -1 12 -23 8 8 -53 3 -16 -23 16 -15 2
6366 2 1 -11 9 -34 -18 25 -23 40 12 -9 26 -8 -19 18 -17 23 32 4 11 -31 -19 26 -30 3 -1 3 17 22 12 23 -5 -27 -21 -14 28
6401 28 -13 -40 15 -10 -4 0 -36 14 4 16 0 4 -9 -11 -26 3 -1 -10 13 16 38 16 -1 -6 -19 -14 -9 -2 40 31 9 12 -30 10 0 -25 -7
6438 -7 -26 10 3 13 -13 -11 -18 -48 16 18 9 6 -12 0 -39 -27 1 -28 28 8 -11 10 -6 26 12 -26 32 0 14 40 22 28 2 -34
6472c4N2k2K9j8J9rmLnm0OL5m8M2Nl7L4j0j9L4j8J7rNJk6J7j5M0j6j8L4k9K4N
6507B5k0k3M9l9k4N7qk2K4l6Mkj4N4j0Kk7JK0l5K5k5J3Qk5K2KLk4J2oK4nkJ7Q
6543B3m7L8j7j9M2l0M4m0J4J1m7K0J6j1K7j1k1K4k4j4K9m9K9MkKK7m4KPQk8K7
6576a0L4l1K6k3nKj8ONLJ8rL3l1j6J0K5J3Kl4J0Qj6nJ9j9J5J8k3K8l4J3j1o3N0
6611a0J1k3O5m4K8k6k3J1k5nN5k8J5O%nk3l4L1k7L9Q3m8kj5m6N7m0NM3RL2m5j0
6645A1ml4NJ2J0J4K%JJl0kk4K4j5O1k7J6l8L7p2J3J9j5Q2m2K8l1J8Mo2J8KN2j4
6680B0K9l4K4m9k2J4j1M6k2J4K6j3m8L5m1OJ3k4K8J2lQo5L2oJ0K1kj6J3kJ1J2
6713A6k7OPj3K0M8m2jL0l3m2%M8l6K1K7j3K4l1j1j9ljJ3K2L2k3n1M5l9LK2l4J6
$$ plain form
6472 -34 18 -4 25 7 26 17 13 16 11 -29 -23 12 -36 6 11 -26 8 -2 -21 13 -5 12 3 8 9 -17 0 -15 25 9 -9 25 -4 20 25
6507 25 5 -18 31 -8 -32 25 17 -5 19 -17 -13 -15 -29 25 15 17 -10 -9 11 -24 1 -24 -11 -3 -28 -6 -4 -1 -25 -13 -19 5 0 -2 15 23
6543 23 -24 14 -3 -22 20 -10 34 -6 8 19 -28 -8 8 -3 24 13 -8 16 -8 -22 7 -42 -13 -9 -11 -9 18 -26 -24 -17 -9 -37 -10
6576 -10 24 -7 19 -4 -9 -7 -25 -19 -14 -11 7 -2 31 0 -16 -6 19 32 34 0 10 18 2 -3 16 -3 12 30 7 35 1 14 3 -60 -10
6611 -10 1 -22 43 -1 27 1 -22 -11 -36 -41 14 -14 1 7 7 2 -21 -55 -24 -51 -12 71 23 21 6 -40 17 -23 -18 25 34 66 21 11
6645 11 7 -27 -22 -10 0 14 16 16 17 18 -12 -14 -38 -14 -29 32 5 21 -17 20 -52 -39 -20 -35 47 5 33 2 20 24 -38 -20 -18 34 20
6680 20 49 15 39 -10 -32 -18 -29 17 -5 9 35 22 -26 9 -32 -26 -13 -37 -9 3 0 8 -57 -25 -31 -21 0 -2 -18 -5 -7 4 16
6713 16 -11 -5 2 -11 9 57 15 14 44 11 -31 -31 17 -19 2 29 16 40 9 -2 -21 -24 -25 -12 10 42 19 -32 13 -26 -23 -1 -35 -19
6747a9M5l3L3rk7%j5M6l3nN4j9k3j1J7J1k1oK3rMjj4K6lm8L5k6%N0k0J6m8J7o
6782a9l0J2L6l2J4J7J1lk3jK1l3L1k2J4J7Kj0NrJ7m4nN8m5L8l1Rj2k0K4k0NM1
6816A3K4m4Lk0JQl2N3k6K5J3k6L7m0k2KL1oJ8kLppqk0J3J7kj7O0k5j1K0k1Qk5
6852a2lM1j8L3m4nj0lk0L5J0j2K5j2K3o6M3j0J0j6J4k4QJ4k5MLJ9lJ7k8J9K1j
6886B7l2%%l%Ojk1N3j7J4l2L2k1kQj4K7n9M6k7mmK6l9K3l2L3J8j0j1Ok6QJ5NJ9
6923A1j1L4k0k8L2n1RK4j5jL2pj2Ok2M5k0Kk5K4J2j3J3Ll2lrNJ5k6L4J1k7L1l6
6958a5lKrmL4j0J2K1ll9jjQK4J2j5J1nOl5l3J9j5L1K0J9J4m9J3m5%K4RKQlQj1
6996AKj2l2L7loK7j4Mk4K2k2k3J0L4J8mL2m0J3p8L4K7j1L6k3N8j3o4K0l2jK3R
$$ plain form
6747 -19 26 -7 26 17 -10 -10 -25 21 -12 -17 37 18 -5 -16 1 12 -9 -15 8 -1 3 2 -12 14 11 -37 -2 -28 -28 22 2 18 -30 -13 -19
6782 -19 -49 -37 -1 -33 -19 -2 9 6 -17 -18 3 -30 1 -21 -7 10 12 2 7 -2 15 -29 -34 24 -21 17 -14 -5 -17 -37 -13 -33 -28 13
6816 13 37 -7 -4 -24 -23 -15 -47 6 -20 5 18 -8 29 -11 -33 -31 0 -6 12 10 13 6 -1 -9 -29 -16 1 -1 -18 42 17 6 26 5 13 -12
6852 -12 -15 26 8 41 -3 -8 -18 -21 -41 -6 4 -8 17 5 28 -38 5 -5 5 -11 3 -21 -13 1 -24 -20 -17 2 -1 16 -12 7 28 27
6886 27 -5 -5 -5 -8 -8 -2 -3 -24 29 12 26 -6 26 5 3 11 -3 24 -35 11 -16 -20 -24 2 -37 -14 -46 -13 5 -5 -16 -10 -36 -28 -13 -8 11
6923 11 0 34 14 -14 18 -33 -24 0 -15 -16 16 9 -3 3 -19 26 6 8 -17 7 19 6 19 22 -10 -13 -22 -17 -2 -28 6 17 -10 21 -15
6958 -15 -18 -16 -25 -29 5 -5 7 28 25 -14 -15 -16 -8 16 28 13 24 19 25 -10 -43 -24 -39 -8 12 31 45 -4 9 -36 -36 -12 -3 -1 7 4 12 1
6996 1 3 -9 -41 -4 -7 -13 14 0 4 -20 2 -20 -43 -33 1 19 15 47 7 20 -58 -24 3 -8 28 5 63 50 -14 6 -26 -27 -4 5
7030EJ6rL4l3%n0j0Qj9N1K5k7L0k1l9K4m0K7K6%L9Mj9j1l3j0L0K1j5K3J5k1k2
7063aj0J1j5MJ8mJ9rK1j0l7KroJ3OJ3J0l3J2l3J7%%j0L2J7j6kqj9PJ9pORJ9Kl
7102B5l8j6N4k3pK5J3mk8Loo3N7k7J9L0j8L8m5m1M0rkJ7j3L3j7j2L2k9qkk5M5
7136bJ0k4J9j5QL6l0Lkk3K3JJ5J1k0J0Mk0J4qk3K7KL0n7PRk0K9k5kM5l8j0N5n9
7172b0K4mqJrJ2JJ1nj2k5kL8l4K9J4JJ5m9K3mj4K7p%K1l5L8l4L3l6j1J8MLnqJ7
7210Hj6Ppk2QK1J0J0J1l0j2MJ8j3J0PoPojLl6J1J6p%M3J0m1Mk7%Q%K4J2Mj5rl1
7250b3J5j4J9Lj5kpL8l3Rk0K0jJ7jj4L4k0j7J1k7K0K4j8M3k9pm0K5LMl1M6j5K9
7285B6nm2qK4j5j7N0k1J7oQk0Jj1J5k5J9K2%oj4J7k1j0K8J2mK7j9Qj8J3m1J0%
$$ plain form
7030 5 21 12 46 13 13 -37 -47 -39 -58 -7 18 -9 21 0 -39 -15 -55 -28 -2 -2 37 41 22 11 -22 -32 -2 19 4 27 42 21 -1
7063 -1 -11 0 -15 -11 7 3 22 13 34 24 -13 -11 -20 -26 -13 -7 6 16 -17 -5 -38 -21 -21 -21 -31 1 18 2 0 -8 -27 -20 -1 -8 -2 7 26 28 25
7102 25 -13 -29 25 2 -5 20 33 29 1 4 -2 -65 -8 -35 -16 14 -4 34 -11 -52 -12 -21 -23 -6 -19 14 -3 -15 17 -12 -20 -22 -47 -2
7136 -2 8 -16 3 -12 -4 32 2 5 3 -20 3 4 19 30 10 20 24 4 18 10 -13 14 16 46 -11 -4 5 -15 14 -11 -13 32 -6 -16 39 -20
7172 -20 4 0 -8 -7 -16 -4 -3 8 3 -9 -34 -36 2 -32 -3 11 12 27 -22 1 -3 -17 10 3 3 24 -11 27 -7 26 -10 -21 -3 1 4 -1 -9 8
7210 8 -8 -1 -8 -30 -22 -1 9 19 30 0 -12 -8 10 -3 7 14 8 15 9 8 11 -25 -14 2 -5 -5 38 48 7 11 -16 -16 -8 -8 16 28 32 17 8 -23
7250 -23 -8 -22 -3 0 -15 -17 -24 14 -19 -10 -30 -10 -11 6 5 -9 25 5 -12 -1 -28 -8 16 -2 41 12 5 -35 -10 -7 -3 -34 12 -3 26
7285 26 21 -21 -29 -5 -20 -37 13 -8 9 3 11 -9 -8 -19 -4 -29 -10 12 12 6 -8 9 -12 -22 6 18 14 41 22 30 12 25 -16 -6 -6
7320fK8k7L3jj2j2j0j9J5K0LpRj3OMj2j6J5j2K4KJ6L1n3k3Jj6L9j8NK2%Jk3j7
7356b3L9j3O%K1j4J5K0p5L2l8L5k3K3J6Ol2J9j5mrM1l0qPK3m4K1kj7J2j1KJ8J2
7391A0J0%j1nJ0l5j1N2oJRk3j2L5l4j7RL3pLKRl5npN0k7j1JK0pj3Oj1MmJ2K4K3
7430D2m9J8j5j7L8k2mlM5k3qJ9k9rJ2J4kj9J9J2k2KJ5k1j3qM2%Qk1Rk1L4j4m3
7465c4K5KmLJ8j4Rk7PrK6j0J8J9l7QQPnj9J1Qj6J2j1mOqJ7j1QJ0J4m5lK7k4Pj
7504a2JNNj9M8n2K9j7K1j7K9n1M3K3rk3j9Ok3M0Qj1j5M9j3pKj3Pk5J4Rj6Rk5M1
7540B2l5K8m5K3JroJ9nK3K2o4K5l5J9K0j2M3k9mk9NK2Rk0QJ1pJ5krj2J0JJ9K0
7576D2k0j3j8LLK5j7KPNj4%j3K2l4j2J0kJ6RJ7j1j9Nk4QL0qj4J9J7l3J3J0l5K5
$$ plain form
7320 -6 22 -5 28 27 15 3 -7 -26 -11 9 12 5 14 1 7 11 -1 -17 -2 -14 10 12 28 59 6 -17 -16 -32 7 -11 -6 16 16 17 -6 -23
7356 -23 16 3 9 9 30 16 31 51 -24 8 -30 5 -18 5 21 27 -5 14 -1 -5 -14 27 -3 -11 -4 19 -25 -4 -6 -23 -11 -22 -20 -2 10
7391 10 20 20 9 4 14 -21 -32 20 14 15 24 1 -11 24 -10 -27 -18 15 8 11 13 22 -13 -18 -25 25 -2 -13 -12 8 1 -12 -6 -17 -13 -17 -5 19 42
7430 42 -7 11 -4 -21 17 -5 -9 -12 33 10 2 21 -8 -17 -5 9 7 -12 7 19 -3 -1 14 -7 -20 -28 14 14 22 1 10 -11 23 9 -34
7465 -34 -9 -7 -11 -8 10 -4 5 -22 -15 -24 2 -8 10 29 -8 0 8 15 10 -9 2 10 -6 6 -5 -9 -3 -11 6 -5 3 13 27 -18 -21 6 -18 -11 -12
7504 -12 -11 -6 -1 -20 28 -24 5 -12 9 -8 21 -30 13 36 27 4 -15 -9 -32 8 16 5 -10 39 26 19 21 8 15 -10 4 13 -3 6 -19 22
7540 22 -13 15 -30 -7 -6 -15 -21 -2 -7 16 38 -26 -1 -36 -17 3 -9 34 5 1 -28 -23 -1 8 -12 -4 7 0 15 13 4 -8 2 3 22 42
7576 42 22 9 -9 -6 -3 22 5 7 14 19 5 5 -8 14 -20 -32 -22 -24 -8 1 18 7 -12 -7 -31 -23 7 -1 -15 4 21 -12 1 11 -24 1
7612Aj2qL6Jj5lL5m5RL5n6J9L1k0J9k0k5OK2Ol4K9Ok2NPj3k2J7J5Pjj9lM5l2l
7649bNl3K4L6Kk0K7k2k2J3k7M7l2L9k4jlk1LjL5k1kJ0j5Jj9J2nJk1L1PJ4%j8K8
7686B6l3l3L7pqL3kj3kj8J7lj3L0pJ8J8l6pj1jj9M1J8l5J9Jj3j2K7l8J0J8nj0
7721a3M4k0J8o2NJ0jJ7J1lJmJqj8lML0KK3j3l7J1K3l8NoL5j9M7l9J9m8K6J6k4
7757hkK4j6qK5qj4j0J7kj8J5lJ0nJ0J3J6o9M9K3m9K0L%k0K1jk3L1%j7Kj0K7j4
7793IJ7qrLl1K3pL%rj4KKNJ9j1K8j7k8qM5l3NJ3j5K8pJ1J2k0Qqj1j1M7j1k2K6
7831B6k8J6mk1L7m8M6k5jnQj3nK7j7%nj2K5J4j9J1l6J7J7k7K1Rj3l0M3kpj1qL3
7867A3k2J9j1K7k7K7j3j8J9j9j4L0PoJ2l0MJ4jj5J2k5J3%Kl7M9l1PK3%nj2K0j3
$$ plain form
7612 1 -11 -19 17 18 3 0 35 -10 -1 34 -22 -3 28 8 27 7 -18 -12 10 16 -18 11 17 -5 0 7 -6 -28 -11 4 11 10 -9 -12 33 1 -2
7649 -2 3 -30 -6 30 32 12 39 17 -5 8 -19 28 -4 35 11 10 7 -14 -11 -12 23 2 0 10 -5 -4 -23 -11 -16 -15 -36 -5 2 16 16 -2 26
7686 26 -7 -40 -3 -10 -18 15 13 0 -2 -20 -3 -6 -19 11 4 22 40 4 -3 -14 -15 -34 7 25 -10 9 10 -3 -15 12 -26 -16 2 -3 -13
7721 -13 31 11 29 -33 -28 -18 -19 -2 9 6 7 3 4 -4 -22 -25 -21 9 11 34 21 -16 -5 18 -20 -15 -21 14 -5 42 3 22 -26 0 16 -8
7757 -8 -10 14 -2 -10 15 7 -7 -17 0 -2 -20 -5 -8 2 -3 7 20 36 -33 16 39 -10 10 13 13 -7 14 13 -10 21 21 4 6 -4 23 9
7793 9 26 18 9 12 -19 4 -3 0 0 -9 -23 -21 -19 -14 5 -6 22 5 -23 -31 14 -19 -14 -1 -16 12 5 16 28 8 16 8 -3 -14 33 22 0 26
7831 26 -2 14 10 -11 26 -22 24 -1 -2 -7 1 -12 -17 10 -7 -7 -12 -24 1 15 -4 7 -29 -12 5 -22 -1 8 -5 -35 8 6 -1 -12 -20 13
7867 13 -9 10 -1 26 -1 26 13 -5 14 -5 -19 11 18 12 24 -6 -2 12 11 -4 8 -17 -4 -4 -2 -39 10 -21 -14 9 9 4 -8 12 -1
7902aRMl1L2j7j5K5J2j4qJ9rL2n6M5mk8K6J3k3j5lJ7r%Kl6J6K9k2J3pj0K9j6k3
7938b4M8n0K2mK0j3K3n3K6J1l8K8k0O5rk1j1Lm5N8l8M4l4L4rqjNk3mOJ1j2j0K9
7973Fj4k0J7qMK9k5mJ7j0%K2m0L8l4j4M7mk1M0j4OoK6m6RK7l2J5RJ9j9m1K9Kn
8009E%K1j9j3Nk4L1Oj8j2L0%L2j9m0L6l6LkL8k1lJ2nj7K0kQJ2l4K6JlkK2m2J7
8046A3k9J6k5N7l7K9k0j2L2k0lQk0J2%qnK0m1L4pL1k6J3J9p2L1Lk1J7j0M2k6M1
8080C6l3K8Rm7K9l0P%J6lK0m3K8l4ORLj9M4l6j2L4l2K0J6l2J6J5l3K9j8Kk2J4
8114a3J7m1L4j1J7K3j6m6N7kk6K5lmj3K3ml3QJ0j3K7lmJ0k6j0L2ll6K4k4K6j0
8148hM0l4L%j0j9L8Kl4J5j9lJ2J2NPq%rJJ4J6j6j%Nj5k%k6L6J8l0LjJ5J0k3oK0
$$ plain form
7902 -1 8 12 -19 13 -4 -19 6 18 4 -4 15 6 38 -18 27 23 -5 21 34 11 -4 -7 10 1 1 3 -33 -17 12 -10 3 -4 -14 15 -1 -24
7938 -24 24 -26 -4 -8 12 -1 22 -31 -5 6 -32 -4 -24 41 32 11 0 3 -42 16 -22 22 -12 22 13 5 4 9 -14 -18 -12 -1 -13 -23 6
7973 6 -8 -28 -11 -19 -15 14 -11 -15 2 -8 -8 14 -26 12 -22 -36 11 7 -14 26 12 18 12 38 -8 1 28 -4 11 20 39 20 -21 8 10 5
8009 5 5 26 7 -6 -1 -25 6 12 -6 -18 12 12 44 25 -15 21 -15 -12 -14 24 3 0 12 7 -10 10 8 16 28 -6 20 21 18 16 38 -4 13
8046 13 -16 0 -25 32 -5 24 4 -8 24 4 1 9 -11 1 1 -7 -12 8 -33 1 -6 25 -1 12 31 -41 -10 -7 -28 -11 -21 21 -5 36
8080 36 3 31 40 -7 22 -8 -1 -1 15 12 32 -11 17 -17 -11 -2 1 -18 26 -10 -22 12 -20 0 16 -16 0 15 -18 11 -7 -5 -27 -13
8114 -13 4 -37 -3 -14 3 26 10 -36 21 19 -7 18 15 11 -2 21 17 -16 -8 2 -11 16 13 9 19 -7 -17 15 12 -24 0 -24 2 -8
8148 -8 32 -2 1 1 -9 -28 10 12 -22 -7 -26 -29 -17 -5 0 7 -1 -1 -10 -9 5 21 5 4 4 9 -6 -8 -8 -34 2 20 -10 -7 -8 7 17 -6 -12 8
8188Hm5L2k1
$$ plain form
8188 8 -37 -5 -26
8191b6
$$ Imaginary data points
##PAGE= N=2
##DATA TABLE= (X++(I..I)), XYDATA
0@%%%%%%NnQj6J6j6J6k4L2m0N6o4P2q5R8j19J41j67J96k22K59k98L38l87M40n02
32b68N67o37P17q01Q96j002J118j244J378j525J684j860K054k263K495k749L022
49A582l325L660m032M445m908N436o034O722p519Q456r579J0949j2664J4870j7811
64i752K1923k8032L7949n6441J01156l81250n01875N32322o55931Q72901N60901
75D93871l00667Q50479o67918m97183J99465j059771M61315L12051k02163J150309
85G39788k56835r2589L22700j130781J40940j24686m88955R99050j22569K64282
95B50345O59616q14304K09412l11677p71432O21446l56763K60940Q01718m76755
105G2546N21875j45986p43712M07551o52298Q982O23262m22130P18171J02496
$$ plain form
0 0 0 0 0 0 0 0 5 0 8 -8 8 -8 8 -16 16 -24 32 -32 40 -45 53 -66 75 -92 104 -118 141 -157 181 -206 234 -268
32 -268 299 -338 379 -422 474 -528 590 -654 724 -801 883 -977 1077 -1186 1309 -1440 1582
49 1582 -1743 1917 -2115 2330 -2578 2858 -3176 3546 -3973 4483 -5096 5853 -6811 8059 -9752
64 -9752 12171 -15861 22088 -34353 66803 -314447 -816322 -284000 -939931 -67030 493871
75 493871 193204 1043683 375765 -121418 78047 -981724 -520409 -208358 -410521 739788
85 739788 482953 390364 713064 -417717 -276777 -401463 -890418 108632 -13937 250345
95 250345 909961 95657 305069 -6608 -778040 -156594 -513357 -252417 549301 72546
105 72546 594421 448435 -295277 112274 -540024 -531042 92220 -329910 388261 490757
115D90757m78578M97555p09776j59051L51838n99244O43703J52278k71355O88726
125F06853n50352r4700K45613p40134M62313J3136k63668P44802m01627O5253
135H7489L04606p11450L76074j21332l45881O57490l80542J48507L71621o02293
145b15711M01241j51630l76413N58861m23613J41824L65029n32021M38410j31480
155G4497l46349N18327m43387J28050L29865n08783M43078j31996l20250M96405
165B39457m44674J37273L15125m78649M53445j37630l08367M58923m68940J28497
175a05540K92546m43491M85595j11278k64872M38991m94668R2414K27566m47435
185c30172M89763q0086j87892M65924m67794Q1563J54917m87419M31925r9974
$$ plain form
115 490757 12179 509734 -200042 -359093 -7255 -606499 37204 189482 -81873 606853
125 606853 56501 -38199 207414 -532720 -70407 -57271 -320939 423863 22236 87489
135 87489 392095 -319355 56719 -64613 -410494 246996 -133546 14961 386582 -215711
145 -215711 185530 33900 -342513 216348 -207265 -65441 299588 -232433 205977 74497
155 74497 -271852 246475 -196912 -68862 261003 -247780 195298 63302 -256948 239457
165 239457 -205217 -67944 247181 -231468 221977 84347 -224020 234903 -234037 -105540
175 -105540 187006 -256485 229110 117832 -147040 291951 -202717 -110303 117263 -330172
185 -330172 159591 79505 -108387 357537 -110257 -28694 126223 -361196 70729 -29245
195b9245j37050N01911l90268J32737J38041n01643L53385j72005j55786M82385
205B22462l31142K07810J82914m46156L28864k30101k08366M00838l45842K33841
215A5122K22513l56759L74661k19749k19337L23573m06000J93502J98892l07031
225a80613M29831j64331j65854L07790m40029J40588J28080l21253M34272j28215
235D0266r3208L41090m14722J29445O7858l59424L86532j43116n5186L70135l56424
246h6754J64714N4960l69454L30348j88748o4312L56668l12802K09316P8127l34237
257a62174L05825k22119r1071L06632l08251K25570R8772k79099L17589k19957
267b8283r8595K55951l29488K08054Q9965k40617L39886j93400p4611K33650l45783
$$ plain form
195 -29245 -166295 335616 -54652 78085 216126 -285517 67868 -104137 -259923 222462
205 222462 -108680 99130 282044 -164112 164752 -65349 -273715 127123 -218719 15122
215 15122 237635 -119124 255537 35788 -183549 140024 -265976 -72474 126418 -180613
225 -180613 249218 84887 -80967 226823 -213206 -72618 55462 -265791 168481 40266
235 40266 -52942 288148 -126574 2871 70729 -288695 97837 -45279 -100465 269670 -86754
246 -86754 77960 132920 -236534 93814 -94934 -159246 197422 -115380 93936 172063 -162174
257 -162174 143651 -78468 -169539 137093 -171158 54412 153184 -125915 191674 -28283
267 -28283 -126878 129073 -200415 7639 97604 -143013 196873 3473 -71138 162512 -183271
278a83271J80045N5303k34542L44945j70958l5334K40479l37179J68438J8626
288D6552k48230L23900j72577p392K54012l07696J82396L067k54797K91532j95072
299h4305n114K48603k78786K07117J1368k35818K71321k15285j8718K18293k69754
310a51078K17319K3793j98991K73036k12694k3852J81960k78396K02674J7694
320E1465j69812K83004j90250o256J64341k83883J78608q685j65207K79527j71324
331c8472K3467J70370k69672J70200l5292j76570K56181j75464M1509J80647k41423
342i4519J85873m1516j79731K28733j98167L5979J72459k20368K09026k7539j59428
353h9198K17773k15274J9088J42513k20891K14811j3865j24974K27746k07233
$$ plain form
278 -183271 -3226 52077 -182465 162480 -8478 -43812 196667 -140512 27926 46552
288 46552 -201678 122222 -50355 -57747 196265 -111431 70965 74032 -180765 110767 -84305
299 -84305 -89419 159184 -119602 87515 98883 -136935 134386 -80899 -99617 118676 -151078
310 -151078 66241 90034 -108957 164079 -48615 -72467 109493 -168903 33771 51465
320 51465 -118347 164657 -25593 -31849 132492 -151391 27217 18532 -146675 132852 -38472
331 -38472 -15005 155365 -114307 55893 20601 -155969 100212 -75252 -33743 146904 -94519
342 -94519 91354 49838 -129893 98840 -99327 -63348 109111 -111257 97769 70230 -89198
353 -89198 128575 -86699 -67611 74902 -145989 68822 54957 -70017 157729 -49504
363d9504J4352J10239k35589J94184k1063j01005K41022j78485L3530R8715k41461
374a35065J63984m8946j02877K35047j54334O4061J11444k22487J51666p5481
384a2988j20821K05302j56806Q0599J27540j87093J68171p8180j28204J71565
394F9085j82664O9649J21417j61981J95955n7527j07566J60204k04222M5867Q9335
405C7552j65801K04693l8606p0820J76114j97193L8073N5874j87155J83680m4870
416h459m7534J95064j67466N7194M6601j96647J52958p1870n1999J90976j43106
427d4288Q5155O0705j78943J39933r3996o9448J63257j43076R6520P4500j47623
438e7304J50658r3152p4166J35351j59206Q6035O8416j28526J65884p8163n8926
$$ plain form
363 -49504 -35152 75087 -160502 33682 12619 -88386 152636 -25849 7681 106396 -135065
374 -135065 28919 -20027 -122904 112143 -42191 21870 133314 -89173 62493 -12988
384 -12988 -133809 71493 -85313 -4714 122826 -64267 103904 25724 -102480 69085
394 69085 -113579 -43930 77487 -84494 111461 53934 -53632 106572 -97650 -51783 37552
405 37552 -128249 76444 37838 -32982 143132 -54061 -15988 39886 -147269 36411 -8459
416 -8459 -55993 139071 -28395 28799 75400 -121247 31711 -40159 -92158 98818 -44288
427 -44288 40867 101572 -77371 62562 -31434 -100882 62375 -80701 15819 90319 -57304
438 -57304 93354 202 -73964 61387 -97819 -11784 56632 -71894 93990 15827 -43099
449d3099J26997j68751P2489M8680j28974J67722p0345l9879J31752j64304P1414
460C702L3659j33557J60119p4143k9661J33344j56637P6844K6704j31505J53859
471F2728p8426k3364J29411j51169P8880J9303j27870J47232p9265j4719J27593
482I0334j41320Q0960J1046j27703J33278q5437j0051J26622j24711R2371J2962
493E8351j22189J18065j00428j9382J13330j16090J06817K7081j00266J20336
503H5625j08427l2691Q5706j30023J03610L2793p3514J42419r2943k5607O7023
514E3971j53200P9346J1501o8686J58099o6858O411P7840j54361N9988k3461r1622
526a11032J41911o1340L4770J05239j23535P1612l6849j13512J04160q7870K9228
$$ plain form
449 -43099 83898 -84853 -12364 36316 -92658 75064 4719 -35160 96592 -67712 3702
460 3702 37361 -96196 63923 -10220 -39881 93463 -63174 13670 40374 -91131 62728
471 62728 -15698 -39062 90349 -60820 18060 37363 -90507 56725 -22540 -37259 90334
482 90334 -50986 29974 41020 -86683 46595 -38842 -48893 77729 -46982 45389 58351
493 58351 -63838 54227 -46201 -65583 47747 -68343 38474 65555 -34711 85625
503 85625 -22802 -55493 30213 -99810 3800 36593 -36921 105498 12555 -13052 53971
514 53971 -99229 -19883 -8382 -77068 81031 14173 20584 98424 -55937 4051 -19410 -111032
526 -111032 30879 -30461 4309 109548 -13987 57625 20776 -92736 11424 -76446 -47218
537d7218J12466q9636J04995j4380j01419Q3819j17340k311Q2990q8328J20887
548D4525J5013o2492J00711j14503j9089M5638j15993J00575J3420l6812J28732
559I9725q3811K47L7500j34493O9496j7670m6142J31620o2092L3494N8661j21027
571c4492O3139m3476p0163J06528p1901M5410P6223r2358Q4636l9934p4673Q3201
583C2140r6596L0111O6149q0791J03627k0648n3740Q4557j03605J5054M1869r1584
595g3457R7379j5565l4152R7883q8027K1277L2129j00183P9428k9367l5015R7436
607D9766p4651L6490M0117r0552P5085l9967m4067Q2130p9625L8889M4242p5455
619c7598Q5783l4260m0049P2843r0523K8776L2262p4974R1322k5288k3627Q0533
$$ plain form
537 -47218 65248 -24388 80607 66227 -35192 48627 -68713 -71024 11966 -76362 44525
548 44525 59538 -2954 97757 -16746 -35835 9803 -106190 -5615 7805 -29007 99725
559 99725 15914 16161 53661 -80832 -11336 -29006 -75148 56472 -5620 27874 86535 -34492
571 -34492 28647 -14829 -84992 21536 -50365 -4955 71268 -21090 63546 23612 -51061 32140
583 32140 -64456 -34345 31804 -48987 54640 33992 -19748 64809 -38796 -23742 18127 -73457
595 -73457 23922 8357 -25795 72088 -15939 5338 37467 -62716 16712 -12655 -47670 49766
607 49766 -24885 11605 51722 -38830 36255 -3712 -47779 34351 -45274 -6385 37857 -37598
619 -37598 48185 13925 -26124 46719 -43804 -15028 17234 -57740 33582 8294 -15333 65200
631F5200q7490K6172J7343q6689Q0093l1612j5543R0277p2033M0379J8754q8943
643d4092O6288m9521k5459Q2240o5257N5581L2825p1716O9257n6484l7456O0452
655A6658p6922N1597L7154n1744Q5428m2622l1219M8310r1457L2556K0933n0705
667e2033R2747k4938r256N7710q8300K2195m89o6703P9488k5557N516P4246o8813
680d187L3964m872p7557N9464m4765p49P5316n4041N4921R020o7990N4014o1316
693b8778j7146N7638n8952O2556K2093m7086O6929n8550k2400L9012p5159N0749
705i094J7890l5331Q1028m1843r808L6378q2618L4492N65m1079P9623l0659P353
718F897M7456p2971L1183j2115n3034O4562l5580J2826N6003n6738M1996r981
$$ plain form
631 65200 -22290 3882 21225 -65464 14629 -16983 -32526 57751 -14282 26097 44851 -44092
643 -44092 22196 -27325 -52784 29456 -35801 19780 52605 -19111 50146 -6338 -43794 16658
655 16658 -60264 -8667 28487 -23257 62171 19549 -11670 36640 -54817 -22261 -1328 -52033
667 -52033 40714 15776 6520 64230 -24070 -1875 -2364 -69067 10421 -15136 -9620 64626 -4187
680 -4187 29777 24905 -52652 6812 -37953 -38702 36614 -17427 37494 46514 -21476 32538 -28778
693 -28778 -45924 11714 -47238 15318 37411 -9675 57254 -1296 -23696 15316 -59843 -9094
705 -9094 8796 -26535 54493 12650 2842 39220 -43398 -8906 -8341 -49420 30203 -456 6897
718 6897 54353 -18618 12565 450 -52584 11978 -23602 -10776 45227 -11511 30485 20504
730B0504n5373N1409m8672N038N1412m9572N3699J13m5114N1246n5858l779L8319
743A3372n5304N4890M868l2516O0196n1548l088K9038o4453M7025j042k8200O6476
756C9714m2670O286K9599o5903L9699j1244l2369O2945l8667J4807L5203n8333
768b0933L9746j6268l7187N3413m2156J5617L7361m9206M5085j3414l5766M6564
780B2856m7567J0530L2637m5854M8986q061k8742M6711m8903O827K4965m8686
792c4301M7592p036k2063N0811m5369Q872K0461n2452M3002j1688k0270N2881
804C0440m1116J4990K1056n2039M0106j7897k2404M9886m0185J9813K3737m7022
816b0635M1183k0524k4262M4062m2754J9913K3943m1419M4309j8420k2516L9734
$$ plain form
730 20504 -34869 16540 -32132 -27094 24318 -25254 28445 28558 -16556 34690 -21168 -24947 13372
743 13372 -41932 12958 17826 -14690 45506 -6042 -9130 19908 -44545 2480 1438 -26762 39714
756 39714 -2956 3330 32929 -32974 6725 -4519 -36888 26057 -12610 2197 37400 -20933
768 -20933 18813 2545 -34642 18771 -23385 -7768 29593 -19613 25472 12058 -23708 22856
780 22856 -24711 -14181 18456 -27398 21588 13527 -15215 31496 -17407 -10580 14385 -34301
792 -34301 13291 6255 -15808 35003 -10366 -1494 18967 -33485 9517 -2171 -22441 30440
804 30440 -10676 4314 25370 -26669 13437 -4460 -26864 23022 -17163 2650 26387 -20635
816 -20635 20548 24 -24238 19824 -22930 -3017 20926 -20493 23816 5396 -17120 22614
828B2614m5459J6473K0251l8980M5645j4750j7588L9279m5096J3694J5000m0145
840b9062M3619j3610j2941M1260m1671J4653J1719m2062L9647j6427j1446M2201
852B5880l7987J8650J1976m1551L7105k0885j2914M0096l7122K2538J3799l8097
864a8512L7886k3368j4251L5947l9128K3274J4121l4008M0363k2420j3113L2571
876A9362m1344K1199J1696l1870M1563j9861r880L1648m1168J8898Q127l1883
888b3513M0071j8453o643L2185l8647J8549N679l2341L7105j9081n160L2294l5812
901a3767J9991M936l1835L4941k1001m900L1124l4404K1876M845l0335L4232k2754
914g051m682K9453l4226K3518M442k8531L4273k4159m275K7558l4303K4605M183
$$ plain form
828 22614 -22845 -6372 13879 -25101 20544 5794 -11794 27485 -17611 -3917 11083 -29062
840 -29062 14557 947 -11994 29266 -12405 2248 13967 -28095 11552 -4875 -16321 25880
852 25880 -12107 6543 18519 -23032 14073 -6812 -19726 20370 -16752 5786 19585 -18512
864 -18512 19374 -3994 -18245 17702 -21426 1848 15969 -18039 22324 -96 -13209 19362
876 19362 -21982 -783 10913 -20957 20606 745 -9135 22513 -18655 243 8370 -23513
888 -23513 16558 -1895 -8538 23647 -15000 3549 9228 -23113 13992 -5089 -10249 22045 -13767
901 -13767 6224 11160 -20675 14266 -6735 -11635 19489 -14915 6961 11806 -18529 15703 -7051
914 -7051 -11733 17720 -16506 7012 11454 -17077 17196 -6963 -11238 16320 -17983 6622 10805
927A0805k6375L4446k4748m140K5101l4756K4512L895k3743L5118k3703l455K2610
940A5567l5537K2475K524k1908L5708k1011j101K1805l5412J9699n42k2413L4480
953A4334j8893K263K3420l2811J9010l501k4570L0664k0128L901K5242k8513K2139
966A2557l405k5025K6889k4576K042K3679k6180K6608l56k1255K6697k7677j120
979a1122J8380k8255K7445J693j5624L0438k5872j094J3732l2472K3409p71j3103
992a3216L3617k0719L401J3882l3444J8600o287j5687L1840j7670Q514J7896k9008
1005h281J8192r512j9665K5791k0013R064K0295k2895K2473p400j9497K1174k4834
1018a5108N073J7326k0960K6344k948j4378K2141k6567J753J1430k4278K5521
$$ plain form
927 10805 -15570 18876 -5872 -10012 15089 -19667 4845 8740 -15003 20115 -3588 -7043 15567
940 15567 -19970 2505 5029 -16879 18829 -2182 -3283 18522 -16890 2809 2267 -20146 14334
953 14334 -4559 -2296 21124 -11687 7323 3822 -20748 9916 -10212 -6311 18931 -9582 12557
966 12557 9152 -15873 11016 -13560 -11518 12161 -14019 12589 12233 -9022 17675 -10002 -11122
979 -11122 7258 -20997 6448 8141 -7483 22955 -2917 -4011 9721 -22751 658 -113 -13216
992 -13216 20401 -318 3083 16965 -16479 2121 -4166 -19853 11987 -5683 2831 20727 -8281
1005 -8281 9911 399 -19266 6525 -13488 -4424 15871 -7024 15449 8049 -11448 9726 -15108
1018 -15108 -10035 7291 -13669 12675 9727 -4651 17490 -9077 -7324 4106 -20172 5349
1030E349j851r172K6477k3507L354Q147k8055K1225n719q456K8416j9355Q369
1043E222R765k7487J8411j0570j1496K5420j8608J1679J3026k2911J9795j1528
1055G18j3651K0479k1411J0336J3174j8821K2927q531j1716J8271k3723O759R655
1068D466j8770K3570n653p561J9905k2642N602N969k1155K1132o525n237K1973
1081A5074j9542Q127N358k2008J8428r958o060K1323j8064J1431P030j9974J8407
1094I572j2206p713J8320j9349J2155P763j6850K0448j1421p214J5938k1247J0380
1107a424O019j5691K1500r305m648J5984k1021Q707L470j6586J9993q633k738
1120d373J6998j8687R158K528j7186J7551r988k770J6820j6776J0773L212j5966
$$ plain form
1030 5349 3498 -5674 20803 -2704 650 8797 -19258 1967 -3752 -12208 16208 -3147 5222
1043 5222 14987 -12500 5911 -4659 -16155 9265 -9343 2336 15362 -7549 12246 718
1055 718 -12933 7546 -13865 -3529 9645 -9176 13751 5220 -6496 11775 -11948 -5189 4466
1068 4466 -14304 9266 3613 -3948 15957 -6685 -1083 4886 -16269 4863 -1662 -6899 15074
1081 15074 -4468 3659 9017 -12991 5437 -4521 -10581 10742 -7322 4109 11139 -8835 9572
1094 9572 -2634 -10347 7973 -11376 779 8542 -8308 12140 719 -6495 9443 -11804 -1424
1107 -1424 4595 -11096 10404 1099 -3549 12435 -8586 121 3591 -12995 6998 -1635 -4373
1120 -4373 12625 -6062 3096 5624 -11562 5989 -3999 -6769 10051 -6725 4048 7260 -8706
1133h706J6550j1401l596J4986j6783J1644L697j3976J7280j1604l372J3241j7851
1146i891J1359K756j2830J8137j1086j928J2654j8109J0917J160j2643J7776j0943
1159b671n81J2574j7280J1064L31j2357J6784j1203j70J2021j6402J1137J47j1555
1173h161J6086j1000lJ1166j5783J0704k21j0960J5437j0521N31J0842j4948J0477
1187C646q22j0769J4430j0677R58J0641j3946J1186r67j0198J3568j1742Q03R541
1201E652j3496J2097n87q681J3760j2197O10P739j4261J1850r24p013J4689j1124
1215a886J557O787j4916J0396k473o940J4682r818L392P353j3918R563l971p886
1229h078J2844r783M133Q167j1698J0268l786q132J0807j0891L134P588j0306
$$ plain form
1133 -8706 7844 -3557 -7153 7833 -8950 2694 6391 -7585 9695 -1909 -5281 7960 -9891
1146 -9891 1468 4224 -8606 9531 -1555 -3483 9171 -8938 1979 3139 -9504 8272 -2671
1159 -2671 -3252 9322 -7958 3106 3437 -8920 7864 -3339 -3509 8512 -7890 3247 3394 -8161
1173 -8161 7925 -3075 -3078 8088 -7695 3009 2788 -8172 7265 -3256 -2725 8117 -6831 3646
1187 3646 2824 -7945 6485 -4192 -3234 7407 -6539 4647 3680 -6518 7050 -4692 -3889 5652
1201 5652 -7844 4253 3666 -5015 8745 -3452 -2842 4897 -9364 2486 1562 -5451 9238 -1886
1215 -1886 -329 6458 -8458 1938 -535 -7475 7207 -2611 781 8134 -5784 3779 -192 -8078
1229 -8078 4766 -5017 -884 7283 -4415 5853 2067 -6065 4742 -6149 -3015 4573 -5733
1242e733J1389k417o668J0312j1524J943N641j0704J1287j834m781J1228j0731
1255b592K149M232j1627J0118k896m064J1745r627L690M137j1431R374m373m361
1269e526J0969r373M713M505j0327R533m824m484R831r665M693M270r401R664
1283D578m548m022R090r471M381L815q823R258m357l723Q555r142M364L676q092
1298d461R134m298l510P671r332M013L229p396R550l611k653P345r651L315J763
1313A108p637R396l202r76Q228q819L598M29q748P906m375l99Q909o955N452R59
1329D874q552O413o478j909P518o406P090K846o124P104o932l469M687q180N972
1344a546L293l667R355m492k383L484j0029K889Q42m114R932j783Q16N474r000
$$ plain form
1242 -5733 5656 3239 -3429 6883 -4641 -2698 2943 -7761 3526 1692 -3089 8139 -2592
1255 -2592 -443 3789 -7838 2280 -616 -4680 7065 -2562 1128 5265 -6166 3208 -1165 -5526
1269 -5526 5443 -3930 783 5288 -5039 4494 -330 -4814 5017 -4648 45 4315 -5086 4578
1283 4578 30 -3992 5098 -4373 8 3823 -5000 4258 -99 -3822 4733 -4409 -45 3631 -4461
1298 -4461 4673 375 -3135 4536 -4796 -783 2446 -4950 4600 989 -1664 5681 -3970 -655 1108
1313 1108 -6529 2867 -335 -1311 6917 -1902 1696 2125 -6623 1283 -3092 -3491 5418 -1537 3915 4874
1329 4874 -3678 2735 -3743 -5652 1866 -4540 2550 5396 -728 6376 -556 -4025 662 -7518 -1546
1344 -1546 1747 -1920 7435 2943 560 4044 -5985 -3096 -2254 -6368 3564 1781 2597 8071 -929
1359i29J614k069o960P274k425K495Q029n418M020j907q226L963n895N53P348
1374A467l482P475J137n581L977q080k444L491n374P608K968j772P156o217k389
1389f0R10q712M291R55j087R378k550R12K176q972J536k552l808P593j558L595
1405B047N315n712K478l544o219L924l976K620O151k768N527j206n141K466o539
1420d577k36L615l073O742J144k027M258o187j314R63n526N122O69m86O330l877
1436A540M38O97o551L003j651j397O147k671K489K217n289K882k852k858M378
1451E22l451K720K976l554L999k133k722L225m436J531K246l281M461j111j692
1466g00L567m206J073J303l835L800j296j293L883l404J621J428l633L258j875
$$ plain form
1359 -929 685 -1384 -8344 -1070 -3495 -1000 7029 1611 5631 3724 -4502 -539 -6434 -5881 1467
1374 1467 -2015 5460 6597 1016 4993 -3087 -5531 -2040 -7414 194 3162 1390 8546 2329 -60
1389 -60 850 -7862 -3571 -2616 -3703 5675 3125 4037 6213 -2759 -1223 -3775 -7583 10 -1548 2047
1405 2047 7362 1650 4128 584 -5635 -1711 -5687 -3067 3084 316 5843 4637 -504 1962 -4577
1420 -4577 -4813 -1198 -4271 2471 3615 1588 5846 -341 -1655 -692 -6218 -1096 -427 -913 5417 1540
1436 1540 1978 2675 -3876 -873 -2524 -3921 2226 -445 2044 4261 -1028 1854 -998 -3856 522
1451 522 -2929 -209 2767 -787 3212 1079 -1643 1582 -2854 -1323 923 -2358 2103 992 -700
1466 -700 2867 -1339 -266 1037 -2798 1002 -294 -1587 2296 -1108 513 1941 -1692 1566 -309
1481c09j573L200l479J925J661k792L833j739j417K551m187J371R69k607M344
1496A751j068l18K926m153R16k63l410L605j139O21L878k839J613m94m013K069
1512c18k328k2L780j614L027P88l135J624l416j575K151k056L319K067j125K784
1528C951k784k065M58l685J854J513j72M384q88n46N56m655R4n72j320M230K58
1545F11J626K279l339M3k216l236K206r12K189L785j087K007j522l612L18l161
1561d021L97K915k23M006O87j645P16m206j611M21j629L528J926O62K806k493
1577B236j508j121l746J126N16Q98M220L0O95k1l934o49j853j163K998O13K568
1594A905K253j751K19k671k930N50j412J996K924K94K593r41k180m67l479j82
$$ plain form
1481 -309 -1882 1318 -2161 -236 1425 -1367 2466 727 -690 1861 -2326 -955 14 -2593 1751
1496 1751 683 365 3291 -862 54 -209 -3619 -14 -1153 -532 3346 507 2120 1626 -2387 -318
1512 -318 -2646 -2668 1112 -502 2525 3313 178 1802 -1614 -3189 -1038 -3094 225 2292 1167 3951
1528 3951 1167 -898 -440 -4125 -2271 -758 -930 3454 2566 2020 2576 -2079 -1985 -2557 -3877 353 611
1545 611 2237 4516 1177 1220 -996 -4232 -2026 -2938 -749 3036 1949 3956 2434 -1178 -860 -4021
1561 -4021 -3624 -709 -932 3074 3761 2116 2832 -1374 -2985 -2564 -4193 -665 1261 1923 4729 2236
1577 2236 728 -393 -4139 -3013 -2497 -1599 2621 2651 3346 3325 -609 -1258 -3111 -4274 -1276 -663 1905
1594 1905 4158 2407 2626 -45 -2975 -2425 -3837 -1841 1083 1377 3970 3029 849 382 -3097 -3279
1610c279J010mL700R85J67J009l156j258j105k046K151P68J500K916j027R7j203
1627A225l152P9j107L46K812L30J999N84j950j93k304j414R34m65K104J811r9
1644A540J296j455j588l78k028O70R50K77K436K4j38J94k313l84n93q64J830K33
1662b91R85J418j132K13r87j625N95q23O28J558l64J325j75j135M13j559j85O32
1680e09o29J433L62k85R60j164k86J36j156P92N0j50J165n42J79L10r97M93l57
1699a95m71P85n67L22N29o08P09j97m02N71q10P8J80o63P74n8m9Q51o06K05lr58
1721e83M51n02o9Q82l58P24L62o87M44q40n09L14o85P47N41p8R60m10l40m4j187
1742h67K3K9j35J183K06L82M84q63k20o88p84L71RO17J038L7M73l42r12l42q77
$$ plain form
1610 -3279 -2269 -2273 1427 2412 2579 3588 432 -826 -1931 -3977 -1826 -1058 442 3358 2331 2428 1225
1627 1225 -1927 -1848 -2955 -2609 203 533 2532 3116 1166 973 -1331 -2745 -1811 -2276 -172 1639 1540
1644 1540 2836 1381 -207 -585 -2613 -1943 -993 -716 1720 1744 1606 1800 -513 -897 -1490 -2354 -524 -291
1662 -291 694 2112 980 1193 206 -1419 -824 -1647 -1019 539 175 1500 1325 190 603 -956 -1141 -509
1680 -509 -1138 295 657 372 1332 168 -118 18 -1138 -346 -296 -446 719 177 356 666 -331 162 -195
1699 -195 -666 119 -448 -126 403 -205 504 307 -95 476 -334 -256 -76 -739 35 -23 -72 779 173 378 375 -583
1721 -583 -132 -634 -703 179 -179 545 907 220 664 -176 -685 -371 -1056 -309 232 154 1114 704 364 320 -867
1742 -867 -844 -815 -950 233 439 821 1305 442 222 -466 -1250 -879 -870 -253 785 822 1295 953 41 -301 -1178
1763a178r1M86K68J118N10M4J42r84p66n06o97N94N46O64J207J4qn24j357m87
1783a005o56j0J130O18J163O81n14l26j352j156k36l53J049J268Q37J056l20q66
1801A008r88j629m88J37O11J697J094P88J11j226j192j487r66L69P49J589J615
1818A792N81J13j099j723j287j172K39J202J468J872P78k73q97k049j530p79q4
1835b848J579J687J565J153n68j157j785j965n05J38J288K144J336J014l48j648
1851A080j581j853p54O84J116K126J568M61j97j669j817j365q94P93J370J692
1867G60J745K51m65j354k037j112o01N45J685J408J448N03q92j110j798j270j07
1884b401L23J560J592R06N71p81j344j201j354q0O45R62J655P89J81l03j465j031
$$ plain form
1763 -1178 -1269 -783 -515 603 1113 1157 1299 315 -451 -957 -1654 -1060 -514 150 1357 1371 1363 839 -518 -1005
1783 -1005 -1661 -1671 -541 77 1240 1921 1407 1081 -271 -1427 -1663 -2016 -967 301 1138 2194 1874 1008
1801 1008 20 -1609 -2097 -1960 -1349 348 1442 2230 2341 1115 -77 -1564 -2530 -2161 -1412 177 1792
1818 1792 2373 2486 1387 -336 -1623 -2795 -2556 -1354 114 1986 2764 2491 1594 -455 -1985 -2764 -2848
1835 -2848 -1269 418 1983 3136 2568 1411 -374 -2339 -2844 -2706 -1418 726 2062 3076 2728 1080
1851 1080 -501 -2354 -3108 -2424 -1308 818 2386 2847 2650 981 -836 -2201 -3095 -2302 -932 760
1867 760 2505 2756 2291 937 -1100 -2212 -2813 -2268 -583 825 2273 2776 1884 774 -1024 -2294 -2401
1884 -2401 -2078 -518 1074 1980 2551 1770 426 -775 -2129 -2209 -1564 -602 1053 1842 2023 1720 255 -776
1902g76q54n00Q70Q06J146J093j64k68r04j320l99m29L97J093O77R36J89n94m43
1921E56j168o34qk0R79P71M72N76n50n65o36r39O9M3M46J083K95L95K4q86l71
1942f8p15m91M56J36Q12P67o7L17n82q03k54p18K31N69K58R70K07k12n6r83l99
1963f25j90l33P94M22M42O92m46k06m72r61J03j53L46Q99J31N55j2p47j78p82
1983g21k99M12kQ57M92o8L46p48n52j67o27M31M47K09Q98j35j90j14r96o5j13
2004g05j18Q78J44L37M15o15j47m38o24L92j02M37P24j76L63k73o52L9o06N2N16
2025a59m3P23J28l04K32p36k85O9m23O26K92O2O36m86j27r6p42K33l7l3P96j21
2047B05K62K22o99J26m39l61M67k15M48M89k86M40l80m88J66o33J66M05j44P72
$$ plain form
1902 -776 -1630 -2130 -1260 -454 692 1785 1621 1353 449 -871 -1270 -1699 -1302 -209 468 1404 1593 999 556
1921 556 -612 -1246 -1254 -1274 -295 476 948 1524 974 409 -227 -1166 -1097 -1054 -608 475 770 1165 1189 303 -68
1942 -68 -783 -1274 -818 -682 130 897 830 1147 565 -238 -492 -1210 -979 -410 -152 818 1025 813 757 -226 -625
1963 -625 -815 -1148 -354 68 510 1202 756 550 78 -883 -780 -933 -587 312 443 998 986 239 61 -721
1983 -721 -1020 -608 -610 247 739 671 1017 269 -283 -450 -1077 -646 -199 10 908 773 583 469 -527 -592 -705
2004 -705 -823 55 199 536 951 336 189 -249 -873 -481 -583 -146 578 402 765 492 -160 -121 -727 -675 -159
2025 -159 -202 521 649 345 577 -159 -444 -375 -798 -172 120 182 818 332 205 109 -633 -400 -437 -470 326 205
2047 205 467 689 -10 116 -323 -684 -217 -432 16 505 219 659 279 -209 -43 -676 -510 -105 -249 523
2067E23J1k06K65p63j72j1m78O39J62J54P13m06l7j64q07J80k74M0Q16p1N46J94
2089H54o12L7o46m79L42k34O31O22m2N45m55n90r0q66J61L50O3J046J49NJ49j032
2111i2l28l36m95P76K81N68Q39m08k9n08j086L6l53K43J021J99P90J29p64j77
2131C06r77n30L28o1R08Q00P1N33p14p26l36r57L13M34L02J237J03J9m9j220m12
2152f28m13l62R46L09P58Q22n34o6p50j051J8l19M62J038K48P88l1q09j96j077
2172h47l89L43l4J090O38Q0M61q07o30l62q32L32L70L51J147J8P6j42j105k48
2192d90m52l02Q73K18O92O74m81L9o99q74Q1l90M33Q67J42P89j10o02j29j001
2212g22k23K40j43R94M11R4M92p36m08l27p84M47J00L04R72q6J65o8r10p1m56
$$ plain form
2067 523 534 328 593 -170 -342 -353 -831 -192 -30 124 837 431 394 230 -577 -397 -671 -631 185 114 660 854
2089 854 242 279 -367 -846 -504 -738 -107 515 473 1018 563 -27 -117 -983 -822 -472 -409 637 786 791 940 -92
2111 -92 -420 -756 -1251 -475 -194 374 1213 805 776 268 -818 -782 -1135 -892 129 328 1118 1247 483 306
2131 306 -671 -1201 -873 -934 -26 774 845 1378 664 -62 -398 -1355 -1042 -608 -306 931 1034 1053 1004 -216 -628
2152 -628 -1041 -1403 -457 -148 610 1432 898 832 82 -969 -951 -1270 -808 230 478 1266 1235 426 230 -847
2172 -847 -1236 -893 -927 163 801 881 1342 535 -95 -457 -1289 -957 -587 -236 911 929 1005 863 -242 -490
2192 -490 -942 -1244 -371 -153 539 1213 732 771 72 -802 -721 -1111 -678 189 331 1120 1010 408 279 -722
2212 -722 -945 -705 -848 146 557 651 1143 407 -1 -328 -1112 -665 -565 -261 711 625 790 722 -188 -259 -715
2233g15k28O64N1N94N21l73J80n94o41J51m76M02N24L5P04j52l63K9q10j02J37
2254d62k37P85J82J04M69n94j64j73o40L77l9J44P20j99K61l6o18J16m04j77N13
2275g2k33M89K88l35L55m14l60K28m66K61K25j11N94j81j45K23n93P7K2l14N32
2296G0q3N5L92m19J37n1m34L30k32k9M73l22L09Q6l76L09l32r5K83l93L27J29
2318A34k62M61k60q8K45m98J81L8k96N18k06L9L57m36K20n9l84L64l19P6L47k82
2340a10L46j6k86L11l84p1K49l49L62O2j61L88l15p0J72m47K20J6j84M99j84P8
2362A26J97m39K05j63k85L77j82J35L36l07K74j33l47K53l27M5K95k62M22k4j81
2383A5K81m05m4J33l53L90K6r8M20l22J8J13m38K35j16j02M35k30J43K10m04K39
$$ plain form
2233 -715 -943 -279 -228 366 887 514 694 100 -541 -390 -866 -464 60 95 799 647 284 313 -497 -599 -462
2254 -462 -699 86 268 372 841 247 83 -90 -730 -353 -392 -248 472 273 534 498 -120 -4 -408 -585 -72
2275 -72 -305 184 472 137 492 78 -282 -54 -520 -259 -34 -145 449 268 123 346 -247 -170 -148 -462 70
2296 70 -13 42 434 15 152 101 -333 -3 -235 -264 209 -113 196 282 -94 215 -117 -212 71 -322 5 134
2318 134 -128 333 73 -15 230 -268 -87 -49 -345 173 -33 6 363 -73 147 88 -296 68 -251 -175 172 -110
2340 -110 236 220 -66 245 -139 -210 39 -310 52 114 -47 341 26 -44 128 -319 -99 -83 -267 232 48 126
2362 126 323 -116 89 -74 -359 18 -164 -29 307 0 274 141 -206 47 -280 -235 60 -202 220 196 15
2383 15 296 -109 -153 -20 -373 17 43 -55 365 43 61 174 -264 -29 -145 -247 188 -42 101 311 -93 146
2405A46j79k35L06k55J35K73k51L03j26k17K10l24N6J86j84L22n1j39K91l33M0
2426b6J09l53K64p0p7L97k94J45J13l37K12j77j32L32k39J48J75k54K81j68j82
2447a33K53k86P0J56k09L17q1j12K57l32O5N4k62K92p6n4L35k49R8L4l49K44j39
2470a07r1K95j76J91J14k85K08k02j81K40k42K17J38j66L20j86j08J49l53Q6R5
2491d4j53L48m7l4J94l22M4k7k61K97n6M5K99k57J52o1l05J78j74nK81j53K10
2514A49N9k57K10l09o0J74j81K61R9j17K70k19j34J05l15J29J01m7L23q9k7P0
2536A95l07Rl4j45L07j9O5K15k46N3q9k57J48r9R4L26j61J86o0k72J00k46k8K54
2560a1j34K94J02j52J56k86j42N7j97K24J49jK89j86p5k8l12L6L2J5L14k0R9R2
$$ plain form
2405 146 -33 -268 38 -217 -82 191 -60 243 117 -100 110 -214 -158 28 -156 166 115 -24 267 -66 -26
2426 -26 83 -270 -6 -76 -153 244 -50 95 208 -129 83 -94 -226 106 -133 15 190 -64 217 49 -133
2447 -133 120 -166 -96 60 -149 168 87 -25 232 -100 -35 19 -243 49 -27 -81 254 5 103 137 -212 32 -107
2470 -107 -198 97 -79 112 226 -59 149 -53 -234 6 -236 -19 119 -47 273 87 -21 128 -225 -139 -44
2491 -44 -197 151 104 70 264 -58 -14 -41 -302 -5 -61 -16 283 26 178 117 -188 -10 -184 -189 92 -61 149
2514 149 208 -49 161 -148 -208 -34 -215 46 145 28 298 79 -55 50 -265 -136 -35 -82 241 152 125 195
2536 195 -112 -103 -137 -282 25 6 71 286 40 93 4 -253 -105 -204 -110 216 55 241 181 -91 9 -237 -265 -11
2560 -11 -145 149 251 99 255 -31 -173 -116 -313 -89 60 59 348 162 87 59 -253 -217 -185 -170 144 124 223 315
2584C15l38jj67j97K62NJ91K76j48Q4j95l16N3j89J15K91J0K96j1k38L8l78j03
2607c45J16o9L02K39QJ70k81j64q2l31J49R2J56L62j6K5m2m17p3j63q5L19J27
2630cK73K46k74Ll42l07Q2j09K30M06N1K52j20k92j38l90n7J75N8M39K16J3N6
2653D68l78k36k07k18K62K00K12M04o7j06j65m39r6p7L5L91J78K71J14k90j20
2674A36l59k90J16rL46L76M5J90k11l32k18l19J0K23J87M54J60n3l8m36k87j28
2696d37j43L19K42K75L45j59j10k96m11r5l7J42M36J97K71Pl08k42l60k15J31
2717d48J07L91L53P0N7k82l56k06k65N4L03K57L79J18q3j61m06k97j01m2L89K79
2739A10K74K34j71k33k89m12m4N7K51M20K06J73l8l92k93k74j97K17J80L89L43
$$ plain form
2584 315 -23 -24 -191 -388 -126 -121 70 346 198 282 87 -229 -176 -365 -250 41 51 347 336 98 136 -242 -345
2607 -345 -229 -298 4 243 251 421 140 -24 -106 -437 -288 -196 -40 322 306 331 289 -128 -201 -364 -449 -130 -3
2630 -3 270 516 242 245 -97 -404 -322 -431 -201 205 256 508 388 96 -42 -432 -489 -314 -256 183 399 412 468
2653 468 90 -146 -353 -571 -309 -109 103 507 440 334 169 -270 -366 -443 -408 -17 161 432 546 256 136
2674 136 -223 -513 -397 -406 -60 316 361 551 340 8 -210 -529 -519 -296 -109 345 505 452 414 -22 -309 -437
2696 -437 -580 -261 -19 256 601 442 332 36 -375 -470 -507 -365 71 268 539 546 238 -4 -364 -579 -448
2717 -448 -341 50 403 473 530 248 -108 -314 -579 -525 -222 35 414 532 449 288 -118 -415 -516 -558 -169 110
2739 110 384 618 447 214 -75 -487 -531 -474 -223 197 403 576 538 146 -147 -421 -618 -401 -221 168 511
2760E11k7K1l41l93j99j68J51L06L02L57O6j99k22m37k44J2K9L70L22K38J78k42
2782C91l07l14l28L2J62K49M11J69J01j52l96k67k82n4K55K56L76K68o6o6m06
2803C2l36j76p8K20L51K36K88j5k38k63l75k02P2J39M01L22J03M7k95k66k84k36
2825e53J06K11K44M02J00k5j61m21k29j62j8L31K06L11K11j82j42l10l38m2NK33
2847b23L50J62K05q8k56k57k59r7J17J52L49J93P1k8k84k82j35j70J63K13J91
2868H7K98L1q4j97l18j29o4J8L37J42J97J47k17j44k70j85pM5K29K48J18Q8p3
2891B97k57j66k26LJ38J10K79J48k1rl16j48p9j12J76J83J54J80m5r7j57k50m1
2914b56j7O0K54J12J09N2j94j28j50j43J03M2J63K52j3J9j39k01o3j17J6J72N8
$$ plain form
2760 511 484 505 164 -229 -428 -596 -445 -139 163 520 586 387 165 -272 -516 -504 -475 -105 217 455 633 391
2782 391 84 -230 -558 -526 -364 -115 296 465 566 414 18 -249 -531 -585 -330 -74 302 570 504 438 32
2803 32 -304 -480 -558 -338 13 249 537 522 284 21 -354 -556 -484 -345 56 378 481 528 233 -33 -317 -553
2825 -553 -447 -236 8 410 510 485 324 -97 -326 -488 -506 -175 31 342 553 371 229 -81 -419 -461 -456 -223
2847 -223 127 289 494 406 150 -107 -366 -463 -346 -194 155 348 419 391 107 -175 -310 -480 -317 -104 87
2868 87 385 416 332 135 -183 -312 -376 -358 -21 121 318 465 248 104 -166 -351 -358 -313 -84 164 282 370 297
2891 297 40 -126 -352 -349 -211 -101 178 326 305 296 -20 -168 -247 -359 -183 0 154 334 289 192 35 -215 -256
2914 -256 -273 -213 41 153 262 314 120 -8 -158 -301 -198 -156 7 259 246 265 126 -75 -138 -255 -239 -67 -9
2937iJ89Q3j13Nk36j18j4l2J49J74O5J19p9j02r7k15L4L4R4J92N2NK9k41m8j03
2963a83p2J75L3J52J34p4m8j10j71lo3J03J68M7J14Jj44q5j64q5J54PJ89J13l5
2988A53M7j68j47l6r5J06J39N8J91o5k7j12j89m6k9K9K36R0P2M4j47r1j71j17
3012b75J24L5J40K10j9Mj03k24k1j54N6J83Q1K17L2r5q5k38j42Rj4K38J72O8J60
3037C59j88j52q7k27M3P3R4K77O8L3m4k89j15j26p1K00J00J97J75l8p5j93k62
3060b48k1q8J44K21J05K15j7j64j44k42j33P9O3K92J83J7P6k19j53j44k36J31
3082b83J63J41K74lPj23k69j34j02lK28J59K01R8j18p0k49k21K7l0J64K49Q6J54
3106C46p4k27j00k51m2J27O9K87J38J0L9k61j73j23j57J60J87J00K70l2n6j14
$$ plain form
2937 -9 180 263 150 155 -81 -199 -213 -245 -96 78 143 262 183 81 -16 -231 -197 -163 -69 123 175 180 209 -32 -80 -183
2963 -183 -255 -80 -47 105 239 165 117 7 -164 -167 -230 -127 41 88 202 203 59 -26 -190 -275 -121 -114 75 188 153
2988 153 200 32 -115 -151 -246 -140 -1 57 248 183 156 44 -145 -191 -220 -191 45 135 207 251 104 13 -158 -275
3012 -275 -151 -116 24 234 215 219 116 -108 -129 -283 -227 -44 37 254 286 191 106 -132 -274 -265 -279 -41 131 199 359
3037 359 171 19 -68 -295 -252 -179 -85 192 260 293 249 -40 -155 -281 -352 -152 -52 145 320 282 207 14 -248
3060 -248 -269 -357 -213 8 113 328 311 147 3 -239 -372 -293 -230 62 245 262 338 119 -34 -178 -414 -283
3082 -283 -120 21 295 292 299 176 -93 -227 -329 -332 -104 55 256 354 236 166 -83 -304 -277 -307 -143 106 192 346
3106 346 272 45 -55 -306 -348 -221 -152 135 273 283 322 61 -112 -235 -392 -232 -45 55 325 293 237 123
3128A23k88p4j01M1K82J35J22J17j88p4k02k18O9PJ85K46N4J10j21k16j12k18
3150c21PJ37J06K73R7l5j0k49j60j00q0J92J64J10J66m1o3j40k83j9k0R8K47O0
3174A36J19M3k06r9j39j55J00K8K13J74j2O1j33k05o1j44M2J57O2K31M5o1n3k77
3198a34o7j7k1J88J11R3J33q4j28j40j68J4K6R4K34M5O3k5k25p2j03o0J35L2K01
3223A25J02o6Jj61j40k8q3J28J60J8J54j0j16n0k06k6M6J3J62J08J0R8j63p5j13
3248a12j31J16J2J00J95j2M0o7k57J7j01j1J76N3J30O1j02j2j61q2rl1J36J27
3272G5M6O0q4p8j8j89RN5N6J81L6LK1j66n0j08o1J08N3Q3J43n4J7p8j77J4p2M6
3300a29J46J8J22Rq1m3j43o5K8oJ38J23o5J32p9j00o1j29M6M2L2J80k9oL9j65
$$ plain form
3128 123 -165 -239 -340 -299 -17 118 240 357 169 95 -107 -325 -256 -249 -64 182 236 346 225 9 -103 -321
3150 -321 -314 -177 -71 202 299 264 254 5 -155 -255 -335 -143 21 131 297 256 193 53 -230 -249 -269 -171 76 136
3174 136 255 298 92 -7 -146 -301 -201 -173 40 214 202 263 130 -75 -136 -280 -238 -81 -19 212 257 196 143 -134
3198 -134 -201 -218 -239 -51 60 153 286 202 74 -66 -234 -220 -194 -100 134 179 242 217 -8 -80 -183 -243 -108 -76 125
3223 125 227 161 162 1 -139 -167 -250 -122 38 56 210 200 84 34 -172 -198 -152 -139 23 131 141 239 76 1 -112
3248 -112 -243 -127 -115 -15 180 168 208 141 -116 -99 -200 -211 -35 18 148 209 107 95 -66 -148 -157 -188 -52 75
3272 75 121 181 97 19 1 -188 -179 -124 -68 113 149 152 173 7 -43 -151 -212 -104 -51 32 175 121 138 60 -117 -103 -175 -129
3300 -129 17 35 157 166 85 42 -101 -166 -138 -144 -6 117 52 184 105 5 -56 -185 -139 -97 -65 115 86 80 119 -46
3326d6j1n1n4J23K4Q6J04q6Oq9j01K3o8O0J27j0J07l2r0j5j01k4L7J6Q1Q9j7K2
3354A10q3n2j8q6N1M3J6J10k6j5j7r0J7n3QJ07j4L4O3q3K3n4p0O2m1M0P3m0M7
3383F2k5p8L4o2L1P2n9P6jnpn1l2L5r4J11K9k9M0m4k1J4q7P4j3J0R7o6k0J3l7
3414c3ojmP8oNJ4p3K7l7l4P0LK9K6o7N2n6n5L0k4M1N6oL9J3j10L8j00K2O1l6Q7
3447D3K1k9On3l3j3n2P8L5QN6LNl0o3k8l0LJ07j3M8L4o6Op7n9L4j1O3P4lM9n4
3480E9o0j5o5j8J8M2O8L9k0K4o3n6l5k7K1O9K0P2J8Qo9q2j3m3LQ4L3P3M5n7j0
3511F3j06n4L1l9O0P9K1O6m1m1m6j10PJ6MJ36L5QK7q4m2q2m7K0L5P7J26J1m2o0
3541B8n3l3p2K4P1N4M4Q5o1k2j06p0K4n2Q3J02N9M8m2l5j30o9J4k0P0J07N2L7
$$ plain form
3326 -46 -57 -108 -162 -39 -15 71 175 89 95 6 -95 -72 -140 -80 47 37 144 112 22 7 -94 -118 -81 -65 16 105 88 110
3354 110 27 -25 -43 -129 -78 -35 -19 91 65 50 33 -57 -40 -93 -85 22 8 42 105 22 45 -9 -79 -17 -58 -18 55 15 62
3383 62 37 -41 -7 -69 -38 34 -25 51 50 45 38 -13 -45 -10 -104 7 36 7 47 3 -18 -4 -91 -17 -30 -20 77 11 -9 4 -33
3414 -33 -39 -40 -44 34 28 33 47 -26 1 -36 -70 0 3 32 58 -9 43 -13 -68 -38 -62 -21 35 29 68 81 -29 9 -91 -69 -8 -44 43
3447 43 64 35 41 -12 -45 -58 -110 -32 3 11 67 70 75 45 -18 -46 -76 -73 34 21 69 103 37 43 -34 -93 -59 -70 -7 67 64 113 59
3480 59 -1 -16 -81 -99 -81 -39 29 68 48 72 9 -47 -82 -109 -88 -19 1 73 91 99 30 -52 -65 -108 -105 -21 12 85 130 73 63
3511 63 -43 -97 -66 -105 -45 34 55 121 80 39 -7 -117 -110 -94 -90 46 81 89 116 32 -10 -92 -139 -119 -84 -7 119 130 88 28
3541 28 -25 -58 -130 -106 -35 19 63 148 87 65 -41 -111 -87 -139 -56 46 105 153 111 76 -54 -123 -109 -129 -59 48 100 137
3569A37Kr4p3p6m3K0P2Q2R5rj5m5j28kp7L4P7Q2L5P2n3n1p0q8plQ8Q5M5K4k2p4
3601B0l3q6j3K9K4J16k1O1j5o9p0l5l5L5N2N0P7k1k7j1p1m8%qN5P0J8N3n9K8p8
3632a2q1M5l4N2M3N1J7pm5o7j4l0L2M5J5M0K0J8n7o4j6l9M2j0L7O2Oj0j1l0o6
3663f8j0nN0%O3M7m4L3q3k6J4m4K5O4ML5rl0l1m3KjK6J0O9j4J3Qo7%p1L7L6%M0
3698C0J2k2Om1n7K5j0M8k4P5K2o6K4J2p0kJ9k3P4l0M7j9oj9k0mK6j1J0J0RJ8n2
3731iMql6K0J4LM0oJ7Ko0l1Pj4L4K5ML3k3k5K3m8J3m8N6M5mK6Mn4k0o1M7J9NJ7
3767A1L8k7J5l5k2j7j1K2J2K5J9RMl7l0j9nL9L2k7K9M4o5j4J6m5%K0KM5J7mK4
3800F5o0Ll1%K7OK8K0k8ok0j6rJJ6j3K6N4n4J1J0j2n2K7n0N1J2oK0k0k6K7n3N
$$ plain form
3569 137 139 45 -28 -104 -147 -127 -55 27 122 113 98 53 -75 -77 -154 -120 -43 39 74 146 93 42 -28 -116 -123 -126 -38 47 92 116 94 20
3601 20 -13 -99 -112 -83 -59 57 36 97 82 13 -57 -92 -127 -92 -40 10 87 66 39 28 -43 -91 -91 -99 -44 26 44 97 38 66 -12
3632 -12 -93 -48 -82 -30 13 64 81 74 29 -38 -52 -82 -50 -5 10 50 70 88 31 -33 -49 -88 -46 -56 -19 43 49 39 28 -2 -68
3663 -68 -78 -83 -33 -33 30 77 33 66 -17 -43 -29 -73 -48 16 20 55 46 16 -15 -58 -56 -57 -31 -21 48 34 47 55 -12 -12 -83 -46 -10 -10 30
3698 30 42 20 26 -15 -72 -47 -57 -9 -33 42 64 -2 22 34 -36 -38 -19 -42 32 2 49 30 24 5 -15 -19 7 -4 6 16 25 43 -9
3731 -9 -5 -13 -49 -29 -15 -12 28 22 39 41 -19 -50 -43 -57 -23 2 6 39 16 -9 14 -34 -21 -69 -13 32 28 54 58 4 -16 -77 -30 -11 -6 11
3767 11 49 22 37 2 -20 -37 -48 -26 -14 11 30 39 43 6 -24 -43 -48 -9 23 -4 25 69 4 -10 6 -39 -39 -19 -17 28 45 41 65
3800 65 5 8 -23 -23 4 10 38 58 30 24 4 -12 -21 -20 -4 -17 9 63 9 20 30 18 -34 -7 -57 -6 6 0 20 0 -26 1 -52 -47
3834d7M2j6O6m2J0K8l7k8K6n0O4m8L7K4l0L8k3k0j3j9QN2n7R1m6l4N0k0m4L4m6
3865e0L4j5jP1k7J2Mn5K2k2j9O6n2K7K2j6L0j9o3M7Nk3K6k9L6J5QQp8JK4l8L5
3898a4K1m4P3nl1L1n7J0j8RK4K7oK6p1O4p4QL0l7M7K2k3RM6r7L2n5J6NJ3N8Ql6
3932A1J2k2j5L6n4MML5O5n2J6k3l7pj5kO3j0L5Jk8Km3l0kj3N7O0qM1l2m1j3l1
3966c6k9K9LM2M0rK6n4l6j0l9M7J3L1L2j9j3Mo2K3k6pP6l5K8O2p1J9o8k8J9oO5
3999A1K1k6M0n8j9P%k6M0l8O7K9k2M6r8K4ok8K1mL0M5l0N1m9o3M3k4k0M6j4M6
4031D2ro2P4p1nL9n3K8M5k1L6l2j3N1q0LJ4j9N4MrN9o2Kj5l8J0N%O4k3K6Ko2M3
4066B7n7K5k6j2O3M7m6M2m5m7L2q5M4L2pM5j9K8l1n3J9l8QR2rj4N0m4j1n4l3L6
$$ plain form
3834 -47 -5 -21 45 3 13 41 4 -24 2 -48 16 -32 5 29 -1 37 14 -6 -19 -38 -30 22 -35 56 10 -24 26 6 -38 -4 -50
3865 -50 -16 -31 -32 39 12 24 28 -27 -5 -27 -46 20 -32 -5 17 1 31 12 -51 -4 1 -22 4 -25 11 26 34 42 -36 -35 -11 -49 -14
3898 -14 7 -37 36 31 0 31 -26 -16 -34 -25 -1 26 20 46 -25 39 -35 -27 3 -34 13 35 12 21 67 -30 2 -53 -37 -32 -19 39 47 11
3932 11 23 1 -14 22 -32 -28 -24 11 76 24 40 17 -20 -27 -42 -44 19 9 44 45 17 19 -24 -54 -56 -69 -12 48 40 81 49 8 -5 -36
3966 -36 -65 -36 -33 9 49 40 66 12 -24 -34 -73 -26 -13 18 50 31 18 22 -40 -17 -43 -50 26 -9 19 81 10 29 -39 -67 -48 -54 11
3999 11 32 6 46 -12 -31 -24 -24 -50 -10 -48 19 48 26 72 -26 -2 -8 -36 -15 -19 11 56 26 77 28 -35 8 -16 -36 10 -4 42
4031 42 33 -29 45 -26 -31 8 -45 -17 28 7 43 11 -2 49 -31 -28 -14 -33 21 25 16 75 13 15 0 -38 -28 -23 -23 41 18 44 46 -16 27
4066 27 -30 -5 -31 -43 20 67 21 63 18 -29 3 -82 -38 -6 -13 32 13 41 10 -43 -24 -62 -54 38 29 15 65 21 10 -44 -77 -41
4098d1RJQ9k1n%p5M6n1j7R0j5K0O3n9Lq6jM2l8O6LrN6n8k4J1n9L9J0kN5ml0J1
4133A9o2J7j2KO1rJ2N5n5k4k1l6M7j6ON1l2L4Op1Q%k2Q0l6K0J5n8M8q4J6L3lJ8
4167GJ1m1O0n8j7N3m3L4Qj6M3o0L5K2p5M8q%L0m7K0J6o4L9j2jM3k4qL1m2J5pq
4201a6J8j3lM7n5J7j7l1P3o3L2O0q7L9l8oN4n8L4J3kM3j0n2K6l1l0M2k5P0mrL9
4234E7p1MK5n4L4j9L9M3n4%Qo9K9N0l7K4m0L1rj2M5m7kL2k1L8J6m6J4l2l4P1o3
4267e0M5L8l5N8m2m6Lk5J6N8m1O1Ll6Qm9k9N9j3K0Mj8P2q2nK6o4O7j5LN9m4J7
4300B3l9k9%OL3M0k7J0k7j7kqLM5k3K8L2o3L3o0J5K1k1K8J0PM1m3k8k4k6L0K5
4333gk8P5n3M6k5m2Nj1K3K6k5RP7p7J1l2j9M3mNN8n6Lmj1Lj9L8K1m0N8J2o5J6
$$ plain form
4098 -41 -32 -31 58 37 32 32 -43 3 -48 -65 25 10 30 93 34 37 -49 -50 -8 -46 20 23 14 70 12 -12 -1 -60 -21 -11 -13 42 38 8 19
4133 19 -43 -26 -38 -36 25 16 28 83 28 4 -17 -53 -6 -22 -16 35 3 37 43 -28 -20 -20 -42 38 2 22 37 -21 27 -57 -41 -8 -11 7
4167 7 18 -23 37 -21 -38 15 -28 6 14 -2 41 -19 16 38 -37 11 3 3 33 -14 6 22 -42 -3 -15 -16 27 3 -5 26 -16 -1 -8 -16
4201 -16 2 -11 -14 33 -22 -5 -22 -53 20 -43 -11 49 -38 1 -37 -43 11 -47 -13 0 -2 41 31 -21 5 -26 -56 -14 -39 31 27 18 57
4234 57 -14 -10 15 -39 -5 -24 15 58 4 4 12 -57 -28 22 -15 9 -31 0 -9 -21 24 -23 -25 7 -14 24 40 -6 8 -24 -58 13 -50
4267 -50 -5 33 -2 56 14 -32 -29 -54 -38 20 -21 40 43 7 15 -34 -63 -4 -17 3 7 -11 61 -21 -26 0 -64 3 -12 -9 50 6 23
4300 23 -16 -45 -45 -39 -6 34 7 17 -10 -27 -29 -37 -34 11 -12 16 48 -15 18 -42 -27 -6 -27 1 11 18 59 16 -12 -36 -62 -32 -7
4333 -7 -35 40 -13 33 8 -34 -29 -40 -17 9 -16 -7 70 -7 4 -28 -47 -4 -8 -3 55 -1 2 -2 -13 -10 -29 9 30 -10 48 60 -5 11
4367A1o0K3K4j7L6Kl3Ll5%K6m0P0j5l2N6m4K1J1m9J9MLN7l5J9Jp1L9Rl1P2m0R
4401A3K1l4J4k2j0kJJ7K5k6K7k3KK4m4J3%k7M4k1j6J7j8kJ9pNK0m8O6k7mJk1L2
4436IPj4L9p3%L6k9P8l7%L3m9J1nj7L0k2RP5q3PPm7L8n2J8M1j4M2J5m8lm3K5J6
4471@k5L7J5nlpj4j1k5K8L1m7P0k6mk4k3J0L3k5M9Pl1%olrm5L1J8JJ2k2L2j9n2
4507e2J4k3L2L5QM2m2j3M4o9%N6m5L7k1K0ll7NK7o9O5moJ9l6L8om7M3l0J4L8l9
4541eRK9n5L0ml0L9m7K3J7l5M0l4JK1pk3M9m4N9k0k4N6p7K7L1n6M6Jl5P6r1M2
4574IK3o7L7j3j5L3j2L4k0oJ1m2j1J8k3K7L7l7L3j4nkq2O4K3oM4k1qJ5j8nK0o2
4608d1O4KJ1mm8M2k1l7M1k5jM3k8L2%j9J1l1j5K8k2N8p2J1N5m9pL2n8O4J7k5K6
$$ plain form
4367 11 -49 -26 -2 -19 17 19 -14 -11 -46 -46 -20 -60 10 -5 -37 19 -25 -4 7 -42 -23 -19 -16 41 6 25 26 -45 -6 3 -28 44 4 13
4401 13 34 0 14 -8 -18 -20 -19 -2 23 -3 24 1 3 27 -17 -4 -4 -31 13 -8 -24 -7 -25 -27 -8 -15 -10 10 -38 28 1 -3 -2 -23 9
4436 9 16 2 41 -32 -32 4 -25 53 16 16 49 0 11 6 -11 19 -3 6 81 -2 5 12 -35 3 -49 -31 10 -4 38 53 5 2 -41 -16 0
4471 0 -25 12 27 22 19 12 -2 -13 -38 -10 21 -26 44 18 14 -10 -33 -23 10 -15 34 41 10 10 4 1 -8 -53 -22 -4 -3 9 -13 19 0 -52
4507 -52 -38 -61 -29 6 14 56 14 1 45 -24 -24 32 -13 24 3 23 20 -17 -12 15 -54 11 7 1 20 -16 22 16 -31 12 -18 -4 34 -5
4541 -5 4 33 -22 8 4 -26 13 -34 -11 6 -29 11 -23 -22 -1 -8 -31 18 -26 33 13 -11 45 -32 -5 26 -30 16 17 -18 58 -33 9
4574 9 32 -35 2 -11 -26 7 -5 29 9 3 14 -28 -39 -21 -44 -17 20 -17 16 2 -3 -5 -87 -23 0 -6 38 17 9 24 6 1 21 -41
4608 -41 23 25 36 32 -16 26 5 -32 9 -16 -17 26 -2 30 30 11 22 -9 -24 4 -18 40 -32 -21 34 -15 -22 10 -48 16 33 8 34
4641C4l2K3K2o0j1M3k7K5pj3K7k4L8k6k1M8l9%J1l2M0Kn1N9k4rJ3j7K8rl1J6l
4674gmN4n0K5k9k6L4m9L6K8k5K9rk6K2l3L7ll5O7%m0N1n7j1L1j9K5K0k5J5j6q
4707Bj5j1K6K7l8L2pqPm3j0J7lN0l0lL1l1nn1J4M6j4J8J9j1R%l1J2k8JK8J2MJ5
4743C1j8Oj5l9O2m0K5J7k8N4q9J5Mk6K4K0nK2k2j7K6m9M7j8%L0l6K7j6k1J5jj3
4776b8K2J2J1Ok2K1j0j5k3K4K0K2k8K0rn6K0JkK8n4P8l5J1j4qKNk7J2M1k0J4k9
4810a0rnj0L5LjJ4l3K7Km6K8j6OJ6J3nrj1MnrK1JJ0J6l5LJ4l8%RJ0J3l8M3Jk5
4848a6L7k4k8NJ0J2jJ9%k5k4J6K3l2L0kK1j7l3L4j6KK9j3K3j3j2L5k7j7J0m0M0
4881FJ2j5nkrj1J2j3L8m1N8m1NqqK2Qm6K3%mK2rJ4Nj6k5L1j4L8m2lJ2ROpj4M3
$$ plain form
4641 34 2 25 47 -13 -24 19 -8 17 10 -3 24 0 38 12 -9 39 0 0 11 -21 19 21 -30 29 5 -4 9 -8 20 11 -20 -4 -7
4674 -7 -11 43 -7 18 -11 -37 -3 -52 -16 12 -13 16 7 -19 3 -30 7 4 -31 36 36 -4 47 -10 -21 10 -9 16 36 11 26 10 2
4707 2 -13 -24 2 29 -9 23 16 8 15 -28 -38 -21 -24 26 -4 -7 24 -7 -12 -63 -49 -3 -17 1 20 9 18 18 -13 -1 -29 -28 0 12 16 31
4743 31 13 19 4 -35 27 -13 12 29 1 55 -34 -19 -15 -41 -17 3 -2 20 -2 -19 7 -42 5 -13 -13 17 -19 8 -8 -29 -14 -15 -28
4776 -28 -6 6 17 23 1 22 12 -3 -26 -2 18 40 12 32 23 -33 -13 -12 -14 14 -40 38 3 14 0 -8 -6 -1 -28 -16 25 5 19 -10
4810 -10 -19 -24 -34 1 4 3 17 -16 11 13 -33 -5 -21 -15 1 14 9 0 -11 -7 -12 -21 0 1 11 27 -8 -5 9 -29 -29 -20 -10 3 -35 8 9 -16
4848 -16 21 -3 -31 -26 -16 -4 -5 14 14 -11 -35 -19 4 -28 2 0 21 4 -29 5 -11 -9 20 7 30 17 5 40 13 -4 6 -34 6
4881 6 18 3 -2 -4 -13 -24 -12 -25 13 -28 30 -11 -6 -14 -22 0 8 -38 -15 -15 -19 3 -6 8 13 -3 -28 3 -11 27 -15 -18 -6 3 9 2 -12 31
4919C1j3j0J3k2%Kl1K5J2M%l5J7qJ1j0JJ2J2JNj0oJ0k5J2j1rnK2OM8l3j7K2j2
4955Il2L9pJ4m0KQqMJ5PopKLNlj9JK5j2qJ6j4Lpqj2L0L3l4k2K1K4k1Rk9M1j0k9
4995a7N7l4lL1k6nj6j5J9j4J9K3l5J4%nL1k2j9J5Nj2Kj7J9kj5M1k6pJ8m0K5MJ
5030fL5l1L1j3NRm1LL3l4L4j7j8J3j4pJ8j1J7J1j6Lj3j1LJ6j4Oj7PJ1qJ4j1j7
5065c0L7k0J5ok2M3k7K6km8L6joK9m1pM5k6M1n2jL4l4J0Lk3L2j1%K7k7Pl8K2M1
5100B6l6nM2m0rL6l1K9l1ON2o0L3j7n5L3L4nJ1rKJ6l7M4m2J6%Mj6%jJ4pnOk2L8
5137A4j1mjJ7k6J8n1L2j6PJ8ml7O8m5jJ1k1L6j9J5M0k3m2J4kK9Jj1K8o7N8j8m0
5171c3M0j0j4K0qK7k4k0N1l0jJlOkk6M0k2j2qojL6k1M9k0qK3k7J5j3k4M1ql1L2
$$ plain form
4919 31 18 8 21 -1 -1 1 -30 -5 7 11 11 -24 -7 -15 -4 -14 -13 -1 11 12 17 7 1 11 -14 -2 -13 -22 -27 -5 1 49 16 -1 21 9
4955 9 -23 16 9 23 -17 -15 -7 -15 -11 4 11 5 -2 0 3 8 5 -14 -13 12 0 -8 8 -6 -3 -10 -18 -30 0 33 -1 -23 -2 22 1 10 -19 22 12 -17
4995 -17 40 6 3 34 8 3 -13 -28 -9 -23 -4 19 -16 -2 -2 -7 24 2 -17 -2 3 -9 -7 -24 -5 -7 -22 19 -7 -14 4 -36 -11 -7 -6
5030 -6 29 -2 29 16 21 30 -11 -8 25 -9 25 8 -10 3 -11 -18 0 -11 6 17 1 4 -9 -20 -17 -1 -15 -9 -26 -19 -8 -16 -2 -13 -30
5065 -30 7 -13 2 -4 -26 17 -10 16 14 -34 2 1 -5 24 -17 -24 21 -5 36 -16 -17 17 -17 -7 -4 -27 5 -6 -6 21 -6 1 -37 -15 26
5100 26 -10 -15 27 -13 -22 14 -17 12 -19 -13 39 -21 12 -5 -60 -27 7 2 13 4 6 22 -15 29 -13 3 3 7 -9 -9 -10 4 -3 -8 -2 -24 14
5137 14 3 -1 -2 15 -11 7 -44 -12 -28 -21 -3 -7 -44 24 -21 -22 -11 -32 4 -15 0 40 17 -25 -11 -13 16 17 6 34 -33 25 7 -33
5171 -33 7 -3 -17 3 -5 22 -2 -22 29 -1 -2 -1 -4 2 0 -26 14 -8 -20 -28 -34 -35 1 -20 29 9 1 24 -3 12 -1 -25 16 8 -23 9
5207Io%j2k5L3j8MN5n8M9k9k2LpK2L4l9J5j8qK2l6K2J6n0N6n3L9klj1qj4J8J0
5242a2qM9l3j7M1l0J7j6J1K2l5K0J1j3qMk9N1l3oM4j8J4k0m2O3m0KL6l3K8k7J
5275fL8p1J7k0J3L6Kj9L3l1OJ4m1jK9mL0j6j4L1l8J2K8l2JK3j8N0p6J7rJ9Rk0
5309hjJ4k3K2Ol6L7k3K3j1m0M3Rm1K2j9J7J6j5K9j1j7K4k3j7M3l3RnJ5K9l0j5
5342a0J7k5M3l6Nj0j8K9J6m3J0N2m6L1k1J3J7n7M4l3J3L0m0L2J8m1K6l8L4j7K5
5373B0n8N9m7K1Oj3K6l8J8J0k9K8Kj6L8n2K2Lj3J1NJJ4l4K2j4n4M4mK9j5j1L6
5406A7k1l3L4qj0L6k1K1K5k5j0Kj8L6m6L1k%ML0l6mlMJ1k1K1J0l0jJ5j3J8m5J6
5441a6Kkj3K6j0K1j7Ql4L7J9Ok7K0l7M5m4j4P2j9k5J7j3J6l2K3j4J3j0M1m1OJ
$$ plain form
5207 9 3 3 -9 -34 -1 -19 -15 40 -18 31 2 -20 -17 -24 -2 32 -7 8 -10 -18 4 -32 -10 6 -44 12 -41 -2 -4 -7 -18 -26 -40 -22 -12
5242 -12 -20 29 -4 -21 20 -10 7 -9 2 24 -11 9 20 7 -1 3 -26 25 -8 -14 30 12 26 6 -36 27 -13 -11 25 -8 20 -7 -6
5275 -6 32 -39 -22 -42 -29 7 9 -10 23 -8 -2 12 -29 -30 -1 -5 25 9 -5 26 -12 0 28 -4 -3 20 2 52 -24 -7 -16 3 12 -8
5309 -8 -9 5 -18 4 10 -26 11 -12 11 0 -40 3 12 -29 -7 -26 -9 7 -8 21 10 -7 17 -6 -23 20 -13 -4 -9 6 35 5 -10
5342 -10 7 -18 25 -11 -6 -16 -34 -5 11 -32 -22 30 -16 15 -6 7 24 -33 11 -22 -9 21 -19 13 31 -10 16 -22 12 -5 20
5373 20 -38 21 -26 -5 1 -12 14 -24 -6 4 -25 3 5 -11 27 -25 -3 0 -13 -2 3 4 18 -16 6 -8 -62 -18 -22 7 -8 -19 17
5406 17 -4 -37 -3 -11 -21 15 -6 15 40 15 5 7 -11 25 -21 10 8 8 12 42 6 2 -1 3 14 -7 14 24 -6 -7 8 -5 13 -32 -16
5441 -16 -14 -16 -29 -3 -13 8 -9 -1 -35 2 21 27 0 20 -17 28 -16 -30 42 23 -2 15 2 18 -14 9 -5 8 -2 39 -2 4 5
5474Ej2L7l6jqRN3l0k4J5j9jNJ9k4nQNJ3l0L6l9lK0J3K6m6L0Kk1l9M1pL0m1J6
5510cj9OJ3j3J1K7l6M5k9oMK1m4L3l5L1k6k9M7jpK2l8NlM0l2J3Nj4J0K0k3nQK0
5546A8m1K6J6k1j9j0M0lNrK0K8ol9olqK4rJ0oonj2K7k5j3lM6l1L7n0K5L5m6J5
5582Ajo2O3N1o4L6l2J0l2J9J8p%PKrRj4LJ6k5J5j9K3mk6M7m8%K8m0K0JJ2K0kk2
5619fmlK3Jl5K7NJLnOnj0ll4K4N9o0jJ4qM6j1k8K5j9J5J3n3rJ7J3J9l0K4l2QJ
5657a2%j2K9k1j1K3j4L%J3Mj4L9k1J0j3Kk0JJ4j1K0j1K6j5j0j1roK5lL4l4NNj6
5693a1pKJ2K2k7k2L0j0L1m8lK8j8K2J6l3J3rQj9l2O2lj6L1j0j0K0l9j3O4k3j6
5726hJ8j9L0j7oj8mOJ5j7L8k5pPNJj7lM0k3kL2j5j7K2m4M3pJ9kl0Jj1JK8j9J4
$$ plain form
5474 5 -7 30 -6 -7 -15 -6 47 17 -7 8 -11 -12 -7 12 -12 -17 -9 -4 9 -21 15 -24 -27 -7 6 32 -14 16 18 -3 -42 -1 -8 22 -19 -3
5510 -3 -22 -16 -3 -16 -5 22 -14 31 2 -4 0 21 -23 10 -25 6 -20 -49 -2 -3 -10 12 -26 -21 -24 16 -16 -3 2 -12 -2 18 -5 -10 -2 18
5546 18 -23 3 19 -2 -21 -31 9 6 11 2 22 50 44 5 -1 -4 -12 12 3 13 7 1 -4 -16 11 -14 -27 -30 16 -15 22 -28 -3 32 -14 1
5582 1 0 -62 1 52 -12 24 -8 2 -30 -11 7 0 0 7 9 0 9 -5 -2 14 -11 4 -15 8 4 -22 25 -23 -23 5 -35 -15 -14 -2 18 16 -6
5619 -6 -10 -13 10 11 -24 3 8 9 12 7 13 8 -2 -5 -39 -15 44 -16 -17 -3 -11 35 24 -4 21 2 17 30 -23 -32 -15 -2 17 -13 11 -21 -13 -12
5657 -12 -12 -24 5 -16 -27 -4 -18 -15 -15 -2 2 -12 27 6 16 3 5 -15 -14 0 -11 9 -2 24 9 -1 -12 -21 -27 -2 -5 29 -5 0 5 -11
5693 -11 -18 -16 -4 18 -9 -31 -1 -11 20 -28 -31 -3 -21 1 17 -16 -3 -12 -4 -23 -55 7 4 -12 19 9 -1 19 -20 -33 31 8 -8
5726 -8 10 -9 21 4 -2 -20 -24 -18 -3 -20 18 -7 -14 -7 -2 -1 -18 -21 19 -4 -6 26 11 -6 16 -28 15 8 27 25 -5 -4 -15 -14 14 -5 9
$$ [...]
8191A9
##END NTUPLES=NMR FID
##END=
