##TITLE=1H_DE-80H_X3
 200.13MHz, d2o
 8 sc
 
 19ns.26.2.2025
##JCAMPDX= 6.0         $$ Bruker NMR JCAMP-DX V2.0
##DATA TYPE= NMR FID
##DATA CLASS= NTUPLES
##ORIGIN= UXNMR, Bruker Analytische Messtechnik GmbH
##OWNER= pz
$$ XWIN-NMR		Version 3.5
$$ Fri Oct 17 15:23:48 2025 Russian Standard Time (UT+4h)  Yarkov@DPX200
##.OBSERVE FREQUENCY= 200.1313
##.OBSERVE NUCLEUS= ^1H
##.DELAY= (6, 6)
##.ACQUISITION MODE= SIMULTANEOUS
##.ACQUISITION SCHEME= undefined
##.AVERAGES= 8
##.DIGITISER RES= 18
##SPECTROMETER/DATA SYSTEM= spect
##.PULSE SEQUENCE= zg30
##.SOLVENT NAME= CDCl3
##.SHIFT REFERENCE= (INTERNAL, CDCl3, 0, 14.3821)
##AUDIT TRAIL= $$ (NUMBER, WHEN, WHO, WHERE, WHAT)
$$ ##TITLE= Audit trail, XWIN-NMR		Version 3.5
$$ ##JCAMPDX= 5.01
$$ ##ORIGIN= Bruker BioSpin GmbH
$$ ##OWNER= Yarkov
$$ C:/Bruker/XWIN-NMR/data/yarkov2/nmr/H-C/1/audita.txt
$$ ##AUDIT TRAIL=  $$ (NUMBER, WHEN, WHO, WHERE, WHAT)
(   1,<2025-10-17 15:21:16.31 +0400>,<Yarkov>,<DPX200>,
      <created by zg, POWCHK disabled, PULCHK disabled
       configuration hash MD5:
       00 E9 B6 7A A2 85 ED C7 34 08 36 98 17 FE 4E 26
       data hash MD5: 16K
       AC BD 54 82 61 C0 93 8E 1E 55 20 CF BB 95 B7 5F>)
$$ ##END=
$$ 
$$ hash MD5
$$ 9C FF D2 32 9B 35 9A 95 74 19 62 C7 43 F8 D8 DE
##$RELAX= 
##$RELAX= 
##$RELAX= 
##$RELAX= 
##$RELAX= 
##$RELAX= 
$$ Bruker specific parameters
$$ --------------------------
##$DU= <C:/Bruker/XWIN-NMR>
##$EXPNO= 1
##$NAME= <H-C>
##$PROCNO= 1
##$TYPE= <nmr>
##$USER= <yarkov2>
##$AMP= (0..31)
100 100 100 100 100 100 100 100 100 100 100 100 100 100 100 100 100 100 
100 100 100 100 100 100 100 100 100 100 100 100 100 100 
##$AQSEQ= 0
##$AQ_mod= 1
##$AUNM= <au_zg>
##$AUTOPOS= <>
##$BF1= 200.13
##$BF2= 200.13
##$BF3= 200.13
##$BF4= 200.13
##$BF5= 200.13
##$BF6= 200.13
##$BF7= 200.13
##$BF8= 200.13
##$BYTORDA= 1
##$CFDGTYP= 0
##$CFRGTYP= 5
##$CHEMSTR= <none>
##$CNST= (0..31)
1 1 145 1 1 1 1 1 1 1 1 1 1 1 1 1 1 1 1 1 1 1 1 1 1 1 1 1 1 1 1 1 
##$CPDPRG= <>
##$CPDPRG1= <>
##$CPDPRG2= <>
##$CPDPRG3= <>
##$CPDPRG4= <mlev>
##$CPDPRG5= <mlev>
##$CPDPRG6= <mlev>
##$CPDPRG7= <mlev>
##$CPDPRG8= <mlev>
##$CPDPRGB= <>
##$CPDPRGT= <>
##$D= (0..31)
0 0.7 0 0 0 0 0 0 0 0 0 0.03 0 0 0 0 0 0 0 0 0 0 0 0 0 0 0 0 0 0 0 0 
##$DATE= 1760700075
##$DBL= (0..7)
120 120 120 120 120 120 120 120 
##$DBP= (0..7)
150 150 150 150 150 150 150 150 
##$DBP07= 0
##$DBPNAM0= <>
##$DBPNAM1= <>
##$DBPNAM2= <>
##$DBPNAM3= <>
##$DBPNAM4= <>
##$DBPNAM5= <>
##$DBPNAM6= <>
##$DBPNAM7= <>
##$DBPOAL= (0..7)
0.5 0.5 0.5 0.5 0.5 0.5 0.5 0.5 
##$DBPOFFS= (0..7)
0 0 0 0 0 0 0 0 
##$DE= 6
##$DECBNUC= <off>
##$DECIM= 32
##$DECNUC= <off>
##$DECSTAT= 4
##$DIGMOD= 1
##$DIGTYP= 9
##$DL= (0..7)
0 120 120 120 120 120 120 120 
##$DP= (0..7)
150 150 150 150 150 150 150 150 
##$DP07= 0
##$DPNAME0= <>
##$DPNAME1= <>
##$DPNAME2= <>
##$DPNAME3= <>
##$DPNAME4= <>
##$DPNAME5= <>
##$DPNAME6= <>
##$DPNAME7= <>
##$DPOAL= (0..7)
0.5 0.5 0.5 0.5 0.5 0.5 0.5 0.5 
##$DPOFFS= (0..7)
0 0 0 0 0 0 0 0 
##$DQDMODE= 0
##$DR= 18
##$DS= 0
$$ [...]
##$SUBNAM2= <"">
##$SUBNAM3= <"">
##$SUBNAM4= <"">
##$SUBNAM5= <"">
##$SUBNAM6= <"">
##$SUBNAM7= <"">
##$SUBNAM8= <"">
##$SUBNAM9= <"">
##$SW= 18.0517328524113
##$SWIBOX= (0..15)
0 0 2 0 0 0 0 0 0 0 0 0 0 0 0 0 
##$SW_h= 3612.71676300578
##$TD= 16384
##$TD0= 1
##$TE= 0
##$TE2= 300
##$TE3= 300
##$TEG= 300
##$TL= (0..7)
0 120 120 120 120 120 120 120 
##$TP= (0..7)
150 150 150 150 150 150 150 150 
##$TP07= 0
##$TPNAME0= <>
##$TPNAME1= <>
##$TPNAME2= <>
##$TPNAME3= <>
##$TPNAME4= <>
##$TPNAME5= <>
##$TPNAME6= <>
##$TPNAME7= <>
##$TPOAL= (0..7)
0.5 0.5 0.5 0.5 0.5 0.5 0.5 0.5 
##$TPOFFS= (0..7)
0 0 0 0 0 0 0 0 
##$TUNHIN= 0
##$TUNHOUT= 0
##$TUNXOUT= 0
##$USERA1= <user>
##$USERA2= <user>
##$USERA3= <user>
##$USERA4= <user>
##$USERA5= <user>
##$V9= 5
##$VALIST= <valist>
##$VCLIST= <CCCCCCCCCCCCCCC>
##$VD= 0
##$VDLIST= <DDDDDDDDDDDDDDD>
##$VPLIST= <PPPPPPPPPPPPPPP>
##$VTLIST= <TTTTTTTTTTTTTTT>
##$WBST= 1024
##$WBSW= 4
##$XGAIN= (0..3)
0 0 0 0 
##$XL= 0
##$YL= 0
##$YMAX_a= 247773
##$YMIN_a= -225199
##$ZGOPTNS= <>
##$ZL1= 120
##$ZL2= 120
##$ZL3= 120
##$ZL4= 120
##$ABSF1= 10
##$ABSF2= 0
##$ABSG= 5
##$ABSL= 3
##$ALPHA= 0
##$AQORDER= 0
##$ASSFAC= 0
##$ASSFACI= 0
##$ASSFACX= 0
##$ASSWID= 0
##$AUNMP= <proc_1d>
##$AZFE= 0.1
##$AZFW= 0.1
##$BCFW= 1
##$BC_mod= 2
##$BYTORDP= 1
##$COROFFS= 0
##$CY= 83.5205535888672
##$DATMOD= 1
##$DC= 2
##$DFILT= <>
##$DTYPP= 0
##$F1P= 10.8118882576601
##$F2P= -7.23987719738617
##$FCOR= 0.5
##$FTSIZE= 0
##$FT_mod= 4
##$GAMMA= 1
##$GB= 0.15
##$INTBC= 1
##$INTSCL= 1
##$ISEN= 128
##$LB= 0.25
##$LEV0= 0
##$LPBIN= 0
##$MAXI= 10000
##$MC2= 0
##$MEAN= 0
##$ME_mod= 0
##$MI= 1.114404
##$NCOEF= 0
##$NC_proc= 0
##$NLEV= 6
##$NOISF1= 3.799351
##$NOISF2= 2.8
##$NSP= 1
##$NTH_PI= 0
##$NZP= 0
##$OFFSET= 14.38212
##$PC= 1
##$PHC0= -3434.24
##$PHC1= 8.821912
##$PH_mod= 1
##$PKNL= yes
##$PPARMOD= 0
##$PSCAL= 0
##$PSIGN= 0
##$REVERSE= no
##$SF= 200.129724274929
##$SI= 16384
##$SIGF1= 3
##$SIGF2= 2
##$SINO= 400
##$SIOLD= 16384
##$SREGLST= <1H.CDCl3>
##$SSB= 0
##$STSI= 0
##$STSR= 0
##$SW_p= 3205.1282051282
##$SYMM= 0
##$S_DEV= 0
##$TDeff= 0
##$TDoff= 0
##$TI= <>
##$TILT= no
##$TM1= 0
##$TM2= 0
##$TOPLEV= 0
##$USERP1= <user>
##$USERP2= <user>
##$USERP3= <user>
##$USERP4= <user>
##$USERP5= <user>
##$WDW= 1
##$XDIM= 8192
##$YMAX_p= 0
##$YMIN_p= 0
$$ End of Bruker specific parameters
$$ ---------------------------------
##NTUPLES= NMR FID
##VAR_NAME=  TIME,          FID/REAL,        FID/IMAG
##SYMBOL=    X,             R,               I
##VAR_TYPE=  INDEPENDENT,   DEPENDENT,       DEPENDENT
##VAR_FORM=  AFFN,          ASDF,            ASDF
##VAR_DIM=   8192,          8192,            8192
##UNITS=     SECONDS,       ARBITRARY UNITS, ARBITRARY UNITS
##FACTOR=    0.0002768,     1,               1
##FIRST=     0,             0,               0
##LAST=      2.2672688,     0,               0
##MIN=       0,             -225199,         0
##MAX=       2.2672688,     247773,          0
$$ Real data points
##PAGE= N=1
##DATA TABLE= (X++(R..R)), XYDATA
0 0 0 0 0 0 0 0 0 0 0 0 0 -8 8 -8 8 -9 16 -16 24 -25 32 -40 48 -56 65 -73 89 -99 114 -134 153 -174 197
33 197 -224 252 -284 320 -357 401 -447 498 -553 613 -679 751 -829 916 -1010 1112 -1226 1349
51 1349 -1487 1639 -1806 1997 -2208 2450 -2728 3048 -3425 3873 -4423 5110 -5998 7194 -8904
66 -8904 11558 -16305 27453 -110232 -72989 -14454 -4740 247773 73629 112575 67385 -175384
78 -175384 -75174 -145376 -147726 102846 19609 149720 185169 -22697 47041 -105223 -190793
89 -190793 -24053 -119532 43817 153099 39093 165752 24003 -95425 -14491 -182178
99 -182178 -71790 30486 -32564 162856 91899 19142 88545 -120360 -79467 -43578 -133554
110 -133554 68512 43840 38501 156600 -24715 1714 -11345 -153381 -111 -41489 -25935
121 -25935 129981 2099 65351 59307 -96792 13781 -69640 -79823 65837 -38438 58338
132 58338 84146 -45027 61880 -39036 -75372 37041 -77225 19957 59951 -39871 82470
143 82470 -6975 -44465 47968 -79299 1738 33750 -56204 72379 -2572 -28928 60966 -66133
155 -66133 5854 28090 -61661 62930 -7807 -28100 60556 -62706 7276 26123 -60337 62929
167 62929 -4986 -21627 63062 -60960 3568 16241 -68547 55385 -5645 -12587 74428 -46693
179 -46693 11955 13305 -77916 37457 -21784 -19059 76317 -30831 32215 28750 -68744 29391
191 29391 -39843 -39618 56542 -34408 41871 47766 -42554 44557 -36890 -50286 30989 -56885 26140
204 26140 45615 -25163 67375 -12824 -34801 26619 -72363 939 21145 -34626 70564 5804
216 5804 -8437 46030 -62470 -5910 173 -57240 50797 -146 1899 64928 -38941 10270
228 10270 1855 -67143 29752 -21214 -9917 63806 -25347 30276 19473 -56043 26039 -35276
240 -35276 -27842 46106 -31006 35352 33032 -36602 38430 -31158 -33760 29505 -45876 24054 30436
253 30436 -26202 51463 -16229 -24152 26777 -53843 9627 16649 -30381 52650 -5612 -9876 35708
266 35708 -48583 4889 5044 -40992 42667 -7182 -3143 44958 -36436 11639 4128 -46601 31288
279 31288 -17049 -7400 45504 -28166 21919 11979 -42099 27737 -25161 -16411 37145 -29691 26019
292 26019 19521 -31866 33328 -24308 -20484 27569 -37537 20699 18897 -25164 40892 -16089 -15314
305 -15314 25140 -42432 11906 10592 -27270 41530 -9325 -6063 30608 -38351 8961 3021 -34096
318 -34096 33774 -10961 -2121 36347 -28938 14552 3641 -36605 25222 -18685 -6928 34609
330 34609 -23615 22109 10890 -30716 24372 -23653 -14345 26043 -27303 22961 16019 -21709
342 -21709 31354 -20114 -15465 18907 -35286 15865 12634 -18383 37898 -11489 -8210 20104 -38232
355 -38232 8055 3352 -23652 36091 -6701 657 27865 -31856 7763 -2802 -31476 26450
367 26450 -11021 2345 33368 -21352 15681 482 -32742 17735 -20345 -5030 29558 -16617
379 -16617 23820 9986 -24476 18308 -24985 -13942 18602 -22287 23318 15707 -13599 27495
391 27495 -19261 -14553 10650 -32346 13762 10698 -10654 35301 -8395 -5149 13540 -35494 4720
404 4720 -625 -18328 32626 -3745 4931 23622 -27625 5701 -6687 -27692 21818 -9905 5535
417 5535 29399 -16755 15049 -1907 -28262 13783 -19650 -2905 24608 -13429 22340 7522
429 7522 -19560 15573 -22507 -10534 14559 -19294 20264 11145 -10933 23167 -16476 -9505 9527
442 9527 -25999 12535 6304 -10250 26941 -9608 -2892 12348 -26124 8330 272 -14725 24249
455 24249 -8586 1113 16447 -22182 9667 -1289 -17223 20633 -10834 960 17176 -19745
467 -19745 11526 -651 -16848 19233 -11681 709 16768 -18678 11661 -1155 -17113 17466
479 17466 -11995 1413 17726 -15671 13148 -907 -17965 13600 -15179 -831 16992 -12167
491 -12167 17387 3687 -14467 12348 -18852 -6770 10582 -14549 18406 8852 -6409 18443
503 18443 -15679 -8740 3404 -22831 11104 5931 -2772 26085 -5924 -1021 5103 -26873 1863
516 1863 -4788 -9889 24470 -398 9595 15753 -19290 2252 -11770 -20856 12666 -7208 10339
529 10339 23197 -6636 13717 -5515 -21829 3279 -19726 -1224 16844 -3724 23079 7597
541 7597 -9799 7832 -22452 -11417 3050 -14158 18163 11380 1295 20380 -11610 -7621 -1908
554 -1908 -24368 5079 1593 -1104 24922 -630 4693 6475 -21991 -531 -9199 -12305 16714
567 16714 -1781 10651 16526 -10906 6465 -8820 -17878 6490 -11806 4554 16050 -4843
579 -4843 15883 342 -11858 6184 -17266 -4075 7110 -9647 15771 5310 -3518 13612
591 13612 -12263 -3905 2273 -16327 8350 814 -3459 16858 -5644 2522 6102 -15172 4945
604 4945 -4647 -8893 12219 -6271 4849 10477 -9371 8731 -3262 -10230 7718 -11061 710
617 710 8298 -7971 12174 1539 -5532 9849 -11471 -2422 3161 -12476 9219 1455 -2275 14631
631 14631 -6330 1136 3275 -15180 4024 -4236 -5873 13764 -3391 6630 8970 -10718 4744
644 4744 -7273 -11282 7136 -7656 5760 11818 -4401 11066 -2647 -10186 3412 -13651 -1066
657 -1066 6881 -4608 14403 3984 -2973 7562 -12984 -5090 -212 -11206 9765 3987 1633
670 1633 14279 -5799 -967 -852 -15645 2420 -2858 -1844 14861 -673 6315 5530 -12184 1091
684 1091 -8299 -8877 8452 -3437 8187 10856 -4941 6869 -6165 -10874 2624 -10287 2942
697 2942 8968 -2139 12581 429 -5857 3508 -13127 -2867 2485 -6116 11817 3754 111 9123
711 9123 -9170 -2863 -1242 -11491 6060 659 739 12533 -3380 2074 1150 -12015 1956 -4521
725 -4521 -3620 10209 -1983 5943 5921 -7759 3293 -6048 -7353 5395 -5368 4968 7539 -3783
739 -3783 7478 -3126 -6601 3282 -9041 1159 4872 -3848 9639 347 -2928 5209 -9178 -1019
753 -1019 1336 -6850 7925 743 -457 8251 -6248 286 468 -8998 4743 -1688 -1239 8938 -3728
768 -3728 3041 2460 -8098 3442 -3917 -3692 6845 -3861 4179 4566 -5505 4742 -3750 -4863
782 -4863 4448 -5797 2868 4547 -3923 6674 -1830 -3725 3977 -7131 913 2729 -4523 7091
796 7091 -386 -1735 5367 -6576 375 1067 -6197 5764 -800 -849 6800 -4900 1562 1070 -6973
811 -6973 4184 -2391 -1659 6705 -3846 3084 2384 -6080 3864 -3478 -3034 5241 -4232 3411 3430 -4444
827 -4444 4818 -3021 -3468 3824 -5409 2349 3156 -3564 5862 -1627 -2555 3663 -6033 1030 1842 -4043
843 -4043 5872 -698 -1209 4616 -5439 742 762 -5161 4830 -1080 -639 5549 -4195 1640 802 -5672
859 -5672 3726 -2286 -1223 5446 -3513 2786 1728 -5032 3562 -3103 -2193 4420 -3860 3106 2453 -3865
875 -3865 4246 -2840 -2486 3455 -4672 2407 2274 -3236 4948 -1928 -1908 3233 -5031 1525 1494 -3430 4927
892 4927 -1288 -1120 3682 -4665 1211 867 -3923 4342 -1320 -749 4083 -4040 1491 730 -4165 3787
908 3787 -1715 -790 4154 -3660 1918 853 -4083 3551 -2084 -952 4008 -3480 2256 1029 -3907
923 -3907 3419 -2425 -1149 3743 -3366 2565 1356 -3515 3403 -2673 -1531 3158 -3536 2620 1704
938 1704 -2793 3790 -2403 -1732 2432 -4120 2016 1554 -2236 4392 -1512 -1208 2276 -4574 1010 628
954 628 -2584 4458 -672 -48 3108 -4061 606 -403 -3697 3446 -944 557 4165 -2700 1600 -300
970 -300 -4323 2087 -2393 -289 4058 -1785 3085 1039 -3411 1936 -3474 -1769 2540 -2513 3378
985 3378 2179 -1685 3317 -2842 -2166 1084 -4131 1977 1652 -970 4663 -1066 -832 1331 -4767 319
1001 319 -110 -2082 4350 -40 857 2958 -3533 275 -1162 -3680 2556 -949 973 4022 -1700 1873
1017 1873 -341 -3842 1230 -2680 -518 3222 -1276 3163 1303 -2360 1775 -3180 -1800 1479 -2576
1032 -2576 2720 1822 -904 3373 -2032 -1428 745 -3930 1232 706 -1015 4067 -635 90 1623 -3784
1048 -3784 396 -695 -2325 3160 -557 961 2902 -2389 1067 -809 -3114 1739 -1676 318 2963
1063 2963 -1386 2232 312 -2510 1406 -2512 -865 1863 -1757 2424 1158 -1300 2274 -2094 -1140
1078 -1140 938 -2769 1567 795 -905 3061 -1089 -312 1150 -3091 786 -198 -1554 2841 -739 531
1094 531 1988 -2414 952 -623 -2255 1968 -1314 465 2321 -1618 1711 -109 -2120 1501 -1979
1109 -1979 -275 1755 -1587 2030 554 -1377 1835 -1880 -667 1064 -2148 1559 552 -956 2331
1124 2331 -1229 -336 1008 -2403 973 46 -1177 2303 -851 201 1408 -2088 894 -315 -1591
1139 -1591 1855 -1062 307 1665 -1646 1266 -168 -1610 1569 -1425 35 1464 -1564 1504 72
1154 72 -1292 1636 -1476 -117 1180 -1728 1398 80 -1135 1739 -1312 -51 1117 -1721 1242
1169 1242 13 -1125 1658 -1230 -31 1090 -1596 1228 80 -1040 1602 -1182 -102 965 -1615
1184 -1615 1122 111 -879 1709 -990 -25 869 -1748 871 -115 -930 1710 -778 267 1072 -1615
1200 -1615 771 -418 -1234 1387 -911 437 1346 -1171 1105 -326 -1339 990 -1355 120 1166
1215 1166 -951 1523 143 -915 1075 -1523 -323 629 -1285 1369 372 -400 1541 -1075 -251 343
1231 343 -1720 791 20 -434 1741 -541 246 648 -1617 419 -466 -915 1372 -510 556 1114 -1093
1248 -1093 681 -502 -1205 846 -949 313 1104 -738 1151 -101 -916 773 -1244 -63 696 -919
1264 -919 1201 132 -488 1080 -1074 -94 414 -1192 930 -2 -410 1233 -821 120 475 -1195 748
1281 748 -184 -538 1125 -737 178 545 -1070 728 -169 -541 1038 -707 137 499 -1069 623 -194
1298 -194 -509 1057 -533 286 589 -991 497 -383 -703 865 -528 450 836 -634 707 -385 -879
1315 -879 463 -941 218 771 -374 1170 68 -531 427 -1254 -318 182 -688 1160 430 122 1023
1332 1023 -853 -346 -293 -1357 424 19 190 1495 -41 397 108 -1392 -191 -799 -574 1039 144
1349 144 1035 1028 -508 212 -962 -1280 6 -699 597 1239 309 1223 -40 -862 -288 -1531 -499 277
1367 277 -63 1510 844 318 622 -1148 -853 -704 -1198 571 487 744 1578 22 83 -427 -1615 -438 -701
1386 -701 -129 1307 528 1130 716 -729 -261 -1212 -1141 133 -247 960 1273 359 840 -445 -1043 -502 -1248
1405 -1248 -136 568 305 1391 597 -12 104 -1220 -796 -446 -626 793 652 623 1040 -286 -283 -536 -1226
1424 -1226 -136 -194 198 1113 316 582 207 -810 -243 -774 -539 423 6 732 727 -76 340 -504 -683 -82
1444 -82 -589 216 468 59 755 42 -220 76 -730 -180 -1 -292 551 159 90 442 -363 -50 -78 -517 193
1465 193 -108 -56 450 -159 177 164 -338 206 -181 -217 220 -292 111 207 -188 370 -2 -74 239 -370 -43 -33
1487 -33 -344 286 39 94 463 -147 65 -83 -515 -6 -253 -49 466 60 389 214 -322 -45 -486 -399 87
1508 87 -117 424 502 110 334 -270 -476 -239 -540 5 297 232 685 265 -35 -70 -655 -427 -231 -183 509 460
1530 460 422 469 -222 -321 -474 -683 -99 39 354 754 338 278 -99 -653 -458 -562 -236 367 375 698 521 -25
1552 -25 -124 -651 -671 -311 -217 401 631 498 553 -41 -413 -491 -758 -294 90 312 783 560 289 20 -596 -605 -545
1575 -545 -386 259 455 618 667 125 -157 -499 -771 -431 -226 185 655 570 519 182 -379 -488 -698 -512 -8
1596 -8 214 606 671 342 151 -360 -612 -532 -484 15 374 514 666 330 -13 -289 -641 -519 -308 -26 447 519
1618 519 521 350 -110 -339 -532 -551 -215 38 335 564 398 259 -80 -420 -453 -456 -223 139 315 472 415 134
1640 134 -72 -351 -465 -322 -185 122 347 377 357 118 -122 -268 -386 -290 -92 86 300 332 267 128 -110 -219
1662 -219 -296 -270 -84 59 207 278 195 80 -83 -200 -230 -201 -79 60 142 198 150 54 -49 -141 -155 -122 -43 37 104
1687 104 124 108 53 -18 -70 -86 -86 -32 6 26 72 44 42 35 -15 -11 -29 -67 -21 -33 -8 44 24 53 56 -5 6 -53 -94 -59 -69 -14
1719 -14 62 55 110 73 -4 -17 -112 -122 -68 -72 51 112 113 158 54 -26 -67 -171 -103 -54 1 147 147 146 109 -46 -76 -164 -195 -57
1749 -57 -26 122 205 138 135 -16 -147 -147 -232 -129 11 63 238 200 102 70 -145 -202 -184 -214 -1 92 175 288 152 63
1775 63 -39 -255 -206 -202 -114 144 183 258 278 47 -35 -203 -331 -185 -164 68 274 250 311 145 -109 -163 -364 -302 -117
1800 -117 -8 283 335 272 223 -99 -254 -312 -414 -136 38 231 452 301 204 -1 -336 -343 -371 -236 112 232 429
1823 429 439 159 10 -298 -470 -334 -271 62 349 360 467 198 -129 -250 -514 -418 -174 -7 382 446 360 281
1845 281 -149 -340 -422 -496 -147 71 294 537 348 193 -54 -429 -393 -399 -218 193 277 479 433 93 -52 -362
1867 -362 -482 -296 -225 133 378 346 411 108 -170 -262 -482 -322 -94 41 384 363 265 183 -210 -302 -322 -375 -30
1890 -30 99 238 420 193 105 -67 -341 -260 -263 -132 188 171 308 285 7 -17 -243 -310 -130 -140 110 257 176 271
1914 271 62 -106 -100 -300 -162 -38 -26 248 191 138 152 -119 -129 -169 -251 -8 3 80 259 79 104 2 -194 -93
1938 -93 -177 -136 79 20 185 192 16 76 -110 -179 -67 -162 23 129 70 221 75 -22 -1 -211 -117 -65 -91 139 116
1963 116 106 170 -65 -56 -87 -223 -35 -47 17 189 60 107 48 -157 -52 -153 -112 61 1 148 157 -2 80 -97 -143
1988 -143 -43 -134 44 117 61 194 42 -26 -2 -179 -59 -25 -54 148 72 67 112 -103 -54 -76 -158 29 -7 40 162
2013 162 -8 45 -13 -154 -28 -99 -45 99 6 122 95 -58 50 -98 -111 13 -74 75 99 12 129 -17 -57 8
2037 8 -141 -2 29 -22 135 33 29 63 -112 -28 -53 -106 55 -1 33 125 -38 36 -21 -129 -6 -92 -29 83 -13 92
2063 92 74 -54 34 -94 -92 16 -86 61 84 16 136 -1 -39 12 -131 -31 -14 -29 131 64 63 105 -88 -33 -73 -134
2089 -134 21 -29 54 144 30 85 0 -134 -49 -142 -72 54 8 139 106 -17 40 -119 -137 -70 -123 61 117 93 188 40
2115 40 -22 -43 -202 -78 -42 -11 182 121 126 127 -86 -77 -145 -175 -6 -12 113 211 80 96 -30 -167 -113 -179 -81 80 63
2142 63 196 139 17 9 -170 -173 -106 -119 67 131 127 200 25 -53 -86 -233 -104 -59 8 186 138 145 102 -93 -93 -161 -178 6
2170 6 13 142 207 90 92 -46 -179 -123 -182 -57 77 70 194 127 13 6 -170 -152 -101 -115 68 104 113 180 19 -40 -76 -189
2198 -189 -84 -52 -2 162 112 139 101 -73 -55 -137 -145 -6 6 105 169 77 99 -31 -118 -76 -146 -53 38 37 158 103 27 19
2226 19 -130 -119 -69 -98 46 59 78 142 22 -8 -49 -144 -63 -63 -11 106 66 109 89 -39 -19 -92 -108 -4 -32 66 122 56
2254 56 104 7 -65 -27 -116 -40 13 0 94 62 28 44 -70 -49 -53 -82 27 21 37 96 4 14 -4 -84 -28 -48 -37 42 10 68
2284 68 63 -9 25 -47 -44 4 -38 31 52 15 81 11 -8 12 -64 -23 -7 -20 43 24 15 55 -29 -13 -22 -64 10 -22 -1 56 -23 24
2316 24 20 -31 17 -45 -40 12 -24 36 43 4 51 1 -7 12 -35 -5 8 -13 54 18 22 52 -21 8 -21 -46 21 -21 10 48 -7 24 15
2349 15 -36 7 -43 -31 16 -7 35 34 -7 31 -25 -37 -6 -50 12 25 -2 58 -2 11 20 -34 -6 -9 -13 45 18 29 47 -14 20 -11
2381 -11 -36 15 -18 18 41 -6 37 12 -26 12 -45 -36 3 -28 14 15 -11 26 -21 -17 -10 -44 4 2 -14 39 -3 13 35 -28 12 -13 -31
2414 -31 31 12 30 39 -2 25 -3 -13 13 -21 4 24 -10 39 26 -5 25 -22 -10 -3 -35 10 -2 -8 21 -14 2 2 -28 7 -19 -25 19
2447 19 -7 12 25 -12 36 -3 -19 14 -14 2 25 1 41 19 -8 37 -20 -13 6 -17 25 12 13 34 -1 -1 0 -31 5 -17 -16 26 -10
2480 -10 16 22 -25 0 -25 -38 -3 -17 19 32 5 19 -16 -19 8 -33 2 10 -8 38 37 9 14 -27 -10 -1 -8 25 15 24 52 2 5 -8 -33
2515 -33 -5 -5 -1 30 5 25 17 -31 -4 -37 -29 8 -8 29 32 5 17 -16 -27 -9 -36 -1 22 14 57 21 5 13 -21 -23 -7 -5 38 34 33 37
2551 37 -18 -7 -21 -40 5 3 13 41 11 25 0 -44 -31 -39 -23 11 -2 30 20 -9 -13 -39 -38 -19 -27 20 15 16 38 0 -32 -18 -52 -21
2585 -21 10 13 58 37 26 13 -23 -28 -25 -41 10 23 34 46 11 4 -25 -58 -31 -44 -6 36 32 43 27 -25 -43 -66 -58 -20 -21 31 45 28
2619 28 40 -28 -45 -41 -57 -14 8 33 70 51 37 -6 -60 -41 -34 -17 28 48 63 67 10 -15 -46 -62 -42 -30 17 65 58 49 12 -39 -56
2652 -56 -86 -63 -9 4 63 70 44 39 -32 -65 -61 -72 -14 21 58 97 51 12 -10 -55 -53 -43 -17 38 61 75 68 9 -28 -68 -79 -40 -10
2685 -10 23 82 69 58 5 -46 -75 -90 -72 -17 23 63 75 41 -1 -55 -90 -83 -69 -4 36 66 88 34 3 -49 -72 -84 -51 -2 71
2716 71 81 89 75 -10 -36 -79 -82 -42 -2 53 93 86 53 4 -54 -75 -82 -66 1 29 76 69 37 -6 -64 -108 -82 -54 7 56 73 84 41
2749 41 -15 -49 -92 -74 -50 2 62 84 76 57 -3 -49 -73 -74 -33 8 58 91 76 45 -21 -74 -85 -71 -46 12 64 84 63 24 -20
2780 -20 -75 -95 -89 -60 14 57 65 71 28 -17 -68 -97 -67 -29 9 64 77 67 44 -30 -51 -67 -74 -11 28 71 97 70 34 -13 -77 -66
2812 -66 -71 -34 35 53 76 56 14 -25 -72 -96 -69 -32 15 50 68 58 24 -37 -70 -86 -68 -15 19 68 71 59 24 -38 -66 -80 -56
2843 -56 -3 34 68 93 45 8 -29 -55 -66 -51 -24 21 57 63 50 -2 -45 -64 -77 -41 -31 20 52 46 38 -15 -45 -66 -78 -52 -15 10
2875 10 52 60 28 9 -35 -53 -49 -42 8 35 60 64 38 9 -21 -43 -39 -27 -6 37 41 49 37 -11 -25 -54 -58 -39 -13 19 37 52 15 -7
2909 -7 -38 -52 -54 -41 -4 20 47 39 24 -2 -35 -35 -36 -33 7 25 37 54 27 4 -9 -41 -22 -15 11 44 33 33 28 -6 -21 -41 -42 -13 0
2944 0 18 33 23 7 -16 -35 -30 -45 -24 7 19 23 19 -12 -14 -28 -39 -17 -8 30 29 28 23 1 -14 -17 -36 -18 14 16 38 45 14 14 -26 -26 -28 -21
2982 -21 16 19 29 25 -4 -9 -23 -43 -34 -18 -7 9 11 24 -2 -35 -29 -39 -23 -14 2 29 35 14 11 -18 -42 -27 -29 3 22 38 45 32 7 -9
3018 -9 -30 -33 -8 9 38 32 29 20 -5 -33 -46 -38 -21 6 19 41 22 16 -6 -50 -36 -37 -19 14 34 42 30 10 0 -40 -41 -24 -17 26 47 48
3054 48 48 18 -15 -29 -48 -20 -1 32 55 51 45 20 -25 -39 -39 -50 -6 14 32 54 20 0 -22 -56 -50 -48 -19 22 33 48 24 0 -24
3087 -24 -55 -45 -29 -8 30 49 49 45 16 -24 -33 -38 -21 6 18 68 52 31 21 -25 -39 -42 -26 16 21 49 61 10 2 -32 -43 -48 -32 -2
3121 -2 30 34 45 31 -32 -25 -64 -54 -16 -21 25 44 44 41 -5 -20 -32 -43 -18 7 32 63 49 21 17 -24 -39 -45 -20 17 26 38 51 22 -6
3156 -6 -26 -53 -43 -21 -2 22 21 35 11 -16 -29 -50 -42 -20 -9 29 42 23 29 -14 -31 -24 -35 -1 23 30 53 44 17 5 -34 -27 -26 -9 13
3191 13 37 37 48 5 -13 -26 -45 -19 -17 -5 27 28 12 16 -28 -36 -52 -36 -6 0 19 44 18 -3 -25 -34 -34 -42 3 18 30 45 32 6 -2
3226 -2 -18 -26 -11 -3 37 36 34 25 2 -7 -31 -30 -10 0 11 30 21 16 -2 -31 -31 -31 -18 9 6 28 18 1 -15 -26 -33 -20 -28 -5 32 15 29 18
3264 18 -2 -23 -31 -21 9 0 36 35 36 13 9 -12 -7 -16 -3 7 24 32 21 20 -17 -26 -24 -29 -21 1 18 20 7 3 -5 -26 -36 -18 -16 15 19 17 21 1
3304 1 -20 -26 -31 -15 4 9 29 31 18 22 -8 -14 -11 -4 6 19 29 30 15 10 5 -23 -24 -14 -22 1 0 6 10 -17 -13 -30 -27 -20 -2 4 7 -1 1 -13 -17 -26 -19 -5
3348 -5 -2 7 32 23 16 15 3 9 -6 3 12 14 22 15 4 6 -18 -17 -11 -6 -3 5 2 3 -4 -14 -6 -32 -25 -14 -20 7 1 -14 -3 -23 -9 -13 -27 -5 -9 1 -1 -9 -3
3393 -3 2 0 8 -2 7 15 11 1 0 3 12 -6 2 16 0 1 3 -5 7 5 -10 -7 -15 -11 -6 -9 -13 -5 -13 -11 -12 -14 6 -9 5 -2 -10 -20 -16 -4 -3 -8 11 4 2 8 12 5
3441 5 -2 2 13 13 6 19 7 8 6 -2 -6 -6 -8 -7 -8 -3 -1 -10 -11 -11 -18 -17 -25 -10 2 -1 10 2 -11 -19 -17 -18 -4 -5 6 5 5 11 -2 -5 -7 -5 12 -2 13 22 15 0
3489 0 12 -1 3 -1 -7 1 14 9 5 6 -6 -10 -25 -19 -15 -18 -5 -3 7 -4 -11 -10 -18 -11 -11 -8 -3 14 8 7 11 -5 -17 -13 -10 5 7 18 16 16 3 5 -2 -8 -12 7
3535 7 1 10 9 6 12 -4 -23 -21 -18 -15 -1 9 -6 0 -12 -6 -31 -24 -27 -8 -4 13 9 15 -5 -13 -3 -14 -5 -4 18 18 22 14 11 -2 -3 -3 -3 -1 20 14 17 17 6
3580 6 -4 -16 -15 -10 12 9 4 -2 0 -6 -15 -20 -19 -20 6 12 9 8 9 -4 -9 -8 -1 -1 10 10 9 5 8 3 4 2 1 5 16 8 16 17 14 5 -1 3 -3 -3 -3 8 3 -1 6 -7 -16 -14
3632 -14 -15 -13 -19 -5 -4 4 12 6 -10 -7 -9 -17 4 4 15 4 8 12 0 -3 8 4 -3 19 16 13 15 0 2 -9 1 6 7 12 13 2 3 -7 -9 -7 -19 -10 -9 2 -8
3677 -8 -9 -8 -5 -14 -4 -6 0 -3 -8 2 10 8 10 -4 -8 13 -4 12 3 16 19 5 14 9 2 -5 12 6 2 9 3 0 6 -7 0 -1 -5 -6 -5 -3 -11 -2 -5 -12 -10 -12 -9 -3 1 1 8
3728 8 6 -1 -2 -2 6 4 1 3 10 21 9 -11 3 6 11 8 7 20 6 7 11 2 -10 0 -5 0 -2 -3 13 -8 3 -9 -12 -8 -16 -8 0 -6 -5 1 -1 -6 -7 -8 4 6 1 12
3776 12 -1 11 0 0 3 -4 8 21 12 19 7 8 8 -2 7 -7 1 13 -1 -6 7 -7 6 -9 -13 2 -3 -7 -1 1 2 -11 -20 -12 -6 -5 4 -5 -3 11 -3 6
3818 6 -3 2 8 7 17 12 13 24 13 10 16 8 11 8 7 2 3 9 3 -6 5 -7 -8 -11 -11 -8 -4 -14 -7 -17 -20 -5 -12 -21 4 -12 -14 -2 -10 -8 -9 1 7 8 4 1 14 15
3866 15 14 9 10 10 11 11 8 16 11 -1 1 6 8 2 -3 -1 -6 -9 -11 -12 -11 -8 -5 -1 -8 -21 0 -11 -12 -13 -11 6 -10 3 13 -3 0 -2 3 7 14 8 6 11 11 21 1 8 -4
3915 -4 2 14 5 10 14 -3 10 5 -12 0 -5 -8 -2 -12 9 -1 -7 2 -7 -8 -9 -14 -5 -4 -5 -1 6 -5 -12 -1 6 9 -2 7 14 21 6 6 14 10 10 12 12 12 18 8 3 0
3963 0 -6 -3 -7 3 -1 5 0 -12 -3 -7 -12 -18 -16 -21 0 -7 -6 -3 -18 -6 -5 -3 -8 5 11 18 5 14 4 3 9 6 10 13 13 21 10 17 26 3 -2 2 -8 12 -2 -4 -7 -5
4011 -5 -14 -3 -7 -6 -24 -7 -2 -6 -5 -4 -9 -6 -21 -8 -1 -6 2 0 2 7 13 7 16 -4 11 16 1 28 17 11 13 2 -2 2 -2 17 9 2 -5 -5 -4 -7 -15 0 -18 -6
4057 -6 -11 3 -8 -14 -2 -6 -4 -7 -8 -20 -3 2 -13 21 0 3 -5 -7 -2 2 8 15 19 8 17 -4 6 4 5 8 8 13 27 16 4 4 -12 1 2 -1 6 11 5 1 -4
4102 -4 0 -5 -12 -5 -3 4 16 11 8 -2 -12 -4 -8 -3 15 9 12 25 17 16 4 14 8 9 14 12 31 24 -2 9 -1 -13 -6 -3 -3 9 9 -3 -3 -19 -17 -16 -5 2 -8
4147 -8 4 10 -8 -3 -8 -13 0 -8 2 1 8 15 9 12 5 -6 6 7 14 19 23 7 16 12 10 4 -1 11 -6 10 7 1 1 -14 -3 4 -3 1 4 3 -10 -15 -14 -3 -6 -12 2
4194 2 -15 8 -2 -4 4 -9 3 28 4 2 2 5 1 10 11 17 6 11 9 11 12 3 0 5 8 15 14 1 7 1 -9 -4 -18 -3 0 -10 18 -11 -14 3 -14 -4 -22
4237 -22 -6 13 7 0 9 -11 0 -9 1 10 2 18 18 5 8 1 -15 12 4 21 26 19 21 14 -8 1 -20 -6 2 -10 6 8 -10 0 -17 -19 -16 -13 -3 4 -10
4278 -10 10 -4 -15 -1 -23 -1 -10 1 19 5 11 9 -2 8 -3 -1 23 19 11 9 1 5 -4 -13 4 1 9 15 0 16 -10 -14 -16 -26 -17 1 -10 6 -6
4317 -6 -12 -12 -31 -22 -11 -10 7 5 -7 10 -11 -8 -15 -13 -2 7 20 20 18 11 1 -16 2 -5 0 17 7 12 10 -6 5 -18 -27 12 3 9 5 -15 -12 -14 -42 -19
4359 -19 -22 -14 -3 -1 0 -5 -15 -10 -22 -11 -4 -13 10 0 5 8 -5 2 0 -4 18 19 15 18 0 -1 8 -9 2 1 -3 23 5 14 9 -8 -3 -17 -26 10 -7 3
4401 3 0 -8 7 -16 -17 -4 -18 -2 0 8 6 11 -1 9 -8 1 8 3 3 13 7 14 4 8 15 8 32 -3 -5 1 -3 5 11 -5 17 6 -8 1 -12 -12 2 -18
4443 -18 1 -8 -15 4 -29 -15 -6 -18 11 2 2 10 -7 3 -3 -9 -1 -7 0 24 17 14 23 6 2 -4 -3 19 -3 23 25 5 14 5 -6 9 -5 0 2 -2 22 -8
4485 -8 -12 -12 -30 -18 -18 -9 17 6 5 19 -14 -1 -11 -17 10 5 4 25 10 8 15 -12 16 -8 11 23 13 34 28 -2 12 -9 -20 5 -15 4
4521 4 21 -9 7 -6 -7 -8 -25 -23 -10 -21 -2 -10 -3 5 -18 -2 -7 -18 0 -2 -3 18 6 16 1 -13 12 -11 -3 27 2 19 20 11 14 1 2 3
4559 3 -13 13 10 -4 16 -12 5 -2 -35 -10 -4 -24 -5 -7 -10 17 -12 -2 -7 -34 1 -1 2 20 2 8 0 -14 7 -11 -4 24 4 29 21 6 15
4596 15 0 -3 7 -11 16 18 5 17 2 -8 -4 -25 -9 0 -7 19 -6 5 -6 -34 -7 -12 -28 0 -7 -1 27 5 12 -6 -20 4 -15 6 27
4631 27 8 16 9 -6 3 -3 6 27 6 19 15 0 17 -5 6 8 -17 7 5 -12 15 -2 -16 2 -18 0 -5 -25 6 -7 -10 2 -8 3 9 -3
4667 -3 16 0 -1 8 -8 7 6 -5 22 16 9 19 10 18 11 -2 29 15 1 25 -1 3 2 -3 9 -3 3 12 -2 18 -4 -19 -6 -23 -15 10 -13 6
4705 6 12 -14 2 -17 -12 3 -10 22 18 -3 25 -8 0 3 -19 16 13 14 35 13 15 17 -11 7 -4 -8 17 2 16 18 -12 -4 -13 -30 1 -20 -1
4742 -1 17 -7 6 -9 -28 -22 -24 -7 4 2 11 18 0 11 -11 -7 11 -2 23 13 3 29 -11 -5 18 -19 13 15 10 29 4 0 6 -28 -4 -7 -4
4779 -4 15 4 -5 5 -26 -14 -14 -26 1 -9 7 8 -28 0 -1 -15 0 -16 10 22 -5 21 8 -2 12 -12 -1 7 10 32 25 2 25 0
4813 0 0 10 -10 16 5 10 21 0 -14 -5 -30 2 5 -8 18 -1 -1 -5 -30 -9 0 -10 15 3 1 10 -6 -5 -11 -16 2 1 14 38 18 18 7 -5
4851 -5 9 0 2 23 13 18 9 -8 -2 -15 -23 5 -14 9 7 -4 6 -6 -10 -7 -21 3 2 -12 5 -6 -17 -9 -17 3 -2 -4 31 -5 1 20 -12 15
4889 15 6 -15 23 2 24 29 0 9 9 -4 15 1 -5 16 -19 13 -8 -15 6 -18 -6 11 -3 7 -15 -17 4 -29 -23 3 -18 7 7 -9 12
4924 12 -12 -3 8 -9 23 21 2 31 3 5 12 -4 14 11 10 35 16 5 11 -16 1 -3 -10 -4 3 -5 11 -25 0 -20 -25 -14 -15 0 6 -9 3 1
4962 1 -27 -7 -20 -8 5 -5 17 5 -11 12 -9 -5 15 -12 16 24 8 32 -8 -6 12 -13 4 0 14 35 -7 -3 5 -20 -8 -17 -22 13 -8
4997 -8 -11 7 -15 0 -13 -27 -1 -16 10 23 -6 9 -7 -3 1 -14 8 20 4 29 20 1 12 -10 -3 12 -3 21 21 5 28 10 4 14
5031 14 -17 2 1 0 17 -15 -16 -3 -29 -3 -17 -16 3 -5 -1 5 -17 -13 -13 -13 17 1 4 12 -9 20 12 3 25 -7 13 29 3 18 10 -10 21 0
5069 0 14 17 8 24 12 -12 2 -13 -14 -7 -6 6 -1 -7 10 -17 -2 -4 -18 2 3 -4 16 -4 -3 2 -9 -1 7 -2 24 18 22 35 2 7 0 -6 31 10 25
5110 25 35 6 16 4 -8 3 -16 2 16 0 21 -1 -18 3 -22 -23 3 -11 16 6 -11 18 -20 -22 4 -9 19 7 5 22 3 4
5142 4 8 -13 10 13 13 28 12 24 18 -18 5 -1 -8 16 9 26 19 -1 17 -15 -31 -4 -19 -8 16 -13 3 -9 -21 -18 -32 -16 9 -5 12
5177 12 14 0 10 -26 -15 -7 -17 15 28 5 29 4 3 10 -17 7 5 12 29 2 12 4 -4 -12 -2 -7 8 4 11 14 -11 -7 -18 -27 4 -5 3 9 -7
5216 -7 10 -7 -18 -8 -17 -6 5 7 25 16 2 11 -6 10 17 -3 23 19 15 33 16 4 0 -8 12 15 13 25 6 3 -2 -35 -9 -9 -13 16 4 -3 11
5255 11 -16 -2 -14 -14 3 0 1 24 -9 9 -1 -10 1 -11 6 12 19 25 28 2 10 -13 1 8 5 23 15 3 27 3 -1 -5 -11 2 -5 7 23 0
5293 0 -5 -10 -13 -1 -9 -9 6 -3 9 12 -15 4 -1 -11 11 -5 10 15 4 18 7 0 3 6 12 29 12 21 4 -1 9 1 9 13 2 5 6 -11 12 -5 -15
5334 -15 -6 -12 -5 1 -9 12 -17 -14 -7 -13 -6 -4 3 13 1 -5 2 -19 8 -7 -4 23 16 12 16 4 5 1 -1 19 13 21 19 0 16 2 -3 9 -4 7 14 -3
5376 -3 15 1 -17 -6 -11 -31 -2 -15 3 -7 -12 3 -16 -8 -10 -7 6 -2 -5 24 9 9 1 -4 18 13 20 32 17 24 17 9 10 4 7 20 11 14 23 0 11
5417 11 -3 -19 -1 -15 -2 -5 -4 10 0 -12 4 -12 -18 -6 -1 9 12 -6 14 -11 -4 3 -2 21 7 4 27 9 10 18 5 17 24 10 13 15 13 15
5455 15 -5 9 -12 -14 17 -9 -10 16 -5 7 -10 -24 -11 -17 -6 -2 3 9 -4 -14 3 -7 4 9 6 26 10 2 27 2 17 9 1 12 26 18
5491 18 26 23 5 5 -7 13 3 13 22 3 4 9 -8 -14 -11 -14 0 2 9 8 -9 2 1 -11 -5 -4 -4 16 7 13 11 -1 10 14 -2 13 7 27 22 9 14 3
5533 3 17 24 21 17 30 17 22 9 3 -1 -1 4 2 10 11 1 7 6 -17 -5 -8 -13 0 -15 9 13 0 5 -9 -6 4 -1 6 23 12 17 7 -2 2 1 -7 11 14 27
5577 27 19 9 19 1 0 9 -1 12 16 3 0 -12 -9 -3 -16 -6 -3 -11 -8 -6 -9 -1 -25 -8 -13 -14 2 -8 -3 14 3 -4 2 -7 3 6 11 20 13 14 7 0 13
5620 13 10 8 23 17 11 1 -3 -1 -13 -4 0 -2 -5 -1 1 3 -9 -4 -3 -14 -10 7 -21 2 -10 -10 -12 -6 2 1 3 9 4 -3 21 -9 12 9 12 8 10 14 13 17 7 3 1
5667 1 2 6 3 11 -3 1 -13 -7 -2 -9 -1 -1 0 4 -4 -12 -5 -18 -11 0 -14 -1 10 -1 9 -5 -3 1 3 10 13 10 13 10 12 6 5 10 5 13 18 20 1 19 -13 -4 -6 -13
5715 -13 0 -4 4 6 -3 -4 -3 -12 -18 -6 -14 -1 -14 -12 -4 -11 0 -9 -12 3 14 12 9 5 19 9 6 12 -9 20 13 17 26 13 7 8 15 12 1 5 21 -1 -6 5
5759 5 -8 -3 -10 -12 -7 -4 -6 -1 -7 -10 -23 -16 -5 -1 4 8 -3 5 9 2 15 6 12 31 21 16 22 11 10 2 9 8 6 27 6 7 8 2 1 6 -6 12 2 -8 6 -12
5805 -12 -9 -10 -20 -6 -3 -15 4 2 0 -9 -7 -20 -5 -9 -4 1 -2 14 9 6 5 -1 9 8 6 21 6 12 12 6 8 12 6 1 0 18 2 4 -7 -11 -14 -10 -11 -2 -4 -10 -12
5852 -12 -10 -10 -8 -21 -16 5 -8 3 -2 -10 3 -1 2 -5 2 18 13 14 24 11 12 6 -3 1 8 7 18 14 17 11 -1 -1 3 -2 0 -11 -3 -4 -5 -8 -15 -25 -9 -14 -3 7
5898 7 -6 -8 -7 -16 0 -10 2 9 -2 17 7 9 2 0 6 1 12 13 8 13 28 18 16 2 -3 6 11 2 15 -4 1 -9 -6 -14 -7 -19 -11 -7 -2 -10 -8 -7 -14 -23 -1
5943 -1 -6 14 7 7 18 1 -14 5 -1 6 20 15 22 6 15 4 -1 4 8 5 17 4 6 -4 -2 -5 -13 -2 -7 -5 7 7 -17 -8 -5 -20 -5 -13 -6 -9 -7 -7 -6 -10 -11
5988 -11 -8 -2 5 10 12 11 -3 12 3 1 10 7 12 19 23 9 8 -5 15 8 14 10 -2 11 -11 -6 1 -8 -7 -3 -2 0 1 -2 -3 -11 -9 -7 -15 -1 -6 2 2 -2 -1 -1 -3 9 2 7
6038 7 8 8 20 15 12 3 -7 -2 -1 2 18 8 2 5 9 -6 -1 -8 4 11 2 -1 -3 -9 -12 -25 -18 -6 -11 4 2 -4 -13 -18 -14 -7 -9 9 1 -1 1 0 1 -2 -7 10 10 16 15 21
6088 21 8 17 0 3 6 0 1 15 17 9 -9 -8 -9 -15 -5 -28 -4 4 -13 -7 -13 -17 -17 -13 -16 2 -9 8 3 -18 8 -17 -7 -1 -8 9 11 8 7 1 0 10 -11
6131 -11 14 12 8 17 9 0 -2 -2 -3 -2 -1 2 -7 1 -9 -11 -8 -27 -18 -12 -14 -11 -4 -4 -4 -9 -10 -10 -12 -2 3 5 8 12 7 6 -7 3 9 7 13 10 12 11 -2 7 5 -12 16 -2
6181 -2 2 3 -4 5 1 -11 -23 -17 -14 -5 -12 -3 -9 -12 -14 -5 -13 -11 7 -4 5 -7 0 -2 -7 -1 0 6 0 -2 3 10 5 9 5 12 9 4 9 -3 3 -4 1 3 0 -11 -15 -14 -13 8 -11 -9
6233 -9 -13 -22 -9 -21 -10 -15 -13 -6 -16 -19 -5 -10 3 -2 -2 4 -1 3 0 4 18 9 -1 11 7 5 -1 -3 -12 6 -1 -10 -7 -10 3 -11 -16 -5 -16 -3 -11 -11 -15 -19 -21 3
6279 3 -9 -7 -11 -28 -19 -3 -7 -9 -9 1 -4 5 2 -8 4 -4 7 8 26 16 10 11 10 3 4 -3 14 6 0 -2 2 0 -11 2 -1 -13 -10 -7 -2 -7 -21 -11 -6 -13 -6 -13
6325 -13 -13 -8 -5 6 -9 -5 -5 1 2 -4 16 11 0 12 6 0 2 15 4 16 12 10 4 -4 10 4 0 -6 -10 -16 -3 -4 -2 -9 -16 -17 -16 -11 -13 2 -14 -1 -16 -13 4
6370 4 -6 4 -9 -6 0 2 7 10 6 10 2 9 19 19 19 9 8 7 10 5 13 5 7 -2 -5 -11 -6 -8 2 -12 -3 1 -5 -13 -7 -16 -16 -17 -8 -21 -13 -7 -12 6 -6 1 -4 -8 -2 -1 -7
6421 -7 -2 10 11 14 8 4 1 5 7 7 8 18 3 3 1 -4 7 -3 -9 -10 -9 -5 0 -6 -15 -7 -10 -8 -1 -18 -16 -15 -10 -7 -10 -9 9 -5 -5 5 17 8 6 10 11 21 14 11 3 19
6471 19 4 8 19 8 5 -4 -1 11 7 8 -2 4 1 -4 2 -7 2 -4 -7 -1 -12 1 -13 -10 -9 -10 -9 -4 3 6 8 1 -5 8 16 3 12 9 5 18 15 21 20 14 10 13 17 9 11
6520 11 2 6 3 2 0 -3 1 1 -12 6 -5 -3 -11 -14 -7 -2 -15 -9 -11 -12 -10 -8 -1 2 0 -1 4 8 4 5 7 3 15 11 2 18 8 15 18 24 6 6 9 2 7 1 -5 -4 -16 -16 -9
6571 -9 -13 -9 -10 -2 -12 -13 -8 -12 -12 5 -8 -13 -3 5 7 9 7 19 14 17 10 12 9 11 20 24 15 12 24 15 6 19 15 -7 17 13 11 6 -12 3 -1 -1 -9 9 3 0 -13 -3
6619 -3 3 -7 9 -12 8 -11 1 3 -9 -11 -1 8 6 1 14 17 9 8 16 12 11 24 12 16 15 21 18 11 13 18 12 4 3 3 1 -3 -1 -8 -3 -5 -7 6 -12 -6 -8 -4 3 -11
6667 -11 11 -1 1 3 7 1 6 10 10 15 23 7 19 8 12 5 7 16 20 12 5 11 14 13 13 8 1 9 4 -1 -14 -2 -6 -5 1 -4 0 -4 -4 7 -5 -17 0 0 -6 0 4 3 2
6716 2 5 10 -1 26 14 14 9 12 13 18 20 16 4 10 15 11 14 8 11 2 -1 5 -7 -11 9 -9 3 -5 -20 0 -13 -10 -3 -2 -25 -3 3 -8 -5 -4 -9 0 9 4 10 7 14
6763 14 15 11 11 27 14 14 18 26 20 13 17 9 10 17 5 3 6 -6 -14 -2 -4 -9 -10 -17 -16 -12 -10 -7 -13 -10 7 -5 -6 3 8 -5 0 -13 -6 2 13 6 17 18 18 11 8 16 22
6812 22 9 3 14 2 15 1 0 1 4 1 1 12 0 -3 -12 -11 -1 -4 -6 -7 -10 5 -8 -9 -7 -1 -4 -10 -8 -2 -3 1 8 -2 8 3 14 10 15 -3 4 4 13 9 10 8
6858 8 18 -2 5 3 11 6 4 1 -4 5 -1 -1 0 -1 -12 0 -3 -5 -5 -13 -21 2 -3 -3 -4 -5 -1 -1 -3 -3 -2 6 15 13 8 10 11 11 7 1 5 0 9 0 -1 3 5 -2 4 -2 4 1 -10 -7 -10
6913 -10 -7 -8 -11 -22 -11 -1 -6 -4 -9 1 -4 -5 -4 -1 1 11 9 -2 0 2 12 10 7 13 9 15 9 10 13 12 6 13 12 5 9 6 -5 4 3 9 8 -8 -14 -13 -10 -3 -6 6 -8
6962 -8 4 -1 -6 -3 -1 1 5 6 -5 -5 -4 13 13 7 6 13 14 25 31 18 12 15 15 5 16 12 12 5 6 5 4 -2 16 1 -4 -4 -17 -11 -5 1 -3 -6 0 -15 2 -7 -5 6
7010 6 -5 -3 3 -3 6 -1 6 19 8 6 20 22 24 17 12 12 14 7 8 12 9 8 13 -2 6 3 5 3 -6 -2 4 -3 -7 0 -3 -5 -4 -4 -6 -11 8 -8 -3 7 -2 -9 3 5 8 2 6 9
7062 9 8 22 12 20 10 11 11 16 9 13 14 9 4 -8 5 -3 12 6 -2 -7 -5 -16 -13 -2 6 -12 -11 -5 -1 -11 -3 -6 5 -1 -5 5 3 -2 -5 3 7 2 12 17 8 14 16 6
7110 6 4 7 14 10 3 7 2 19 2 5 7 2 -11 -10 0 -7 -11 -13 -8 -12 -6 -13 -4 -11 -8 -12 -10 -1 -6 -4 2 -3 3 0 11 7 10 -2 0 6 21 13 7 12 15 6 7 11 -5 6 1 0
7162 0 9 -7 -1 -8 -3 -4 -10 -2 -19 -7 -17 -13 -12 -19 -22 -6 -3 -10 -3 -3 2 0 -10 10 7 7 -1 17 12 16 8 14 6 8 22 11 19 17 11 12 5 14 5 -1 5 -4 -5 0 -11 -2
7212 -2 -8 -10 -3 -4 -12 -7 -9 -8 -9 -7 -5 2 1 -3 2 10 5 6 7 17 7 9 19 15 17 11 13 11 7 8 18 12 16 13 11 1 -10 -5 -7 -12 -7 -5 -6 -11 -5 -3 -6 -5 -14 -14 -14 -5 -9 -2 8
7267 8 -8 4 -1 1 17 5 7 14 13 15 1 16 8 14 13 18 21 8 12 8 -1 6 5 -5 3 -2 0 -2 3 -9 -9 -8 -8 -20 -8 -18 -13 -11 -12 -16 -9 -3 -7 5 -12 8
7313 8 2 4 -1 9 14 11 7 10 14 13 18 6 5 7 3 6 6 15 9 -7 0 -3 -6 -14 -11 -13 -13 -15 -5 -8 -5 -18 -6 2 -10 0 7 -3 -2 5 5 2 -1 5 4 3 18 10 15 25
7363 25 20 8 17 12 16 17 21 9 0 -4 5 5 9 1 -9 -3 -11 0 -4 2 -11 -12 -6 -4 -3 -6 -3 -2 -16 -11 -4 3 -5 0 6 7 15 10 15 11 10 2 3 12 12 4 21 19 7 13 14 7
7415 7 1 0 1 -3 -1 -8 3 -7 0 -15 -10 -3 -1 -2 -8 -5 -6 -10 -5 -13 -5 -3 -8 10 0 8 15 14 1 -4 6 13 17 8 15 11 13 13 2 7 16 10 13 0 8 6 9 -4 -3 -7 -13
7466 -13 -2 -5 5 -4 -17 -9 -7 -13 -13 -2 -12 -11 -7 -13 0 2 -6 3 7 6 12 15 7 18 26 8 9 17 12 0 19 10 6 13 2 0 1 -2 2 -5 -6 -9 -2 -7 -2 -8 0 -7 -13
7515 -13 -11 -16 -7 -4 -10 -6 -4 -6 -18 0 7 -4 12 3 12 9 11 21 12 23 8 18 13 16 1 12 -2 6 4 -7 9 2 3 -4 -1 -9 -5 -8 -10 -14 -5 -3 -2 -8 -6 -10 -15
7562 -15 -10 -12 -8 -3 -6 -5 3 5 -3 18 14 7 4 16 8 1 19 10 2 4 9 9 23 13 14 7 13 2 -12 -4 -12 -3 -3 -3 -9 -8 -12 -14 -13 -15 -12 -9 -1 -6 -4 -8 -15 -4 -10 -4 16
7613 16 8 8 9 18 22 16 10 19 1 20 13 7 15 13 4 1 6 10 5 -5 -2 5 -5 -6 -12 -11 -11 -14 -14 -10 -18 -14 -10 -12 -4 -7 -15 -10 -3 -5 -6 2 3 -1 6 12 14 23 19 16 12 17 9 -2 10
7668 10 16 0 0 -4 6 -4 -4 1 3 0 -10 -4 -1 -11 -13 -5 -4 -7 -12 -4 -13 -10 -4 -8 -2 -4 0 -8 -5 15 3 17 7 17 9 22 21 6 11 0 7 9 16 11 12 9 12
7715 12 2 3 -4 2 -1 -3 -14 -4 -15 -16 -12 -12 -14 -15 -9 -8 -6 -7 -10 -8 -6 1 3 2 -2 -6 6 12 12 8 11 14 10 12 15 9 10 5 13 4 9 7 21 -6 9 -1 -2 0 2 -8
7765 -8 -12 -14 -23 -23 -2 -10 -13 -15 -11 -10 -7 -13 -11 -8 4 -5 5 14 2 12 0 7 1 8 20 5 15 1 9 9 15 16 3 5 -2 5 9 2 -15 -5 -5 -17 -13 -13 -16 -9 -23
7812 -23 -16 -13 -10 -13 -3 -19 -17 1 -7 -18 -2 -8 11 -5 9 13 21 22 3 18 15 10 8 9 10 -5 1 6 10 5 7 -1 6 -10 -2 -2 -9 -9 -16 -6 -15 -13 -19 -20 -13 -11 -18
7859 -18 -13 -3 -10 -11 -10 -3 -11 0 7 10 9 5 15 1 7 32 6 10 23 8 6 13 5 15 9 5 -2 12 16 1 0 -5 1 -6 -7 -15 -5 -8 -18 -10 0 -6 -8 -11 2
7904 2 -1 -6 -9 4 -1 2 11 10 15 8 4 13 9 18 13 13 16 16 4 9 13 7 19 0 8 10 1 -9 -2 -11 3 -19 -4 -8 -15 -13 -17 -17 -3 -12 -19 -2 -7 -10 -4 4 -1 -1 4 -5 3
7955 3 3 12 10 8 13 17 20 13 14 8 14 17 18 8 4 2 -7 3 0 3 -5 -4 -8 -11 5 -14 -16 -17 -9 -16 -12 -7 0 -10 -8 -12 -1 -4 6 14 12 -3 4 17 5 2 14 16 12 12
8005 12 16 18 10 13 18 3 6 12 6 8 6 1 -10 -1 -5 -1 -8 -2 -10 -11 -6 -11 -13 -10 -10 -2 -10 -7 -8 -9 8 8 4 8 7 7 5 10 14 11 23 16 15 9 11 7 20 16 6 14 -2 -1 7
8058 7 2 -3 12 3 -16 -3 5 -8 -9 1 6 -5 -7 4 -2 -5 3 -6 -8 6 6 -3 7 11 14 13 16 8 18 23 5 3 26 19 12 12 7 1 -1 8 1 9 -4 7 -2 -7 -9
8105 -9 -13 -15 -14 -13 -5 -6 -17 -17 -19 -6 -15 -8 0 5 -3 12 2 5 13 4 2 7 2 11 11 5 5 16 13 10 12 15 16 3 2 6 -3 4 -2 7 -13 -2 -1 3 -17 -12 -8 -1 -12 -21 -10
8156 -10 -14 -10 -13 -1 -11 -16 8 2 5 9 5 3 7 9 8 14 18 19 18 17 11 22 26 19 5 15 4 8 4 4 -1 2 4 0 11
8191A1
$$ Imaginary data points
##PAGE= N=2
##DATA TABLE= (X++(I..I)), XYDATA
0 0 0 0 0 0 0 0 0 0 0 0 0 0 0 0 0 0 0 0 -8 8 -8 8 -8 8 -10 14 -16 16 -20 22 -24 29 -31 36 -37 44 -46 53 -60 63 -71
41 -71 79 -87 94 -105 115 -124 138 -152 167 -183 201 -223 246 -275 306 -345 391 -446 514 -601 715
62 715 -867 1084 -1402 1914 -2817 4686 -9882 49927 169933 61208 210866 63144 -97295
75 -97295 -21201 -225199 -120183 13193 -47010 193256 138586 50964 123445 -128845 -114166
86 -114166 -78366 -183741 53772 57543 65029 211342 9170 11730 -19708 -201131 -43569
97 -43569 -72597 -40828 160020 42812 109045 96591 -102683 -11750 -113522 -131900 47509
108 47509 -36519 89254 138653 -9936 85313 -47837 -118661 -2255 -119584 4453 82283
119 82283 -9779 131848 27329 -43043 37053 -122708 -40525 12830 -67685 99587 35626
130 35626 1929 91403 -72819 -18645 -1652 -102601 50777 -1735 -8928 101489 -38482
141 -38482 18538 22707 -92166 35863 -27890 -33806 80311 -39483 29817 39489 -70903 44923
153 44923 -27608 -39891 65822 -48296 24934 38118 -64245 48626 -24554 -37255 63448
164 63448 -47355 26730 38961 -60543 47019 -29334 -42839 54794 -50025 29766 46202
175 46202 -47115 56502 -25999 -46422 40265 -64769 17931 41677 -37223 71952 -7718
186 -7718 -31970 39574 -74714 -1665 19567 -47420 71325 6701 -7808 58510 -61708 -5180
198 -5180 363 -69201 48150 -2830 226 75877 -34557 15400 6107 -75764 24833 -28445
210 -28445 -17364 68731 -21809 38141 29708 -56848 25873 -41810 -39253 43439 -35162 38738
222 38738 43456 -32364 46588 -30579 -41365 25964 -56700 19866 34123 -25316 62824 -9651
234 -9651 -23950 29809 -63816 2594 13567 -37404 59667 62 -5528 45860 -51975 2014
246 2014 1402 -52579 42818 -7677 -1626 55938 -34446 14999 5565 -55382 28791 -22117 -11560
259 -11560 51186 -26567 27159 17884 -44751 27881 -29262 -22862 37647 -31809 28258 25301 -31384
272 -31384 36965 -24606 -24920 27330 -42004 19570 21826 -25942 45532 -14292 -16981 27278 -46697
285 -46697 10215 11611 -30702 45329 -8253 -6889 34928 -41674 8717 4046 -38807 36816 -11477
298 -11477 -3552 41017 -31909 15585 5422 -40883 28181 -19841 -8957 38361 -26642 23052
310 23052 12903 -33936 27365 -24167 -16069 28908 -30079 22916 17353 -24505 33725 -19672
322 -19672 -16287 21852 -36998 15310 13189 -21641 38878 -11248 -8751 23677 -38526 8556 4302
335 4302 -27236 36018 -8113 -1081 31162 -31938 10038 -149 -34095 27260 -13739 -1120
347 -1120 35102 -23356 18243 4290 -33660 21188 -22216 -8544 30017 -21303 24489 12638
359 12638 -25048 23746 -24393 -15258 19843 -27636 21765 15649 -15851 31986 -17247 -13445 14031
372 14031 -35381 11979 9132 -14819 36731 -7306 -3741 18094 -35524 4605 -1374 -22790 31723
385 31723 -4603 4778 27620 -26309 7408 -5537 -31063 20569 -12341 3425 31941 -16044
397 -16044 17948 1069 -29884 14049 -22682 -6491 25304 -15007 25113 11292 -19428 18607
409 18607 -24497 -14038 13924 -23658 21179 13893 -10128 28567 -16024 -11057 9045 -31910
421 -31910 10647 6318 -10680 32701 -6449 -1084 14286 -30762 4516 -3148 -18681 26790 -5233
434 -5233 5338 22290 -21956 8017 -5037 -24125 17765 -11760 2785 23760 -15260 15178
446 15178 351 -21615 14760 -17190 -3172 18761 -15871 17669 4831 -16118 17629 -16903
458 -16903 -5210 14411 -19153 15678 4745 -13643 20014 -14684 -4017 13360 -20176 14117
470 14117 3610 -13070 20098 -13907 -3644 12315 -20286 13516 3822 -11082 21037 -12399
482 -12399 -3609 9916 -22322 10403 2289 -9468 23408 -7739 244 10567 -23412 5393 -3545
495 -3545 -13247 21632 -4509 6525 16879 -17908 5857 -7807 -20213 13186 -9538 6633
507 6633 21693 -8803 14552 -2909 -20466 6343 -19364 -2423 16418 -6889 22315 7681
519 7681 -10462 10468 -22078 -11128 4351 -16278 18484 11327 8 22411 -12283 -7889 -1056
532 -1056 -26801 5433 1766 -1743 27776 -198 5228 7486 -24709 -1642 -10594 -14203 18571
545 18571 -519 12638 19510 -11390 5815 -10733 -21573 5491 -12290 5687 19854 -2692
557 -2692 17799 592 -15027 3561 -20549 -6055 8828 -7509 19833 8955 -3273 13073
569 13073 -16123 -8482 51 -18138 10821 5084 -33 21082 -5844 -61 2874 -20900 2928
582 2928 -4615 -7235 17964 -2843 7308 11276 -13607 5319 -7266 -13389 9604 -8910 4878
595 4878 12978 -7418 12022 -1490 -10515 7529 -13401 -1367 7233 -9455 12650 2592 -4592
608 -4592 12073 -10326 -1778 3537 -14021 7522 -474 -4394 14422 -5514 3124 6637 -13022
621 -13022 5190 -4932 -9079 10397 -6672 5025 10594 -7655 9408 -3326 -10294 6008 -12124
634 -12124 479 8160 -6222 13602 2328 -4920 8309 -13130 -3842 1783 -11461 10679 3372
647 3372 -22 14437 -7103 -954 298 -16001 3667 -2591 -2576 15460 -1568 5992 6104 -12871
661 -12871 1626 -8082 -9524 9015 -3728 8114 11714 -5155 7232 -5963 -11785 2570 -10916
674 -10916 2462 9722 -2022 13482 1287 -6195 3640 -14133 -3994 2343 -6817 12659 4824
687 4824 608 10431 -9602 -3596 -1832 -13346 5993 738 1051 14568 -2924 2725 1368 -13860
701 -13860 1324 -5773 -4552 11500 -1537 7476 7484 -8233 3333 -7405 -9237 5140 -6051 5740
715 5740 9325 -3057 8764 -3065 -7877 2470 -10637 296 5435 -3416 11144 1709 -2770
728 -2770 5355 -10241 -2487 709 -7677 8371 1901 287 9569 -6107 -289 -59 -10520 4176
742 4176 -1771 -1183 10367 -3077 3688 2939 -9197 2994 -4875 -4644 7494 -3829 5137 5765 -5721
757 -5721 5244 -4460 -6031 4412 -6723 3171 5459 -3843 7826 -1694 -4271 4038 -8260 460
771 460 2869 -4874 7942 181 -1648 5973 -7032 -132 914 -6957 5817 -488 -812 7590 -4662
786 -4662 1499 1280 -7634 3882 -2520 -2085 7182 -3605 3318 3001 -6329 3884 -3679 -3719 5357 -4545
802 -4545 3545 4051 -4524 5413 -3001 -3906 4015 -6175 2223 3349 -3932 6644 -1448 -2570 4241
817 4241 -6698 895 1745 -4828 6324 -671 -1105 5469 -5627 844 800 -5987 4831 -1308 -832
832 -832 6223 -4072 1936 1244 -6130 3589 -2560 -1808 5700 -3440 3025 2425 -5036 3638 -3181 -2885
848 -2885 4343 -4132 3043 3048 -3747 4709 -2625 -2919 3399 -5286 2067 2481 -3378 5626 -1560 -1893 3593
865 3593 -5690 1171 1300 -4028 5458 -1051 -802 4495 -4972 1194 590 -4853 4440 -1488 -592 5026
881 5026 -3924 1904 828 -4948 3574 -2278 -1179 4687 -3409 2532 1522 -4292 3435 -2626 -1794
896 -1794 3893 -3600 2556 1908 -3556 3814 -2398 -1878 3312 -4030 2195 1770 -3209 4199 -2035 -1600
912 -1600 3165 -4298 1900 1427 -3148 4356 -1788 -1251 3165 -4407 1679 1058 -3191 4426 -1546 -816
928 -816 3290 -4366 1417 549 -3474 4191 -1354 -293 3708 -3871 1397 147 -3973 3404 -1648 -171
944 -171 4117 -2953 2013 420 -4080 2552 -2463 -849 3793 -2381 2865 1381 -3246 2520 -3025
959 -3025 -1868 2576 -2987 2896 2122 -1901 3672 -2405 -2002 1488 -4322 1714 1495 -1476 4778 -981
975 -981 -703 1877 -4824 431 -172 -2600 4419 -299 819 3383 -3654 609 -1074 -4045 2726 -1307
991 -1307 832 4324 -1907 2206 -169 -4085 1434 -2968 -712 3431 -1446 3419 1587 -2476 1978
1006 1978 -3333 -2102 1530 -2781 2798 2165 -869 3671 -1928 -1692 702 -4257 1029 868 -1052 4410
1022 4410 -347 43 1775 -4102 108 -803 -2620 3402 -363 1106 3280 -2547 999 -982 -3590
1037 -3590 1817 -1814 455 3465 -1387 2551 297 -2937 1417 -2932 -964 2178 -1786 2920 1417
1052 1417 -1429 2433 -2483 -1468 946 -3060 1820 1131 -810 3446 -1134 -550 1068 -3508 642
1067 642 -94 -1570 3207 -477 553 2132 -2685 677 -702 -2532 2117 -1125 582 2667 -1651
1082 -1651 1658 -171 -2506 1458 -2077 -278 2106 -1547 2286 663 -1598 1879 -2196 -842 1193
1097 1193 -2298 1901 762 -939 2643 -1463 -472 961 -2807 1067 78 -1188 2735 -842 266
1112 266 1514 -2459 820 -473 -1829 2074 -995 449 1983 -1726 1267 -262 -1958 1512 -1518
1127 -1518 -14 1788 -1448 1682 283 -1489 1565 -1678 -429 1241 -1750 1582 438 -1057 1958
1142 1958 -1402 -317 997 -2074 1220 125 -1052 2099 -1116 43 1140 -2018 1075 -161 -1251
1157 -1251 1881 -1132 179 1290 -1773 1181 -152 -1259 1714 -1190 109 1212 -1673 1173 -77
1172 -77 -1178 1653 -1115 105 1188 -1603 1074 -124 -1209 1515 -1074 143 1244 -1408 1115
1187 1115 -102 -1253 1293 -1230 17 1181 -1242 1336 108 -1035 1268 -1381 -247 828 -1408
1202 -1408 1330 286 -630 1604 -1165 -209 531 -1791 941 9 -573 1862 -706 274 741 -1772 595
1219 595 -485 -993 1553 -625 612 1220 -1231 805 -554 -1330 951 -1050 354 1289 -773 1268
1235 1268 -86 -1096 768 -1404 -205 804 -899 1385 359 -523 1138 -1214 -365 352 -1382 956
1251 956 224 -314 1519 -729 31 430 -1515 565 -260 -602 1405 -546 418 767 -1201 648 -459
1268 -459 -854 1042 -781 385 883 -920 890 -292 -813 885 -948 193 707 -891 929 -149
1284 -149 -651 906 -894 126 616 -898 844 -126 -629 852 -853 112 631 -779 903 -25 -560
1301 -560 756 -943 -86 434 -820 931 157 -262 965 -823 -145 127 -1165 604 -3 -110 1285
1318 1285 -369 271 245 -1288 182 -575 -536 1072 -184 768 835 -741 365 -810 -1069 344 -709
1335 -709 595 1094 -46 1105 -196 -860 -10 -1376 -257 445 -178 1445 635 71 608 -1184 -724
1352 -724 -432 -1103 719 512 559 1488 -150 -40 -371 -1627 -311 -535 -112 1411 465 1006 678 -909
1370 -909 -289 -1209 -1172 272 -195 1036 1352 245 820 -570 -1207 -483 -1331 -40 733 374 1588 595
1388 595 -89 68 -1458 -856 -462 -641 1035 797 766 1191 -419 -391 -712 -1467 -138 -160 346 1434 479
1407 479 673 192 -1087 -482 -1008 -709 554 202 1012 1032 -36 272 -744 -1059 -286 -735 302 812 352
1426 352 1056 138 -386 -147 -1089 -417 -22 -186 927 501 320 551 -591 -325 -377 -791 268 58 270
1445 270 846 -30 221 -38 -733 -41 -421 -198 497 -47 444 365 -292 202 -346 -376 164 -349 199 306 -133
1466 -133 423 -36 -186 232 -388 -7 72 -318 304 -17 -55 375 -192 138 118 -352 133 -236 -220 251 -178
1487 -178 259 294 -112 297 -205 -322 5 -447 65 215 13 538 94 -62 63 -562 -231 -146 -248 446 272
1508 272 296 455 -238 -172 -338 -618 -15 -41 243 677 236 296 -3 -569 -310 -514 -281 324 228 599 516 -30
1530 -30 -27 -537 -637 -246 -281 319 584 395 552 -10 -379 -396 -744 -301 69 208 737 512 280 101 -578 -546
1552 -546 -520 -438 260 392 599 695 101 -81 -469 -783 -393 -275 181 673 538 566 187 -400 -455 -731 -520 13
1574 13 205 657 693 319 151 -423 -676 -542 -494 33 450 548 725 327 -94 -341 -734 -572 -269 16 553
1595 553 609 537 371 -197 -426 -587 -610 -154 121 465 692 436 235 -160 -558 -528 -524 -182 264 411 620 463
1617 463 71 -157 -525 -575 -370 -175 251 487 486 433 48 -262 -411 -554 -328 -41 210 488 459 285 85 -281
1639 -281 -411 -420 -315 17 232 381 439 228 29 -200 -402 -337 -240 -28 232 299 336 217 -11 -168 -322 -320 -167
1662 -167 -19 163 271 253 183 -5 -156 -230 -256 -141 -1 126 219 194 131 4 -112 -156 -172 -99 -3 92 142 146 93
1687 93 9 -49 -105 -106 -60 -19 41 82 70 65 13 -23 -26 -60 -45 -21 -43 12 27 21 70 33 1 13 -58 -56 -48 -86 0 22 43 110 60
1720 60 36 9 -83 -81 -92 -92 34 52 98 147 52 38 -63 -149 -108 -127 -23 97 95 166 118 9 -34 -172 -177 -103 -83 95 153
1749 153 145 187 14 -70 -153 -254 -133 -75 29 212 170 181 107 -109 -132 -211 -224 -43 -13 169 260 163 170 -17 -186 -187
1775 -187 -271 -142 40 106 289 256 124 66 -199 -278 -239 -251 13 146 222 348 161 29 -122 -354 -278 -230 -91
1798 -91 216 251 338 291 -13 -114 -321 -404 -204 -117 174 379 317 338 76 -205 -283 -449 -283 -31 110 425 412
1821 412 280 162 -233 -365 -392 -402 -21 175 344 519 277 79 -155 -472 -407 -348 -126 283 338 466 375 -7
1843 -7 -163 -422 -513 -250 -118 235 485 385 381 50 -283 -349 -510 -288 18 166 501 433 244 113 -314 -398 -388
1866 -388 -357 53 227 364 489 196 24 -201 -480 -331 -272 -44 312 304 391 260 -96 -170 -374 -403 -131 -69 237
1889 237 384 262 265 -27 -262 -239 -368 -170 61 115 360 274 135 74 -238 -250 -217 -243 65 147 198 322 67 29
1913 29 -98 -317 -159 -166 -60 196 127 228 186 -74 -36 -205 -233 -69 -100 111 207 102 203 9 -114 -80 -245
1936 -245 -91 -4 -26 216 152 98 127 -121 -101 -120 -205 29 9 83 231 60 81 13 -191 -77 -141 -105 110 30 164
1961 164 167 -19 41 -140 -194 -47 -137 46 133 57 191 32 -68 -34 -211 -80 -19 -37 180 115 81 132 -108 -72 -85
1986 -85 -169 40 12 66 189 5 66 -16 -171 -51 -120 -61 118 25 141 94 -60 19 -134 -126 13 -83 81 115 25
2011 25 133 -37 -85 -14 -159 -21 33 -18 164 44 23 61 -118 -50 -47 -100 94 30 54 141 -37 19 -27 -137 10
2036 10 -53 -4 122 1 83 45 -83 9 -110 -97 30 -64 72 79 -7 98 -44 -67 5 -121 3 23 -15 138 32
2061 32 12 50 -119 -43 -41 -93 83 16 43 133 -15 37 -27 -134 -10 -70 -20 109 17 113 72 -64 19 -122 -113 -4 -82
2088 -82 78 91 29 130 -23 -68 -48 -174 -54 -21 -9 156 80 70 68 -124 -71 -117 -134 39 16 110 188 36 60 -52
2114 -52 -161 -81 -139 -32 123 74 172 106 -29 -8 -173 -164 -61 -75 101 139 109 161 -28 -92 -113 -231 -75 -9 26 211
2140 211 116 96 53 -142 -118 -160 -147 51 50 165 215 67 55 -73 -197 -105 -143 -23 138 109 215 113 -35 -37 -194
2165 -194 -169 -75 -49 126 154 123 146 -31 -106 -127 -228 -82 -13 50 201 108 98 37 -143 -116 -149 -144 29 43 137 197 50
2192 50 45 -82 -166 -91 -131 -9 108 87 180 102 -16 -15 -166 -135 -62 -70 93 119 104 141 -27 -61 -93 -179 -66 -24 30 154
2220 154 84 80 38 -102 -82 -131 -111 24 10 101 146 48 63 -38 -110 -55 -100 -17 67 47 139 71 0 21 -117 -89 -46 -77
2248 -77 58 61 60 112 -12 -15 -43 -136 -41 -41 -10 84 37 63 36 -60 -24 -89 -94 6 -27 53 87 12 62 -24 -56 -14 -90 -18 25
2279 25 -1 84 39 11 42 -56 -40 -21 -66 25 18 25 66 1 14 -12 -75 -4 -39 -30 37 -3 48 33 -36 11 -27 -59 1 -49 9 44
2311 44 -6 58 2 -16 28 -51 -5 -10 -25 41 8 16 57 -19 14 3 -46 5 -23 -7 47 1 41 24 -22 7 -40 -44 2 -40 16 23
2343 23 -14 43 -17 -22 6 -60 -13 -10 -26 46 17 11 42 -26 -7 -18 -49 14 -5 22 59 5 38 14 -31 2 -34 -16 27 -24 49 21
2375 21 -6 36 -29 -30 -7 -47 6 18 -10 36 -4 -4 1 -52 -12 -20 -33 30 2 17 34 -19 1 -7 -52 8 -15 -7 33 2 30 19 -20
2408 -20 10 -30 -13 10 -29 25 19 2 38 -19 -13 3 -33 7 4 -19 18 -14 -5 9 -30 -4 -12 -35 10 -12 -7 14 -18 17 -15 -27 4
2441 4 -35 -15 17 -22 20 10 -2 22 -13 -3 3 -17 17 -3 4 39 -6 25 2 -16 3 -13 -19 6 -9 3 22 -5 21 -18 -33 1
2473 1 -35 -8 9 -7 19 16 -12 8 -42 -18 -4 -29 21 19 11 35 -17 5 -1 -32 12 -8 1 40 6 30 22 -22 6 -17 -26 2 -7 10 28
2508 28 -2 7 -21 -30 -16 -32 -3 6 2 36 9 -15 -15 -37 -16 -7 -18 33 24 22 37 -16 -20 -4 -32 4 -3 14 36 10 14 3 -25 -12 -30 -4
2544 -4 21 8 37 34 -14 2 -31 -47 -12 -19 8 27 8 33 -7 -32 -18 -52 -16 -5 6 39 25 11 2 -44 -38 -30 -32 14 25 32 47 6
2578 6 9 -20 -33 -14 -13 10 38 33 50 28 -16 -13 -42 -40 -2 -5 41 45 28 23 -22 -43 -39 -49 -12 17 33 68 40 5 -7 -54 -46 -28 -25 39
2614 39 43 53 43 -13 -19 -36 -65 -25 -15 41 65 57 46 0 -29 -43 -49 -48 -1 24 62 58 23 16 -50 -70 -56 -57 0 41 52 72 27 -13
2648 -13 -41 -93 -59 -52 -14 53 64 56 45 -13 -34 -60 -71 -24 -2 45 78 54 38 1 -42 -56 -63 -49 14 42 85 66 31 -1 -60 -73
2680 -73 -63 -46 14 63 62 80 23 -17 -61 -97 -61 -40 3 61 65 58 31 -22 -42 -74 -77 -26 17 63 98 67 37 -8 -64 -69 -62 -22 38
2713 38 57 89 79 20 -17 -66 -88 -54 -40 21 65 79 81 23 -26 -72 -96 -66 -32 15 78 83 76 38 -39 -61 -87 -77 -14 26 65 91
2745 91 60 33 -29 -72 -66 -59 -28 40 69 101 71 19 -25 -75 -75 -56 -19 41 66 74 65 10 -40 -67 -92 -72 -20 25 87 76 50 16 -45
2778 -45 -87 -89 -67 -5 30 83 95 45 7 -37 -71 -69 -53 -2 62 76 88 62 3 -33 -70 -84 -33 -6 50 77 76 61 -6 -49 -73 -79
2810 -79 -45 -6 32 72 71 47 -1 -57 -81 -73 -62 -5 36 76 89 46 -7 -40 -73 -70 -38 2 64 77 85 43 1 -28 -60 -67 -32 6 63
2843 63 80 70 52 -5 -48 -66 -71 -32 -2 36 62 65 32 -10 -58 -81 -58 -48 0 46 63 53 23 -12 -49 -79 -60 -34 8 57 67
2874 67 59 24 -18 -42 -55 -63 -21 12 67 70 50 22 -13 -46 -39 -53 -23 12 26 51 32 7 -20 -49 -54 -51 -26 8 36 31 43 11 -23 -37
2908 -37 -60 -34 -14 13 46 47 34 20 -28 -24 -38 -30 -2 19 35 55 30 27 -7 -41 -36 -28 -4 16 27 44 34 -4 -12 -45 -39 -29 -14 16
2942 16 23 20 23 -2 -27 -35 -38 -12 -10 16 34 27 5 6 -20 -24 -21 -10 20 15 36 35 11 3 -17 -32 -19 -14 16 24 21 28 6 -11 -15 -38 -23 -2 -3 22
2982 22 33 9 -4 -20 -34 -28 -31 -7 17 21 26 16 -9 -27 -38 -33 -11 -6 30 44 27 23 -5 -7 -29 -26 -3 20 33 50 29 16 -2 -35 -26
3017 -26 -32 -14 14 17 31 32 -5 -12 -29 -42 -33 -21 22 44 34 45 2 -27 -39 -42 -20 1 13 45 40 25 10 -21 -33 -34 -23 19 29 63
3051 63 56 15 8 -18 -43 -31 -24 -3 37 43 55 30 -7 -30 -55 -53 -22 1 29 46 29 31 -16 -41 -60 -66 -25 8 30 63 31 24 0 -47
3085 -47 -49 -40 -30 26 44 45 50 15 -9 -31 -58 -37 -12 14 54 56 47 15 -9 -34 -57 -46 -19 -5 29 49 34 14 -35 -43 -57 -44 -22 -1
3119 -1 27 56 29 20 -10 -59 -43 -33 -22 29 43 52 42 19 -7 -30 -41 -27 -11 21 61 39 33 21 -13 -28 -49 -42 -7 8 36 38 34 8
3153 8 -26 -50 -44 -47 -14 15 28 43 29 6 -8 -47 -41 -21 -13 27 39 48 45 20 -8 -24 -31 -14 -7 22 43 30 38 12 -22 -26 -46 -27 -4 19
3189 19 33 45 20 3 -24 -44 -39 -33 -2 21 25 48 13 -7 -13 -49 -36 -27 -11 28 38 27 20 -14 -22 -28 -34 -10 8 23 36 33 28 3 -33 -16
3225 -16 -26 -15 14 24 42 28 5 1 -29 -29 -20 -21 16 24 16 22 -3 -15 -33 -57 -21 -14 -1 31 26 22 15 -27 -25 -26 -24 7 17 31 28 11 12 1
3263 1 -21 -1 -2 1 25 30 33 16 -3 -9 -29 -32 -8 -17 8 19 22 16 -7 -24 -24 -36 -19 -3 8 31 24 15 11 -29 -24 -25 -27 18 12 21 24 12 13 -7 -20
3304 -20 -13 7 6 21 14 32 22 -7 -9 -20 -16 2 8 20 26 23 15 -4 -11 -28 -29 -16 2 -5 13 14 3 -6 -18 -33 -16 -21 3 15 25 15 8 8 -13
3343 -13 -9 -6 0 5 24 15 22 3 5 -2 -12 -14 4 -6 12 23 5 12 -9 -20 -23 -18 0 5 6 14 -6 -1 -9 -19 -14 -2 -3 11 1 6 15 -3 -1 -2 -6 0 -1
3386 -1 7 19 11 10 9 11 8 2 8 10 6 16 10 11 3 -4 -12 -2 -7 2 -2 -4 4 -15 -12 -6 -4 -12 1 4 15 -8 -2 -10 -14 11 3 5 12 6 1 -1 -16 6 -3 6 15 12 19 15 -4
3437 -4 1 -15 10 6 7 1 12 9 11 4 -17 -5 -17 -7 1 8 7 0 -8 3 -16 -11 -7 -22 5 10 11 21 9 1 -9 -11 -6 -3 1 6 19 19 16 2 -11 -3 -6 14
3481 14 12 10 23 15 12 4 2 -2 -11 -12 -7 3 10 7 -1 6 -12 -21 -20 -14 -15 -10 2 23 17 -6 0 -10 -9 -5 -9 6 5 13 19 5 -4 -4 -6 -4 3 12 5 24 8 3 6 -11
3529 -11 -17 -1 -3 -1 1 7 9 7 -13 -12 -23 -29 -12 2 5 16 19 4 5 -23 -12 -6 -1 8 12 13 22 14 -1 -9 -18 7 6 10 20 22 31 14 2 -1 -7 -11 -2 -2 16
3574 16 16 15 9 3 -16 -17 -11 -16 -6 1 9 -3 0 -11 -7 -12 -16 -2 6 11 6 14 3 -10 -9 -9 3 -6 1 10 20 18 3 11 4 -9 -13 5 17 6 14 5 4 -5 -3 -12
3620 -12 -10 -12 -4 4 6 -5 2 -7 -14 -14 -2 -9 -3 7 -8 13 -2 10 4 -6 7 3 8 0 11 15 10 3 2 0 -2 4 6 2 5 9 15 0 -1 -2 1 -5 -3 -2 -4 1 -2 -8 -6
3669 -6 -7 -12 2 2 9 4 12 6 7 -6 -22 -7 -9 4 10 8 15 -2 1 10 4 -11 -2 -3 -2 8 8 8 -1 -12 -10 5 -1 -5 -6 2 -6 -1 -1 -16 -5 -14 -7 -14 -7 0 -7 2 -7
3718 -7 -2 -6 1 3 7 2 4 5 6 10 4 7 0 4 12 8 0 11 -8 -1 -2 -2 -3 -5 1 -1 -6 4 -4 -11 -6 -8 -7 -4 -8 -4 2 -9 -6 -6 -8 -9 -10 -1 2 0 4 4 4 19 -1 4 -1 0 15
3773 15 5 14 9 0 6 -2 -1 -1 1 -4 2 6 -3 -8 0 -2 -13 -4 -4 1 8 5 9 -10 -1 -9 -13 0 -9 2 1 -1 -12 -10 3 -3 6 1 9 -1 11 12 -15 4 13 -6 11
3820 11 14 7 11 3 8 13 -3 2 -21 -5 1 -6 -10 5 -12 2 -6 -14 0 -10 -14 -3 -14 -6 -3 -5 -5 -12 -7 -7 -8 -2 5 -5 -1 4 -11 -3 -9 1 -4 -10 -3 -9 5 12
3866 12 1 0 -1 0 -2 -3 -1 -9 -5 -2 -5 -18 -8 -14 -3 -2 -13 -10 -13 -14 -8 -7 2 4 -7 3 -1 -7 13 4 -13 11 3 5 2 1 1 -7 -2 29 7 3 10 12 8 1 5 7
3914 7 -5 0 -5 6 7 -7 -12 -16 -7 1 -6 -3 6 -2 2 6 -3 0 -8 -1 5 5 3 16 2 5 -2 -1 10 4 23 13 5 20 6 2 8 -3 11 12 -9 4 15 21 -5
3959 -5 -11 -17 -8 -4 4 -7 -5 11 5 1 2 -8 -7 -16 -5 4 0 9 10 10 -8 0 -11 -3 -5 10 4 10 28 5 -2 -2 -1 3 0 -1 6 9 10 0 -7 -16 -15 -22 -11 -7 -4 -4 -2 2
4009 2 0 -1 -12 -13 0 1 -6 7 10 -9 -9 -8 -4 -1 0 7 13 8 12 0 9 9 -5 -4 13 -4 14 16 8 9 -11 9 -10 -5 4 -5 -2 2 -2 2 -10 -8 -16 -14 -3 0 6
4056 6 0 -1 7 -2 -14 -1 -13 -7 -2 7 7 7 3 0 8 3 1 -3 -4 17 -3 7 0 -8 2 -10 -2 0 7 -2 11 -12 2 -9 2 -6 -20 -16 -4 -10 -1 0 0 -7 -2 -12
4102 -12 -6 -10 -3 1 14 5 -8 1 -3 -5 -3 -7 3 20 13 20 -3 -4 -7 -12 -4 -1 -2 0 5 -4 6 -13 -13 6 -14 -7 -4 6 9 -11 -12 -7 -16 -7 -5 -3 12 8 -3 6 -9
4149 -9 -1 -8 -8 5 8 19 18 16 20 6 -10 1 -4 1 18 8 15 6 2 20 -2 -6 7 2 6 4 -2 -5 -6 -7 2 -6 11 3 -2 13 -11 -1 3 -13 2 2 2 9 7
4194 7 -2 8 -13 14 3 3 23 10 10 16 -3 10 14 4 13 17 13 12 -8 2 -2 -4 6 -3 10 1 -13 12 -5 -25 2 -5 1 13 6 13 -8 -9 -8 -11 2
4235 2 9 15 16 4 5 14 -9 -12 7 2 21 0 0 12 -8 -3 -5 -3 3 9 1 11 3 5 -2 -11 0 1 -21 8 2 4 -2 -14 -12 -26 -15 -2 -2 14 29 0 3
4278 3 -4 -9 -4 -11 5 19 6 26 11 -8 10 -8 12 2 1 21 5 9 5 -6 -11 -19 -21 8 -1 11 6 7 12 -14 -21 -7 -5 -7 24 2 0 0 -8 -3 -5 -10
4320 -10 18 11 18 18 -5 0 3 -5 9 -4 9 20 4 6 3 -4 -2 -13 8 15 -3 17 -4 -8 -4 -19 -22 -7 -15 3 6 -4 6 -15 -25 -12 -20 6 8
4359 8 13 13 -13 0 -7 -19 -8 1 -2 11 12 11 16 -4 5 -13 -14 8 -2 7 11 0 14 -9 -13 -2 -9 0 8 -1 0 -3 -12 -6 -31 -14 -10 -14 1 0 -3 8 -11
4402 -11 -13 -11 -16 5 3 -9 9 7 5 1 2 5 -1 4 24 1 2 1 3 2 0 -9 -4 -9 -1 -2 -20 2 -4 -7 3 -14 -11 -8 -15 -3 -16 -13 4 -10 -6 8 -17 0
4446 0 -9 -16 -5 -5 13 27 5 19 -5 -1 7 -16 14 4 12 23 -2 -4 2 -19 -14 -4 -6 11 1 2 17 -16 -12 -13 -24 -5 -13 -9 5 -5 8 -7
4484 -7 -12 -7 -20 -18 5 15 16 23 -7 10 -11 -16 13 -1 15 30 14 24 -1 -10 8 -11 -4 -1 6 31 8 2 19 -1 -23 -10 -23 -2 -9 5 15
4521 15 -7 -1 3 -20 1 -23 -15 20 -12 -1 13 -10 -4 -4 -5 4 -13 6 19 7 20 5 -4 14 -7 -5 5 -1 18 6 0 9 -11 3 11 -12 12
4558 12 3 1 2 3 9 1 -24 6 -14 -15 11 -14 8 6 -6 -4 -11 -10 3 -5 8 15 -4 18 1 -1 8 -16 4 6 6 20 11 8 12 -13 2 -11 -3 8 1
4599 1 1 18 2 7 -3 -25 -4 -13 -18 9 -22 0 6 -20 3 -14 -11 2 -14 17 8 0 9 -9 -11 8 -17 4 12 9 27 5 -10 -5 -15 -3 6 -17
4637 -17 15 -4 0 14 -21 -1 -14 -14 0 -18 -5 2 -18 2 -5 -28 0 -20 -1 2 -7 1 -4 -7 11 -5 -12 9 0 -1 9 -9 11 3 5 21 -10
4674 -10 11 -5 -10 15 -13 -4 22 -13 13 -5 -16 4 -14 -15 -3 -24 -3 0 -7 16 -17 -11 -7 -27 0 8 -6 13 6 0 0 -14 -11 -5 -19 17 3
4711 3 12 16 -1 -5 -6 -23 10 -4 3 26 -6 16 -15 -21 -4 -26 -13 -1 -9 9 6 -11 9 -15 -26 0 -24 14 14 -3 8 -9 -17 -11 -32 -2
4747 -2 6 11 28 12 -1 8 -18 0 -1 -1 26 16 6 25 -7 -8 -4 -18 9 -9 -5 22 -4 -5 -10 -21 -16 -27 -20 8 -15 15 9 -22 1 -32 -26 -8
4785 -8 -11 13 9 -7 5 -12 -12 1 -25 6 8 1 30 -2 -8 8 -32 -1 7 -7 24 -1 0 11 -25 -12 -10 -29 0 -1 13 12 -6 0 -26 -19 -1
4822 -1 -19 -12 18 -5 5 -5 -24 -9 -16 -22 11 -10 17 9 3 9 -16 -9 5 -6 3 10 8 20 -15 -8 -4 -34 -7 0 -15 16 -3 -5 5 -23 -1 -17
4860 -17 -21 6 -8 -5 15 -15 -3 -16 -20 3 -15 9 20 -12 4 6 -13 6 -13 2 17 -4 10 7 -12 14 -7 1 7 -9 11 -3 -7 5
4894 5 -21 -15 4 -24 4 4 -15 10 -20 -17 6 -29 0 -3 -18 13 -7 -17 1 -28 -13 -4 -14 25 0 -9 22 -14 5 -2 -9 17 16 7 19 -4
4930 -4 10 -7 -24 0 -7 4 14 -2 6 0 -17 -6 -22 -14 11 -20 22 6 -5 -2 -9 -17 5 -21 7 6 2 18 8 -3 17 -18 2 -1 -4 21
4966 21 8 11 5 -11 11 -6 -12 29 -1 9 18 -10 18 6 -15 2 -9 -2 3 -22 7 -2 -13 -1 -21 -20 5 -17 6 17 -3 12 -23 -15 8
5001 8 -13 10 8 0 18 4 1 10 -3 -2 -5 -5 18 4 5 7 -23 -6 -9 -24 14 0 11 9 -25 1 -6 -10 9 -14 -6 8 -10 9 -3 -14 -1 -15
5039 -15 -3 7 -7 1 2 -3 16 -11 3 11 -2 15 5 6 21 0 3 5 -8 12 8 0 12 -6 -1 5 -21 7 -6 -7 10 -10 -11 -6 -21 12 -4
5076 -4 -8 19 0 5 13 -18 6 -8 -24 8 6 10 18 -4 4 3 -15 10 -12 5 17 -6 19 6 6 19 -9 -9 8 -17 21 20 -5 23 -14 -3
5112 -3 -12 -35 0 -7 -5 10 -10 -6 -1 -17 -1 -11 -13 7 4 17 17 -13 -4 -11 -16 18 1 18 22 -3 15 2 -8 4 -11 -1 7 4 24 9 -13 -3
5150 -3 -22 -14 -2 -10 15 4 3 4 -17 -18 -8 -12 -11 2 10 11 2 3 -13 -15 -13 -21 -2 17 8 18 9 -7 -3 -11 -22 12 4 16 30 -11 3 -11 -15 3 -8
5191 -8 10 24 10 24 2 -12 1 -13 -11 6 -12 17 1 -8 9 -14 -15 -17 -20 10 1 18 29 -12 -1 -7 -17 8 5 -10 20 1 -1 11 0
5226 0 -9 -17 -4 17 10 22 20 -6 4 -12 -25 -6 -10 4 25 -4 10 -3 -23 -5 -23 -14 6 -4 12 13 -12 3 -20 -17 -7 0 10 20 5
5261 5 15 2 1 -1 -10 8 10 9 28 17 -5 0 -6 -12 -5 -9 13 -4 16 11 -9 -22 -21 -13 5 -7 -3 10 -3 7 -2 -18 -4 -23 4 17 -4 11
5299 11 -11 -5 -1 -15 -15 0 1 8 -3 -3 4 -12 -7 -6 -4 7 4 5 22 -4 1 -1 -16 1 -1 -3 -4 -7 5 6 -14 -4 -14 -11 3 0 -1 2 2 -11 -10 -8 6
5342 6 2 12 11 9 1 -9 -14 2 -2 6 14 -4 13 3 -5 14 -16 -8 2 -8 13 0 -7 0 -11 -20 -4 -27 8 -3 5 1 2 -3 -1 -14 -4 -16 -13 9
5382 9 -4 4 -6 -13 6 -3 -19 10 0 4 16 1 8 -1 -13 19 -7 7 8 4 11 6 -14 0 -17 -26 -2 -7 8 4 -10 -1 -13 -9 -12 -17 -1 -8 -8 17
5422 17 -2 5 2 -18 -11 -9 -5 8 6 8 22 -3 1 1 -9 5 2 7 6 1 7 -12 -3 -1 -4 8 3 -4 4 0 -9 4 -13 -2 -10 -8 -10 0 -3 6 -3 2 -4 -6 6 -2
5468 -2 -2 19 -16 7 -4 -16 -1 -4 2 11 11 7 13 -2 2 5 -4 5 -7 9 7 -4 5 -6 -14 4 -3 4 12 2 12 -5 -8 -9 -24 -21 -6 -6 -2 7 3 9 -1
5511 -1 -1 -1 -10 1 9 8 16 7 -3 7 -5 -3 -1 6 19 4 3 12 -4 -7 -7 -19 -1 5 13 17 0 3 -7 -20 -9 -22 -2 6 1 8 4 -14 2 -18 -13 2
5553 2 4 16 15 -2 5 0 -1 13 -3 9 7 18 15 8 -5 9 -5 -6 -2 -2 10 0 4 -6 -8 1 -14 -11 -4 1 2 10 0 0 -2 -14 0 -7 -10 5 -2 -2 5 -9
5597 -9 -5 -4 -3 13 -5 17 6 0 4 3 -1 3 -12 -1 1 -1 4 2 -3 -5 -9 -2 0 -11 1 4 1 -9 -15 -13 -9 -2 2 -11 -10 -6 -9 -10 -3 -22 -4 -18 -4 12 -13
5642 -13 4 9 -8 -5 -2 2 11 2 5 3 -6 4 0 9 10 -9 23 10 6 0 -9 1 -2 -9 -3 3 -7 5 -14 -5 -5 -15 -7 -6 2 5 -11 1 0 -15 -10 -14 -10 12 9
5687 9 5 11 -6 0 -4 -10 7 -2 -4 8 7 6 8 -10 -12 -12 -4 1 0 8 -2 -22 -12 -18 -20 -6 -1 4 3 -1 -1 -9 -11 -10 -8 2 -4 1 19 2 -5 -7 -6 0 10 7 15 13 10
5736 10 7 5 6 1 1 8 10 9 17 3 -1 -8 -12 -11 -9 -8 4 -8 2 1 -13 -6 -6 -19 -7 -1 6 8 -1 9 -6 2 0 -5 4 7 16 7 9 7 8 3 9 16 0 11 12 7 4
5785 4 -10 0 -11 0 -2 -2 -1 6 -19 -6 8 -12 -3 -11 9 4 -6 -2 -2 -3 -4 -12 -11 1 -6 8 2 -15 2 -16 -3 -2 9 13 10 1 20 0 -9 9 2
5826 2 11 7 -1 14 4 -3 -6 -18 -9 -8 -5 15 4 -13 4 -9 -12 -1 -16 2 6 -3 -1 9 4 -3 -14 -4 3 6 7 11 6 4 1 4 2 1 16 -4 15 15 4
5869 4 5 3 3 9 -2 -2 3 -2 11 0 -16 -8 -13 -6 2 -5 7 -6 4 9 -11 0 -2 -14 20 12 5 19 -5 -1 -1 -18 6 9 4 9 5 7 11 6 15 -8 -2 9
5913 9 1 10 14 0 11 -5 -7 2 -4 -4 4 -5 -3 -4 -10 -2 -2 5 5 -1 13 6 3 8 -13 7 4 6 17 15 7 5 13 3 7 -1 18 3 10 15 4 -3 -2 -2 3 0 10 12 6
5962 6 5 7 -4 -3 2 5 2 0 6 8 -10 7 -5 -7 -1 3 11 -1 4 17 0 5 12 4 -3 2 11 18 19 3 8 11 13 2 -3 7 5 9 13 15 7 -3 -14 1 4 5 7 10
6010 10 7 11 4 -10 3 -7 7 3 10 9 6 4 -9 -4 6 0 6 21 7 7 5 0 4 -8 16 10 6 10 4 4 0 3 3 4 5 6 19 -2 10 0 -9 0 -3 2 2 6
6056 6 7 4 1 -15 -8 -5 -2 2 3 12 11 11 6 1 -13 1 13 6 11 9 9 15 -13 0 2 7 11 10 6 18 10 -1 4 -3 -4 -3 -5 5 2 13 12 -5 -5 0 -9 -11 12 8 12
6105 12 5 0 12 1 4 12 7 12 8 9 7 6 -2 6 5 17 5 9 10 14 14 6 -3 2 7 10 14 0 9 -4 4 -4 3 8 -1 -1 12 2 1 11 -2 9 3 -3 10 8 1 5
6153 5 -3 -8 -10 -3 4 4 2 14 11 6 8 6 5 2 6 15 2 2 8 -4 1 -7 -17 12 0 12 6 4 2 -14 -13 -5 -9 -6 -1 4 2 -13 -1 -14 -5 -7 -2 -7 6 4 9 12 7
6202 7 3 3 1 12 -7 1 5 5 5 2 -1 -2 -3 5 9 -2 5 11 -3 0 -11 -5 3 -7 10 1 -1 2 13 -7 -6 2 9 9 7 3 0 0 8 4 -2 4 6 10 -2 12 11 8 7 12
6252 12 4 -4 0 0 1 8 9 -1 -12 -1 -4 -7 7 5 -3 -1 -5 8 0 -8 0 -9 -2 6 3 15 -6 2 6 3 11 2 11 8 -3 2 9 6 6 18 -3 12 6 5 12 -1 6 4
6300 4 5 0 -8 -10 4 -8 -4 1 -10 -1 0 -3 -2 -8 -2 -4 6 3 -8 -1 -2 1 7 3 2 8 5 9 0 6 -4 12 4 -6 8 8 9 15 7 10 0 3 10 4 -5 7 -10 -2 12
6349 12 -5 6 1 2 -8 1 4 -4 9 -8 9 3 15 6 -6 4 -6 -5 -1 9 -6 8 14 12 10 3 11 4 8 3 4 2 -2 -3 3 -3 -14 -7 7 -8 0 -4 -10 2
6393 2 -13 -4 5 -1 -6 -6 -6 4 1 4 1 4 -1 -2 -3 12 -5 2 -4 0 -4 7 11 -3 9 20 7 8 7 3 -7 6 5 5 2 -3 8 5 2 -5 3 -7 7 1 8 3 -7
6440 -7 12 1 6 0 3 -5 -9 1 -2 4 -4 4 -1 -1 4 7 2 1 -4 7 7 11 3 0 2 -4 -3 8 0 8 -6 -1 -5 -2 17 -3 2 3 3 -7 -4 -6 6 1 3 -5 -9 2 -7 -10
6490 -10 -1 -8 0 6 11 4 8 10 3 2 10 9 -4 13 -1 9 2 9 5 6 8 7 3 4 -1 4 -2 -2 -2 3 -4 -5 -2 0 8 -2 7 -6 4 5 1 1 -2 -11 -2 -6 -6 3 1 11 2 -1
6542 -1 1 -2 -1 -4 9 6 -2 -1 -5 -5 11 0 2 11 -11 -14 0 -8 -6 2 4 -3 -9 -4 4 -3 -1 -8 4 -9 -9 6 -3 3 2 -4 0 -5 -5 7 8 0 -2 -3 4 2 -2 1 -7 -4 4 5
6594 5 7 1 7 -3 -6 0 -2 -2 -6 3 -6 5 5 -9 -3 0 -10 0 -4 3 -4 2 1 -3 -1 -4 -9 -7 -4 -4 -2 -11 -5 -3 11 -6 -1 -14 4 1 6 5 0 -10 -5 0 -1 -2 -10 2
6644 2 3 -9 -10 -5 -3 -7 0 -9 2 -5 -8 -5 -5 -5 -6 -15 -7 -8 -1 -1 2 2 3 -12 7 0 -1 4 13 3 -5 2 4 -2 1 -7 -5 -15 -4 -7 0 -6 -2 -5 1 -2 -5 -3 -7 -6 -6 -1 -10 -6
6698 -6 0 12 -3 0 7 3 -7 2 6 3 10 7 5 10 1 6 10 13 -2 5 1 5 -5 -6 6 -1 3 -7 -1 12 -2 -1 0 -6 8 3 2 -3 5 1 -9 -7 -8 1 -5 -11 5 -3 -10
6747 -10 -1 -3 5 8 2 8 -2 6 5 5 2 -2 -5 1 2 1 5 1 10 8 -3 -7 -3 0 -9 1 1 -11 -1 1 -2 -2 -3 -3 -4 2 3 0 -4 -1 -4 4 1 5 3 1 14 7 4 3 4 5 -3 4
6801 4 5 6 13 -6 -2 -5 0 0 -6 -4 -8 0 -6 -9 2 -11 -11 -12 0 -7 4 -9 -16 -6 -3 -5 -3 -5 3 -7 -8 1 -2 -3 6 10 5 -9 -6 7 3 3 1 -3 0 -6 5 7 -6
6850 -6 6 2 -1 8 7 -2 0 7 -2 3 -5 -6 3 5 -13 -18 -4 -2 6 1 2 6 3 -2 3 -9 1 8 -4 1 8 9 4 7 -3 4 4 10 2 0 -3 16 4 4 5 8 6 -2 5 5 1 4
6902 4 -18 -11 -8 1 2 8 -7 3 1 -4 -14 -6 -1 -11 -5 -11 -4 3 5 -4 -1 3 0 3 8 5 4 3 8 -1 11 -3 5 5 10 -5 4 10 2 -5 0 -9 -11 -8 -8 -2 3 3 -1 -4 -1 2 -7
6955 -7 -14 -6 -11 -5 6 -1 11 0 -11 -6 2 6 4 1 7 1 12 1 3 6 -6 -7 4 3 2 5 0 -3 -7 -6 -8 -1 -4 -5 -10 0 -7 -4 -5 -13 2 -8 -4 6 -14 -10 -14 0
7003 0 1 -2 5 3 2 -3 10 -12 6 6 8 4 -8 7 4 6 -2 3 6 -8 -8 -1 3 -4 0 -5 0 -12 5 -8 0 -4 0 -3 2 -2 -5 -2 -11 -8 -8 2 4 -3 6 2 -17 -4 7
7052 7 0 -1 9 1 5 13 4 14 0 1 -2 4 10 1 5 2 -10 -11 -6 0 -4 -4 -3 -3 1 5 3 0 -12 -14 -3 -10 -4 -3 -6 -8 -9 -11 -10 -8 -12 2 -1 1 -7 -1 5 7 3 8 3 -8 1
7105 1 3 2 -1 -4 0 -4 -9 2 -3 -12 1 7 -6 -3 -7 1 8 -9 1 2 -1 -1 -3 1 -2 4 2 4 9 10 4 3 5 6 3 5 6 7 10 -1 -2 -2 11 12 1 -5 -4 4 -2 0 0 -2 8
7158 8 3 -3 -12 -11 -13 -8 -4 -7 2 4 2 -4 5 1 5 7 3 -3 8 8 1 -7 9 2 17 10 2 15 4 0 9 2 7 13 2 8 6 -10 -4 -2 2 -6 -9 -2 1 7 0 -2 3 10 -5 0 -3
7211 -3 -3 2 -2 9 10 -3 -1 10 1 6 4 14 -8 -6 12 -1 -3 6 4 6 5 0 -5 -2 0 -5 1 -1 12 3 -2 4 -4 -6 -2 -3 -1 1 4 5 -1 -2 0 -5 -10 -4 10 1 2 5 1 16
7263 16 16 -7 -8 0 -3 2 1 14 -1 12 2 -2 1 3 13 8 0 -12 7 -5 -4 -5 0 -10 -5 5 -4 9 1 -1 -6 0 -11 -8 -9 -9 4 -3 8 7 4 -3 -3 -5 8
7308 8 4 -6 9 5 7 2 3 4 -1 -4 3 -4 7 -2 2 -7 -3 -10 0 5 10 6 -2 0 3 9 2 -4 6 10 8 1 9 3 9 11 -2 3 4 11 10 5 -2 -3 5 5 5 8 6 11 7 17 10 2
7362 2 -3 8 14 2 6 4 7 -3 -5 -1 -12 -2 -4 -2 3 -5 -7 -6 10 -5 -7 3 2 0 2 -5 0 7 -7 2 9 5 14 3 -3 8 4 23 7 2 2 -8 4 -6 2
7407 2 12 5 0 -4 1 3 1 1 -3 -11 3 2 -1 4 -4 2 2 -3 -15 -2 2 -2 5 5 5 4 8 4 -1 1 10 11 4 4 -5 7 -5 -3 5 6 2 -5 -5 -6 8 3 -8 8 7 0 -1 -4
7459 -4 1 3 -4 7 4 1 -12 -8 -4 4 5 -6 1 6 -1 5 -4 3 10 10 -1 2 9 0 9 2 4 10 10 -4 1 4 -2 -5 4 6 17 -7 -6 -7 -6 7 -6 -4 5 0 1 4 1 2 -2 4
7511 4 0 3 1 -3 1 -5 10 7 2 -4 7 11 13 2 5 3 6 12 5 9 9 -11 3 9 -1 1 0 -6 -3 -4 -4 -4 -1 -8 1 -2 1 -7 -12 -1 -7 1 4 -4 2 5 -5 -2 -3 9 -2
7562 -2 -10 7 1 -2 -4 -1 -5 5 1 2 -8 2 8 4 -3 -8 0 2 7 -10 -7 5 12 0 0 -4 -5 -2 4 0 -1 -6 1 3 5 -8 -6 4 0 6 -5 1 15 -1 3 -1 0 5 12
7611 12 16 5 -7 -3 12 3 -4 8 0 -12 -4 -1 12 -5 -4 -6 -9 -12 5 0 -8 0 -7 14 -1 -11 0 -8 3 -4 -3 -8 2 -3 -1 -5 4 7 8 0 8 1 3 -4 -1 1
7657 1 -4 5 -5 1 7 -1 6 -3 4 2 -1 5 11 0 -6 7 0 -4 -5 -3 -2 -2 -14 -1 -3 2 -2 -3 -8 -4 3 6 0 9 1 7 11 17 0 2 -1 10 2 -9 7 -4 -3 -2 3 -6 -3
7708 -3 -9 -1 2 7 2 -7 0 3 -7 -4 -3 -1 5 3 -11 -1 -3 -11 2 7 3 3 5 7 7 8 13 2 -4 3 4 -1 5 1 -1 1 15 7 6 -2 7 1 4 -2 5 -3 -7 -6 -11 -2 0 9 3 -16
7762 -16 -4 -2 7 -3 2 5 8 3 -2 7 3 7 2 11 8 16 10 9 0 3 2 -8 4 4 0 -3 -7 3 11 5 -3 -1 -11 -1 1 -3 -4 -7 3 -9 0 -2 -3 -10 -2 -6 8 -8 4
7811 4 -10 2 -2 5 -12 3 2 0 8 2 2 4 2 -2 7 -1 -2 0 5 -7 -5 -3 -7 9 11 3 4 4 1 0 -5 1 1 -11 -8 0 2 2 0 12 -6 1 4 3 -9 -7 6 6 5 2
7861 2 2 7 0 1 8 6 -3 4 0 4 3 9 11 8 8 3 -10 -6 -6 1 -1 2 -5 -6 4 2 -13 -3 -1 -3 -2 -4 -2 5 -1 3 0 1 11 7 1 9 8 12 13 2 14 5 3 6 7 4 0 -5
7915 -5 -6 3 -4 -5 10 8 4 -5 -1 6 -4 7 -3 -9 -7 10 3 -2 -3 6 -8 5 10 -1 9 14 -6 1 -2 6 7 -6 1 5 8 1 5 3 7 16 4 3 -1 4 11 0 -9 -2
7963 -2 0 -3 -1 -6 1 -1 -5 -13 -8 0 -10 -6 -4 -16 1 -6 -4 -3 4 3 6 -8 4 -7 -7 5 -5 0 3 4 -3 2 -8 7 5 2 0 5 5 7 4 16 -5 2 3 -6 -2 -8 -4
8012 -4 14 5 -2 -1 2 -4 0 11 -3 -3 -2 3 1 9 -2 -4 -7 -4 3 -1 8 -10 3 1 13 4 3 5 -3 12 2 10 -6 9 0 -4 -7 1 -3 -4 6 7 -2 -4 3 4 5 -7
8060 -7 -2 5 -2 7 6 15 6 8 7 1 2 4 -4 5 11 2 -8 -3 -12 -3 4 17 9 7 -1 5 0 11 1 4 5 1 13 -5 -8 1 4 -1 8 -2 -3 -9 -5 3 -2 -7 -1 -6 2 -1 8 0 2 1
8114 1 8 2 16 -10 -4 8 8 -1 7 7 7 -1 -3 3 -3 0 7 7 0 5 2 7 -2 5 0 -6 3 -2 1 0 -2 1 -4 -2 0 0 11 7 -3 6 -4 3 8 3 12 8 6 -1 4 14 8 5 7 6
8168 6 -1 5 11 10 -5 8 5 3 -2 6 10 -1 -3 8 5 -2 1 -6 2 5 7 -3 4
8191D
##END NTUPLES=NMR FID
##END=
