##TITLE=1H_DE-80H_X3
 200.13MHz, d2o
 8 sc
 
 19ns.26.2.2025
##JCAMPDX= 6.0         $$ Bruker NMR JCAMP-DX V2.0
##DATA TYPE= NMR FID
##DATA CLASS= NTUPLES
##ORIGIN= UXNMR, Bruker Analytische Messtechnik GmbH
##OWNER= pz
$$ XWIN-NMR		Version 3.5
$$ Mon Mar 17 16:57:57 2025 Russian Standard Time (UT+4h)  Yarkov@DPX200
##.OBSERVE FREQUENCY= 200.1313
##.OBSERVE NUCLEUS= ^1H
##.DELAY= (6, 6)
##.ACQUISITION MODE= SIMULTANEOUS
##.ACQUISITION SCHEME= undefined
##.AVERAGES= 8
##.DIGITISER RES= 18
##SPECTROMETER/DATA SYSTEM= spect
##.PULSE SEQUENCE= zg30
##.SOLVENT NAME= CDCl3
##.SHIFT REFERENCE= (INTERNAL, CDCl3, 0, 14.3821)
##AUDIT TRAIL= $$ (NUMBER, WHEN, WHO, WHERE, WHAT)
$$ ##TITLE= Audit trail, XWIN-NMR		Version 3.5
$$ ##JCAMPDX= 5.01
$$ ##ORIGIN= Bruker BioSpin GmbH
$$ ##OWNER= Yarkov
$$ C:/Bruker/XWIN-NMR/data/yarkov2/nmr/H-C/1/audita.txt
$$ ##AUDIT TRAIL=  $$ (NUMBER, WHEN, WHO, WHERE, WHAT)
(   1,<2025-03-17 16:55:21.93 +0400>,<Yarkov>,<DPX200>,
      <created by zg, POWCHK disabled, PULCHK disabled
       configuration hash MD5:
       00 E9 B6 7A A2 85 ED C7 34 08 36 98 17 FE 4E 26
       data hash MD5: 16K
       A6 0E CD 26 11 3D 4A 26 10 7A 47 0A E6 66 B1 64>)
$$ ##END=
$$ 
$$ hash MD5
$$ BC 3B 8A 5C 32 5E 2C 1A F6 DE E8 73 36 7A E2 2F
##$RELAX= 
##$RELAX= 
##$RELAX= 
##$RELAX= 
##$RELAX= 
##$RELAX= 
$$ Bruker specific parameters
$$ --------------------------
##$DU= <C:/Bruker/XWIN-NMR>
##$EXPNO= 1
##$NAME= <H-C>
##$PROCNO= 1
##$TYPE= <nmr>
##$USER= <yarkov2>
##$AMP= (0..31)
100 100 100 100 100 100 100 100 100 100 100 100 100 100 100 100 100 100 
100 100 100 100 100 100 100 100 100 100 100 100 100 100 
##$AQSEQ= 0
##$AQ_mod= 1
##$AUNM= <au_zg>
##$AUTOPOS= <>
##$BF1= 200.13
##$BF2= 200.13
##$BF3= 200.13
##$BF4= 200.13
##$BF5= 200.13
##$BF6= 200.13
##$BF7= 200.13
##$BF8= 200.13
##$BYTORDA= 1
##$CFDGTYP= 0
##$CFRGTYP= 5
##$CHEMSTR= <none>
##$CNST= (0..31)
1 1 145 1 1 1 1 1 1 1 1 1 1 1 1 1 1 1 1 1 1 1 1 1 1 1 1 1 1 1 1 1 
##$CPDPRG= <>
##$CPDPRG1= <>
##$CPDPRG2= <>
##$CPDPRG3= <>
##$CPDPRG4= <mlev>
##$CPDPRG5= <mlev>
##$CPDPRG6= <mlev>
##$CPDPRG7= <mlev>
##$CPDPRG8= <mlev>
##$CPDPRGB= <>
##$CPDPRGT= <>
##$D= (0..31)
0 0.7 0 0 0 0 0 0 0 0 0 0.03 0 0 0 0 0 0 0 0 0 0 0 0 0 0 0 0 0 0 0 0 
##$DATE= 1742216121
##$DBL= (0..7)
120 120 120 120 120 120 120 120 
##$DBP= (0..7)
150 150 150 150 150 150 150 150 
##$DBP07= 0
##$DBPNAM0= <>
##$DBPNAM1= <>
##$DBPNAM2= <>
##$DBPNAM3= <>
##$DBPNAM4= <>
##$DBPNAM5= <>
##$DBPNAM6= <>
##$DBPNAM7= <>
##$DBPOAL= (0..7)
0.5 0.5 0.5 0.5 0.5 0.5 0.5 0.5 
##$DBPOFFS= (0..7)
0 0 0 0 0 0 0 0 
##$DE= 6
##$DECBNUC= <off>
##$DECIM= 32
##$DECNUC= <off>
##$DECSTAT= 4
##$DIGMOD= 1
##$DIGTYP= 9
##$DL= (0..7)
0 120 120 120 120 120 120 120 
##$DP= (0..7)
150 150 150 150 150 150 150 150 
##$DP07= 0
##$DPNAME0= <>
##$DPNAME1= <>
##$DPNAME2= <>
##$DPNAME3= <>
##$DPNAME4= <>
##$DPNAME5= <>
##$DPNAME6= <>
##$DPNAME7= <>
##$DPOAL= (0..7)
0.5 0.5 0.5 0.5 0.5 0.5 0.5 0.5 
##$DPOFFS= (0..7)
0 0 0 0 0 0 0 0 
##$DQDMODE= 0
##$DR= 18
##$DS= 0
$$ [...]
##$SUBNAM0= <"">
##$SUBNAM1= <"">
##$SUBNAM2= <"">
##$SUBNAM3= <"">
##$SUBNAM4= <"">
##$SUBNAM5= <"">
##$SUBNAM6= <"">
##$SUBNAM7= <"">
##$SUBNAM8= <"">
##$SUBNAM9= <"">
##$SW= 18.0517328524113
##$SWIBOX= (0..15)
0 0 2 0 0 0 0 0 0 0 0 0 0 0 0 0 
##$SW_h= 3612.71676300578
##$TD= 16384
##$TD0= 1
##$TE= 0
##$TE2= 300
##$TE3= 300
##$TEG= 300
##$TL= (0..7)
0 120 120 120 120 120 120 120 
##$TP= (0..7)
150 150 150 150 150 150 150 150 
##$TP07= 0
##$TPNAME0= <>
##$TPNAME1= <>
##$TPNAME2= <>
##$TPNAME3= <>
##$TPNAME4= <>
##$TPNAME5= <>
##$TPNAME6= <>
##$TPNAME7= <>
##$TPOAL= (0..7)
0.5 0.5 0.5 0.5 0.5 0.5 0.5 0.5 
##$TPOFFS= (0..7)
0 0 0 0 0 0 0 0 
##$TUNHIN= 0
##$TUNHOUT= 0
##$TUNXOUT= 0
##$USERA1= <user>
##$USERA2= <user>
##$USERA3= <user>
##$USERA4= <user>
##$USERA5= <user>
##$V9= 5
##$VALIST= <valist>
##$VCLIST= <CCCCCCCCCCCCCCC>
##$VD= 0
##$VDLIST= <DDDDDDDDDDDDDDD>
##$VPLIST= <PPPPPPPPPPPPPPP>
##$VTLIST= <TTTTTTTTTTTTTTT>
##$WBST= 1024
##$WBSW= 4
##$XGAIN= (0..3)
0 0 0 0 
##$XL= 0
##$YL= 0
##$YMAX_a= 154708
##$YMIN_a= -86717
##$ZGOPTNS= <>
##$ZL1= 120
##$ZL2= 120
##$ZL3= 120
##$ZL4= 120
##$ABSF1= 10
##$ABSF2= 0
##$ABSG= 5
##$ABSL= 3
##$ALPHA= 0
##$AQORDER= 0
##$ASSFAC= 0
##$ASSFACI= 0
##$ASSFACX= 0
##$ASSWID= 0
##$AUNMP= <proc_1d>
##$AZFE= 0.1
##$AZFW= 0.1
##$BCFW= 1
##$BC_mod= 2
##$BYTORDP= 1
##$COROFFS= 0
##$CY= -3
##$DATMOD= 1
##$DC= 2
##$DFILT= <>
##$DTYPP= 0
##$F1P= 0
##$F2P= 0
##$FCOR= 0.5
##$FTSIZE= 0
##$FT_mod= 4
##$GAMMA= 1
##$GB= 0.15
##$INTBC= 1
##$INTSCL= 1
##$ISEN= 128
##$LB= 0.25
##$LEV0= 0
##$LPBIN= 0
##$MAXI= 10000
##$MC2= 0
##$MEAN= 0
##$ME_mod= 0
##$MI= 1.114404
##$NCOEF= 0
##$NC_proc= 0
##$NLEV= 6
##$NOISF1= 3.799351
##$NOISF2= 2.8
##$NSP= 1
##$NTH_PI= 0
##$NZP= 0
##$OFFSET= 14.38212
##$PC= 1
##$PHC0= -1267.619
##$PHC1= 13.19222
##$PH_mod= 1
##$PKNL= yes
##$PPARMOD= 0
##$PSCAL= 0
##$PSIGN= 0
##$REVERSE= no
##$SF= 200.129724274929
##$SI= 16384
##$SIGF1= 3
##$SIGF2= 2
##$SINO= 400
##$SIOLD= 16384
##$SREGLST= <1H.CDCl3>
##$SSB= 0
##$STSI= 0
##$STSR= 0
##$SW_p= 3205.1282051282
##$SYMM= 0
##$S_DEV= 0
##$TDeff= 0
##$TDoff= 0
##$TI= <>
##$TILT= no
##$TM1= 0
##$TM2= 0
##$TOPLEV= 0
##$USERP1= <user>
##$USERP2= <user>
##$USERP3= <user>
##$USERP4= <user>
##$USERP5= <user>
##$WDW= 1
##$XDIM= 8192
##$YMAX_p= 0
##$YMIN_p= 0
$$ End of Bruker specific parameters
$$ ---------------------------------
##NTUPLES= NMR FID
##VAR_NAME=  TIME,          FID/REAL,        FID/IMAG
##SYMBOL=    X,             R,               I
##VAR_TYPE=  INDEPENDENT,   DEPENDENT,       DEPENDENT
##VAR_FORM=  AFFN,          ASDF,            ASDF
##VAR_DIM=   8192,          8192,            8192
##UNITS=     SECONDS,       ARBITRARY UNITS, ARBITRARY UNITS
##FACTOR=    0.0002768,     1,               1
##FIRST=     0,             0,               0
##LAST=      2.2672688,     0,               0
##MIN=       0,             -86717,          0
##MAX=       2.2672688,     154708,          0
$$ Real data points
##PAGE= N=1
##DATA TABLE= (X++(R..R)), XYDATA
$$ [...]
1007D34k295J168J611k69oj081j421J875J804j368j048k67o8J865P14k159p20
1024a231R39N11Q13m36j744L64J149J68L63j115j599J803J757j510q88J88k24
1041f92J286P80j811n41R68j4N47L07j645q7J558l07m46K97p86K07J258p42p14
1060e77O61k95J75R45j168p59J494R6q58K74j86M0P86o74n68Q66j28k00O12q81
1080c45n48J402K09q02Kn56J24J607k70j590J07N01L80Q95q32j746P79J606n4
1099H69o95r99l83J661J041j366r25P2K08J519N79k226r93J408R46M80o48k090
1117a542K64K237K14q40q26r90J266J914j011j448j04J88J463Q13j985r58J059
1134b86M66P51R5k052m30J847N98l90p19j131O92J622l39r55k72j47P89Q81q16
$$ plain form
1007 434 -1861 -693 918 649 643 -438 -1859 16 1820 452 -596 -863 -931 934 1648 -511 -1231
1024 -1231 -292 219 1032 596 -1148 -784 365 533 896 -219 -1818 -15 1742 232 -656 -468 -692
1041 -692 594 1374 -437 -978 -10 -24 523 830 -815 -902 656 349 -97 200 -586 -379 879 137 -577
1060 -577 84 -211 -36 909 -259 -1018 476 572 -286 -12 -198 -158 628 -46 -614 252 124 -76 536 -345
1080 -345 -893 509 718 -84 -82 -638 -514 1093 823 -767 -660 -159 221 1116 284 -1462 -683 923 869
1099 869 174 -825 -1208 453 1494 128 -797 -725 -517 1002 1581 -645 -1638 -230 716 1196 548 -1542
1117 -1542 -1278 959 1173 333 -493 -1483 -217 1697 686 -762 -866 -678 785 1598 -387 -1345 -286
1134 -286 180 931 1026 -1026 -1456 391 989 599 -120 -1251 -559 1063 724 -231 -503 -650 139 1020 204
1153B04r13L47L99L26K23p80n80P55N14l44j21j62l15N20M34n62j57L30k11j0
1173a03K43j93K08R2o64R3O10p0M4k98p73O91R02n42l78k20m02J116Q39j270p76
1194h51L92M25R69j0j777l80J338P79M0r50j398O11J777K80j063j218k26J523
1212B61J265q72j523l98R37J483J32j626j137P77J518N79j069j612L3J682J015
1229A445p87j415n98R61J587P3j592j020O05J401O81j010j440J41J233O98k52
1246G11j138p32Q80J168j17q67o86J28J035N20p53p14M0M27N90Q3p24m61L59M68
1266B17J81k25m12m6K22Q7K45M7n30k08L49K21J64m9n82j85N28L49N5l29p41N9
1288e83R67L85m91p60l95P53J032j54r88p82K68J426O31j193j197J35J107J076
$$ plain form
1153 204 -709 -362 37 363 586 -194 -774 -19 495 151 30 -132 -447 73 507 -55 -212 118 -93 -103
1173 -103 140 -53 155 247 -417 -324 286 216 260 -38 -811 -120 782 240 -138 -358 -760 356 1195 -75 -851
1194 -851 -459 -34 935 925 -852 -1232 106 885 925 -25 -1423 -812 965 1245 182 -1036 -1262 261
1212 261 1526 654 -869 -1267 -330 1153 1285 -341 -1478 -701 817 1396 327 -1285 -1252 430 1445
1229 1445 658 -757 -1355 -394 1193 1266 -326 -1346 -741 660 1341 331 -1109 -968 265 963 711
1246 711 -427 -1159 -279 889 772 -95 -781 -653 382 902 149 -565 -525 -98 492 575 -149 -610 -251 217
1266 217 398 173 -239 -285 -63 24 269 316 -214 -422 -73 148 312 263 -319 -504 24 373 428 99 -642 -583
1288 -583 384 769 278 -482 -877 -124 908 754 -234 -1016 -748 678 1309 116 -1081 -946 161 1237
1306A237l89j568o07R71J380K55j374j363N31J641P83j032j694j28J573J219m51
1323I84j623r65J098J757J27j471j338L67J743Q02r91j413m30J218J530l55j582
1340e42p31O43J452N27j350j183M12J041P86l68j413l25R95P58J07p93j001M41
1358e44J019J42k66o48n50P19P92k47m13m41r2P37L28l68k26l26m7P17K64m16
1378A34l64k91K60P79P2o30m75m9O11P39k33r45m94N25J029K47q38r18k9J067
1398A97R62m74j323n69Q36J436J37j460j016N13J288Q89q72j741o7J413J124j43
1416A130j640j221J226J738L7j202j381QJ889J068j083j472n53J094J843j76j928
1433f23p89P80J315P77j069j698J51J473R46l66j547q20J193J375j11j058r78
$$ plain form
1306 1237 848 -720 -1327 -356 1024 1279 -95 -1458 -927 714 1497 465 -1229 -1357 216 1435 984
1323 984 -639 -1604 -506 1251 1378 -93 -1431 -1064 679 1481 490 -923 -1353 -135 1395 1040 -542
1340 -542 -1273 -630 822 1349 -1 -1184 -772 269 1055 687 -726 -1051 -56 702 809 16 -985 -544
1358 -544 475 617 351 -297 -847 -128 664 417 4 -437 -529 208 536 168 -58 -384 -431 286 550 134
1378 134 -230 -521 -261 518 590 -40 -515 -564 47 786 553 -392 -886 -361 668 915 77 -841 -870 197
1398 197 1159 685 -638 -1207 -371 1065 1202 -258 -1274 -761 527 1416 544 -1197 -1264 149 1273 1130
1416 1130 -510 -1731 -505 1233 1270 68 -1313 -1305 584 1652 569 -903 -1456 -362 1481 1305 -623
1433 -623 -1412 -632 683 1460 391 -1307 -1156 317 1263 897 -650 -1470 -277 1098 987 -71 -1049
1450a049J67J339P10p87j014k97O60J145N3j249n86N79O12L60j86r34l25P75N74
1469E47n3m31o53M4P95K87k36l88n60J79R46K29n47n87l36O31J026k75r11l19
1489f12M1P02R74n52j404j03Q99Q81J91j197j122P02J288L77o11j352m69J519
1507A52J273o41j339p54O41J730L73j540j127K10J221J362n96k116m18J524J295
1524A250J6j517j423Q90J770L18r26j406m74J678J487q67j550n45P07J640M26
1541A474j630j194N11J202R56n26j770m00J422J039k30j042r22M19J301L67o94
1558B83q52l94P76J154k24j118l81K92P61O11o20r46O5N07N40L28p87q90M78P39
1578C22J98J8p53p54O89R15N0m39r05l29J186Q36n93p91n04K47J277M49j067q94
$$ plain form
1450 -1049 -882 457 1167 380 -634 -931 -271 874 927 -322 -908 -329 283 643 457 -477 -802 -27 547
1469 547 494 63 -590 -546 249 536 300 -88 -648 -469 477 706 159 -428 -764 -133 893 618 -293 -612
1489 -612 -571 131 1105 553 -851 -954 -55 826 1017 -180 -1302 -600 688 1065 454 -898 -1367 152
1507 152 1425 784 -555 -1309 -668 1062 1435 -105 -1232 -1022 199 1561 965 -1151 -1569 -45 1250
1524 1250 1266 -251 -1674 -784 986 1304 378 -1028 -1502 176 1663 796 -754 -1299 -592 1048 1474
1541 1474 -156 -1350 -839 363 1319 793 -977 -1377 45 1084 854 -188 -1110 -691 610 977 283
1558 283 -569 -963 -187 967 743 -375 -756 -464 297 908 288 -658 -593 -86 454 782 -5 -895 -417 322
1578 322 520 538 -215 -969 -280 635 685 246 -659 -988 198 1034 441 -350 -854 -607 670 1119 52 -842
1598h42l5Q50J243k89j672m84R28J076M67j044j572L04J667P34o76j443p17J272
1616b33J605k48j459r91L96J650Q80j226j599o0J369J372l27j900q32J220J435
1633A052K29j167j512K27J791Q18q92j341n85J054J635j65j549q05M66J250Q48
1650A354r04j506J9J122Q76n8j215q69P35J127J83o19r33k45J015Q05l17q09n82
1669h21K64J064M02p80p09r8N21Q95rr65n14K66O89O57l79j095k21P21O92K23
1689H03p12j025J82J134N45m27r93o03P86J270Pj087q83J65J214R05p18j400l61
1708a198J016J286L3j436j058O15J428O49q86j552k24J469J202m28j448r17Q50
1725e99J679K78j403j205K26J405J078p39j668l90J172J309L4j431j159O56J483
$$ plain form
1598 -842 -877 -27 1216 927 -745 -1229 -301 775 1242 198 -1374 -1070 597 1331 655 -788 -1505 -233
1616 -233 1372 1124 -335 -1326 -930 720 1600 374 -1225 -1285 84 1456 1129 -771 -1603 -383 1052
1633 1052 1281 114 -1398 -1171 620 1438 546 -795 -1380 -326 1309 1144 -405 -1210 -744 506 1354
1650 1354 450 -1056 -1037 85 961 903 -312 -1181 -446 681 864 245 -688 -933 82 887 570 -239 -821
1669 -821 -557 507 909 129 -580 -678 -157 738 729 -236 -750 -484 205 862 483 -612 -833 -112 580 803
1689 803 91 -934 -752 382 927 500 -493 -1096 -310 960 967 -120 -1003 -838 376 1281 563 -837 -1198
1708 -1198 -182 1104 1137 -299 -1357 -742 686 1335 449 -1103 -1327 142 1344 916 -532 -1449 -599
1725 -599 1080 1358 -45 -1250 -1024 381 1459 720 -948 -1338 -166 1143 1177 -254 -1413 -757 726
1742G26N30q52j367k64J306J132l92j260p22O19J323L36j029r98Q0R65Q58l23
1760F68j160n11O76R63K39p85r12J00R16O03k71q55n12M95R06J97o20p43j02P29
1780B1P44j93q08n09K63Q84M95o46r22q6P31P78k2r49p20M32R82M80o04j098k36
1801i83R77R63j49j092q58N18J319M43r25j147j19J155J110m04j396o27P99J285
1819H69K79j098j207K22J360Q60o86j421m40J135J259j14j308r73N30J456N40
1836A263j030j215p6J142J074l40j382o11P91J169K69r61j124J72J192P12n00
1853E45j135m42Q46J002l1q70p56J77J012N67n66q70k54N94Q43P3q24o57K49P51
1873B54M74l33q35k90N66O96R7o21o60J09P43M59k59p09m35M51Q65J54o95o86
$$ plain form
1742 726 1256 404 -963 -1227 79 1211 819 -441 -1163 -544 779 1115 86 -912 -832 133 991 668
1760 668 -492 -1003 -327 636 875 90 -822 -722 194 797 526 -329 -841 -346 560 757 137 -606 -708 21
1780 21 765 572 -236 -745 -482 402 897 251 -671 -757 -26 752 730 -219 -939 -507 475 955 351 -747 -983
1801 -983 -6 957 808 -284 -1142 -624 695 1138 213 -934 -1053 102 1212 808 -588 -1215 -416 869
1819 869 1148 50 -1157 -935 425 1285 599 -822 -1262 -127 1132 1018 -290 -1263 -733 723 1263
1836 1263 233 -982 -1058 84 1158 818 -564 -1175 -384 785 1054 93 -1031 -859 333 1045 545
1853 545 -590 -1032 -186 816 785 -85 -841 -664 348 915 349 -521 -775 -181 662 735 -89 -746 -497 254
1873 254 728 395 -440 -730 -164 532 629 8 -652 -543 200 659 400 -309 -744 -293 572 726 31 -655
1893f55J3P73O86l04r21m18N26Q88K99q12r15J32R46O86l43j102m83P85R95J01
1913H77r03r43K00J239O32p43j082k59Q94J078j39j207p16N23J161N01r05j192
1931i84R0J133P96l78j189n74Q00J143O7r27r31J85J177O57p06j019k28P75R57
1950H44n4j048o58M46R16M39o06r99m5Q71O16j88p48n83L96Q77K06n48o63j30
1970f59O81O67k48o92l21K35O54L25m90o28l6M77N56J4o96m78L27O07K84k81p29
1991d31k34O24O36o9o04n90J80Q35L91n02p04k37N43Q59lq99n93L11Q59N03o04
2012B71j004k5Q18P10j03r49p14O30J030J68p15r04l8J072P50n34r88l83O28J055
2032G75J33j083p79L95R78N23n99j078r8Q90P30j23r36o71N37J018J92p18p80
$$ plain form
1893 -655 -642 131 817 513 -408 -826 -300 588 887 75 -840 -708 238 924 581 -521 -1004 -219 776 877
1913 877 -26 -969 -769 470 1102 359 -723 -982 -88 990 851 -356 -1072 -549 612 1113 208 -984
1931 -984 -894 239 1035 657 -532 -1106 -306 837 904 -23 -954 -769 408 1065 359 -660 -888 -113 844
1950 844 790 -258 -916 -470 446 885 279 -720 -765 106 722 534 -214 -797 -401 476 682 134 -529 -659
1970 -659 22 689 441 -251 -572 -337 317 642 152 -476 -512 -35 521 535 -161 -639 -312 295 579 298 -431
1991 -431 -665 -41 595 526 -78 -668 -488 347 738 236 -468 -705 -162 697 694 -205 -798 -487 372 875 271
2012 271 -733 -758 60 770 667 -282 -996 -366 664 832 117 -787 -825 247 997 463 -525 -908 -280 775
2032 775 908 -175 -954 -559 419 942 343 -735 -833 57 787 664 -272 -943 -406 612 804 86 -694
2051f94m1Q82P21m36q81k88M93P90J82p58o83K47O99M05k81p41k67N47N76K2m68
2072B6n76P4P07L48l52m99k46L17O39N5n39l64K0M28N06j76o60k21L13N08K65
2093E73m49o58M3N63M53n8o95m81M45P22J19m41o57j20P62O25l14p61l73L91Q58
2114E47K43p76p58J79P86O01l80r75k95P06P98M5q30p71L52J007L36n75q44k19
2134h23Q49Q54l13r43m38M69Q99K84q12q34K18Q55N24l66r01l16O79P59j8p07
2154h1o48K30Q74L52n09o81j66N57P02j11p43l69K85N82L16m16o52NN14L84j3
2175D12n19m22K85N20J58k42m96j82M69M35q8l66l68L8N50L21l09m52j81K79N45
2196C87J00n08m56Q9N29M21k37o42k48M20N97J20n84o13J43P34M09l76p04k69
$$ plain form
2051 -694 -735 147 868 432 -449 -737 -244 546 728 -30 -713 -466 233 638 357 -384 -651 -104 472 494 26
2072 26 -550 -476 231 579 227 -272 -518 -201 438 493 -46 -410 -390 38 544 368 -292 -513 -200 308 573
2093 573 124 -534 -491 72 525 467 -228 -709 -264 458 577 136 -521 -641 121 746 432 -329 -702 -311 547
2114 547 790 14 -744 -565 221 822 442 -533 -828 -122 676 721 -109 -880 -528 479 815 240 -604 -823
2134 -823 26 880 567 -376 -814 -345 554 838 26 -808 -590 265 789 423 -478 -794 -115 644 626 -81
2154 -81 -729 -499 375 727 218 -463 -629 -72 630 519 -224 -593 -308 274 590 174 -478 -473 41 425 412
2175 412 -107 -529 -244 276 434 192 -304 -486 -17 418 330 -36 -404 -366 184 505 196 -256 -437 -158 387
2196 387 487 -21 -477 -388 141 562 325 -317 -565 -145 452 572 -12 -625 -482 252 661 285 -419 -688
2216f88N67P58l9p51n47K52P95M36n61q52l7P29O35j35q74n09N52Q37J34o43p36
2237f77O1R06M98m67p66k76N72Q22n0q10m94K80P46M04n52p70j0O28N61j36p19
2258b49m17M33O55J32m64n84K1O03M00k28n30k65L18N25R7m21m19N3M25L33j50
2279B68m62j92K53L76J07k66l79m3L74K94o2l33l10J21M44J98k38l92j61L06M77
2300C80k2m24l47Q9M80L54k94n57j19L79N26M3n79m63K25O06L12l67o98j02O10
2321C2N56j47o56m30L56P44J66n83n98L9O78N15l18p55k47N35O63Ro77n51K92
2342c77P18K74m46o65q4O49N37k20o38l23L48O37J44n59m86R9N42L78k47o02j55
2363d76M04M47K6m50l78J67M43J88k05l99j29L19L53m2k99k45P1L10K02j68l05
$$ plain form
2216 -688 -121 637 598 -153 -700 -448 347 783 222 -630 -667 62 697 562 -312 -821 -269 568 702 59 -677
2237 -677 -616 290 788 321 -445 -721 -149 673 623 -187 -681 -401 345 749 197 -573 -583 45 606 470 -249
2258 -249 -666 -233 422 554 90 -494 -473 130 530 302 -228 -493 -175 350 447 26 -393 -340 85 418 268
2279 268 -194 -386 -133 243 350 84 -295 -338 36 330 268 -65 -375 -254 190 388 150 -242 -403 -97 380
2300 380 358 -66 -413 -324 156 510 216 -341 -460 -81 445 488 -91 -554 -329 277 589 222 -476 -578 32
2321 32 588 441 -215 -645 -289 455 621 38 -560 -521 157 672 354 -401 -648 -113 550 559 -118 -669 -377
2342 -377 341 615 169 -496 -580 69 606 386 -252 -575 -227 410 554 -5 -491 -392 150 528 281 -321 -476
2363 -476 -72 375 401 -49 -427 -260 183 371 166 -233 -362 -43 310 268 -31 -276 -205 105 307 139 -166
2384a66p9J62K60O8k19k48J1K24K04Pl08j79J01L07J40j45l52j27L29L09l6l06
2406d3k95P6M78J97k94m13r6L47M69p6n14k87K15N07K26m21n13N1M93L85j62o19
2428b89k54M48N19J8m91m64J68O13K64l88n18j10N21N03j86n83k69L27N22J35
2448D86m72m64J00N38K75k59m89j49L80M40o3m47k64J81M11J79l06l88M2L11K55
2469B97p4l62j58K21K32O8j62k82J7K84J07q6j46j51R0K45J5j38q0p3Q9J81kj31
2493Ar6m7J45J83o2j91r0L5K03J58j79k56k2K07K35jl07k11J60L11J10j87l60
2516b61m9L79K94j47l72j96K29M33N2m21l07J33L83K44k30m84m9M02L12o2m19
2537a36k85K77M49N5l48l52L0M69K52k80m07n2K98L63m2m48k00K33L30J05k44
$$ plain form
2384 -166 -245 -83 177 245 26 -222 -211 13 217 224 -84 -263 -162 145 285 140 -212 -339 -10 299 263 -43
2406 -43 -338 -262 216 413 119 -294 -390 -43 426 350 -164 -451 -236 271 497 76 -437 -386 107 492 330 -289
2428 -289 -543 -95 424 442 -49 -513 -345 268 532 144 -374 -484 37 540 354 -229 -498 -171 351 486
2448 486 14 -450 -350 188 463 204 -285 -434 -54 386 323 -124 -388 -207 204 383 77 -311 -269 42 297
2469 297 223 -139 -297 -76 156 224 62 -220 -203 81 188 102 -44 -195 -105 140 155 17 -63 -136 -47 134 132 1
2493 1 -95 -142 3 186 124 -67 -157 -122 81 239 60 -196 -218 -11 224 223 -84 -295 -135 176 286 99 -261
2516 -261 -310 69 363 216 -156 -352 -123 310 362 -59 -366 -233 150 394 164 -320 -369 33 345 283 -136
2537 -136 -421 -144 305 360 12 -340 -310 159 411 131 -276 -328 -30 333 291 -157 -357 -124 206 311 67
2558F7l67L7L82J81j65k80j33K25L07n2k66j45P7K35J42k18j89M6J38R0lj73q3
2581a47J25Q1Pl8r8k4J11L7l7pm6k6O8K9RLr5o0J10Q9j6p8j20OK10Q3j46j34m4
2610a48J38J91k2k52j11J36J94Q5j82k63M0K95J38j18k64j38K45L09p5l02j56
2631b60J04L37J22l10k77J12K53J95j23l67p7L05K32m5k68k31J75L45K4k61j94
2652b09J2K95J96k23k77MK02K05l2k84j20J85K03J2j63j89N2K37P5j49j51rJ38
2675A0J26o5j58j9J04Q3%j04p4O9J05l7m6l2mQ9Oq0LM6j3Oj2m4O7M1q2m5K6M5
2705A1N8m3j20J0J25M7m6j19n8J39J31o4j28o4N3J91L7j98j27Q6J58P2r4k20J3
2730a50K12J07q2j94p1J50K21n1j98j03R5J93O9k03j69O8J96P6r2k23k2K16J39
$$ plain form
2558 67 -300 -263 119 300 135 -145 -278 -53 254 202 -64 -209 -132 103 245 27 -162 -116 22 112 109 -64 -147
2581 -147 -22 59 66 28 -70 -94 17 54 17 10 -36 -62 6 35 44 47 -48 -108 2 91 75 -3 -123 -117 93 176 30 -104 -148
2610 -148 -10 181 159 -93 -204 -68 126 211 29 -234 -194 101 239 121 -143 -281 -36 273 198 -104 -260
2631 -260 -156 181 303 -7 -284 -172 81 276 153 -214 -291 14 246 201 -67 -298 -123 222 246 -15 -209
2652 -209 -197 98 294 71 -206 -202 0 205 173 -111 -231 -46 157 169 6 -183 -131 106 181 32 -119 -128 10
2675 10 136 71 -87 -106 -2 81 81 -23 -97 -28 77 40 -6 -38 -42 47 53 -27 -24 22 9 15 3 -41 26 67 -15 -60 -34 11
2705 11 69 26 -94 -84 41 88 42 -77 -135 4 135 71 -57 -121 -68 123 160 -38 -165 -79 79 151 57 -163 -150
2730 -150 62 169 87 -107 -178 -28 193 142 -56 -159 -64 129 198 -5 -174 -106 90 166 74 -149 -171 45 184
2753A84r9j84o8J19K02j5k07r7R7J63N8j52j69N3K02N3r9j63k0J79J12r8j40l5
2777a24R5J54k2j68n9J04J07Or2j19O1J39J3r8r4MJ36N9j00r2K3Q8O4n6j05jJ05
2804B8M5l5q3l7Q6R1o3q3j4O3P2Jj11l5Q4N4kp7o8N6J03nj12l6M4R3K3r3q1M7
2834d5R9K8p6r1J7J14M5p6r5nJ01R9o4j27k2J00R8j5j39p6J11J43k2j25r3N5J63
2861A02L7j37j42M1J50R4r5j71j8J66J13n3j64r1J30J76k8j56j06O6J76O7j48
2884Ij63M7J55R6q1j78k3J39J29m1j47r3J08J63rj32r6M5J44O5j24j15K1J06P3
2909I8m6j20k7R5P5k6p8m8L6Q0kn1l6J0N7K2m6m2L8K2Mj6k4OM9j0n8K2L7Mj6l8
2941b9j9N8N8m6p5j7O8Q3k5j13l5P8R9Lj12j05Q1J30K9j03j09k3J61R0p9j46k4
$$ plain form
2753 184 85 -99 -167 -48 154 139 -68 -165 -68 95 153 1 -168 -115 87 140 41 -122 -142 37 149 51 -89 -124
2777 -124 -29 125 103 -65 -124 -20 87 93 1 -118 -57 82 95 -3 -97 -93 43 102 2 -90 -67 21 85 29 -76 -77 28
2804 28 73 38 -45 -82 4 95 32 -51 -65 -2 70 71 -40 -75 9 63 61 -16 -84 -28 75 70 -42 -78 -34 59 82 -11 -92 -45
2834 -45 54 82 6 -85 -68 46 91 15 -80 -85 16 115 51 -76 -98 2 100 85 -54 -130 -19 124 102 -23 -116 -61 102
2861 102 139 2 -140 -99 51 145 50 -121 -139 27 140 87 -77 -168 -38 138 110 -46 -152 -86 90 157 9
2884 9 -154 -107 48 144 63 -115 -138 1 130 89 -58 -151 -43 120 111 -21 -117 -72 72 137 13 -102 -81 25 98
2909 98 52 -68 -95 0 75 49 -29 -77 -41 39 37 -14 -50 -40 17 39 -7 -49 -11 11 15 -1 -25 -19 30 20 -38 -16 21 25 9 -29
2941 -29 -48 10 68 22 -53 -70 -2 81 56 -57 -92 -14 85 88 -24 -129 -48 82 111 8 -101 -124 37 127 48 -98 -122
2968a22R5J64pj95j07J10J68N8j46j93M7J95J02j02j88m4J74J63n5k02q3J08J75
2991A15N1j81j41N0J70R3j00j82k5J64J32n9j38q6Q4J57%j32q8L4J19Q6r4j17
3015h8KQ8P2kj06n9O5P1J5n0m6JN2L1k7k3j1j4L5J2j6J2l5k8M8L6j1k8l9j2O3
3046HO0m7o6l4M5R9J9j04q5M8J02P9q4j42j2J44J06m9j56q8J18J70pj51j15N2
3072i0J71J03j48j76oJ59J51l3k20j01J38J97Rj81j62O4K21P5j28j70l9J86J57
3095A77o7j91p7J11J76K7j68j45P1J62P8j01j67j8J38J22l7j36q2P7J31K6j06
3118Aq0J3Q3O6k6j06k9N9P1J0n6n1MM8K5jl7m6J7N6OJ4n0m9J5P8L2k9p5m5O5J09
3150I2j6q3q7K5J18R3r7j36j8R8J30pj62j04Q7J60N7j30j67J4J84J03q1j77q5
$$ plain form
2968 -122 -27 137 130 -65 -172 -62 106 164 18 -175 -128 67 169 67 -121 -165 9 172 117 -85 -168 -60 115
2991 115 166 -15 -156 -106 64 157 57 -125 -150 14 146 87 -51 -137 -53 104 104 -28 -116 -82 37 123 29 -88
3015 -88 -86 2 74 72 -34 -93 -28 43 58 8 -38 -37 15 46 19 -4 -15 -29 6 18 2 14 -21 -49 -1 35 24 -4 -43 -55 8
3046 8 68 21 -45 -79 -34 65 84 -20 -105 -57 45 124 40 -102 -114 30 136 87 -69 -157 -39 131 124 -27 -142 -90
3072 -90 81 184 36 -140 -146 13 164 131 -89 -190 -52 145 154 -27 -189 -125 96 171 43 -127 -166 20 177
3095 177 110 -81 -158 -47 129 156 -12 -157 -86 76 154 53 -114 -132 6 128 91 -45 -127 -50 81 107 1
3118 1 -79 -66 17 83 57 -49 -78 -19 52 62 6 -45 -41 7 32 31 -6 -52 -35 21 27 41 -9 -58 -43 35 67 38 -37 -82 -17 92
3150 92 76 -7 -94 -69 49 142 45 -91 -109 -11 119 112 -50 -154 -67 93 150 20 -147 -133 51 154 73 -104 -189
3175a89J56J86j1j91j39P1K09J01j54k11J5J82J61n1k39r4J66J99j1j73j71P3
3197a15K15P6j33j61m0J75J57o0j96q7J05J70L9j43j41K9J51Q8o1j45n1J08J22
3220A02j0j05q9K1J24N2n6r6k4N5J01%p1o5PN7O0Jr5o2M8P9N6n0r1l0O5P3L5r1
3250Aj06K0J14Q1n1j26o5R7J54Lj45j13L9J60J08j09j84k9J52J61j8k08j25J17
3274g2K02N3j59k02J4K21J46r7k30p9J56K29rk24j47P6K18J21j60k29j0K05J67
3297A90n9k32j05J47J99K6j76j55L8K06J00j15j83n1J54J65j8j66j08O2J52P8
3319A49j16j44j4J29J06j7j25r1O3J14N3q0r8k9Q4R3jr7p4LJ07Q9m9j13n1O7J08
3346F6L9q2j37OJ16J04k0j49p5P2J49M8j15j53rJ68J36o3j70j05J05K04M6j91
$$ plain form
3175 -189 -33 153 142 -49 -188 -117 92 193 39 -172 -157 25 186 135 -104 -198 -32 167 156 -17 -188 -115
3197 -115 100 176 43 -118 -158 17 174 114 -82 -169 -64 106 145 2 -139 -110 41 129 68 -77 -128 -20 102
3220 102 92 -13 -102 -81 43 95 39 -57 -81 -26 75 75 4 -61 -54 3 63 64 -31 -93 -45 34 90 40 -51 -81 -16 57 92 1
3250 1 -105 -85 29 110 59 -67 -132 -35 119 122 -23 -136 -97 63 171 62 -122 -151 1 162 144 -64 -189 -72
3274 -72 130 183 24 -178 -164 57 203 106 -124 -203 -47 182 173 -51 -198 -122 96 217 57 -172 -182 23 190
3297 190 131 -101 -206 -59 140 166 -10 -165 -127 79 179 64 -119 -170 -16 149 131 -35 -143 -81 71 149
3319 149 33 -111 -125 4 110 93 -32 -123 -60 54 107 27 -71 -100 -16 77 76 -21 -95 -92 15 104 55 -58 -109 -42 66
3346 66 105 23 -114 -108 8 112 92 -57 -132 -60 89 137 22 -131 -140 28 164 101 -69 -174 -69 135 181 -10
3370a0j77L8K13J38j08k46o2J92K05k1k22j69J01K52Q4j64k23j0K20K00r3k36
3392i8j32J64K34L8k28j91P5K20J22j19k31n2J92J85k5k03j42R7J94Q4j51j75
3414a42j9J79J46o1j61j14J01J69M6j29j52K1J34J12l7j43q1P4J31M9q9j27k1
3437a14J17J16k7j15r1M0J28Q1q7j28m0J02J22J3j36j15K9J68Q9q9j77m7J43J50
3461A32Pj68j60Q4J94R0j13k13n5K09J86m8k17j39R7K58P6j87k31J0K41J77r1
3484A39k62j01J61K50J2k16k15Q1K60J12j47k52k9J97K03l1k40j48J18K39Q3j90
3506B4k04J1K01J64q4k18j00J49J96L1j78j58K8J95J20p4j86q4J31J65J8j59j25
3529a37K5J55J26r4j56n9R0J50M3j43j24J1J30J11k1j72q6Q8J51N3j00j65j8J59
$$ plain form
3370 -10 -187 -149 64 202 94 -152 -214 -22 183 162 -60 -229 -128 124 208 44 -179 -189 31 231 138 -98
3392 -98 -230 -66 168 206 -22 -213 -138 82 204 85 -146 -198 -6 179 154 -49 -191 -94 100 184 33 -142
3414 -142 -161 18 164 103 -58 -172 -71 98 144 15 -137 -116 18 130 93 -50 -131 -57 74 123 34 -93 -114
3437 -114 3 119 92 -23 -114 -74 54 135 48 -80 -120 -18 104 117 -19 -134 -105 63 152 63 -114 -161 -18 132
3461 132 139 -29 -189 -105 89 179 66 -147 -202 7 193 145 -72 -211 -114 144 220 33 -198 -188 53 230 139
3484 139 -123 -224 -63 187 199 -17 -232 -151 109 221 74 -178 -207 -10 193 162 -78 -226 -108 131 214 24
3506 24 -180 -169 32 196 112 -106 -206 -57 139 170 -8 -166 -138 57 177 103 -83 -167 -36 129 147 -12 -137
3529 -137 -112 43 169 75 -81 -140 -50 100 143 0 -124 -113 17 128 107 -65 -151 -63 88 141 41 -124 -142 17
3553A7J37m1j72j07Q9J88P0j51j69qJ76J70p2k10j20J37K13O7k04k13L7K35J64
3576B33j09k39j13J89K38Ok42j94P5K61J29j65k45m7K23K29n2k47j66J25K56P9
3598B24j83k41J5K34J77q7k46j06J55K33J5j96j87N0K23J22j20k16n4J43K03J0
3620A68j98j37O6J76R7j00j94l7J43J50jj58j46O3J74Q6q8j79m9J33J55J4j65
3643b7j28L8J69J12q1j80o2J32J64J4j43j82M7J86J24q2j97r0J47J99J3j82j89
3666a98M9K27J23j17k30p0J83K21mk39j68Q9K57J18j75k47m4K48K07p1k56j53
3688b50J55K62O9k30k14K9K47J73j18k58r6J82K49lk26j92P6K44J38j52k49l7
3710b01J91J96k9k21j35Q7K20Q2j40k08j2J75J75l9k03j16Q5K11N5j32j88oJ70
$$ plain form
3553 17 154 113 -59 -166 -77 111 181 30 -139 -147 29 199 127 -83 -203 -66 147 214 10 -203 -166 69 233
3576 233 124 -115 -228 -39 199 205 -37 -231 -156 105 234 69 -176 -223 0 229 177 -70 -236 -111 145 224
3598 224 41 -200 -185 49 226 139 -107 -213 -58 175 190 -6 -193 -143 80 202 82 -134 -188 -45 158 168
3620 168 -30 -167 -101 75 172 72 -122 -159 -16 134 133 -25 -171 -108 66 152 64 -115 -164 -31 124 138 -27
3643 -27 -155 -117 52 164 83 -97 -159 -27 137 151 8 -174 -127 59 183 101 -96 -186 -39 160 173 -9 -198
3666 -198 -149 78 201 84 -146 -216 -33 188 184 -55 -223 -134 123 241 66 -181 -225 23 230 159 -97 -250
3688 -250 -95 167 236 6 -208 -179 68 241 123 -135 -231 -49 200 197 -29 -221 -145 99 237 85 -164 -201
3710 -201 -10 186 157 -64 -199 -112 108 190 50 -158 -170 5 180 141 -62 -178 -93 118 173 41 -147 -153 17
3733A7J41l8j76j07Q4J76P6j21j68k7J42J47j0j74j23O7J81P9j06j82l6J51J66
3756A59k2j86j39Q1J99R5j19k07n0J85J92l7k13j45J02K38Q9j72k27nK08K04p7
3779A53k56j21J39K61M6k25k12L2K54J66j26k57r2J84K48J1k38j96P8K72J12j56
3801G7k44n2K07K15m3k31j48J16K39P2j60k25mK01J79p0k09j11J20K15M8j73j79
3824a60K5J80J42o8k03q6J07J81M5j43j67J1J66J29n6j94p6J07J68N2j36j59l
3847a38J71J26m6j68j08J00J65P1j47j71%J62J56n4j90j07R6K14N1j60j96J4K01
3870D2J49o3k23j15J39K22M5k06j82K7K38J43j25k24q3J75K22Mk37j69Q6K44J18
3893B27j55k48k3K18J97n1k36j35J15K31O6j75k19K4K12J55q1k23r4J46K02J7
$$ plain form
3733 17 158 120 -56 -163 -79 97 173 52 -116 -143 -1 146 136 -38 -161 -94 87 166 60 -122 -158 -7 159
3756 159 137 -49 -188 -107 92 187 68 -139 -189 -4 188 151 -62 -207 -105 133 222 50 -177 -182 26 230 153
3779 153 -103 -224 -85 176 222 -3 -215 -183 71 237 111 -146 -238 -54 194 205 -33 -229 -151 121 233 77
3801 77 -167 -219 -12 203 160 -71 -219 -103 136 208 48 -177 -181 20 199 129 -80 -191 -71 144 192 19 -160
3824 -160 -135 45 187 119 -84 -170 -63 118 163 20 -147 -136 30 159 103 -91 -167 -60 108 160 24 -135 -138
3847 -138 33 159 113 -55 -163 -63 102 173 26 -145 -145 17 173 119 -71 -178 -82 132 183 23 -173 -159 42
3870 42 191 128 -95 -210 -71 151 196 -10 -192 -165 73 216 91 -133 -216 -41 181 185 -52 -221 -135 109 227
3893 227 72 -176 -199 19 216 165 -71 -206 -91 140 206 31 -188 -164 48 203 122 -101 -195 -49 153 170
3915A70j85j60L3K00J14r7j90o2J39J63L1j74j35L1J82J11j01j67o7J13J77J0
3937A36j39j34L2J58J07q2j69m2R3J62J0j41j32K5J52J12o3j66p8J21J61J0j35
3960bj50L6J59J27q3j72q4J28J81J0j62j61N0J82J33j13k06n5J63J97j1k18j49
3983b00Q4K26Q8j54j99l0K10J76q0k19j03J22K12N1j77j87J5K12J48r1k16p8J49
4006d1J72K4j70j52N1J97R5j00j97m7J60J50rj73j15O8J80O8j23j58k0J29J46
4029A35k1j54j08P4J50N7q8j41l4J30J23j6j36j03N6J45M9q5j29k2J07J32j8j34
4053c1j08N1J52O9p3j53l0J17J33mj56j09M8J85P5j09j71l1J47J55l8j81j13Q3
4077i2K03O0j50j67oJ82J45o2k05j01J43J99K6j80j72M9J98J17j10j98n4J55J89
$$ plain form
3915 170 -15 -175 -142 58 172 75 -115 -177 -38 125 156 -18 -153 -122 60 171 70 -97 -164 -51 126 136
3937 136 -3 -137 -105 53 160 78 -91 -133 -40 122 132 -9 -141 -116 36 148 85 -81 -159 -38 123 133 -2
3960 -2 -152 -116 43 170 87 -85 -169 -41 140 150 -12 -173 -123 59 192 79 -127 -182 -19 178 167 -51 -200
3983 -200 -116 110 198 44 -155 -185 25 201 121 -98 -201 -79 133 184 7 -180 -165 47 195 104 -112 -190 -41
4006 -41 131 155 -15 -167 -116 81 176 76 -121 -168 -8 142 133 -40 -155 -87 93 161 38 -120 -140 -11 135
4029 135 114 -40 -148 -74 76 133 45 -96 -130 0 123 107 -29 -132 -76 69 118 33 -96 -118 -11 121 103 -31
4053 -31 -139 -88 64 133 60 -93 -123 -6 127 123 -33 -142 -94 91 166 57 -114 -145 2 157 119 -62 -175 -92
4077 -92 111 171 21 -146 -152 30 175 113 -92 -193 -50 149 175 -5 -177 -128 70 187 77 -121 -175 -20 169
4100A69j5k01j24Q1J99O5j35j81nJ76J37m8j84r6J06J71L1j32j53K4J60R6o6j62
4124h7o7J00J62Oj18j24K6J45Q7o7j35o0R9J24K8j22j03K0J17Q7n1j35m6P2J28
4149H6K8j07r8oJ37Q5m4j33p5Q1J34L7j17j22KJ42J05m6j56q3J03J56L3j43j47
4174a48K8J78J07q4j77o9J43J65J1j74j45P1J93Q5j18j93k9J61J62l2k03j17J15
4197g0J82N8j41j83QJ88J33q3j89o9J17J82J3j60j39N8J64P9q9j66l7J34J41j9
4221A12j48j06O3J60N2r3j30k8J28J11k4j31p9N1J38K7p9j17j0J06J00j8j20p3
4245a08M2J21M8o0j20j3P9J05Mj15r1K6J23P6o3j28l3Q8J20Oj16j17M4J45P1q5
4271D9j42l7J23J46j5j56j08O3J55O9j13j62pJ43J48m7j78r9R6J79N9j59j61J7
$$ plain form
4100 169 154 -47 -171 -90 109 174 39 -142 -147 29 166 118 -66 -162 -56 115 146 14 -139 -115 45 141 75 -87
4124 -87 -154 -54 108 114 -4 -128 -102 43 130 63 -72 -132 -33 91 119 -3 -106 -86 31 118 67 -68 -114 -42 86
4149 86 114 7 -91 -97 40 125 81 -52 -127 -46 88 125 8 -114 -112 30 135 89 -67 -150 -47 109 142 -1 -148
4174 -148 -120 58 165 81 -96 -165 -22 143 154 -20 -165 -94 99 184 66 -127 -156 5 167 135 -68 -185 -70
4197 -70 112 170 29 -154 -146 42 175 92 -97 -166 -49 133 146 -14 -153 -95 69 148 59 -107 -144 -10 131 112
4221 112 -36 -142 -79 81 133 40 -90 -118 10 121 97 -34 -113 -62 76 103 24 -93 -103 3 103 85 -35 -108
4245 -108 -66 55 103 43 -77 -90 -11 94 98 -17 -108 -82 41 117 54 -74 -107 -19 101 107 -9 -126 -82 63 134 49
4271 49 -93 -130 -7 139 124 -32 -140 -77 78 147 34 -128 -135 8 156 109 -69 -168 -72 107 166 7 -154 -137
4295a37J76J23p6j91n7J27J66K0j79j36O3J86P8j17j60k1J41J36l2j60r2Q5J59
4318A02L4j23j37J7J28J15m7j43p2R1J30J2j06r7J8J17O2n1j13m1O2J23Nr0q2
4343h6JJ05P0l5r4m6M6R8K9o4j00PR2O5%j18p5N4J11L4n8j18j7J10Q9j6j18p9
4371a13N2J32N9j13j29j3J43R9l8j47p6Q4J51L7j25j28KJ73R7p0j68n7J21J53
4395A26j3j41j12O6J54O8j10j45j6J42J25m9j59q6R8J57J1j02j36J7J42Q1n4j41
4419g7l7J00J13%j24r0M5J27N5p3j08j6R1P0nr9o4M8R0L7o1q4oO6P4j6o4o0K7
4448d1P6L1l9p9k2N0P2J2o5n6KP0O2l1p8n4M8R0L1p5q7OJ01N4k0j05n0O3J13K2
4478A01j01r7QJ26P4o6j17l0Q8J12nj16j01O1J30N6r1j51NJ30Q8k6j36o5P4J35
$$ plain form
4295 -137 39 162 86 -105 -162 -35 131 151 -28 -164 -101 85 163 46 -114 -135 6 142 110 -50 -142 -57 102
4318 102 136 13 -124 -107 21 136 89 -54 -126 -35 95 107 1 -96 -78 39 101 50 -63 -104 -42 81 86 -4 -86
4343 -86 -85 20 90 55 -39 -85 -39 59 88 24 -76 -69 23 88 88 -30 -105 -51 60 94 36 -82 -99 11 100 84 -34 -113
4371 -113 -61 71 130 17 -112 -125 18 117 79 -68 -144 -60 91 128 3 -125 -123 50 147 77 -91 -148 -27 126
4395 126 113 -28 -140 -74 80 148 38 -107 -123 19 144 95 -64 -150 -52 105 116 14 -122 -105 37 118 64 -77
4419 -77 -114 -14 99 99 -25 -115 -70 57 112 39 -69 -85 6 76 71 -28 -92 -44 46 83 22 -62 -68 -2 72 56 -8 -68 -41
4448 -41 35 66 27 -52 -74 -24 48 60 -5 -61 -59 11 73 42 -36 -90 -42 48 79 4 -83 -77 24 78 58 -47 -97 -34 79 101
4478 101 0 -97 -89 37 111 45 -72 -102 -14 98 93 -23 -124 -63 67 123 32 -119 -114 16 104 78 -58 -123 -49 86
4504H6J4j10j05K8J25P1p7j29nJ04J06j3j18p4M7J13L9p6j13LJ15O4n1j00k9N9
4530b6Q4Np3n8J6O1N2m9m9j5L7N8Po6l6J4O3J6j2m8k4K7L4K1l5l5%K7L6J0l7l3
4562b8JN2L4k4m9l7L5O3%l7o5RP2M3l7q6k4O5O6Op0q2M1R3L3o5p9mP9Q0l1r7n0
4595i3O2J04J9r5p5J8R0O1m7j00l9Q9J02m0r0n3N3R7J8p7p9J3Q4N6m8q3k5P1O7
4624F0j5q3m3N1O8J0m4n9RO3M0l4n5j8M2M4Km5k9J8M2K1k9m0LK1J9qk3pRRMkl
4659bnJ2JKjjk3JJ6J6j0j5j2MK5K2m1j7OL6K8l1n6%M4L8Jn5l0L3O2Mo0k7oP0J9
4696D8l1n1j6M4N7j2o5m1N2N9Rn6n8K4O2L4m8o0j5P0O3l5n8m5N0P9j9m5n5K1P1
4727C3L1m9n5mO8L0l4m9j8N2M0nn9k9L3L7J1l5m0J5M6J2l2l5J0L8J7l1l0QK0J7
$$ plain form
4504 86 100 -10 -115 -87 38 109 32 -97 -102 2 108 95 -23 -97 -50 63 102 26 -87 -84 31 95 44 -56 -85 -26
4530 -26 58 63 -10 -68 -52 9 61 12 -37 -52 -15 43 50 -16 -52 -38 25 41 29 -19 -43 -16 18 39 4 -31 -31 -4 32 42 5 -28
4562 -28 -27 25 59 35 -14 -51 -16 47 47 10 -55 -46 26 69 32 -54 -78 -13 53 59 -11 -93 -52 41 74 9 -70 -74 5 85 54 -43 -93
4595 -93 -31 73 92 -3 -78 -60 30 91 44 -56 -95 -6 96 56 -34 -87 -34 63 81 4 -75 -62 22 78 30 -53 -78 -7 60
4624 60 45 -38 -81 -30 38 48 4 -55 -46 17 57 23 -32 -50 -8 36 38 -7 -36 -18 24 45 16 -24 -21 0 19 11 -12 -19 -10 -1 3 1 -2
4659 -2 -7 5 6 8 7 6 -17 -16 0 16 6 -9 -21 -17 8 30 -11 -28 -22 14 42 11 -45 -45 -1 37 38 -17 -47 -14 48 52 -8 -35 -41 29 48
4696 48 17 -34 -50 -6 51 39 -26 -67 -15 44 53 -3 -61 -37 25 59 11 -49 -64 6 69 34 -24 -69 -19 60 41 -4 -59 -38 33
4727 33 64 15 -40 -44 24 54 20 -29 -47 5 45 40 -19 -48 -15 22 33 -2 -42 -27 19 31 -1 -36 -26 12 29 -2 -32 -24 -4 13
4759A3Jk8lNJ7J7k5j1QK1oqj4J1J8qkj2%J3oj0OMKLj4lJ6Rnk4qK5J4j0k5j3K1
4798a1K3Qk5l4J8M2K0m1l5OM4L0j1n8k3N1M4rm7l2K9M9J0n7k9lO8L3n8n7RM9M6
4831D9qq5kL0O5Oo4n6M0N8K1m9o5J6O0N0l7n7k0M1O8qn3m8L1M6J4l7m8J8M9L5
4863F0m2m4jK6L9mm4k4J7L7K5m3k5oL7J6j5j9j0K1Pmoj6NJ3J0j0Poj6J0J2Kjk3
4899a5kJ5K1Lk8j5JL4J5j4m2pL3K5nm1m6M5N3Rm7m6NP1L6l6n9k2M6P2j6p0m2M1
4933b8P6K3p4n8LP4N7m1q3k4O6P5j6p4n9M7R1J7p7o6OP3O2l0q6k5N7N8Ko1n5M0
4965c0O2K7l8p4lN6N0k1m9l1L5N4Mm2m1J5N2Rj0n3k3L9M2qk0l0kL2K0Kl5k4J6
4998a9J8J8%l1k1K3M3lk1m8J1M0K6j7l6l4K7N8K7n6n3LN2N1j0q2l5N2P4J3o1q0
$$ plain form
4759 13 14 -14 -17 -12 5 22 -3 -14 -6 15 9 1 -13 -2 16 8 6 -6 -6 7 1 -9 -3 1 3 6 -8 -11 5 14 9 -15 -23 2 16 6 -19 -32 -11
4798 -11 12 20 -5 -39 -21 21 41 0 -35 -29 15 45 34 -24 -47 4 48 39 -8 -40 -11 38 48 -9 -38 -41 27 60 2 -55 -46 3 49
4831 49 41 -44 -46 -16 49 55 -9 -65 -25 33 54 5 -60 -44 16 66 29 -28 -48 -7 61 53 0 -48 -17 29 43 6 -42 -24 25 60
4863 60 18 -26 -27 -1 38 34 -10 -34 -17 20 45 2 -23 -29 8 24 9 -10 -20 1 8 4 -2 -18 -13 0 10 0 7 1 -15 -5 7 9 8 -15
4899 -15 -17 -2 19 22 -6 -21 -20 14 29 15 -27 -34 -1 24 19 -22 -68 -23 30 39 -8 -54 -49 22 58 22 -37 -59 -13 59 43 -27 -69 -28
4933 -28 48 71 -3 -61 -58 16 73 32 -51 -75 -9 66 50 -24 -83 -36 55 72 -5 -71 -65 8 70 40 -46 -71 -14 44 46 -15 -70 -30
4965 -30 32 59 21 -53 -56 0 50 29 -20 -51 -16 38 42 0 -41 -26 26 35 25 -28 -51 -12 30 22 2 -28 -30 2 22 24 -11 -35 -19
4998 -19 -1 17 17 -14 -35 -12 31 28 7 -41 -30 10 36 19 -17 -51 -24 34 61 5 -48 -45 7 58 48 -34 -69 -17 57 70 9 -71
5030g1J1R2N4n0j01j2P1Q2mr9o7N1Q3M4p2r1jR9P5m6j07l4P9Q8rp6p6K6J14K9
5060H2n5j00mQ1P5k8q0m7L5J06J1o9p3MP5M8k6p3j8M3N8jn2m2JO6J6j9m7j3J9
5091b7N4Pk9m8JN3L8j5n4k4J9M1L6l3n4j8N4N0rm3n3J1O4L0l5o0k3N2P8mo8n7
5123f6J1R4M4n2j02rP0R0j8j12n0N5J05L1q0j07J0J09P5l4j25m4P8J26j1r9r0
5150a01L5J23M4p1j04k7J03R4k2j15o6N7J06K2p9r0OJ10O9m5j05k7O2Q3J0q1o6
5177g5K9P0N0m0p6k9N2Q9k2n7n1J3P0L4l1p0rL5O6jm5n2PM9M2j7o1l2L1N4L7m6
5209A4p6J0M9N6mp3n7L3Q9K8n9p3qP7P5k2q9o6N2J10K8p6j14J4J06P0m5j08l9
5238i8P2J23lj03r5K6J42M2q6j01l1J16R8k8j32o0O2J28L6j16r2J1J19O7m7j13
$$ plain form
5030 -71 -60 32 86 36 -65 -77 -6 76 72 -27 -94 -43 40 84 12 -79 -80 19 94 48 -59 -93 -14 74 65 -11 -87 -61 53 82
5060 82 27 -73 -77 4 79 51 -29 -76 -41 65 76 7 -66 -62 13 61 35 -38 -56 -13 45 44 -8 -50 -49 17 33 14 -33 -46 -27
5091 -27 27 34 5 -43 -42 11 49 34 -20 -44 -25 16 52 19 -35 -53 1 51 42 -1 -54 -43 21 51 16 -44 -67 -15 63 59 -9 -66
5123 -66 -55 39 83 31 -71 -80 -10 80 62 -50 -100 -45 60 91 11 -96 -86 23 98 64 -61 -105 -27 99 88 -11 -101
5150 -101 -66 57 101 30 -74 -101 2 96 74 -41 -107 -50 56 78 -1 -91 -85 25 94 49 -56 -83 -21 62 72 -9 -75
5177 -75 -46 24 74 34 -42 -71 -19 70 48 -9 -60 -47 23 57 26 -44 -53 -18 48 47 2 -50 -43 6 48 31 -30 -62 -31 23 60 14
5209 14 -62 -52 -3 53 49 -24 -81 -48 41 69 10 -63 -71 6 81 59 -30 -96 -44 66 94 18 -96 -82 24 94 49 -59 -98
5238 -98 -26 97 94 -9 -104 -78 64 106 20 -81 -112 4 102 74 -58 -118 -56 72 108 -8 -100 -89 30 97 50 -63
5264f3n0R3J14Mj07q1M0J03N0p7q6k5P7Q5%r7o6L7R9M3o9q7kN6P3j3o8n6K2Q8
5294C7K8l6p2k3O1O0Lo4n9J5Q3L6l4p7k2M4Q3K3p4p3NQ3P0n2q2n3P7R3Np7r6J0
5326g8J11P0o1r7m8Q2J16pj05q2L6J16O7q1j23k8J18J04k0j32p6P6J24M2j15j14
5352a05QJ34Q6n4j23o6J03J22J0j26j02M4J19P5p8j17l0R8J02j5j21o9M8J17L4
5377I4p5r6j2J04Q1j9r9p2N8J02L0p3r4KP4P5k4p8n8M2Q7N0q6o9j5Q7N0Kp9o5
5407g6L3Q9L9n0q2l3P5Q7j4q8p8L3J11M3n4j16j5R0J03j1j17r0O4J19N8r0j21
5434i1MJ02J03k9j45o7Q1J39L5j28j21K3J36R1p7j41m9J10J34nj27j16N8J37P6
5459A33j01j26k0J15J21l6j30q2Q0J24M3j03j09pJ19Q4m7j16n5P8J11K7r7q2J
$$ plain form
5264 -63 -113 -20 94 98 -9 -90 -50 53 103 26 -60 -85 -8 77 77 -20 -86 -49 50 93 24 -63 -65 -9 64 51 -17 -73 -51 37
5294 37 65 29 -43 -66 -5 55 58 -6 -65 -50 33 69 35 -42 -64 -20 63 86 12 -61 -56 27 97 45 -37 -90 -13 80 85 8 -88 -78
5326 -78 33 103 42 -55 -103 -21 95 88 -17 -99 -63 53 120 39 -84 -112 6 110 90 -42 -118 -42 82 124 9 -105
5352 -105 -97 37 123 69 -54 -120 -17 105 115 -11 -113 -69 50 125 47 -70 -100 -2 100 85 -36 -105 -57 60 94
5377 94 19 -77 -89 15 96 77 -22 -94 -36 66 96 23 -71 -69 5 80 56 -22 -80 -38 49 99 13 -56 -71 16 66 68 -11 -76
5407 -76 -43 46 85 35 -47 -80 -5 82 68 -20 -98 -65 46 89 35 -81 -96 -6 97 86 -31 -121 -57 62 120 30 -91
5434 -91 -87 15 118 89 -56 -123 -42 97 132 4 -117 -94 42 133 56 -85 -134 -24 110 105 -22 -138 -80 57 133
5459 133 32 -94 -114 1 122 86 -44 -126 -46 78 121 18 -91 -98 21 105 58 -58 -113 -35 76 103 6 -76 -75
5484g5J09N6k7j16m3P0Q9J3p6p7oJ04O7m0q6n1O8Q3J8o9q9NQ6Q0l8r4n0N2R3M1
5514I7p9q9j7R7Q7j5j18o2N0J20L0q4j10mJ28R7m3j35o5O8J38L0j27j15L3J18
5540C0R5o2j51m3J13J25nj30j11N2J53O4q7j35k5J34J15l7j38p8P4J34N7j30j19
5565a05MJ28J04n3j32o7Q5J34J0j14r5K9J12P2o2j20l3Q8J04Nj06q5L0J00O3n9
5591C7j12k0P0R0J0q4q7L5J00N6n9q6l6P4Q6J0q9p8J9R4O3m6r8n0O6J03K4j07
5619a5q1OJ15P5m6j23l6P1J22K6j15j12L8J27P2p2j49k6J06J35j4j26j07O2J44
5644G7O1r7j44j2J46J04m4j48p7Q1J46K3j04j40L1J41R1p5j26o5J05J38Kj34r8
5669a18M8J12Q5q1j29k8J11J07j4j18q4M8J25M8p5j20mQ6R9k4j06o5M7J08L7o7
$$ plain form
5484 -75 34 90 63 -53 -96 -26 63 76 0 -77 -83 21 88 48 -38 -89 -21 62 80 11 -78 -73 13 93 55 -39 -89 -37 56 97
5514 97 18 -71 -88 9 96 81 -37 -99 -49 71 101 17 -93 -97 31 128 85 -50 -115 -47 91 121 -6 -121 -88 30
5540 30 125 63 -88 -131 -18 107 102 -28 -139 -87 66 130 43 -92 -117 17 132 95 -43 -121 -47 87 144 14 -105
5565 -105 -101 27 131 78 -54 -121 -36 98 108 -6 -101 -72 40 112 50 -70 -103 -15 89 94 -12 -97 -67 33 96 37
5591 37 -75 -95 -25 65 75 -9 -96 -61 39 95 36 -50 -86 -12 74 84 -5 -83 -64 30 93 47 -51 -101 -35 68 92 -15
5619 -15 -96 -90 25 100 54 -69 -105 -34 88 114 -1 -113 -75 52 124 52 -97 -123 -17 118 104 -22 -129 -67 77
5644 77 138 41 -103 -115 31 135 91 -57 -134 -53 93 116 12 -128 -97 44 135 60 -66 -131 -26 112 114 -20 -118
5669 -118 -70 42 127 46 -83 -111 0 107 93 -25 -109 -61 64 112 37 -83 -87 -1 98 74 -32 -97 -50 58 95 28
5695B8j01j2R1P6j5q3o8M6Q9L8n7j03k4R5Q1qr4p6K9J22L9n7j11j7Q2J05j6r5
5723a6q6M0J12O5p2j24k3J00J14k2j09r3O0J26N0j01j19jJ29R3m3j42n4Q3J30
5748I7K5j24j17K1J30Q8n5j51m3J17J20kj29r5L4J47N7q4j35j1J23J02k6j34p1
5773a16O7J19M5q8j03lR9P6l1j22n0O3J04M3r2r6J9P7P1l6r5m4N7J01J3p8p8J3
5801f5Q6O2k5r5m9O0R2J8o9q4PQ2O8k7r6n0M7J02L2p9q8qR7P0l5r5o3N9J14K4
5831I2r4j00J4R8R7m8j14o1Q0J19Rr8j01L3J26O3o6j26k8R4J19j0j31o6M6J19
5857F6M6q1j20lJ19Q3l8j22o2P4J07K1r6r4J5J06Q7n8j09l9Q1R3J2r6q8J8J15
5884C7N2m9r7k8P3R0Jr0o5K6Q5M4m9q4l0P2O9oo8n8K1P7M4l6p8l8O4P6Rp2n8j
$$ plain form
5695 28 -73 -85 6 82 67 -16 -84 -38 51 89 32 -71 -95 0 81 73 -21 -97 -68 54 93 36 -75 -92 -10 95 79 -16
5723 -16 -102 -62 50 115 43 -81 -104 -4 110 88 -21 -114 -54 72 122 21 -98 -99 30 123 80 -62 -116 -33 97
5748 97 122 -2 -119 -98 32 120 65 -86 -129 -12 108 106 -23 -118 -84 63 120 36 -99 -110 13 115 89 -45 -116
5773 -116 -49 70 115 27 -76 -79 20 96 65 -57 -107 -44 60 103 11 -85 -66 11 82 46 -49 -93 -36 65 78 0 -78 -65
5801 -65 21 83 58 -37 -86 -26 66 84 15 -69 -62 20 88 61 -35 -85 -38 64 96 17 -71 -79 18 88 53 -42 -105 -46 68 92
5831 92 -2 -102 -88 10 107 59 -55 -116 -36 83 92 -6 -107 -74 52 115 49 -77 -105 -11 108 98 -33 -99 -53 66
5857 66 112 31 -89 -92 27 110 72 -50 -112 -38 69 90 -6 -100 -85 21 108 50 -59 -98 -17 76 88 -8 -96 -78 37
5884 37 89 40 -57 -85 -12 78 79 -11 -76 -50 35 79 30 -54 -84 -12 57 51 -17 -75 -54 23 67 31 -47 -85 -21 55 64 -8 -66 -67
5916f7R6M1l5q5m0O8Q5lo2p9K3Q1N8m5r0k7O9R1Kr5p8L2R9N8o4r3l8R1Q8mj08
5947c1p5O0Q8N1q3q1j5Q7Q5l3j05m6N8J04J4q3j01K3J14O8n5r2l3P5P3J1q5p8
5975h5K9R8M0m8q7k8Q1P4rq3n7L6P2L9n9p3mO6P3k9o9m5L4O4L7n9o3qN6N3ln9
6007a6m0J8O2L8m7o8mN4M9Qn8n3K2O7L2m6o2k3N5P2ro2n9K7Q1L6m9p6j4O2P4j7
6039E4q2n8M0Q9L5p7o9JQ6N1k9p6m7N0Q6J3o6o6J4P3O2m7o3l5N8Q2j8o8p5L6P6
6070C0L9n8o0j6O2O4k1n8m1K2Q1J1m9o6nP0M4j9o3k2L2N7J5m4m3lN0N0l3m3l2
6101d9M4L9J1l6m7KM2M8k0l9m6L3L5K0m1m2%N2K3rn0k3K8N6Om3m0JN6L5j4m7m0
6134e5K5O8Nl2m3NL6L9k1n4k3K8P1mm3n7J6O1K2k9n2j5M9M7mm8n4K6O2K4m1n1
$$ plain form
5916 -67 29 70 35 -50 -90 -22 63 60 -2 -81 -58 23 81 36 -54 -81 -12 79 81 -14 -92 -60 39 97 33 -60 -98 -7 81 77 -31
5947 -31 -106 -46 42 93 10 -71 -86 1 86 53 -52 -98 -40 64 78 -5 -106 -83 31 99 44 -48 -81 -6 67 78 -7 -85
5975 -85 -56 42 82 34 -53 -81 0 74 65 -18 -75 -39 33 72 13 -60 -64 2 75 46 -23 -68 -34 30 67 8 -55 -63 -7 46 43 -16
6007 -16 -56 -38 24 62 15 -53 -57 -3 46 54 -4 -57 -35 32 64 18 -44 -67 -12 60 51 -11 -70 -43 38 74 25 -51 -65 -3 71 54
6039 54 -28 -86 -46 43 78 1 -68 -67 19 70 41 -35 -82 -32 54 67 1 -65 -51 22 84 37 -26 -61 -3 79 61 -7 -82 -46 30
6070 30 69 11 -49 -65 -3 61 40 -18 -59 -37 44 55 6 -60 -65 5 49 30 -33 -55 -23 34 49 5 -38 -41 9 59 26 -17 -49
6101 -49 -5 34 45 9 -38 -36 6 54 34 -5 -51 -18 17 37 -4 -46 -46 6 29 20 -30 -53 -25 31 37 -6 -46 -45 11 46 32 -15 -55
6134 -55 -30 38 43 11 -32 -27 9 48 27 -27 -50 -22 49 45 2 -55 -39 22 44 15 -37 -52 -3 44 40 -8 -62 -36 26 50 9 -42
6166d2pM4L9nn3l1L0N9Nl7l7JM4L3k4l6k8L5L3Ok2m6PL6L8k2m1jK6K3Nl3m1K1
6200b1L0Okk8qJ5L0pj3k5j6L9J0j1k6j4L3J7J3k5k3MK9L0j9l4nK6K2%k1l2LL2
6234IK7j6m3j0K1L5Jk0m3J3L8K0j0m3j4K4L2J1m4j6NM2K1k8m8ML4J9jm1j2K7K2
6267A6J3l2j9%K6L2k2l6oK5K7ok3k5J6K4Pj0l0MJ7K2jl8kRJ8Mlk4j7M0OMk2j7
6303b3J8K4mj2jNmM%mj0LJ6Oqrj0J3J0Lj5j5PJ5Mlj9rPJ8Lqj6lL2Mj5j8%J6J4
6344A6qj1j3OL7j1j7kkJ6MJj4j5J9J3Jj5j9oK4N%k9jJ8J0qlj7J0J9Lj4j2lK0J4
6382A6k1jj1PK3krj2QK2qLj9ONKKk0OPKkj5J1omJ7qLnjKJmKqLMOmqJONNlk3J4
6430eJ0JlpOqJ5Kj6LRpJ5rk0kJ3ONj5Pj1J5Pj2j5KJ7qQjj4NJ6j3Mj2QJ0Mj1nL
$$ plain form
6166 -42 -49 -5 34 29 -24 -55 -25 34 39 2 -35 -34 10 43 19 -17 -45 -10 23 29 7 -39 -32 4 42 20 -21 -22 4 27 32 -1 -42 -21
6200 -21 9 15 13 -15 -23 -8 22 15 2 -23 -39 0 10 -1 -27 -41 -8 9 22 -3 -26 -22 7 37 18 -16 -21 5 27 27 6 -26 -23 9
6234 9 36 20 -23 -33 -12 23 24 4 -39 -26 12 32 22 -21 -35 -11 21 32 -12 -28 -23 19 40 12 -36 -32 2 21 20 -21 -33 -6 16
6267 16 29 -3 -22 -22 4 36 14 -22 -28 -3 24 18 -5 -30 -14 10 17 7 -23 -19 -2 20 19 -19 -21 -12 6 10 7 -17 -34 6 12 16 -6 -23
6303 -23 -5 19 15 3 2 7 3 7 7 3 -7 -4 12 18 10 1 -9 4 14 17 2 -13 -6 9 13 10 -9 -18 -11 7 10 2 -14 -17 15 19 4 -14 -14 2 16
6344 16 8 -3 -16 -10 27 16 -1 -3 -5 11 15 16 2 -13 6 19 20 5 -14 -20 4 9 9 -20 -21 -3 7 -1 -4 -21 -11 8 11 -3 -15 -18 2 16
6382 16 -5 -6 -17 -10 13 11 2 -10 -2 20 12 15 -4 2 7 9 11 -9 -3 4 6 4 -11 0 -6 -10 7 -1 2 -3 -4 -2 -1 -5 -3 -11 -8 -4 2 -2 -10 -9 -3 2 7 4 -19 -5
6430 -5 5 6 3 -4 2 -6 9 11 -5 -2 7 0 15 6 -14 -16 -3 3 8 -7 0 -11 4 11 -1 -16 -14 3 -5 3 2 -12 -7 9 -4 0 -12 -4 6 10 -1 -6 -3
6473cLJ4j4oRPQj4npJ3jLkp%JNk%MqRjj8K2j0MJj0J1omKJlMJ0j0MjQkj3J4j2K
6520@RnKLj4OJloJ2Jjklj4J9Mj5MJ2j7jJ1j2NQoJ3j4pNNpRqQLrJ0j7J3Pkj9J5
6565Cj%JmOqQnKj1RnOjJj4J2OpLKjJ5j3j0MKNqOoJ5pj1OjmRJ0j7RoMPJqmQmJ6
6615B0j3j6NPoJ1j9J7qLJ3k0QrJ7j2j3NPQKKj0JkJkKKJ0Nk2Jj0O%J2%lkJ2j3j
6658dKKMj0OLknJ3j8K%MmOoNJ2qqqJ5lJ2omNLkJj6QOjKj6OjOppQL%LrjlJ5Mlp
6710ckJ1mrpMJ3k%pnQPNj2noJ2JMj2lJ2J%k0J6mJ6j1noNkJ3j0pKJ0nJ2j6LMqJ8
6756FmoJ0%roJ1k%KkMmOqKKK%rnJ2%llllQnJ0njKLopLKMOj0qQJ5Nj6OpJ9j2qL
6808aj0RJ7pkpNJ4rj3mONmonMQONj3rMK0nql%JJQj1JqK4pj8PJ1pPKj1MMOj0Rl
$$ plain form
6473 -3 0 14 0 -6 3 10 18 4 -1 -8 5 4 7 5 -2 -2 -1 4 2 2 6 -2 7 6 -12 10 0 4 5 -5 6 0 -4 -2 -1 -4 0 10 0 4 3 11 9 -4 10 -2 0
6520 0 9 4 6 9 -5 1 2 -1 -7 5 6 5 3 0 -14 5 9 -6 -2 10 -7 -8 3 -9 -4 4 -2 11 -3 -10 -5 0 -7 2 -6 2 5 -4 6 -11 2 9 7 -12 3
6565 3 2 2 3 -1 5 -3 5 0 2 -9 0 -5 1 0 1 -13 -1 5 -2 1 3 2 17 4 -6 -2 0 5 -3 3 -3 12 5 -6 0 -1 -5 4 14 -3 6 0 4 11 12 4 0 8 4 20
6615 20 7 -9 -4 3 -3 8 -11 6 -2 1 14 -6 2 -7 10 -2 -15 -10 -3 5 7 9 -1 0 -2 -1 -3 -1 1 11 16 -6 -5 -15 -9 -9 3 3 0 -2 10 -3 -4
6658 -4 -2 0 4 -6 0 3 1 -4 9 -9 -7 -7 -3 -7 -1 -7 -2 10 2 -6 -14 1 -2 10 4 0 5 8 6 7 -9 -1 5 4 6 -10 -4 -5 1 -6 -13 -5 -2 -2 1 -8 -9 -12 3 7 4 -3
6710 -3 -5 6 2 -7 -14 -10 3 1 1 -6 -11 -3 4 9 -3 -8 -14 -2 -1 3 -9 -12 0 1 1 -19 -3 -7 9 -2 -7 -13 -8 -10 3 -7 -14 -12 -2 -7 5 -11 -8 -4 -12 6
6756 6 2 -4 6 6 -3 -9 2 0 0 2 0 4 0 6 -2 0 2 4 4 -5 -10 2 2 -1 -4 -7 -10 -2 -7 3 -2 -3 -1 2 -4 -11 -8 -6 -2 4 -6 -14 -6 9 14 -2 4 -3 16 4 -4 -1
6808 -1 -11 -2 15 8 6 -1 4 18 9 -4 -8 -2 3 -1 -7 -12 -8 0 6 11 -2 -11 -7 13 8 0 -3 -3 -2 -1 7 -4 -3 -11 13 6 -12 -5 6 -1 6 8 -3 1 5 11 1 10 7
6857Gj1RJ0rrmJJ0LrJnJ4Nj0j0Rj6J2LrKjJ6Np%qmJ6por%OKPrmJJ1Qrj1kJ1LL
6905Fj1j3J4J6Mj8k0QLQOkk2J4J5mj3j1QJ3J1ok3OJ5J6j4lj0NKPj1j2NJ6J7k4
6943bPj0RmpLj1QMJ6j7%%J2jJj4j4RJ1nJ0lj2PJ9Jj9KjqJ5qJ7k3jJ4Noj6kNK0
6986A1orqlK0Jj4m%J5J0j0j0oK0lJ0pk0PJ0Mj2rjJ0J7mj5LnK4lj8j0RJ4NKk8j2
7027b5L0Rmj3j0JJ9Onk7NJ1J2nj2%pJ7kJlqJJ9mj9%LJ9Qnk2KLJ6jLj4lJ9j1qJ
7070cj4J6Nkjj4MJ9Lj4j3oJ8J1J1k2j6jK3J6pk4QkQPpj5LJ7J6j4j7lRJ8qj6oJ
7110a2K1Pj4k6MK4Qmj2rLJ5Rj7j7MK5J1j3j9kJ2K2Pl4nJ1J4J5j6j4oJ1J5qj3l
7147fnK1Qj7k6J4J3NNj4k5PK5J3j1k1MJ7Nlpj7J0RJ3mk0lJ0K1rj7j2%K6Nqj4K
$$ plain form
6857 7 -4 5 15 6 -3 -7 -6 4 7 -2 -1 -6 8 13 3 -7 2 -14 -2 1 -8 -6 -7 9 14 7 7 -1 -5 11 4 -2 -11 -11 -5 -3 4 -5 -9 -8 3 11 2 -9 -11 0 3 6
6905 6 -5 -18 -4 12 16 -2 -22 -14 -11 -3 3 1 -21 -7 8 4 -9 -20 -12 1 12 6 -17 -11 4 20 6 3 -7 -2 0 7 -4 -16 -11 5 22 -2
6943 -2 5 -5 4 0 -7 -4 -15 -7 -3 13 -4 -4 -4 8 7 8 -6 -20 -11 0 -5 5 2 -10 -3 16 17 -2 0 -1 -9 6 -2 15 -8 -9 5 10 4 -12 -14 -9 11
6986 11 5 -4 -12 -15 5 6 -8 -12 -12 3 13 3 -7 -13 7 4 14 7 -13 -6 4 8 -4 -13 -14 -4 13 9 -6 -3 -8 16 13 -5 -15 -6 8 13 15 -13 -25
7027 -25 5 14 10 -3 -13 -12 7 13 8 -19 -14 -3 9 4 -8 -8 -15 2 0 1 -2 -10 -9 10 6 -13 -13 -10 9 17 12 -10 -8 -5 11 10 13 -1 -4 15 4 -4 -3
7070 -3 -17 -1 4 2 1 -13 -9 10 13 -1 -14 -20 -2 9 20 -2 -18 -19 4 20 13 -11 -3 -5 3 10 3 -12 -9 8 24 10 -7 -10 -1 17 9 -7 -13 -12
7110 -12 9 16 2 -24 -20 4 12 8 -4 -13 -10 5 14 -3 -20 -16 9 20 7 -12 -14 -2 20 27 -7 -12 -1 13 28 12 -2 -8 3 18 10 -3 -6
7147 -6 -11 10 18 1 -25 -11 2 7 12 -2 -27 -20 5 18 7 -14 -10 7 12 9 2 -15 -5 4 17 13 -7 -10 0 21 12 -5 -17 -17 9 14 6 -8 -6
7186fRJ6kj0j4lK1Mok8J1J4PRl4n%K3Rj3k3J0J4J9j2k1j0J7J2Qj2k3J7MK1jm2
7223b0nJ5L2j7nj3mL0lkj9kJ6J9qj6j9J0J7Nok9QJ4J4kk1rRJ8lNk8nK3J9ok1o
7262a5J2K3mj4j4JJ2J6%ok3PJ3J1ok5MJ0J2pj8j2RK4Prk3j0K4J6jk6j0J9J4Nk1
7299ej3NK7Pj4j6k0J2L5Mj7k8J3J4J3lk3oJ4K8j6nk5JL1lnk5j0K0J4Nj8pLK6L
7336A6j8j7PRJ8j1j4j6J2J9J2j7j9POK5%l5kJ0J4K4l1j7PJ2OMk2j2J2J9mok4Q
7372a8J9MJ0k6j4K3J1Orj9mJ4J8j3nj5J7RJ6k2k1OJ4J8j0k2j3QK7Nj7k0J1J8J2
7407A8kl0j1K3K0kj3k3kJ8L2j8k8mK3J4oj1j8OK3Lqj1oJ9OMj4j2KK8%k7j4LK4
7444FJ0rj8j0J0K2rPk6NJ2J0mj0j8J4K3Kj4k1QJ1Qj3kpJ5QJk2lLJ9J1rk0%LK3
$$ plain form
7186 -6 3 19 17 7 -7 -10 11 15 9 -19 -8 6 13 22 -12 -17 -17 6 15 2 -21 -11 3 22 10 -11 -21 -4 8 16 4 -19 -2 2 23 22 -20
7223 -20 -25 -10 22 5 0 -13 -17 13 10 8 -11 -13 3 22 14 -2 -21 -11 6 11 5 -24 -16 -2 12 10 -11 -20 -11 7 4 9 -19 -24 -1 18 12 -9 -15
7262 -15 -3 20 16 2 -12 -11 1 17 17 11 -12 -5 8 19 13 -12 -8 2 14 7 -11 -23 -14 10 17 8 -15 -25 -1 15 14 -12 -22 -3 11 16 -5
7299 -5 -18 -13 14 21 7 -9 -29 -17 18 22 5 -23 -10 4 17 14 -9 -15 -1 27 11 6 -19 -18 13 10 5 -20 -30 -10 4 9 -9 -16 -13 13 16
7336 16 -2 -19 -12 -3 15 4 -10 -26 -14 5 17 0 -19 -12 -6 19 19 -16 -18 -8 6 30 -1 -18 -11 1 7 11 -11 -23 -11 8 4 -2 -26 -18
7372 -18 1 5 15 -11 -25 -2 9 15 6 -13 -17 -3 15 2 -3 -18 -1 8 24 2 -19 -13 1 19 9 -13 -26 -18 9 14 -3 -23 -12 6 18
7407 18 16 -14 -25 -2 18 16 3 -20 -22 -4 28 10 -18 -22 1 15 9 -2 -20 -14 9 12 4 -7 -13 6 12 16 2 -10 -8 20 20 -7 -21 -18 6
7444 6 16 7 -11 -21 -11 11 2 9 -17 -12 0 10 6 -4 -22 -8 15 17 3 -18 -10 1 9 -4 -6 -13 2 10 11 -11 -14 -11 8 19 10 -10 -10 -7 16
7483A6Oj6l2MK3J1rj5j1J6K4jl0j1J0J3J6ok4jK1J2Lj8j2QJ4Nlk5JJ3K1j1k4j7
7519b9K1K6Oj7j8oK8kKj1k6J8K3Kk2j4J3J6J4j3k8lJ3J5jqk3J4K0Mlj2j0J6J6
7554B1Jj8j6JK1Prj8qJ7%K1k9j2KJ5J4k0Nk2J8K4j6pm%J8Jpj5rK1PJ3k4j2RJ4
7592DK2j4k2%J5J3Jk5j8QJ9Qj4j3MJ6J8j0k5pJ0J4Nmk1%J5J6nk2KNJ8jj6j2pK7
7630DOj6j1%J6K2mk6JjJ5Njk8%K1J4Ol1jKK4mj7nmJ4QLk3j6J3K5Rk5j6J0J2J2
7669A3lj3n%K5j0Jk0MJ9lRk6j1QJ6J7k0k0%K1J3qnk4J2L0lk4nlK2J4j6k8LJ3J5
7707HJ1k9j6J6J7K1k5j9j5K1K8nj8j2RK4Lj3k4JJ9J0rk5j2J7L0%j3k4kK6K2k4
7741bj1j5K5J3kj4j8%J2K0qj4qK0Nkj3pmK4kJ2j4j3J3J8Nk8rjJ5J9j2k5%J7K2
$$ plain form
7483 16 22 6 -26 -22 1 12 3 -12 -23 -7 17 16 -14 -25 -15 -2 14 8 -16 -17 4 16 19 1 -11 -3 11 16 13 -12 -11 2 23 12 -12 -29
7519 -29 -8 18 24 7 -11 -17 11 9 11 0 -26 -8 15 17 -5 -19 -6 10 24 11 -17 -20 -7 8 7 -1 -24 -10 10 14 11 -1 -11 5 21
7554 21 22 4 -12 -11 10 17 8 -10 -18 -1 -1 20 -9 -21 -19 -4 10 -10 -5 -27 -9 15 -1 -8 -12 -12 6 7 0 -15 -24 -3 4 17 -7 -19 -10 4
7592 4 26 12 -10 -10 5 18 19 -6 -24 -16 3 11 -3 -16 -12 4 22 12 -13 -20 -10 4 9 5 -16 -16 -1 15 10 -12 -10 -5 13 12 -4 -16 -23 4
7630 4 10 -6 -17 -17 -1 21 17 -9 -8 -9 6 11 10 -18 -18 3 17 23 -8 -9 -7 17 13 -4 -9 -13 1 9 12 -11 -27 -14 11 20 -5 -21 -11 1 13
7669 13 10 -3 -8 -8 17 7 8 -12 -8 11 8 17 -9 -20 -12 4 21 1 -19 -19 2 15 7 2 -22 -10 20 17 -7 -12 -15 7 21 5 -23 -20 -7 8
7707 8 19 -10 -26 -10 7 28 3 -16 -31 -10 18 13 -5 -17 -8 16 19 6 -18 -17 2 12 3 -22 -34 -17 13 13 0 -24 -26 0 22 -2
7741 -2 -13 -28 -3 10 8 -6 -24 -24 -12 8 0 -14 -22 -2 3 1 -12 -19 -23 1 -1 11 -3 -16 -3 15 20 -8 -17 -18 -3 16 4 -21 -21 -4 18
7778A8qj7j3%K4Rj4j9lJ3J7jj5j8J5K4J0j3k9qK5K4qk2k5J9K6J8k7k8J5J0K5j3
7812A1k5oJ1K3Rk0l1QJ6K4nk9nRK5Kl4j3RK1K4l2k3KK9K3nk0j5MK9Qj7k4oJ9K6
7849B2lk4j9NL2J1j6k2oJ7J8rk1rJ6J0J5rl7nK4K1Jk8JjJ8J8k2rqJ9K0Ml4oJ1
7886eJ4J0j8k2jK4J3pj8j3J8J5Jj1j2qK0J9j5j9j4J7K1J4l0l0J2K5L0j8l0j2K3
7919gK2mk1j0rL7J4j6k5j2K5K6rk8oJ3J9K1k4j4j3L0J7j9k2pJ5J2J5k6k9%K6K0
7953A1j4k4pK9J6Mj9k4J1K7Rpk1JjK7rok4KJ5K6j1k6lQK0Nj6k0%K2K2j5k6j2K1
7990iK0Nl0j8J2K2J0rj9j1J8K3J0l2k0QL1J8l4qj5L4K3%k8l3J6L2J0k6k2j0L3
8023AK9j2l3k8L0K4Lj7k0%L4%J7m0k1K4L2Rl1k5KK6J3j0j9k3K7K2Mk6j0QK6J6
$$ plain form
7778 18 10 -7 -20 -20 4 13 -1 -20 -23 -10 7 6 -9 -27 -12 12 22 9 -20 -28 -3 21 13 -9 -34 -15 11 29 2 -26 -11 -1 24 11
7812 11 -14 -20 -9 14 23 3 -28 -20 -4 20 15 -14 -19 -10 15 17 -17 -30 -21 0 24 -8 -31 -29 0 23 18 -2 -17 -13 16 24 7 -17 -23 -4 22
7849 22 19 -5 -24 -19 13 24 8 -14 -20 -3 15 6 -15 -24 -8 2 17 8 -29 -34 -10 11 12 -16 -15 -16 2 20 -2 -11 -19 0 20 24 -10 -16 -5
7886 -5 9 19 1 -21 -22 2 15 8 -10 -23 -5 10 11 0 -12 -20 0 19 4 -15 -29 -12 9 23 -7 -37 -25 0 30 12 -18 -30 -7
7919 -7 15 11 -10 -20 -29 8 22 6 -19 -31 -6 20 11 -17 -23 -10 9 30 6 -8 -21 9 26 7 -15 -22 -7 5 20 -6 -35 -35 -9 11
7953 11 -3 -27 -34 -5 11 15 -4 -28 -17 10 19 12 -9 -8 -9 18 9 3 -21 -19 -4 22 11 -15 -18 -10 10 15 -1 -21 -21 1 23 8 -18 -30 -9
7990 -9 11 16 -14 -32 -20 2 12 3 -16 -27 -9 14 24 -8 -28 -20 11 29 -5 -13 -28 6 29 29 1 -32 -16 16 26 0 -22 -32 1
8023 1 30 18 -15 -43 -13 11 14 -3 -23 -23 11 11 28 -12 -33 -9 23 32 1 -24 -22 4 17 7 -12 -35 -8 14 18 -8 -18 -10 16 32
8057C2k0k5JMJ9Lok7jK9Qrk3jOK6nk1k4J5K4J1j7j8jJ9J7j1j5j2J2K0Jj0k9JK0
8094gK0Pk6k1K1K2J2j8l0nK0K7Jk9j9J7J2K0k2j9lJ5J3Ll5oJ3K5Qj6l7J4K2J0
8128Ijl6j1K8K6J3l4k0qL5J7j4k4j6K9K8ok8j0jK7J5j0k9MK1J7Kl5j2LK9Jml2
8163b7NK2QMj9j2PK5jnk7lK7NJ1k4k0J3J3K2k6oj1J4K2j1j2j8
$$ plain form
8057 32 12 -13 -12 -8 11 14 8 -19 -20 9 17 8 -15 -16 -10 16 11 -10 -34 -19 5 16 -1 -19 -20 -1 16 5 -10 -22 -10 10 11 1 -28 -27 -7
8094 -7 13 20 -6 -27 -6 16 28 10 -20 -25 -5 22 23 -6 -25 -8 4 24 2 -17 -20 -5 8 11 -24 -30 -17 8 16 0 -37 -23 -1 9
8128 9 8 -28 -39 -11 15 28 -6 -26 -34 1 18 4 -20 -36 -7 21 15 -13 -23 -24 3 18 8 -21 -17 4 21 23 -12 -24 -21 8 9 5 -27
8163 -27 -22 0 8 12 -7 -19 -12 13 12 7 -20 -23 4 9 20 -4 -24 -11 2 24 -2 -8 -19 -5 17 6 -6 -24
8191b4
$$ Imaginary data points
##PAGE= N=2
##DATA TABLE= (X++(I..I)), XYDATA
0@%%%%%%%%%%%%%%%%%%%%%%%%%%%%%%%%%kNpQqQrJ3j7K1k4K4k6K9l2L7m2M8n2
52b6N7o2O6p1P4p7Q0p9P2o0L5J4j02K75o42J534m394K7278J30736j22231j00744
73f8267L5224k2419O2386Q6800p7950q6302K1309N3153N1090k2620o3486m022
85c5104K0440M3571M0244p7414o3427O9100L8689j2013J1806n5905o0133P2815
97g331P8998l5848o3504j3241J7186J9316L4480J9167n8200n9426L9081O7530
109C8208J0617m1492m6797Q594M2168K0419q77m5299l8349N9330M0792m2283o922
122a891j4210l4559P3978M8264q6330k7970L2867j0175L8913M1293o3127n4286
134e7233K1320N1844L8546l7707n1029J5220N387J3675N2969l3810o7650L0193
$$ plain form
0 0 0 0 0 0 0 0 0 0 0 0 0 0 0 0 0 0 0 0 0 0 0 0 0 0 0 0 0 0 0 0 0 0 0 -2 3 -4 4 -4 4 -5 8 -9 12 -12 12 -14 15 -17 20 -22 26 -26
52 -26 31 -31 35 -36 38 -39 41 -38 34 -26 9 23 -79 196 -446 1088 -3306 23972 154708 32477 -68267
73 -68267 -33043 -55462 6924 93724 15774 -70528 -49219 3934 55024 32404 -31082 -35104
85 -35104 -14664 28907 69151 -8263 -71690 -2590 36099 24086 35892 -20013 -80146 -7331
97 -7331 71667 35819 -27685 -40926 -23740 -4424 30056 49223 -8977 -68403 -29322 38208
109 38208 48825 7333 -39464 -30870 11298 31717 30840 -14459 -52808 6522 47314 5031 -1891
122 -1891 -16101 -50660 23318 71582 -14748 -42718 -9851 -20026 18887 60180 -2947 -57233
134 -57233 -35913 15931 54477 16770 -34259 -19039 -13652 23 52992 19182 -48468 -18275
146a8275L0360R21K3596l9027n6129N1628N4806k5551l2687k3088n32N2854L5471
159E4347l8827o0626r515N7626N3496k0783n7232k6052K0088M9722L2132l1214
171B3162o2963j0407N7384M2371k2312m5095k1358K3786M8922J530m7686k0684
183c3350J6466K7611K4270k1046m7571o35L6363K8767R60m1569l2695K5462L4925
196A7958J3539o998m5031k4819M4647L5761j3760k2267k2436r65L5899J5496k1562
209E462j7890p089J1405K8287p69l0084j2199J3383K3007J1321k1604k7443N106
222a9107K4112J7695j803k7731k2982J5621L0462Q884j4250k5055j2761J9190
234g725K8022K311k1023k2145j000K6104K0297j3650k5023n985J5307K1445J774
$$ plain form
146 -18275 12085 13006 36602 -2425 -58554 -6926 47880 22329 -10358 -33446 -33978 18876 54347
159 54347 15520 -45106 -54621 3005 56501 35718 -21514 -47566 -27478 22244 54376 23162
171 23162 -39801 -50208 7176 49547 27235 -17860 -39218 -15432 33490 35020 -12666 -33350
183 -33350 -16884 10727 34997 13951 -33620 -34255 2108 30875 31835 -9734 -42429 -16967 17958
196 17958 31497 24499 -20532 -45351 -704 35057 21297 -970 -23406 -24371 11528 27024 5462
209 5462 -12428 -19517 -8112 20175 19406 -10678 -22877 -9494 13513 24834 3230 -24213 -19107
222 -19107 5005 22700 20897 -6834 -29816 -14195 16267 25151 10901 -14154 -26915 -7725
234 -7725 20297 22608 1585 -20560 -21560 4544 24841 11191 -13832 -19817 -4510 16935 18709
247A8709k4038j7529J1264K4975J1561j8038l0219k213L0240K4797q403l2812
259a1706k1247J7670L6822J1052k6726l2502j441L0970K6749r534l3062j5545
271b8500J8648K8190N125k3365k3912O457K8622J3345j6982k6123m540K4822K4101
284B5888p899k8734j5611J4226K9665R772k3213k6398P7K3706K1839n474k6606
297h762j4094J2515K1832P711j5082j9288J046J7183J1474n645j6251o829J1736
310b454J4327o6j3610j2427M506J6964Q113r251j5892o092J1810J6726J922j3678
324H98j4462m45J5272J3651l630j5113j0239M971J5357P876q779j3946l260J0445
338a404J2118j071j3144q629O410J3605M465j0878j3961M96J5809J2314o833j8504
$$ plain form
247 18709 -5329 -22858 -11594 13381 24942 6904 -23315 -25528 4712 29509 21106 -11706
259 -11706 -32953 -15283 21539 32591 5865 -26637 -28078 2892 29641 20107 -12955 -28500
271 -28500 -9852 18338 23463 98 -23814 -17357 11265 24610 7628 -18495 -23035 1787 25888
284 25888 17989 -10745 -26356 -12130 17535 27307 4094 -22304 -22227 1479 23318 17844 -8762
297 -8762 -22856 -10341 11491 19202 4120 -15168 -14122 3061 14535 8890 -7361 -14190 -2454
310 -2454 11873 11807 -1803 -14230 -9724 7240 15353 6102 -9790 -15882 -4072 12654 14576 898
324 898 -13564 -14009 1263 14914 11284 -3829 -14068 -9097 6260 14136 5357 -8589 -11849 -1404
338 -1404 10714 9643 -3501 -12130 -5720 7885 12350 1472 -12489 -11993 3816 16130 9297 -9207
352i207q532J2010J9648M117j7110j8313J723J9738J5401p514k1848r143J3592
365e438J8697K554j6063j5785M357J8972R008j1447j7146k188J6257J4919o381
378A0316j9308p689J1616J7632M346j6346j8086L697J9455J1878p498j9564q351
391a7902J4212J6354k64j2089j2342J048J5899Q128r324j0848k254Q142J1484
404A0244k910j2940k948N697P480N597p843j3375K319J2056O163k745j0914o998
418a1117P452R470J859l298r048n545Q301R482q50o037o759j124Q845N986m868
433B749n661j873J075P487M506r168p862N839P162J254k079p635m858P584R539
448H059O62q572j1593K242J5734N184q343r071n614P494J4903k129j1954m037
$$ plain form
352 -9207 -17739 -5729 13919 18036 926 -17387 -15664 4074 19475 11961 -9887 -19030 -5438
365 -5438 13259 15813 -250 -16035 -11678 7294 16302 4855 -12291 -14479 1778 16697 10316
378 10316 -8992 -16681 -5065 12567 16913 567 -17519 -13822 5633 17511 10013 -9551 -17902
391 -17902 -3690 12664 12400 311 -12031 -10983 4916 13044 3720 -7128 -9382 -1240 10244
404 10244 7334 -5606 -8554 -2857 4623 10220 2377 -10998 -8679 3377 9540 6795 -4119 -11117
418 -11117 -3665 5805 7664 4366 -4682 -10227 -1926 7556 6706 669 -6090 -7214 1631 7617 2749
433 2749 -2912 -4785 -3710 3777 8283 -885 -8747 -2908 4254 5508 3429 -4206 -9064 -1480 8059
448 8059 8721 149 -11444 -9202 6532 11716 3373 -5698 -11312 -3818 11085 8956 -2998 -7035
462g035n79Q464J2873r024j6238M547R744L635J136j0491r661R728J2117L53q737
477H32j3510J962J9324M568j2241p544k986N500J4853K24j4926n807M304P965
491B518Q384n839j4592J061J1890L772l915o499l685N461P076l32n500o964J183
506e981J1967K131j0285j467J818k809P983O900j1948o518O849J459L168L977
520G244j0374n109R704J424k778L243l998m924N252L716p33k369m962K546O547
535D429k719k132N42n305L166J0078m926q361K190J245K937N678n508o886K735
550b837J555L280N878p025r325M956O531J830l64q617m072J0376L961n457p78
565a08l524k671J1003M429j1816m547M957L586N095j161j1028k705Q406O843P05
$$ plain form
462 -7035 -7614 850 13723 4699 -11539 -6992 2752 6387 7523 -2968 -12629 -2901 9216 9569 832
477 832 -12678 -10716 8608 13176 935 -6609 -9595 -4095 10758 10982 -3944 -9751 -5447 2518
491 2518 10902 5063 -9529 -8468 3422 7194 3279 -3220 -6905 -1444 5632 5300 -200 -7164 -5981
506 -5981 5986 8117 -2168 -3635 -1817 -4626 3357 10257 -1691 -8209 -1360 99 3267 7244
520 7244 -3130 -8239 1465 2889 111 3354 -644 -5568 -316 3400 2667 298 -4664 -2118 4429
535 4429 1710 -422 120 -5185 -2019 8059 3133 -5228 -3038 -1793 1144 6822 1314 -5572 -2837
550 -2837 -1282 1998 7876 851 -8474 -3518 3013 4843 4479 -4138 -8210 2166 6127 670 -108
565 -108 -3632 -6303 4700 9129 -2687 -7234 -2277 1309 6404 5243 -5785 -8490 -84 6759 7464
580G464q575r072N994J0468K35n030o875j908R817M708p091k466o8j633P553L901
596G422j0522l380O954J735J052m48p823j72Q385P58k564j539m749J862P586j392
612C165m195K61j887P34N108q94l010l9j888J793N054l068m197K627Q12j64J927
629B139k689k017L306pp40K132l061k701M466J394j861Q90k598k610M738K713
645C494k453j117k353q79N331J740l844r94q48n62M945J663n265k010J710K026
661E84L283j952o409J157N878Q88j889l464l054M286N861j891m869k690Q76O128
677B723L126n532m485R71K873M382N6o742k287M907L080k96k772l953J749N437
693C237j50l666j869j2L085L102k350l801k66J772L071J213l845k879K094K228
$$ plain form
580 7464 -1111 -10183 -4189 6279 6514 1484 -5391 -7299 2518 7226 135 -2331 -2399 -4032 3521 7422
596 7422 -3100 -6480 474 2209 3261 2813 -5010 -5182 3203 3961 1397 -142 -4891 -3029 4557 3165
612 3165 -1030 -769 -2656 -1922 3186 2292 -718 -757 -2645 -852 4202 1134 -3063 -436 376 212 2139
629 2139 -550 -2567 739 732 -8 2124 -937 -3638 828 2222 361 1251 -1347 -3957 781 3494
645 3494 1041 -76 -2429 -3308 2023 3763 -81 -1075 -1923 -2485 2460 4123 -1142 -3152 -1442 584
661 584 3867 1915 -4494 -3337 2541 3429 1540 -1924 -4978 -692 5169 3278 -1591 -4281 -3405 2723
677 2723 5849 317 -4168 -3197 -324 4058 4114 -2628 -4915 -8 3072 2776 4 -3949 -2200 3237
693 3237 3087 -579 -2448 -2460 625 3727 1377 -2424 -2690 -918 2153 3366 -479 -3358 -1264 964
709I64R14p1k959j579L018J619j399n42o65l86J857M62j790j61N56O7Q79l02j461
728i79L52P23O4O36m69j215N42L74k01J096J0j540k09K82M38J607j99k375o40
747a703J262J317P93j254k200L25K066R72p23j866q69J869K055q18k383q63J616
764d04K334J70k556k148J083K964J385j921l238m60L121K481j059k847j597J493
780a199L151N22k759k037Q36K529J405j886k785M05K675J377j182k518q28K117
796a77K291k06k333k010J006K957P65k044j896O1J794J540q08j951l91J303J230
813A131k71j473n85J109J106k83j114o28O11J140K12q74q31jR06P80n48r53J05
832d61N97N8k12j64J39L91j94o16k9N53N88Jj017o31Q40R52r1p41p34K17J082
$$ plain form
709 964 1878 1807 -1152 -2731 287 1906 507 -35 -700 -1086 771 1233 -557 -718 -162 -95 784 482 -979
728 -979 -627 96 160 796 327 -888 -346 28 -173 923 933 -607 -816 -534 -96 1511 1312 -1063 -1703
747 -1703 -441 876 1669 415 -1785 -1460 606 1578 855 -1011 -1880 -11 2044 1226 -1157 -2020 -404
764 -404 1930 2100 -456 -2604 -1521 1443 2828 907 -2331 -2791 330 2811 1752 -1095 -2692 -1199
780 -1199 1952 2474 -285 -2322 -1486 1043 2448 562 -2223 -1818 857 2234 1052 -1466 -2294 -177
796 -177 2114 1908 -425 -2435 -1429 1528 2293 249 -1647 -1586 208 1748 940 -1011 -1402 -99 1131
813 1131 860 -613 -1198 -89 1017 734 -380 -1008 -397 743 955 81 -750 -751 155 935 387 -566 -461
832 -461 136 194 -18 -182 -43 348 154 -462 -491 62 650 651 -366 -997 -157 795 704 -37 -771 -554 528
853E28K94q08p25Q1R65P23q46j322J42J412Q98p54j602m47J348J571k04j753j090
872a589Q16J768O69j506j685N39J582O61o13j592n55J788J288r04j458p44J137
889c98K165m63k217m95P53J379J163j638k088Q28J553O78k13j963p84K116R44
906A320r26p02p70M87J833k15j617m21M67J266P68j645j292R66R76L54j59j416
924g26n78J418R54n76q52m83M95J185o8j383k04J105K58l46j97o69J42J340n0
943G65j117k77J50P83P24j186p15R18L9P9M87j239k29J642l18q64K98n89O23J564
963A538j606j361J484L63j89M79j236n69J507J95m02o1j152M62J901q45j401N25
981c68J96M73R02j322j353J194J104J0m71j447k48K044P61j431q69K0O22J265
$$ plain form
853 528 822 14 -711 -630 335 1058 212 -1110 -968 444 1342 588 -1014 -1461 -113 1458 1254 -499 -1589
872 -1589 -773 995 1664 158 -1527 -988 594 1255 642 -950 -1505 283 1571 667 -791 -1535 -398
889 -398 1767 1304 -913 -1408 -655 724 1887 249 -1839 -1011 542 1220 1007 -956 -1740 376 1320
906 1320 394 -308 -1078 -591 1242 1027 -590 -1011 -544 722 1490 -155 -1447 -481 495 849 690 -726
924 -726 -1304 114 1068 492 -360 -843 -348 837 769 -614 -818 287 545 199 2 -667 -525 815 765
943 765 -352 -629 -479 304 1028 -158 -873 45 84 163 650 -589 -818 824 506 -358 -60 -649 -26 1538
963 1538 -68 -1429 55 418 229 708 -528 -1097 410 605 203 142 -1010 -548 1353 508 -893 -368
981 -368 -172 301 1203 -119 -1472 -278 826 836 365 -1082 -1330 714 1475 44 -825 -805 -183 1082
999A082k43j542j74O58O42R05j141k098J321K119q29q66m06p97J596J780j804
1016B03j523O25M73J171M69k206p91J716O04k2m48j463M27J625j68m40o29j078
1034a455J536J823j782j409R33K97O11N99j709p32J540K63k37K28j210k39J743
1051H00j34j079L72k16r1J149n25j095Q14K11l12P04p06r51J457M48j269J55L42
1070G4k14N95l70p66Q73K25o32M28l47o44J254L95j245p0J70L3J179k17j742K40
1090g81J155R6K15o38j439R04J786m88j223m64J32J417Q05j668j077P99O21P75
1108I27K10k043q48K002J022n27q15j397M59K384l9j698n09j24J115J622j247
1125D94j845N29Q61Q27L99j895r79J684P78k08j55j557k99K141N36j207o84m34
$$ plain form
999 1082 839 -703 -877 -219 423 1328 187 -1911 -590 1529 700 -166 -572 -1369 227 2007 203
1016 203 -1320 -695 -222 949 1418 -788 -1579 137 741 719 271 -1192 -765 860 692 252 -377 -1455
1034 -1455 81 1904 122 -1287 -354 -57 554 1153 -556 -1288 252 515 278 506 -704 -943 800
1051 800 666 -413 -41 -257 -348 801 276 -819 -5 206 -106 598 -108 -1059 398 846 -423 -268 74
1070 74 -140 455 85 -681 192 417 -215 213 -134 -778 476 871 -374 -444 -274 -241 938 721 -1021 -781
1090 -781 374 470 685 47 -1392 -488 1298 810 -413 -877 -745 672 1477 -191 -1268 -469 152 927
1108 927 1137 -906 -1754 248 1270 743 -72 -1469 -1010 1374 1335 -363 -872 -996 119 1741 494
1125 494 -1351 -822 39 866 1265 -630 -1609 75 853 645 490 -1067 -1366 775 1311 104 -580 -1014
1143a014P23J560n64j405M8L99N77O03q90r85O55O80ko5o13m39Q16N97n71l39
1163b29P9j26L69M38n85l58M95l9j65K91j29m6J68m74J1P24j22l34q0m61N25R28
1185H80p01p10K19k6O97P03j330q59R49O18K87k09j500j89J730N84p12r17p82
1204a268Q69J732k23j545p81M34J494Q10j316j513K67J325J020m36j687o84J316
1221a86J431j25j396j174O00J791N26j338j315R9J279J208m93j733o05J186J304
1238A059P0j297j182O32J464L05p96r88k95J087J055n44j101l04N24R37K39r72
1256a07o93M13O38L16j91p17l03N92M89q4l56l49P1L52J09Ok9m32j34M93K35j12
1278B07j64l99o8O21K88k79l71m07K10R41J49q05o06P5Q28P71n27j110l03O95
$$ plain form
1143 -1014 -291 1269 705 -700 -652 -253 324 927 37 -948 -293 387 385 320 -293 -732 84 681 110 -229
1163 -229 -150 -276 93 531 -54 -412 83 44 -121 170 41 -5 163 -311 -300 424 302 -32 -112 -573 -48 880
1185 880 179 -531 -312 -338 359 1062 -268 -1127 -178 440 727 518 -982 -1171 559 1143 431 -486 -1268
1204 -1268 -399 1333 1110 -435 -1216 -782 712 1522 206 -1307 -1040 285 1305 869 -818 -1502 -186
1221 -186 1245 1120 -276 -1450 -850 941 1467 129 -1186 -1087 192 1400 907 -826 -1431 -245 1059
1238 1059 1129 -168 -1350 -718 746 1051 255 -733 -1028 59 1114 570 -531 -835 -311 626 865 -107
1256 -107 -800 -387 251 567 376 -341 -644 -52 437 353 -3 -352 -281 71 180 186 157 -275 -409 84 319 207
1278 207 43 -356 -424 197 485 206 -165 -572 -362 579 728 -77 -683 -608 220 991 464 -646 -949 -254
1298b54J186J80j428j005P51J240N05q01j454r6J385J048l83j485q70J030J637
1315A186J20j447j337M76J801P12j096j539k87J484J488n46j741p88R63J683K63
1332A395j496j206L03J416J085q31j711k00J211J158l0j532r52R73J208J90p36
1349B45j213KJ332N78m62q28o53O80J127j69o86m31k01P54P78n63o37j17J60O54
1369C50K50o29k98L4R1N72J89o49l40P2L52N94j19p92k86L33N95M35m95r29j14
1390g84Q14Q21j53j037o23M55J070N52q53j261k6J174J077l67j585o34J094J246
1408I80J99j164j437M35J724O25q37j489n92J566J614o70j584p45O11J795N94
1425A625j643j376L10J383J290o66k082l16J475J127Rj296j366O81J732M24r92
$$ plain form
1298 -254 932 1112 -316 -1321 -570 670 1175 374 -1080 -1176 209 1257 874 -611 -1481 -451 1186
1315 1186 1306 -141 -1478 -1002 799 1511 415 -1124 -1411 73 1561 1015 -726 -1514 -551 1132 1395
1332 1395 -101 -1307 -1004 412 1497 666 -1045 -1245 -34 1124 1094 -438 -1390 -417 791 981 245
1349 245 -968 -966 366 944 482 -346 -999 -319 808 639 -47 -478 -679 75 853 290 -347 -464 -304 350
1369 350 600 -29 -327 -293 -202 370 559 -90 -430 -358 -6 588 469 -323 -609 -276 319 754 259 -670 -784
1390 -784 30 851 698 -339 -962 -507 563 1115 262 -999 -1025 149 1226 859 -726 -1360 -266 980
1408 980 1179 15 -1422 -987 737 1362 525 -964 -1556 10 1624 954 -630 -1375 -764 1031 1625
1425 1625 -18 -1394 -1084 299 1589 923 -1159 -1475 0 1127 1136 -160 -1526 -845 887 1311 319
1442C19j347k64J481J209p14j311m71O39J273L10j158r68K80R04P94l17j313l55
1460a009R94O67j15m24p32q9R60M95m65n50l30K49Q13J41n68l88j93L34Q42J0
1480F42q44m30J25O59P60n03j087mN38N64M99p01j316K95J266N04l94j116p11
1499a254J038J310j84j042r46R0J561R44j178j414n2J068J341j23j802q23R79
1516d87J265O15r85j900J20J981R16q18j520q01J303J760l18j478r27K46J676
1533F48J082j388j658J78J221J194j38j790r09J196J302K30r20j494N8J731Q01
1550A344r05j117m08P77J248k0j111o60J61Q77Q71n44j253q6P63O37J93p73q68
1569h74L73Q17K60r7p28o88P04R00j41m11n16m38Q15R24l65p66m87O0J133O46
$$ plain form
1442 319 -1028 -1292 189 1398 684 -627 -1098 -459 814 1124 -34 -1002 -722 182 976 659 -654 -1009
1460 -1009 -15 652 537 113 -619 -708 252 747 282 -268 -598 -349 464 605 37 -351 -544 -210 632 642
1480 642 -202 -632 -507 152 912 409 -678 -682 -144 420 919 218 -1098 -803 463 967 573 -543 -1254
1499 -1254 -216 1094 910 -132 -1078 -988 573 1517 339 -1075 -1127 -59 1282 1159 -643 -1466 -487
1516 -487 778 1393 408 -1492 -1372 609 1525 707 -813 -1614 -311 1449 1131 -347 -1274 -1028 648
1533 648 1730 342 -1316 -1138 83 1277 1139 -651 -1560 -364 938 1168 248 -1246 -1188 543 1344
1550 1344 439 -678 -1086 -309 939 919 -192 -852 -691 186 1057 513 -740 -826 -63 574 767 -6 -874
1569 -874 -501 316 576 479 -249 -937 -233 667 526 115 -401 -839 -24 900 535 -231 -718 -658 475 1121
1589A121r98q86N6N62R84J09j310p19N95R28O93o21j594r9J433Q56k85j163j098
1608a436P57J771K06j282j171j1J461J285q38j678l97J012J448K71j580j363O53
1625h92J603P70q99j769k98J687J248n46j407r65P68J798L20j456j164J49J277
1642B24J230o56j738l55J114J090K40j165j302M94J446M77o48j132m64J058J110
1659A023l06r44o20J96J074N83p39q92j27N75R08P7j010o02L54O70N64k96j024
1678e36k83O92O54K00n71r71Q9J001N01k83p77o87N15J190J79q58q27j07R86J029
1698A136m48j298m70O87J157L99j060j277K19J323Q91n32j490n97J121J366Oj259
1716a26j197L75J631P73j032j448k72J252J423l06j697p89Q69J414M88j165j511
$$ plain form
1589 1121 123 -763 -707 -145 839 948 -362 -1081 -486 442 1135 514 -1080 -1179 254 1110 825 -338 -1436
1608 -1436 -679 1092 1298 16 -1155 -1166 295 1580 742 -936 -1333 -321 1127 1398 -182 -1545 -892
1625 -892 711 1481 582 -1187 -1485 202 1450 904 -503 -1468 -700 1098 1418 -38 -1202 -1053 224
1642 224 1454 798 -940 -1295 -181 909 1149 -16 -1318 -824 622 1099 451 -681 -1145 -87 1023
1659 1023 717 -227 -847 -651 423 1006 267 -625 -752 -177 731 808 -202 -804 -450 220 784 488 -536
1678 -536 -819 -127 527 727 156 -815 -726 275 776 493 -284 -971 -456 734 913 55 -772 -879 107 1136
1698 1136 688 -610 -1080 -393 764 1163 103 -1174 -955 368 1259 727 -763 -1360 -239 1127 1133 -126
1716 -126 -1323 -948 683 1456 424 -1024 -1296 -44 1379 1073 -624 -1413 -544 870 1358 193 -1318
1733a318J88J551R22o02j492o67J134J453p3j277j035L18J453P80r37j295j94
1750a091J010J141j33j293p57O08J082M45p05j122j05J000Q16k36r54o40M77J014
1768E57K81o48q22j21P29P84j47q46n14K73Q16M76n18q55j56N84P64J15q40p73
1788h61L04R19M63m16r59l69P71R31J3q67q56K02J150O44o25j128l83Q77J193
1807A003n2j230q60M50J254O53q39j374j17J211J031k86j302q14P34J405L52j116
1825A03j240J32J388R30o82j396m79R99J325J0j351r69N25J290O19q05j340j59
1843a100J190R69k68j164p64O13J253L14r21j015K4J072P98m59j040m11N73R78
1861F42K19q47q08J70P98O10k73r19l91N84P57J44n96p28K9P53N48k38p40m15
$$ plain form
1733 -1318 -1130 421 1343 741 -751 -1418 -284 1169 1096 -181 -1216 -898 555 1335 398 -897 -1091
1750 -1091 -81 1060 927 -366 -1123 -515 567 1012 307 -815 -920 80 896 660 -294 -934 -457 557
1768 557 838 190 -632 -753 -24 760 613 -233 -747 -474 342 818 300 -555 -711 -127 637 752 -88 -861
1788 -861 -557 362 825 409 -550 -919 -148 783 796 -71 -927 -725 425 1069 444 -684 -1067 -190 1003
1807 1003 951 -279 -1139 -689 565 1218 379 -995 -1112 99 1130 844 -458 -1272 -538 867 1219 103
1825 103 -1137 -1005 383 1313 631 -765 -1244 -245 1080 1090 -261 -1230 -705 585 1204 399 -941 -1100
1843 -1100 90 1059 791 -373 -1137 -524 729 1043 122 -893 -869 203 1001 542 -498 -909 -336 642
1861 642 861 14 -794 -624 174 784 511 -408 -799 -215 542 686 90 -638 -609 144 692 454 -286 -701
1881g01M04P73K01n74o35r8O39P11j72q53m58M00Q03L77o10q97m6Q06P04j26r36
1902b88o57N17J017K91o94r78p7J043Q01l85j032n61N95J202K35j093r24K59J073
1921C44P47n82j241l08R44J012j4j116r27N27J275L82q12j078j17J090R20l88
1939F58j134n47O19J133K68j015r23K60R78O49m36j106l42Q11Q73Lq29p90L09
1958e61J018L54n51p55k39O36P96r6p93m65K24P19M48n09p35m3N08N28N9o47n20
1979f24K59O04L19k60o83k47N50N74om84n72L0P56M74l75o90k84M36P82J36p62
2000f7n93J64O65N93l01r59l20O81P64J17q08q13L02J010M01n13r04l20Q64R41
2020I04k53r48n72L63J065M26q78r31R9Q49P91k68j166m80Q05R34Q2q52q79K69
$$ plain form
1881 -701 -297 476 677 103 -532 -630 9 720 548 -305 -763 -363 440 817 207 -690 -736 70 774 648 -288
1902 -288 -945 -428 589 880 186 -792 -869 174 975 590 -442 -1003 -408 794 1029 -64 -988 -729 344
1921 344 1091 509 -732 -1040 -96 916 902 -214 -1141 -614 661 1043 231 -847 -964 126 1046 658
1939 658 -476 -1023 -404 729 997 -18 -941 -681 297 946 510 -596 -938 -127 746 749 -80 -870 -561
1958 -561 457 811 260 -495 -734 -98 698 602 -191 -656 -432 287 735 226 -509 -552 -44 484 543 -104 -624
1979 -624 -365 239 558 298 -385 -632 -82 492 486 2 -570 -540 216 690 315 -375 -659 -223 559 695 -67
2000 -67 -660 -496 169 762 461 -498 -818 -137 627 744 -64 -877 -575 435 836 323 -581 -901 -37 904
2020 904 651 -297 -869 -506 559 985 107 -824 -725 124 915 647 -519 -999 -194 740 822 -30 -909 -640
2040f40J082M52n67q90k99P90R18j69r44n36L46R09M22p14q77P3P42N98j61q60
2060c25m65N47P48Q5n17o39nP25M66k84n72l34K85P23J46n97m43L5M53M98j34
2081C96o64k31L21M31K66l20o51k1N32L92ln36n14K71O69K20l50o14k37O35O34
2102F26j86o27m34K01P71M02n92p62k2O29O88q2r05n43N32Q35K38o47q77N5R38
2123B38N73l63q76m54O57R75k4q54o34J92R06N90o34r80o3P66P32r6r39o18N56
2144c50R26J71o55p91J6Q73N85l60q17l41N03Q35P0p41n66J87O62M89l57p94j48
2165f03N56N20K6n43n37K19O47K13k86n12k25M39N24o7m19l57K9N33L53l21m44
2186b55j37K13M99J63m98m07Q1L85M13r6o01k95L51N13J92m19n86JN92M59j78
$$ plain form
2040 -640 442 894 327 -563 -862 -72 846 677 -267 -803 -457 452 874 160 -717 -644 98 696 535 -325
2060 -325 -790 -243 505 590 73 -566 -571 154 620 336 -236 -570 -285 438 584 -13 -456 -421 32 530 396
2081 396 -268 -499 -178 253 519 199 -452 -473 59 451 448 -88 -602 -331 338 558 208 -406 -643 -8 626
2102 626 440 -187 -621 -420 351 753 161 -601 -623 6 694 612 -293 -836 -304 531 769 122 -755 -700 238
2123 238 811 448 -428 -882 -225 750 726 -128 -762 -570 336 926 292 -688 -751 15 747 651 -288 -906 -350
2144 -350 576 747 92 -699 -683 190 775 415 -402 -743 -240 595 665 -76 -642 -455 207 696 339 -455 -603
2165 -603 -47 473 499 -44 -581 -362 285 498 212 -300 -525 -86 438 371 -48 -405 -376 157 510 189 -255
2186 -255 -392 -179 320 483 -15 -422 -341 44 457 361 -240 -535 -184 329 521 102 -484 -483 109 568 390
2207C90o47l93M10P25J30n85o21M5P15N59l32q32k90N74P34Q3p33o92K81Q41L74
2228G36m60q18k00P58P35k30q07m73L86R01K35p32p00J08P16O11l47q82k55N96
2248a22O85P5p16o52L12P61L05l97o99j70O25N76j54o04l98K59O44K09m48n17
2268d26j5M71M27j18n18k83K63M60J62l08m48l5M02L11q1l40k85J19M23J95k37
2289A39l49j37K40M20M1l89l10M8L79L46j83m99j66K97M32J43m35n04J17N12L33
2310D75j64o14k72M40O00L9n36n45J41P19L40m13o41j74N64O28j03p10m28L55
2330b99O90K57n42o86N0O93M86k83p20l12N23O96ko48n15J96P06L47m66o45n9
2351e33N25N37j01o44l65L55N63J62m11n48M8N43L29j97m94k32L46M66kl60l22
$$ plain form
2207 390 -257 -650 -240 485 615 30 -591 -546 169 728 396 -436 -726 -152 582 665 -68 -760 -479 362 736
2228 736 276 -542 -742 16 751 521 -286 -759 -373 528 763 31 -669 -561 155 766 419 -463 -718 -122
2248 -122 563 638 -78 -730 -418 343 648 251 -448 -618 7 583 429 -175 -573 -314 330 539 91 -426
2268 -426 -441 30 457 339 -179 -462 -199 261 423 115 -333 -368 34 345 264 -76 -361 -242 181 376 139
2289 139 -210 -347 -107 313 354 -35 -345 -297 82 428 245 -254 -420 -123 309 452 17 -487 -370 142 475
2310 475 311 -303 -575 -135 465 504 -32 -577 -436 283 623 210 -431 -605 -41 587 484 -226 -654 -299
2330 -299 391 648 106 -580 -530 163 649 366 -354 -666 -143 553 551 -97 -612 -416 290 637 171 -474 -533
2351 -533 -8 529 428 -216 -581 -226 337 499 88 -460 -412 131 460 263 -231 -463 -117 349 347 -13 -335
2372c35L8M00K63j97l56j15J88L24P7k62k78L3K55K03m2k79j82J22K73J26j48
2393A08k89r0K23K73J1k39k84K7L85K28k09l31j28K05M20O1m16l32J04M03L19
2414D49k34n50r0L95M27On18m04K78N40J89l59n45n2N77M26k47n48k59L64N88
2435D33M1n52m25J65N52L30l70n94m4M94M31j07n28l37L29N33R6m23m26O1M68
2456A27L30k51m88r9L37L56K4l97l15J86L68J26j82l60n4L39K17r6k22j83Q4L11
2478A58O2k00j59l4J24K24l4k09n0J7J07J49n8j88l8M7J47J29j22k05j0J37J53
2501A47O4k23k34R8K56J25j10k94j19K61K91k7k88k49R0L89J83k83l56k1L19L40
2523C59r3m61j99L08L65O3l38l97J09M73K11k59m12j11L70M11j08m50k31K23M36
$$ plain form
2372 -335 -297 103 366 169 -187 -302 -114 210 287 25 -253 -220 35 238 196 -83 -265 -143 130 256 108
2393 108 -181 -271 -48 225 236 -3 -287 -260 125 353 144 -187 -315 -110 310 371 -45 -377 -273 130 449
2414 449 215 -335 -425 -30 397 403 -115 -519 -241 299 488 129 -416 -468 109 535 288 -260 -519 -155 433
2435 433 474 -78 -503 -338 214 544 174 -420 -464 30 461 354 -174 -511 -182 351 447 24 -402 -341 127
2456 127 457 206 -282 -381 -44 312 336 -61 -376 -190 178 304 122 -238 -292 47 264 168 -54 -237 -153 158
2478 158 220 20 -139 -173 -49 175 141 -68 -118 -101 6 155 97 -91 -129 -82 65 194 72 -133 -143 -6 147
2501 147 211 -12 -246 -148 108 233 123 -171 -290 -29 262 235 -53 -302 -212 177 360 77 -279 -300 19 359
2523 359 266 -195 -394 -86 279 342 4 -393 -284 189 400 141 -271 -382 -12 399 291 -159 -390 -167 269
2544B69J44m17l62J22L78K28j65m60q8L67K86p9k97k58J48M12P2k90k41%K79K41
2566B89j49l13m7J91J98L4k48j63J35J71L4o3j66l6J52R2o8n0n6kJ11M7q1l2j1
2591c1j1P6L3l2l4n7k0J11Q3p9r8l8L7J71N9j94j39P7J52J09o7k58o8K34J72l3
2617A55k11j83J27K89O2k26k25OK79K23j78l08o1K26K76ml51k18K35K80N9k09
2639D3k96J4L65J60j91k65r8K29L11o8l23j39J61K66J05k77k65J21K49J15j24
2660I3k70l4K54J72q3k15j02J11K34Oj98j15N7J65Q3j14j62J5J47N3n2r3n3R6
2684eQ4n3o8j1M1N3J0q7nQ2k0k1kk9N7L6p9n1O8L9K1m7j08L4J46Nr4q6kJ38R7
2715A43j05j50QJ02J37j3j96r7J48J46Mj44j56N1K25O1j52j60KJ75J59r9k22l8
$$ plain form
2544 269 413 -4 -366 -244 134 362 197 -263 -351 16 302 223 -74 -332 -184 228 300 10 -231 -231 48 289
2566 289 140 -173 -220 -29 169 203 -45 -208 -73 98 132 69 -97 -133 19 111 43 -7 -63 -65 46 93 12 -20 -31
2591 -31 -42 34 67 35 1 -56 -76 35 118 39 -59 -97 -60 111 170 -24 -163 -86 66 175 108 -150 -218 16 188 155
2617 155 -56 -239 -112 177 239 13 -212 -206 73 296 118 -190 -251 -25 251 247 -104 -322 -87 193 252 43
2639 43 -253 -239 126 286 95 -170 -268 -39 272 204 -119 -258 -97 169 274 -3 -268 -147 102 217 93
2660 93 -177 -211 43 215 132 -83 -185 -74 160 166 -32 -147 -90 75 158 44 -118 -103 44 97 45 -48 -101 -5
2684 -5 79 26 -42 -53 -12 41 51 -36 -41 41 21 0 -2 -31 26 62 -17 -68 0 39 60 13 -95 -61 85 90 -4 -90 -92 46 143
2715 143 38 -112 -104 -2 135 122 -74 -171 -23 123 127 -17 -173 -122 103 164 12 -148 -146 29 188 89 -133 -171
2739a71J71J61k1k14j22J40K03Kj72j42M2K28Q5j62j82J6J55J52p8k17m4J59J63
2762A52l2j74j27J30J81Pj54j14L4J63Q8j41j36K3J30R3o1j68pJ39Q2l9j14p8
2786a23J05J39m8j11o0O2J11L5j37q1O8R4J5o3r8K9J15J9q1n9PQ7P3p1r3RQ2N9
2814H4n0r3rR0N5m8o1l5O6R2l3j25rP1P1lr2o0P6J03j4q9p0N3J04K4j15p9M4Q8
2844C6O7j06j07L2J24O6p1j34k6J37J22p8j39l3Q7J30Oj56r2R2J50L3j33j45N3
2869h5J67N9r6j48k6J55J35q0j67m6J10J54Kj73j21J02J74J6j20j59M4J69P8j02
2893D2j49l4J45J48p6j50m8R3J29J9j52q0O8J19K6p3r6pJ16N8o5q7k6P5P9j9q6
2920c1k2M2N0J1p0j5L7K2j7j6nJ0L0nn2K1L9pk5k7KO3K4o3n5J5P6L9l9j04pJ08
$$ plain form
2739 -171 0 161 140 -74 -196 -56 147 149 -23 -165 -123 105 190 28 -154 -138 17 169 91 -126 -170 -11 152
2762 152 120 -54 -181 -51 130 137 -17 -131 -97 66 154 13 -123 -100 30 123 62 -106 -113 26 108 69 -45 -123
2786 -123 -18 121 73 -38 -98 -36 75 110 -27 -108 -40 54 69 6 -92 -63 52 71 -10 -69 -62 25 98 27 -66 -57 25 84
2814 84 34 -59 -68 22 77 29 -32 -67 -1 91 58 -67 -76 -5 66 63 -29 -89 -13 90 76 -13 -83 -30 74 98 -17 -96 -52 36
2844 36 103 -3 -110 -78 46 112 41 -93 -119 18 140 62 -77 -110 -23 107 113 -43 -135 -43 107 140 7 -138 -85
2869 -85 82 141 45 -103 -129 26 161 81 -86 -132 -22 132 134 -39 -160 -58 116 132 12 -147 -103 66 144 42
2893 42 -107 -141 4 152 76 -74 -122 -29 100 119 -33 -113 -45 74 100 27 -69 -76 40 98 33 -54 -80 -5 74 55 -31
2920 -31 -53 -11 39 50 -20 -35 2 24 7 -9 -14 -4 26 21 -31 -10 29 22 -3 -30 -28 35 59 -4 -59 -44 32 71 32 -72 -79 29
2952B9O9m3r6p5J00J41k2j34q5N0J46O7j37j41L3J49J04p0j96l9J55J46k6j79
2976e4j22R9K15K7j70j44L0J90J21j26k04rJ53J41k2j87j14J24J75K1j49j46M3
2999a08J94Q0j32j43j5J32J46n9j73m4Q6J23J7r6j26N1J16L7n2r7k3Q6P2k9n5
3024a2k8RO2J8m0l5J0lM4Jj6qj2j8M4L1k4l8k3PN9M3o3p3RO7P1j5j21m8Q7R9Q
3057I2j01j24M3J65N6j11j25j7J36J40n2j89o2J07J62M3j90j45P8J79P6j00j93
3080a32l8K13J34p3j89r6J19K18J0j97j50N8J99J11j37j98NJ62J41m3j95q4J20
3103d2J69j1j21j35L6J71Q4j03j31l2J19J11l0j28o8P4R3L3o4r9OQ1O0j8o9n0
3129f4L5P0J2l5l9k9L3N1jj9l4l9M6O1Oo0n9kP2Q2m4r2m1O5J02M1j08j17J6J41
$$ plain form
2952 29 98 55 -41 -116 -16 125 103 -31 -116 -66 80 147 10 -131 -98 51 155 85 -111 -150 5 151 125 -54
2976 -54 -176 -77 138 165 -5 -149 -119 71 192 66 -138 -147 6 147 125 -62 -176 -52 123 144 -5 -151 -108
2999 -108 86 166 34 -109 -124 8 154 95 -78 -122 -36 87 104 8 -118 -67 49 86 34 -63 -86 0 72 43 -12
3024 -12 -40 -31 31 49 9 -26 -16 -19 25 26 10 2 -10 -28 16 47 23 -15 -38 -31 28 71 8 -65 -56 11 82 67 -54 -102 -15 84 92
3057 92 -9 -133 -90 75 131 20 -105 -122 14 154 102 -87 -149 -42 120 163 -27 -172 -94 85 161 61 -132
3080 -132 -170 43 177 104 -85 -181 -62 156 166 -31 -181 -123 76 187 50 -148 -143 19 160 117 -78 -162 -42
3103 -42 127 116 -5 -140 -104 67 151 48 -83 -115 4 115 85 -43 -111 -37 56 89 25 -74 -68 13 73 55 -14 -64
3129 -64 -29 41 53 18 -21 -50 -17 34 33 14 -20 -59 -13 48 54 -6 -65 -67 5 87 43 -49 -90 -25 77 118 10 -107 -91 50
3159E0P9o5j56m2J26J45k6j59j11Q5J86O0j49j69kJ81J66j01k13o4J58J76Lk00
3183d2j54Q9K12R0j44k07k7K10J58q4k01p3J36J94Nj87j41O3J87J06j34j94JJ47
3207A0J21j1j78r8J00J53L1j17j17NJ34R1o5j08n8O5J20J2q4q0OQ6N7k3r3n2N6
3234c7P0L1l6p7k0N4P3Mn4p3pR6O6l9q1o7N0J21L6r9j00j8J20J27o7j50o3R3J52
3263A05L4j47j54M9J84J04r7k02n4J67J91l2k08j40R5K28P2j74j89mJ98J73p6
3286A23k42q8J79J96J9k22j70O8K45R5j45k08k3J74J82n6k16j13J20K13M8j79
3308@j66L6J76J23q6j86l8J16J39Rj33j15L7J47P3p7j38l6R2J22Nj13q7K4J06
3333C0P1m4j12m9N9J01L0p1j00nR6Q8j9j05r1N4J24M7o8j41k8J10J44j3j43j18
$$ plain form
3159 50 129 64 -92 -134 -8 137 111 -48 -159 -74 112 172 23 -146 -148 33 199 98 -115 -179 -21 155 158 -42
3183 -42 -196 -107 105 195 51 -156 -183 27 185 101 -100 -173 -37 157 162 -25 -166 -103 84 190 56 -138 -137 10
3207 10 131 120 -58 -156 -56 97 128 11 -106 -101 33 124 59 -49 -107 -42 78 90 6 -74 -68 18 75 52 -41 -93 -37
3234 -37 33 64 28 -49 -69 -15 58 62 8 -65 -72 24 90 51 -30 -97 -47 74 110 11 -89 -107 13 140 73 -77 -140 -47 105
3263 105 139 -8 -162 -113 71 175 78 -124 -178 -11 180 148 -60 -200 -105 123 195 21 -168 -172 26 199 123
3286 123 -119 -207 -28 168 187 -35 -205 -137 108 203 58 -150 -173 1 183 127 -89 -202 -82 131 179 0
3308 0 -166 -130 46 169 83 -103 -141 -25 114 123 -10 -125 -88 59 132 55 -83 -119 -27 95 100 -13 -100 -76 30
3333 30 101 57 -55 -104 -45 56 86 15 -85 -90 6 94 75 -30 -121 -67 57 104 36 -105 -133 -23 121 108 -35 -153
3359a53O3J79P6j25j70j8J50J65m1k10r7J12K07N9j87k04L8K19J38q7k47p2J75
3382c0K21rk20j82Q4K45J19j72k33j8K07K02p0k36j24J46K27L4j87j96L8K29J24
3405A99j09k11p2J65K00j3j92j42P0J88R1j18j79k8J47J36pj70j00O5J55O9r9
3428D5j43k5J14J31j9j23j03M0J35P8q1j21m5Q9J34K6j37r5NJ27R9n0j51p6J09
3453c7J47L5j43j42K8J68J23p4k02q6J45J80J4j56j71L6K21J26j42k11n0J72K11
3476A92qk41j76J07K46R9j73k36jK23J84n8k71j17J63K49L0k23k01N7K46J39j31
3499I9k46o2J92K01mk39j48R3K23J01j61k04j2J96J62n6j97j07R6K08L5j58j61
3522a49NJ69J48p7j76p4Q4J70N4j27j44MJ46J04j9j78q4P3J51O1j02j40m1J51
$$ plain form
3359 -153 -90 89 165 40 -130 -148 2 167 126 -84 -181 -69 138 197 10 -194 -156 63 201 114 -133 -205 -30
3382 -30 191 182 -38 -220 -136 109 228 56 -177 -195 12 214 144 -92 -216 -70 157 191 4 -192 -154 75 199
3405 199 90 -121 -193 -28 172 159 -33 -175 -105 83 174 56 -123 -151 -4 132 125 -45 -145 -80 75 144 45
3428 45 -98 -123 -9 122 103 -20 -123 -83 52 130 49 -72 -117 -28 106 132 -5 -100 -95 32 131 81 -70 -146 -37
3453 -37 110 145 2 -140 -112 56 179 105 -97 -183 -38 142 156 0 -171 -135 86 212 70 -141 -191 -19 192
3476 192 184 -57 -233 -126 120 219 46 -190 -191 32 216 158 -113 -230 -67 182 212 -11 -212 -155 91 230 99
3499 99 -147 -209 -17 184 180 -59 -207 -114 109 210 49 -155 -167 29 191 135 -62 -169 -73 135 170 12 -149
3522 -149 -144 25 173 96 -80 -154 -70 100 154 27 -117 -113 33 137 118 -60 -144 -71 80 141 39 -101 -142 9
3546IJ23j6j55j20N7J83P7j09j70l3J44J70j4j95j33P6J95R9j32k05l3J91J77
3569A86l2k26j44J19K46P2j82k35PK33J85r7k57r4J69K35M0k29k23P2K55J42j35
3592A07k78o8K26K10j4k42j83J08K73Q2j73k27j4K29J89q2k43j10J42K28L8j99
3614aj88M4J99J49r2k21p4J38J83L3j75j61L4J90J23j01j74p4J26J65K8j54j38
3637a41J9J52J23o6j68o6R8J60M1j16j79J8J57J25n3j76r8J08J77M9j36j85LJ88
3661C4J60p2k08j02J18K15N5j97j99L9K24J49r4k61q1J91K19K1k48k00R0K65J19
3684B37j62k55m6K31K14l4k61j57J24K63Q4k12k33J8K31J85q5k72r7J69K28M1
3706B11k27j96N0K39J41j29k25o0J66K10j4k09j46O2K20J00j17k11m6J64J76j4
$$ plain form
3546 9 132 116 -39 -159 -102 81 158 49 -121 -154 -10 160 146 -49 -182 -106 89 188 56 -149 -182 9 186
3569 186 154 -72 -216 -97 149 221 39 -196 -189 44 229 132 -125 -219 -50 185 225 -4 -227 -155 100 242 107
3592 107 -171 -239 -13 197 183 -59 -242 -134 139 221 48 -179 -193 36 225 143 -100 -210 -68 160 198 -1
3614 -1 -189 -145 54 203 111 -110 -184 -46 137 170 -5 -166 -132 58 181 80 -94 -168 -42 123 151 -3 -141
3637 -141 -122 30 153 87 -81 -147 -49 111 152 36 -143 -125 32 157 104 -72 -170 -62 115 164 28 -157 -154 34
3661 34 194 122 -86 -188 -70 145 200 3 -196 -157 67 216 122 -139 -220 -29 190 211 -37 -237 -147 118 237
3684 237 75 -180 -226 5 219 185 -76 -233 -109 154 238 26 -207 -189 42 227 142 -130 -227 -58 170 211
3706 211 -16 -212 -162 77 218 89 -136 -196 -30 180 166 -43 -189 -127 93 193 76 -135 -181 -17 159 145
3728A45j88j32P5J89Q3j03j85l7J26J73qj64j25M1J83R8j06j68n9J39J56J8j68
3751a7j45K8J90J17r0j96o2J41J70L0j81j62M9J97J23j19k23m4J74K07qk27j73
3774b21Q8K48J19j65k56k3K18K17n1k56j58J41K54O9j91k41J7K51J86j07k61j10
3796b32J67K50K8k30k05O4K65J26j27k59n5J96J98j2k27j51P9K30J07j64k02l1
3818a85J96J75n3j97j15J00J99O0j39j85j1J72J49l7j72j28R4J80O0j24j77j2
3840a50J52J52l0j63j22Q2J69P1j04j76l5J51J57k2j73j32P2J95Q8j29j89l7J77
3863DJ69k6k06j36R9K04R0j61j94k1K04J86o8k25j31J28K36N8j97k19K9K26J65
3886B14q2k68r1J73K42Mk15j87O8K46J27j51k31m7J94J98l1k21j43R8K24Q5j60
$$ plain form
3728 145 -43 -175 -100 89 172 69 -116 -153 -27 146 138 -26 -151 -110 73 171 65 -103 -162 -23 133 151 -17
3751 -17 -162 -134 56 173 83 -113 -175 -34 136 166 -15 -177 -128 69 192 73 -150 -194 -20 187 179 -48 -221
3774 -221 -133 115 234 69 -187 -210 8 225 174 -82 -240 -99 155 224 33 -208 -191 60 246 139 -122 -232
3796 -232 -65 185 213 -17 -222 -158 107 233 106 -153 -208 -12 186 174 -53 -204 -125 105 212 48 -154 -185
3818 -185 11 186 133 -64 -179 -79 120 180 41 -144 -155 17 166 129 -43 -171 -77 103 163 39 -138 -150
3840 -150 2 154 124 -39 -161 -79 90 161 57 -119 -154 -3 154 132 -41 -173 -101 94 182 53 -136 -173 4
3863 4 173 147 -59 -195 -96 108 198 37 -157 -178 26 212 144 -81 -212 -84 152 210 13 -206 -177 49 214
3886 214 132 -136 -227 -54 188 192 -23 -210 -142 104 231 80 -151 -198 -4 194 163 -58 -201 -103 121 206 46
3909D6k13j0J97J63m8k22j00J16K12L3j48j83RJ96J14o0j88q0J03J91J9j39j51
3932a43K4J56J21o4j74p4J06J49M8j31j48QJ42J22m9j49q8Q7J57M5j14j48k1J58
3956B0J34n0j66q9Q0J86M3j33j56jJ67J33o2j90j01J29J90M0j79j74M4J88J35
3979A88q6k21p6J56K05Nk00j71P6K26J09j37k27l6J92J98m5k18j31J17J96P4j63
4002C1k07J7K00J40o9k03q1J15J96K6j68j54L2J85J13j03j74n3J37J55Rj63j20
4025a39L9J73O9q8j58l7J27J33qj26j08L7J52Q2q5j50l6J09J31%j29j18M3J39
4049E2Q9p5j48n2J03J46Pj34j26L0J60R6p3j58o3J23J46Qj45j30L6J86Q9r9j81
4074a13m1J39J74j0j89j33Q2J97P4j33k03rJ90J48n0k03j03J31J91M1j69j74K8
$$ plain form
3909 46 -167 -177 20 183 135 -87 -187 -71 141 174 26 -157 -148 48 162 102 -86 -166 -63 128 147 8 -143
3932 -143 -119 37 158 94 -80 -154 -48 101 149 18 -130 -122 20 142 93 -56 -144 -57 100 145 31 -117 -138 20
3956 20 154 104 -62 -151 -71 115 158 25 -131 -132 35 168 106 -84 -185 -56 134 174 -5 -179 -135 53 188
3979 188 102 -119 -195 -39 166 171 -29 -200 -124 102 211 74 -153 -189 3 201 156 -62 -193 -76 120 194 31
4002 31 -176 -159 41 181 112 -91 -172 -57 139 165 -3 -157 -125 60 173 70 -104 -157 -20 135 144 -19 -139
4025 -139 -100 73 142 54 -104 -141 -14 119 111 -15 -123 -86 66 148 63 -87 -123 -14 117 117 -12 -130 -87 52
4049 52 141 66 -82 -134 -31 115 122 -12 -138 -108 52 148 75 -83 -146 -23 123 131 -14 -144 -108 78 167 68 -113
4074 -113 -154 -15 159 149 -40 -173 -91 106 180 47 -156 -165 25 173 123 -80 -183 -52 139 180 11 -163 -135
4097a35J92J30r9k01o9J53J74J8j91j41O0J99Q5j22j73l2J71J28l6j61j01Q1J82
4120A12M5j36j37NJ36J20n2j53q1Q6J38M1j13j21J1J32R2l3j49p1Q6J30L6j04
4144B0j15nJ18J01l0j35p5O4J31N8r4j39pJ14J14j4j39r5O3J46O4r9j59j1J41
4169A7J17l8j55r3R7J63M4j32j55J2J68J23o9j92o7J26J70K5j70j56M9J93J03
4192A80j04j97m4J50J76k1j88j31R1J89P7j45j79KJ75J35o9j64r5J15J60L5j63
4215a5j28L7J42J20q8j61n1J19J39%j43j08L5J53Q5q7j40k5R8J22Lj20r7M4J14
4240D8O2o2j25k9Q5J09Nj01r5K3J21O8m5j19m8P1J19K8j13r8MJ22R1n6j29p0J02
4267c2J29L1j27j27K2J42J04o7j59o2J27J58j4j61j14N0J68R9j07j88l2J57J49
$$ plain form
4097 -135 57 187 88 -113 -182 -29 145 163 -28 -169 -109 90 175 53 -120 -152 19 147 111 -50 -151 -70 112
4120 112 157 21 -116 -111 25 145 93 -60 -141 -55 83 124 11 -110 -99 33 125 92 -57 -128 -42 88 124 20
4144 20 -95 -100 18 119 89 -46 -121 -57 74 132 38 -101 -108 6 120 106 -33 -128 -65 81 145 46 -113 -124 17
4169 17 134 96 -59 -152 -55 108 152 20 -135 -123 45 168 99 -93 -160 -34 136 161 -9 -165 -116 77 180
4192 180 76 -121 -165 -15 161 140 -48 -179 -88 101 178 33 -146 -144 31 166 97 -67 -162 -47 113 148 -15
4215 -15 -143 -106 36 156 68 -93 -144 -25 114 114 -29 -137 -102 51 136 49 -91 -116 -18 104 107 -13 -110 -66 48
4240 48 110 48 -77 -106 -21 88 93 -8 -103 -80 41 109 64 -55 -103 -32 87 115 2 -96 -92 30 121 65 -64 -134 -32
4267 -32 97 128 1 -126 -104 38 142 75 -84 -146 -19 139 125 -36 -150 -100 68 167 60 -128 -160 -3 146
4290A46l6j75j16J02J79N2j35j70J5J76J22p4j82p3J33J73Qj68j33N6J57R8r5
4313F0j69k2J24J32j1j58j04P5J52N3j08j35OJ23R1k5j25q0P2J25L2j03r0oJ03
4338A2Q8k6j18n5O1R5L4q1q8nP7Q9kr9p2L9R8L9m4j14k4Q0J11j3r7q1J6J24P1
4367A15p2j20l1Q8J23kj26j02N3J45N1q6j48j1J24J30l4j51r7R2J51N4j35j51
4391a40J6J57J15p2j55n5J09J48J0j64j15N6J63O7q9j75rJ55J04j8j55r4P9J51
4415H9L2j16j23J3J26J00n8j25n6R4J16J0j10r6L2J08N6o0r3m0Q6R1nq6n6K1R2
4442D2L7m4q2j9N1P0Oo0o9J4P0O3l5q5l0M8N5L2n3p9pP7O7j0q2o9N2R2L1n8j02
4473g7lP6J04l7j05n5N4J14L5r7j08J4J13Q9n8j34m9J07J16nj12j04M5J44M6p7
$$ plain form
4290 146 110 -65 -181 -79 100 152 17 -153 -138 38 160 86 -96 -169 -36 137 145 -23 -156 -100 57 155 60
4313 60 -109 -131 -7 125 114 -44 -148 -73 79 132 24 -111 -105 18 109 84 -41 -121 -49 76 108 5 -85 -91 12
4338 12 100 74 -44 -99 -38 57 91 10 -78 -83 -6 83 81 -18 -90 -51 47 86 42 -72 -96 -16 95 82 -15 -96 -80 44 115
4367 115 43 -77 -108 -20 103 101 -25 -127 -74 71 122 36 -112 -123 1 131 97 -54 -151 -59 92 146 11 -140
4391 -140 -124 33 148 76 -79 -134 -25 123 133 -31 -146 -90 73 140 51 -124 -133 22 126 108 -47 -141 -62 89
4415 89 121 5 -118 -105 21 121 63 -62 -118 -24 92 102 -8 -104 -72 36 92 32 -61 -101 -15 76 71 -15 -71 -50 42
4442 42 79 35 -47 -66 -15 55 61 1 -68 -54 16 79 44 -41 -71 -23 32 64 11 -68 -75 2 69 59 -23 -92 -40 52 83 25 -77
4473 -77 -80 -4 100 63 -42 -97 -43 71 106 9 -99 -85 28 117 59 -75 -124 -17 99 94 -18 -122 -77 67 113 36
4499C6j23k0J13J11l3j40o7P6J20L3j14j11L5J15P3o3j10m2R9R6rj02n9L4J11
4524E9L2p3r7J9P2P8l7r1m7O2O9K2o2p4J4P0M1k7n4l1L2N9Nm1l3j4M2L9j6l5l1
4555d8J0M9J9j6l7j8J9N0J7m8m3ON0M3j8n3l2K0P8J0o1o2PP1N1k4p7m3N6Q2Rp5
4587hp4K8R6N3p5r6kP7Q4k1j12k9M9R0K1p7q8K1R4O4o7r3j8Q8P5k8q3n6N8Q2J7
4618G0o4p9K0P7N5l6r2j3N4P2j7o9m3L2N9L0o2m0J4M0L7j1o6mL8K2Ll1l0K1K7
4649A4Jnl2JK0J3jk5O%QjLnqj1LJ7Knj6%K2K3j1l2j0OM1Rm3k1J6L8J8k4m5j5M2
4688gN6k3m7l8L5N9J3n6n0J6O9K4l8o1kN1M9j1n8n1M3P2Qo6n0K2O8L0n2n9mO2
4720DM6k2p0k2N8N1Ko3m6K9P0J8m6m9oN3M2k9o4qM3N0nn5l0L5M4nm6k0J6M1J5
$$ plain form
4499 36 -87 -107 6 117 84 -56 -123 -47 73 106 -8 -119 -84 31 104 41 -69 -111 -12 84 75 -27 -86 -52 59
4524 59 91 18 -79 -60 12 90 53 -38 -85 -23 46 68 6 -68 -54 16 57 30 -24 -55 -23 36 41 0 -33 -47 -5 34 18 -17 -48
4555 -48 -38 11 30 14 -23 -41 -22 28 45 -3 -46 -40 10 53 35 -18 -50 -30 48 58 -3 -65 -58 13 64 40 -37 -80 -24 58 67 -8
4587 -8 -82 -54 42 95 20 -76 -78 -1 83 62 -50 -79 -30 60 81 4 -84 -63 31 95 28 -65 -83 5 80 52 -31 -87 -29 53 70
4618 70 6 -73 -53 24 79 43 -49 -62 -8 64 47 -22 -65 -33 26 56 -6 -46 -32 8 45 34 -32 -36 2 24 27 -4 -34 -13 14
4649 14 15 10 -22 -21 -1 12 11 -14 -8 -8 0 -1 2 -3 -11 -22 -19 -2 0 -5 -21 -21 1 24 13 -19 -29 -23 18 27 -16 -37 -21 17 35 11 -34 -49 -7
4688 -7 49 26 -21 -59 -24 35 48 -8 -58 -42 27 51 13 -48 -50 1 50 39 -19 -70 -27 45 53 -13 -63 -41 27 57 5 -54 -58 4
4720 4 50 28 -42 -64 -6 45 47 -16 -62 -33 37 55 9 -40 -46 7 49 20 -44 -52 -9 41 36 -19 -49 -14 30 25 -21 -41 -25 16 31
4753C1l3k7LK7K2pl3pK0K0pj9kMK2j6nlK0Mj2j0mJ2Mj1jjJ4mj2J%K3l%l8QK7K3
4793C0k9k2j5L3L5j6l8j4K9M6j4l9l8K2N8Nm2m7K1N4K3k3m5j6N4L0j2n2l3M0N0
4824C5Jm5n4K2O4L2l9o2jN6N2k8o6l3N8N6jp1l9L3O4K4m9n7OO2M3m0o9JM3N7q
4857D7n9m5L6N8J5n2l1OL1L6k6n5qN3L1mm4k0J7L0Qj3l5kK5K7j3k0LmJ2KLj3k
4892flLJ3pnj1pK4Rmk0qK1K2ok0k9J5K9K1j4n1NK3L6nl6m2J9O5J5l3o7KP2M0l1
4929B9q0j2N5O4Jp4n4M5P7K2o9o5OP6N5m9p5k6O6Q5j2r7m4M0P9K3o2o9lP5O2l8
4961C1p4k7N4P5j3n9m7K5N6L7m3o4kO5L7j4o6j8L3L9J3l8l9RL6K9rm1k0K0L3J2
4993C0j7l5j7K4M0nj6m1J4K3L0ml1l3OL9L5l4l6oL5L0J3m3n6J1Q1J8m1p0j1P1
$$ plain form
4753 31 -2 -29 -26 1 23 16 -17 -24 -4 16 9 -10 -12 -8 14 -2 -7 -10 10 14 2 -8 -12 0 4 -7 -8 -9 5 1 -11 -10 -10 13 10 10 -28 -20 7 30
4793 30 1 -21 -36 -3 32 16 -22 -36 -7 39 25 -14 -52 -30 28 33 -9 -56 -35 19 42 19 -26 -42 12 42 30 -22 -55 -15 35
4824 35 36 -9 -63 -41 23 55 16 -46 -47 9 61 33 -33 -66 -8 48 47 -24 -63 -30 34 58 9 -48 -42 20 63 23 -46 -45 -2 55 47
4857 47 -12 -57 -21 37 52 0 -31 -25 6 42 16 -39 -47 6 37 33 -11 -31 -14 16 24 11 -24 -26 -1 26 13 -7 -4 -8 4 6 9 -4 -6
4892 -6 -9 -6 7 0 -5 -16 -23 1 10 6 -14 -22 -1 21 15 -5 -34 -19 10 31 17 -34 -29 -6 30 25 -11 -53 -34 31 46 13 -54 -52 20 60 29
4929 29 -51 -63 -8 56 57 -17 -71 -26 51 73 4 -61 -55 21 76 27 -48 -74 -8 77 65 -32 -76 -36 43 66 4 -65 -68 7 69 31
4961 31 -43 -70 -16 59 46 -13 -60 -35 21 58 15 -49 -51 14 51 37 -29 -47 -14 25 38 0 -39 -30 6 35 26 -15 -35 -15 18 30
4993 30 13 -22 -39 -15 25 20 4 -37 -23 0 30 26 -5 -38 -32 7 42 8 -28 -34 1 31 44 1 -55 -44 37 55 14 -56 -67 4
5025DN9j7p0n0L9R2J5p9n2lR1N2m7j02k0P2Q2or8n8N0R2L2o3r8J1Q1Q0l5r2m1
5056g9O6P9Qq3o7K5Q9M2m7r3j7Q6O7k6p8l3L6P0K0m7p5KO6N0k6p4k6N0M8J3m1
5087En5kN6L2Ro9k5L3M2J1k6m1j2M2L3J6n1l1JN6L1j5o2l4L8O5J8o9n0nP3N4l8
5120C0p2l0O2P2%p1o8J9J03M3n5j00j8Q8Q0Jj03o5L9J04M4r3r6J3Q9Q7k9j28m5
5149i9P7J02J2j06q3L9R7O3p4r3k4R0Q6j2j10n8M7J04L1q7p1j7J03O0k8q5l4N5
5177a5Q0Ln0q3jR9L3l5n8l1L0Q2Pn2o2QP2M1k4p3j6K7N9K6n9n7KN0N4po5m3K0
5210c8P6L9n9p5j5O8P5kp4o0K6Q4M6n7j00JO7Q6j0j14o8N8J10M2q8j06J5R9Q0
5239A06l6j20o9Q9J26Kj21r1M7J06Q0p9j15k2R9Q9qj10q5N5J25M1r1j02kJ07P4
$$ plain form
5025 4 63 46 -24 -74 -35 57 72 -7 -59 -62 29 81 34 -68 -88 -16 66 60 -38 -96 -46 46 78 15 -83 -72 9 89 54 -38 -79
5056 -79 -13 66 74 -9 -76 -51 38 80 33 -60 -77 9 76 50 -28 -61 -25 45 65 18 -57 -55 11 61 35 -39 -65 -15 33 46 5
5087 5 -50 -52 4 36 45 -24 -49 -16 26 37 11 -30 -42 0 33 49 -2 -33 -32 24 55 40 -22 -56 -18 47 65 -4 -54 -59 14 68 30
5120 30 -42 -72 -10 62 62 -9 -77 -58 45 88 33 -67 -85 3 83 84 -19 -84 -45 59 103 10 -86 -73 16 103 74 -54 -99
5149 -99 -22 80 92 -14 -97 -58 39 102 28 -65 -89 1 87 75 -35 -93 -46 58 89 2 -69 -86 17 77 49 -36 -70 -15
5177 -15 65 68 18 -65 -66 33 66 31 -27 -58 -28 54 61 9 -53 -45 27 68 44 -29 -45 -18 41 67 8 -49 -47 3 57 50 -15 -58 -38
5210 -38 38 77 18 -57 -72 -4 71 69 -5 -65 -39 45 91 34 -66 -65 2 88 78 -36 -104 -46 64 106 18 -88 -73 26 106
5239 106 70 -50 -119 -30 96 98 -23 -114 -67 39 119 40 -75 -97 2 91 83 -27 -112 -57 68 109 18 -84 -86 21 95
5266I5k7j23l3O0J02J5q8q5K5R4N9n0j03k4Q0Q0kp9p3J5Q9N7n9q1rN1Q7mp1n9
5296f1RP1M8l0q6j9L8P6K2n5p4lO7P6j7r5n4N6Q1L1p3q8J3Q5P3k6q8p1N5J00L0
5327I1p9j12J2J14P8m6j14o0Q3J25Mj02j06L5J31P3r2j21l6J23J08j8j38p1N3
5352f5J42O2j15j36%J33J02m9j31n8Q9J22J7j13j18L2J29O7o6j16l6Q6J10mj06
5377b2q5M4J03N1o7r5nP0Q5k4p0o8L8Q5L5m9p2k9O9Q4j8p2o8K6Q8M6n2p4l4N6
5407b4R8ro5o6QQ3O2m1r8l9O9R7Pq7q0J3J16P2n7j21n0R3J16mj10r2M4J35M7o9
5437D8j34k1J14J15k7j34p9O9J41L5j26j17J1J34J02o1j42o1R8J40Qj21j16L4
5461i0J43P1p9j23m6J24J12j3j38q2O2J15N9q1j21j2J05R7j9j20o6O8J06K3q0
$$ plain form
5266 95 68 -55 -88 -28 74 89 1 -84 -59 35 94 44 -59 -83 -3 77 75 -4 -77 -62 27 84 25 -56 -65 -14 73 69 -2 -61
5296 -61 -52 19 67 37 -49 -68 -30 46 68 13 -61 -64 3 79 62 -33 -87 -31 50 81 8 -80 -67 18 91 65 -23 -94 -39 61 91
5327 91 12 -100 -88 26 104 58 -56 -116 -33 92 96 -6 -112 -77 54 127 35 -86 -122 1 109 91 -47 -118 -65
5352 -65 77 139 24 -112 -112 21 123 74 -57 -115 -26 96 113 0 -118 -86 43 110 44 -72 -108 -22 88 84 -22
5377 -22 -107 -63 40 91 24 -71 -76 -6 79 55 -15 -83 -45 40 75 26 -46 -75 -6 78 60 -12 -80 -54 34 80 28 -46 -80 -24
5407 -24 74 65 0 -66 -58 25 87 46 -52 -91 -22 75 82 -5 -85 -72 44 116 59 -62 -112 -19 97 93 -17 -109 -65 70 117 48
5437 48 -86 -107 7 122 95 -39 -118 -49 92 127 1 -116 -105 29 131 70 -72 -133 -35 105 113 -8 -124 -90
5461 -90 53 124 45 -78 -124 0 112 99 -39 -121 -59 56 115 34 -87 -99 6 103 84 -36 -102 -34 72 95 15
5486A5r3kQ8P3j6r2n7M0R9L5p9p0j6P1R4l0r3n8N1J02K4n8r6mQ1Q0j1r0p8L0J09
5517D9N3p0j08j1Q4J08j6j18p0M0J20M1o8j38lJ19R5k3j37o8O9J41L2j02j32O
5543a07J43R3o0j36p1R9J50Lj32j00M3J41P1r1j35l0J19J29j9j48r8P5J47M6r6
5568C6j39JJ26J04n4j32o1P4J09L6r9r2MJ17Q3m5j19n3P3J12J1r0j02L5R8O3m8
5595D8r5m3O6J04J0p1r4%Q9P8l5r4n7O6R8K9r0q7mR5P8k7j00p9O5J22L2q7j07
5624i0JJ15Q7l7j29n9P5J25J6j02j13K7J26Q4n8j44l7Q9J34Mj26j18N3J41P4q6
5650E2j49j8J26J22l3j41r3P9J47L7j12j29OJ31R8m4j47o3R8J23K4j14j09K9J22
5675D2P0m7j25m3R0J06J5j14r2L8J10N3n7j16k8R3R3pj00p5L0J17M9n8r5m0Q8
$$ plain form
5486 15 -78 -80 8 81 65 -27 -84 -44 55 90 11 -59 -75 -4 90 60 -33 -91 -40 62 86 28 -68 -72 9 89 78 -12 -90 -60 49
5517 49 102 32 -76 -87 -3 105 89 -29 -99 -59 61 102 34 -104 -107 12 107 84 -53 -121 -52 89 121 19 -113 -107
5543 -107 36 129 69 -67 -138 -39 111 114 -18 -118 -75 66 137 46 -89 -119 0 129 110 -38 -136 -61 86 132 36
5568 36 -103 -102 24 128 74 -58 -119 -45 64 100 1 -91 -87 30 113 68 -51 -104 -31 81 92 2 -100 -65 33 96 48
5595 48 -47 -90 -24 80 90 19 -75 -75 14 92 57 -37 -94 -28 70 99 9 -78 -82 13 91 64 -36 -115 -50 72 104 17 -90
5624 -90 -89 26 113 76 -53 -112 -37 88 104 2 -111 -84 42 126 68 -76 -113 -24 110 114 -12 -130 -77 64 138 52
5650 52 -97 -115 11 133 100 -41 -134 -55 92 129 17 -112 -106 25 123 79 -68 -131 -33 90 114 0 -109 -80 42
5675 42 112 65 -60 -103 -13 93 108 -6 -98 -60 50 103 46 -70 -98 -5 88 81 -19 -94 -64 53 102 44 -51 -91 -3
5702cR4j0q3q4K3R6O2o1r1m5P9J03Kq6r1L0J02N7l4j23k9P7J09Oj04j02L8J18
5730E0N7o2j21m0J01J25qj37p9M8J37N6r8j26j4J23R5k5j33p8Q0J19M4j04j28
5755a18K0J31R0o0j36n0R9J30Oj24j11L3J42P1q2j27j2R3R8jj23q9N6J36L6q4
5781B4j07rJ00Q5k5j05o8N9J00K9p5q1qQ6Q3j9r5p0O1Q9L3p1p9j1P7Q2k5r1m9
5810h0L2R6L7o0r1k1Q5Q8j4j00o1L6J15M3p6j05lP8J00j8j19p1M7J30L1q1j12
5837i4pJ05R2l7j11n8O9J27K4j07j09J6J24P9n4j31l6R2J09Jj12r2M2J24M3o7
5863C2j16j7J02R8k2j10p4N9J10L9q9j01LJ09P4m2r3o5O1J06K4q2q2PQ9P4l5r5
5891c6m8O0Q0K3p7o6QP6O2m0p9l7M7P7K4p1o0nO7N5k5p7l1O1O5K4o1r0J5P8O2
$$ plain form
5702 -3 91 81 -2 -86 -63 33 95 34 -57 -102 -23 80 82 -4 -95 -65 37 94 60 -63 -92 -15 94 100 -4 -106 -68 50
5730 50 107 45 -76 -116 -15 110 102 -35 -114 -66 71 127 29 -97 -111 12 107 82 -51 -129 -49 70 114 10 -118
5755 -118 -98 33 123 63 -73 -123 -24 106 112 -12 -123 -90 52 123 41 -86 -98 -5 93 92 -31 -120 -64 72 108 24
5781 24 -83 -92 8 93 68 -37 -105 -46 54 83 8 -73 -81 5 88 69 -26 -96 -35 54 87 16 -63 -74 3 85 60 -31 -80
5810 -80 -48 48 85 25 -66 -87 -2 86 72 -28 -89 -53 62 105 29 -76 -79 -1 99 81 -38 -109 -62 68 99 18 -94
5837 -94 -101 4 96 59 -52 -110 -41 86 110 3 -106 -90 34 113 59 -72 -108 -16 93 94 -18 -110 -68 56 99 32
5863 32 -84 -101 1 99 77 -33 -107 -48 62 101 12 -89 -86 23 97 55 -38 -103 -42 64 88 6 -76 -69 20 94 59 -36
5891 -36 -84 -24 56 79 2 -64 -56 20 82 42 -37 -74 -27 50 74 3 -57 -62 5 60 35 -42 -73 -12 53 77 16 -74 -59 19 81
5922H1m6p0m5M3R7K8q1q6J6Q5O1l6j00m3O1R9J9p9r3K9R6O2m9j09l4Q7R1j5j00
5951c1p8M7J08M6o3j01j5R7P3k8j00n3N2R7L0p4q4J4Q2P5l9r4m0N6Q7Pr4o5L2
5980e6Q3N0n9o1k9O7P2j1p1m8K6P1L8l8q1k1N7O7j7n7m9J7P5K6l0o4j2M2N6On9
6011a0m9J3O7M0l3n9k6L1P0mm7n8J2P0L7k4q6pM0P6No8o3K2P2M4l8p5k5N7P7%
6043F1p8n5L7P2L3n3p9rP9N8j2q8m8M0R5K2p0o7PP8O0l8r3j8N8O7pn5o0J8P9L2
$$ plain form
5922 81 35 -35 -80 -37 60 88 7 -79 -63 22 83 47 -53 -96 -35 64 83 4 -89 -60 36 98 49 -60 -94 -7 84 69 -31
5951 -31 -109 -62 46 92 29 -72 -87 10 83 55 -45 -98 -46 51 81 7 -77 -63 19 94 55 -39 -79 -23 64 71 -23 -88 -56
5980 -56 27 77 18 -43 -72 -5 67 56 -15 -63 -37 34 72 34 -47 -68 -11 56 39 -18 -67 -50 25 51 21 -43 -55 -13 43 49 -10
6011 -10 -59 -46 21 61 28 -31 -57 -26 44 40 -7 -65 -53 17 54 30 -56 -63 -23 53 58 -10 -73 -51 21 65 27 -48 -73 -16 61 61
6043 61 -17 -72 -35 37 70 17 -62 -71 8 66 54 -34 -82 -42 53 75 5 -62 -55 23 83 45 -48 -66 -8 59 52 -3 -63 -45 34 66
$$ [...]
8191i
##END NTUPLES=NMR FID
##END=
