##TITLE=1H_DE-80H_X3
 200.13MHz, d2o
 8 sc
 
 19ns.26.2.2025
##JCAMPDX= 6.0         $$ Bruker NMR JCAMP-DX V2.0
##DATA TYPE= NMR FID
##DATA CLASS= NTUPLES
##ORIGIN= UXNMR, Bruker Analytische Messtechnik GmbH
##OWNER= pz
$$ XWIN-NMR		Version 3.5
$$ Mon Mar 17 17:12:08 2025 Russian Standard Time (UT+4h)  Yarkov@DPX200
##.OBSERVE FREQUENCY= 200.1313
##.OBSERVE NUCLEUS= ^1H
##.DELAY= (6, 6)
##.ACQUISITION MODE= SIMULTANEOUS
##.ACQUISITION SCHEME= undefined
##.AVERAGES= 8
##.DIGITISER RES= 18
##SPECTROMETER/DATA SYSTEM= spect
##.PULSE SEQUENCE= zg30
##.SOLVENT NAME= CDCl3
##.SHIFT REFERENCE= (INTERNAL, CDCl3, 0, 14.3821)
##AUDIT TRAIL= $$ (NUMBER, WHEN, WHO, WHERE, WHAT)
$$ ##TITLE= Audit trail, XWIN-NMR		Version 3.5
$$ ##JCAMPDX= 5.01
$$ ##ORIGIN= Bruker BioSpin GmbH
$$ ##OWNER= Yarkov
$$ C:/Bruker/XWIN-NMR/data/yarkov2/nmr/H-C/1/audita.txt
$$ ##AUDIT TRAIL=  $$ (NUMBER, WHEN, WHO, WHERE, WHAT)
(   1,<2025-03-17 17:10:17.98 +0400>,<Yarkov>,<DPX200>,
      <created by zg, POWCHK disabled, PULCHK disabled
       configuration hash MD5:
       00 E9 B6 7A A2 85 ED C7 34 08 36 98 17 FE 4E 26
       data hash MD5: 16K
       C4 66 06 3E EC 99 86 F4 0D DA F7 CA 25 18 57 E2>)
$$ ##END=
$$ 
$$ hash MD5
$$ E5 9C 53 68 9A 4A F5 D6 AD 02 33 E5 10 E5 0B DE
##$RELAX= 
##$RELAX= 
##$RELAX= 
##$RELAX= 
##$RELAX= 
##$RELAX= 
$$ Bruker specific parameters
$$ --------------------------
##$DU= <C:/Bruker/XWIN-NMR>
##$EXPNO= 1
##$NAME= <H-C>
##$PROCNO= 1
##$TYPE= <nmr>
##$USER= <yarkov2>
##$AMP= (0..31)
100 100 100 100 100 100 100 100 100 100 100 100 100 100 100 100 100 100 
100 100 100 100 100 100 100 100 100 100 100 100 100 100 
##$AQSEQ= 0
##$AQ_mod= 1
##$AUNM= <au_zg>
##$AUTOPOS= <>
##$BF1= 200.13
##$BF2= 200.13
##$BF3= 200.13
##$BF4= 200.13
##$BF5= 200.13
##$BF6= 200.13
##$BF7= 200.13
##$BF8= 200.13
##$BYTORDA= 1
##$CFDGTYP= 0
##$CFRGTYP= 5
##$CHEMSTR= <none>
##$CNST= (0..31)
1 1 145 1 1 1 1 1 1 1 1 1 1 1 1 1 1 1 1 1 1 1 1 1 1 1 1 1 1 1 1 1 
##$CPDPRG= <>
##$CPDPRG1= <>
##$CPDPRG2= <>
##$CPDPRG3= <>
##$CPDPRG4= <mlev>
##$CPDPRG5= <mlev>
##$CPDPRG6= <mlev>
##$CPDPRG7= <mlev>
##$CPDPRG8= <mlev>
##$CPDPRGB= <>
##$CPDPRGT= <>
##$D= (0..31)
0 0.7 0 0 0 0 0 0 0 0 0 0.03 0 0 0 0 0 0 0 0 0 0 0 0 0 0 0 0 0 0 0 0 
##$DATE= 1742217017
##$DBL= (0..7)
120 120 120 120 120 120 120 120 
##$DBP= (0..7)
150 150 150 150 150 150 150 150 
##$DBP07= 0
##$DBPNAM0= <>
##$DBPNAM1= <>
##$DBPNAM2= <>
##$DBPNAM3= <>
##$DBPNAM4= <>
##$DBPNAM5= <>
##$DBPNAM6= <>
##$DBPNAM7= <>
##$DBPOAL= (0..7)
0.5 0.5 0.5 0.5 0.5 0.5 0.5 0.5 
##$DBPOFFS= (0..7)
0 0 0 0 0 0 0 0 
##$DE= 6
##$DECBNUC= <off>
##$DECIM= 32
##$DECNUC= <off>
##$DECSTAT= 4
##$DIGMOD= 1
##$DIGTYP= 9
##$DL= (0..7)
0 120 120 120 120 120 120 120 
##$DP= (0..7)
150 150 150 150 150 150 150 150 
##$DP07= 0
##$DPNAME0= <>
##$DPNAME1= <>
##$DPNAME2= <>
##$DPNAME3= <>
##$DPNAME4= <>
##$DPNAME5= <>
##$DPNAME6= <>
##$DPNAME7= <>
##$DPOAL= (0..7)
0.5 0.5 0.5 0.5 0.5 0.5 0.5 0.5 
##$DPOFFS= (0..7)
0 0 0 0 0 0 0 0 
##$DQDMODE= 0
##$DR= 18
##$DS= 0
$$ [...]
##$SUBNAM0= <"">
##$SUBNAM1= <"">
##$SUBNAM2= <"">
##$SUBNAM3= <"">
##$SUBNAM4= <"">
##$SUBNAM5= <"">
##$SUBNAM6= <"">
##$SUBNAM7= <"">
##$SUBNAM8= <"">
##$SUBNAM9= <"">
##$SW= 18.0517328524113
##$SWIBOX= (0..15)
0 0 2 0 0 0 0 0 0 0 0 0 0 0 0 0 
##$SW_h= 3612.71676300578
##$TD= 16384
##$TD0= 1
##$TE= 0
##$TE2= 300
##$TE3= 300
##$TEG= 300
##$TL= (0..7)
0 120 120 120 120 120 120 120 
##$TP= (0..7)
150 150 150 150 150 150 150 150 
##$TP07= 0
##$TPNAME0= <>
##$TPNAME1= <>
##$TPNAME2= <>
##$TPNAME3= <>
##$TPNAME4= <>
##$TPNAME5= <>
##$TPNAME6= <>
##$TPNAME7= <>
##$TPOAL= (0..7)
0.5 0.5 0.5 0.5 0.5 0.5 0.5 0.5 
##$TPOFFS= (0..7)
0 0 0 0 0 0 0 0 
##$TUNHIN= 0
##$TUNHOUT= 0
##$TUNXOUT= 0
##$USERA1= <user>
##$USERA2= <user>
##$USERA3= <user>
##$USERA4= <user>
##$USERA5= <user>
##$V9= 5
##$VALIST= <valist>
##$VCLIST= <CCCCCCCCCCCCCCC>
##$VD= 0
##$VDLIST= <DDDDDDDDDDDDDDD>
##$VPLIST= <PPPPPPPPPPPPPPP>
##$VTLIST= <TTTTTTTTTTTTTTT>
##$WBST= 1024
##$WBSW= 4
##$XGAIN= (0..3)
0 0 0 0 
##$XL= 0
##$YL= 0
##$YMAX_a= 175225
##$YMIN_a= -114383
##$ZGOPTNS= <>
##$ZL1= 120
##$ZL2= 120
##$ZL3= 120
##$ZL4= 120
##$ABSF1= 10
##$ABSF2= 0
##$ABSG= 5
##$ABSL= 3
##$ALPHA= 0
##$AQORDER= 0
##$ASSFAC= 0
##$ASSFACI= 0
##$ASSFACX= 0
##$ASSWID= 0
##$AUNMP= <proc_1d>
##$AZFE= 0.1
##$AZFW= 0.1
##$BCFW= 1
##$BC_mod= 2
##$BYTORDP= 1
##$COROFFS= 0
##$CY= -3
##$DATMOD= 1
##$DC= 2
##$DFILT= <>
##$DTYPP= 0
##$F1P= 0
##$F2P= 0
##$FCOR= 0.5
##$FTSIZE= 0
##$FT_mod= 4
##$GAMMA= 1
##$GB= 0.15
##$INTBC= 1
##$INTSCL= 1
##$ISEN= 128
##$LB= 0.25
##$LEV0= 0
##$LPBIN= 0
##$MAXI= 10000
##$MC2= 0
##$MEAN= 0
##$ME_mod= 0
##$MI= 1.114404
##$NCOEF= 0
##$NC_proc= 0
##$NLEV= 6
##$NOISF1= 3.799351
##$NOISF2= 2.8
##$NSP= 1
##$NTH_PI= 0
##$NZP= 0
##$OFFSET= 14.38212
##$PC= 1
##$PHC0= -1254.035
##$PHC1= -4.807778
##$PH_mod= 1
##$PKNL= yes
##$PPARMOD= 0
##$PSCAL= 0
##$PSIGN= 0
##$REVERSE= no
##$SF= 200.129724274929
##$SI= 16384
##$SIGF1= 3
##$SIGF2= 2
##$SINO= 400
##$SIOLD= 16384
##$SREGLST= <1H.CDCl3>
##$SSB= 0
##$STSI= 0
##$STSR= 0
##$SW_p= 3205.1282051282
##$SYMM= 0
##$S_DEV= 0
##$TDeff= 0
##$TDoff= 0
##$TI= <>
##$TILT= no
##$TM1= 0
##$TM2= 0
##$TOPLEV= 0
##$USERP1= <user>
##$USERP2= <user>
##$USERP3= <user>
##$USERP4= <user>
##$USERP5= <user>
##$WDW= 1
##$XDIM= 8192
##$YMAX_p= 0
##$YMIN_p= 0
$$ End of Bruker specific parameters
$$ ---------------------------------
##NTUPLES= NMR FID
##VAR_NAME=  TIME,          FID/REAL,        FID/IMAG
##SYMBOL=    X,             R,               I
##VAR_TYPE=  INDEPENDENT,   DEPENDENT,       DEPENDENT
##VAR_FORM=  AFFN,          ASDF,            ASDF
##VAR_DIM=   8192,          8192,            8192
##UNITS=     SECONDS,       ARBITRARY UNITS, ARBITRARY UNITS
##FACTOR=    0.0002768,     1,               1
##FIRST=     0,             0,               0
##LAST=      2.2672688,     0,               0
##MIN=       0,             -114383,         0
##MAX=       2.2672688,     175225,          0
$$ Real data points
##PAGE= N=1
##DATA TABLE= (X++(R..R)), XYDATA
0@%%%%%%%%%%%%Qj6J6j6J6k4L2m0M8n6O4p2Q8j04J20j36J60j84K08k40K72l12
$$ 0 0 0 0 0 0 0 0 0 0 0 0 0 8 -8 8 -8 8 -16 16 -24 24 -32 32 -40 48 -56 64 -72 88 -96 112 -128 144 -168
34a68L52l92M45n01N60o24O96p76Q61r54J057j169J290j423J567j725J901k095
$$ -168 184 -208 237 -264 296 -328 368 -408 453 -501 556 -613 677 -746 821 -904 997 -1098
52a098K309k546K810l109L447l833M280m803N426o181P121q329R945j2224J5698
$$ -1098 1211 -1335 1475 -1634 1813 -2020 2260 -2543 2883 -3298 3823 -4506 5439 -6785 8913
67H913k1705L4858j11398P2733J78258k29674L3103J22927j52298l6153K19524
$$ 8913 -12792 22066 -89332 -16599 161659 -68015 -34912 88015 -64283 -100436 119088
78A19088o4062j48325R6881L4986j14108R0204R3997j44364o4489J40003q67p6591
$$ 119088 55026 -93299 3582 38568 -75540 14664 108661 -35703 -100192 39811 38944 -37647
90c7647P1908N245j28393N8228J19781q4692m8289P9619n7098m1775J28287q748
$$ -37647 34261 39506 -88887 -30659 89122 4430 -43859 35760 -21338 -63113 65174 56426
102E6426j25593O1301M7582r5417N5943J00540j30107o5687J38452k487q5744
$$ 56426 -69167 -7866 39716 -55701 242 100782 -29325 -95012 43440 40953 -44791
113d4791Q1831J518j32259P6753J20200j21998l9613J21519p3085p8896J57373
$$ -44791 37040 38558 -93701 -16948 103252 -18746 -58359 63160 -9925 -88821 68552
124F8552J0630j64400N7518R0822j00100J9487J02329j05740o6212J29097P451
$$ 68552 79182 -85218 -27700 63122 -36978 -17491 84838 -20902 -87114 41983 49434
135D9434r3313N1808L1264r1780K3107R8419n5288o6737O7793N087o5651O2786
$$ 49434 -43879 7929 39193 -52587 -29480 68939 13651 -53086 14707 19794 -45857 16929
147A6929M6821j04761q487R6063m1260l7389P9949m2214q3206J00199M2605j06823
$$ 16929 63750 -41011 -49498 46565 5305 -32084 47865 5651 -77555 22644 65249 -41574
159d1574K4002O2389q2319M543J00595n7970o8675P5490K657n7600O4942K0297
$$ -41574 -17572 44817 -37502 -32959 67636 9666 -59009 16481 19138 -38462 26480 46777
171D6777j02322J8331R3053m6907m3502O0255k1539n6195P1031L3777q3065L043
$$ 46777 -55545 -37214 55839 8932 -34570 25685 4146 -52049 18982 52759 -30306 -27263
183b7263N5555m2459o085O7671l9626o4467O2170L0626n7059K0933L3096o6499
$$ -27263 28292 -14167 -20252 47419 7793 -56674 5496 36122 -20937 -4 33092 -33407
195c3407l026Q3373k3928o1538M2887J0375m9928M4822M0058p5898j1036O7284
$$ -33407 -36433 46940 23012 -38526 4361 14736 -35192 9630 49688 -26210 -37246 30038
207C0038k9843k5151O5142k6331p4529O0403M8347o2609L587L7964n4854l560
$$ 30038 195 -24956 40186 13855 -60674 -271 48076 -14533 -10946 27018 -27836 -31396
219c1396P7735k4203n9492L8270J0990m0179M0394L3023o7453j6925N8794q018
$$ -31396 46339 22136 -37356 914 11904 -28275 12119 45142 -22311 -39236 19558 11540
231A1540k3858L6160j5349n4217L9443M8498m1521j6138K7838k8692r611O1315
$$ 11540 -12318 23842 8493 -45724 -6281 42217 696 -15442 12396 -16296 -25907 35408
243C5408o244o1546J9007K7782k9719K0719L5398n6167k8929N9489O162l1840
$$ 35408 29164 -32382 -13375 14407 -15312 5407 40805 -15362 -44291 15198 21360 -10480
255a0480K6453p839n1968L6967N2426m3231k2725K9959k2914r960N8306o148o2005
$$ -10480 15973 8134 -43834 -6867 45559 2328 -20397 9562 -13352 -23312 34994 28846 -33159
268c3159J5757L1549k2051J4273K6521m8835k4868N4367J1140l2107J3830j018
$$ -33159 -17402 14147 -7904 6369 32890 -15945 -40813 13554 24694 -7413 6417 5399
280E399l8818K5989M7357l3278l0087K5878o258j3186M1363J984n4248P043L7146
$$ 5399 -33419 -7430 39927 6649 -23438 2440 -3818 -17004 24359 26343 -27905 -20862 16284
293A6284j6095j117K4555l2336k6690M5387J6114l4096O666R001l1440J4540M3003
$$ 16284 189 -928 23627 -8709 -35399 9988 26102 -7994 -1328 7673 -23767 -9227 33776
306C3776k6314l1465K5306R98j6883L1494O403m6870M179L6051j4559o386K2901
$$ 33776 7462 -24003 1303 2301 -14582 16912 23315 -23555 -19376 16675 2116 -4270 18631
319A8631k3985k4572L8448J5252l1649M045J1293k4951R397L5792k0943k8617
$$ 18631 -5354 -29926 8522 23774 -7875 -3830 7463 -17488 -8091 27701 6758 -21859
331b1859K1719N596j5920K1233Q098l7244L20L3602r574j2958J8378j2667k2614
$$ -21859 -140 5456 -10464 10769 18867 -18377 -18057 15545 5971 -6987 11391 -1276 -23890
344b3890K9821J7493l0953k229J7906j7197P45L0625j5764k9398K1810J2511j8826
$$ -23890 5931 23424 -7529 -9758 8148 -9049 -8304 22321 6557 -22841 -1031 11480 -7346
357g346J1722J0127l0379M15L3219r953j8818J6358m441j8020K4036J3594l0183
$$ -7346 4376 14503 -15876 -15461 17758 7805 -11013 5345 904 -17116 6920 20514 -9669
370i669l272K1278r901l780K0640j2725k3173K0944J4573j9047K324J0174j9711
$$ -9669 -12941 8337 -1564 -5344 15296 2571 -20602 342 14915 -4132 -1808 8366 -11345
383a1345N81K8367r376k2812J4228N458j4841J4607J1367k6546m044K4214n812
$$ -11345 -10764 17603 8227 -14585 -357 5101 -9740 4867 16234 -10312 -14356 9858 4046
396D046r670J5149q388j9756K0487J5919k1656l562J3417j2410j700K3810p884
$$ 4046 -5624 9525 1137 -18619 1868 17787 -3869 -7431 5986 -6424 -8124 15686 7802
409G802k3300J2598R743j2697J0055R651k4892m165K6042l351j3139J1379n355
$$ 7802 -15498 -2900 6843 -5854 4201 13852 -11040 -15205 10837 7486 -5653 5726 371
422C71j6857J8390J5918j9666o969J1031p048P2J9255p256k2252R354J2899r193
$$ 371 -16486 1904 17822 -1844 -8813 2218 -4830 -4758 14497 7241 -15011 -5657 7242 -1951
436a951M684R427k0962r026K6505M726j7902M386N94j4369J4994J7967k0252j0526
$$ -1951 2733 12160 -8802 -17828 8677 13403 -4499 -113 481 -13888 1106 19073 -1179 -11705
450a1705J3909n492k145K1089o890k6421R227J7589o867M18M553j6909m392K2586
$$ -11705 2204 -3288 -5433 15656 8766 -17655 -8428 9161 2294 2712 7265 -9644 -14036 8550
464H550L937j4960L37k05q452J3505J5046j8082j3424J3355J822m288J3659k945
$$ 8550 12487 -2473 -2136 -2341 -10793 2712 17758 -324 -13748 -393 1429 -2859 10800 7855
478G855k2852N419J8987m591l825L593j3168l628K1959K549j8179K296N652j0508
$$ 7855 -14997 -9578 9409 4818 993 4586 -8582 -12210 9749 12298 -5881 -3585 2067 -8441
492h441P303J7200j3916j6136J2362N276n668J0225j598k0760O519J8992q557
$$ -8441 -1138 16062 2146 -13990 -1628 3648 -2020 8205 6607 -14153 -7634 11358 2801
505B801n666Q660j0654p409J9672M448j6715O14N432o939N846J1774j0839j1693
$$ 2801 -2865 5795 -4859 -12268 7404 11852 -4863 -4249 1183 -5756 90 11864 1025 -10668
519a0668Q899N132m002N639J92j5024J704J7351l545j0622O609j445r409J1708
$$ -10668 -1769 3363 -639 5000 5192 -9832 -8128 9223 5678 -4944 1665 220 -9189 2519
533B519Q629j4190k511P948o872K548J4276j0987j4805J3297P430r737L836L685
$$ 2519 11148 -3042 -5553 2395 -4477 -1929 12347 1360 -13445 -148 7282 -2455 1381 5066
547E066j2596J576J3915m624p226N939l587n934J2465M427j4926q63J0194m238
$$ 5066 -7530 -5954 7961 3337 -3889 2050 -1537 -7471 4994 9421 -5505 -6368 3826 -412
561d12j461Q821o496j0305J0061P337q546q14L908o260J287J0274n139r017P431
$$ -412 -1873 6948 452 -9853 208 7545 -1001 -1815 2093 -4167 -2880 7394 2255 -6762 669
576F69K614q229O027P423j2751m466J3893m23q589N499o42p955Q992N835j2166
$$ 669 3283 -4946 1081 8504 -4247 -8713 5180 4757 -3832 1667 1025 -6930 2062 7897 -4269
591d269M40R001p833j893J2367m867j1341P940N096o719L164L127r329M39J0290
$$ -4269 -3829 5172 -2661 -4554 7813 2946 -8395 -455 4641 -2078 1086 4213 -5116 -4677 5613
606E613k637n951L824j340m469P655M407j0016k560P845j618k984O813j738r890
$$ 5613 2976 -2975 849 -491 -4960 2695 7102 -2914 -5474 2371 753 -2231 4582 2844 -7046
621g046M212Q115m277j319K935p271j094J2594j143j1252M015L867o935N066Q072
$$ -7046 -2834 5281 1004 -315 2620 -4651 -5745 6849 5706 -5546 -1531 2336 -4599 467 8539
636H539j0134n620Q684m41k308P362m426j1055P447Q815o060j426K580o976K5
$$ 8539 -1595 -7215 1469 1028 -1280 6082 1656 -9399 -1952 6863 803 -623 1957 -5019 -4994
651d994J1353o71r272P15K256k034N277M498q917n762P260L290k168K903k806
$$ -4994 6359 5688 -3584 -2869 -613 -2647 2630 7128 -1789 -7551 -291 2999 831 3734 928
666I28r257M985J1153m313o582K619k125j557R427J197j0707q6N360k704K895
$$ 928 -8329 -3344 7809 3496 -3086 -467 -2592 -4149 5278 6475 -4232 -4318 1042 -1662 1233
681A233O089q787p386R280M477n046J909n09p969M125R408m639m887L240k990
$$ 1233 7322 -1465 -8851 429 4906 -140 1769 1260 -6709 -2584 6824 2185 -2702 538 -2452
696b452j615Q943P20r249J06M155j690K515L954o444n315N984M041k728K00m30
$$ -2452 -4067 4876 5596 -3653 -3547 608 -1082 1433 5387 -1057 -6372 -388 3653 925 1125 695
712F95n283J748P865j741n886K025nl142O254L865q906k573O495j122o96N275
$$ 695 -4588 -2840 5025 3284 -2602 -577 -582 -3724 2530 6395 -2511 -5084 1411 289 -407 4868
728D868m688o949O666M547m947R52J494o299J277Q147k309n526K339p7k280N252
$$ 4868 180 -6769 -103 4444 -503 449 1943 -4356 -3079 5068 2759 -2767 -428 -505 -2785 2467
744B467K284p153j633N267l97j088L194k843m952M560M240l942r04J968l332O1
$$ 2467 4751 -2402 -4035 1232 835 -253 2941 98 -4854 -294 3946 4 -900 1068 -2264 -2203
760b203N918j389n488K104K296k569K010K573n130j709N685k44l614K778k5m473
$$ -2203 3715 2326 -3162 -1058 1238 -1331 679 3252 -1878 -3587 2098 1854 -1760 1018 993 -3480
776c480L459M035n097j357M344k326j677M966j508n068L645K592l935J081K553
$$ -3480 -21 4014 -1083 -2440 1904 -422 -2099 2867 1359 -3709 -64 2528 -1407 -326 2227
791B227m014m14M850j494l404K640N93k897K231K363l823j165L686o09k033K481
$$ 2227 -1787 -2201 2649 1155 -2249 391 984 -1913 318 2681 -1142 -2307 1379 770 -1263 1218
807A218k78l685K255L312l151j098K799k111j521M620p3m881J590K486k651J316
$$ 1218 940 -2745 -490 2822 -329 -1427 1372 -739 -2260 2360 2287 -2594 -1004 1482 -1169 147
823A47K927m286k117M717J68k560K355p25m166L022M091l295j773J964j786l15
$$ 147 3074 -1212 -3329 1388 1556 -1004 1351 626 -3540 -518 3573 278 -1495 469 -1317 -1632
839a632M597n62m950P31K573r20J184J540m066k114M423J627k360M03o18l091
$$ -1632 2965 2403 -2547 -1816 757 -163 1021 2561 -1505 -3619 804 2431 71 474 -144 -3235
855c235K600M593k701l485J464K9j91L734k11n335L5L701k02R0J227l570k447
$$ -3235 -635 3958 1257 -2228 -764 -735 -926 2808 2597 -2738 -2703 998 796 886 2113 -1457 -3904
872c904M694K409l098m35K07k678K065M684k576l905J692M73m78L432k14n081
$$ -3904 790 3199 101 -334 -127 -2805 -740 3944 1368 -2537 -845 -372 -850 2582 2368 -2713
888b713L61L465o33J80J343l227k165L827K151k139p13j28j659J306L487j098
$$ -2713 -2352 1113 480 660 2003 -1224 -3389 438 2589 450 -263 -391 -2050 -744 2743 1645
904A645l306N17Q80n54K378J256m377j529L798M70j087J601j862l214L099K964
$$ 1645 -1661 -1144 -264 -818 1560 2816 -1561 -3090 708 1178 91 1692 -170 -3384 -285 2679
920B679k222o09K81k482J161M251j330l569Q05Q41n65K184J002l653j414K867
$$ 2679 457 -152 129 -2353 -1192 3059 1729 -1840 -1035 -194 -759 1425 2427 -1226 -2640 227
936B27Q34n31Q13j754k501K765K712k204j008Q99j719J84L596m65l436K69J430
$$ 227 1061 530 1343 -411 -2912 -147 2565 361 -647 252 -1467 -1283 2313 1848 -1588 -1319 111
953A11k25J070N87k567r24K519M80j323R32j77k541J245L149j688k094J594k25
$$ 111 -114 956 1543 -1024 -1948 571 1051 -272 660 483 -2058 -813 2336 648 -1446 148 -77
970g7r66K270%k712J035J338j700Q85J638k474q66K617k76j556J235K04j600O24
$$ -77 -1043 1227 1227 -1485 -450 888 -812 73 1711 -763 -1629 988 712 -844 391 595 -1005 -381
988c81J341q57n12O96n26m26J422Nj805O93J500j568n56K137o14j926J447R02
$$ -381 960 103 -409 287 -239 -665 757 762 -1043 -350 1150 -418 -974 1163 549 -1377 70 972
1006I72j548M77Q35j579M22J774j586j096K163j10j899J332R56k034K17J910j074
$$ 972 -576 -99 736 -843 -421 1353 -233 -1329 834 724 -1175 157 1113 -921 -704 1206 132
1023A32r54J275m83q24J673P3j972O28J156j052K96J200j527j126J861Q15j224
$$ 132 -822 453 -30 -854 819 892 -1080 -452 704 -348 -52 1148 -379 -1505 356 1171 -53
1040e3k13J57n97O80J212r04j128O71J35m30J394L63k530l62K441J62j117M06
$$ -53 -266 -109 -706 -26 1186 282 -846 -175 -40 -470 924 1287 -1243 -1605 836 998 -119 287
1058B87p34r68J940J001j824j41N87j214P82K270j430k198J199Q46n16R77Mk118
$$ 287 -447 -1415 525 1526 -298 -439 148 -1066 -284 1986 556 -1642 -443 403 -113 864 868 -1250
1076a250O6J839jl60J62j265n43J939P81j425m14L71n90L68J605l14j899j57J099
$$ -1250 -1184 655 654 294 456 -809 -1352 587 1368 -57 -471 -100 -690 -322 1283 969 -930 -1087 12
1095A2L48L98Pj667m90J929L59j055O26l23j834J251K257j246j280M88n66L14
$$ 12 360 758 765 -902 -1392 537 896 -159 467 144 -1690 -439 1818 572 -708 -220 -786 -472
1113d72K058o00k148L92P79j84J058L35k080p02J710P57m30j12p46r57J043J628
$$ -472 1586 986 -1162 -770 9 -175 883 1218 -862 -1564 146 903 473 361 -385 -1342 -299 1329
1131A329m47j235l59j08O79J531l72k002j40J220K26J93K99j257r97J313J135
$$ 1329 882 -353 -712 -820 -141 1390 1018 -984 -1124 96 322 515 814 -443 -1440 -127 1008
1148A008m92l80m63q73R36J735q39j477N32J62l17J320K48j928p5J237l17J86
$$ 1008 516 136 -327 -1200 -264 1471 632 -845 -313 -151 -468 852 1100 -828 -903 334 17 203
1166B03P54j328q85J436M97o45K56l04r43P22J144m76p51M7N3MN76L38q31n82
$$ 203 957 -371 -1256 180 677 32 288 -16 -959 -237 907 431 -320 -273 -220 -216 360 698 -133 -715
1186g15N98L16j08M67l98j170O71J163o38l64M13p19j27J342j31j075L79J17n29
$$ -715 -117 199 91 558 160 -1010 -339 824 186 -178 235 -484 -611 731 600 -475 -96 21 -508
1205e08Q40N46j224l47Q78p2j41N31n18p84Q01O10o52j02K71m52P5P72k60p13
$$ -508 332 878 -346 -693 185 113 -28 503 -15 -799 2 612 -40 -142 129 -323 -248 524 264 -449
1225d49L13K88k48K16J94o13j13P27K1n51J18J78l33L07M72o80m20P74J08m97
$$ -449 -136 152 -96 120 314 -299 -412 315 336 -215 -97 81 -252 55 527 -153 -573 201 309 -188
1245a88L64l7p42N52P37p34k98N11l85o1R21l29j004M87M94l72K77J78q43l6Q76
$$ -188 176 139 -603 -51 686 -48 -346 165 -220 -281 640 311 -693 -206 288 -84 193 371 -472 -508 368
1266C68m1l80J38k71l19O51M87n71m20J83N8J38M44j46p69m0O28J03o2R7n41m54
$$ 368 327 -53 85 -186 -505 146 633 62 -358 -175 -117 21 465 319 -450 -490 138 241 179 276 -265 -719
1288g19Q38N43n99j45L1n46M64R91n65p89K87k4P0Q93j84j177L5O55J12K83Nr50
$$ -719 119 662 63 -82 -51 -597 -133 858 293 -496 -209 -233 -163 730 546 -631 -596 59 171 454 459 -491
1310d91l54R30N95k97l86m05k77O64R02l72r31j58K75L95O80j84j203k62Q91M91
$$ -491 -845 85 680 383 -3 -408 -685 -21 881 509 -422 -580 -305 90 770 586 -617 -879 12 503
1330E03K1k43q07l48R21P95l96o47k88q9N81Q91l44j127p5N43K30M87qj218k91
$$ 503 524 281 -526 -874 47 842 446 -201 -489 -578 3 894 550 -577 -652 -109 121 608 600 -618 -909
1351i09J069L49k12no99m71R93O32m96l21k48l00O37P63l77p80j53L08M03K97
$$ -909 160 509 297 292 -407 -878 115 747 251 -70 -318 -618 19 782 405 -375 -528 -220 183 480
1371D80j15o40m16N37O36j09k35l38m71N00Q80l16o19Oj82J90Q64j00r45j33L90
$$ 480 365 -275 -691 -154 482 373 138 -200 -671 -171 709 393 -226 -220 -402 -212 652 552 -393 -526 -136
1392a36K03M10k2q29k78O33L96r4o8m27m43N32Q03l00o24n6L2K23N79j61p72j1
$$ -136 67 477 455 -374 -652 -19 377 283 215 -212 -655 -123 680 380 -244 -300 -268 -45 534 373 -399 -410
1414d10L83J26K41l2o72j74O37L26k53k75j14j8K60L55j78m89K3K75N6J91n1o05
$$ -410 -27 99 340 308 -364 -538 99 425 172 -103 -217 -235 25 380 202 -287 -264 11 67 258 207 -398
1436c98L7O85j12l21K07k07k45N61J56n07NJ38j49K89K33n18k14M43R5j93R0m4
$$ -398 -361 324 212 -109 98 -109 -354 207 363 -144 -139 -1 -150 139 372 -146 -360 83 178 -15 75 31
1458C1k76J22L69o2k98l2M9Q1K49l3m36j0L41mn5J41k15l71L38M46j98k89l5q0
$$ 31 -245 -123 246 184 -114 -146 -97 -16 233 200 -236 -246 95 91 36 177 -38 -409 -71 375 177 -112 -147 -227
1482b27K05M19k15m49R3J05J0L95L5p16j57N91K00q9n7m11k03N46L63k21k66k61
$$ -227 -22 397 182 -267 -174 -69 -59 336 371 -345 -502 89 289 200 143 -268 -471 75 438 217 -49 -310
1504c10j38N22N69l75p00j8L79K73K04j66o02k22N41N18m1m02n32p0P11N83m48
$$ -310 -448 74 643 268 -432 -450 -71 202 406 240 -362 -584 -43 475 434 32 -500 -570 141 724 276
1525B76o44n8K05L39M76k14q63j47O12M01J12k96p44q6Q53L70l58k70l70j74P61
$$ 276 -368 -426 -221 118 594 380 -483 -630 -18 383 495 199 -545 -631 222 592 234 -36 -406 -580 181
1546A81N76n35o10q0K16N18L32m39o11pL83M12J52l49n98j23O40N79k93n58j78
$$ 181 757 222 -388 -468 -252 266 598 159 -452 -459 -76 336 488 139 -459 -582 58 637 344 -214 -392
1567c92O7L93N22k47o71j00K13L13M83k21q53j00O40L30rk15n68j51O46M69k39
$$ -392 -325 68 590 343 -328 -428 -215 98 581 360 -493 -593 47 377 368 153 -415 -566 80 549 310
1588C10m00l17l7N69N21l89o38k6K40L19L72k50p39q7N86L72j2l63n17N1O20L20
$$ 310 -90 -407 -444 125 646 257 -381 -407 -167 152 524 274 -465 -552 34 406 394 31 -486 -435 185 505
1610E05k90m03j70J21L55L66k08o63r6N24K70k8j91m74m9O45J98l56j32j38j34
$$ 505 215 -188 -358 -237 118 484 276 -387 -483 41 311 283 92 -382 -431 214 412 56 -76 -214 -348
1631c48N34L08m90l12J50N4K62K10l80l59K04K82Q0j7k30k70J76L71K0k60j50
$$ -348 186 494 4 -308 -158 -104 158 368 -12 -371 -167 115 195 178 -52 -322 -146 225 245 -15 -165
1652a65K7Q6J84J13k54k52J41K10N3Lj88k77J99L90p3k67k4p2O5L54pm09o4J79
$$ -165 -138 -52 132 245 -9 -261 -120 90 143 146 -42 -319 -120 270 197 -70 -94 -166 -101 253 246 -163 -227 -48
1676d8M3J96P0m47k01L90K08n1o5k78k02M22L63k34l00r0J6K73L33j80m86q3K95
$$ -48 -5 191 261 -186 -387 3 211 160 95 -183 -385 37 400 166 -134 -224 -208 65 398 218 -268 -351 -56
1699e6K64J11j87m48j23M66M17j81l81k38L0M28M27k60o10q0L26L09K12k21o24
$$ -56 208 319 132 -316 -439 27 444 263 -118 -356 -326 102 529 269 -341 -421 -95 214 426 205 -419
1720d19j21O19L52j28k85m66n5P08L97m20m30j58R3N82L39m91n39K1L03M44J83
$$ -419 -540 79 431 303 18 -448 -503 205 602 182 -248 -406 -313 269 608 117 -422 -401 -98 346 529
1741E29m87n51J02N12L50j17m65l46J13N39L96l28n89r7K74L85L17l47o72K8M95
$$ 529 42 -509 -407 105 455 338 -127 -473 -360 179 575 247 -342 -439 -165 220 537 190 -482 -454 41
1762D1K47J12k61o48PO80L04k22l36l67M9O03L59l58m99j47K27M59L17m13o33
$$ 41 288 400 139 -509 -502 178 482 260 -76 -443 -394 209 568 210 -289 -436 -209 250 567 154 -479
1783d79J0N19L09M1l38n59N4O28L13k40l94l47J42O32K52l94m98r7L44M39J09
$$ -479 -469 50 359 400 62 -497 -443 185 498 258 -136 -483 -341 291 543 149 -349 -446 -102 337 446
1804D46l61n30k1N85L36j98l19l43nO31L23m55l56l9P3M79K82n24m43K02K54K50
$$ 446 85 -445 -466 119 455 257 -62 -405 -410 221 544 89 -267 -306 -233 246 528 4 -439 -237 17 267
1826B67J01m38l72K58L63J34j36l34k04K34L83P9l33k88N8K43K06N0l33k95J95
$$ 267 368 -70 -442 -184 179 313 177 -157 -361 -127 256 335 2 -286 -228 15 221 271 -62 -357 -162
1847a62L15L9o2k00k56K12L73l6k51j15n9J44K97J3l54j75J90J80Q1mk77k08K73
$$ -162 153 192 130 -70 -326 -114 259 223 -28 -143 -202 -58 239 252 -102 -277 -87 93 174 170 -107 -315 -42
1870d2K78q9j23j31j66K44L75j64l32n8P3K15K22j67l71k4K31K23N6k09l17pL37
$$ -42 236 147 24 -107 -273 -29 346 182 -150 -208 -135 80 302 135 -236 -260 -29 194 250 41 -276 -283 54
1893E4K82j41l47j36J29K75K53j95m66n6L44K54O4k44m56M2N22J91k06k39k63
$$ 54 336 195 -152 -288 -159 116 369 174 -292 -348 -4 250 314 70 -386 -344 178 369 163 -76 -339
1914c39N1N15K57l86l98l7K35M02J41m59m31J67M03K17l9l90l63J68N46J90l26
$$ -339 -288 227 484 98 -300 -337 -102 300 441 -18 -449 -282 121 338 299 -91 -454 -286 260 450 124
1935A24l97j27K68M62R9m03m09M3L75L10J8m03m37J72N19J85k22l24k71J69N41
$$ 124 -273 -400 -132 330 429 26 -383 -340 35 345 363 -40 -477 -305 214 399 177 -147 -418 -249 292
1956B92J54l65l56q4K12M69J53m99m26J52L59K71K1m01m17J67M98K14j85m03l09
$$ 292 446 81 -275 -359 -147 322 475 -24 -450 -298 61 332 353 -48 -465 -298 200 414 229 -174 -483
1977d83K61N66R7l87l58o1K77M43O6m48m14R6M48L21j25m73k80K24N09J54l14
$$ -483 -222 344 441 54 -304 -365 -88 355 421 -27 -441 -345 103 424 299 -174 -454 -230 279 433 119
1998A19l60j35K15N00J20m89l81J31L25L11%m87l27K87L70J23r6m20k66L49M59
$$ 119 -241 -376 -161 339 459 -30 -411 -280 45 356 356 -131 -458 -171 199 322 226 -194 -460 -111 348
2019C48j4l27k79l6L16L34p3l61k28J16L41J90j23l78j85K86L44k9k27k09o2K39
$$ 348 334 7 -272 -308 8 342 269 -92 -320 -204 137 327 204 -174 -359 -73 271 242 15 -194 -256 -17
2041a7L03o9l12j30O2K32K04r5l63q8K44J88J1r5k22j15K65K53j27j99r7j8K34
$$ -17 286 217 -95 -225 -163 69 273 178 -185 -273 -29 159 170 75 -147 -262 3 256 129 -70 -167 -185 49
2064D9K29j73k81LJ10J52J56j45l14lK67J56l8k10j85Q2K64J32j59k48o3J55K26
$$ 49 278 105 -176 -173 -63 89 245 100 -214 -217 50 206 168 -42 -227 -145 119 251 92 -156 -219 -64 162
2087A62P9j99l07K6L23J50r0k08k32J05L90R8k41k22p7J43L57O2l73k43J12K41
$$ 162 241 42 -265 -239 84 234 144 -64 -296 -191 199 297 56 -166 -243 -100 257 319 -54 -297 -185 56
2109E6K06j7l68k32K25L42P4j55l32j46K92L91m8l47k30M7L01K61o9l81k35K11
$$ 56 262 245 -123 -355 -130 212 286 131 -201 -347 -55 336 288 -59 -289 -242 59 320 251 -130 -365 -154
2131a54L42J27j77l46j73K94M17l2l37k33NK63L51o2m20j92J49K97J89r1m09j90
$$ -154 188 315 138 -208 -381 -87 330 298 -39 -272 -267 -4 347 285 -135 -327 -178 119 308 217 -192 -382
2153c82K89L22P4k00l45j17L16L72m0l18k51oL18L38j19l82j93J29L31K36j86
$$ -382 -93 229 303 103 -242 -359 -43 329 289 -29 -280 -286 32 370 251 -131 -324 -195 136 372 186
2174A86m06j52K67L50R4k90l42n2L38L49m5l79k53J00L06K81q6m56k01K72L37
$$ 186 -220 -372 -105 245 339 49 -293 -345 -7 342 297 -82 -335 -235 71 352 266 -190 -391 -119 218
2195B18J13j74m11j50L98L39p8k51k68m6L72L13j68l43j62J17L31K02k24l56q4
$$ 218 331 157 -254 -404 -6 333 255 4 -264 -310 62 375 207 -136 -298 -181 150 352 128 -228 -312
2216c12K59K97L5k62k71j6K97K74j05k87j64Q9K70J79j59k96p6K02K07Q3j79k89
$$ -312 -53 244 279 17 -254 -270 27 301 196 -91 -255 -166 104 283 124 -172 -248 -46 161 244 65 -224
2238b24OK61J77p2j86j48J8K50J53j50k02m7P8J83J40j87k53O0J60J09L0j51k14
$$ -224 -218 43 220 148 -38 -186 -168 82 235 85 -117 -164 -86 97 237 50 -203 -143 17 126 156 5 -209
2261b09P7K09P8o8j69j20J17K16M7j42j79j7J71J33Mj57j87N0K50Q8j31j38j11
$$ -209 -132 77 155 87 -82 -202 -85 131 178 36 -143 -160 11 144 148 -9 -196 -146 104 192 61 -77 -188
2284a88R9K57K5k10j33K5J17K06k0k74j25J61J67P0q8k26r7K14K12l0j79j65n
$$ -188 -89 168 193 -17 -150 -125 -8 198 178 -96 -221 -60 107 177 89 -137 -234 -20 192 162 -17 -182 -187
2307a87K18K16j17k50j00J36K11J05j54k55m6K13K22j2k18j92K3K42J99j04k83
$$ -187 31 247 130 -120 -220 -84 127 232 78 -177 -223 -10 212 200 -18 -210 -187 55 254 150 -133
2328a33r8J34K17J27j40k93n7K43J92qj63k49ML13J46r9j98j57M1K95J49j81k50
$$ -133 -231 -97 120 247 107 -186 -243 0 192 184 21 -228 -224 89 235 136 -62 -219 -178 117 266 85 -165
2351a65n9J46K39Q4k07k50nK21J99J3k16k44M6K75J79r6k50j50R3K61J57j47k97
$$ -165 -224 -78 161 245 38 -212 -217 4 203 216 0 -244 -198 77 256 160 -90 -240 -147 114 271 124 -173
2374a73q0K01K47N2k02k88jK81J98n3k13k14K9L29J90j87k52j14J19L09J18k60
$$ -173 -253 -52 195 247 45 -243 -244 37 235 182 -31 -245 -216 113 303 116 -136 -250 -131 178 296 36
2396C6k66K2J88K30K6k48k54P8K77J70j15k50j37J20K58J09j69k44l9J79K08L9
$$ 36 -230 -208 -20 210 236 -12 -266 -188 89 259 144 -106 -243 -123 135 244 75 -169 -208 -29 179 218
2418B18k12k28N6K26J39n6k02j51P8K35J00j32j91o9J29K05L8j79j59L5J30J13
$$ 218 6 -222 -166 60 199 143 -59 -210 -132 103 203 71 -120 -189 -60 145 183 4 -155 -120 10 123
2440A23K4j72j57Q3J77O0n3j42j09J10J73Rj12j05l5J09J43nj36j16K9J42R8p0
$$ 123 147 -25 -182 -99 78 138 85 -57 -166 -56 117 126 14 -91 -126 -17 126 121 -15 -131 -102 40 138 68
2464F8j22q6Q1J29M8j07r7k8P1J59Oj68r3Q0R7R4l1j75o0J19J08K0p3j46l8J78
$$ 68 -54 -140 -59 70 118 11 -86 -114 -43 116 122 -46 -139 -59 38 132 101 -74 -134 -15 93 113 40 -106 -144 34
2490C4J04n0j41o4M7J29Q4r8j49k1J13J15J7j22j43L1J67R5o8j52o8P9J52N6j14
$$ 34 138 88 -53 -117 -70 59 143 45 -104 -125 -12 103 120 -2 -145 -114 53 148 80 -72 -140 -61 91 147 33
2515C3j54j0J37J28j0j38j47M2J92Q2q7j24q5O1J95N9j48j42j2J01J64J9j79j34
$$ 33 -121 -131 6 134 124 -14 -161 -119 73 155 68 -56 -141 -80 115 174 26 -116 -128 -27 137 156 -23 -157
2539a57N6J38R3oj76j22Q8J83N1q3j60o7J27J64K2j30j46k6J45J44J9j82j57N3
$$ -157 -101 37 130 124 -52 -174 -86 97 148 65 -95 -162 -35 129 151 21 -125 -151 -6 138 157 -25 -182 -129
2563a29J99R6o2j67j23Q3K15Q1j40j54o6J11K10M5j87j74L4J39J59j9k00j49P6
$$ -129 70 166 104 -63 -186 -103 112 193 53 -101 -167 -56 154 199 12 -162 -128 11 170 151 -49 -198 -122
2586a22K00R4o7k16r4J32K04M6j54j75j9J53J71Jj83j42L8J84J23o2j93r1J05
$$ -122 78 172 105 -111 -205 -73 131 177 23 -152 -171 -18 153 154 -29 -171 -133 51 174 112 -81 -172 -67
2609f7J84N0j26j53m5J27J70Kj50j27J7J38J26k3j79r0P7J25O0m1j42p9J10J49
$$ -67 117 167 41 -112 -157 -30 140 142 -8 -135 -118 20 146 123 -56 -146 -69 56 116 75 -67 -146 -36 113
2633A13k2p7r4l5J09J13l2j07o1PR5R3k4j25n7N4J10M4p1r3k5N4J00J2q8p2K0
$$ 113 91 14 -80 -115 -6 107 75 -32 -93 -86 9 102 78 -47 -104 -50 60 104 33 -60 -85 -31 69 81 -7 -79 -59
2660e9N5R1Kj26o2N1P4N3k5j15l4P8P2Mm3q3j6R4P8m9p4l6J7R9L4n4r8j1P6P1
$$ -59 -4 87 89 -37 -99 -48 26 79 54 -61 -95 -17 55 59 16 -67 -83 11 89 40 -34 -70 -53 46 80 26 -72 -83 -7 64
2690F4Np1q0K2J02N7o7p8k5M9P3K8p3q1RQ7N1j4p7p8M4R8M0p7p2%L4Q7L1j09o3
$$ 64 69 -2 -82 -60 42 99 32 -46 -71 -22 51 79 6 -75 -66 21 72 58 -19 -97 -53 45 85 8 -64 -64 -30 57 88 -21 -84
2721h4L9N1O5Nj16n5O9P3K3m0r1l3Q4Q3%p7o7oR4O9j7r6o5L7R4M5k1r6o0O2R0
$$ -84 -45 6 71 76 -40 -95 -26 47 70 30 -61 -94 -10 73 73 -4 -71 -77 17 86 69 -27 -92 -55 39 84 63 -33 -93 -31 59
2752E9L4q2p8j4N7J02Pj02p8J6P7R2j4j21o5O8Q8N4l4j19m5O3J10K4p1r3l3R4
$$ 59 93 11 -67 -81 -24 78 85 -17 -95 -79 -2 90 76 -45 -110 -42 46 100 66 -53 -98 -35 75 99 28 -65 -98 -4
2780dJ09oj21p1J2J13Q5n0j07o8M9J35M0p2j10m1Q5J10J4j08q8NQ7R6rj25o7M3
$$ -4 105 99 -22 -93 -81 32 117 67 -40 -108 -59 76 116 44 -66 -107 -22 88 102 -6 -94 -89 -2 94 85 -40 -107 -64
2808f4J10N0m9j08m0P0R5J6n8q3l9J00Q9k2o5p2J5P3O5l9o8n3J8Q7M7m2q7j9M6
$$ -64 46 96 47 -61 -101 -31 64 80 22 -61 -100 0 89 67 2 -70 -55 18 83 44 -24 -77 -59 28 75 33 -54 -73 -27
2837b7O0K1m1o9oL9P2J0o8n4J6M7M1J0p2m6L5M9K4j2n6m8N7N5J4l8m9k0N6N2j7
$$ -27 33 54 13 -56 -62 -23 49 59 -9 -63 -47 0 41 51 -21 -67 -32 17 41 29 -27 -75 -18 37 51 13 -36 -56 0 52 35
2868C5m4l6J2M6M2k3o5k3M1M9J0m3m1oM2L7%m5l3J0M7L3l3l0j0J9L5jk7k0jL4
$$ 35 -9 -45 -33 13 55 32 -33 -56 -15 34 44 1 -40 -46 -4 33 33 -12 -45 -35 12 45 12 -18 -28 -9 26 25 -2 -22 -23 11
2900A1L5l4l3j5L2K3K8m6l4J9J9J2J9l4m1L0L3mrk3k1M0K2ol1j9LJ8L1pk6k7K5
$$ 11 46 12 -21 -36 -4 19 47 1 -33 -14 5 17 36 2 -39 -9 24 20 11 -12 -33 7 29 23 -8 -27 -24 -6 25 18 -8 -35 -10
2933a0L2jj3l2QPL3J1l3k4JJ7L9Rm5k8QL1K8pm0l2J8M8Nj5l8l3M8M2J0l4l0j1
$$ -10 22 21 8 -24 -16 -9 24 35 2 -22 -21 -4 35 44 -1 -29 -21 10 38 31 -9 -41 -23 25 30 15 -23 -56 -8 34 44 10 -20 -31
2967c1K2N4rl6n1J8M1N1k7n7l0K3O5J9m1m8qK6O4J0m5n2J2M1L8%o1k8K7L9K4l4
$$ -31 -9 45 36 0 -51 -33 8 59 32 -25 -55 -32 33 52 11 -37 -45 -19 45 55 10 -42 -30 11 49 49 -12 -40 -13 26 50 16
2999A6l9l5M0O0pk0n7ML2L9Kl7l2mL9M7j9m7j9J5L8K4j4l0l1K2M5Ok1m6jJ9M3
$$ 16 -23 -58 -18 42 35 15 -42 -38 -6 33 35 -2 -34 -38 1 48 29 -18 -37 -22 16 40 26 -4 -35 -13 32 38 17 -29 -30 -11 32
3032C2Nk7m3PL2K8Mm1l3J1M0K8k0k7l8K3L6J4k6j3l2J0N7J3l4m0NK3M3Jl1k4K
$$ 32 37 10 -33 -26 6 34 38 -3 -36 -25 15 43 23 -4 -42 -19 17 31 5 -8 -40 -30 27 40 6 -34 -29 -6 37 38 7 -17 -15
3065a5K6L3j1m1k0J6L1J2k7l4J1J6K3Lj9k6ML6Npj7k2QK8K2k5j6k0J8K2J0k1j9
$$ -15 11 44 33 -8 -28 -12 19 31 4 -30 -19 -3 20 23 4 -22 -18 18 23 16 -1 -23 -15 13 35 10 -6 -26 -8 14 24 3 -16
3098a6J6j1K0Nk8MoK5Qj1k1LJ6KJ5j7%j8J9mJ1rk3J4J6p%nkJJ4j0Jj0jJ0K6j6
$$ -16 0 -11 9 14 -14 -10 -16 9 17 6 -15 -12 4 6 21 4 4 -14 5 1 12 3 -20 -6 10 3 3 -2 -4 -3 11 1 2 -8 -9 1 27 11
3136A1k3jKPK0%k6kJ5MRk0pmJ2K4j5poNJ4K0pl3j3L0RJk2j1j5K4K8kk7j3pK8K2
$$ 11 -12 -13 -11 -4 16 16 -10 -12 3 7 16 -4 -11 -15 -3 21 6 -1 -7 -2 12 32 25 -8 -21 9 18 19 -3 -14 -29 -5 23 21 -6 -19 -26 2 24
3175B4lm0j9K3K8J5j5m3jM5J9j1j8k9jK9L3j7k6k1J7L4Nk1l1oK4K8J0k8k9jL7
$$ 24 21 -19 -38 -15 13 28 13 -30 -31 14 33 22 4 -25 -26 3 36 19 -7 -28 -11 23 28 7 -24 -30 -6 22 32 4 -25 -26 11
3208A1J9rk7k3LM1PNl0k9J7K9J7j3l9k5M1K8JNn4PK7J8kj4l9NL1K7qk9l0J8K1
$$ 11 30 21 -6 -29 -26 15 22 27 -3 -32 -15 14 31 18 -21 -46 -5 23 24 29 -25 -18 9 27 25 11 -28 -23 8 35 27 -2 -32 -14 7
3243GL5j3n2j3K4L7J3j4n3mK0L9J3l6l0lL9L8j4l6k5PL1J7mm5j0K9L4J0l1l7m
$$ 7 42 29 -23 -36 -12 25 38 24 -29 -33 -13 26 39 3 -27 -30 9 47 33 -3 -28 -21 10 27 23 -22 -32 -3 31 41 10 -27 -31
3276c1L1L1Kl5j3j3L6K4j5k6lqL7J6k3l2oJ9L3kj4k9NK0K4j4k3pkK5J4lk5j8N
$$ -31 0 31 33 -2 -15 -28 8 32 17 -9 -12 -20 17 33 10 -22 -28 -9 24 22 8 -21 -16 4 28 14 -9 -16 -18 7 21 18 -7 -25 -20
3311b0L5J0nk9NMK1Nj9j8pK0K7j2j2llPK2k1k3OPJ4nnj0j3K4J4j2pooK8K2k4k0
$$ -20 15 25 20 -9 -4 0 21 26 7 -11 -18 2 29 17 5 2 -1 6 28 7 -16 -10 -3 11 6 1 -9 -22 2 16 4 -3 -9 -15 13 35 11 -9
3349iqJ8L3j0k1j6JL6%mk6oJ1QK2k7j4KJ1K1Kl3j3J0L4Njm0j8L7J8%k3k7qM1K5
$$ -9 -17 1 34 24 3 -13 -12 24 24 20 -6 -12 -1 7 29 2 -12 -10 1 22 24 -9 -22 -12 22 27 26 -14 -32 5 23 23 0 -27 -35 6 31
3386C1j4k7k5J0L3K5j6m1j3L4K8J1k3k8j7L1M2j1k6l0KK9L0rk7k0jL7J9j7l0k1
$$ 31 17 -10 -35 -25 8 33 17 -24 -37 -3 25 36 13 -15 -32 -1 41 30 4 -26 -24 5 35 26 -1 -21 -22 15 34 17 -13 -34
3418c4K2L1J2k5j9j6K3M6k4j5l5KL7L7j3m8k4J9M1K1j3m9nK1M7Qk7n3nM9L2lm2
$$ -34 -12 19 31 6 -13 -29 -6 40 16 1 -34 -32 5 42 29 -19 -43 -24 17 38 25 -24 -29 -8 39 47 20 -33 -38 11 43 40 -2
3451bl8J1M1L3j0m5m1L3L7M0l7m5k3M5N3k4k1l6j4M0O0j8m7k6J5N2K0j9n6j1K4
$$ -2 -40 -29 12 45 35 -10 -51 -18 19 59 22 -23 -46 -1 52 28 7 -29 -43 -3 57 39 -8 -34 -19 33 53 34 -22 -33 -9
3482iL1K1k3m4KL2K5Ol3k6rL3L6j4k6k4LL4J7k0k6j8L5L1j2j5k6qK6K9pk4k2Q
$$ -9 22 43 20 -24 -22 10 35 41 8 -18 -27 6 42 28 2 -22 -19 15 32 12 -14 -32 3 34 22 7 -19 -27 -1 28 21 -3 -25 -17
3516a7K6K8j1l1j6J6K1K1j7k7k0K8K6Kk0k8j1K9M3k3k8k4PL6K5k0l3j5K8K2Ql2
$$ -17 9 37 26 -5 -21 -5 16 37 20 -7 -27 1 27 29 9 -19 -30 -1 42 19 -9 -33 -26 10 35 15 -18 -33 -5 17 25 -7
3548gk1PL0K5pl0k6QL5J8k6l1KK1K9mk5l0J0M0J7j4k0k8K5L6kl4k4KK8K6rl0k2
$$ -7 -28 -21 9 34 27 -3 -29 -21 14 32 6 -25 -23 -2 27 23 -2 -32 -22 18 35 21 1 -27 -2 34 32 -2 -26 -24 4 30 21 -9 -31
3583c1J0K5K2rk8j9J6L1J3k8k3nK0L6om0j7QL0K7pl8l4K8K6L2k7l5j0L0L6J2l7
$$ -31 -21 4 26 17 -11 -30 -14 17 30 2 -21 -26 -6 30 24 -16 -33 -25 5 32 25 -13 -47 -19 7 39 12 -23 -33 -3 33 45 8
3616Hl0mK7L2Nm5k8J1M1J7j7m4k8L2M4K0l1l2k8M7M0kl8k7j7O5L2j0m4m0L2L6
$$ 8 -22 -26 1 33 38 -7 -35 -24 17 34 17 -27 -55 -23 21 41 10 -22 -50 -3 37 35 -3 -30 -47 18 50 40 -4 -44 -12 24
3648B4L2k9m4l6L6N1K2l8n5nL7N5Ln9m5K7M4L4k2n4l1L1M9K0l0m6j8M1M7Nm1m5
$$ 24 56 27 -17 -53 -17 34 56 18 -37 -42 -5 50 53 -6 -51 -24 20 54 32 -22 -53 -22 27 47 17 -29 -47 -6 41 46 5 -40
3680d0PM5L6lo1k9J6N1L7k2n5k7L1M9J7m3k1j8K8L7Ol8m4J1L6L6j5l6l5K6M6P
$$ -40 -33 12 48 45 -16 -45 -29 22 59 37 -18 -45 -14 35 52 9 -12 -30 -2 35 41 3 -41 -30 6 42 27 -9 -44 -18 28 35
3712C5rm9k3L1L9J6l6l5oL5L7j4k6l5J5L8L1j2m4k1J2N7Mk6m2rM7K0Mk5l6J0L0
$$ 35 26 -23 -46 -15 24 40 4 -31 -37 -2 35 21 -5 -40 -25 13 44 32 -12 -33 -21 36 40 14 -28 -37 10 30 34 9 -27 -17 13
3745A3L1k1l4k2K1L5J1k3m1LL5K8ml9l3K8K9J1rk7j7K1K5Mj1l8MK7K1Ml6j6ML9
$$ 13 44 23 -11 -33 -12 23 34 11 -30 -27 8 36 32 -7 -40 -12 17 28 19 -8 -25 -4 21 25 14 -24 -20 7 28 32 -4 -20 -16 23
3779B3Mol8pRM0Rk2l7j0M0K4mk1k6LL1J0ql0j6J5L7K2m1k5lJ6L6Ol6l1J7K7K7
$$ 23 27 21 -17 -24 -15 25 34 12 -25 -35 5 29 25 4 -22 -19 12 22 14 -16 -32 -17 20 42 1 -24 -27 -11 25 31 -5 -36 -19 8 35
3814C5k0l1j8K4L3J2j9l8pJ8M2mj3n1kM8L4j2l8l5RN0L1l7k7k5J4M9K6m4m0JK6
$$ 35 15 -16 -34 -10 23 35 16 -22 -29 -11 31 27 14 -37 -39 9 43 31 -7 -42 -33 17 48 11 -16 -41 -27 22 48 4 -36 -35 -9
3847iM9ln0l0J0M8L1k2n0k0M1L6J7k4n4j5M9M0Jl9m4OL6M0j8m1k7%O7J7k1m1k0
$$ -9 40 37 -13 -43 -33 15 46 24 -26 -46 -5 31 48 24 -30 -45 4 44 45 6 -38 -32 4 44 26 -15 -42 -42 25 42 21 -20 -40
3880d0K6M1J4m0l9mM5M4j5l6k7%M8K8k6j9l2K1K8J8k3l2j8L6L6J3l8l4kL3L5j0
$$ -40 -14 27 41 1 -38 -42 3 47 32 -4 -31 -31 17 45 19 0 -32 -11 17 35 12 -20 -38 -2 34 47 9 -25 -27 6 41 31
3912C1m2k6QL8K8k2k8k4L0K8J9k2m1rL6J8J1k6l8RL9J1Jl9j0J6L5Nk3l5oL0K0
$$ 31 -11 -37 -29 9 37 15 -13 -37 -7 21 40 18 -23 -32 4 22 33 7 -31 -22 17 28 29 -10 -20 -4 31 36 13 -22 -28 2 22
3945B2J1l2k3%L8J5ol2j3lM3Kj5l0OJ6K9j6j9k0J5J4K4j5k4nJ2J2J1ok6kJ9K7
$$ 22 33 1 -22 -22 16 31 25 -7 -20 -23 20 22 7 -23 -17 -1 28 12 -7 -27 -12 2 26 11 -13 -18 -6 6 17 11 -15 -17 2 29
3979B9j9j5LoK6Qmk7j5K0K2pj2j7kL1KQk8j6J0J5Rnk0rQJ9J3pl2%LK7kj3j7J4
$$ 29 10 -5 -2 -8 18 26 22 -5 -20 0 22 15 3 -14 -16 15 17 25 -3 -19 -9 6 15 10 -10 -19 -11 8 21 14 -18 -18 -15 12 10 -3 -20 -6
4017fPJ9lj9j8jL1K4k0k3nRK2Mj7k4PK2J1ll3j0K0K1krk2lJ4L0Mk2l5J0J3L2P
$$ -6 1 20 17 -2 -20 -21 10 34 14 -9 -14 -5 17 21 4 -20 -13 9 20 17 -16 -26 -6 15 13 4 -18 -21 -7 23 27 5 -30 -20 -7 25 32
4054C2l1j7LK1J5j1k2j0J0K3K1l0j3j3L6J1j2k0rJ0J5J8j4j8j3RK7Jml2kK2QJ4
$$ 32 1 -16 -13 8 23 12 -10 -20 -10 13 34 4 -9 -22 14 25 13 -7 -16 -6 9 27 13 -5 -18 -9 18 19 15 -17 -19 3 11 25
4088B5k1k4j0K7K5pk7loL3J0pk1j2J4K1Jql1J4J1K4j2j7j0OJ9Qkl1kJ3K1Mrj4
$$ 25 4 -20 -30 -3 22 15 -12 -15 -21 12 22 15 -6 -18 -4 17 18 10 -21 -7 4 28 16 -1 -11 -5 14 22 20 -11 -13 0 21 25 16 2
4124Bk5K9K3pl6MoK7Opj1j8J3J5J1j5k5kK2J2Lj1j1OJ9kmj2rmJ7J8j0j6KmJ6R
$$ 2 -23 6 29 22 -14 -10 -16 11 17 10 -1 -19 -6 9 20 5 -20 -22 0 12 15 4 -7 -1 18 16 12 0 -9 -13 4 22 12 -4 -2 -6 10 19
4162A9j2k3OJ2J7lj8qKRJ0pk3J6JJ0kmk1OJ4K0rj7%oJ6J0j0rmJ3NK%oj4J0K0j2
$$ 19 7 -16 -10 2 19 16 -2 -10 -8 1 11 4 -19 -3 -2 8 6 2 -19 -13 1 21 12 -5 -5 -11 5 15 5 -4 -8 5 10 12 12 6 -8 2 22 10
4202A0j8jj0K9%%j9jJ1PNj2j6KNJ8mj3pMNJ4kj5%lK0%J6k8KJ0Pjj3Lj4J4J5kj9
$$ 10 -8 -9 -19 10 10 10 -9 -10 1 8 13 1 -15 -13 -8 10 6 -7 -14 -10 -5 9 7 -8 -8 -11 9 9 25 -3 -1 9 16 15 2 5 -9 5 20 18 -1
4243aqQLkOnqKJ8%j0j3mLJ6Pj8l%K1rJkj0LJ8%nj3rJ0RNmj4oK2J1jk0j0J1J9l
$$ -1 -9 -1 2 0 6 1 -7 -5 13 13 3 -10 -14 -11 5 12 -6 -9 -9 12 3 4 2 -8 -5 13 13 8 -5 -14 -4 5 10 6 -8 -14 8 19 18 -2 -12 -1 18 15
4287A5nnk6K4J9j2nKj8J4QNj5j3kJ9Rmlj7J0J0J0oj1lQMLkk1LjK3Kj1nJNOqj1
$$ 15 10 5 -21 3 22 10 5 7 -11 3 11 16 1 -12 -14 5 14 10 7 -10 0 10 20 14 3 0 8 12 15 13 -8 -5 -6 17 19 8 3 4 9 15 7 -4
4329dLKmJ3pj2mJ6KPj4nk%J4Pj6j4QK1%Jj3lORNj0j1MQLKj0oPKNnlmmMJ3proQ
$$ -4 -1 1 -3 10 3 -9 -13 3 5 12 -2 -7 -9 -9 5 12 -4 -18 -10 11 11 12 -1 -4 2 11 16 6 -5 -1 7 10 12 2 -4 3 5 10 5 2 -2 -6 -2 11 4 -5 -11 -3
4377cJ7lj2j1%J3Op%j1%ROjj2qJ6PjjOj4KJ9j5jpJJ3Moqj1RJ7Looj9J6RRj9qj0
$$ -3 14 11 -1 -12 -12 1 7 0 0 -11 -11 -2 4 3 -9 -17 -1 6 5 4 10 -4 -2 17 2 1 -6 -5 8 12 6 -2 -13 -4 13 16 10 4 -15 1 10 19 0 -8 -18
4422a8K0K%%j1KJ1J6lk3mmL5Lqj8qPJ8Mk2mqK4Nj0nj7%K4Nj0kj7K0J0olk1JK0
$$ -18 2 4 4 4 -7 -5 6 22 19 -4 -8 -12 23 26 18 0 -8 -1 17 21 -1 -5 -13 11 16 6 1 -16 -16 8 13 3 1 -16 4 14 8 5 -16 -15 5
4463EJ4pj6orJ5Roj7LJ1K0J0j2l0qJ9K0Kj6j4J1K0kJ0k3j2KJ6J2nk4j8J2J9J8
$$ 5 19 12 -4 -10 -19 -4 5 -1 -18 -15 -4 16 26 14 -16 -24 -5 15 17 1 -13 -2 18 16 26 3 -9 -7 9 21 16 -8 -26 -14 5 23
4499B3k4rlNK9lj8j7MJ9J7k6mj1J2K1Pk1%k2J1K6%ol5QK9NPj3k6RK2J8j8j3k7
$$ 23 -1 -10 -13 -8 21 18 0 -17 -13 6 23 -3 -7 -18 -6 15 22 1 1 -21 -10 16 16 10 -25 -17 12 17 24 11 -15 -6 16 34 16 3 -24
4536b4J8K2Mj1k6kJ2K4%l4j3J2K8%Ll3JJ0J6J3k0j2j6K6J9mk3j8K2K5mJ3m1oJ7
$$ -24 -6 16 20 9 -17 -19 -7 17 17 -17 -30 -18 10 10 13 -20 -19 -9 7 20 0 -12 -28 -2 17 13 -10 -28 -6 19 15 28 -13 -19 -2
4571bJ2J6k2j6oJ7J9Nl0ljLK8ok1k3K8RMj6pnJ6J1Ok5j0jK5K7j9j4njRK0j2k4
$$ -2 10 26 4 -12 -18 -1 18 23 -7 -10 -11 -8 20 14 -7 -30 -2 7 11 -5 -12 -17 -1 10 16 -9 -19 -20 5 32 13 -1 -6 -7 2 22 10 -14
4609a4LmK7K2k7j9j2J8K4Kl1j5NK3J5j9j4j4K4J8Jql2JL6Ppk1j7NK9J7j9j6k0
$$ -14 -11 -15 12 34 7 -12 -24 -6 18 20 -11 -26 -21 2 17 -2 -16 -30 -6 12 13 5 -27 -26 10 17 10 -11 -28 -23 6 23 4 -12 -32
4644c2K4L5jk2j7j3L5J4Nl2k0OK7J5j4k4j5J4L1J1j9k5j1J7J9J9k8l5J4L6J0o
$$ -32 -8 27 26 4 -13 -26 9 23 28 -4 -24 -18 9 24 10 -14 -29 -15 16 27 8 -17 -28 -11 8 27 -1 -36 -22 14 24 18
4676A8l4pJ3K9J3j9k7rJ1L9j2j3j8oK6K6lk8k5QK7K2lm1j7K8J9Mol1qJ6L8j1k5
$$ 18 -16 -23 -10 19 32 13 -14 -23 -12 27 15 2 -16 -22 4 30 27 -1 -26 -18 9 31 28 -13 -30 -2 17 21 15 -16 -24 -8 30 19 -6
4711fk5OK3L0j2k1k9MM5J5j9l3jJ9K8Rl0j5rL3K5ml6j8J2L4J2j5l9j6L2L5jk9
$$ -6 -31 -25 -2 28 16 -5 -34 -30 15 30 11 -22 -23 -4 24 33 3 -12 -21 12 37 33 -3 -21 -9 25 37 22 -17 -33 -1 34 33 4
4745Dl1RL1K2j4k7k6LM2Qkl9j0J4L2J3l6k1NK3K6Jl2j9LM0Okl4j2K6K6oj6k0%
$$ 4 -27 -18 13 35 21 -6 -32 -29 13 21 19 -20 -30 -16 16 29 -7 -28 -23 0 26 27 -5 -24 -21 19 25 23 -11 -23 3 29 23 7 -13 -13
4781a3J0J9Kk3jj8K2L4j0l5JkL2%j4k1JJ2K4kj8k4J9J4J2pk3j6MM0J3j2l3pJ5
$$ -13 -3 16 18 -5 -6 -24 -2 32 22 -13 -12 -14 18 18 4 -17 -16 -4 20 18 0 -24 -5 9 21 14 -9 -25 -21 19 32 20 -13 -20 -5
4816eL2J4l4j9JJ4K2Kl2j4J8J5J5k4k6pL4J7qj3k2RK0L1j6m3jRK0K1j9l2kK1K1
$$ -5 27 41 7 -12 -11 3 25 27 -5 -19 -1 14 29 5 -21 -28 6 23 15 2 -20 -11 9 40 24 -19 -20 -11 9 30 11 -21 -23 -2 19
4851A9Ol0j9QJ8L0k2ok9J5K8K0k3k8j5J9M3j1j3k5j0L1K6nl3k1J0K0K2j4k3j8
$$ 19 25 -5 -24 -16 2 32 10 4 -25 -10 18 38 15 -13 -28 -9 34 23 10 -15 -25 6 32 27 -6 -27 -17 3 25 11 -12 -30
4883c0J7L0J9k5l5KK1K9Kk8k5OL1J9rl5j0OK9K4j4m2j2K0M2jk7k3LJ8K1mk5k1
$$ -30 -13 17 36 11 -24 -22 -1 28 30 2 -23 -17 14 33 24 -11 -21 -15 14 38 24 -18 -30 -10 32 31 4 -19 -16 2 23 19 -6 -27
4917b7kL0L5k1m1oJ6L5Nk1l1j1L8L2%l4j8OK6J7j0k9j1J3L6jpl1nJ4L4j0j4k6
$$ -27 -29 1 36 15 -26 -32 -16 19 24 3 -28 -39 -1 31 31 -3 -21 -15 11 28 18 -11 -22 -9 27 26 19 -12 -17 -3 31 21 7 -19
4951a9j4M4J6rk8j2OL8Oj7k6mJ9J9J2l0k8J7J6J4Jk9j5J2J3L5k5k0j2J4K3jj0
$$ -19 -33 11 27 18 -10 -22 -16 22 28 11 -15 -19 0 19 31 1 -27 -10 6 20 21 -8 -23 -11 2 37 12 -8 -20 -6 17 16 6
4984Fk0j0K5K2jj8k4J1J2J3pl0qJ5K4Qj6j9qL1J0rj5j3KL0Nmj8j5J3K9%j1j9m
$$ 6 -14 -24 1 23 22 4 -20 -9 3 16 9 -21 -29 -14 10 18 2 -17 -25 6 16 7 -8 -21 -19 11 16 12 -6 -21 -8 21 21 10 -9 -13
5020a3J2K4jk7k4J0L4J3j9k7lJ0L4Pk8k8J1K0J8j1j3k4J1K6J2j7j6j7K4K3lk3
$$ -13 -1 23 22 -5 -29 -19 15 28 9 -18 -21 -11 23 30 2 -26 -15 5 23 12 -1 -25 -14 12 24 7 -9 -26 -2 21 18 -5
5052ek4J9K5Mrj2j5J5K1J0ok6kJ2J2J2k1j9j0K4J5nj2k2J1RK2qj6k8RL0J2j0k7
$$ -5 -29 -10 15 19 10 -2 -17 -2 19 29 23 -3 -5 7 19 31 10 -9 -19 5 20 15 3 -19 -8 1 23 15 -1 -29 -20 10 22 12 -15
5087a5mJ0K6jj3k6mL1J5Kk9k1J9L6Pj5k6j0J4J9K0k0k9oK9J9Ol8j9J0K8J7j1l7
$$ -15 -19 -9 17 16 3 -23 -27 4 19 21 -8 -29 -10 26 33 18 -8 -18 -4 15 35 15 -14 -20 9 28 34 -4 -23 -13 15 32 21 -16
5121a6oJ5K2Qj9k0j1K4K6j3rk3lL1J8j3l1j1J9J7Qj0k4JK4J3Pj9k6QK9Rqk4rR
$$ -16 -22 -7 15 23 4 -16 -27 -3 23 10 1 -22 -25 6 24 11 -20 -31 -12 5 13 3 -21 -20 4 17 24 5 -21 -13 16 25 17 -7 -16 -7
5157gK6J1k0k5qJ2L0lqk0pK0J5Kk0j9OK3J4j2j7nLK1K%k6NPK6pj3k1OK0NOj8j7
$$ -7 19 30 10 -15 -23 -11 19 16 8 -12 -19 1 16 18 -2 -21 -15 8 22 10 -7 -12 -9 12 14 14 -12 -7 0 26 19 6 -15 -9 11 16 22 4 -13
5196a3MK0J2j0k4oK2J8Ml0j2MJ6J1oj2j9OJ5J5rk6LK6PKk0rLJ1K4j8j1knL4Lj5
$$ -13 -9 11 23 13 -11 -17 5 23 27 -3 -15 -11 5 16 10 -2 -21 -15 0 15 6 -20 -17 9 16 18 -2 -11 -8 3 27 9 -2 -4 -9 25 28 13
5234A3j1j4J8J5lj5l0J5K0J6j2j2k1K0J4J8j1l2KJ3K3pk5j0RJ9J3j5j9mRJ9Nj5
$$ 13 2 -12 6 21 18 3 -27 -12 8 24 12 0 -21 -1 13 31 20 -12 -10 3 26 19 -6 -16 -7 12 25 10 -9 -13 -4 15 20 5
5268EmpQK2j1Ll2%K6J1jj5k1J0K0Nj1j4j0NJ6Pj6lnJ6K2ok7j4PJ5K7Jl9mJ0J3
$$ 5 1 -6 2 24 13 16 -16 -16 10 21 20 5 -16 -6 14 19 8 -6 -16 -11 5 12 -4 -7 -12 4 26 20 -7 -21 -14 1 28 29 -10 -14 -4 9
5306IK4j1l4nJ8K2Pk2k3rL5J6j1k5j0J3K2J2k3k3qK6K4kj5l5QK6J6j5pk2PK7P
$$ 9 33 22 -12 -17 1 23 30 8 -15 -24 11 27 16 -9 -19 -6 16 28 5 -18 -26 0 24 22 7 -28 -20 6 22 7 0 -22 -15 12 19
5341A9j8j1JjL1mj2k2LK1RLok0%K4Qqj6j4LJ6Rlk5jJ4J5%j6j4lJ8K0j2k1%LK1
$$ 19 1 -10 -9 -10 21 17 5 -17 -14 7 16 19 13 -7 -7 17 25 17 1 -13 -10 6 15 12 -13 -14 0 15 15 -1 -15 -18 0 20 8 -13 -13 -10 11
5380A1Kj0kk2J4K4pnj8KQL1j1j2j8KK0J2%k3r%L1rNk0LQJ4kk6j2mK0J9ll0JLJ8
$$ 11 13 3 1 -21 -7 17 10 5 -13 -11 -3 28 17 5 -13 -11 9 21 21 -2 -11 -11 20 11 16 -4 -1 7 21 19 -7 -19 -23 -3 16 13 -17 -16 -13 5
5420EJ1k0j0lK3OQj9j9KJ9JporRL0oj6mjJ4J0Jj0k2kK8Mnk2%OJ9Lj5j9jK1JLr
$$ 5 16 -4 -14 -17 6 12 20 1 -18 -16 3 4 -3 -9 -18 -9 21 15 -1 -5 -6 8 18 19 9 -13 -15 13 17 12 -10 -10 -4 15 18 3 -16 -17 4 5 8 -1
5462aoj4L3Jkj1j6%L1Orj9j1K3jPlpj7K4J1Jj9NrNK6j1k3j4K1J2Jnj9j0J4L0j2
$$ -1 -7 -21 12 13 11 0 -16 -16 15 21 12 -7 -18 5 4 11 8 1 -16 8 19 20 1 6 -3 2 28 17 -6 -20 1 13 14 9 -10 -20 -6 24 12
5501A2j4j6pL0J3oj3j6J1J8J7j8k2j2L5JJ4j9k1jK5RLk9j4J6J4J7j6k8RJL0%j8
$$ 12 -2 -18 -25 5 18 12 -1 -17 -6 12 29 11 -11 -23 12 13 27 8 -13 -14 11 20 23 -6 -20 -4 10 27 11 -17 -8 -7 23 23 5
5536Ej9NK2J0Kk5k0RK0Qj1k7jJ9J4Rj3j5%J2J0%jk5MjK3Mj4l2L8%K2j2j8k3JL5
$$ 5 -14 -9 13 23 25 0 -20 -11 9 17 6 -21 -22 -3 11 20 7 -8 -8 4 14 14 13 -12 -8 -9 14 18 4 -28 10 10 32 20 2 -21 -20 15
5574A5Rj4j9pQK1mj1j9kK0J8jj9j8OJ9J7j1l8J1J1K0J2k6rOJ1J0kl3MLK8J3j6
$$ 15 24 10 -9 -16 -8 13 9 -2 -21 -23 -3 15 14 -5 -23 -17 2 19 8 -30 -19 -8 12 24 -2 -11 -5 6 16 14 -19 -15 -12 16 29 13
5610A3j9oOJ5Mj7j4PJ6mQl0PJK2Rpk4oJ7mJ7qk4PJ1J5J0j7k4J4J4K5k6j2jrK7
$$ 13 -6 -12 -6 9 13 -4 -18 -11 5 1 9 -21 -14 -13 9 18 11 -13 -19 -2 -6 11 3 -21 -14 -3 12 22 5 -19 -5 9 34 8 -4 -5 -14 13
5648A3J0j8j1j%PJ3j8j2mK0J6qk0LjJ7J8j5rqNJ9kj6j9jK5NQk3k2J7K2J6j9j3
$$ 13 23 5 -6 -7 -7 0 13 -5 -17 -21 -1 15 7 -13 -10 -11 6 24 9 0 -8 -3 16 14 -2 -21 -22 3 8 16 -7 -29 -12 10 26 7 -6
5685fqJ2K6mj7j1KPJ3Qk6j7KK9J1j4j9j5K0J7%j3j7mK3J1Jj6j2RKK7k4nj2J2J1
$$ -6 -14 -2 24 20 3 -8 -6 1 14 22 -4 -21 -19 10 21 7 -12 -27 -7 10 10 -3 -20 -24 -1 10 11 -5 -17 -8 -6 21 -3 -8 -20 -8 3
5722CJ5k1j2qK2K0Jk2j4LJ5J8jl3qJ2J7J0j6k3kK2J5nj2j2JJ2K1j1k6%QJ3K3j8
$$ 3 18 -3 -15 -23 -1 19 20 -2 -16 -13 2 20 19 -14 -22 -10 7 17 1 -22 -24 -2 13 8 -4 -16 -15 -3 18 7 -19 -19 -11 2 25 7
5758Gj7jjK6J0k6k0RNK8nj0k3%L5Nj6j7j4K0RJ6j8j7M%L7pj5l1JL0Qjk7k0J8K3
$$ 7 -10 -11 -12 14 24 -2 -22 -13 -8 20 15 5 -18 -18 17 22 6 -11 -25 -5 4 20 2 -15 -11 -11 26 19 4 -27 -26 4 12 11 -16 -36 -18 5
5796EJ5j7j3j1J4K4%j9k2QJ8J3mj3k5J7K5J4j6j9j5J6K0j0j3j2nL5Rj0qj7kK6
$$ 5 20 3 -10 -21 -7 17 17 -2 -24 -16 2 15 11 -2 -27 -10 15 29 13 -6 -21 -5 15 5 -8 -20 -25 10 19 9 1 -16 -18 8
5830HJ1mj9j8J4J7Kj2j7KJ5J4Pk0j3NPK4j1j1k7K1J8Qj1j4j4J6J8oLk7%K1KJj4
$$ 8 19 15 -4 -22 -8 9 11 -1 -18 -16 -1 13 20 0 -13 -8 -1 23 12 1 -26 -5 13 21 10 -4 -18 -2 16 10 13 -14 -14 7 9 10 -4
5867dj4J3J5Jj2j2jJ1QNk1qJK0K0Ml8j0QK0J9j6l2LJ2K7kj7qoPL1rk6lJ9J3Kj5
$$ -4 -18 -5 10 11 -1 -13 -14 -3 5 10 -11 -19 -18 2 22 26 -12 -22 -14 6 25 9 -23 -20 -8 19 17 0 -8 -14 -7 24 15 -11 -14 5 18 20 5
5906Ej3LKK0%j9j9NK2Oj1j1j3J4J0J9k5j4%J0K5Lj5j7JJ8JJ5k5j7QJ4K1j8k0J
$$ 5 -8 -5 -3 17 17 -2 -21 -16 6 12 1 -10 -23 -9 1 20 -5 -19 -19 -9 16 19 4 -13 -12 6 7 22 -3 -20 -12 2 23 5 -15 -14
5942a4J0K6mQl5%RJ4j0ok0J0J9Rj4j2j2OK7J3k1k6nJ8K5Jk4j6LK9K5l3qj3MK9
$$ -14 -4 22 18 26 -9 -9 0 14 4 -2 -22 -12 7 16 2 -10 -22 -16 11 24 3 -23 -28 -10 15 16 -8 -24 -21 8 33 0 -8 -21 -17 12
5978A2Pj5k0nK3J3Nj9k0mK5K3rk1j6jL1Kj7j4k2L9K2j0j5k0JK8J7j1k5j3J7J7
$$ 12 19 4 -16 -21 2 15 20 1 -19 -23 2 25 16 -5 -21 -22 9 11 -6 -20 -42 -3 19 9 -6 -26 -25 3 20 9 -16 -29 -12 5
6012EOKl2j4K6J7J3j3k4oK9OQk5j4kL5Jj2j2j0QJ5Qk1j3qK8NKqk4J0J5J8j5j6
$$ 5 11 13 -19 -33 -7 10 23 10 -14 -20 9 15 23 -2 -16 -18 17 18 6 -6 -16 -8 7 15 -6 -19 -27 1 6 8 0 -24 -14 1 19 4 -12
6049a2oPK7Mk5j1NJ2J5Mj1k8LK2ROk7m%L3mmj9mLK1Mrl3jL3J0k0j5j3RK9Jrk2
$$ -12 -18 -11 16 20 -5 -16 -11 1 16 20 9 -19 -16 6 15 21 -6 -10 -10 23 19 15 -4 -8 -5 16 20 11 -22 -23 10 20 0 -15 -28 -19 10 11 2 -20
6089b0jJ3K0Ok4j2MJ6K1j0qk7J8J8J4k0j7lK1K2j1j7k7J0K3J4rqrJRJ0j3k4QJ
$$ -20 -21 -8 12 18 -6 -18 -14 2 23 13 5 -22 -4 14 28 8 -9 -12 9 31 20 3 -24 -14 9 23 14 6 -3 -2 7 17 4 -20 -12 -11
6125a1K5Lk2k0RPK8mk2j4MK5J1j1j8nNK5J5j8k0j6K7K8pj8k7PK9Qkk5j7J0L2Q
$$ -11 14 17 -5 -25 -16 -9 19 15 -7 -21 -17 8 19 8 -10 -15 -10 15 30 12 -8 -24 3 31 24 6 -21 -14 15 23 21 -4 -21 -11 21 29
6161B9j4l5LK4J3%k5k1NL0K4j0m3j2K0K5J7k5j8j5K7L2j0j9k0RJ7K0Pm0k1J7K8
$$ 29 15 -20 -17 7 20 20 -5 -26 -21 9 33 23 -20 -32 -12 13 30 5 -13 -28 -1 31 21 2 -18 -9 8 28 35 -5 -26 -9 19
6194A9J7j4m3pK2K6Jk4j8JJ8K2ok3k0J0K9J9k3k6KJ4K6J3l6j7kL0J2kk6j3lK8
$$ 19 36 22 -21 -28 -6 20 21 -3 -21 -20 -2 20 14 -9 -29 -19 10 29 6 -20 -18 -4 22 35 -1 -18 -20 10 22 20 -6 -19 -22 6
6228FJ8lk6j4K1K0J3k4j8qRK6%j9j7j0L4J1Km1pJ3L0Kj7k7%J6L1Kk1j4kJ1K5j1
$$ 6 24 21 -5 -19 2 22 35 11 -7 -15 -6 20 20 1 -16 -26 8 19 21 -20 -27 -14 16 18 1 -26 -26 -10 21 23 2 -12 -14 -3 22 11
6264A1j8j8kM0J1j4k8JPK1Mlk5j2L3K0rk1k3J4J9J7k1k4jJ5L2j0k2j6JJ6K6kl7
$$ 11 -7 -25 -27 13 24 10 -18 -17 -10 11 15 12 -13 -25 8 28 19 -2 -25 -11 8 25 4 -20 -21 -6 26 16 -6 -22 -21 -5 21 19 -18
6299a8j7K1PK6j3j7j2J5K9J2k5j8j3L0K3j7j0k3J8RK1j7k9pJ9J8Lj5k0PJ5J8M
$$ -18 -35 -14 -7 19 6 -11 -23 -8 21 33 8 -10 -23 7 30 13 3 -20 -2 7 28 11 -18 -25 -6 12 15 0 -20 -13 2 20 24
6332B4l7j1NL1J8j1l4j7K7J3PLk7j7K0J5J7k7k2LL2J6Nk8j8LK6J6k2k9mK0K6O
$$ 24 -13 -24 -19 12 30 19 -15 -32 -5 8 15 18 -9 -26 -6 9 26 -1 -23 -20 12 28 33 5 -13 -10 16 32 10 -19 -23 -3 23 29
6366B9j9l1nK8K2Ll9j6J1K2J4ml4jJ7L1rj6k8qL5K9j0k1j9jM1J3j5l8%J0L3Qk0
$$ 29 10 -21 -26 2 24 27 -12 -28 -17 5 19 15 -19 -20 -3 28 19 3 -25 -33 2 31 21 0 -19 -20 21 34 19 -19 -19 -9 24 32 12
6401A2k6oL0J5%k6k1J1K4J4ok8j7RM0Jk0k5JJ3K6jk2k4J0K4Pjk3j6J2L1J4j4k7
$$ 12 -14 -20 10 25 25 -1 -22 -11 13 27 21 -7 -24 -15 25 26 6 -19 -18 -5 21 20 -2 -26 -16 8 15 14 -9 -25 -13 18 32 18 -9
6436ij5K3J9Ok5k6NK9K2j0k3j6JL3Rj0j8j8J4J8J0k7nj0K0K0Kk7k2RL1J2k0j7
$$ -9 -24 -1 18 24 -1 -27 -22 7 29 19 -4 -20 -19 14 23 13 -5 -23 -9 9 19 -8 -13 -23 -3 17 19 -8 -30 -21 10 22 2 -15
6470a5j3K5K4Rk9l0J4K2J6%k5k1J6K3J2k0k3k3K8K0Mpj3k2K2K4jk4j8NK3K0j4
$$ -15 -28 -3 21 30 1 -29 -15 7 23 23 -2 -23 -7 16 28 8 -15 -38 -10 10 14 7 -6 -28 -6 18 17 -7 -25 -20 3 23 9
6503Il0jLK2Pj7kj3K3PJ0j9j6JK9Qqk0j6J7K1J4j2l3QJ2J7Rl0j9mK7J0kk0j8J2
$$ 9 -21 -22 -19 3 10 -7 -9 -22 1 8 18 -1 -17 -16 13 21 13 -7 -23 -6 15 29 17 -16 -8 4 21 30 0 -19 -23 4 14 12 -8 -26 -14
6540a4J5J4j4j9j2K4K3mj0k0j1K9K2ml4qJ3J4K2j5k5qJ6L0J1l4k3OJ5RK5l0k7
$$ -14 1 15 1 -18 -30 -6 17 13 3 -17 -28 1 23 19 -15 -23 -10 4 26 11 -14 -22 -6 24 35 1 -22 -16 -1 8 33 3 -24
6573b4J0J5K4j3l0j0J6K3J2j9j9nJ2K6mk4k0ML2J6%l0rLL2J4k1k8nJ7K3Lk1j4
$$ -24 -14 1 25 12 -18 -28 -12 11 23 4 -15 -20 -8 18 14 -10 -30 -26 6 22 22 -8 -17 -14 18 32 11 -17 -22 -5 18 21 0 -14
6607a4J1J6RKk0k4JK5J0j2k5KJ1J6J2j5j4j2J7K0pj0k6J0J7K1rj8j1J2J0Rnk7
$$ -14 -3 13 22 24 4 -20 -19 6 16 4 -21 -19 -8 8 20 5 -9 -21 -4 16 9 -1 -27 -17 0 21 12 -6 -17 -5 5 14 9 -18
6641a8lK6K0mk0j2pK6J6mk5j4J5J8Rk1j4j2K5J3Rk3k7JK2K5j0j7j5MK9Okl4lJ7
$$ -18 -21 5 25 21 1 -11 -18 8 24 20 -5 -19 -4 14 23 2 -12 -24 1 14 23 0 -27 -26 -4 21 11 -6 -21 -17 12 18 16 -18 -21 -4
6677dK5Kj6k5KK3NOk6k3J9J7J8j5k4LJ3K6qk3j8LK1J7rk7j5K5J8Mnk0j5J7K5o
$$ -4 21 23 7 -18 -16 7 12 18 -8 -31 -12 5 23 8 -16 -13 0 26 18 -5 -23 -20 1 18 9 -18 -33 -8 10 14 9 -11 -26 -9 16 10
6713A0j7j7QJ4J7nk2LoK5kKk0lJ2K3j2%k5jJ0K3kj6j8J2J1PMl0jOK2lpj8oJ7J4
$$ 10 -7 -24 -16 -2 15 10 -12 -9 -15 10 8 10 -10 -13 -1 22 10 10 -15 -16 -6 17 15 -1 -19 -7 4 11 15 -15 -16 -10 12 9 2 -16 -22 -5 9
6752Ijj0j7KL1%J3l1j0PJ8Mnk0lK1J6j4nj3mJ3J2J0l5kKK8Kk1j1JJ1J5Jqk6KJ1
$$ 9 8 -2 -19 -17 14 14 27 -4 -14 -7 11 15 10 -10 -13 8 24 10 5 -8 -12 1 13 23 -12 -14 -12 16 18 -3 -14 -13 -2 13 14 6 -20 -18 -7
6791gJ5Mj7qORPj1j1kJ2J1Onk3J1RMlnk0J8J3Kj4kj6J6J0Nqj7JJ4K1j4rk0%J7
$$ -7 8 12 -5 -13 -7 2 9 -2 -13 -15 -3 8 14 9 -14 -3 6 10 7 2 -18 0 13 15 1 -1 -17 -1 9 14 6 -11 -10 4 25 11 2 -18 -18 -1
6831aRoj4l%K0Jlj2kmK2J7k3j7LRK7j0j1mMOJ9j6l1LRJ4Nj1j2%K0Njqk6J0J5J
$$ -1 8 2 -12 -15 -15 5 6 3 -9 -11 -15 7 24 1 -16 -13 -4 23 13 2 -2 2 8 27 11 -20 -17 -8 6 11 0 -12 -12 8 13 12 4 -22 -12 3 4
6872DKj0j1J6NLoj5kMJ9Oj5j1RMJ5pj5rJ5RNj0j1j3K3QJk1qNPJ8j6lLj0J8l%k0
$$ 4 6 -4 -15 1 6 9 3 -12 -14 -10 9 15 0 -11 -2 2 17 10 -5 -14 1 10 15 5 -6 -19 4 12 13 -8 -16 -11 -4 14 -2 -5 -2 -12 6 3 3 -17
6914a7KJ2QOrj7LJ2KRk1kMNPrj3J0OJ9oj0j7PJ9%Lj8pOROKk2mMJ8J2j6j1NlJ4
$$ -17 -15 -3 5 11 2 -15 -12 0 2 11 -10 -12 -8 -3 4 -5 -18 -8 -2 17 11 1 -16 -9 10 10 13 -5 -12 -6 3 9 11 -11 -15 -11 7 19 3 -8 -3 -6 8
6957HJj7nnJ5J8j0j3j%K2Jpj6J0%J6mlk2PJ6M%j1j1QJ4%j0j3nMJ6Lj1llMJ3j3
$$ 8 9 -8 -13 -18 -3 15 5 -8 -9 -9 13 14 7 -9 1 1 17 13 10 -12 -5 11 15 15 4 -7 1 15 15 5 -8 -13 -9 7 10 -1 -4 -7 -3 10 -3
6998c%j6J0J2Kj1krJ7KJ2oj3nJ7%Qj4qkJ0J0j1Rk6NJ2J0j1Lj0J7rNkj6nJ4KJ1
$$ -3 -3 -19 -9 3 5 -6 -8 -17 0 2 14 8 -5 -10 7 7 15 1 -7 -9 1 11 0 9 -17 -12 0 10 -1 2 -8 9 0 5 3 -13 -18 -4 -2 9
7038Inj6jPJ3oj8PRj0J0mkNj0PJ7rj6J4KJ0npjqJ8Oj9nKKJ5j1q%mNJ8j6%j1J6
$$ 9 4 -12 -13 -6 7 1 -17 -10 -1 -11 -1 -5 -7 -2 -12 -5 12 3 -13 1 3 13 8 1 0 -8 10 16 -3 -8 -6 -4 11 0 -8 -8 -12 -7 11 -5 -5 -16 0
7081@Mj%oojJ9mpj5NQJ9j8%j0J3KOjj6LKJ1Kj1n%J3mjKj7J2kPPj9lJ3%Nj6JLn
$$ 0 4 3 3 -3 -9 -10 9 5 -2 -17 -12 -4 15 -3 -3 -13 0 2 8 7 -9 -6 -4 7 9 -2 -7 -7 6 2 1 3 -14 -2 -4 3 10 -9 -12 1 1 6 -10 -9 -6 -11
7127a1J6Nj4jL%J3mj3mKJ0l%qJ0R%Kk6J1jjROj8lJ1MlKj8MQPJ1j8qjJK1oroOQ
$$ -11 5 10 -4 -5 -2 -2 11 7 -6 -10 -8 2 -1 -1 -9 1 10 10 12 -14 -3 -4 -5 4 10 -8 -11 0 4 1 3 -15 -11 -3 4 15 -3 -11 -12 -11 10 4 -5 -11 -5 3
7173CjJ1k3%pJ9JLj3NMKJ0j4Mj2J1jOj3j0K6rrJ2j3MJ3Jlj2JoJ3Mojj0JK6j6n
$$ 3 2 13 -10 -10 -17 2 3 6 -7 -2 2 4 14 0 4 -8 3 2 8 -5 -15 11 2 -7 5 -8 -4 9 10 7 -5 -4 -10 3 7 1 0 -10 -9 17 1 -4
7215dnoQOJ4j5Nj2J1ORk3PPRpOj6pOLnMj0qRPJ1pjpNKj%qjJ0KMj7jJ1MpJ3oj5
$$ -4 -9 -15 -7 -1 13 -2 3 -9 2 8 17 -6 1 8 17 10 16 0 -7 -1 2 -3 1 -9 -17 -8 -1 10 3 2 -5 0 2 1 1 -7 -8 2 4 8 -9 -10 1 5 -2 11 5 -10
7263a0NOJ6j8mkJ0OJj1LPJ%lrj0OQMrqJ3NpRj3kKNkjj6LJ2OPqmj1J8j2J3lnOJ1
$$ -10 -5 1 17 -1 -5 -7 3 9 10 -1 2 9 10 10 7 -2 -12 -6 2 6 -3 -11 2 7 0 9 -4 -6 -4 1 -1 -2 -18 -15 -3 3 10 2 -2 -13 5 -7 6 3 -2 4 15
7310A5Kmj5%J1j1J5qj8J5j0RJJlj3K0j1LmkkJ0J3j6kKpJ9rKlOj1J8mjj6NJ1On
$$ 15 17 13 -2 -2 9 -2 13 5 -13 2 -8 1 2 3 0 -13 7 -4 -1 -5 -7 -9 1 14 -2 -4 -2 -9 10 1 3 0 6 -5 13 9 8 -8 -3 8 14 9
7352Ij3JKPMj5%Rl%J0j8%LPMJmj1j%K0j0j5K%RJ0j6oMJ1PrQj0RJMjk1J1MRjoj7
$$ 9 -4 -3 -1 6 10 -5 -5 4 1 1 11 -7 -7 -4 3 7 8 4 -7 -8 -8 12 2 -13 -11 -11 -2 8 -8 -14 -10 1 8 -1 7 -3 6 7 11 10 -11 0 4 13 12 6 -11
7399a1PJ3J6%k6%J1pMj3%OlJ3Qj1j2OkR%kj2PKKNj5NmJ4Rkqj5QRJj3rOJ1J9j3
$$ -11 -4 9 25 25 -1 -1 10 3 7 -6 -6 0 -3 10 18 7 -5 1 -1 8 8 6 -6 1 3 5 10 -5 0 -4 10 19 17 9 -6 2 11 12 -1 -10 -4 7 26 13
7443A3j0j3OJ1%kj1ljNRjlj2MJ8oj1KJ3KJj1lpKJ8Ooj8JKK1kj7Qjl%JMmJlPj0
$$ 13 3 -10 -4 7 7 5 -6 -9 -10 -5 4 3 0 -12 -8 10 4 -7 -5 8 10 11 0 -3 -10 -8 10 16 10 -8 -7 -5 16 14 -3 5 4 1 1 2 6 2 3 0 7 -3
7489ckPj0J3j0LmJ2oJljpKJ7nLqk%M%mPj7J3J2nmrKPLNn%j6J2J0Rk8j0K2mQj2
$$ -3 -5 2 -8 5 -5 -2 -6 6 0 1 -2 -3 -10 -8 9 4 7 -1 -3 -3 1 1 -3 4 -13 0 12 7 3 -6 -4 3 6 11 6 6 -10 2 12 21 -7 -17 5 1 9 -3
7535cJ1j3nK8j4j1KNMj1J0qmJ4KLj1nMnJ2J3j0k1J4J7j2lkOj1J6mj3QnKKj2J7
$$ -3 8 -5 -10 18 4 -7 -5 0 4 -7 3 -5 -9 5 7 10 -1 -6 -2 -7 5 18 8 -13 1 18 6 3 1 7 -4 12 8 -5 3 -2 0 2 -10 7
7575Gj7OQjqmJ1qJ8kj6NkQKNlj8J3QrNj3LOKKRj6jOMRk1J0j0jL%%%j1J9J4k0q
$$ 7 -10 -4 4 3 -5 -9 2 -6 12 10 -6 -1 -3 5 7 12 9 -9 4 12 3 8 -5 -2 4 6 8 17 1 0 6 10 19 -2 8 -2 -3 0 0 0 0 -11 8 22 2 -6
7621fj0NJ9Lk2OM%RklrLJNJ3j3Mj4J5%LJk1NJ4%OqpJJ6j2j7JMJ1oPnnJ2j4J0n
$$ -6 -16 -11 8 11 -11 -5 -1 -1 8 6 3 -6 -3 -2 3 16 3 7 -7 8 8 11 12 -9 -4 10 10 16 8 1 2 18 6 -11 -10 -6 5 -1 6 1 -4 8 -6 4 -1
7666a%j3J0J4rMolQJMnoLJ0koopPK0m%j4mlJ4J0j8qJ1%mJ2j8NnJ8%J4k8nPOMq
$$ -1 -1 -14 -4 10 1 5 -1 -4 4 5 9 4 -2 1 11 9 3 -3 -10 -3 17 13 13 -1 -5 -8 6 16 -2 -10 1 1 -3 9 -9 -4 -9 9 9 23 -5 -10 -3 3 7 -1
7712aJoJ9nkj4%J4J4j7JjoQRLqj2mKK1pj0oJMNPj8%rJ1LKoJQJ4j0oLMlJmlJ3j0
$$ -1 0 -6 13 8 6 -8 -8 6 20 3 4 3 -3 5 14 17 9 -3 -7 -5 16 9 -1 -7 -6 -2 3 10 -8 -8 -17 -6 -3 -1 -7 -6 2 16 6 0 3 7 4 5 1 -2 11 1
7760AJ9%qj3kOJ0jmOj0jOOj3lO%LJj2nRK0j8j2oJ1qPJ6j2krRQq%OrJ0Mlr%J9J
$$ 1 20 20 12 -1 -3 3 13 12 8 14 4 3 9 15 2 -1 5 5 8 9 -3 -8 1 21 3 -9 -15 -4 -12 -5 11 -1 -3 -12 -3 5 -3 -3 3 -6 4 8 5 -4 -4 15 16
7807A6jj8PkJ1Nj9nlMJ1Nqj0lJ4QLk2Lj0RJ7j2oJJJ3%ooj1J2Rj0loOlJ7Rj8Ko
$$ 16 15 -3 4 2 13 18 -1 -6 -9 -5 6 11 3 -7 -10 4 12 15 -7 -4 -14 -5 12 0 -6 -5 -4 9 9 3 -3 -14 -2 7 -3 -6 -12 -6 -9 8 17 -1 1 -5
7851eJ5JKk0kJ1lJ2j0mpJ9kKj6j0J4KNLj5LKJ1Nrj4K%J8Pj6ooOJ2jQk9J1J6Jo
$$ -5 10 11 13 -7 -9 2 -1 11 1 -3 -10 9 7 9 -7 -17 -3 -1 4 7 -8 -5 -3 8 13 4 -10 -8 -8 10 17 1 -5 -11 -5 7 6 14 -15 -4 12 13 7
7894GLj2OJ4Jk2oJ0NmL%j6OLJ2%j1j4J6Pjm%j3J4jKkj3QnJ0J1k5LjK5pjlrj0K3
$$ 7 10 -2 4 18 19 -3 -9 1 6 2 5 5 -11 -5 -2 10 10 -1 -15 1 8 7 3 3 -10 4 3 5 3 -10 -2 -7 3 14 -11 -8 -9 16 9 8 5 -4 -14 9
7938ILqjpPJMlj3JQOLjj9J3Qllpj2K1K%qpkRJ6j5lpJ3J3nJ0k6QqK6j2lj5J4J5
$$ 9 12 4 3 -4 3 4 8 5 -8 -7 1 7 10 9 -10 3 11 8 5 -2 -14 7 9 9 1 -6 -8 1 17 2 -1 -8 5 18 13 23 -3 5 -3 23 11 8 -7 7 22
7983B2jrj4KoJ6Kkj7NNJ0Ljj7JJ1jQj7qNQJ2rj3j4K0J0Mj6Qj2J2J1qqpLK0rLj3
$$ 22 21 12 -2 0 -6 10 12 10 -7 -2 3 13 16 15 -2 -1 10 9 17 0 -8 -3 5 17 8 -5 -19 1 11 15 -1 7 -5 7 18 10 2 -5 -2 18 9 12 -1
8026aj8L1L%j9j3J5MMJ7k7j2RJ9K%j5j5J4OMKj5NPJJ4k5qJ5KJ1pj0%mRPnj1mR
$$ -1 -19 12 15 15 -4 -17 -2 2 6 23 -4 -16 -7 12 14 14 -1 -16 -2 4 8 10 -5 0 7 8 22 -3 -11 4 6 17 10 0 0 -4 5 12 7 -4 -8 1
8068AQLj3LpNJ3kj7rRROMk2qJ4O%Noj1MJ9Oj8mMNJ3j1j1mJ8LMjk1%mK7qj0qNO
$$ 1 9 12 -1 2 -5 0 13 11 -6 -15 -6 3 9 13 -9 -17 -3 3 3 8 2 -9 -5 14 20 2 -2 2 7 20 9 -2 -6 12 15 19 18 -3 -3 -7 20 12 2 -6 -1 5
8114EMPj7j0MJ9Pqj8j3K4J0jj0j6QPJ3k1jnJ8KJ1rmj2J1J6jrj4ljK0Joj2oJ4Q
$$ 5 9 16 -1 -11 -7 12 19 11 -7 -20 4 14 13 3 -13 -5 2 15 -6 -7 -12 6 8 19 10 6 -6 5 21 20 11 -3 -6 -7 13 14 8 -4 -10 4 12
8155A2npk0J4J2J3k5m%J4RpKpJJJ1lk2RQjJ6j8krJ9jM%j5j0K6jjk0
$$ 12 7 0 -20 -6 6 19 -6 -10 -10 4 13 6 8 1 2 3 14 11 -11 -2 6 5 21 3 1 -8 11 10 14 14 -1 -11 15 14 13 -7
8191g
$$ Imaginary data points
##PAGE= N=2
##DATA TABLE= (X++(I..I)), XYDATA
0@%%%%%%%%%%%%%%%%%%%%%%%%%%%%KoQqJ0j4J6j8K1k3K4k8L6m0M2m8N6o2O8p6
$$ 0 0 0 0 0 0 0 0 0 0 0 0 0 0 0 0 0 0 0 0 0 0 0 0 0 0 0 0 0 2 -4 4 -4 6 -8 8 -10 11 -12 12 -16 20 -20 22 -26 30 -32 36 -40
48d0Q4r4J05j13J22j35J49j62J74j86J99k10K15k12J97j59P1J16n33J593n076
$$ -40 44 -50 55 -58 64 -71 78 -84 90 -96 103 -107 108 -104 93 -66 5 121 -412 1181 -3895
69c895L2531J46589k04128p3646J83499j00852p9696J99970j8560j96195Q6007
$$ -3895 28636 175225 -28903 -102549 80950 -19902 -99598 100372 81812 -114383 -28376
80b8376R5111j08633L2100J06689j26370q2193J50064L5005j12609L6515M0638
$$ -28376 66735 -41898 -9798 96891 -29479 -111672 38392 73397 -39212 -2697 37941
91C7941j05473K9597J33156p6083r1051Q6391m318o3630J00376J7467j37517L6112
$$ 37941 -67532 -37935 95221 19138 -71913 14478 10160 -53470 46906 64373 -73144 -37032
103c7032R3644q1367M632J02523r9770q8073J43086L4887j18274M3068M5186j13150
$$ -37032 56612 -24755 -20123 82400 -17370 -105443 37643 72530 -45744 -2676 42510 -70640
115g0640M0400J35378j04657q7061J27631j6252j04644J22667M6519j71932K5237
$$ -70640 -30240 105138 481 -86580 41051 24799 -79845 42822 89341 -82591 -57354
126e7354J35880q3251l6334J06560o8925q8304J26050L8326j16917K3475O3134
$$ -57354 78526 -4725 -41059 65501 -3424 -91728 34322 72648 -44269 -20794 42340
137D2340p5256j679R9840m2063q7194O3578L8500o8509L0054N8641q8935k9945
$$ 42340 -32916 -34595 65245 23182 -64012 -434 38066 -30443 -389 58252 -30683 -60628
149f0628J07445j6091p1712O3694k427q7118P6355O7850j10726j0606Q9659n6540
$$ -60628 46817 30726 -40986 22708 20281 -66837 9518 77368 -33358 -43964 45695 -10845
161a0845k9398R7706l4859r0488P1686L8067p0184L3152M0127q8935k58J03659
$$ -10845 -40243 57463 22604 -67884 3802 41869 -28315 4837 44964 -43971 -44229 59430
173E9430l4308p2116N5658J0918o0563M9968M7152q2427j6628P3503k3472l2001
$$ 59430 25122 -46994 8664 19582 -40981 8987 56139 -26288 -42916 30587 7115 -24886
185b4886N7882j8749p0132N4440N0916o2738n701M6606m6038j8139P9582j1225
$$ -24886 32996 14247 -55885 -1445 49471 -13267 -18968 27638 -18400 -36539 43043 31818
197C1818p7167L4631L8267m8210J8576M7375o4827k7784P6669q829m9194M9532
$$ 31818 -45349 -10718 27549 -20661 -2085 45290 -19537 -47321 29348 20519 -28675 20857
209B0857j238p4081M6890O5751o5578k4164N2695l1184k0776P1168j1825p3622
$$ 20857 19619 -54462 -7572 58179 -7399 -31563 21132 -10052 -30828 40340 28515 -45107
221d5107L2999L7519m0504J6271L7644n8174k6169O7453N388m3346K2385L373
$$ -45107 -12108 25411 -15093 1178 38822 -19352 -45521 21932 27320 -16026 6359 9732
233I732m7418L0073N4913m3059l5135L5961o138j8683M8115J230o6113J2917M8104
$$ 9732 -37686 -7613 47300 4241 -30894 5067 -1071 -19754 28361 29591 -36522 -23605 24499
246B4499k4679l625L3578m1656l4131O2290J9490m8632R804J1998m1351K4855
$$ 24499 -180 -3805 29773 -11883 -46014 16276 35766 -12866 -3062 8936 -32415 -7560
258g560N6095m3065m0865L8327L88j9958M3558J052o4826J1612N0258j9118q873
$$ -7560 48535 5470 -35395 2932 3320 -16638 26920 27972 -36854 -25242 25016 5898 -2975
271b975K4648l4500k6888N5625J9676m5896M24J5611k7360J5423M6060l1911m1933
$$ -2975 21673 -12827 -39715 15910 35586 -10310 -9886 5725 -21635 -6212 39848 7937 -33996
284c3996L0858J3239j9605K5436P217n1530K669M9141j1514k0249K0662j7315
$$ -33996 -3138 10101 -9504 15932 23149 -28381 -25712 23429 11915 -8334 12328 -4987
296d987k6897M2044K3195m2399n808K2296j9744L816L9756k2167m0245K7158J7761
$$ -4987 -31884 10160 33355 -9044 -14852 7444 -12300 -8484 31272 9105 -31140 -3982 13779
309A3779k1611J6283J1707m2252j126M4637r450k2573J9208r925k4937L3878K1388
$$ 13779 -7832 8451 20158 -22094 -23220 21417 11967 -10606 8602 -1323 -26260 7618 29006
322B9006l7467o466K2353j4992k40L2338j6603l4601K2519J8502j9296Q291J2101
$$ 29006 -8461 -14927 7426 -7566 -7806 24532 7929 -26672 -4153 14349 -4947 3344 15445
335A5445l1389l971L7990m877k4789J4203j30k1419K2996K1421l2508j0883K5755
$$ 15445 -15944 -19915 18075 13198 -11591 2612 2482 -18937 4059 25480 -7028 -17911 7844
348G844p552q648K5332r139l2133K0042K2575k1266n56J4929k2539m915L4113
$$ 7844 292 -8356 16976 7837 -24296 -4254 18321 -2945 -3501 11428 -11111 -16026 18087
361A8087n463k7829J3639P525j7878J5443J6611k9118r039K7376l237j3000J5973
$$ 18087 12624 -15205 -1566 5959 -11919 3524 20135 -8983 -18022 9354 6117 -6883 9090
374I090n168k3212J8140K0235k1167o757J5154j1563m746K5623n402k7436J2328
$$ 9090 3922 -19290 -1150 19085 -2082 -8839 6315 -5248 -9994 15629 10227 -17209 -4881
387d881J5158j5059M956J3610k2145q134K7233o98j7992J0777M31j8309J5643
$$ -4881 10277 -4782 174 13784 -8361 -16495 10738 10040 -7952 2825 3256 -15053 590
400E90J9017k2488j0636J8393m441p605J9204l606k5323J0888J7905j3128M0J1495
$$ 590 19607 -2881 -13517 4876 435 -7170 12034 8428 -16895 -6007 11898 -1230 -1190 10305
414A0305j8770p187K7443N98k0954P456L887j4695J3126J7390k0590j2374J6167
$$ 10305 -8465 -15652 11791 12389 -8565 -1109 2778 -11917 1209 18599 -1991 -14365 1802
427A802K06n303J3901m376k2249Q810J9038r335m629R225j3631r484K5473P555
$$ 1802 2008 -3295 10606 6230 -16019 -7209 11829 2494 -2135 7090 -6541 -16025 9448 17003
441A7003k3832o29R715r677Q061J7380j9206j5682J8267L129q154J4010l108k5498
$$ 17003 -6829 -7458 2257 -7420 641 18021 -1185 -16867 1400 4529 -3625 10385 7277 -18221
455a8221Q909K3656q335r126N509r580m257K1466M472k0226k403P730m138P647
$$ -18221 -9312 14344 6009 -3117 2392 -7188 -11445 10021 14493 -5733 -8136 -406 -4544 3103
469C103J2395j7091j5554J6653Q637q914O021J50j9634M759K2689n214j2344L970
$$ 3103 15498 -1593 -17147 -494 8143 -771 5250 5400 -14234 -9475 13214 8000 -4344 -374
483c74n132l550J9062L430k1550o83J2526o194J295J4449j1656j7927J4040J1780
$$ -374 -5506 -9056 10006 13436 -8114 -8797 3729 -2465 -1170 13279 1623 -16304 -2264 9516
497I516r355K436J868j6710M437K1599p838j3348Q789k834q197J6577O174j9630
$$ 9516 161 2597 4465 -12245 -7808 13791 5953 -7395 1394 -1440 -9637 6940 13114 -6516
511f516k176J1657l782P02R776r331j2512J0502R184o496L6J824j0938Q93J7350
$$ -6516 -8692 2965 -817 -115 9661 330 -12182 -1680 7504 1008 1044 2868 -8070 -7177 10173
526A0173k492j5019M960M830q219P262R645j4115o232J1995k070k842J1206p389
$$ 10173 7681 -7338 -2378 2452 -5767 1495 11140 -2975 -9207 2788 718 -2124 9082 1693
540A693j5588J2979J1941j2082j888O773q932q00J4340l358j1412N453J958o071
$$ 1693 -13895 -916 11025 -1057 -2945 3828 -5104 -5904 8436 5078 -6334 -881 1077 -4994
554d994Q633N395j4655k906J3334j594o038O743k895j0103Q958R375r863m365
$$ -4994 3639 9034 -5621 -8527 4807 3213 -2825 3918 1023 -9080 -122 9253 -610 -4975
568d975O444k901j229Q864l431j0346O463O350q013J673Q083r903o227J4142K195
$$ -4975 1469 -1432 -2661 6203 2772 -7574 -1111 5239 -2774 -1101 6982 -2921 -9148 4994 7189
583G189j1957L099M180p225N247P500j1390l082J1311m262n667J0680j781j2598
$$ 7189 -4768 -1669 2511 -4714 533 8033 -3357 -6439 4872 610 -5057 5623 3842 -8756
597h756O984Q726p790r51N093o791j186J0517j712q689L321K416m212M859M606
$$ -8756 -1772 6954 -836 -1787 3306 -3485 -4671 5846 4134 -4555 -1234 1182 -3030 1829 6435
612F435r437l788R427P47n565M274M23q824L330R695m499n241L741l059k034J0618
$$ 6435 -3002 -6790 2637 3384 -2181 2093 2516 -6308 -2978 6717 2218 -3023 718 -2341 -4375 6243
628F243L9j2838K513Q098n561P57P858q359p340J0212K925n837M066j333r841
$$ 6243 6282 -6556 -4043 4055 -1506 -749 7109 -1250 -8590 1622 4547 -1290 2776 1443 -8398
643h398O529J0731p222n586M392k984j012R872n50j1117O21O148j162J733L210
$$ -8398 -1869 8862 1640 -3946 446 -2538 -3550 6322 5772 -5345 -4724 1424 262 1995 5205
658E205p748n468Q711N059m911m94n63o335M290J0988m918r604L443K407j958
$$ 5205 -2543 -8011 700 5759 848 354 -209 -6544 -2254 8734 3816 -5788 -2345 62 -1896
673a896O308J363j0975q21Q712j111j282M473o413p189R766O502p578j554K221
$$ -1896 4412 5775 -5200 -6021 2691 1580 298 4771 -1642 -8831 935 7437 -141 -1695 526
688E26n263K691R444m720p824M054J029k375O525J095r884l71P210p73p18K832
$$ 526 -4737 -2046 7398 2678 -5146 -1092 -63 -2438 4087 5182 -4702 -5073 2137 1364 646 3478
704C478n043m866O743N052m494k204R86k849J330P090j795p479J772L246k531
$$ 3478 -1565 -6431 312 5364 870 -1334 -348 -3197 -1867 5223 3428 -4051 -2279 967 -1564
719a564L357L655q198l538Q293R61l812L359k299o577O200O257o173k035L292
$$ -1564 1793 5448 -2750 -6288 2005 2966 -846 2513 214 -6363 -163 6094 -79 -2114 1178
734A178l897R8P808k003p352K387K866k273K940K308o709k108O636P96l322J799
$$ 1178 -2719 -2621 5187 3184 -4168 -1781 1085 -1188 1752 4060 -2649 -4757 1879 2675 -647 1152
750A152j056m322M036M953m495k827L033j245q99M953q28o102J778M158k369j26
$$ 1152 96 -4226 -190 4763 268 -2559 474 -771 -1670 3283 2455 -3647 -1869 2289 -80 -206
766b06K650l840k303N783Q80m957J515J893l832J888M564m576k937N034m90l169
$$ -206 2444 -1396 -3699 2084 2964 -1993 -478 1415 -2417 -529 4035 -541 -3478 1556 1066 -2103
782b103L906K5n365K771M082m036p71L407k761j513M732o28m360K178K085k880
$$ -2103 1803 1828 -3537 -766 3316 -720 -1491 1916 -845 -2358 2374 1746 -2614 -436 1649 -1231
798a231R22K733l235j845L983L40l021J578R01l237J351L738k871k420L116m58
$$ -1231 -309 2424 -811 -2656 1327 1667 -1354 224 1125 -2112 -761 2977 106 -2314 802 344
814C44k254L580P36n106Q74L975k184o41K918l038k663M861J273l901J088R18
$$ 344 -1910 1670 2406 -2700 -1826 2149 -35 -676 2242 -796 -3459 1402 2675 -1226 -138 780
830G80l438K087M434l432l200K790Mj096L439k49n145P11M061p75p19J178k869
$$ 780 -2658 -571 3863 431 -2769 21 25 -1071 2368 2119 -3026 -2315 1746 971 252 1430 -1439
847a439j886M596K057l638p94Q77j784J815M125k885m417K172J964p50J979j39
$$ -1439 -3325 1271 3328 -310 -1104 -227 -2011 -196 3929 1044 -3373 -1201 763 13 1992 1853
863A853m901J46M893j4j941O41k035j898M500K648m157j678J697j104J092L964
$$ 1853 -3048 -2902 1991 1977 36 677 -1358 -3256 1244 3892 -265 -1943 -246 -1350 -258 3706
879C706k539m709K248K425j055J602M9m662L37M657m56j730R40j941j803L867
$$ 3706 1167 -3542 -1294 1131 76 1678 1727 -2935 -2598 2059 1603 -127 813 -1128 -2931 936
895I36K335l187j632R50m26R10K742j343l683P63K340m25P55Q87l663j502M416
$$ 936 3271 84 -1548 -598 -1024 -114 2628 1285 -2398 -1635 705 280 1035 1922 -1741 -3243 1173
912A173J191k601N02m89k571K756L381k883k001J269r83O01L620j394m225J087
$$ 1173 2364 -237 265 -224 -2795 -39 3342 459 -1542 -273 -1256 -655 2965 1571 -2654 -1567
928a567K368n81P59P03l163j290L524J296j813j01p06j759K466K845k640k071
$$ -1567 801 220 979 1682 -1481 -2771 753 2049 236 135 -571 -2330 136 2981 341 -1730
944a730J577l57k62K855m11l811L80K608j89j37L75k008q04K729Q32k007J33N68
$$ -1730 -153 -510 -772 2083 1672 -2139 -1759 849 660 523 898 -1110 -1914 815 1647 -360 -227 341
962C41j797P79L045j549k828J707R99j332J362N25k729N23K206j432k40J785j838
$$ 341 -1456 -677 2368 819 -2009 -302 697 -635 727 1252 -1477 -954 1252 -180 -420 1365 -473
979d73j323K736K98k188Q11Q73j517K91J563q32r63Q00j2n68J023K38j700L01
$$ -473 -1796 940 1238 -950 -139 734 -783 -492 1071 239 -724 76 64 -504 519 757 -943 -642
997f42J743j119j081J910k0k148J109J511j612k09J283j113k34J788j055j529
$$ -642 1101 -18 -1099 811 791 -1357 -248 1263 -349 -558 725 -388 -622 1166 111 -1418
1013a418J959N32k119P38J489j767l60K082p09j522J251K65j127J158M74j956
$$ -1418 541 1073 -1046 -308 1181 -586 -946 1136 427 -1095 156 421 -706 452 926 -1030
1029a030K88J697q76m70J162j001j185J834J009j652n61P02j65L21R64q64j292
$$ -1030 -742 955 79 -391 771 -230 -1415 419 1428 -224 -785 -83 -248 73 1037 173 -1119
1046a119Q23P51n57O33L72k080l74K669L03j913J06J65p20J499J059k045o77J293
$$ -1119 -296 455 -102 531 903 -1177 -1551 1118 1421 -492 -386 -221 -941 558 1617 -428 -1105 188
1064A88n33J55J838j223k394J405J657q72P9K15j710P6K165k5j196M5n13l42J753
$$ 188 -345 -190 1648 425 -1969 -564 1093 221 300 515 -1195 -1119 1046 1021 -175 -130 -643 -985 768
1083G68P13j820o83R12k4J01J118m25j858P8J614L47m03k33j109k88J938N54j617
$$ 768 1481 -339 -1022 -110 -134 -33 1085 660 -1198 -1120 494 841 438 205 -904 -1192 746 1300 -317
1102c17M2L63j268Q97K204j367j941R06M01m5J464n40k320N33J610k53J54K18
$$ -317 -275 88 -1180 -283 1921 554 -1387 -481 -80 -125 1339 799 -1521 -988 622 369 523 741
1120G41j731n31K071Q17j139n29k37m20J042J389q25j575QO50O08Q91n98j923
$$ 741 -990 -1521 550 1367 228 -301 -538 -958 84 1473 648 -927 -919 -269 339 1230 632 -1291
1138a291R6J760K65n34l0q34o72J413J170r58q65j4k49P88J413r48j770O91R08
$$ -1291 -1195 565 830 296 266 -568 -1240 173 1343 385 -480 -494 -743 45 1458 510 -1260 -569 339
1157C39l87O11K87j777j79J729r7n55N61q75q73J514P63j117j38J25o39O13J121
$$ 339 -48 563 850 -927 -1106 623 526 -29 532 -343 -1216 298 1061 -56 -194 -69 -708 -95 1026
1176A026o59j024K53M30K5L01J48p72n05P69N31l59K1j62q65N57J267o72q51N39
$$ 1026 367 -657 -404 26 51 352 500 -272 -777 -8 523 164 185 23 -842 -285 982 310 -541 -2
1196bj92k80J136Kj329K69O38m58M01N67j114m80J119J70n36L14k42o89P09P55
$$ -2 -194 -474 662 664 -665 -396 242 -216 185 752 -362 -842 277 447 -89 225 -17 -706 3 758
1216G58p57m05M84j92r2O70j83q01L04N15k73l3K19m38j55O92R9o86L6L80k25
$$ 758 1 -404 80 -112 -204 466 283 -518 -214 301 28 -5 214 -224 -379 313 412 -274 -238 142 -83
1237h3O7M21n21m84P84K85o67J16K40n75L19P89o88n64O72l4l07P20j67j051M51
$$ -83 -16 405 -116 -600 184 469 -198 -82 158 -417 -98 691 3 -561 111 77 -230 490 323 -728 -277
1258b77Q09m63j08K74o04j10R41jo80Q4L0k20N23M23o77m88L94K66PK05j93o32
$$ -277 532 69 -39 235 -369 -479 462 461 -219 -135 -105 -325 198 621 -56 -544 -150 116 123 328 135 -497
1280d97O4P44J15m05l7k34l07P60N51p65m10L27j80K52Q15n52r76M35M37r2M94
$$ -497 -433 311 426 21 -16 -250 -557 203 754 -11 -421 -94 -274 -22 793 241 -735 -300 137 45 539
1301E39j68j128J23J021M9k09r4o81j65J028N25o64n69q2Q7O14O26n69j009J09
$$ 539 371 -757 -634 387 436 227 133 -548 -713 315 840 176 -393 -475 -388 226 852 283 -726 -617
1321f17O75L15K15l39j014m1J141M29m68m36m69l2R43O44p08q02K1L28M85N50
$$ -617 58 373 588 249 -765 -806 335 764 296 -140 -609 -641 302 946 238 -564 -543 -215 270 820
1341H20n19j116J35R23K00l3j58r39j40J250L75p11j96k97k59R57O12q39n29J19
$$ 820 301 -815 -680 243 443 410 252 -687 -827 423 798 87 -109 -406 -665 292 904 65 -464 -345
1361c45L1N16N73n64q50J16N81L50Nl30n35j45O62N75l38m98j41j14M78P40m41
$$ -345 -314 202 775 211 -639 -523 58 408 413 83 -452 -597 65 640 302 -196 -337 -451 27 767 326
1382C26q44J51K56J38N61j76r89j8P13K03L3j42o85j44Q03L93l95k74k04j95N24
$$ 326 -518 -367 -111 27 588 412 -577 -595 118 321 354 212 -473 -617 186 579 184 -90 -294 -489 35
1403C5O91m43p98J17L67J63L32k27p64P7O51Q0q6q5n13n6P09K70m65l35L9J58
$$ 35 726 283 -515 -398 -31 132 464 237 -527 -450 201 281 195 110 -403 -459 250 520 55 -280 -241 -83
1425h3K33K06k60m65J08M22K8n2o1m32L8O95o4n39J51O1k33M21K07n82p1L35q3
$$ -83 150 356 96 -369 -261 161 189 137 76 -356 -318 377 313 -226 -75 -14 -247 174 381 -201 -272 63 -20
1448b0R8K04m49k22N19J50l22jN5j99J17L37j08l55PJ91P7R4o6l47lM19K4k22
$$ -20 78 282 -167 -389 130 280 -42 -43 12 -187 -70 267 159 -196 -189 2 79 173 107 -240 -243 176 200 -22
1472b2O3j00k48L01M29k90l97Q2J19J40K65k23m82J42L29m6J47Po02r6P16J96
$$ -22 41 -59 -307 -6 423 133 -264 -182 -63 77 342 119 -363 -221 108 62 209 216 -386 -482 234 430
1494D30l65j43j99o8N37L21m36l55l1Q8M49L73m96p01J83O03J86j02k77m44j3
$$ 430 65 -78 -277 -345 192 513 77 -278 -309 -221 228 601 105 -596 -413 190 376 274 -3 -447 -460
1515d60O44M09l37n18k51J91O72L57o36o79K05M74K40J42l27p36M0Q18L18l03
$$ -460 184 593 256 -262 -513 -322 350 707 71 -608 -403 71 311 453 126 -610 -570 248 566 263
1535B63l86m62R5R19K63o73l71k9P8O48L92p18o49K53M41L43P8n48n29K33N58
$$ 263 -123 -585 -490 429 692 19 -352 -381 -303 345 737 19 -630 -377 64 407 485 -63 -592 -359 199
1556A99K46j25m57m09J44O75L98m94o52M4L56L19K73l65o61P2M98K47J28l06p27
$$ 199 445 320 -137 -546 -402 273 671 177 -475 -431 -75 244 517 152 -509 -437 61 308 436 130 -597
1577e97N4Q25K55l54l09l34P0O70L30m86m79n7K28M90K92n24o38J81M91K17O9
$$ -597 -543 282 537 183 -126 -460 -390 280 610 124 -355 -412 -184 306 598 74 -564 -383 108 325 394
1598C94l47o13J03P25K67l34m17k75K30O23J59m94m09M9K97L13J36l40n53O5O42
$$ 394 47 -566 -463 262 529 195 -222 -497 -267 356 515 21 -388 -339 -42 271 407 67 -486 -421 221
1619B21K18k99k68k41O5O23J54n59j90J14J0L79K39n71l35L50J93Q3P4l49l23
$$ 221 439 140 -128 -369 -304 319 473 -86 -276 -162 -152 227 466 -105 -440 -90 103 186 260 -89 -412
1640d12L20L52o4j58j82j31K15L52q2l47j11J65J41R0Nk44k04K22K72o0j17j37
$$ -412 -92 260 196 38 -144 -275 -60 292 210 -137 -248 -83 58 148 153 -91 -295 -73 199 139 22 -115
1662a15j47K00L77j40l55J3J14O0K28m1m37k8L36O0J9Kl57j39M72K05k46j48j31
$$ -115 -262 -62 315 175 -180 -167 -53 7 235 194 -243 -271 65 125 144 146 -211 -350 122 327 81 -67 -198
1685a98q0L97L07l65l62N3J91K11J88k87m26N7M14K22j14k65k93K6N21K98l81
$$ -198 -278 119 426 61 -301 -248 -57 154 342 55 -371 -314 100 322 208 -57 -350 -324 197 495 114
1706A14m24l3K34L58K23l83n84J03N31K20p1k97m54M2P05K45l93l70j84J32O49
$$ 114 -310 -343 -109 249 472 89 -495 -392 139 359 288 -9 -463 -421 284 529 136 -234 -418 -286 363
1727C63K50o29m56J33K87M28J26n87n01K90M78K25n6n32l96L30N96J34l52m68
$$ 363 613 -16 -472 -339 -52 376 502 -85 -586 -296 182 407 351 -181 -577 -247 349 483 131 -337
1747c37j28L41M82J45m65n50J18N02K63J4l87n57J95O48J44k27l11l91J56P25
$$ -337 -465 -124 358 503 38 -512 -394 108 371 385 -2 -559 -364 284 428 201 -110 -501 -345 380
1767C80J67m95l68q5K19N54J61n32m94J13M21L38K8m64n21K21O29J89k62l81l33
$$ 380 547 52 -316 -401 -182 372 533 1 -493 -380 41 379 407 -57 -578 -357 272 461 199 -182 -515
1788e15K26O77J39m90l98o9L18N29P0n67m10J48M75L10j30m65l43J88O14K11m34
$$ -515 -289 388 527 37 -361 -430 -112 417 487 -80 -490 -342 133 443 313 -152 -495 -307 307 518 84
1809H4l82p6J94N30J75n93l98K36K44K81J24n71l82L92L73M9r7l79k62L80M26
$$ 84 -298 -374 -180 350 525 -68 -466 -230 14 295 419 -152 -534 -142 231 280 183 -196 -458 -78 348
1830C48o7k77k66m2L17L22p4l94j97J95L04Q5j13k97j93K87L44r6k01j39r8K28
$$ 348 281 4 -262 -304 13 335 261 -133 -330 -135 169 254 141 -156 -349 -62 282 186 -15 -154 -252 -24
1852b4L43j24l50n1J04J46K04q5l67r4L00K03o7j01j96j21L06K75j99k24l1j7
$$ -24 319 195 -155 -206 -102 44 248 163 -204 -298 2 205 138 37 -159 -280 26 301 102 -122 -153 -170
1874a70K04L18k39l92O5K22J44R0k05l44R5L28J40j05k33k21J31L58J44k61l46
$$ -170 34 352 113 -279 -214 8 152 242 37 -307 -212 116 256 151 -82 -303 -172 186 330 69 -277
1895b77j1K89K18P2k67m00Q1M55J63j63k66k98J74N34R8m14k51l1J79M30J13m93
$$ -277 -288 1 219 291 24 -376 -295 160 323 160 -106 -404 -230 304 402 -12 -263 -294 -115 315 428 -65
1917f5l71J94L60K41o0m77l12L48M50M6k43l55j70L21N01Om76l37Q9L90L28j07
$$ -65 -436 -242 118 359 299 -178 -490 -142 308 354 111 -244 -414 -93 408 414 -62 -399 -310 80 408 301
1939C01m87k66K42M34J66j95m18k46L11N28L2m31k98j4K89M32J0n04k97J52L29
$$ 301 -186 -452 -210 224 390 195 -223 -469 -158 370 402 -29 -327 -341 -52 380 390 -114 -411 -259 70
1960G0L20m1n53l04L53M40P3j91l83k35L28N04K0l78l51o8L81M64q2n36k63J93
$$ 70 390 349 -204 -508 -155 285 358 167 -216 -451 -123 381 401 23 -328 -396 -15 449 367 -169 -432 -239
1982b39L62K75j13n00k65K90M93J24l29m26r9L75M60m0m58k94R9L40L41m2n54
$$ -239 123 398 285 -215 -480 -190 303 427 98 -328 -427 -52 408 368 -90 -384 -285 55 396 354 -200
2003b00l00L61L78J18j79m53j90M36L95p1k67l10r9M18M13k03m37j56J61L36K04
$$ -200 -500 -139 239 357 178 -275 -465 -29 366 295 28 -282 -381 37 450 247 -190 -346 -185 151 355
2024C55k15l79r9K74L16L6k44l21l6L69K94j80l07j09Q8K51K08j67l40m4K13J99
$$ 355 140 -239 -338 -64 252 288 44 -277 -313 56 350 170 -137 -246 -158 93 301 134 -206 -250 -37 162
2046A62P2j71l04lL28J58j30j59j41KK72K15k24k50jJ16J82J25k20k78Q6K09R7
$$ 162 234 63 -241 -244 84 242 112 -47 -188 -186 86 301 77 -173 -174 -58 124 249 29 -249 -163 46 143
2069A43K3j70k55Q6L17R7j70k14q2J67K52J4k23k04M4K25J64m0k35k24J31L47
$$ 143 166 -4 -259 -173 144 241 71 -143 -225 -58 194 208 -15 -219 -175 50 214 174 -61 -285 -154 193
2091A93P7k23k20o3J65L41Ql63j73R9K05K41n5m07j67K69K66N1j46l16j26L26
$$ 193 270 47 -173 -236 -71 270 278 -85 -258 -159 46 287 232 -175 -342 -73 193 244 98 -218 -344 -18
2113a8L10o5k74k43K9L31K98j81l97j15K05L05J27k08l65p1L23L20m4k92k69K2
$$ -18 292 227 -47 -290 -261 70 368 187 -210 -325 -120 185 312 104 -261 -332 -9 311 267 -25 -294 -272
2135b72L42L11j57m21j19J85K83J96j95m27o7L21K74J1j99l63m4L99K89j16l08
$$ -272 70 381 224 -197 -316 -131 152 348 153 -274 -341 -20 254 265 66 -297 -341 58 347 231 -77
2156g7k32M7L74K71k03l86j10J78L31J68k35m02m2K79K99O0k75l71J1L95K72j06
$$ -77 -309 -262 112 383 180 -206 -316 -138 193 361 126 -276 -318 -39 260 320 45 -326 -315 80 352 246
2178B46l50k57J31L86K24k12m11j17K72L15J02k23m21n5M06K96r7k66k94J4M43
$$ 246 -104 -361 -230 156 380 168 -243 -360 -88 227 329 106 -315 -370 36 332 235 -31 -325 -311 132
2199A32K74k64l23j08J04L78J94l17l59jK49K91M2l10k98O0L51K20j17l11j93
$$ 132 406 142 -181 -289 -185 193 387 70 -289 -290 -41 250 292 -18 -316 -256 95 315 198 -113 -306
2220c06J40L28J54k27l07k9K01K42M0k29k68N2K68J57n3k23k14J14K95J09j94
$$ -306 -166 162 316 89 -218 -247 -46 196 236 7 -261 -209 59 216 163 -60 -274 -160 135 244 50
2241E0j99m3J13K25Q1k25k10P1J58J23L2k08k16J48K08K9n6j66j16J22K43J7j70
$$ 50 -149 -192 -79 146 227 2 -208 -137 21 144 176 -32 -248 -100 108 137 81 -85 -201 -79 164 181 11
2264A1j44l6J62J86m1j97j14O2J88R9r4j74r8J19K34J4j96j47K6J35J97m4k64
$$ 11 -133 -169 -7 179 138 -59 -173 -111 77 176 82 -92 -190 -71 163 177 -19 -166 -140 -5 192 148 -116
2287a16p8J28J47R6o8k73n7K27J80o1j42j63JK47J60j30k11p2R5K18J09j83k66
$$ -116 -194 -66 81 177 109 -164 -221 6 186 125 -17 -180 -179 68 228 98 -113 -185 -90 128 237 54 -212
2310b12LK26J74j8k07k06O2K64J59j37k35j07J41K39Q5j84k56nK31J74Nk02k43
$$ -212 -209 17 191 173 -34 -240 -178 86 245 108 -127 -234 -93 146 231 47 -209 -214 17 191 196 -6 -249
2333b49N7K98J40j32k06j38R4L09Q5k24k05k8J39K56M8k64k24N6K35J75l5k59
$$ -249 -192 106 246 114 -92 -230 -136 173 258 34 -171 -199 -60 196 244 -20 -244 -188 47 222 187 -72
2355g2j95R2K90J24j23k43j37J50K77R8k16k53k8K04K44J8k34k51L6K84J87p7
$$ -72 -267 -175 115 239 116 -127 -264 -114 163 261 45 -208 -236 -32 212 230 -4 -255 -219 65 252 175
2377A75k44j97J15L05J09j90k37o9J26L14Q6k95k41M9K03K22Ql12k17J38K61J15
$$ 175 -69 -266 -151 154 263 73 -164 -233 -107 207 293 -2 -243 -194 9 231 239 -73 -290 -152 109 224
2399B24q7k57j61J85K81O1k09k29l1K12K21j1k33j95O5K35J55p7k36j61J43K57
$$ 224 137 -120 -281 -96 185 246 37 -192 -223 -11 210 199 -34 -229 -164 71 226 149 -87 -248 -105 152
2421A52O4j67j78n4J40K18J0k05j53K6J71J62m2k32j12J29J63L8n5j72q6J41J81
$$ 152 216 49 -129 -183 -43 175 185 -20 -173 -147 24 186 144 -88 -200 -71 92 130 75 -97 -183 -42 139
2444A39oj34j18k7J44J65o7j60o9M6J33R6p4j51n9J01J39L1j13j26NJ00J22j0
$$ 139 133 -1 -119 -146 -2 163 96 -64 -133 -87 46 142 68 -83 -142 -41 98 129 16 -110 -105 -5 117 107
2468A07j41q5M3J03R2k7j88n5J38J00J6q1j42jJ57P6m1j03q8K5J55R0j18j52P
$$ 107 -34 -119 -76 27 119 92 -96 -151 -13 87 103 22 -120 -121 36 112 71 -32 -120 -95 60 150 32 -120 -113
2493a13R7J31Jj24j35M3J47Q7n5j37q8Q0J80L5j41j31OJ29J14Lj58j28N9J66Q2
$$ -113 -16 115 116 -8 -143 -100 47 134 79 -58 -146 -66 114 149 8 -123 -117 12 126 129 -29 -157 -98 68 150
2518A50p9j45q5R5J89K5j52j16j6J09J65Jj82j26P5J38R8l5k03p1J31J41J6p0
$$ 150 71 -74 -159 -64 125 150 -2 -118 -134 -25 140 141 -41 -167 -92 46 144 109 -94 -165 -34 107 123 53
2542E3j53o5J51J62j1j45j29J7J63J25n9j75q5N8J68R0p7j74r8J24J93K8j37j54
$$ 53 -100 -165 -14 148 137 -8 -137 -120 43 168 109 -66 -151 -93 75 165 88 -86 -184 -60 133 161 24 -130
2566a30l3J32J93mk05j23N0J50J43k8k24j17J11J89O1p8j99p7J50J92J6j55j73
$$ -130 -163 -31 162 158 -47 -170 -120 30 173 145 -79 -196 -85 104 165 87 -112 -189 -39 153 169 14 -159
2589a59lJ86J68n2j95j21O2J85J14q6j95p7J23J75L8j26j79k8J71J59j5j79j25
$$ -159 -162 24 192 140 -55 -176 -114 71 185 99 -96 -173 -50 125 163 37 -142 -170 1 160 145 -34 -159
2612a59N0J47J20n2j83q3J01J40O7q3j70m7J42J33qj08j21rJ49J26n7j27o1J7
$$ -159 -109 38 158 106 -77 -160 -59 81 148 65 -105 -152 -10 123 115 7 -114 -123 26 152 95 -32 -93 -76
2636g6J18R3q0j24l0O4Q9M8o8j32nP8J15lr6p4J6Q1O6rj15m7N5P0N0k5j21m2J03
$$ -76 42 135 55 -69 -99 -35 54 102 34 -98 -103 -25 90 87 -9 -83 -67 14 80 71 -44 -91 -36 34 84 59 -62 -104 -1
2665aQ0rn6r8%J09P3m9o8n7J6J14M6p0q6j9O6O7J2p8p7L0Q1M9l0p8n2N4R9J0q6
$$ -1 79 70 14 -84 -84 25 98 49 -19 -76 -60 54 100 30 -56 -75 -9 58 70 -8 -85 -55 26 75 45 -33 -85 -31 68 78 -8
2696ho3J7N8N9nr1n4M8R8J7m5p8k3O5R0rr6n6L6O6N8j9j03n4Q3O9J8n0q5k7R7
$$ -8 -71 -54 4 63 58 -33 -87 -39 59 76 31 -47 -70 -5 85 76 -20 -76 -40 26 84 65 -38 -92 -9 60 78 28 -57 -84 13
2727A3P1l4o3o5RR0O4m5q0m6L2R3M3n6q6j4N2Q8Kp7p2jR6Q2k5j01m9L1Q0O7m4
$$ 13 84 50 -13 -78 -69 21 85 40 -40 -86 -54 39 82 26 -60 -74 -22 66 68 -9 -81 -82 14 96 71 -30 -79 -48 32 99 55
2758E5j16l3N8Q6M2n8j09k5J03Q2Op9q5k7J17Q6k8j03p2K2J23P1o6j28k9O3J12
$$ 55 -61 -94 -36 50 92 34 -75 -100 3 85 91 12 -73 -100 17 103 75 -28 -100 -78 45 116 50 -78 -107 -44 68
2785F8L8q9j07j4J05J02rj04r2K8J03P8l7j25m8O4R8N0n8j39j6R3R4lp5r4JJ10
$$ 68 106 17 -90 -104 1 103 94 -10 -102 -74 29 107 70 -55 -103 -39 59 109 51 -88 -104 -11 83 80 5 -89 -88 22
2813B2O9l9q1n2J2J06N8n3j03j9N4P2M1o1p9j0M8O9J6n3q7J1O6O1j6n6n1K7N7
$$ 22 91 52 -29 -81 -69 37 95 42 -61 -80 -26 46 87 26 -53 -63 -15 54 70 17 -70 -59 7 68 52 -4 -55 -28 29
2842B9L4pp7m5M7O4J3k9o8j4M9O3rm6l1k7O0N1l8m0l0J6O5M2n3n1kK3M9K1n3l6
$$ 29 63 56 -21 -66 -19 45 58 29 -39 -53 -4 59 50 4 -27 -54 6 57 19 -21 -51 -35 30 72 19 -32 -34 -11 38 59 6 -30
2874c0j4N9M2jo0l8K4M5K6k6m1j7K3M4K3n4m0J4L9J7j7k4k7J9L7J2l0l1J0K0K7
$$ -30 -44 15 57 56 -4 -42 -18 27 53 27 -14 -31 -8 36 59 5 -35 -21 18 35 18 -6 -33 -14 23 35 5 -26 -16 4 31
2905C1mk5l9K5L9jj9j2k4M2K5pl2k3NL2K7k7k1j0J2L1J9l3k2j1J7M4nl2l0K1J2
$$ 31 27 2 -37 -12 27 26 7 -5 -29 13 38 31 -1 -24 -19 13 40 13 -8 -18 -6 25 44 11 -11 -22 -5 39 34 2 -28 -7 5
2938EK6Km0k1J6J4L1no0mL9K4Rj6l7j8M1J5J2k5m0NL8M1j8n0k3J6M7K8k2n2k0
$$ 5 31 33 -7 -28 -12 2 33 28 -32 -36 3 27 36 20 -17 -35 6 21 33 8 -32 -27 11 52 34 -16 -39 -23 24 52 30 -22 -42
2971d2M2L4Qk9n9jM5N1j3m8l6QN4L0oo3k7L0M8K4k6o1j5M4N4pl5l7j3N0N4k4l8
$$ -42 0 34 42 13 -46 -47 -2 49 36 -12 -48 -40 14 44 38 -25 -52 -22 26 50 24 -37 -52 -8 46 39 4 -33 -46 4 58 34 -4
3004dm0J8M2M0k0m5k5J9N2K0k5o1NJ9M8pl0m6MM3K4ml3k1ML8K6ln2k2J5N1Rlm7
$$ -4 -44 -26 16 56 36 -9 -34 -15 37 57 32 -29 -24 -5 43 36 6 -40 -36 7 31 27 -6 -27 -23 15 41 38 -14 -36 -21 30 39 36 -11
3039a1l2L3M6Rk4l3k4L3L7Kl2j4lJ7L3Qm4k6J1L3J8j4n0mK1L4Rk6l1%K4L3j2k2
$$ -11 -43 -10 36 45 21 -12 -36 -3 34 36 4 -10 -13 4 37 45 1 -25 -14 19 37 23 -27 -31 -10 24 33 7 -24 -24 0 33 21 -1
3073aj8pK6K1Kl0j2MM2J2l0k1rK4K2Nk5k0KJ6K9j4k2k4K6QJ7j2j6j1K0Mjj3Kq
$$ -1 -19 -26 0 21 23 -7 -19 -15 27 39 9 -12 -21 3 25 30 5 -15 -13 3 32 18 -4 -28 -2 6 23 11 -5 -16 4 8 7 -6 -4 -12
3109a2J6Qj1njkJ8j6N%j7J2J1Lnkj1NK4rj5JKjK1%k2mJ3kK4j2k8jK6J5j3j5j4
$$ -12 4 12 1 -4 -5 -7 11 -5 0 0 -17 -5 6 9 4 2 -9 -4 20 11 -4 -3 -1 -2 19 19 -3 -7 6 4 28 16 -12 -13 13 28 15 0 -14
3148a4NJ6J0j4j3%PJ6K1k4k8RJ7K0j3j7k4J7J7J5mk8j0J9K9%k0l9J0L4J1Ll4k8
$$ -14 -9 7 17 3 -10 -10 -3 13 34 10 -18 -9 8 28 15 -2 -26 -9 8 23 19 -9 -19 0 29 29 9 -30 -20 14 25 28 -6 -34
3182c4J1M0J1j7l4j0MM7J1l4j1j0J8J9J5l6j8RK6J5Jl2k4J5K7K4j0k6j9J0K3K0
$$ -34 -23 17 28 11 -23 -33 -29 18 29 -5 -16 -26 -8 11 26 -10 -28 -19 7 22 23 -9 -33 -18 9 33 23 -3 -22 -12 11 31
3214C1j3l7lL4K9j1k7k8nL7J8kj1l4OK3K3j9k0j9J5L2L0m0k9j8L0K4J5j8m2KK6
$$ 31 18 -19 -22 12 41 30 3 -25 -30 7 25 23 12 -22 -16 7 30 11 -9 -28 -13 19 49 9 -20 -38 -8 16 31 13 -29 -27 -1
3247aK5J3l6k5KL4K2j1k1l9K6L9J2k2l9j4L5K3Pk1l4pL5L5j8k7l3J5L0L2k5l5
$$ -1 24 37 1 -24 -22 12 34 23 2 -37 -11 28 40 18 -21 -35 0 23 30 9 -25 -32 3 38 20 -7 -40 -25 5 37 12 -23
3279b3j5K3L5Jj6l7J0K7QJ7k3l6J7K1J4j1j4k3J0L8lj2j7j3K1J3Nj6j6RPNlmj2
$$ -23 -38 -15 20 21 5 -32 -22 5 13 30 7 -29 -12 9 23 12 -2 -25 -15 23 20 8 -9 -22 -1 12 17 1 -15 -6 1 6 3 -1 -13
3314a3%K1Oj5oo%J6J3j3j9lKK6Rj3l2K2J5rK1k0j2QJ8m%k7LJ3K6mk6r%J5Rj3n
$$ -13 -13 8 14 -1 -7 -13 -13 3 16 3 -16 -19 -17 9 18 5 -27 -5 10 1 22 2 -10 -2 16 12 12 -15 -12 1 27 23 -3 -12 -12 3 12 -1 -6
3353frRK0J2k8j9KJ5K5kk3k9OM2pLl1rL6K1Ll7l1J9M1J4j8k3j8%L5K6k5m3NK6
$$ -6 -15 -6 14 26 -2 -21 -19 -4 21 19 -4 -33 -27 15 8 11 -20 -29 7 28 31 -6 -37 -18 23 37 19 -4 -22 -22 13 39 14 -29 -24 2
3389BK2mj6l4%K9K9jl7k5OL3K2j1l5j1K0K0J1j0l5j4L6L1Jk5k6JK3L4mm3j0KL7
$$ 2 24 20 4 -30 -30 -1 28 27 -10 -35 -29 4 26 15 -20 -31 -11 9 20 10 -25 -39 -3 28 29 4 -22 -21 2 36 32 -11 -21 -19 18
3424A8J6pl9k6K2M1K3l6l5jJ7M4j4j6m2k0M7M9j3m3l1J3N6K0j9n9qK2N4J0l1m6
$$ 18 34 27 -12 -38 -16 25 48 12 -23 -24 -7 37 23 7 -35 -55 -8 41 28 -15 -46 -33 23 43 24 -35 -43 -21 33 43 12 -34
3456c4j4M7M1Ll9m8J8M1K8nm6l1K2L3K9k6n4oL7K3J6l4m5mM8K9Ml6n0J6M7J7k
$$ -34 -48 -1 40 43 4 -44 -26 15 43 38 -8 -39 -17 16 45 19 -35 -41 -4 19 35 1 -44 -48 0 29 33 -3 -53 -37 10 27 25
3489B5n0jJM4J9k2m6nK9K8J4k5m3jL4L2lk9j5lJ8L3rm2k4K9K2K2k6l2pK0L6Mk9
$$ 25 -25 -26 -25 19 38 16 -30 -35 -6 22 36 11 -32 -33 1 33 30 1 -14 -17 1 34 25 -17 -41 -12 10 32 6 -26 -33 -13 23 27 -2
3524bk9jK8M0j2l3k5K0K5K8k7l4jK4K9Kk1m6RL2J8Ol7k2K5K7J4k6l1LK3KRk4l1
$$ -2 -31 -32 -4 36 24 -9 -34 -14 11 39 12 -22 -23 1 30 32 11 -35 -26 6 24 30 -7 -29 -4 23 37 11 -20 -17 6 8 17 -7 -38
3559c8J6K7K9k3k4j3QL3J0l1k2nK3K8jl5j7J0L0K0ql7k8M4K0Pk5k2J2J6K5ok9
$$ -38 -22 5 34 11 -13 -26 -18 15 25 -6 -28 -33 -10 18 17 -18 -35 -25 5 25 17 -20 -48 -4 16 23 -2 -24 -12 4 29 23 -6
3592fk4QL2J8j2l8k3K9K9J2k1k7k2M0L4j0l0k6RK2M1k1l4k0J5M0J6j0m1k0K8L9
$$ -6 -30 -22 10 28 16 -22 -45 -16 13 25 4 -23 -45 -5 29 19 -11 -37 -28 -6 35 14 -20 -40 -25 15 31 21 -20 -40 -12 27
3624B7J3l4m1lL6L9Mm9l3MN4K9k3m5k3K0M4L7n3m5qL0O0Jm5m6kN5L5on2k6JO3
$$ 27 40 6 -35 -38 -2 37 41 -8 -41 -37 17 46 23 -22 -45 -25 19 56 3 -42 -50 -20 40 41 -4 -50 -52 3 38 32 -20 -46 -45 18
3658A8K6j8m6l2L7N4J6l7n9qM9M5Km6m5J1M1L2j5m5k7K3M8K7m8l8j3L1N2Km1m3
$$ 18 44 26 -20 -52 -15 39 55 18 -41 -49 0 45 47 1 -44 -33 8 40 25 -20 -47 -24 24 51 3 -35 -48 -17 35 37 -4 -47
3690d7%N3J8J1m8l4QN1K4j2n2j8K1L7K5k5m0j6L8L3J1l4l3%L5L2kn5j3kN2K5k7
$$ -47 -47 6 24 35 -13 -47 -39 12 36 24 -28 -46 -25 12 37 12 -28 -44 -6 27 38 4 -29 -29 6 38 36 -19 -32 -34 18 43 16
3723A6l3k7L3L0J7l4m5PL1K7ml1l5QN1K6qo3j5L2L2K1l1m2J1K5K7Pm0l0jL6L7
$$ 16 -17 -44 -11 19 36 2 -43 -36 -5 22 18 -13 -48 -40 11 37 29 -34 -49 -17 15 36 5 -37 -26 -1 26 33 -7 -37 -38 -2 35
3756C5k7l2oNM1J2k3l2mL2K5j4k9l3K6L0J4j5l3nJ8K4J1j8l3jM0J4mk5k8K3K7
$$ 35 8 -24 -30 -25 16 28 5 -27 -31 1 26 12 -17 -50 -24 6 20 5 -28 -33 -15 9 20 2 -31 -32 8 22 18 -7 -35 -12 15
3789A5J5j5l9qK6L1Rl3k7ML1J6lk7l3J7K8K6j0l8j7J4M0%j9m2%J8M8ll1m2K0K8
$$ 15 30 15 -24 -32 -6 25 34 1 -26 -22 9 25 22 -5 -38 -21 7 33 23 -15 -32 -18 22 22 3 -39 -39 -21 27 24 -7 -49 -29 -1
3823aM4k7m0j9K3M0J8j8m4k2L9N2jl5m5JL8M2lo1k3K5L2K1om6k7K4M8J0l7l6r
$$ -1 43 16 -24 -43 -20 20 38 20 -24 -46 -7 45 44 9 -36 -35 3 45 42 -19 -42 -17 15 36 30 -16 -43 -19 29 39 2 -34 -43
3856d3L2L8J1n9j9jN0K9k1m4j5J7N0K1l2l5j2K8L3J9m2k7pM6L1j8m2k7K7J7M4
$$ -43 -11 27 38 -21 -40 -41 9 38 17 -27 -42 -25 25 46 14 -21 -33 -5 28 47 5 -22 -29 17 48 30 -12 -39 -12 5 49
3887D9k8m4j0J1M8J1k4m5JK8L0Nl1k9qL6K8j3k2l6K7M0K7k1n8oK0M2jj9l0jK9
$$ 49 21 -23 -33 -22 26 37 13 -32 -31 -3 27 32 1 -28 -36 0 28 15 -7 -43 -16 24 51 30 -28 -34 -14 28 27 8 -22 -23 6
3920FJ6J3m5j5RL2K1j1l7j0K2J9J9k6l8lL7K8ok6l5QL6J0k5k3rL0K5Kk1k4pK6
$$ 6 22 35 -10 -25 -16 16 37 26 -11 -21 1 20 39 13 -25 -28 9 37 31 5 -30 -22 14 24 -1 -24 -33 -3 22 24 3 -21 -28 -2
3954bK6%k4j3mK2J6j2k6nJ6K8Lj5l1MK5J7oj4j8OJ5Ojk2j7K1K3Ml7oKK1J5lk3
$$ -2 24 24 0 -13 -17 5 21 9 -17 -22 -6 22 25 10 -21 -17 8 25 19 5 -13 -7 8 14 13 -9 -26 -5 18 22 -15 -21 -19 2 17 14 -9
3991ij5NL7jnk3rJ2K6Ok4lj7K1J8jj8j9OJ9K2qk7j3%L9Lj4l5LK5K1mk2j0oK3K1
$$ -9 -24 -19 18 17 12 -11 -20 -8 18 24 0 -3 -20 1 19 18 0 -19 -13 6 28 20 -7 -20 -20 19 22 8 -27 -24 1 22 18 -4 -14 -20 3 24
4029B4pl3j4K2K9Qj7l4mL3J2Pj4l0NK1K4j5k8rJ5K9Oj6k9kJ1K8J0m0j2MJ8J9J2
$$ 24 17 -16 -30 -8 21 29 12 -22 -26 7 19 26 12 -18 -13 8 32 17 -11 -20 -5 24 30 14 -15 -17 -6 22 32 -8 -20 -16 2 21 33
4064C3m8qLL1J4j2k4oK0J2J2k5j7KK0J7oj3l0K2J4J5pk5oRJ9Lj3k5kJ2L2kj7k4
$$ 33 -15 -23 -20 11 25 13 -11 -17 3 15 27 2 -15 -13 7 24 18 5 -25 -3 11 26 19 -6 -12 -3 16 19 6 -19 -21 -9 23 21 4 -20
4100b0%J5K0j7j5kOK1MKk5qJ7K3rj2k0RJ4J3Lj6k0PJ7J7ll0oNK4Pj2k3OK3Pno
$$ -20 -20 -5 15 -2 -17 -19 -13 8 12 14 -11 -19 -2 21 12 0 -20 -11 3 16 19 3 -17 -10 7 24 21 -9 -15 -10 14 21 9 -14 -8 15 22 17 11
4139A1k3nK6Qmj9j6J1PQmj7jJ1K8nk3klL5qqj9JKJ9J4nk4lJ3J4Kj1j3QmK3j6p
$$ 11 -12 -17 9 17 13 -6 -22 -11 -4 4 0 -17 -18 -7 21 16 -7 -9 -12 23 15 7 -12 -11 -9 10 24 19 -5 -8 5 19 21 10 -3 5 1 24 8 1
4179Aj3J0kK1j4pKLJ4j5jj1oJ4J3qj3LKJ8J1j0j2nMJ2%lj9RJ7nJrn%J0J9j9mj0
$$ 1 -12 -2 -4 17 3 -4 -2 1 15 0 -1 -12 -18 -4 9 1 -12 -9 -7 11 22 12 0 -5 -1 11 11 8 -11 -2 15 10 11 2 -3 -3 7 26 7 3 -7
4220gNKRpj4MJ4Pkj6j8J7Qj%k0NJ3RJ2j1k5MK4oK1j9j5%J9Ppj5rJ6J7Ok1mqQJ4
$$ -7 -2 0 9 2 -12 -8 6 13 11 -5 -23 -6 2 1 1 -19 -14 -1 8 20 9 -16 -12 12 6 27 8 -7 -7 12 19 12 -3 -12 4 21 27 6 2 -6 2 16
4262A6onj4MONJ4j5pnJ5Oj1ooQJ3Lnk7J7PlJ3j2j0%PJ5orrKJ7Rj0nj2NJ8lj3j7
$$ 16 10 5 -9 -5 1 6 20 5 -2 -7 8 14 3 -3 -9 -1 12 15 10 -17 0 7 4 17 5 -5 -5 2 17 11 2 -7 -5 12 21 11 6 -6 -1 17 14 1 -16
4305a6PKJ2Qj0j8KJ8J1%j8pJ4mQnoqOJ7Rj1j5jPJ4Mj1qrK0Nrmj1%J7Pj4lj8J0
$$ -16 -9 -7 5 13 3 -15 -13 5 16 16 -2 -9 5 1 9 4 -2 -10 -4 13 22 11 -4 -5 2 16 20 9 1 -8 12 17 8 4 -7 -7 10 17 3 0 -18 -8
4347hJ2OJk1mJ6QKj0qqJ0J5jqj0JQRj1Pk0QJ4JrkMJJ0nj3nJJ6J0j3mkMJ4l%j7
$$ -8 4 10 11 -10 -14 2 10 12 2 -6 -14 -4 11 10 2 -8 -7 1 10 -1 6 -14 -6 8 9 0 -2 2 3 13 8 -5 -10 -9 7 17 4 0 -2 2 16 13 13 -4
4391dkrK5Kqj6MJ6lJ1k4oRRPrkmKJ6kjj7JJ1J5pj3klRNnrj0K2Rmlk0KJ7OLk4j1
$$ -4 -6 -15 10 12 4 -12 -8 8 5 16 -8 -14 -5 4 11 2 0 -4 -2 14 12 11 -6 -5 6 21 14 1 -1 -4 5 10 5 -4 -14 8 17 13 10 -10 -8 9 15 18 -6 -17
4437a7QJ8Kqj0j0J2J0J3j5j0pK0NKj9rLJ5K1nk0j2KL1J2k0k0nKM0lk9rlJ8J6j2
$$ -17 -9 9 11 3 -7 -17 -5 5 18 3 -7 -14 6 11 13 -6 -15 -12 3 24 19 -1 -13 -11 20 32 12 -8 -13 -11 29 26 -3 -12 -15 3 19 7
4475Gk3j0OK7J9j9k2qJ8J0J9rk1j1J4J7jj2j7j0J3K8Nj7j2oK1J8j1k1oJ3NK0k4
$$ 7 -16 -26 -20 7 26 7 -15 -23 -5 5 24 15 -6 -17 -3 14 13 1 -16 -26 -13 15 20 3 -9 -15 6 24 13 -8 -14 -1 4 24 0
4510@j1mJ4L2j6j2k0OJ2K6j4k1j7PMK8j2k1oK0K0Pj3k2lJ1K1kk5j0RJ1K6j3j6
$$ 0 -11 -15 -1 31 15 3 -17 -11 1 27 13 -8 -25 -18 -14 14 2 -19 -25 -5 15 22 9 -13 -16 -5 16 14 -11 -21 -12 -1 25 12 -4
4545dk5J9K8nj7j8OOK3pj8j2ML6Pk3j6nMK9lrk0oK5J2Rj9k0J2K1J0qk1j4J7J5
$$ -4 -29 -10 18 13 -4 -22 -16 -10 13 6 -12 -24 -20 16 23 0 -16 -21 -17 12 9 0 -20 -26 -1 11 20 1 -19 -7 14 24 16 -5 -19 -2 13
4582A3J6rk9qK4J3lk5pJJ4PNj6j9J6K6pmk4qJ2K5rrj1qK0L7j2l5j1J4K4J2j9j5
$$ 13 29 20 -9 -17 7 20 17 -8 -15 -14 0 7 12 -4 -23 -7 19 12 8 -16 -24 -12 13 4 -5 -16 -24 -4 33 21 -14 -25 -11 13 25 6 -9
4619iJJ6J2%k4j5LK8Roj8qRK0Pj5m2PK1K8ok1l0kL4K0nl0j7RL5J8k9j6j3K0L1
$$ -9 -8 8 20 20 -4 -19 -16 12 21 15 -3 -11 -2 18 25 10 -32 -25 -4 24 18 -3 -33 -35 -1 19 14 -16 -33 -24 11 29 0 -16 -29 -9 22
4656B2Jj6l3jL3K6pl4j1QK2J7pl9lJ6L4Jk3k0j0K7K3pj4l4OL0J5Ml1k5%L8J3j2
$$ 22 23 7 -26 -27 6 32 25 -9 -20 -12 10 27 20 -19 -22 -6 28 29 6 -14 -24 3 26 19 5 -29 -23 7 22 26 -5 -30 -30 8 21 9
4692Il0qJ1K7J7k4j6mJ9K0Lk3k8KM4Nrk8l0K9L7J3l0k2j3J7M2k0j9j7NL1K1j0
$$ 9 -21 -29 -18 9 26 2 -14 -18 1 21 24 1 -27 -25 19 24 15 -13 -43 -14 23 36 6 -16 -29 -12 30 10 -9 -26 -21 10 31 21
4726B1l8j3OL9J8k5l7NK0L2ll0l1LM2K1nm2nJ0L3Qk1k2j0K1L4j3j7j5mK2J6mk4
$$ 21 -17 -30 -24 15 33 8 -29 -24 -4 28 25 -5 -36 -33 9 30 25 -17 -22 -12 21 29 8 -14 -24 -3 31 18 1 -14 -18 4 20 16 -8
4761hj2J2J6J5ok6k0K3K0jj3l1%K0L3kl0j8QK2L1j5k8j4K1J0K6k5k0jJ7K3pk0
$$ -8 -20 -8 8 23 17 -9 -29 -6 14 13 0 -31 -31 -11 22 20 -10 -28 -20 2 33 18 -10 -24 -3 7 33 8 -12 -13 4 27 20 0
4795@j7MK6J0qj3j5OK6J5k4l4lJ8L0Jk9k2MK7K9j5k4j5J3L6Nj6l4nJ7L3rj3l4
$$ 0 -17 -13 13 23 15 2 -13 -7 19 34 10 -24 -27 -9 21 22 -7 -29 -25 2 31 16 -8 -23 -10 26 31 15 -19 -24 -7 26 17 4 -30
4830c0J6K2K3j7k4j7RL7J1k2l0jJ9K9Nk4l4J4K9Qj2l4j3K4J8J4k1k6lK2L3nj7
$$ -30 -14 8 31 14 -10 -27 -18 19 30 8 -22 -23 -4 25 30 6 -28 -14 15 23 11 -23 -36 -12 6 20 -1 -27 -30 -8 25 20 3
4863Ck6OK0K0Ql8k2K1K4J6j4k6pRK7Rj5l2mJ8K4Kk7k6JL7L2k7k0k7J6M0Nj5l4
$$ 3 -23 -17 3 23 31 -7 -29 -8 16 32 18 -8 -15 -6 21 30 15 -17 -21 -3 21 23 -4 -30 -29 8 40 13 -7 -34 -18 22 27 12 -22
4898b2j3L0M0j6j6k2MK1K4j3k6j9J0L6J1ml2j9J2L8J4k9k8LK3K5jm1j9J5K4J8
$$ -22 -35 -5 35 19 3 -19 -15 6 30 17 -9 -28 -18 18 29 25 -7 -26 -14 24 38 9 -19 -16 7 32 31 -10 -29 -14 10 28
4930B8pl9j4K8K5Qk2l6kL1K8jk9k4PK5J0qk4j0J7K4Pok8rK7K5lj7j3j7K9J2ok8
$$ 28 21 -18 -32 -4 21 29 7 -29 -31 0 28 27 -2 -26 -19 6 16 8 -16 -26 -9 15 22 16 -12 -21 6 31 28 11 -2 -19 10 22 16 -12
4966a2j0JL8Lrk9lJ3J6J8k2k1RK1Llk8j1J2K6J1j6j1qJ7J7Nk1j3JJ1K4%k6qJL1
$$ -12 -22 -21 17 20 11 -18 -21 -8 8 26 4 -17 -8 13 16 13 -15 -26 -14 12 23 7 -4 -12 5 22 27 6 -7 -6 5 29 29 3 -5 -4 27
5003B7Mql2lLL1Ok3k3PJ9J2nj7rNJ7J6j8k8kK6K6j4j3k6NK1NJ1k3j9J9K7J7k5
$$ 27 31 23 -9 -12 -9 22 28 5 -18 -11 8 20 15 -2 -11 -6 11 27 9 -19 -21 5 31 17 4 -22 -17 4 9 20 -3 -22 -3 24 41 16
5039A6k5j0K0K0Ol0j6J5J7J3nk1k0J7J1J9j0l0nNL4Pk1k1j3K0K0Nj9j5MJ9J7j0
$$ 16 -9 -19 1 21 27 -3 -19 -4 13 26 21 0 -20 -3 8 27 17 -13 -18 -13 21 28 7 -14 -27 -7 13 18 -1 -16 -12 7 24 14
5073A4j9k0K0L1J6l1k2KK3J9jl5j2J1J4K0j5k5rjL8J3j6l0rK3J6Rk0l1RK9K0j3
$$ 14 -5 -25 -5 26 42 11 -11 -9 14 33 32 -3 -15 -4 10 30 15 -10 -19 -20 18 31 15 -15 -24 -1 15 24 4 -27 -18 11 31 18
5107A8l0pjK8J9j2k5j6J8L5kj8k2kK6L2pl3j6LM1Rj9l1pK1RJ2mm1rL2J4Kk0k1
$$ 18 -12 -19 -20 8 27 15 -10 -26 -8 27 25 7 -15 -17 9 41 34 1 -15 -12 29 38 19 -12 -19 2 11 23 19 -22 -31 1 15 17 -3 -24
5143b4PL0J5j5k9j5J7L1K1l5qk4L3J1J4k3k6J4J0J8mk0qMK1J0j1j7rJ2RK3j2k6
$$ -24 -17 13 28 13 -16 -31 -14 17 38 3 -5 -29 4 15 29 6 -20 -6 4 22 18 -2 -10 -6 15 25 14 -3 -12 0 9 32 20 -6
5177fqK4J1kj6j6J2J2Ok0Pj3MRJ1j3j2mJ3J5qkj8KJ9J3oj3j7J4K7Rj8j7nPJ9j0
$$ -6 -14 10 21 19 3 -13 -1 11 17 -3 4 -9 -5 4 15 2 -10 -14 -1 14 6 4 -14 -12 7 20 14 1 -16 -2 25 34 16 -1 -6 1 20 10
5215A0j7rjK3Nmkj7QK4ook6JJ2J8j1j2lQJ8J5j3l1LJ4K0lrk9NK0J3Lj8rKJ7J2
$$ 10 -7 -16 -17 6 11 7 5 -12 -4 20 14 8 -18 -17 -5 13 2 -10 -13 -5 13 28 15 -16 -13 1 21 18 9 -20 -15 5 18 21 3 -6 -4 13 25
5254B5j3j4k4K5J6J5l0k2jK6K6%k3k0LQJ1onLmJ4J1j6rlJ2J4%j3j2j0K5PLj5k3
$$ 25 12 -2 -26 -1 15 30 0 -22 -23 3 29 29 6 -14 -11 -3 8 2 -3 0 -4 10 21 5 -4 -7 5 19 19 6 -6 -16 9 16 19 4 -19
5291a9J6K3Ork1pJ4J2J0k3pj0J3K6Pk4k1J2J5Nok0j4J7K2Pj9k5LK5K5pk7k1RK7
$$ -19 -3 20 26 17 -4 -11 3 15 25 2 -5 -15 -2 24 31 7 -14 -2 13 18 12 -8 -22 -5 17 24 5 -20 -17 8 33 26 -1 -22 -13 14
5327A4J6j3j2k4J3L4Qk9k0KJ6J4Qk2k3lK6K2j3j3k0J0J6J8j1k2j2J7J1Prj3mJ5
$$ 14 30 17 5 -19 -6 28 36 7 -13 -11 5 19 27 5 -18 -21 5 27 14 1 -19 -9 7 25 14 -8 -20 -3 8 15 6 -7 -11 4
5361DJ5kj5rQJ8kQk3j5QK1Orrk3K6J5mpk1LJ4MJ6k8j4kJ7J5j5rkJ1J9J4k2j7j5
$$ 4 19 17 2 -7 1 19 17 25 2 -13 -5 16 22 13 4 -19 7 22 18 11 -10 -7 7 11 27 -1 -15 -17 0 15 0 -9 -11 0 19 33 11 -6 -21
5400b1K9J4nk8MmK7Oj0j1j4OL5j6j1j2kJ4J7lj9j0%K1J3j6j6jrK9kolqJ7K0j9
$$ -21 8 22 17 -11 -7 -11 16 22 12 1 -13 -7 28 12 1 -11 -13 1 18 15 -4 -14 -14 7 20 4 -12 -13 -22 7 5 -1 -4 -12 5 25 6
5437Fj3jjJ8lPrk1J1K0Prj4JQOkoj2RmJ4qj1j3PK3Qj1k3%J5J0MrprJ3J3j0nk8
$$ 6 -7 -8 -9 9 6 13 4 -17 -6 14 21 12 -2 -1 7 13 11 5 -7 2 -2 12 4 -7 -20 -13 10 18 7 -16 -16 -1 9 13 4 -3 -12 1 14 4 -1 -29
5479b9K1J1J3j0j1j7K2J5Orl1JK3Lq%qJ1J3Mmj7j8RK2Lql0jJ9K1%k1j6OK9Kj0
$$ -29 -8 3 16 6 -5 -22 0 15 21 12 -19 -18 5 8 0 0 -8 3 16 20 16 -1 -19 -10 12 15 7 -23 -24 -5 16 16 -5 -21 -15 14 16 6
5517Fk2KJ1J5oj9mmJ7K4lj2j6MJ9Nlk9J0NPK6j6k2j0RK9jqk0j3K4J5%j9k5J3J3
$$ 6 -16 -14 -3 12 6 -13 -17 -21 -4 20 17 5 -11 -7 12 17 14 -15 -5 0 7 33 17 -5 -15 -6 23 22 14 -6 -19 5 20 20 1 -24 -11 2
5555BK3jl5lJK5J0j6j0j6QK5OJl6%K2K0%j9j9NJ5KJk0mMK5J5k5k1nK6J4j0j6j0
$$ 2 25 24 -11 -14 -13 12 22 6 -4 -20 -12 13 19 20 -16 -16 6 26 26 7 -12 -7 8 10 11 -9 -13 -9 16 31 6 -15 -20 6 20 10 -6 -16
5593a6j0K5K3j3j8j5RK0J3j9rj0RK4J1j7k2rK4J3Qk1j6PJ2J0j2j6mJ9J4Mj3j8
$$ -16 -26 -1 22 9 -9 -24 -15 5 18 -1 -10 -20 -11 13 24 7 -15 -24 0 13 21 0 -16 -9 3 13 1 -15 -19 0 14 18 5 -13
5627a3MJ2J6j7nllK6%rk6RQNJ1j2j6KkJ7jkk1NJ6J1llj5PK5j7Jj3oJ0J7%k8LK
$$ -13 -9 3 19 2 -3 -6 -9 17 17 8 -18 -9 -1 4 15 3 -13 -11 -13 4 3 1 -20 -15 1 12 9 6 -9 -2 23 6 7 -6 -12 -2 15 15 -13 -10 -8
5668hJ5Mqj7JLJ6Qj4k0LJ2J4J3l1pmK3J6j4k4lJ5K2Nj9j2kNL7j9lk2OK4jJj5k3
$$ -8 7 11 3 -14 -13 -10 6 14 0 -20 -17 -5 9 22 -9 -16 -20 3 19 5 -19 -22 -7 15 20 1 -11 -13 -8 29 10 7 -15 -9 15 14 15 0 -23
5707b3J9J0K1j5k7PPK0Nk4j8J1J3J2jk0k2J9K4Pj8j5j3J4K3%j9k1J5QK7Mk3j2
$$ -23 -4 6 27 12 -15 -8 -1 19 24 0 -18 -7 6 18 17 -3 -25 -6 18 25 7 -8 -21 -7 16 16 -3 -24 -9 -1 26 30 7 -5
5741eLJ0K5k1j7oPJ1J5j2k1mJ7J6Nj1k9MK0J6nk2k8J7J9K0j2j4j9J2K9rLk8j4
$$ -5 -2 8 33 12 -5 -11 -4 7 22 10 -11 -15 2 18 23 12 -17 -13 7 23 18 -4 -32 -15 4 24 12 -2 -21 -9 20 11 14 -14 -28
5776b8M4J0j3j6j0nK2L2k0k0j7J7K9jmk9mK1J3Kk1k1NL4Lkl2j0%L3J0j4j8j5K0
$$ -28 16 26 13 -3 -13 -18 4 36 16 -4 -21 -4 25 24 20 -9 -13 8 21 23 2 -19 -14 20 23 21 -11 -21 -21 12 22 8 -10 -25 -5
5811eK9qqj8nJ9J6Kk1j7NK4K6l4j6kK4J2jj4j3mK1jJLl1NK0J1j3mj3JJ9Oj1k2
$$ -5 24 16 8 -10 -15 4 20 22 1 -16 -11 13 39 5 -11 -13 11 23 22 8 -5 -9 12 11 12 15 -16 -11 9 20 7 3 -10 -9 10 16 5 -17
5849a7KK0J7j0j5rJJ7J0Qk9mJ1J2J3j7j7pJ4K2jj3k3J2J5J2ll1KMJ1J3j8pj2K3
$$ -17 -15 5 22 12 -3 -12 -11 6 16 24 -5 -9 2 14 27 10 -7 -14 0 22 21 8 -15 -3 12 24 21 -10 -8 -4 7 20 2 -5 -17 6
5885FQ%k7mlK6Q%k4oJ3J0J5k0j5kK3NJ1k6k0OK8NPk6pJ2K5ll0mnJ1L0j5rj7J0
$$ 6 14 14 -13 -17 -20 6 14 14 -10 -16 -3 7 22 2 -13 -15 8 13 24 -2 -22 -16 12 17 24 -2 -9 3 28 25 -5 -9 -14 -3 27 12 3 -14 -4
5924dJ9J4k2k2pJ5K2Pj7k1j1J9K0Mj2j8OK9mNk0qNNJ8Pl9oK0J3Ok0j1rL1J6%k0
$$ -4 15 29 7 -15 -22 -7 15 22 5 -16 -27 -8 12 16 4 -14 -8 21 17 22 2 -6 -1 4 22 29 -10 -16 4 17 23 3 -8 -17 14 30 30 10
5962A0k8J3K3J0k6oj7J7K0Krj6qJ6K7j4k2j7PJ6J6lj5k0J8L0J2k7k9%J4K6Nk7
$$ 10 -18 -5 18 28 2 -4 -21 -4 16 18 9 -7 -15 1 28 14 -8 -25 -18 -2 14 11 -4 -24 -6 24 36 9 -20 -20 -6 20 25 -2
5996bj9QJ7L1j6k0j6K7KMll3KJ0J4Jqk2NK2J9ml0j0J2K0Oj1j5j5K2J0Qj4j9mL5
$$ -2 -21 -13 4 35 19 -1 -17 10 12 16 13 -20 -18 -8 6 7 -1 -23 -18 4 23 19 -11 -21 -9 11 17 6 -9 -24 -2 8 16 2 -17 -21 14
$$ [...]
8191a1
##END NTUPLES=NMR FID
##END=
