##TITLE=1H_DE-80H_X3
 200.13MHz, d2o
 8 sc
 
 19ns.26.2.2025
##JCAMPDX= 6.0         $$ Bruker NMR JCAMP-DX V2.0
##DATA TYPE= NMR FID
##DATA CLASS= NTUPLES
##ORIGIN= UXNMR, Bruker Analytische Messtechnik GmbH
##OWNER= pz
$$ XWIN-NMR		Version 3.5
$$ Mon Mar 17 17:05:20 2025 Russian Standard Time (UT+4h)  Yarkov@DPX200
##.OBSERVE FREQUENCY= 200.1313
##.OBSERVE NUCLEUS= ^1H
##.DELAY= (6, 6)
##.ACQUISITION MODE= SIMULTANEOUS
##.ACQUISITION SCHEME= undefined
##.AVERAGES= 8
##.DIGITISER RES= 18
##SPECTROMETER/DATA SYSTEM= spect
##.PULSE SEQUENCE= zg30
##.SOLVENT NAME= CDCl3
##.SHIFT REFERENCE= (INTERNAL, CDCl3, 0, 14.3821)
##AUDIT TRAIL= $$ (NUMBER, WHEN, WHO, WHERE, WHAT)
$$ ##TITLE= Audit trail, XWIN-NMR		Version 3.5
$$ ##JCAMPDX= 5.01
$$ ##ORIGIN= Bruker BioSpin GmbH
$$ ##OWNER= Yarkov
$$ C:/Bruker/XWIN-NMR/data/yarkov2/nmr/H-C/1/audita.txt
$$ ##AUDIT TRAIL=  $$ (NUMBER, WHEN, WHO, WHERE, WHAT)
(   1,<2025-03-17 17:03:28.01 +0400>,<Yarkov>,<DPX200>,
      <created by zg, POWCHK disabled, PULCHK disabled
       configuration hash MD5:
       00 E9 B6 7A A2 85 ED C7 34 08 36 98 17 FE 4E 26
       data hash MD5: 16K
       91 59 6D 42 78 0F 88 A3 18 98 80 70 D2 6C E3 E9>)
$$ ##END=
$$ 
$$ hash MD5
$$ 4E F3 86 5B B6 2B 0A 9E 25 66 EA E4 F9 88 89 1C
##$RELAX= 
##$RELAX= 
##$RELAX= 
##$RELAX= 
##$RELAX= 
##$RELAX= 
$$ Bruker specific parameters
$$ --------------------------
##$DU= <C:/Bruker/XWIN-NMR>
##$EXPNO= 1
##$NAME= <H-C>
##$PROCNO= 1
##$TYPE= <nmr>
##$USER= <yarkov2>
##$AMP= (0..31)
100 100 100 100 100 100 100 100 100 100 100 100 100 100 100 100 100 100 
100 100 100 100 100 100 100 100 100 100 100 100 100 100 
##$AQSEQ= 0
##$AQ_mod= 1
##$AUNM= <au_zg>
##$AUTOPOS= <>
##$BF1= 200.13
##$BF2= 200.13
##$BF3= 200.13
##$BF4= 200.13
##$BF5= 200.13
##$BF6= 200.13
##$BF7= 200.13
##$BF8= 200.13
##$BYTORDA= 1
##$CFDGTYP= 0
##$CFRGTYP= 5
##$CHEMSTR= <none>
##$CNST= (0..31)
1 1 145 1 1 1 1 1 1 1 1 1 1 1 1 1 1 1 1 1 1 1 1 1 1 1 1 1 1 1 1 1 
##$CPDPRG= <>
##$CPDPRG1= <>
##$CPDPRG2= <>
##$CPDPRG3= <>
##$CPDPRG4= <mlev>
##$CPDPRG5= <mlev>
##$CPDPRG6= <mlev>
##$CPDPRG7= <mlev>
##$CPDPRG8= <mlev>
##$CPDPRGB= <>
##$CPDPRGT= <>
##$D= (0..31)
0 0.7 0 0 0 0 0 0 0 0 0 0.03 0 0 0 0 0 0 0 0 0 0 0 0 0 0 0 0 0 0 0 0 
##$DATE= 1742216607
##$DBL= (0..7)
120 120 120 120 120 120 120 120 
##$DBP= (0..7)
150 150 150 150 150 150 150 150 
##$DBP07= 0
##$DBPNAM0= <>
##$DBPNAM1= <>
##$DBPNAM2= <>
##$DBPNAM3= <>
##$DBPNAM4= <>
##$DBPNAM5= <>
##$DBPNAM6= <>
##$DBPNAM7= <>
##$DBPOAL= (0..7)
0.5 0.5 0.5 0.5 0.5 0.5 0.5 0.5 
##$DBPOFFS= (0..7)
0 0 0 0 0 0 0 0 
##$DE= 6
##$DECBNUC= <off>
##$DECIM= 32
##$DECNUC= <off>
##$DECSTAT= 4
##$DIGMOD= 1
##$DIGTYP= 9
##$DL= (0..7)
0 120 120 120 120 120 120 120 
##$DP= (0..7)
150 150 150 150 150 150 150 150 
##$DP07= 0
##$DPNAME0= <>
##$DPNAME1= <>
##$DPNAME2= <>
##$DPNAME3= <>
##$DPNAME4= <>
##$DPNAME5= <>
##$DPNAME6= <>
##$DPNAME7= <>
##$DPOAL= (0..7)
0.5 0.5 0.5 0.5 0.5 0.5 0.5 0.5 
##$DPOFFS= (0..7)
0 0 0 0 0 0 0 0 
##$DQDMODE= 0
##$DR= 18
##$DS= 0
$$ [...]
##$SUBNAM0= <"">
##$SUBNAM1= <"">
##$SUBNAM2= <"">
##$SUBNAM3= <"">
##$SUBNAM4= <"">
##$SUBNAM5= <"">
##$SUBNAM6= <"">
##$SUBNAM7= <"">
##$SUBNAM8= <"">
##$SUBNAM9= <"">
##$SW= 18.0517328524113
##$SWIBOX= (0..15)
0 0 2 0 0 0 0 0 0 0 0 0 0 0 0 0 
##$SW_h= 3612.71676300578
##$TD= 16384
##$TD0= 1
##$TE= 0
##$TE2= 300
##$TE3= 300
##$TEG= 300
##$TL= (0..7)
0 120 120 120 120 120 120 120 
##$TP= (0..7)
150 150 150 150 150 150 150 150 
##$TP07= 0
##$TPNAME0= <>
##$TPNAME1= <>
##$TPNAME2= <>
##$TPNAME3= <>
##$TPNAME4= <>
##$TPNAME5= <>
##$TPNAME6= <>
##$TPNAME7= <>
##$TPOAL= (0..7)
0.5 0.5 0.5 0.5 0.5 0.5 0.5 0.5 
##$TPOFFS= (0..7)
0 0 0 0 0 0 0 0 
##$TUNHIN= 0
##$TUNHOUT= 0
##$TUNXOUT= 0
##$USERA1= <user>
##$USERA2= <user>
##$USERA3= <user>
##$USERA4= <user>
##$USERA5= <user>
##$V9= 5
##$VALIST= <valist>
##$VCLIST= <CCCCCCCCCCCCCCC>
##$VD= 0
##$VDLIST= <DDDDDDDDDDDDDDD>
##$VPLIST= <PPPPPPPPPPPPPPP>
##$VTLIST= <TTTTTTTTTTTTTTT>
##$WBST= 1024
##$WBSW= 4
##$XGAIN= (0..3)
0 0 0 0 
##$XL= 0
##$YL= 0
##$YMAX_a= 123917
##$YMIN_a= -65578
##$ZGOPTNS= <>
##$ZL1= 120
##$ZL2= 120
##$ZL3= 120
##$ZL4= 120
##$ABSF1= 10
##$ABSF2= 0
##$ABSG= 5
##$ABSL= 3
##$ALPHA= 0
##$AQORDER= 0
##$ASSFAC= 0
##$ASSFACI= 0
##$ASSFACX= 0
##$ASSWID= 0
##$AUNMP= <proc_1d>
##$AZFE= 0.1
##$AZFW= 0.1
##$BCFW= 1
##$BC_mod= 2
##$BYTORDP= 1
##$COROFFS= 0
##$CY= -3
##$DATMOD= 1
##$DC= 2
##$DFILT= <>
##$DTYPP= 0
##$F1P= 0
##$F2P= 0
##$FCOR= 0.5
##$FTSIZE= 0
##$FT_mod= 4
##$GAMMA= 1
##$GB= 0.15
##$INTBC= 1
##$INTSCL= 1
##$ISEN= 128
##$LB= 0.25
##$LEV0= 0
##$LPBIN= 0
##$MAXI= 10000
##$MC2= 0
##$MEAN= 0
##$ME_mod= 0
##$MI= 1.114404
##$NCOEF= 0
##$NC_proc= 0
##$NLEV= 6
##$NOISF1= 3.799351
##$NOISF2= 2.8
##$NSP= 1
##$NTH_PI= 0
##$NZP= 0
##$OFFSET= 14.38212
##$PC= 1
##$PHC0= -1259.673
##$PHC1= 0.9922218
##$PH_mod= 1
##$PKNL= yes
##$PPARMOD= 0
##$PSCAL= 0
##$PSIGN= 0
##$REVERSE= no
##$SF= 200.129724274929
##$SI= 16384
##$SIGF1= 3
##$SIGF2= 2
##$SINO= 400
##$SIOLD= 16384
##$SREGLST= <1H.CDCl3>
##$SSB= 0
##$STSI= 0
##$STSR= 0
##$SW_p= 3205.1282051282
##$SYMM= 0
##$S_DEV= 0
##$TDeff= 0
##$TDoff= 0
##$TI= <>
##$TILT= no
##$TM1= 0
##$TM2= 0
##$TOPLEV= 0
##$USERP1= <user>
##$USERP2= <user>
##$USERP3= <user>
##$USERP4= <user>
##$USERP5= <user>
##$WDW= 1
##$XDIM= 8192
##$YMAX_p= 0
##$YMIN_p= 0
$$ End of Bruker specific parameters
$$ ---------------------------------
##NTUPLES= NMR FID
##VAR_NAME=  TIME,          FID/REAL,        FID/IMAG
##SYMBOL=    X,             R,               I
##VAR_TYPE=  INDEPENDENT,   DEPENDENT,       DEPENDENT
##VAR_FORM=  AFFN,          ASDF,            ASDF
##VAR_DIM=   8192,          8192,            8192
##UNITS=     SECONDS,       ARBITRARY UNITS, ARBITRARY UNITS
##FACTOR=    0.0002768,     1,               1
##FIRST=     0,             0,               0
##LAST=      2.2672688,     0,               0
##MIN=       0,             -65578,          0
##MAX=       2.2672688,     123917,          0
$$ Real data points
##PAGE= N=1
##DATA TABLE= (X++(R..R)), XYDATA
$$ [...]
643d36L245P24l711l534J180L416K260m68l942k831K509L784P56j545l345k046
659c984L390M067r86k804j858p65L054L824j841l943n74J012K236K599j907m167
675b647N0K563J752P30k148l176R11K965R69n41k054k090J557K947P3j518j638
692a295q23J983K300j005j918n48K13J660J406j580j823M96Q79Q66O36j619j638
709a810J396J501m60m38n74q21J110J546r61j422K94N57M94O24r75j428P52J497
727H82L1o89r21n18J268J405o65j402n95M10J662Q92j604j628K12J162J589K27
745A718k401j511J401J707P80n02k569j150K475K009m00j319k079n59L061K193
761B854j681k260j024N29K874J744k375k829p3J805K440O22k775k656Q09K714
$$ plain form
643 -436 2809 3533 -178 -3712 -2532 884 3144 2676 -1266 -4097 -1588 2196 2952 1407 -1938 -3984
659 -3984 -594 3473 2487 -317 -2175 -2940 114 3938 2097 -1846 -2420 -1408 828 3427 1520 -2647
675 -2647 -2597 -34 1718 2448 300 -2876 -1965 1000 1969 1428 -626 -2716 -1159 1788 1861 343 -1295
692 -1295 -2118 -135 2165 1160 -758 -1306 -1093 567 1973 393 -1430 -934 -55 811 1447 -172 -1810
709 -1810 -414 1087 627 189 -385 -1206 -96 1450 489 -933 -639 -82 412 1036 61 -1367 -615 882
727 882 913 224 -697 -1215 53 1458 793 -609 -1204 -794 868 1760 156 -1472 -1260 -98 1491 1718
745 1718 -683 -2194 -793 914 1694 1192 -1377 -2527 -52 1957 1557 238 -1841 -2400 661 2854
761 2854 1173 -1087 -2111 -1582 1292 3036 661 -2168 -2241 -436 2004 2626 -149 -2805 -1996 718
777G18J874p18l015j770J669K804J057j602k958q27K545K509k11k112k141M1K740
794F03J996j249k358j027Q44K304J300j783k353O3J580J374L23j575j830N91J829
811F32O68n84j210r34Q87J577o2j091o09L5P81Q04m67r55p1N41N72M9q52m97P32
832e4O91j83n49o31J09J186M90r91q79J2O65J195J27j683j006R58J283N40n75
851G05j737p06J601J617j73j341j495o2K099J527j059j904q37Q28K134R18j706
868D09k014j49J572K011R5k383j705R18J993J289p74k478j071J750K072L52j431
885D56k233l12K391J875p94j987j351O12K346J221j496k139m68J416K005L49j949
902e8j847M55J933J306o04j955j124J106J948N56j286j729l20J607J577l33j580
$$ plain form
777 718 2592 1874 -1141 -2911 -1242 1562 2619 1017 -1941 -2768 -223 2286 2075 -37 -2178 -2137 603
794 603 2599 1350 -1008 -2035 -1191 1113 2413 630 -1723 -1660 -80 1294 1617 42 -1788 -1197 632
811 632 1300 716 -494 -1428 -541 1036 974 -117 -726 -691 90 894 427 -528 -599 -58 514 563 -289 -786 -54
832 -54 637 454 -95 -726 -617 569 1059 68 -811 -799 -134 1061 1188 -495 -1501 -543 740 1280 705
851 705 -1032 -1738 -137 1480 1307 -34 -1529 -1591 508 2035 976 -928 -1765 -937 1197 2115 409
868 409 -1605 -1754 -182 1829 1924 -459 -2164 -1246 747 2036 1262 -1216 -2287 -537 1535 1887 456
885 456 -1777 -2089 302 2177 1383 -604 -1955 -1343 1003 2224 728 -1411 -1879 -463 1542 1891 -58
902 -58 -1905 -1450 483 1789 1185 -770 -1894 -788 1160 1716 430 -1299 -1619 -12 1565 1232 -348
919c48j047L29J604J116r87j670k37R44J165M19j224j344M80J183M94j66j039
936c28q86Q77J235k18p20n84j20R91O88q18p02K20K53N23K84r19o16O65P14J23
956F62n37r94J64J312L20p80o41l97N33J359R5j352q67K33J131J291n33k085o23
975a709J468J441J99j120j682k17J728J619k43j855j718O15K537J215j512k135
991a369o54J361K241N81j969k098L4J910K076j48k622j798J193K340J086j063
1007A101k407r56J707K063M25j387k299m65K459J936q54j859j222L61K171J310
1023B084j363j846m16Q88J761O79j661j670L68J341J077j31j579r52Q98J174L39
1040I91m64j240m38J212R05m59o75m57Q6R31M11p95n35K03L10N10l2r38j56Q43
$$ plain form
919 -348 -1395 -1066 538 1654 667 -1003 -1240 -296 869 1288 64 -1280 -800 383 877 711 -328
936 -328 -1214 -337 898 680 -40 -624 -744 247 935 117 -585 -365 -112 411 695 -224 -840 -175 539 662
956 662 125 -869 -705 607 927 147 -494 -891 -358 1001 1096 -256 -1123 -890 241 1532 999 -1086 -1709
975 -1709 -241 1200 1399 279 -1403 -1620 108 1727 1484 -371 -2089 -1474 1063 2278 766 -1369
991 -1369 -2023 -662 1579 2160 191 -1907 -1873 37 2113 1965 -657 -2455 -1262 1078 2164 1101
1007 1101 -1306 -2262 -555 1508 1933 546 -1753 -2218 241 2177 1323 -536 -1758 -1397 774 2084
1023 2084 721 -1125 -1541 -653 1108 1787 126 -1544 -1176 165 1242 1111 -468 -1420 -522 652 991
1040 991 527 -713 -1151 61 966 507 -168 -625 -539 392 803 8 -527 -324 -14 496 464 -474 -630 213
1060B13K16k83j71m76O0R73J48q36l77Q3M45Q78k29j364k42R61O75J19o68j141
1080a016J38J283O37l52j032j036O54J808L30j295j186k21J210J587k75j725r30
1097a421L94J436J439p91k355n80J562J619L90j425k077J40K144J288n10j648
1113c95j596N97K552J045j543k009o33J451K310K16k162j668K78J744J846l66
1129A667k516j342J202K022J012j121k406n66J869J686R4j362j909m2K115J358
1145A761o59j509j273M50K168Q32j377j302l33O50J590M80j482j119K72Q10R74
1162I33J07j331p95O62P51L54j79q72l72O55M40m2j05m45j98N49J53l69Q4J57
1182A37j49L4j20k79M39N41l99n45j44J15O80O43p03j088nP52Q90L15j125j351
$$ plain form
1060 213 429 146 -25 -501 -441 532 680 -156 -533 -450 -5 873 644 -720 -962 -1 674 793 125 -1016
1080 -1016 -878 405 1042 690 -342 -1378 -724 1084 1414 119 -1067 -1288 -78 1509 1234 -491 -1421
1097 -1421 -1027 409 1848 1057 -1298 -1878 -316 1303 1693 268 -1809 -1669 475 1763 1253 -395
1113 -395 -1991 -1394 1158 2203 660 -1349 -1982 -531 1779 1995 -167 -1835 -1557 187 2033 1667
1129 1667 -849 -2191 -989 1033 2045 924 -1482 -2048 -179 1507 1601 239 -1670 -1712 403 1761
1145 1761 1102 -407 -1680 -1230 938 1770 393 -909 -1242 -592 998 1478 -4 -1123 -851 -41 933
1162 933 1040 -291 -1086 -424 327 681 502 -370 -742 -87 353 311 206 -239 -437 112 265 -104 -20 137
1182 137 -12 22 -98 -377 62 603 204 -341 -485 -370 310 953 250 -838 -843 -91 799 1114 -11 -1362
1202a362M35J427P27l24j347j207Q26J911N03j119j558o27J397J953p3j746j367
1219a551P4J738J722o73k168j021Q58J967J173j365k315k95J611J655M14j626
1235A98k139K39K169J389m88j906j549R07K357P41j273j735p69J273K137K42j807
1252a4j536Q1J607J648m65k021r58Q34J505R06q05j847n09J286J385K38j177j474
1270a316J18J528Q67m12j063r05L89J413N02p79r11l52N77J108J04r75n17J79
1288d45M25N52J1p29l38L61L10J49q4l79n7K95oj56J41P3q9l9j58j11L56L32j99
1311B15l95k98J17P00M24n99p73o5N31Q00K41r20r63K14R73Q08j02j294j024P57
1331f53J430M94o65j415p53J180J665J26j257j437k61J623J680m73j777j133M17
$$ plain form
1202 -1362 -927 500 1227 903 -444 -1651 -825 1086 1589 470 -1088 -1715 -318 1635 1562 -184 -1551
1219 -1551 -1477 261 1983 1310 -858 -1879 -1021 946 2119 754 -1561 -1856 -245 1410 1824 198
1235 198 -1941 -1702 467 1856 1368 -538 -2087 -1180 1177 1918 645 -1090 -1859 -586 1551 1793 -14
1252 -14 -1550 -1469 138 1786 1321 -700 -1658 -824 681 1587 782 -1065 -1574 -288 1097 1335 158 -1316
1270 -1316 -1198 330 1197 785 -278 -1183 -794 619 1121 342 -569 -921 -344 764 868 -107 -624 -445
1288 -445 -20 532 543 -186 -524 -163 147 296 212 -167 -224 71 65 -91 50 123 34 -5 -163 -274 82 414 215
1311 215 -180 -478 -361 339 763 164 -609 -674 -143 657 898 -22 -985 -771 202 1010 908 -386 -1410 -653
1331 -653 777 1271 606 -809 -1562 -382 1283 1409 152 -1285 -1546 77 1757 1284 -493 -1626 -1209
1348a209J811J329r69k028p34J069J902P70j512k005j18J610J636R1j788j698
1364a843M78J897J219n60j911j183J046J949N79j107j653n56J274J735J29j472
1380B1j378R2J457J258l94j545q56N93J279P08o01j362m96R09J090J67p80r68
1398h06l7R19O71k09o06n52P7P62M16l88m78j80J83N00J00l85j17P2p3J72J58
1419A99j91m9Q9j57k2K00OO5L4m23j55M84K89j17k82l96l9O59M10l02n57l89K19
1442d25Q61L94o26q09j75O13R25J21r56q33J72R14Q38k10j224p69O48J203M80
1461A142o62j278m70J061J283M0j107j145J7J376J107m76j385q06N00J454Q40
1478A491r43j555l47J043J374K96j281j382J55J367J027j99j359j117N57J515
$$ plain form
1348 -1209 602 1931 962 -1066 -1800 -731 1171 1941 429 -1576 -1694 -84 1552 1643 -145 -1843
1364 -1843 -1365 532 1751 1191 -720 -1903 -857 1092 1671 564 -1089 -1645 -371 1364 1493 21
1380 21 -1357 -1265 192 1450 1056 -489 -1345 -752 527 1235 634 -728 -1224 -315 775 942 162 -806
1398 -806 -843 76 747 538 -68 -620 -543 219 635 247 -231 -411 -228 272 372 -13 -130 -58 -131 41 199
1419 199 8 -41 48 -109 -131 69 75 140 174 -249 -404 80 369 252 -30 -426 -465 194 604 302 -255 -644 -425
1442 -425 436 830 204 -605 -780 -167 758 879 -77 -910 -738 176 1014 804 -420 -1189 -541 662 1142
1461 1142 480 -798 -1268 -207 1076 1116 9 -1136 -1119 257 1364 888 -497 -1303 -803 651 1491
1478 1491 548 -1007 -1354 -311 1063 1359 78 -1304 -1149 218 1245 1046 -313 -1430 -873 642
1494F42P46p23j427o29J005J386J75r86j091k22J042J210j32j197q61K27J145
1511C10Q36n32j178l68N39Q67M19n30j001j88O96O97J37o29p62J13P53L40j82
1530C37l69m18P1N37K47k00k89j96P8L57P4k02mk6j73J02J51L2P9j21l52N0L06
1553G1J39P6j76n16n6N71L75j05m70n37J51Q06L43l88o02l95L41R06K91o87p57
1574f19j34O36Q94M4r55p43K50Q57O83k54j057n92N52J002M35o11j100l12Q97
1593a27R94K9q94r29L7J089Q45l78j040o28L90J118O02p36j102k29P27R90K32
1612I90r71r72K05R25O92j31j032p37N48J007L47m87r23l81P50R31k2p15o85l6
1632f97P98P15k99p79m20K31P47M48m87p09j20M10N49J84n22n72J28M67K80km30
$$ plain form
1494 642 1388 665 -762 -1391 -386 1000 1175 189 -902 -1124 -82 1128 996 -201 -1062 -835 310
1511 310 1146 614 -564 -932 -393 474 893 363 -638 -826 -130 567 704 75 -687 -574 179 519 337
1530 337 -32 -450 -379 158 405 205 -84 -280 -202 155 229 27 23 -3 -176 -74 77 109 188 67 -285 -235 71
1553 71 210 286 110 -406 -462 109 484 379 -91 -628 -477 329 672 284 -318 -713 -372 534 825 138 -619
1574 -619 -753 -117 777 821 -134 -877 -627 230 913 659 -398 -990 -438 564 999 388 -712 -1024 -127
1593 -127 867 896 2 -927 -890 199 1044 666 -374 -1002 -612 506 1108 372 -730 -959 -232 758 990
1612 990 19 -953 -748 177 869 738 -294 -1031 -483 524 871 384 -539 -920 -170 761 739 24 -661 -697
1632 -697 101 816 517 -262 -682 -451 296 744 257 -452 -572 -162 387 571 49 -523 -395 72 352 350 -80
1653h0l66K28M04Q2j32k46j70K08K71p2j35l7m3N7J18p3m5J02k3j11nK1P2J80
1677B05p4l22p4K35K20R7k52m02RM35L20p3m06m54J60O63K84l16n63l47L86P90
1699E21J68o27o07r5N73P77nq55o35K42P84N96l03r44m71N38Q70L14n34r54k43
1720h90Q06Q33op55p92N1R47O80l50q42n20L19R56M55o04q52k00N57Q22J63p73
1741Ep08J35O52N92r0q12n15M05O76K59l04o57k78N27N74pm13m61l8N37M07k27
1763B59m38j92J41M34J66l22k99J1K05K38L7l11j91J68K07L9j03j75k7K10Q4j18
1785B3r1lP5J20j3k00n2J63J34k9j70j72R2K91Q0k29k24l2K22L05j7m01k45J80
1809a93L63K23k09n16j28M28L95K3l79m93O2N92L64k21n20l58K81O90J79m81n26
$$ plain form
1653 -80 -446 -218 186 268 136 -110 -280 -72 199 127 -8 -45 -88 -31 87 14 -31 71 48 -63 -68 -47 25 205
1677 205 131 -191 -265 -30 190 287 35 -367 -358 77 397 324 -82 -536 -376 287 571 255 -308 -655 -269 521
1699 521 689 62 -545 -640 -67 710 705 -150 -785 -543 241 837 534 -410 -881 -343 527 841 307 -647 -890
1720 -890 -84 749 743 -12 -804 -753 194 874 524 -318 -838 -519 437 892 288 -564 -764 -207 615 778 5
1741 5 -703 -568 84 676 586 -226 -741 -336 340 599 295 -362 -640 -113 461 454 41 -420 -458 79 486 259
1763 259 -179 -371 -230 204 370 48 -251 -240 -35 203 240 -71 -262 -94 113 152 49 -126 -153 57 141 23
1785 23 -68 -71 4 124 111 -89 -141 22 156 127 -43 -215 -123 168 248 19 -205 -237 -15 290 273 -128 -373 -193
1809 -193 170 393 184 -332 -460 -32 363 386 7 -486 -424 168 532 311 -209 -567 -286 404 583 102 -424
1830d24j20M68O48%o84m74J54N91N09k39p87l19M17O55K62m39p62j09O29N83Q
1851E67o14o21J31P40M51k66o66l72L27P14K42m61o18j20M81N95J2n60m84J13
1871d09N40L87j74n38l07L05M71J50k82m19j11L47L74n0l16k55L9L37J95j81k48
1892a45l7J15J65N5j77j25Q2J05J6k9j17J4J82Kj55q0O7J37J07j15k55jK17J82
1916B10J5k54k95J22L87J55j91l58j71K77M37L1l77l48pL99M29j25n25k97K07
1937b79N16K87l20n84j23M22M82P6m52n21M8N62M29j67n70l77K74O40K22l92n54
1958c81j34M30N57L7n47m37Q3N02M22j89o01k67L22N14J70l61n18o0M63M12n4
1979C63m36l72J34M99K64k59m39j65K77M46P3l74l27K6L27L13o6m04k09J90L23
$$ plain form
1830 -424 -544 -76 572 572 -112 -586 -432 159 668 429 -358 -677 -260 395 657 218 -544 -653 -24 559 567
1851 567 -47 -668 -537 203 654 388 -278 -650 -323 391 633 172 -446 -566 -85 510 522 -38 -522 -409
1871 -409 131 518 344 -194 -501 -196 275 425 143 -276 -387 -40 334 284 -32 -287 -248 89 284 103 -145
1892 -145 -182 -67 98 153 -24 -149 -67 38 54 25 -92 -78 104 106 -49 -129 -62 75 182 67 -188 -189 28 210
1916 210 225 -29 -324 -202 185 340 149 -209 -380 -103 334 365 -12 -360 -367 32 461 336 -189 -486 -279
1937 -279 237 524 204 -380 -503 -81 401 477 25 -496 -448 114 543 376 -194 -571 -297 343 565 173 -381
1958 -381 -515 -85 472 509 -38 -475 -392 110 532 343 -258 -525 -203 311 481 120 -398 -458 5 417 363
1979 363 -73 -445 -311 188 452 193 -246 -411 -134 312 385 11 -316 -290 37 350 284 -120 -329 -139 184
2000A84J16j87l26m2K65K22m2k24j65N1K54Q4j51j60k8J16J73k7k10n0J31J20
2022A04qj28j25R3J74J3j25j19j7J79J80j17k41o2J47K47O8k75k71R7K87J94r2
2045B03l32k35K20M18R7k79m00q2L92M33r8m51l16J13M72L33k44n37k01L07N25
2066C38J79m15n52j4M93M48m3n25m32J77N82L04k58n41k72L49N87J00m29m74n4
2087d52M53M67o2n15l42J35M64L30k25n22j68L08M07J17l27m17PL87K72o8l26
2108g7k60J38L62J21j97k51q5K16K51j9k43j30Q4J67J16j09k04kJ60R6l8j42r9
2131a45J25J53l2j43p0K9J53J01j51j69QJ70J29k8k20j36J62K24L5j67k26l3K79
2154D8K19r1k86j57J09L42J39k44l34k5K74L03J0l70k98J41L83K21j88m19j85
$$ plain form
2000 184 300 113 -213 -255 10 232 190 -34 -199 -148 106 190 39 -121 -149 -33 140 113 -97 -147 -16 104
2022 104 96 -32 -157 -64 110 123 -2 -121 -138 41 221 104 -137 -199 -52 195 263 -12 -283 -186 101 295 203
2045 203 -129 -364 -144 274 371 92 -308 -390 2 435 337 -114 -430 -317 155 488 244 -293 -494 -187 338
2066 338 517 102 -450 -464 29 477 434 -91 -523 -346 236 540 282 -259 -531 -182 405 505 76 -398 -452
2087 -452 1 468 406 -109 -451 -316 148 478 253 -269 -437 -129 278 395 68 -349 -342 45 317 249 -77
2108 -77 -337 -199 163 284 87 -164 -249 -33 218 199 -44 -174 -90 77 193 84 -120 -122 38 134 96 -46 -145
2131 -145 -20 133 101 -42 -112 -83 70 171 20 -149 -141 29 158 130 -90 -226 -64 160 195 28 -198 -231 48
2154 48 267 176 -110 -267 -158 184 323 79 -255 -280 -6 297 307 -63 -361 -220 163 384 196 -223 -408
2175d08L03M22M7l26l96j3M30L65j39m39k82J81M90K21l13m84p0L48M25N3m32
2196a7m15Q7M66L30j57m80k76K66N01J33l08m37j10L76M54m8m02l36N1M35L07
2217D20j95m26j66K10L78J54l01l59qK91K57Pl08k64J25L03J21j05k54j23J96
2238d7K27j9j56j38JJ68J23q3j36kN0R9Jj05p8J09P5l3q8o9N5J53Nj54r7M3J55
2265E9J22p9k42p6J62K33N7k11k84J7L19K37j22l07k00J30L94J54k49l66q6K82
2287e6L96K9m06l26R4L68L01j12m57k54K50M20J76k66m67j25L91M05%l79l69L9
2309c48M58L14j84m10k40J95M66J67l12l99o0L24L62J2l93k88R9L56K29j36l83
2330a71j62K41L18N9k22k87k8K81K27o3k51j80Q3K66J34j73k30l4J61J91J6k10
$$ plain form
2175 -408 -105 317 364 38 -358 -371 59 424 285 -154 -436 -255 235 456 143 -341 -411 -63 362 415 -17
2196 -17 -432 -345 121 451 294 -186 -462 -196 305 438 130 -307 -417 -41 413 365 -37 -373 -322 113 420
2217 420 225 -201 -367 -157 221 375 74 -285 -293 -2 255 262 -46 -310 -185 118 239 134 -120 -243 -47
2238 -47 180 161 5 -133 -132 36 159 76 -60 -62 -12 87 88 -17 -95 14 89 56 -32 -101 -46 107 112 -42 -139 -96 59
2265 59 181 102 -140 -216 -54 179 236 25 -259 -242 77 314 192 -115 -315 -185 209 363 114 -252 -338 -56
2287 -56 340 369 -37 -363 -269 99 400 288 -169 -423 -173 247 423 157 -310 -435 -44 361 361 -18 -387 -348
2309 -348 110 424 240 -170 -410 -215 251 418 106 -293 -353 -29 333 345 -48 -336 -237 119 348 212 -171
2330 -171 -333 -92 226 285 63 -224 -252 29 256 193 -58 -238 -155 111 245 72 -158 -192 -31 160 176 -34
2352c4j46O8J72P6n5j67n1J26J09oj10p5K9J54K7j09q2L3P9O4n3j37%J18Q1k8
2378H3j24p8P6J64K9j46j51J0J75J59o9k36j07J24K25R7j71k72l9K59K40l6k79
2401f7k29Q8L48J78j74l05j70K23L77Q8l11l30k5L30L47n9m12k59J32L84K39j92
2423B01m27j84K93L87J03l07m05m1M00L30p4l52k93J09L99K35j84l78j76K19M02
2444B57P6k84l04l1K69K84qk91k23P3K56J96r7k84j20J44K14O6j35j87l8J54J43
2467A30oj32r8RJ13P4o1p6j2M1L3J6m7%M5j0l4j3J5N5L1n1r4jR2Q9Lj39j05N3
2497h0J88N9q7j84q2J46K06Rj64j93j4K16K23o7k65j55P8K84J63j73l04q1J94
2520h3K81P9k40l17K3K96K49n6l12k36J25L60J67j86l28j37K35L47M9k76k99k3
$$ plain form
2352 -34 -180 -112 60 136 81 -86 -137 -11 98 92 -18 -93 -64 90 117 8 -74 -41 38 102 49 -88 -88 30 111 83
2378 83 -41 -119 -43 121 150 4 -147 -137 38 197 128 -108 -215 -91 134 231 60 -212 -251 8 248 212 -67
2401 -67 -296 -208 140 318 144 -161 -331 -108 269 357 46 -284 -309 21 368 309 -103 -362 -230 154 393 201
2423 201 -226 -410 -117 270 373 66 -339 -380 20 350 276 -76 -369 -260 139 374 190 -188 -364 -145 257
2444 257 333 49 -255 -286 -17 267 259 -32 -255 -182 74 270 173 -111 -231 -87 127 193 58 -129 -167 -13 130
2467 130 124 -8 -106 -97 16 90 29 -47 -59 -18 15 31 -16 -16 29 19 -15 -28 -13 42 73 22 -72 -73 19 108 111 -28 -133 -80
2497 -80 108 167 80 -104 -186 -40 166 175 11 -182 -196 20 243 176 -89 -244 -166 118 281 108 -196 -277 -83
2520 -83 198 277 37 -280 -257 39 288 232 -80 -316 -191 169 336 150 -178 -315 -80 267 316 40 -259 -282
2542b82L14K85p4l32k20J17L31J79j82l35j18K15L22P1k49l02kK76K38m6k68k23
2564b85R5K94J50j28k61j07J42K75O6j98k13j7J82J97j8j88j49N6J60J14n2j68
2586e3p5P5J14N0o4j07m3P5O9J0j9n7k1K7K8LPj2l3j8K4K9N1jq7n1M5O9Q2m0j26
2617d9p9R7J23O6q8j71p1J55J77K3j51k08j3K18K01o2k28j87P7K63J68j35k79
2640a53j23J61K95R7k21k87l3K37K84Pk86k73P8K97K31r3l23k00J51L32J39j91
2662A26l02j19K40L12L1k63k67nK79K46m6k96k02R2K80J78j46k79j11J73K30Q9
2684B40j88k40j3J85K01rj92j77M2K13J16p6j68q8Q5J77M8r6j24n8J06J25%j03
2708Fp9QO8Q5j7r0m2K4K8N3Rn2l4JK6J6K1j7k6k1nL6N6j1m7n7PN6P7qr1n9K2J04
$$ plain form
2542 -282 32 317 243 -89 -309 -192 139 318 136 -199 -317 -102 220 291 42 -260 -262 14 252 206 -62 -285
2564 -285 -190 104 254 126 -135 -242 -100 175 241 43 -170 -187 -5 192 174 -14 -163 -107 53 167 115 -53
2586 -53 -128 -53 61 111 47 -60 -103 -28 41 51 32 -25 -46 -19 9 12 19 7 -26 -44 -20 9 60 59 -28 -79 -34 35 117 77 -49
2617 -49 -128 -31 92 158 70 -101 -172 -17 160 183 32 -176 -189 29 230 168 -60 -247 -170 93 261 126 -153
2640 -153 -276 -115 180 277 56 -231 -264 -27 257 264 -22 -295 -217 80 311 218 -105 -305 -154 178 317 126
2662 126 -176 -295 -55 257 288 25 -242 -247 32 278 232 -64 -266 -174 106 284 138 -141 -252 -79 151 240
2684 240 52 -188 -201 -16 185 176 -16 -193 -151 62 178 102 -66 -154 -69 108 156 60 -64 -122 -16 109 109 6
2708 6 -73 -65 3 88 71 -19 -61 -37 -9 44 53 1 -33 -32 -6 10 31 14 -12 -33 -38 -2 54 43 -4 -61 -54 2 79 71 -20 -79 -57 47
2742D7Q1l8j29q2P7J43N8r4j65n6J43J59J7j53j71OJ85J68n7k05j42O7K35J25
2766B19j37k16q9J42K55N5j88k41j3K09K32rk58k11P5K62J85j05k78j31J37K73
2788A68Q4j63k59o4K14K36Ok28k02NK47J85o3k40j47Q4K26J31j32k25q1J40K04
2811A26O2j62j79rJ57J62j2j50j41L9J60Q3m7j35o6N2J41L5n8r9l5M3R4J8o6m7
2837c4j3L5M4Jj7k8k0JK4L4qpl1l8K8N3K4k7o6k6L4J03K0o2q6k9Q6J09Mj07j13
2868a12J4J15J32l3j61r2N4J53R6q8j76o1J00J88L5j43j71k4J77J65k2j83j62
2891a99O7J95J28r5k02r5J11K10P9j64j97j7J57J99Nk02j67N3J97J37o2k18j30
2914b10J33K04N9j24j91m5J60J73qj56j72L1J82J31o3j62j08P2J76O8j11j53k7
$$ plain form
2742 47 128 90 -39 -121 -44 99 157 63 -102 -158 -15 144 161 8 -163 -157 28 196 139 -66 -208 -141 94 219
2766 219 82 -134 -223 -81 174 229 41 -200 -213 -4 228 219 -39 -250 -175 87 272 167 -111 -242 -105 168
2788 168 252 89 -170 -234 -20 216 222 -6 -208 -203 44 229 166 -74 -221 -137 89 220 88 -137 -218 -78 126
2811 126 188 26 -153 -162 -5 157 145 -5 -146 -107 53 136 89 -46 -112 -60 81 116 58 -41 -76 -33 61 79 13 -34
2837 -34 -47 -12 32 33 16 -12 -32 -31 -7 27 19 12 -19 -57 -29 24 48 21 -45 -71 -37 66 86 24 -62 -91 -5 104 108 1 -112
2868 -112 -98 17 149 116 -45 -137 -83 70 166 78 -98 -159 -59 129 164 21 -150 -174 3 168 146 -37 -199
2891 -199 -132 63 191 96 -106 -201 -90 120 199 35 -162 -179 -22 177 182 -20 -187 -134 63 200 138 -80 -210
2914 -210 -77 127 186 62 -129 -174 -14 159 151 -5 -177 -146 36 167 104 -58 -166 -94 82 150 39 -114 -141
2937a41J02J45Rj06j12MJ18Q0j1r7p6L9Q6L9k9p7k6L6M9K3l5m5qJ7L6Nk1oj8K
2967a8OQJ5%j5m2JM2M8Lo6o1L2P3M8k8q3o5N4J20N9r3j05n8J13J36J0j26j20%
2997a12J32J42l9j71j00N2J56J09r4j89n3J05J71N3j37j84j9J71J70j6j81j50
3019a84M5K08J18q8j87r8J04J98P8j52j67l5J60J54Mj57j47L7J63J12n9j64r5
3042a52J04J39M6r1j44k6J12J09j5r8r6K9R9Q3m4j08l3N3P4L8o0o3j4N3N1J0n6
3069@l2K0M3J3k1l1oJ5K1mk4KJ2Qrj9pM2mj8k8j4L3N1j9n1l5J9N9M7m3p4k5O2
3103a7Q9J5r0q4MJ09P9k9j11p3M9J36N1p7j28m4J00J39J1j24j26OJ41J18l9j55
3129e0j08P3J57Q4r8j63m0J07J59J9j45j45KJ65J22l9j48j09O5J57Q7q7j49n1
$$ plain form
2937 -141 -39 106 115 9 -103 -99 19 99 88 -9 -85 -46 40 79 50 -27 -53 -17 32 55 20 -25 -33 -16 20 25 4 -2 -20 -18
2967 -18 -12 -4 11 11 -4 -46 -45 -3 45 48 -18 -79 -47 26 74 46 -37 -102 -48 72 131 38 -67 -125 -12 124 134 8 -112 -112
2997 -112 20 162 123 -48 -148 -96 60 169 75 -114 -167 -62 109 162 25 -159 -178 -7 163 147 -34 -184
3019 -184 -139 69 187 99 -88 -186 -82 116 194 42 -125 -160 0 154 158 1 -146 -109 54 166 107 -57 -152
3042 -152 -48 91 137 46 -98 -124 -12 97 82 -16 -112 -83 16 99 55 -53 -86 -33 41 79 19 -44 -58 -5 46 56 0
3069 0 -32 -12 31 44 23 -8 -14 1 22 18 -6 -4 8 16 7 -12 -19 23 19 1 -27 -41 -8 43 24 -27 -62 -43 16 63 20 -54 -79 -17
3103 -17 72 87 -3 -87 -83 26 105 76 -35 -108 -59 77 128 51 -77 -121 -21 118 129 5 -121 -115 26 144 105 -50
3129 -50 -158 -85 72 156 58 -105 -145 -38 121 140 -5 -150 -148 17 139 100 -48 -157 -92 65 152 65 -84 -135
3153a35R0J53M1j40j24J0J18J25l2j29q7M8J12N7n0j25l0O7R5K5q3o8kP0N5j0
3179E1o3m9J6O2K5l3m7kL3L4lj4j6PlK0j1pPK1j8k5J3J1L0rm0l2K4O1J0l6n6k4
3213f3N9O6jp4o4J6Q2P5m8r7n2M6J14L5p2j20j1J02J03oj02j01M0J16P7m3j38
3240f1n3O7J34N0r0j41k1J25J20j5j15j30L9J33R2n7j62m9Q5J37L5r6j42j4J21
3265hJ01%j27r3M2J22P6m9j34n1Q2J19M1j05r5nQ7J03j2j01p3L7Q5N2n2r2k9O2
3293a7Q2nm9o7kN9M5j3n9k3J1N4J6k2l2qK4K3ml1J8ROj2j6J5J7J3k2k6JL2M3k5
3327C5m6j7J4N4J7k3p3k5N0Q5j8o0p4J1Q6N5k7r7n6M0J15N8p0j14k8Q3J15J5j10
3356er4J0J21Q8l0j36p2N8J23O4o4j38m2J03J09K9j16j14JJ21J14m6j29p6N2J23
$$ plain form
3153 -135 -45 108 149 9 -115 -105 13 138 106 -23 -110 -62 50 107 57 -68 -98 -31 64 89 6 -62 -64 6 61 51
3179 51 -12 -61 -45 17 42 9 -38 -40 -7 27 24 10 -6 1 -2 18 7 0 7 28 10 -15 -2 9 39 30 -10 -42 -18 43 53 17 -39 -63
3213 -63 -4 62 61 -13 -77 -61 21 96 48 -49 -101 -55 59 94 22 -98 -109 -7 96 90 -12 -113 -73 43 120 77 -61
3240 -61 -114 -47 87 137 47 -94 -115 10 130 115 0 -130 -91 42 134 77 -85 -134 -49 88 123 27 -115 -129 -8
3265 -8 93 93 -34 -127 -85 37 113 64 -70 -121 -39 80 121 16 -79 -84 3 106 94 -7 -80 -43 42 94 42 -50 -79 -17
3293 -17 65 60 11 -56 -58 1 46 33 -26 -49 -38 16 32 10 -22 -30 -6 17 13 -18 0 9 15 3 -13 2 19 32 10 -16 -15 17 60 35
3327 35 -11 -28 -14 40 57 34 -39 -64 -14 71 53 -7 -81 -70 16 71 44 -53 -109 -69 46 104 34 -80 -108 -25 90 105 -5
3356 -5 -99 -89 32 120 90 -46 -118 -60 63 127 63 -75 -117 -14 95 124 8 -106 -105 16 130 84 -45 -121 -69 54
3382E4N6p4j27k3P6J23lq4r4JJ10O6kj06o6N1R4K8l8q8k5N6O9Rm8p0OO6M6k2o1
3413b0l0L0M9Lk5m2lM3LNk9j4J3K3Jk4rJ6J0J2k3j3J2L0Lk1l5QM6Pj6k0k9M3L9
3448D3Pm8l6NM8M4k6o0l8M0N9K6m6p5j4O5P1k0o2o8K6Q4N6m2q8m2M2J05K6p5p7
3479g0oP7Q3j0q5q3L7J01O4n0r9n2P2J04J8p0r3k5R7O5mq7o4J1Q9O5l6r5m1M9
3509c8P3M2n5r1oN9O2J1o8n6PO8N4rp8k4L6M7K6l8m3k0L5M0%k5l2LL2J6j1k1q
3542a2J9mKj1jJPqoQNJ3j8j7QQJ9Nl1j9J1L6L2l6l2j6L0M6J1l8l1j1L1N8Jo0n2
3579e2J3O0M2k7n8l6M1N0J6l7o8lO3M0nn5n1J6O5M3j9o6m7M3P1K2m0p0lM9N6P
3611F0o4l8QN9L7j6o5k8K6N0L2k9o6j7M6M1%m2l4ML7L1j3k9l3J1M7K1k2l5j1J5
$$ plain form
3382 54 110 36 -91 -114 -38 85 82 -2 -96 -95 15 81 79 -27 -93 -42 52 80 42 -46 -71 -15 54 63 15 -55 -49 17 63 41 -20
3413 -20 -50 -20 29 32 7 -35 -38 5 8 13 -16 -30 -17 6 7 -17 -26 -10 0 12 -11 -24 -12 18 21 0 -35 -27 19 26 10 -10 -39 4 43
3448 43 50 2 -34 -29 19 63 37 -23 -61 -21 38 64 18 -57 -71 -6 65 45 -17 -85 -59 25 81 39 -49 -91 -49 56 82 7 -70
3479 -70 -76 1 84 74 -11 -94 -57 44 108 58 -41 -93 -21 83 101 31 -62 -87 10 75 71 -16 -80 -69 20 85 49 -46 -87 -38
3509 -38 35 77 22 -69 -75 -16 46 57 -11 -67 -60 8 62 53 -25 -49 -13 34 60 22 -21 -41 -6 34 34 9 -23 -20 12 28 17 -4 -12
3542 -12 7 3 5 -6 -7 -6 1 -7 -13 -5 0 13 -5 -22 -14 -6 13 18 -13 -32 -21 15 47 11 -21 -37 -7 39 50 12 -19 -30 1 59 60 0 -52
3579 -52 -39 21 63 36 -22 -58 -17 33 49 12 -56 -59 4 44 39 -16 -67 -51 14 57 38 -28 -75 -32 39 61 21 -49 -52 -3 53 60
3611 60 -4 -42 -34 25 62 46 -19 -47 -21 29 61 32 -34 -51 -5 36 36 -6 -40 -36 1 32 19 -10 -43 -32 15 36 14 -21 -32 -17
3643a7L6Rl1k8J4K4K7pk7j3J3K1Kjk6oKJ6PloMOpMJ1j5mkrLKMj3j0KK0LMlj6j
3685a1K7Lkk2pkK5J3Kj9k5K4J6J0k2j9qK1K2Jk5k6LL1K8j8j9l2RL3J9j7l8j1%
3720c6N4J2l5k4j5M0K4Pk1l4j0M6K6pl4j9ON0K1k1l8j4K0L5J4l1l3k0L1K4J4l8
3752fl0J7K9Rkk6k2RK6J7j3k3lJK1J6j4j8kJ5J8mj3rnJ9J1rj0JPRMnj4oJ1Jj2
3791eQj7J5Mj2nJ6oJ5j7j6jJ0L0j5ok0J2J5K7j3k1j3K0J1%j3j6J1J5J7j5k0k3
3825b8K1L8nql1j2K0K4Ok2l2kK8K2Ll5m3K2L2K5k1l7j2L3M1Ok7l7%L0L5Nm0k9
3859c0J4M7K1k5l6j9L2K1K7l6m4ML7J8ml5k0MK2L1j6k8j1K4PJ8k7k0J5OK7k3k2
3892b1MK3QNj8o%J9J6j4j7KJ8J2j3j4k7K1K1Kj9j9NL0jk1j5j6L0K2Ol4j6jM3K4
$$ plain form
3643 -17 19 28 -3 -31 -17 7 34 27 0 -13 0 21 23 22 -4 -10 -8 8 15 12 6 10 16 9 13 24 9 5 3 -6 -3 -1 3 -10 -20 -18 2 5 9 6 -10 -11
3685 -11 16 19 17 -5 -12 -14 11 24 26 7 -18 6 22 32 10 -9 -17 4 26 27 2 -24 -21 10 38 20 1 -31 -22 11 30 13 -25 -36 -36
3720 -36 18 30 -5 -29 -44 -4 20 27 6 -28 -38 8 34 27 -7 -26 -20 30 51 30 -8 -22 -2 33 47 16 -17 -37 -6 18 32 -6
3752 -6 -36 -19 10 19 17 -9 -31 -22 4 21 8 -15 -18 -17 4 20 6 -12 -14 1 19 15 2 -7 -12 7 18 9 -1 0 7 16 20 15 1 -5 6 7 -5
3791 -5 3 -14 1 5 -7 -12 4 -2 13 -4 -20 -21 -11 19 4 -2 -22 -10 5 32 19 -2 -15 5 16 16 3 -13 -2 13 30 15 -5 -28
3825 -28 -7 31 26 18 -13 -25 -5 19 25 3 -29 -31 -3 19 22 -13 -56 -34 -2 23 2 -35 -47 -14 27 33 6 -31 -31 -1 34 39 -1 -30
3859 -30 -16 31 52 27 -9 -28 4 25 52 16 -28 -24 13 31 27 -8 -28 -24 -2 29 13 -15 -26 -2 5 23 -4 -24 -9 -3 24 1 -21
3892 -21 -17 6 14 19 1 -5 -5 14 30 16 -1 1 19 31 18 4 -23 -2 19 21 2 -17 -12 18 17 -4 -19 -35 -5 17 23 -11 -27 -28 15 39
3928C9j9m5j5L4L2J3m5k6%L6M0km2l7J4N6J2j4n4k5L9N4J1m0n9NO1L2ro6k9J8
3960c1N1L9m1n4k0L3O0Mm6m6MO7L4k5n1l2K3N1L8l9m0k0M5M5nm2l8J8K6L1Jm5
3992ek3J0M0J8j9l7kK7J1pl2OMK0pj3Jj4PK4j0qj7J5K0oj8LOK3Rl0qNK9J8k8k6
4030a4qL8J6j2j6m0J8M2J0j8m8j9L8N6Ln1m5KM3N4j6o0l5K2O5L4l6p3k0N4O5J8
4062F7o3o2RN6O3k5o6m8M1P1M4n5p5k6N9Q1Mp3o9K0N5M9ro6n7L7O8L4l5q1j0L9
4094b3O0J1l6o4OM9M6rn1k9LP0J3k2m1%J7L8qj1l6RK9K1k4k0rkK5nqj1%J0Kj3
4130a3OJ1Jmj7qJ2J9nk3nKL2K0j2k0k9K5L7K0k1n6LK6N1Mm7n0JO5L9k3n9l5K7
4165b6P3K1n3o7j1N7O3lo7n7J2O7N1k4p6l6M0O5M0n6n9j8O6N6Kn7n9J3P3M2k1
$$ plain form
3928 39 20 -25 -40 -6 26 39 -6 -32 -32 4 44 42 0 -37 -23 33 45 31 -23 -48 -9 45 56 16 -43 -38 23 55 46 -20 -49 -31
3960 -31 20 59 18 -36 -56 -23 37 41 -5 -51 -47 20 54 29 -22 -54 -31 20 58 19 -21 -41 4 49 44 2 -36 -18 8 39 40 -5
3992 -5 -28 -18 22 40 21 -16 -18 9 20 13 -19 -13 -9 11 4 -9 -8 -22 -15 9 -1 -9 -26 -11 9 3 -15 -12 -6 17 26 -4 -12 -7 22 40 12 -14
4030 -14 -22 16 32 20 4 -36 -18 24 34 16 -32 -51 -13 43 46 -5 -50 -48 -5 49 33 -27 -62 -40 25 59 23 -50 -70 -16 49 67
4062 67 4 -58 -49 7 70 45 -21 -69 -28 43 87 32 -43 -69 -10 71 75 2 -67 -47 8 57 48 -18 -75 -38 30 64 29 -52 -62 -23
4094 -23 37 48 12 -52 -46 3 49 40 -11 -40 -37 33 46 24 -17 -17 0 38 30 19 -17 -8 21 42 18 -2 -11 -13 12 7 -1 -12 -12 -2 0 -13
4130 -13 -7 4 5 1 -16 -24 -12 7 2 -21 -26 -24 8 28 16 -4 -33 -8 29 49 28 -28 -25 1 52 56 9 -41 -40 25 64 41 -18 -53 -26
4165 -26 47 68 15 -52 -63 -6 57 54 -13 -70 -58 9 60 36 -40 -76 -36 29 69 13 -46 -64 2 58 60 3 -56 -43 30 72 51
4196E1p3l8L3P7K9m3q2k0N2P2Lo7m8JO4M4j6p0k7K6O1K4l0n7j8M5M2pk7l9JM0
4228CK5J3m1k9K1J8K1j2j8k3J6K8Jnj7nRKMj0Mmj4KRJNj1j4JJ8RJ2m3MjK4K4l
4267B4l7j5J5M6Qk0l9j6L7M8kl4n2MN1L6j8n4j9NP2K6m1n3k4M1N6Rn6m3qM8N3
4300D8nn8m8QO9L8k5n7l8M6O3K2m6n7nM7N0Mm7m6NN5M1l2n2j8J7N1J9l1n1nL5
4333cM3Nm4n1J8K7K8Km2k1J2L5J8j5k0k4K0K9Pk1j3%ML0qj0j2J4LPJ0k7pJ2l%
4369CLlJ2j9pJ3Qjj1lj1J5Mkj4kkK0Rooj5KL0J4k1k6nK3K8%ol9NK2K9lk8l4J1
4409a3L5K1k1k2k4RL7Pj9l5nJ6K8J0l0k6%L1K8ol6pRK8K5m0j2j8K8K9kql5PL2
4444B1KPj9k3PJ9K1k6j1j0OK2%rj5j2K0J2jk4%lJ2J0Mj4oONLlMj2J5J3rpJ%RM
$$ plain form
4196 51 -22 -60 -27 50 79 36 -46 -66 -14 58 61 -6 -54 -53 11 55 39 -31 -58 -32 29 53 23 -34 -52 -7 35 28 1 -38 -37 3
4228 3 28 41 0 -29 -8 10 31 19 1 -22 -6 22 23 18 1 -4 5 7 11 1 5 1 -13 -11 -2 -1 4 -7 -21 -20 -2 7 19 -24 -20 -21 3 27 24
4267 24 -13 -28 -13 33 41 21 -18 -34 3 51 49 15 -37 -33 18 54 36 -18 -37 -32 40 66 25 -28 -52 -11 45 54 -2 -45 -53 -5 48
4300 48 43 -15 -63 -55 14 52 27 -30 -68 -22 41 63 17 -40 -45 2 52 56 9 -37 -32 23 64 32 -20 -38 -21 30 49 18 -33 -38 -3
4333 -3 40 45 1 -50 -32 -5 23 25 -17 -38 -26 9 27 12 -8 -32 -12 17 24 3 -10 -10 -6 24 16 6 -6 8 11 18 28 1 -6 6 3 3
4369 3 6 3 15 -4 -11 2 10 9 -2 -5 -16 -1 3 1 -13 -15 -17 3 12 6 0 -15 -13 17 31 10 -16 -21 2 30 30 24 -15 -10 12 41 38 10 -24 -13
4409 -13 22 43 22 0 -24 -15 22 29 10 -25 -30 -14 14 24 -6 -32 -32 -1 27 21 -15 -22 -13 15 40 0 -12 -30 -2 27 25 17 -18 -11 21
4444 21 23 30 11 -12 -5 14 35 9 -2 -12 -6 16 16 7 -8 -20 0 12 11 -13 -13 -16 -4 6 10 -4 -10 -4 1 4 1 5 -7 8 21 12 5 6 6 15 19
4485A9mmkpLONn%nlk%j2J9Nk2J0MLj1nOLJOj5rJ3MJ0plljJ3Olj0lPJ3pKj4PNJ
4533A4Oj2rnJ6J6j9mplPqKkKKJPrl%kJ0MlmNJ4%jLj2qK3j1J0rj1J7%Kj1lPj0J6
4579A8j3MmJ1j1j2%nLJ7k5J4J%%RkLopQjJ1r%oJ4mMj2NjJ3qj2KKOOj3JJ6kKnj5
4625cnQN%%rqJ6LjNj1j4J7QMk4NJ6j0K2onj0MJ1MLj7OoQRj2k0LJ3Ojj8ONNnrj9
4671b1J0J5Molj2J4LJ3mj5OLrJ7j0LOkJ5Lk1QoJ0kqrONj0LnkQloKj0J3rNl%Nj2
4717a1J0J5k3J0O%%Jj2PNJ4j4oKJ2jRnj7lJ8Qj3pj6LK0JLk6LOK4qk5oLK2J3k9
4758goj8J9J0K0j6k1QK2J4rj5rPK1Qmk9NPK6j0j5j5mJ7K0rj4j8J2J8J0rk8oJ5
4795cJ5J4k8oqJ4NOpj6QJ5K0l4%POMJj0kPNJ2oojr%J1qpOkjnkpNNqoQPNqj2kJ4
$$ plain form
4485 19 15 11 9 2 5 11 16 11 11 6 3 1 1 -11 8 13 -9 1 5 8 -3 -8 -2 1 2 8 -7 -16 -3 1 11 4 1 -2 -3 10 16 13 3 0 7 20 13 15 1 8 13 14
4533 14 20 8 -1 -6 10 26 7 3 -4 -7 0 -8 -6 -8 -6 -4 -3 4 -5 -8 -8 -10 0 4 1 -3 2 16 16 15 18 6 -2 21 10 20 11 0 17 17 19 8 5 12 2 18
4579 18 5 9 5 16 5 -7 -7 -12 -9 8 -17 -3 -2 -2 -2 7 5 8 2 -5 3 2 13 4 4 -2 12 8 12 0 5 4 17 9 -3 -1 1 7 13 0 1 17 15 17 12 -3
4625 -3 -8 0 5 5 5 -4 -12 4 7 6 11 0 -14 3 11 15 -9 -4 12 2 24 18 13 3 7 18 22 25 8 14 8 16 25 13 -7 -4 9 15 14 -4 2 7 12 7 -2 -21
4671 -21 -11 4 8 2 -1 -13 1 4 17 13 -2 4 7 -2 15 5 8 14 12 27 30 9 17 11 21 19 11 2 8 13 3 6 1 -1 7 4 -2 0 -10 3 -6 -1 -4 -4 1 -11
4717 -11 -1 14 -9 1 7 7 7 8 -4 3 8 22 8 2 4 16 15 24 19 2 -1 17 25 12 5 -11 -8 12 13 16 -10 -7 -1 23 15 -10 -16 -13 9 22 -7
4758 -7 -13 -31 -12 -2 18 2 -19 -11 11 25 16 1 -8 -1 20 28 24 -5 0 7 33 23 8 -7 -11 6 26 17 3 -15 -3 15 25 16 -12 -18 -3
4795 -3 12 26 -2 -8 -16 -2 3 9 2 -14 -6 9 29 -5 -5 2 8 12 13 3 1 8 13 25 19 13 12 3 3 14 6 -1 5 3 2 -3 -5 -12 -7 -2 -10 -16 -8 -1 4 -4 -16 -18 -4
4844dJ2onj7J1K1JNk3j0K5Qkrj2PQJ0%k1qQJ8Rj9j9oJ2K7kk8j3ML0J5k2k3j4J2
4883b0K5K3k5k1j0K6J4J1l1pQK3J6j3k7j3K2K6Rk7k2LJ6K6j1j2k9J6J7Qj8k1L
4916a5J0K4qrl3J2K1Qj1j3JJK7Lk3pkK0J6j3koKJ7KmqpPLmj7OJ5Nj2pmOQllk4
4959b1QkK5j0j1jMK0rj0nNJ9Oj6k6%J6K6Ok3k5J1L1OJk4j0JL4jj1l5rL2K0Nk4
4997Cm0J3K9K3j0l4j9J0M0Oj8m2ML3L7qk8k6J1L8J7j5l6pJ4M6jk5k9LK8K0lm1
5031gpjL6J0j9k9oK6J8pj2l2J3J6J2j1k3lJ7K1%j3n%K6Mrj6jRRQj5oQJ4Prj9K
5071FKJ7mk3nOK4nj4j9oK9Npj3j%K1Nj3k3nJ4L2j0j4k4K2J8J6j0l1MOM3rk3j7
5109fLL0K3j9l0j4J4L8j1j8k0rL2J7j0k0k9J2L1K1k5k9j3K7K5Nk7k5KL0L7rl5
$$ plain form
4844 -4 8 2 -3 -20 -9 12 13 18 -5 -15 10 18 16 7 -5 2 10 20 20 -1 -9 -1 17 26 7 -12 -18 -6 21 19 -9 -22 -18 12 27 5 -18 -32 -20
4883 -20 5 28 3 -18 -28 -2 12 23 -8 -15 -7 16 32 19 -8 -21 1 27 36 9 -13 -10 6 32 21 9 -20 -4 13 21 3 -18 -15
4916 -15 -5 19 11 2 -31 -19 2 10 -1 -14 -13 -12 15 18 -5 -12 -14 6 22 9 7 1 3 20 22 18 10 3 10 13 9 -8 -2 13 18 6 -1 -5 1 9 6 3 -21
4959 -21 -13 -15 10 0 -11 -12 -8 12 3 -7 -12 -7 12 18 2 -24 -24 -8 18 24 1 -24 -13 18 24 25 1 -9 -8 26 25 14 -21 -30 2 22 27 3
4997 3 -37 -24 5 28 18 -16 -35 -25 15 21 3 -39 -35 -2 35 27 -1 -27 -16 22 39 24 -12 -19 -5 41 40 15 -14 -11 17 37 34 -7
5031 -7 -14 -15 21 31 12 -17 -23 3 21 14 2 -30 -17 -1 11 0 -23 -26 -9 12 12 -1 -6 -6 20 24 15 -1 -2 7 16 24 9 3 11 25 32 23 4 6
5071 6 8 25 21 -2 -7 -1 23 18 4 -15 -21 8 13 6 -7 -8 -8 13 18 5 -18 -23 -9 23 13 -1 -25 -3 15 31 21 -10 -6 0 43 34 11 -6
5109 -6 -3 27 50 31 1 -13 1 39 28 10 -10 -19 13 30 20 0 -29 -17 14 35 10 -19 -32 -5 20 25 -2 -27 -25 5 42 33 -2
5142bk1J8L4J4j8l5mK8K3lk5j3j4M8Jj2j6rRJ8pj1k5RJ7J1j1j3j4J3J6Lpk2kJ7
5178eJ0Rj3nJ7%Qj8NnJ2%rj1MJ4JLj5qJ6J2J3l0jj0J4J1%l4oJ1K3J7l0k5jL2J4
5217B0lj8k4NL0J0Kl8pL3K3J0k1k6mK8J7pk7j7rM1K0j5l2j9L1K2Nk1m7RK4K4M
5252B3k7k1%L6J8j0k8j5J2L1Pk2j6lJ7K7kk6j5J2J6J3nj7plK4Kqj6j3J7%K1k5
5287cj3OJ0Rkj2Jj0J4lqONQrMkJJ3j6KnJ7pOj1mORJ0j7J8l1J9PJ1k1j0qK4Pj6
5329Erj0PJ2Ppk4j2J9L1Pk4j1j3K8J0J1l3j0NK9K1mm0j8L6K6J0l1l0LJ8L4rl8
5364droM0J3ol3j9RL0J8j5l6k4M2J7Kj2l9LK7L0pl1j8J8K4K3rl5j2J2L4Rj0k6
5399@j5K7PRj8j5pK5MJk6mlK5Nj7Kj9J1J0Qj2lj4J4JLRkjnPjNKj0nJJ6lmJj4P
$$ plain form
5142 -2 -23 -5 29 43 25 -10 -14 14 37 34 9 -4 -18 30 31 19 3 -6 3 21 14 3 -22 -13 4 15 4 -9 -23 -10 6 9 2 -20 -22 -5
5178 -5 5 14 1 -4 13 13 21 3 8 3 15 15 6 -5 -1 13 14 17 2 -6 10 22 35 5 4 -6 8 19 19 -15 -21 -10 13 30 0 -25 -26 6 20
5217 20 17 -1 -25 -20 10 20 22 -16 -23 10 33 43 22 -4 -8 20 37 30 3 -14 -23 18 38 23 -9 -28 3 25 30 9 -38 -29 -5 19 23
5252 23 -4 -25 -25 11 29 19 -9 -24 -12 19 26 4 -12 -15 2 29 27 1 -14 -2 14 27 22 5 -2 -5 19 21 13 -3 -16 1 1 22 -3
5287 -3 -16 -10 0 9 7 -5 -4 -14 0 -3 -11 -5 0 8 -1 3 1 2 15 -1 1 -4 13 6 12 1 -3 3 12 22 5 23 -8 11 18 29 8 -2 -10 14 21 5
5329 5 -4 -14 -7 5 12 5 -19 -31 -12 19 26 2 -9 -22 6 16 27 -6 -16 -11 18 39 35 -5 -23 13 39 49 18 -12 -9 9 43 34 -4
5364 -4 -13 -19 21 34 28 -5 -24 -15 15 33 18 -18 -42 0 17 19 7 -32 -29 -2 28 21 -10 -28 -10 14 37 28 -7 -19 -7 27 36 26 0
5399 0 -15 12 19 28 10 -5 -12 13 17 18 -8 -12 -15 10 15 -2 0 -19 -8 2 10 -2 -5 -19 -5 -4 -1 8 6 5 0 7 6 11 13 3 -2 -1 15 12 8 9 -5 2
5443BJ9Prj7qMJ8Pj1k2qJ6J6jk3j3jK5J5kk6j2ML3J8j9k3rK2L0jk0k3j1K9K3J
5480C0l0j7LK8L4j8m2pJ8K0Rl0k5kL5J4Jl9k2J1L9J6j4k4k4J8K4L3k1l6qK0L4
5513B8J2l2j8JK0L1rk5k0NL0J0rk5j8J8K5Pk5k1rK3K8rj7k0kK2J6qk1NmJ4Rj0
5549BJj7J4MK%jnRNOLLj3j6PNRnqKkRkLok5J3K0lj7j0qJ8J2J1j8j4j8L0K9j6k0
5592gk0K0K1K1j6m3kK0M0J6l1l5KK3K3Nl0l7PL5M0j7l3l8L1K8J1j3l7j0K0K8j0
5625A2ol8MK4K1Ql8j5J0L6Qj5k2j5K2K6Rl1lrK4K7qk8j2jK8J7k3j4j6J8J5J1q
5660A8l2PNQ%oj7RKk%jPlKnMJ0j0Pkj0J5NMj0lnJ9Llj5pJ3OJ2j5k1j8L0J2nj6
5703hk2K1J1J8rm1QnL2J7k2k6j1M1J7Nk8k6KM4K2j8l5j4J7K7K5j7l7mK4K6J2l6
$$ plain form
5443 2 21 28 19 2 -6 -2 16 23 12 -10 -18 -2 14 13 -10 -23 -24 1 16 14 -12 -24 -20 13 31 12 -11 -20 2 32 31 11 -12 -23 6 29 30
5480 30 0 -17 -14 14 48 30 -12 -19 -1 19 28 -2 -27 -29 6 20 21 -18 -40 -29 10 26 12 -12 -36 -18 6 39 18 -18 -26 -6 28
5513 28 40 8 -10 -9 11 42 33 8 -12 -7 23 33 24 -1 -19 -1 24 31 6 -15 -24 -1 27 18 1 -19 -21 1 17 9 -12 -7 -11 3 12 2
5549 2 3 -14 0 4 6 6 5 0 9 14 20 23 26 13 -3 4 9 18 13 5 7 5 14 12 15 9 -16 -3 17 14 -3 -13 -21 -3 9 20 2 -12 -30 0 29 13 -7
5592 -7 -27 -7 14 35 19 -24 -26 -6 34 50 19 -16 -14 9 32 37 7 -30 -23 12 52 35 2 -36 -5 23 34 21 -16 -26 -6 22 12
5625 12 6 -32 -28 -4 17 25 -13 -28 -18 18 26 11 -11 -26 -4 22 31 0 -3 -12 12 39 31 3 -9 -10 18 35 12 -2 -18 0 15 26 18
5660 18 -14 -7 -2 6 6 0 -17 -8 -6 -8 -8 -9 -2 -5 -3 -8 -4 6 -4 3 1 -9 6 11 15 5 2 -3 16 19 16 1 -6 7 13 25 10 -11 -29 1 13 8 -8
5703 -8 -30 -9 2 20 11 -30 -22 -27 5 22 0 -26 -37 4 21 26 -2 -28 -26 18 40 22 -13 -27 -10 17 42 25 -12 -16 8 34 46 10
5737A0l6PL5K0j3k9k5ML6J4ql5j1K8J3J2j5l1oK2K6Mk2k4J4K6J6j4k0j2J2J6M
5770A8lk1kK1oPnrlPMMj5jJKjlN%jNrkMllJKJ1jjj0lJ5PPj2Jj1J6J5j1j8j6J8
5816AJ3J1pk2j0J3J8Rk7l2J2K1L7rm3k5J6L0K2j0l9k2K9J6J8j3m1jK7M2rk2k7
5849b4J1K1L8k7k5j3J7L1Mk1j9j5K2L0Kl5j7LK4J4rk7j4RJ1K7pk9LQJ0Mrj2oK3
5885CLPj9nJ2MJ1j0moOROj4nJ3%J1j5Nj0Oj1PmJ2%pk2J0%kJ2j2j9J6J1Pmk5OO
5927a1K6lJk9kK1K3kk2k3%K9J5nk6oRK8lj0k2j5L1J2Qk0k6KL3Jpj6j8J2K3J2j2
5964Hk9KK0J6Qj9l2RK1J5Pk5llL1lnk1kJK6%k3j6LMK0onk3J5J9mj0j4OOJNpj0
6005a7J0PqJ8j5JJLJ5q%Nj2KpJ0RJ0k0kRjKmj5oJ2J0j4J6k4RLOLj8nJ0O%Rj9n
$$ plain form
5737 10 -26 -19 16 36 23 -6 -31 -27 9 23 15 -20 -31 -3 10 22 7 -24 -30 -8 18 22 0 -24 -10 16 32 18 -2 -14 -2 14 18
5770 18 15 -6 -8 13 7 14 9 0 -3 4 8 12 -3 -4 -3 -1 -2 -5 0 0 -1 4 -5 -7 -3 -6 -9 -8 -6 5 4 3 -7 -10 5 12 19 7 8 -3 13 28 17 -1 -17 1
5816 1 14 25 18 -4 -14 -1 17 26 -1 -33 -21 0 37 28 -15 -40 -24 6 28 18 -21 -43 -14 2 20 7 -34 -35 -8 34 25 3 -24
5849 -24 -13 8 46 19 -6 -19 -2 29 33 12 -7 -22 0 30 32 -3 -20 -17 7 21 12 -15 -29 -20 -9 18 11 -18 -15 -7 3 7 -2 -14 -20 3
5885 3 6 13 -6 -11 1 5 16 6 2 -4 2 11 17 3 -2 11 11 22 7 12 2 8 -3 4 0 12 12 5 -17 -7 -7 -9 3 -9 -28 -12 -1 6 2 -23 -17 -11
5927 -11 15 12 13 -16 -18 3 26 24 2 -21 -21 8 23 18 -8 -14 -5 23 20 10 -12 -27 4 16 24 4 -22 -20 13 14 7 -9 -27 -15 8 20 8
5964 8 -21 -19 1 17 25 6 -26 -17 4 19 26 1 -2 -5 26 23 18 -3 -5 -4 22 22 -1 -17 -14 -10 10 4 -1 -24 -9 10 6 -4 -18 -12 -6 -5 0 -7 -17
6005 -17 -7 0 -8 10 -5 -4 -3 0 15 7 7 12 0 2 -5 5 14 24 4 2 11 10 12 8 -7 -13 -1 9 -5 11 -13 -4 -1 5 8 -10 -15 -5 1 1 10 -9 -14
6048a4J1J4J1j4j6qL5mNj7j6NK6%Ok2pOJ8J2j5k1qJ3OJ6j9k2nJ9L0j3j1j7oK0
6084bJ0%k5JMJ9Nqj4RMJ9mjj9jJ0J0nj3rJ3ONlj5KJJ3oNk6QNkjQj0kjjOkKQj8
6130a5J1J2j0Nj3J3MmJJ4rrJJ6kqj1J3LJOrjpOkrj0oK0KnqpqL1Jrj1lJ3MNrj6
6175a9%K3J0Kj6j0lL0kNk4qJ5NQk0OpJ3PKj5j4J6nJ8j6k1OQJ4oj9L%K4r%jj3J8
6216EmOojMkoRj1J1Mlj2J1nQpJ0rj1MNLmoMjJjkj0lK1k2J5j0KkJ5j0Oj4J1LQj
6262CKqJ4%%qj2KJ9JrqL%J4jj0nKOPj1oj2NK0pj6pJ0kJ9kj1mmJ3Pj2ojJ9MJ1k2
6307cqLK5Orj9LPJ2Qj3k7J0J8Lj7j4kLPJ6k0jpLJ3OqqJ4kRJj9%PJ4%lj6J3MLr
6351CLnlJ8%pj4jJ4Ppj8OlnJ2Lk0NJ2j3Kj1kJ8Kr%kJ7j0J4pkRkNMj4NLJJ0k3J6
$$ plain form
6048 -14 -3 11 22 8 -8 -16 19 15 20 3 -13 -8 18 18 24 2 -5 1 19 31 16 -5 -13 0 6 22 3 -19 -24 -5 25 12 1 -16 -22 -2
6084 -2 8 8 -17 -16 -12 7 12 4 -10 -1 3 22 18 17 -2 -3 7 17 12 -1 -10 3 9 14 11 -4 -2 -1 12 6 11 -15 -7 -2 -4 -5 3 -7 -9 -10 -11 -5 -7 -5 3 -15
6130 -15 -4 8 -2 3 -10 3 7 3 4 18 9 0 1 17 15 7 -4 9 12 13 19 10 9 2 8 6 -3 -13 -19 1 3 -2 -10 -17 -25 6 7 -2 -13 -16 -3 1 6 -3 -19
6175 -19 -19 4 14 16 0 -10 -13 17 15 20 -4 -12 3 8 16 -4 2 -5 8 15 17 2 -12 4 -1 17 1 -20 -14 -6 8 2 -17 -14 -14 10 1 1 0 -13 5
6216 5 1 7 1 0 4 2 -4 5 -6 5 9 6 -6 5 0 8 1 11 2 -9 -5 0 3 -1 -7 -3 -4 -3 -4 -6 -16 -19 2 -20 -5 -15 -13 -15 0 -10 -4 -18 -7 -4 4 3
6262 3 5 -3 11 11 11 3 -9 -7 12 13 4 -4 -1 -1 13 12 2 -3 -1 5 12 1 -5 -17 -12 8 1 -15 -22 -12 -14 5 3 -8 -12 -16 -3 4 -8 -14 -15 4 8 19 -3
6307 -3 -11 -8 17 23 14 -5 -2 5 17 25 12 -15 -5 13 16 -1 -15 -17 -14 -7 9 -11 -12 -19 -16 -3 3 -5 -13 1 -1 8 9 -10 -10 -3 11 11 8 -8 5 9 12 3
6351 3 6 1 -2 16 16 9 -5 -6 8 15 8 -10 -4 -7 -12 0 3 -17 -12 0 -13 -11 -22 -24 -6 -4 -13 -13 -15 2 -8 6 -1 -3 6 4 9 13 -1 4 7 8 18 -5 11
6396A1j5RQj4kjMJ6j3roQMJ3j1k0mJJ7J1nk1nRK5Pk7j5J3J8NNk6MPJ3Qk6oJ0J1
6437A1Ojj0j4kJ7K2k3j9KJJ5Qj3k5nK4J0J0k3j0RJ6jj1j2mJ4J4J0k7NqL0krJ0
6474A5k5%J8oLrOKmOKplJ4j5J1j0pOlopJ1%J2j6J0llJ3nj0KQJ3%j0nLJ4NppkJ
6519EJJ5j9j5KK3J1oj4j7PJ5J7j9k1oQK5Lk4j8nK3J7Jk0j0NJ1J4Qk2pNK0Qnk3
6557gqJ9K0Kj4l5J0K6Klj6j3OK3kJj4j4OK0Kpk4RMKPj3KqJ7Roj4LPJJ0l%mRKq
6601FQoJKj1J1j0QlrkJ9mLl0RRNoJj2j1K1pJ9pj5j0J1K1J1l4oJ3J5LMk4JoK5K4
6643C7k9j4j2K1J4Oj2k2j0K5J0Rk2k4MK2J0pk8j0J7K2Nmk4rJ4J7K3k9oj6L3MK
6678A7j8j6J2J9Rj5j5NJ1Q%rl1J6KK2mk4jPJ1llnj0MK2j9Pk1OML%NjpJ1Ol%j1
$$ plain form
6396 11 -4 5 13 -1 -3 -4 0 16 3 -6 -12 -4 0 13 2 -18 -22 -21 -4 7 2 -19 -24 -15 10 17 -10 -25 -12 6 11 16 -10 -6 1 14 22 -4 -10 0 11
6437 11 17 16 6 -8 -10 7 29 6 -13 -11 -10 5 13 0 -25 -30 -6 4 14 -9 -19 -10 6 5 -6 -18 -22 -8 6 16 -11 -6 -14 16 14 5 15
6474 15 -10 -10 8 2 5 -4 2 4 0 6 8 1 -2 12 -3 8 -2 -9 -3 -6 -12 -19 -8 -8 4 -12 -2 -5 -8 5 0 -10 -8 0 13 13 3 -2 1 15 20 13 6 4 5
6519 5 6 21 2 -13 -11 12 23 17 3 -14 -7 8 25 6 -15 -21 -13 12 15 -9 -27 -32 -9 8 9 -11 -21 -16 -5 9 17 -5 -12 -7 13 21 16 -7
6557 -7 -15 4 24 26 12 -23 -13 13 15 12 -4 -17 -11 12 10 11 -3 -17 -11 9 11 4 -20 -11 -7 -5 2 -11 -9 -17 0 9 3 -11 -8 -1 0 10 7 7 3 12 14 6
6601 6 14 8 9 11 0 11 1 9 6 -3 -5 14 10 13 -17 -8 1 6 0 1 -11 -22 -1 -8 11 4 -11 -21 -10 11 22 -12 -18 -5 10 13 17 -7 -6 -12 13 37
6643 37 8 -6 -18 3 17 23 11 -11 -21 4 14 23 1 -23 -19 3 13 6 -22 -32 -15 7 12 8 -16 -25 -11 6 29 0 -6 -22 11 15 17
6678 17 -1 -17 -5 14 23 8 -7 -2 9 17 17 8 -23 -7 -5 17 13 -11 -12 -5 6 3 0 -5 -15 -11 11 -8 -1 -22 -16 -12 -9 -9 -4 -5 -12 -1 5 2 2 -9
6720iPnRLKoknoK4Pj4pj9J3J6Pj2k7PJ3Pj3mmoK0J8pl4rK3J3Pqj0rJ0K2Pj4k2
6762a7oL2J7rk3j6J9K9%j0j8j8J5K8pj0l0KJ6J8Kl0k2J4L2J0rk4j8J6L0Rk7j6
6796b1JK1J8Jk1j4J5J4RKl0pKLL5k2nqmK4Nj6qpJ6Nopj7QNKkMj0kPNLj2NlJ0M
6840BJ2oj3LkMJ5rj7PkJ9kqoojJ9nkj0j0J2K0nk0rlK4jMj1k7QK9J8k0j6j8J1M0
6881A8jj1j8rL2R%k5j0jK7J6mk5k0J7K4Pj9j3j2K5J4Nk8k8RJ5K3j1k1j9RL2J6
6916B3k3j8j1J3K6J2k4j9MJ0K2kk1j3J7PK0lj5j6J1J2jJ1k4j9J4K0mk0Pj0%K0
6950Fqj4qOPJ1oKn%LPkJJj6J4KKJ2j5JqJJ4l%k0J9RJ0k2j4J4%R%j6j3lJ3K0%j5
6994dk1LJ5K3k0j2j0mL5J8j5j6j4J6J4K0k4j2j2K3J6Mpk8j3M0J3kl3k0J8J9Ok7
$$ plain form
6720 -9 -2 -7 2 5 7 1 -1 -6 -12 12 19 5 -2 -21 -8 8 15 3 -24 -17 -4 3 -10 -14 -18 -24 -4 14 7 -27 -36 -13 0 7 -1 -11 -20 -10 12 19 5 -17
6762 -17 -23 9 26 17 -6 -22 -3 26 26 16 -2 -20 -5 23 16 6 -24 -22 -6 12 14 -16 -38 -24 8 18 9 -15 -33 -17 13 22 -5 -21
6796 -21 -20 1 19 20 -1 -15 0 14 23 25 -5 -12 -10 -7 28 6 1 -7 -11 13 18 2 -6 -13 3 8 2 -5 -22 -14 -9 -7 -9 -5 -15 -17 -10 -5 -2 -14 -9 -12 -2 2
6840 2 14 8 -5 -2 -4 0 15 6 -11 -4 -6 13 11 3 -3 -9 -10 9 4 2 -8 -18 -6 14 9 -11 -20 -23 1 0 4 -7 -34 -26 3 21 1 -15 -33 -22 18
6881 18 17 6 -12 -21 11 20 20 -5 -15 -16 11 27 23 -2 -22 -5 19 26 7 -6 -18 7 21 26 -2 -30 -21 -6 17 6 -15 -34 -25 7 23
6916 23 0 -18 -29 -16 10 22 -2 -21 -17 -7 15 13 -8 -21 -4 3 23 20 5 -11 0 12 11 22 -2 -21 -7 13 9 -11 -4 -14 -14 6
6950 6 -2 -16 -24 -18 -11 0 -6 -4 -9 -9 -6 1 -1 0 1 -15 -1 1 3 15 0 1 -7 -6 8 5 5 -15 4 13 23 1 -13 1 1 10 10 -6 -19 -22 -9 11 11 -4
6994 -4 -25 -22 -7 16 -4 -16 -26 -30 5 23 8 -8 -22 -6 8 28 4 -8 -20 3 19 23 16 -12 -25 15 28 26 -7 -27 -9 10 16 -11
7028a1j5j0K4L6rj1k1kK1K4rk1k2KK1K0Lm0mK4J5Rk8jpK1K4j2rk2MK4mlrqkK2
7066A4kpj1j1J5kOk1J4%JJ3j3JolMJ7j7PpJ4olNPNj2mQJ0Rj5j3pJ9ROj5j5MK2
7108B0Pj9k1j8J2K5J4j0l0pJ5K2Rk6oj1J2K5Nk5k2J0K6K1ml2j3J6M5Nm8j0lJ3
7142cK7Lk9j5lL2K2j0k8k9K2L0%pl0j4K6J4K1m0k3RK2K1%k8k0K3J0K0j1k7nJ9
7176aK3mlk0MJ6K%j8j3NJ5KJj6nJ2lJ1rqRj1LNqRLj0J%J1mQj0j4J2jK5j9pkQJ6
7220A5%rj4RJ4jjj7j4J6K4Pk3k3qJ5L4lk5k3KL0J1Jm8lPK4K9k4l0oK4M5rk0j8
7257a2KJ9L1k4k7j6K0K7K1l2k8nK5K8qk6l1K1K2K0pk9j1JL2Mj8j9j9K2K0Kj8k1
7291c4J4J4K4mk4LkK5Rj1k0kQK2Mj0pj3J2J0j1j4lJ7Mj0Nj2NmQj9J2MjNj5lLO
$$ plain form
7028 -11 -26 -36 -12 24 15 4 -17 -19 2 26 17 -4 -26 -24 -3 17 20 -20 -24 0 15 24 -4 -5 -12 9 33 21 12 -10 -6 18 14 11 2 -6 -8 14
7066 14 12 5 -6 -17 -2 -4 2 -19 -5 -5 -4 9 -4 -3 -9 -12 -8 9 -8 -1 -8 6 0 -3 2 9 14 2 -2 6 16 25 10 -3 -10 9 18 24 9 -6 -2 20
7108 20 27 8 -13 -31 -19 6 20 10 -20 -27 -12 10 19 -7 -13 -24 -12 13 18 -7 -29 -19 7 28 24 -8 -21 -5 40 45 -3 -13 -16 -3
7142 -3 24 27 -2 -17 -20 12 34 24 -4 -33 -11 19 19 12 -18 -32 -6 8 29 -11 -34 -25 -3 18 18 -10 -30 -7 3 23 12 -15 -20 -1
7176 -1 22 18 15 -5 -1 15 17 17 -1 -14 -9 6 8 9 -7 -12 0 -3 8 -1 -9 0 -11 -8 -3 -11 -2 1 -9 -8 -8 3 -1 7 -3 -17 -5 -6 19 0 -7 -9 -1 15
7220 15 15 6 -8 1 15 14 13 -4 -18 -2 22 29 6 -17 -25 -10 24 21 -4 -27 -25 5 16 17 -31 -34 -27 -3 26 2 -28 -34 -10 35 26 6 -12
7257 -12 -10 9 40 16 -11 -27 -7 20 41 9 -19 -24 1 29 21 -5 -36 -15 7 27 20 -9 -20 -19 13 17 -1 -20 -39 -17 3 5 -13 -34
7291 -34 -20 -6 18 14 -10 -7 -9 16 25 14 -6 -8 0 22 26 16 9 -4 8 18 7 -7 -10 7 11 1 6 -6 -1 -5 3 -16 -4 0 -1 4 -11 -14 -11 -5
7331eKjj6%K0J2rj3rJ6K5pj4j7mL1J7Ll0j7J6RJ6kl1k0J3K7Rk3k6j6M2K7%l3l6
7368d4J0L3L2j0l5k4K1L6Pk5l2kL4L7j0l7j3JL3M1k2l8j4K0L1Kj9k8j3K9L1ql4
7401a0k1J1K3K1k0j5l2K9K1jlk0j8K6J9jj5j6PK8%%j4j1QJ7J2j1j8J1PpLj8J7
7436IqJ3j3Qj1J0Oj3nrLK1j0j2j0J2J9kj1l0PK9K4k4j0k0J3L0J2j8j9j0NN1j1
7471B6k1j7rL1K0jl4k4J7L2K6l8m2%K6K7Mk6k4j6L7L2j9k6j7PM5J7k0l9j5K5L8
7504B2Pk2m4LM6K4Jm6j7J1M0J7j4l9j1K2K5Rk3k7kJ8L4j3l1j7kL8J6k7k2lJ5K3
7538A1Jpk6PRJ8Ok6jJJ6JKoJ%Qjj6J8kj1j4ORQMqj6pK6Okk9j2J1J0J3j6j7qK5
7580hK3Kj9k4OK3K3rk6j9NM6J3j8k7j8K1L9Pm0k3ML2K3j1l3m4M0K8K2k3m7j0L1
$$ plain form
7331 -5 -3 -4 -20 -20 0 12 3 -10 -19 -3 22 15 1 -16 -20 11 28 31 1 -16 0 9 25 23 -8 -28 -15 12 21 -2 -28 -44 -2 25 25 -8 -44
7368 -44 -34 -1 31 21 -14 -38 -17 19 26 1 -31 -33 1 38 28 -9 -22 -21 12 53 31 -7 -21 -1 30 32 13 -15 -28 1 32 24 -10
7401 -10 -31 -20 3 24 4 -11 -43 -14 7 6 3 -17 -35 -9 10 9 -6 -22 -15 13 13 13 -1 -12 -4 13 25 14 -4 7 14 7 10 -8 9
7436 9 1 14 1 9 -2 8 14 1 -4 -13 -10 11 1 -11 -21 -9 10 8 -3 -33 -26 3 27 3 -7 -27 -14 16 28 10 -9 -19 -14 37 26
7471 26 5 -12 -21 10 30 29 -5 -29 -12 20 46 8 -34 -34 -8 19 23 -3 -27 -43 -6 26 7 -19 -36 -29 16 33 13 -26 -41 -16 22
7504 22 29 7 -37 -34 12 36 37 -9 -26 -15 25 42 28 -11 -22 0 25 34 11 -16 -18 0 34 21 -10 -27 -29 9 25 -2 -24 -27 -12 11
7538 11 12 5 -21 -14 -5 13 19 -7 -8 -7 9 10 12 6 7 7 15 14 -2 16 14 3 -11 -5 4 12 16 8 -8 -15 11 17 15 -14 -26 -15 -5 8 -8 -25 -33 -8
7580 -8 15 17 -2 -26 -20 3 26 17 -9 -28 -23 23 36 18 -9 -27 -6 33 40 0 -23 -19 13 36 25 -8 -52 -12 16 38 15 -32 -42 -11
7614a1L4J0m3l0jM1K6Mn2j9J5M5K7k9l2j9K9K3J9k9m2J0L3K1Jk9k1J5K3Mrk9J
7647a4JK8j0j0k0NJ5OKlj7QOJ1nj2mO%J1onJ0kLrQOnlKnRLqKk1J2K2lj1j9kJ9
7691AJ5ooj2j0K5Rj3k0j3J0L7lk2k1JK5K4Kj8l5ML2L6j4m5KML6Oj4m1pK2M8Ml6
7728Gl6NL8J8k0l4j9K5K4J7k2l8j1L2K8Rj8m4MK7K5mk6j9J8K8K4k4k3j1J5K6m
7761A7rj8j2K1K0j1j2j5PJ4J8qj3j5NlQpj1RMPmLjnO%J%pLj0%%K6J1j3onMJ7K
7804A8j2j6ONPJ6k9k0K4J5Mj3k2jJ1J4lk5oJK3J7jk9k2K0K8Mj6k6MK3K0oj4k4
7840b5LL2J5ok8j0JL7J7k9j9j1J8K7%k9k6J2K0J9Ql6j8KM1mj0k9lJ0K8Qpj9j4
7875b5K1J7jk5OmJ2J6Jk4MJ3JJ0j1k3J7Pj3NqOklrJkMJPjpL%%j5KkK9j4Qj5%J7
$$ plain form
7614 -11 23 33 -10 -40 -41 0 26 30 -22 -41 -26 19 46 17 -15 -34 -5 18 37 8 -34 -24 9 30 31 2 -19 -4 19 23 14 -15 -14
7647 -14 -13 15 5 -5 -25 -20 -5 1 3 0 -17 -9 -3 8 3 -9 -13 -7 -7 4 -2 -7 3 1 4 -5 3 9 4 1 3 -2 7 10 2 4 -17 -5 17 14 3 -16 -18 1
7691 1 16 10 4 -8 -18 7 16 3 -17 -30 -20 17 14 -8 -29 -28 -3 21 23 5 -30 -26 6 42 28 -17 -15 -11 25 31 17 -24 -31 -9 39 43 7
7728 7 -29 -24 14 32 12 -22 -41 -16 8 25 3 -35 -46 -14 14 23 5 -39 -35 -8 17 13 -13 -32 -14 14 38 14 -9 -20 -5 21 17
7761 17 8 -10 -22 -1 19 8 -4 -19 -12 2 20 12 -1 -16 -11 -14 -6 -13 -24 -15 -11 -4 -8 -5 -6 -11 -5 -5 -4 -4 -11 -8 -18 -18 -18 8 19 6 0 -5 -1 16 18
7804 18 6 -10 -4 1 8 24 -5 -25 -1 14 18 5 -17 -18 -7 7 4 -21 -27 -26 -3 14 13 -16 -38 -18 10 14 -2 -28 -24 -1 19 13 -1 -25
7840 -25 -22 10 25 19 -9 -19 -18 19 36 7 -12 -23 -5 22 22 -7 -33 -21 -1 18 26 -10 -28 -26 15 11 1 -28 -31 -21 7 15 8 -11 -25
7875 -25 -4 13 12 -13 -7 -11 1 17 18 -6 -2 11 12 22 11 -12 5 12 -1 4 -4 2 0 -3 -12 -11 -13 -9 -8 -1 -2 -9 -6 -6 -6 -21 -19 -21 8 -6 2 -13 -13 4
7919DRj1rJJ3K0Mrl9QL2jKl2%jJ9J5j4k9j4K2K1J1k4j5j4RK3K1l4k1NK4RLj5j8
7957b5QK2K9j8l6oJ9K3Rk4k5jK9J9Lk5j3lK9J8k1l0JMK1krj2nJ6J9rk3njK6Nm
7995Cj5qRJ4Npj3qK7Jj1qJ1JjJ4pqMj5K0LoJrnNnLLMoj4PJJ4pj3mRJ1qOj7LNJ4
8042CJ9k6lj3K2J9qrk0PK1j0J2k4pJ8J6J1l2j0mJ6LqJj4kK3J7k4k5MJ1L2Ll0j1
8079b2%J7J7%l2j0J0L1Rrj1k6K0L0%k8qnK1RNj6j7RPK5k8k1nJ6J1J3j8j2oK2K
8116@Kkj6P%J1oj0j2K0J1k%MoJJ1qKklLlL%MlmkkjJ3lj9pMQmKjp%K2j5njJ0J4
8164HRj6j2j4J7K3Oj5j4PJ1J4pk2j5J0K4J0j2k9oK0K9oj6k8J
$$ plain form
7919 4 13 2 -7 -6 7 27 31 22 -17 -9 23 22 24 -8 -8 -9 10 25 11 -18 -32 -10 11 22 -2 -17 -31 -22 1 22 -12 -33 -28 -4 5 8 -7 -25
7957 -25 -17 5 34 16 -20 -26 -7 16 25 1 -24 -25 4 23 26 1 -12 -15 14 32 11 -19 -18 -14 7 5 -4 -16 -21 -5 14 5 -18 -23 -24 2 7 3
7995 3 -12 -20 -11 3 8 1 -12 -20 7 8 -3 -11 0 1 0 14 7 -1 3 -12 8 11 5 6 -3 -8 -3 -8 -5 -2 2 -4 -18 -11 -10 4 -3 -16 -20 -11 0 -8 -2 -19 -16 -11 3
8042 3 22 -4 -7 -20 2 21 13 4 -16 -9 12 2 14 -10 -17 1 17 28 -4 -14 -18 -2 1 -7 -6 -20 -22 1 18 -6 -31 -27 -16 16 19 -11 -22
8079 -22 -22 -5 12 12 -20 -30 -20 11 20 11 0 -26 -6 24 24 -4 -12 -17 4 13 18 2 -15 -6 1 26 -2 -23 -28 -12 -1 12 -6 -18 -24 -2 0
8116 0 2 0 -16 -9 -9 2 -4 -14 -26 -6 5 3 3 7 1 2 13 5 7 5 2 5 2 5 5 9 6 2 0 -2 -3 10 7 -12 -19 -15 -7 -11 -9 -10 -17 -17 5 -10 -15 -16 -6 8
8164 8 17 1 -11 -25 -8 15 21 6 -8 -1 10 24 17 -5 -20 -10 14 24 12 -17 -23 -3 26 20 4 -24 -23
8191b3
$$ Imaginary data points
##PAGE= N=2
##DATA TABLE= (X++(I..I)), XYDATA
0@%%%%%%%%%%%%%%%%%%%%%%%%%%%%%%%%LpQqQj2J6j6J9k3K4k4K7l4L9m2M6n0N7
51C1o3O6p4Q3q9R4j00J07j10J11j09R6o8J0J13l84J063l310K1449J05001j11023
72A2894p2631P4174m3385k1786J11404m925j10638J2181N5248m975R726P889n2629
85b7453k7163N6943N0177l1362m0083O813n300o726N1986J8748o0989j6724L0879
98b54m981J2630K3187m4123k0077M9919m608k7826M0075o644p0447L1498P4697
111E3046l7583l9635L9183j7544m4031O2708L9931p3304j0912N3771l3435j8364
123b6169O6378k0461o9637M8494M3399n4834k432M1964l3367k6438M3965J5061
135B5923l0134m011J1761j0918q311K1392J2720k0839n854J1200j6647K523L7902
$$ plain form
0 0 0 0 0 0 0 0 0 0 0 0 0 0 0 0 0 0 0 0 0 0 0 0 0 0 0 0 0 0 0 0 0 0 3 -4 4 -4 4 -8 8 -8 11 -12 12 -12 15 -19 20 -22 24 -26 31
51 31 -32 34 -40 43 -46 48 -52 55 -55 56 -53 43 -25 -15 98 -286 777 -2533 18916 123917 12894
72 12894 -59737 14437 -28948 -50734 60670 55745 -54893 -42712 12536 7561 17287 25176 -27453
85 -27453 -54616 2327 52504 21142 -18941 -12128 -17428 -24154 27832 46580 -14409 -31133 -254
98 -254 -5235 7395 30582 -13541 -33618 16301 11693 -16133 23942 17298 -53149 -21651 53046
111 53046 15463 -24172 15011 -2533 -46564 16144 56075 -17229 -28141 25630 -7805 -26169
123 -26169 40209 19748 -49889 -1395 42004 -12830 -15262 26702 -6665 -33103 10862 25923
135 25923 -4211 -8222 3539 -7379 -15690 5702 18422 -2417 -8271 2929 -13718 -11195 26707
148B6707j7180l8058K7633J2797k5006K6873J0433n7051N329N3907j3155j3242
160a3J5779l8210j7316O3489J3321m8190J525J0057k3133K2357M0581l2349m4388
173c6490K1362L0710l082j684m336k9172n189M2424J9014k8721j6536P15o624
186a7609J9673L3145k2265m1689J3074K5095m528O051L671l3641j0229M0284J4783
199B5815k1349p027j0075j3202L0935K9697k8988k5007J1570r63M955K9763j0758
212A5366m0988P156K8127q92k68o21k4693m807L1365J1264j7428q877l613m645
226a3554J4688J9557j1231k3744K818J4332q3J258M563j3817r805J8191R161j3518
240a184m37L958j1773M597J8562q708j3388J0283o56j1477J2923J0004j5736k655
$$ plain form
148 26707 9527 -28531 -898 11899 -13107 13766 24199 -32852 -27523 26384 13229 -13
160 -13 15766 -22444 -39760 23729 37050 -11140 -9615 442 -22691 -334 40247 7898 -36490
173 -36490 -15128 15582 12500 10816 6480 -22692 -27881 14543 33557 4836 -11700 -10985 -17609
186 -17609 2064 35209 12944 -28745 -15671 9424 4896 10947 14618 -19023 -29252 11032 25815
199 25815 4466 -2561 -12636 -25838 5097 34794 5806 -19201 -7631 -8594 -3639 26124 15366
212 15366 -25622 -18466 9661 8769 8501 7880 -16813 -21620 9745 21009 3581 -5296 -8909 -13554
226 -13554 1134 20691 9460 -14284 -11466 2866 2783 4041 8604 -5213 -15018 3173 12334 -1184
240 -1184 -1621 2337 -9436 -4839 13723 5015 -8373 1910 1254 -10223 2700 12704 -3032 -5687
254e687J0236q388k959J5869k135j4376M667M843o081O644P406j3176q327J0883
268e81N989k307J630m625j1737L936J6498K000j0872m759j679l05J2159R339j3817
283H69j3681P026Q094K465N303p621j7764N230J9604J251q025m418r376P3J9829
298H859P566j6345j0202L007L710R563P979j3114j6096P001J4134K609k207p481
312a017j2083M025J8517L865j2353q004j448L678J2279N627j3096j2027N259R970
326C192L937n00p621r982M142J4260K441r234n592j513K204J0258M569j1409q213
341i061N550N059J905K605n960r061N251R673j779m189j075l569J258Q496N36
356E639p701j598K530L27K728K189m862l523L907K551j998j41O58j977m6K851
$$ plain form
254 -5687 4549 -3839 -6798 9071 6936 -7440 -2773 2070 -4011 2633 10039 -3137 -11464 -581
268 -581 5408 3101 4731 106 -11631 -7695 8803 10803 -69 -4828 -6507 -6812 5347 14686 869
283 869 -12812 -5786 2308 4773 10076 2455 -15309 -10079 9525 10776 2751 -1667 -11043 -10970 8859
298 8859 16425 80 -10122 -7115 -3405 6158 14137 1023 -15073 -8072 6062 8671 6464 -1017
312 -1017 -13100 -9075 9442 13307 954 -7050 -8498 -4820 7459 13086 -10 -12037 -6778 3192
326 3192 7129 6629 -992 -10974 -6832 7428 9869 635 -4957 -6470 -4266 5992 10561 -848 -9061
341 -9061 -3511 1548 3453 6058 98 -8963 -3712 5961 4182 -7 -1082 -4651 -3393 5103 5639
356 5639 -2062 -3660 -1130 -803 1925 4114 -748 -4271 -364 2187 189 48 706 -1271 -1317 1534
372A534m38k643J375J962k325j124K231k10m73K419j949m678K960M896j822j670
388D5j80l639Q51P269M41o248k160Q72K148N118N55p274m129L946N359K244k126
405C092o254l909M639Q163J046o819n716L32N137O447M48q232o371L561P505L864
421F933k390q116n119N788R023Q88n959o023j938N214Q633N00r127n950L321O267
437A945M160j058p842n180N402P138Q04l088n660l689N677P727j311o197l524
452d696Q11M978L839k166m422k505J198N382K651m359m048M10K462L389J54m253
468a175j332J832N33J789Q55m014j262L444N03o83K59k410J9L901j152l209K082
485b0J102j854J113Q02k357r2K268O07j073j798o07K171J760q85j679j338L18
$$ plain form
372 1534 1096 -1547 -172 1790 -535 -1659 572 362 -111 2308 359 -4319 -1359 3537 1715 45
388 45 -135 -3774 -2923 4346 4787 -1461 -3621 -2749 -601 4517 5072 -2202 -6331 -2385 2974 5218 3092
405 3092 -3162 -7071 -2432 5731 6777 -42 -5758 -5426 -289 6158 6606 -1626 -7997 -4436 3069 6933
421 6933 4543 -3573 -8692 -2904 6119 7007 1048 -4975 -6913 -1699 6934 7434 -1693 -7643 -4322 1945
437 1945 6105 5047 -2795 -7975 -2573 4565 5369 2281 -3379 -7068 -1391 6336 5025 -1172 -4696
452 -4696 -3885 1093 4932 2766 -1656 -4161 -2963 2419 5070 711 -3337 -2927 -465 2924 3078 -1175
468 -1175 -2507 -675 -142 1647 2502 -1512 -2774 670 1173 490 749 -1661 -1642 2259 1107 -2102 -20
485 -20 1082 -772 341 1143 -1214 -1306 962 1569 496 -1302 -1909 262 2022 1137 -542 -1880 -1562
502a562K659J348j827k053p11R59L071J543l300l767J159L798J772j160l068k400
518c539J622M016J481k126l896k047L781N253j258m616j826Q4L221N197j917p045
534c615q96L776K909K314k330o680m34O056L149j055l735m229J486N652K105k271
550B202m499l025L876N867p38l875k486j343L387N561j458n527j613J417L397
565A143L304k632n040J30K592K007J959k210m850N68L969J306j41j784l545Q09
581b415M449M55k296p46r59r6K867J256k419j775L53J340J512n01j897k9P80J10
599a1P20j13j450L87J136o16j12K06j001R30J714j947j727J774R62j88L84j771
617g23j621K432J928j011q33j585j262L172L046k319l007n11Q11K928K161k891
$$ plain form
502 -1562 1097 2445 618 -1435 -2146 -1187 1884 3427 127 -3640 -2481 1317 3089 1929 -1139 -3539
518 -3539 -1917 2099 3580 1454 -2442 -4489 -708 4545 3287 -1329 -3155 -3071 150 5347 3430 -3615
534 -3615 -4511 -735 2174 4488 2158 -4522 -4956 1100 4249 3194 -541 -4770 -3284 2368 4473 2202
550 2202 -2297 -5322 -1446 4421 3683 -192 -2678 -4021 -634 4927 3469 -2058 -3671 -2254 1143
565 1143 4447 1815 -3225 -3095 -503 1504 3463 1253 -3597 -3029 940 2246 2105 321 -3224 -2415
581 -2415 2034 2489 193 -553 -1512 -1608 1259 2515 96 -1679 -1326 14 1526 1025 -872 -901 -121 -11
599 -11 709 596 -854 -467 669 53 -59 147 -854 76 1790 -157 -1884 -110 852 664 1048 -723
617 -723 -2344 88 2016 1005 172 -1413 -2675 497 3543 1224 -1783 -2294 -1483 1445 3606 715
633G15l686L18K405K665Q35l509l639J450L812J950j099l878k384K746L904N94
649C199k181l448j351L579L735r70l010k305k61L719L387k378l833n29J168K759
665A280K554k711m321O75K762J618Q94k319l769J081L724R44r77k182k201J679
681a269L411M6j935j696q91K005K810q12k475r49L51J990J777j638k331K36J144
698b26J216P14j783j806J136J495K10j13j348j275J646J700r68j064p7k29R25
715A53J286j142j588O72J056J21J8q13j093R57J572m24j179m78J02J200J029j060
733C89j515P5J002J235K53j806j403J043J553P09n23k202r59K106J769l57j242
750A27j850l45K791J780j629j863r06M44K860J513k645k475L64J568K177O40k925
$$ plain form
633 715 -2971 -2653 -248 2417 3252 -257 -3896 -2446 1366 3316 2217 -1661 -4045 -1299 2605 3199
649 3199 1018 -2430 -3781 -202 3533 2563 -447 -2752 -3013 706 4093 1715 -2118 -2647 -1479 1280
665 1280 3834 1123 -3198 -2523 239 1857 2751 432 -3337 -2256 1468 2412 1435 -747 -2948 -1269
681 -1269 2142 2188 253 -1443 -2334 -329 2481 1669 -806 -1755 -1404 586 2363 725 -1606 -1370 -226
698 -226 990 1704 -79 -1885 -749 746 956 843 -505 -1780 -134 1566 598 -466 -543 -772 153
715 153 1439 297 -1291 -619 437 558 576 -237 -1330 -373 1199 775 -404 -882 -780 420 1449 389
733 389 -1126 -1051 -49 1186 1439 -367 -1770 -727 826 1535 1012 -1190 -2149 -43 1726 1369 127
750 127 -1723 -2068 723 2503 874 -989 -1895 -1451 1409 2922 277 -2198 -1834 -266 1911 2551 -374
767c74k529J270K588J412o72k926j814K017K985N92j888k747n99K643K555l44
783B169k458k247M13L065J879j515k596j088J191K708J105k188k445R6J795J863
799A747K65k244k052R90K183P79o78j663j218J185K030O4j310j076k21J151J406
816A338m88j461l32N86P82M60o76r73K21Q04L45k59p40l07Q49O45n17o76k04L39
836b64R57K03j214p29N81Q46O29l25j560o15J460J280k52j044j257l2J843J280
854A787j013j637p20P20K005Q57j755j909J38J520J671M3k147j622Q78K009J181
871B006q24k436r98J836K055K07j547k104j82K356J754p86j956j427O13K568J203
888B338j738k137l38J446K071L46k141j864N55J979J386n88k202j218J316K100
$$ plain form
767 -374 -2903 -1633 955 2367 1695 -1231 -3045 -1028 1957 2549 661 -2086 -2685 -42 2513 2169
783 2169 -289 -2536 -2123 942 2821 1306 -1290 -2378 -1187 1521 2626 438 -2007 -1911 -116 1747
799 1747 2012 -232 -2284 -1294 889 1668 990 -673 -1891 -706 1324 1388 78 -998 -1219 -68 1338
816 1338 850 -611 -943 -357 425 885 209 -764 -543 261 606 347 -393 -700 149 794 277 -399 -603 -264
836 -264 693 896 -318 -1047 -466 380 1009 684 -876 -1491 -31 1249 997 -47 -1304 -1336 507 1787
854 1787 774 -863 -1583 -863 1142 1999 244 -1665 -1527 -7 1664 1707 -440 -2062 -1184 825 2006
871 2006 1182 -1254 -2252 -416 1639 1846 299 -1805 -1987 369 2123 1337 -619 -2046 -1433 1135 2338
888 2338 600 -1537 -1875 -429 1642 1988 -153 -2017 -1462 517 1903 1315 -887 -2105 -789 1311
904A311M99j403j833k93J705J698k92j785j274N25J847J068j050j770m18J055
920d10J473M42j419j544L75J455P91k90j315r82R16J401K5p29q47m17J046J175
938A146n79j061k10L12Q44M68r76p68N71N15J55K3p79m85Q72P00l16o66n89L90
958d33J255Q4j156n38K33O44R70k75j520n04R12J098N41r34j846k1J947J136o80
977I13j446j068N50J928R97j134j931p77J388K349L13k250j867M77J964J627m42
994A591k380j491J133K254J119j157k612r23K124K311l8j897j968L2K305J711
1010B114p21j945j515N22K638J346j826k113k46J226J915N68j970j786N11J529
1026B47J227j02j888j318J120J655M12p97j472m86J349J195k97q97q74j5J339
$$ plain form
904 1311 1810 407 -1426 -1719 -14 1684 1392 -393 -1667 -1142 705 1773 723 -1047 -1465 -410
920 -410 1063 1505 86 -1458 -1083 372 1163 873 -442 -1424 -508 893 918 189 -658 -1075 -29 1146
938 1146 567 -494 -704 -392 452 920 -56 -824 -253 262 417 440 -339 -824 48 748 432 -234 -823 -433
958 -433 822 906 -250 -788 -555 89 1059 784 -736 -1240 -328 770 1311 377 -1469 -1490 457 1593 913
977 913 -533 -1601 -1051 877 1874 740 -1191 -1968 -580 1769 2082 -168 -2035 -1558 406 2033 1591
994 1591 -789 -2280 -1147 1107 2226 1069 -1543 -2466 -342 1969 1931 34 -1934 -1902 403 2114
1010 2114 1393 -552 -2067 -1545 1093 2439 613 -1500 -1746 -520 1395 1963 -7 -1793 -1282 247
1026 247 1474 1372 -516 -1834 -714 941 1353 556 -916 -1402 -53 1142 845 -52 -926 -941 398
1043C98P67q94q71k5L95P76K05r54n15N32M35J72j66p72p8R62J97o28j99r5J40
1064b18P80L5r99k56N26M42M11l81j209NJ282M98m71p41p02M48J357K61r39r12
1084g83l59R45J567k07j723q20O09J320J008q36j855l51J206J321N58j273k080
1101a753J39K163J206o38j693j383Q71K355O49j489j649n79J274K296K34k265
1117b62j709N11J922J649o86k487j068J349J913Q66j177k421n51K070J873j10
1133A682j744j912L04K385J273r94j702j119P21K249Q06j557j598l56J076J944
1149A458K21j959j211N54J101J099q2j721r08R58J080M28l73j304n03J084Q61
1166G83j37n01p13j41Q45M70l72k86k63q2N59K08m66m6K50j40n5M0j42L03M18
$$ plain form
1043 398 1165 271 -600 -625 -230 546 751 -203 -718 -186 249 421 255 -517 -595 367 564 -64 -263 -358 -218
1064 -218 562 597 -402 -658 -132 310 721 340 -869 -864 418 916 445 -296 -998 -550 807 1068 129 -783
1084 -783 -1142 -197 1370 1163 -560 -1380 -771 549 1557 721 -1134 -1485 -279 1042 1600 327 -1753
1101 -1753 -1614 549 1755 1117 -576 -1959 -1088 1267 1916 427 -1222 -1801 -527 1769 2003 -262
1117 -262 -1971 -1460 462 2111 1425 -1062 -2130 -781 1132 1998 821 -1600 -2151 -81 1792 1682
1133 1682 -62 -1974 -1670 715 1988 994 -708 -1827 -1106 1143 1949 392 -1206 -1562 -486 1458
1149 1458 1679 -280 -1491 -937 164 1263 1181 -540 -1448 -490 590 1018 645 -659 -1162 -78 783
1166 783 646 145 -568 -709 136 606 234 -52 -315 -397 162 370 -96 -142 108 -32 -87 -47 -189 114 532
1187E32m84n91J72L96M43K46p84r16L96J037M75k69j123r10R08J534J45r79j179
1206i51m59J223J728k03j693j141K85J648J444q37k066p30J034J729R04j340k178
1223a603j78J695J666J55j839j964O02K199J106o60j856j435J062K409O32j478
1239E13j834n98J567K188q8k034j394K70J699J609n56k201j008J048J766Q73j161
1256F59k050k88J595J379N5j288j555J57J749J064n86j412r69P14J680M27j063
1273B68j082k85P85J319Q1j223p99K31Q36Q14k40j154l74O15N34K29k14p17k23
1292e99N77L89r6k09l09j8L85L5k42Q8J09j47o6k1j8K90K23l31m08pL01N37J48
1315F11p37o61L26P59M64j94r59o50O38J099L09o07j189m97J162J364j49j210
$$ plain form
1187 532 48 -543 -371 25 468 714 -70 -986 -590 447 922 653 -470 -1380 -472 1062 1207 228 -951
1206 -951 -1410 -187 1541 1338 -355 -1496 -1211 437 1881 1044 -1022 -1752 -718 1011 1915 575 -1603
1223 -1603 -1781 -86 1580 1735 -104 -2068 -1466 733 1839 1179 -677 -2112 -1050 1359 1991 513
1239 513 -1321 -1919 -352 1836 1748 -286 -1680 -1410 289 1898 1342 -859 -1867 -819 947 1820 659
1256 659 -1391 -1679 -84 1295 1350 62 -1493 -1336 413 1477 891 -521 -1490 -776 904 1331 268
1273 268 -814 -1099 -314 1005 1086 -137 -936 -705 131 945 705 -449 -823 -208 326 555 341 -376 -599
1292 -599 -22 367 271 62 -247 -265 120 155 -87 1 110 -37 -103 -124 -142 148 371 40 -368 -375 -74 463 611
1315 611 -126 -787 -461 298 762 568 -391 -1041 -403 696 1005 398 -791 -1288 -126 1238 1089 -121
1333a21j069j8J467J340o08j644q61N81J712J065j181j936l70J240J657N07j581
1350A80j870J42J743J468j64j921j546P87K010R91q39j917j019J280K015M25j375
1367C90j750l57J625J752k32j698j282L03J644J283o30j807q42Q85J565O77j024
1384E02j574k84J184J196Q7j036j172M6J260Q96l86j042o60M04J047M25o10p17
1402d34k10L64P32K23o28m97Q8L47M06k1n02j47K36L7P1J46k20j35J45n9m3K14
1424A13kr4J1k55q1N08K32l60l16j46J55N92K27n47n28k8M32O94R2q43o46K59
1446e31Q03N97k92j038n33O39R94L53o33j158k93J046J079q6j071r76J31J307
1464C38R63n75j348o55O45J406O05j027j404j82J064J263J74j319j336L22J450
$$ plain form
1333 -121 -1190 -1208 259 1599 991 -653 -1514 -933 779 1844 663 -1273 -1643 -403 1254 1761 180
1350 180 -1690 -1548 195 1663 1499 -422 -1968 -1181 829 1820 981 -936 -1955 -675 1340 1765 390
1367 390 -1360 -1717 -92 1660 1428 -270 -1552 -1249 395 1678 1048 -759 -1601 -716 849 1526 502
1384 502 -1072 -1356 -172 1024 1111 75 -1097 -1051 209 1105 719 -323 -983 -579 468 893 283 -434
1402 -434 -644 -280 452 675 47 -450 -362 -15 391 370 -132 -279 -43 -6 65 211 -9 -144 1 -58 -101 113
1424 113 111 17 28 -227 -308 200 432 72 -244 -390 -235 357 584 37 -491 -519 -87 607 699 -144 -790 -531
1446 -531 272 869 577 -461 -994 -355 639 992 359 -799 -1092 -46 1033 947 -124 -1100 -969 338
1464 338 1301 726 -622 -1277 -632 774 1379 352 -1052 -1234 -170 1093 1267 -52 -1388 -1066 384
1481C84R69m10j482r58Q17J540M89q66j349n17J077J462J12j246j201M1J340J137
1499A339m44j335p23M13J207Q18o75j356l95P92J109L39r15j122O3R50P11n1p76
1518e1q06J84R43N24l18p38n05L96Q50J43m98m07j66K52N37J24m23l09qJ85L37
1539B46K6l24n6P6q0P7J74l6n0j20k14J13L65M8j42j86l20J01N95K24l84m56k47
1562e70L65P52Q2o61n36J8N34P20l1r01n84L27P84N61l36j037m25O58R08K55o45
1583B38r81j91R14Q96p4r11q55J66J116P37m94j052n29N17J114M62q22j061j14
1602i24P94R66J16j025r41K83J007O84k79j096o69O66J060K72n98r62l25Q57R90
1621H76j09q55o96N4R19P43m17r26l85L81Q33M24o17q36p2N55O58J34o87o63K08
$$ plain form
1481 384 1353 943 -539 -1497 -680 860 1349 483 -866 -1383 -306 1156 1268 22 -1179 -1138 202 1339
1499 1339 895 -440 -1163 -750 457 1275 600 -756 -1151 -359 750 1089 174 -948 -885 65 776 725 -51
1518 -51 -857 -673 270 794 476 -262 -767 -371 479 622 124 -283 -449 -197 340 464 41 -268 -276 -91 246
1539 246 272 -52 -108 -32 -112 -35 139 103 53 -67 -281 -168 197 245 103 -83 -403 -302 293 517 133 -323 -570
1562 -570 -205 547 629 -32 -568 -550 -16 704 673 -228 -812 -485 299 860 524 -513 -938 -280 628 883 238
1583 238 -743 -934 -20 876 802 -109 -964 -798 318 1055 561 -491 -1020 -503 611 1073 251 -810 -924
1602 -924 -130 836 952 -73 -1014 -731 276 960 681 -415 -1084 -418 642 914 316 -646 -971 -114 876
1621 876 767 -88 -784 -730 189 932 515 -411 -796 -415 418 842 225 -611 -683 -128 530 664 -23 -686 -478
1642d78O18L95j17o10m27L64N77J00k54l92k21L55M52o4l14j92j2K30K56j38k28
1663a00J4L5M2R7n2r4P9Rj33L0R0L0P6q6k75J8L14J59r5k57k82J54M76J59k82
1688A26m00k09L27O20N8n36m76mN38O22j22p85m42K90O88M61l38q99l44O07P86
1709E68K00o06q69j04Q42P38j17p95p10J75R88N94m46r01m33M57R63L62p20q62
1729f76j03O61Q25Q3q75p20K18P85N85k20q86m96M96P63K64m01p79k69O72O69
1749E96p2n39n37J1O64M81k86n52k50J88N55K68m29m69%L28L53K9m27k62J85K64
1771I9J48q2l01j46K66K06n0j61j29L8K03O7j69r2N1R6O9n2j78mJ76J08j09j73
1795a19o5J34K48mk99j55J19K38J73j26m03j06L34L12K9l18l87N8N16K77k21m25
$$ plain form
1642 -478 140 535 418 -192 -619 -255 322 422 168 -224 -445 -90 362 298 -16 -208 -220 10 266 128 -100
1663 -100 -86 -51 -9 88 36 -58 21 30 -103 -73 17 47 123 37 -238 -220 94 253 158 -99 -381 -227 249 408 126
1688 126 -274 -483 -156 464 522 -14 -490 -494 44 666 544 -241 -683 -393 295 756 418 -481 -825 -218 568
1709 568 768 162 -707 -811 31 769 652 -143 -853 -678 310 904 458 -443 -876 -419 544 906 186 -676
1729 -676 -779 -118 707 790 -85 -805 -587 198 783 563 -323 -819 -323 440 704 303 -476 -745 -73 596
1749 596 524 -15 -552 -541 123 604 318 -234 -484 -296 259 527 98 -371 -371 -43 310 339 -88 -350 -165 99
1771 99 247 165 -136 -282 -16 190 140 -21 -150 -112 91 158 -11 -103 -52 44 113 61 -117 -121 55 163 54 -119
1795 -119 -184 -50 198 194 -105 -260 -141 97 270 144 -259 -365 -31 281 310 -8 -395 -337 179 456 235 -190
1817a90k78K44O07J47m61m82p0M53N77n7o54m01K03N68M19k72p47k61M70O10K00
1838F25m86p15m9O84N42q7o21n75J76P68M19l62o67l29L93P52J96n62o20o0N63
1859a5O08m5o56m81J86O08M03k46o47k86L65N62J57l79n22q3M57M37q4m10l32
1880d03Q3M42K62k06l76j23J80L30R3k69k50O2J95J27j9j82j05J32J16k9p1o2
1902g3J9J47Oj73m8J31J09K2j38k05P5K58Q7j17k40j48J95L80J0l42k68J4L54
1925E5L32j45m61j94K08M26K42l00n22j03M07M50M8m73m70J14N59L38j89n28l25
1946e31K69O12K14m22n31j29M62N60k2n65m40J44N40L79k17o11k65L48N26J82
1966E03l85n63n4N24M32r2m78l80J72N32K74k90m64j83L07N00P0m15l86L8L97
$$ plain form
1817 -190 -468 -224 383 530 69 -413 -483 -30 547 490 -164 -565 -362 206 625 353 -394 -655 -185 425 625
1838 625 139 -576 -625 59 601 514 -107 -682 -506 262 681 319 -348 -677 -284 468 664 102 -518 -578 -15
1859 -15 593 548 -108 -589 -403 205 608 362 -285 -571 -206 356 513 134 -388 -471 -14 423 339 -71 -403
1880 -403 -320 122 384 178 -198 -321 -141 189 282 13 -237 -175 20 147 128 -54 -159 -27 89 60 -11 -73
1902 -73 -54 93 99 -74 -122 9 118 140 2 -203 -128 130 217 100 -140 -288 -93 287 297 -45 -313 -299 55
1925 55 387 242 -219 -413 -205 221 463 163 -359 -462 -55 395 443 -30 -500 -386 173 511 322 -206 -531
1946 -531 -262 350 564 142 -389 -518 -56 504 482 -83 -523 -379 161 540 323 -288 -553 -205 321 503
1966 503 118 -445 -499 25 457 365 -113 -493 -321 211 485 195 -269 -452 -145 355 425 10 -376 -338 59
1987E9L45j03m52k25K15L63J54k24l92p6L22K96l2k83k53P3L23J58j75k48n5J33
2009g7K37L0k27j40N6J67J16q3k16rJ95Q0p6j20p1J16J75m5j60p4O0J78R9j66
2033D5k52M2K31J56n3k88j91K04L12P0k36k91p9L17L70p8l93k93J33M33K79k54
2055A84m88j37L18M54J17m05m75J4M71M17q4n23m02K32N87K60l14n37k14L98N53
2076D26P5m59m88k2N03M86j39n69l25K01N19K98k86n64j58L71M44J11l82m68K5
2097d01M54L38r6m19k93J89M45J54k44l38j01K47L42qk94k16N7K55J93j28k69
2118a33n8J59J73J8j58j72O5J90M7j00j22l3J22J44r0j57j8R8J20L1j75j37J09
2141g7J73M6j01j81n0K10K01p8k11j39P6K74J45k03k89k7K06K91Rl27k61J30L11
$$ plain form
1987 59 404 301 -151 -376 -161 202 356 132 -260 -336 -14 282 250 -33 -286 -213 110 268 93 -155 -210 -77
2009 -77 160 190 -37 -177 -121 46 162 79 -137 -146 49 129 53 -67 -138 -22 153 108 -52 -126 -66 112 211 45
2033 45 -207 -165 66 222 169 -119 -310 -106 206 276 40 -251 -330 -13 357 279 -114 -407 -274 159 438 184
2055 184 -304 -441 -123 331 448 43 -432 -418 53 470 386 -137 -539 -307 280 540 226 -311 -525 -127 426
2076 426 501 42 -446 -468 35 521 382 -187 -512 -311 208 506 220 -344 -502 -131 313 424 42 -426 -401
2097 -401 53 391 295 -124 -417 -228 217 371 127 -211 -312 -65 277 269 -25 -241 -184 71 264 136 -133
2118 -133 -191 -32 141 159 1 -171 -106 84 131 31 -91 -124 -2 142 52 -105 -123 -25 95 126 -49 -186 -77
2141 -77 96 142 41 -140 -190 20 221 143 -68 -207 -131 143 288 85 -204 -231 -25 266 275 -52 -313 -183 128
2164A28J86j38l81j75K83L68M8l05l59nM13L33j49m08k50J74M65J98l08m51p5
2185d08L54M30K3m41l92J25M75K76j73m78k44K86M85J28l46m36r1M26M39p7m42
2206h1l28J03M49L06k32m69j67K63M05J44l42m10PL67L10m1l63l00J57L81J41
2227C00j49l24j31K31L15Kk24k11pK40J86r2k09p7P1J76N9j35j32L5R5N6l5r2
2251e2m8J05P1n9q8j5P7J06k1j68n7J10J45L7j29k10J3K32J70q2k39j62J32L19
2275A87J20k32l08l6K56L18%l51k89Q5L60K65j46m31k08K62M00J25k88m27o7L94
2297a1L76l9l85l53P8M85K82k17m24k11K40M39J60l42m18k4L43L84j7m16l16J49
2319b37L80K44j56m26j65K61L57P2k74l36k0L35K74q3l24k08J17L16J48j93k77
$$ plain form
2164 128 314 176 -205 -380 -97 271 319 14 -345 -350 63 396 247 -161 -411 -237 228 426 118 -333 -408
2185 -408 -54 376 399 -42 -434 -309 166 442 269 -209 -453 -167 318 446 100 -336 -427 -1 438 361 -81
2206 -81 -409 -306 143 449 217 -252 -419 -156 249 393 51 -359 -352 15 325 284 -79 -379 -222 159 300
2227 300 151 -173 -304 -73 242 244 20 -191 -198 42 228 136 -73 -150 -79 97 156 21 -111 -76 19 75 40 -52
2251 -52 -100 5 76 17 -71 -86 -9 97 76 -92 -149 -39 106 143 14 -196 -183 49 219 137 -102 -264 -132 187
2275 187 307 75 -233 -269 -13 305 305 -46 -335 -250 110 375 229 -202 -410 -148 252 377 89 -338 -405 -11
2297 -11 365 326 -59 -412 -334 151 433 216 -208 -419 -179 260 420 78 -340 -364 -21 363 346 -70 -386 -237
2319 -237 143 387 231 -195 -360 -99 258 330 56 -280 -300 35 309 226 -98 -306 -189 127 275 82 -195
2340a95n2J89K27M1k37k00P7K15J27p7k17r3J59J74oj11j44nJ73J08q9j29j9O1
2364b3J14Qj22o0O5P2L2p6j08J7J40M1p3j14l7J03J52k3j98q1J02J62Q4j46k07
2389a76nJ89J78ok36j91Q5L05J34j52k93j17K12L27N6l07k69QL10K96p8l86k42
2412c58J58L85J92k13m26j18L18L40O3l23l77J3L88L33j13l88k76J52M49J93k51
2433A41l75j28K67M01N7l29l42J7L14L31o9l75k30J46L10J90j54l32j28K08K66
2454A86O2k01k54j8K28J99m4k01j45M8J92J01r6j37n1O0J30L7r3q0K9M9K9ml9
2479a3mM1Pn5OL2L1Po4o6M1J19J8n6j29n0J16J63oj59j30j2J94J62p4k20j20R9
2507a22K35J14j47k76m8K02K44O1k64k65M2K90K07p2k80k32J54L40J28j94l17
$$ plain form
2340 -195 -247 -58 169 210 -27 -227 -150 65 192 115 -102 -195 -36 138 132 21 -123 -128 45 153 64 -65 -84 -23
2364 -23 91 99 -23 -83 -18 54 86 10 -98 -81 59 100 27 -87 -124 -21 131 108 -90 -171 -69 93 177 31 -176
2389 -176 -181 8 186 180 -56 -247 -162 143 277 125 -168 -285 -73 254 310 3 -266 -258 52 348 270 -116 -358
2412 -358 -200 185 377 164 -262 -380 -62 278 341 18 -359 -346 42 375 262 -126 -402 -250 199 392 141
2433 141 -234 -362 -95 306 363 34 -308 -291 23 354 285 -90 -320 -174 136 326 172 -160 -288 -80 186
2454 186 248 47 -207 -225 3 202 158 -43 -188 -140 52 153 57 -80 -131 -71 59 96 3 -77 -48 1 30 26 -13
2479 -13 -17 24 31 -24 -18 14 45 52 -12 -78 -37 82 100 44 -85 -135 -19 144 138 -21 -151 -163 31 193 119 -101 -221 -122
2507 -122 113 227 80 -196 -244 -42 202 263 -1 -266 -224 66 273 201 -79 -311 -157 183 311 117 -200
2528b00j03K58L21Rk92k72K8L08K75j16l51j78J35L35J68k11l53p4K63K93L9k84
2550bl05L6L13K48q5l04k09J36L22J34j68k76j07K06K83M4k49k27QK32K14m6k55
2573e7j57J09J94J18j02k19q0J45J61M7j17j80jJ23J15j2r5q9nJ25N2m7m5l9m
2598f0N9M5j7j6j6l2PL8M0Rk2p7k9Q2P6Qo5j23k8J32J17j9j29j31J9J79J37q0
2626A04j91j18P9K36J07j51k37o4J68K49O3k33k55J3K51K28k7l06k03J08L00J67
2648B88j23l09j63J99L15J00k21l19n8K66K99j3k80k54K9L07K40j04l23j81J30
2669a75L12J48j89l01q0K11K65N0k34k41JK64J99n0k36j79R9K43J10j13k07j04
2691b07J36K29L1j61j55k1J42J53j6j53j10L9J17R7l0j52m8N8Q6M0l7r1k1M7M1
$$ plain form
2528 -200 -303 -45 276 285 -7 -279 -251 57 332 216 -135 -313 -178 157 325 114 -239 -313 -50 243 282 -2
2550 -2 -307 -271 42 290 205 -99 -308 -172 150 284 116 -160 -267 -61 222 266 17 -210 -202 30 244 198 -57
2573 -57 -214 -105 89 207 105 -114 -194 -49 112 159 42 -138 -139 -16 99 87 -8 -97 -102 23 75 28 -17 -56 -60
2598 -60 -1 44 27 11 -5 -37 -30 8 48 57 35 -42 -71 11 87 95 30 -93 -121 11 128 109 -20 -151 -132 47 184 104
2626 104 -87 -205 -126 110 217 66 -171 -235 -67 182 245 12 -243 -230 21 249 222 -84 -287 -179 121 288
2648 288 165 -144 -307 -108 207 307 86 -233 -291 -25 274 261 -19 -273 -244 63 303 199 -124 -305 -175
2669 -175 137 285 96 -205 -285 -74 191 241 7 -234 -233 31 230 180 -56 -235 -136 107 217 104 -103 -207
2691 -207 -71 158 189 28 -127 -148 -6 147 131 -22 -132 -93 24 121 91 -61 -109 -51 35 75 38 -53 -74 -27 14
2716A4K4j9n1k4L7K6J4Qk7j9jLL8L7j9o9k2K6N9N3l9j00l8P3R3K8q8j21j1J10
2746eJ11Lj30j34K6J70J16o0j77j10J06J95Q4j40k07n4J58K19L6k18k01L4K14
2769C6J84m0k46j69J05K53J37j37k58j10J77K60N6j97k40n0K42K28l7k30k08M6
2791a98K66J80j10k69j23J36K48J01j53k59l9J80K12L1k05j99L2K01J65n2j89
2812d4j32P6J82R6q4j67p8J03J53M5j12j24k2R7J21k1r3p8J3P0O5k1o9n4L3M3
2838bM5j1n4j8J2J3K9J0j7l4noM2M9On5n1LO4O6j1q2o8J8J00O5m3j16o9P2J28
2869H0O4r4j52l9J04J53J3j49j47J1J71J46m7j82j09P1J88R9j06k00o0J32J93
2892A40M1j76j74J6J68J70k3k04j56Q4K16J11j04k31p3J33K04M6j59j97j3J80
$$ plain form
2716 14 38 19 -32 -56 -19 7 21 29 2 -17 -18 -15 23 60 41 -28 -50 -24 35 88 49 -51 -89 -16 77 105 17 -104 -115 -5
2746 -5 106 109 -21 -155 -129 41 157 97 -80 -190 -84 111 195 55 -152 -206 -48 171 207 -11 -212 -178 36
2769 36 220 180 -66 -235 -130 123 260 123 -135 -245 -68 192 248 51 -189 -239 3 231 194 -36 -244 -198
2791 -198 68 248 138 -131 -254 -118 130 231 78 -181 -220 -40 172 203 -2 -201 -169 32 197 145 -44
2812 -44 -176 -100 82 178 94 -73 -151 -48 105 150 38 -86 -108 -11 110 89 -4 -82 -69 1 66 45 -24 -78 -45 -2
2838 -2 43 32 -22 -40 -28 -15 14 24 7 -27 -32 -38 4 53 59 4 -47 -44 20 86 75 -7 -75 -57 43 108 65 -51 -120 -48 80
2869 80 144 50 -102 -141 -37 116 129 -20 -167 -156 15 161 114 -68 -177 -106 82 181 75 -125 -185 -53 140
2892 140 181 5 -169 -153 15 185 162 -42 -198 -114 102 213 109 -122 -195 -62 142 188 29 -168 -181 -1
2914aJ75k6j96j51M5K03J30r5j82r2J11J83P0j45j66j8J42J51Kj54j38N0J44R8
2938A40m9j38p8P7J26L4o3j17l4R0Q0Lo3p3kO3N8j3m6m0J4K7K1mk8j1lPRJ7Ro
2970Gk1k8J7N3J1j9n8k6M0Q0K9o5p5j9Q0J03j6r8r9L0J05J07n2j48q3P8J48P0
2998A51r1j72m2J23J50J8j38j71K8J61J32l9j76j25Q1J94R5q2k08o0J26J92N0
3021A97j76j54k4J69J68k4j93j21N2J79J13j05j80p9J21J65L3j15j53j7J42J23
3043A21j5j28j28M7J41Q1p0j16n6P5J17K4q3r2j1Q6R2j8q2n3K6P6M0l3p1rL7M6
3071D4kl9k7JK4J6j5k4nK1jlk5J8J3Pk9k4RL3M5l9l9j5M1M7K0n7o4RQ0P1l7q4
3105c0o4N6J05L1o3j11k8J01J27k4j14r3J6J21J06n3j61p1P6J40O5j09j56j6J21
$$ plain form
2914 -1 174 148 -48 -199 -154 49 179 84 -98 -190 -79 104 174 29 -137 -155 -13 138 140 -14 -152 -102 42 140
2938 140 91 -47 -125 -48 78 112 49 -68 -102 -12 68 71 8 -65 -67 -4 54 41 -5 -45 -31 -4 17 13 -15 -26 -29 -22 -13 4 13 7
2970 7 -14 -42 -25 28 39 20 -38 -64 -24 56 85 20 -55 -74 6 109 93 -5 -104 -74 31 138 86 -62 -145 -67 81 151
2998 151 60 -112 -154 -31 119 137 -1 -172 -144 17 149 110 -66 -191 -110 84 179 97 -111 -171 -45 147 197
3021 197 21 -133 -157 12 180 156 -37 -158 -106 73 186 81 -99 -178 -57 108 141 26 -127 -144 -2 121
3043 121 106 -22 -150 -103 38 119 49 -67 -123 -48 69 93 10 -82 -93 -7 85 67 -15 -68 -42 34 74 41 -30 -39 -2 44
3071 44 42 3 -24 -23 1 17 2 -22 -27 -6 -7 -10 -35 -17 -4 3 -26 -50 -41 -8 37 -2 -41 -56 -15 32 52 -5 -69 -60 20 91 54 -30
3105 -30 -94 -38 67 98 35 -76 -104 -3 124 100 -14 -107 -91 30 136 83 -78 -149 -73 67 132 23 -133 -149 -28
3130b8J46Pj56j18J9J62J12n1j56j05Q2J82O3j02j64l3J32J42J0j40j26RJ46J09
3154A42m6j45q5N9J40O1q0j32m2R8J02K7j04j07OR8R6l6r6n1K4R6L9m0q0k0N2
3181b4O2J3m7m5J0L9K8j5k9j2K6RKj0QoOk0j7K2J6J8k9l6k0L9M0On9l9lP4N1l5
3215B3p0m6N4R1K7p2q9LQ6P1J4j04r0L2J27O0m5j31m7P5J30L1j06j17j7J24J01
3242A15k0j19j08N0J23Q2o7j46n9Q8J35L8j11j28J1J09J14k2j23r2M6J42P8q6
3266E0j19m6Q0J30K0j03j06lJ12R7j3j23p7M4J05N5n8j11l0P2Q3K6q2q5MP9N5
3293E6qp9n0M2N9K9m6m4j1L8M7km6j7ML6J4k3jj2J8kJ0j5QJ8Kl7k4K7K0J8k0n0
3327d1nL9M1nm1o2J2P3M3l0p2m7M2R5L0o0r5j4P6J05mr2r8L4J02Q5m3j14n8O6
$$ plain form
3130 -28 118 125 -31 -149 -130 32 144 93 -63 -168 -86 96 159 57 -107 -140 -8 134 144 4 -122 -113 33 142
3154 142 96 -49 -134 -75 65 126 46 -86 -128 -30 72 99 -5 -112 -106 -8 88 52 -44 -95 -71 25 64 24 -56 -76 -24
3181 -24 38 51 4 -41 -31 8 36 21 -8 -20 6 15 17 7 15 9 15 -5 -22 0 16 34 5 -31 -51 -12 28 34 -25 -64 -67 7 58 23
3215 23 -47 -93 -39 52 79 7 -82 -79 7 78 92 -12 -102 -70 57 117 72 -59 -106 -31 99 130 24 -93 -110 14 115
3242 115 95 -24 -132 -82 41 123 56 -90 -149 -61 74 112 1 -127 -116 -7 107 85 -38 -130 -84 58 136 50
3266 50 -69 -115 -35 95 115 12 -94 -97 15 112 99 -24 -101 -57 48 103 45 -66 -96 -24 59 85 3 -82 -78 1 56
3293 56 48 -31 -81 -39 20 49 3 -41 -52 -14 33 31 -15 -32 -28 8 22 -1 -2 -14 4 2 12 -3 5 23 25 -12 -36 -9 11 29 9 -41
3327 -41 -46 -7 34 29 -12 -74 -62 11 54 24 -48 -95 -53 42 72 12 -83 -97 -21 84 80 -12 -110 -76 26 111 68 -46 -104 -38
3357c8J18L8p6j28l0J09J25j4j22r3OJ34Q1m3j26p4N7J36N8r6j31k7J04J21Jj02
3383a2j00J8J20P1l5j03o8N9J07K9n2q9l4P6Q6Pq1o8J9P4N6k9q3l0L4O4J3m2o0
3412e3KL9L9pl8m0J9L2J3Jl0j5J6K6Lj3j2PK3klj8K9J4j2k2j5RM2J0m3k3jM1K9
3447D7j1n6k7K9M9J8m0o0mN9M6on6o2K5O5M8m0q3k7N5P5K3p1o3%P9Q0j5j02n8
3478h3L5R6N4n4q9m2O8R4J6p5j02NQ4Q2k3r3o3J8R7N3n6q7l2N3R4J5o8p8jP5P8
3509G1j6q3n6K4Q4L9j0p7m4M8P3J8m6n3j2M1N3mn2k6qM5L7k1m3j2J1K8J0k4j4
3540a9j0K2J3nlj2oJ4mMLJ6oprPJ5jj0j2j1L0K6pj5l4JM0K5j0n3k3J9M5K5k2p4
3577d8mM9L9J2m1o8qO3N5j7n6m7K4P6L1k7p2j9L6P4J4n6n9mN8N7Mo8n0L0N7L7
$$ plain form
3357 -38 80 118 42 -86 -116 -7 118 104 -18 -111 -105 29 110 67 -59 -133 -76 60 118 22 -109 -136 -32 89 90 -12
3383 -12 -112 -94 26 97 62 -41 -109 -50 57 86 34 -55 -89 -13 73 80 -1 -69 -50 24 80 51 -32 -62 -28 36 49 7 -53
3412 -53 -51 -12 27 20 -18 -58 -39 -7 6 7 -23 -38 -22 4 7 -6 -18 -11 12 10 7 -11 18 32 20 -2 -17 -8 34 44 1 -22 -23 18 47
3447 47 36 -20 -47 -18 31 49 9 -51 -55 4 50 44 -12 -74 -49 16 64 24 -59 -86 -31 44 67 -4 -67 -67 12 92 77 -25 -83
3478 -83 -48 48 102 48 -41 -83 -15 79 95 20 -82 -77 7 89 66 -27 -90 -72 25 78 22 -65 -97 -44 50 65 -3 -81 -82 -7 71
3509 71 55 -28 -84 -60 24 63 53 -24 -68 -20 53 71 25 -28 -40 1 54 50 -2 -28 -36 9 46 25 -18 -30 -19 9 19 -5 -19
3540 -19 -29 -7 6 1 -2 -14 -20 -6 -10 -6 -3 13 7 0 -9 -2 13 12 2 -10 -21 9 35 28 13 -21 -20 20 45 35 -18 -41 -22 23 48 26 -48
3577 -48 -52 -3 36 48 7 -61 -69 -6 49 32 -24 -71 -47 29 60 33 -39 -58 -22 52 66 10 -49 -53 5 62 66 -2 -52 -22 35 72
3609G2k8p2k0L7M3K6l9o1qM4N2rm2n0PM4M1l5l1l0K1N6K7m3l6j5L9M9om0j5LL0
3642A1L0j3k1j5QL8Kj1k6lJ2J5Kj9j6rK6qonn%J0J2j0nJm%J3j5JJ1mjNJ5ojrj3
3683a3MK9Noj2rQJ8K0k5k4lK5J3Jm0j5QK4QOl4k9J6L5K0k8k4j4K0L4J7l1l3pM3
3719GL1mk9l8QM8J7j1l8k5L3M0J6l7l0lJ1M1Ok9l9NK6K4%l5k9PK3K7Lm5j9J6J9
3754cK4j4l1pK3K5kj6j5%K4K2ok8oQK3J0pk6j0J3J9rmnKORj1nj4R%Llp%Rjjj0
3796a2jJ7j1jqOK4Rj6qrJ3K7Rk8j8QPL2j3k7j4RK2J4j3k5j1J9K7rj4l9MK7K1q
3833A0k8k7K5K3K8k2l5k4L7L4J0k2m1JL8L5%l9k5J5L5L0k4m7j5K9K8Qk6k8qM2
3865A7L1qn6j2NL8K0j8m8nK7L2j0k0l7K0K7J5j1l4mK5J6%rk1J4K5J0Kl1j4K4J
$$ plain form
3609 72 44 -28 -48 -11 32 58 19 -42 -50 -6 46 37 -5 -55 -48 -4 37 2 -29 -59 -38 18 45 2 -34 -49 -10 39 33 -7 -22 -19 11
3642 11 41 28 7 -8 0 38 40 29 3 0 12 27 29 10 -6 -15 11 3 -3 -8 -13 -13 -3 9 -1 -6 -5 -9 -9 4 -11 -10 1 -3 -4 1 16 10 9 0 -13
3683 -13 -9 20 25 19 7 -2 6 24 44 19 -5 -8 17 30 31 -9 -24 -16 8 16 22 -12 -41 -25 10 30 2 -22 -36 -16 18 35 4 -29 -36 7
3719 7 38 34 5 -33 -25 23 40 29 -9 -34 -1 39 55 18 -12 -15 -4 37 43 14 -25 -20 6 30 30 -5 -34 -27 -4 23 26 -19 -38 -22 -3
3754 -3 21 7 -24 -31 -8 17 15 -1 -16 -16 8 30 24 -4 -10 -2 21 31 24 -2 -12 1 20 11 7 2 4 10 19 8 3 -11 -2 -2 1 -2 -9 -9 0 -1 -2 -12
3796 -12 -13 4 -7 -8 -16 -10 14 23 7 -1 -10 3 30 39 11 -7 1 8 40 27 0 -14 -5 17 31 18 -7 -18 1 28 19 5 -34 -30 -3 18 10
3833 10 -18 -45 -20 3 31 9 -26 -50 -13 21 31 9 -32 -31 7 42 42 3 -22 -7 28 58 34 -13 -28 1 29 37 11 -17 -25 17
3865 17 48 40 -16 -28 -23 15 35 17 -31 -36 -9 23 13 -7 -44 -24 3 18 7 -27 -31 -6 10 10 1 -20 -6 19 29 31 0 -14 10 11
3899A1Rj2k2K2J5j1kj3MNJ6j9ok7K9J8ol6j0NK6K5pl6j3K2M4Nl7k9mM9K7jn0k1
3935c0L5L1K9l2m6j9K3O0Lm0n8RM9N2l1n8m1M2N7J9m7o6MM0N3Km3n4KN6N7k1n8
3968b1l4L9N0K3l2n8qM7M2kl5m0RM5K7j3l6k5J4M3ll0k5oK5K6ll3l3K6K4J6k5
4001fj8qK1K2oj0k2K7J0oOj9kK6Qqk6KL9Kj8j6j1K1J9Ol3j8mL5K4k8k8j6K4M2
4037C1Ml9m6KM2M9k1n9k8L1N6L5l8n8l1O2P0jo2n2QO5N5k3p6l2M1P2J5m2p2k6
4069f8N2Q2no4p3J1P9N2l2o3m3L6P3K6m4p6j7N5O7pm9n3RO8L7j4o1l4M1O6J0k6
4101C5n7k4M6N1ok7m9J1M5R%l5l0J8K9Kj8k5QKK5mj1k1J3J5mj6J2QJPk6J2J5P
4137A8j0k6mK3L0Jj5k6k2M5K8j6k2l3J5K8M5l7m5k5J6O0J8m6m8k4N7N5kn6n6K4
$$ plain form
3899 11 20 8 -14 8 23 12 10 -3 1 6 22 3 -3 -30 -1 17 11 -25 -35 -30 -4 21 14 -22 -35 -13 31 36 -1 -30 -34 15 42 41 -9 -30
3935 -30 5 36 65 33 -13 -32 -9 51 54 14 -44 -35 14 66 35 -23 -64 -22 35 54 7 -59 -55 -15 38 40 -3 -57 -55 1 58 37 -21
3968 -21 -55 -16 34 57 25 -33 -41 6 48 46 11 -29 -20 25 52 39 3 -22 -8 35 32 2 -23 -29 -4 22 19 -14 -47 -21 3 19 -6
4001 -6 -24 -32 -11 11 5 -5 -27 0 10 4 10 -9 -11 15 23 15 -11 -9 30 32 14 -2 -13 8 27 33 0 -18 -22 13 37 9 -19 -35 -11 31
4037 31 35 -4 -50 -48 -6 43 22 -37 -65 -34 22 57 19 -39 -70 -8 62 61 -1 -53 -45 20 75 52 -24 -56 -15 57 72 30 -42 -68
4069 -68 -16 66 61 -3 -76 -65 14 66 34 -29 -72 -36 37 63 19 -57 -74 -19 48 41 -8 -61 -52 16 53 39 -22 -56 -15 51 61 35
4101 35 -22 -46 0 51 45 18 -31 -20 25 34 34 -1 -31 -13 16 18 0 -25 -17 -15 10 6 -5 -26 -13 2 -2 -18 -6 2 3 10 -16 -4 11 18
4137 18 8 -18 -22 1 31 32 17 -9 -31 14 42 26 4 -29 -14 14 59 22 -23 -48 -32 28 46 0 -48 -72 -15 40 38 -18 -74 -50
4169e0O6L9l9o0k9M4O8K3n7n9qO8O4j1o2o7L2P4N2l8q2k9M5P4J5n9o3j4O1O6p
4200E7p4n6J8P0M3l5o8l2L6P0J5l3p6QM6N7Ln9m9J2N8M2j8l9l6K2O2J2k6m5kK0
4232CK4J0l3k2j5L0J2Ok1j4J5QLrojqP%KJ1Npj1MmL3j1k9KJ5K4Pk2k1j0L6L1M
4271D8m0l6J9L6L4l5m5k1J6N7K0m4n0j5M4N6pn1m2NN1M3j2o7l7K5Q0K0k2p0j4
4302e4M1O8On7m6oN9M7nm5n9K3N6L6k5n6l5L7N7J0m1n7rN3L9om7l0J2L4K0j7l9
4335c6k3L1L9J0j5l2kJ4L3Lj4k0JJ8K1jk9KlK0J8j5j8JKMPj0k2kMJ3nklkmNMK
4375frMj6LJ6RKj6kKK6Qj3k3PJ3K2Nk2k4LL2J5j3l1j8J7K3J6k2l3nJ6K5Jj9k4
4412c1kK5K5Jl4k1LL2K0ql6k2K7L5J5j4l7kL1J5J2j6l7J1K5K5j0l3j6J3L1J1k7
$$ plain form
4169 -50 16 55 16 -44 -73 -29 39 62 5 -54 -62 6 70 59 -3 -70 -38 36 88 50 -32 -61 -16 58 73 14 -49 -63 -2 64 57
4200 57 -17 -73 -55 15 58 23 -45 -77 -41 29 44 11 -65 -57 -11 46 49 -10 -59 -47 11 53 35 -4 -40 -18 44 56 30 -15 -17 3
4232 3 27 37 4 -18 -33 -3 9 15 -6 -20 -5 3 6 -3 -9 -10 -18 -11 -11 -9 2 7 0 -11 -7 -11 22 11 -18 -16 -1 23 30 8 -13 -23 13 44 48
4271 48 8 -28 -9 27 61 26 -19 -40 -24 33 53 9 -41 -56 -12 44 37 -14 -56 -51 0 43 31 -36 -73 -48 32 52 30 -40 -54
4302 -54 -13 55 61 4 -42 -48 11 58 53 8 -51 -28 28 64 39 -17 -52 -15 42 52 11 -46 -55 -2 37 31 -16 -46 -34 0 20 3 -36
4335 -36 -59 -28 11 21 6 -26 -28 -14 19 22 8 -12 -11 7 28 27 -2 0 -3 17 35 20 2 3 5 9 16 6 -16 -18 -14 -1 -6 -8 -11 -13 -17 -12 -8 -6
4375 -6 -15 -11 -27 -24 -8 1 3 -13 -15 -13 13 21 8 -15 -8 5 27 32 10 -14 -11 21 36 23 -8 -26 -9 14 30 8 -25 -30 -14 11 12 -7 -31
4412 -31 -33 -8 17 18 -16 -37 -34 -2 18 10 -26 -48 -21 14 29 15 -22 -24 7 22 34 18 -19 -8 17 42 32 -1 -17 -4 27 38 11
4445A1k5rK0PJ0k3j4rJ5K3ok0kKJ9Nnj6KRJ2J5j3j1qJ4J6jpkkKLj0PKmKrNLko
4488@O%KpqKrnJ3%%lJkQRj1%rJ0NkKOpJ4J0%j3mPoQqoJ0rRokj4J0jJ0pj0rRMM
4538Aj9MnMJ8pMj5jRL%jKOLkNonJ1lK0j3pJMLNj9lLQoj2ljONj%j2OnQLoJLR%P
4590A0q%Mjj5J5pQRnKJlMMKj5LKJJrLj2MnL%njmMj2QqMJ5JpoKJ2QJ1j8jNJ4ml
4640A1Kj3JK2jmj4pQMOj4j2OQkPj3lpJ4mmrqJ0LmMnJ0KQmnkK7j0%Qj3L%K1pj6
4686DJP%%nMkj1J2j0Lj8NkJ5mj0%JLnJJ2rJkLj2J6KMlLkQPj2m%J0KJ6j6oqJ6Q
4733B3j4pmj0J4Jj6lj0K4l%k2qK1J0Qqj5%KK6Rk9llK3J9pj8%jJ0J1rj5j4K6PJ2
4773B7k1j7rK4K2j9j2j5JJ5J0k5oj0J6J3Kj0j6RK2J5j3j4j6J9J0Qlj5QJ3J0nn
$$ plain form
4445 11 -14 -23 -3 4 14 -9 -23 -32 -17 6 0 -20 -22 -20 -1 4 -1 -17 -15 -6 6 21 8 -3 -11 3 19 18 11 9 7 9 12 2 9 11 7 9 0 5 8 6 0
4488 0 6 6 8 1 -7 -5 -14 -19 -6 -6 -6 -9 -8 -10 -2 7 -4 -4 -13 -3 2 0 2 8 1 15 25 25 12 8 15 9 17 9 3 13 4 13 7 5 -9 1 0 10 3 -7 -16 -7 -3 1
4538 1 -18 -14 -19 -15 3 -4 0 -15 -16 -7 -4 -4 -5 -3 3 6 4 9 3 -2 9 6 26 13 6 7 11 14 19 0 -3 0 8 2 -10 -13 -14 -8 -3 -4 -4 -16 -10 -15 -7 -4 -10 -9 -6 3 3 10
4590 10 2 2 6 5 -10 5 -2 6 15 10 12 13 10 14 18 20 5 8 10 11 12 3 6 -6 -2 -7 -4 -4 -9 -10 -14 -10 -22 -14 -22 -18 -3 -2 -9 -15 -13 -1 7 18 0 -1 4 18 14 11
4640 11 13 0 1 23 22 18 4 -3 5 9 15 1 -11 -5 3 1 8 -5 -8 -15 -1 -5 -9 -18 -26 -16 -13 -17 -13 -18 -8 -6 2 -2 -7 -9 18 8 8 16 3 6 6 27 20 4
4686 4 5 12 12 12 7 11 9 -2 10 0 3 -15 -10 -12 3 -1 -11 -11 -10 -7 -12 -11 1 -8 -7 -9 -6 -18 -2 0 4 1 4 2 10 17 5 1 1 11 13 29 13 7 -1 15 23
4733 23 9 2 -2 -12 2 3 -13 -16 -26 -2 -5 -5 -27 -35 -14 -4 4 -4 -19 -19 -17 9 18 -11 -14 -17 6 25 18 0 0 -1 9 20 11 -4 -18 8 15 27
4773 27 6 -11 -20 4 26 7 -5 -20 -19 -4 6 -19 -25 -35 -19 -6 -4 -14 -30 -21 1 16 3 -11 -27 -8 2 10 7 -8 0 13 23 18 13
4808A3j4KK0normOJ6j2j0KqK0Ql1jMlOj3Mj6J7MQqj2J0POnqKJ0KRrKNJ1Rk1mq
4853dK2J2j3k2K%J8J0k0j6j5K5NMl5j0J3OK1kk0qKK8J7k8j5jJ3L3j0k2j4J0K9
4888A5K0k6k0nK4K4qrl4mL2K1nl7k0J1L3J1k7k5nJ5K5ok1j6NK1J8mk6oJ2L3qp
4924Ak2JK7J1jj9lJ1K0Kj9qoJ8Rj2j3%KMJ0j7rqJ2O%jk7K2J1nk1mNK2j5J1j1L
4964a3J1J4Ll5NRK9lrk2OJ4K7rk6j7kL3J1k0j9j2J5J6Qk4j6jK2J8j1l8KOM3Ol2
5001a1l0RK7K6Lm6nJ2K1L4j7m0jMM4Nj5l1lK8K2j5k0l1J9K7J2j9l1rK3J6j0j3
5035a5k9J8K2J3j5j4k5L1K4jqj4mK6J1lj9mMJ7Mj1k0LRJ7mj4oMJ6Jj5j8kK4Rj3
5073ak3lNJ6Ok4KLK0Qj7j0nPK2%j4qQK3Pnk0lKL3Kl1k7J8K3J7pl3k0J8L1J1k9
$$ plain form
4808 13 -1 1 21 16 10 1 -3 3 19 7 -3 -1 -9 11 19 -12 -13 -9 -12 -6 -19 -15 -31 -14 -10 -2 -10 -22 -12 -5 1 -4 -12 -10 0 2 11 2 4 9 20 29 8 4 -4
4853 -4 18 30 17 -5 -3 -3 15 25 5 -11 -26 -1 4 8 -27 -37 -24 -18 3 1 -19 -27 -25 3 20 -8 -23 -24 -11 22 12 -10 -24 -14 15
4888 15 35 9 -11 -16 8 32 24 15 -19 -23 9 30 25 -12 -32 -21 12 23 -4 -29 -34 -19 6 0 -21 -37 -32 -11 7 3 -23 -29 -17 16 8 1
4924 1 -21 -20 7 18 17 -2 -5 6 26 28 9 1 -5 13 22 10 -3 -3 -1 3 13 -4 -13 -21 -9 -3 -3 -4 -31 -9 2 -3 -24 -28 -23 -1 -16 -5 -16 -13
4964 -13 -2 12 15 -20 -15 -6 23 20 11 -11 -5 9 36 27 1 -16 -18 15 26 6 -13 -25 -10 6 14 -10 -26 -27 -5 13 2 -36 -34 -28 15 21 -11
5001 -11 -41 -32 -5 21 24 -22 -27 -15 6 40 23 -17 -18 -14 30 35 20 -11 -14 14 36 21 1 -30 -11 16 28 9 -22 -31 -8 8 -2 -15
5035 -15 -44 -26 -4 9 -6 -20 -45 -14 10 9 1 -13 -17 9 20 17 -2 -6 -2 15 19 8 -12 -9 0 17 13 -1 -7 -3 13 14 -1 -19 -21 3 12 -1
5073 -1 -24 -27 -22 -6 0 -24 -22 -19 1 9 -8 -18 -23 -16 6 6 -8 -16 -8 15 22 17 -3 -6 -4 29 31 0 -27 -9 14 31 24 -9 -29 -11 20 31 2
5112Bk5nK6J5Kl8qjM0J0j3k8j1J3L8%k0k7jK4K5Nl4j5K8K6J4k2l4qL4K3j0j7l0
5147b2lL1K4j8j3l1J4L3kk4j9jK9O%j7rPJ0J5j7j5JJ4J8jj1r%J8J0j2qRNRjj4
5185Fm%J4lj1j2J1J1knj8j3J5J5pj5qmK1K0j7k0MJ4K5jl7kJ0K5J4j8j3k8K7L1
5221B5Rk2k4nJ9L8j0k6k4OL1J5j5m2oK4K5Lj3l7JK0J7Nl5k2MM5Pj0l1j1L4L5j0
5256B0j3k4oK6L5km3okM0Qpk4j7OK8mpl4jJ2K6j5Qk1JJ2mjj4nJJ8Lj1pJ4J5kJ
5296DrQkOj%kOnMLk%Jr%jMQj2rj0JJ7Lj4mj4J2J0Mrj3j4K6J2J4k5k3J5J8L7j1
5339B4l1j0RJ9K0rl6nK7J9Mk4j8lK1L3j1k8l5J2M5Rk0l6j8J7K9J8k4k7rK3K9Q
5373B2m1j8OK6K9j1l2nNM0K9l2l8jK9J2J5k3k4j1L3J9lj9k7J3J1J2oj4k5J7J0
$$ plain form
5112 2 -23 -28 -2 13 15 -23 -31 -32 8 18 5 -23 -34 -21 17 17 -3 -30 -31 -7 18 23 -11 -26 2 28 42 20 -14 -22 12 35 25 8 -22
5147 -22 -25 6 30 12 -1 -32 -18 15 13 -11 -30 -31 -2 4 4 -13 -22 -15 -5 10 -7 -22 -21 -7 11 10 -1 -10 -10 8 18 6 -2 7 12 21 20 6
5185 6 2 2 16 13 2 -10 1 12 10 5 -13 -26 -11 4 -3 -18 -26 -30 -9 11 -6 -26 -22 -8 17 16 -21 -23 -13 12 26 8 -5 -33 -6 25
5221 25 34 12 -12 -17 2 40 30 4 -20 -14 17 32 17 -25 -31 -7 18 21 8 -29 -28 -8 9 14 -21 -43 -39 6 13 3 -28 -39 -5 30 20
5256 20 7 -17 -23 3 38 36 -7 -13 -15 25 33 26 2 -15 -9 19 15 8 -26 -27 -15 11 -4 4 -17 -16 -4 -8 -9 -23 -28 -27 -9 -6 -17 -24 -10 5 3 4
5296 4 -5 3 1 7 6 6 4 10 5 9 12 10 10 11 2 2 1 5 13 1 -8 -18 -17 0 3 -11 -15 -29 -17 -7 -3 -12 -25 -39 -13 -1 13 -12 -35 -20 -2 35 24
5339 24 -7 -17 -8 11 31 22 -14 -19 8 27 31 7 -11 -14 7 40 29 1 -34 -22 23 32 12 -24 -42 -25 4 22 -2 -29 -38 -15 14 22
5373 22 -19 -37 -31 -5 24 13 -19 -24 -19 21 50 18 -20 -21 8 20 35 12 -12 -23 10 29 26 7 -20 -7 4 16 10 -4 -29 -12 -2
5406blJj2rNQJ4j5rqJ3J9nmpN%OJjKLO%QooKoRkQk3jLJJ4rj4joJ1J2rk4%J5J3
5454cJ0j4k0mQJ9J4j3j5j3K5J6Jj0k6J3K8J2kk4k5K2K2Nj0l1k0L7K6mk3l7jK6
5488a1L3k3k7j4kL9K2k2k1j9K2L3K2l7k2j1L6L8j5k5k2KL3K0jl3j3OL9Pk9j2j0
5521a7ML5Mk0k8rK6K3j0j9j6KJ7%lj0j5J1QJ9ol3J7RJ1Ppj5KJ5J0oJrMjML%np
5562djOJ%moj1J1J1kj9%rJ5J3Kj8rPJ5KJ0k9j0J4L3J5l2qj7J3M1pj1k1qK4L0O
5601D3m5k9J3K6K4j6k7k6K3K4Nk1l0j2L5J9%k0m2K2L5J8j5k3k0PN0K4l8k6qL1
5633AK6Nk9k0JK3L3ql2k1J8J7J8k1k5oMK4lj4j8lJ6J5j1rj6J0J2OrllOLLOKNJ
5673DkJ3omm%PnRJkoj%oJ5j5qqJ6J4j6j4rKK2J1rl4kJ4J2NMl7NK1K9km0jJ4K2
$$ plain form
5406 -2 -5 -4 -16 -25 -20 -12 2 -13 -22 -30 -17 2 -3 -7 -14 -9 -9 -3 -2 -3 -1 2 8 8 16 10 4 6 0 9 7 15 -8 -9 -6 -5 9 0 -14 -15 -21 -10 2 -7 -31 -31 -16 -3
5454 -3 7 -7 -27 -31 -23 -4 10 -3 -18 -31 -6 10 11 1 -25 -12 16 28 26 2 -23 -1 21 26 16 -15 -35 2 28 24 1 -36 -37 -11
5488 -11 22 -1 -28 -42 -44 -5 17 -5 -26 -45 -23 10 32 -5 -27 -38 -2 36 21 -4 -26 -24 9 29 28 -5 -18 -12 27 34 5 -7 -17
5521 -17 -13 22 26 6 -22 -31 -5 18 8 -11 -27 -25 -8 -8 -11 -21 -36 -25 -17 2 -4 -37 -20 -11 0 7 0 -15 -13 2 12 6 7 -2 2 1 5 8 8 3 -4
5562 -4 -5 1 2 2 -2 -8 -19 -8 3 1 -18 -18 -27 -12 1 3 -15 -24 -17 -2 0 10 -19 -29 -15 18 33 1 -7 -24 -11 30 23 12 -9 -17 7 37 43
5601 43 -2 -31 -18 8 32 16 -11 -37 -14 10 15 -6 -36 -48 -13 6 6 -14 -56 -34 1 19 4 -19 -39 -32 18 42 4 -22 -30 1
5633 1 27 32 3 -17 -16 7 40 32 0 -21 -3 14 32 11 -14 -20 -16 8 5 -9 -27 -30 -14 1 -10 -19 -35 -25 -13 -7 -16 -19 -22 -16 -13 -10 -4 -2 3 4
5673 4 2 15 9 5 1 1 8 3 12 13 11 5 4 4 -2 13 -2 -10 -18 -2 12 -4 -18 -27 -25 -3 8 -1 -35 -37 -23 -11 -6 -2 -39 -34 -13 16 14 -26 -27 -13 9
5716IK8j0l7j4K2L5Kl0k1j4K5L8Om5k8J1K3K1j2l2j5J1L3J1j5l6mJ7L1Jk6l2Q
5749c9K5L2j0j9j7RK6J8j2k5MJ1K4Lj9k1PK5k%k4mMK3Jk4Kj3MMoonKJlJ2oOJQ
5790cqnJ0LlqKJ1KJ4qj3jK1J9j9j4kLJ6pKj4k2K6J0J1k2l3jJ7J5J0l2j3LK7K1
5828A5k0k7j5K5K8J9k7k5kL3J9Ol2k1J1M1J3ql5j7K3K5Mk4k8j2L2K1mk7j9J1J9
5861BJ7j3k3k8K3K3Rj4l1J1J6QQk0j8J2J8K3j6j2mPK5J6j9k2mJ0K2loj6mOMj2
5897eJnJ1nlJ2ooj6J2kJmQqlKJ4J4j2oj3J4J7J%j7PPJ8nk0njJ8J0j1k6JJ0K8%
5939B7j7k1j2RK3Nl1j6OJ7J8j0k9j1J9K2J1j5k2mK7J3J5k9j0QK5J7nj9l1J1M1
5972C2Rj3m3nJ9K2J8l1k2rK0J1lk0j3J0J1J5j0j9rRK0onj1JJ8J0Mj1mNJJ5j6Q
$$ plain form
5716 9 37 27 -10 -24 -2 33 35 5 -16 -30 -5 33 39 -6 -34 -23 0 21 9 -23 -38 -27 6 17 2 -34 -38 -21 10 11 -15 -47 -39
5749 -39 -14 18 8 -11 -28 -19 7 25 13 -12 -8 3 27 30 11 -10 -3 22 20 20 -4 -8 -4 19 20 -4 -2 -15 -11 -7 -13 -19 -24 -22 -21 -24 -12 -18 -12 -11 -3
5790 -3 -11 -16 -6 -3 -6 -14 -12 -1 1 15 7 -6 -7 14 33 14 0 -2 1 17 10 12 -2 -24 2 12 23 1 -32 -33 -16 -1 9 -23 -36 -33 -6 15
5828 15 -5 -32 -47 -22 6 25 -2 -27 -29 4 23 29 -3 -24 -13 28 41 33 -2 -19 4 29 33 9 -19 -31 1 22 18 -9 -28 -17 2
5861 2 19 6 -17 -45 -22 1 10 -4 -35 -24 -8 0 8 -12 -30 -18 0 23 7 -5 -9 -2 23 39 20 -2 -6 4 26 23 17 1 -3 3 7 -5
5897 -5 -4 -9 2 -3 -6 6 0 -6 -22 -10 -12 -11 -15 -7 -15 -18 -16 -2 12 0 -6 -19 -5 12 13 13 -4 3 10 28 23 3 -2 -3 15 25 14 -12 -11 -1 27 27
5939 27 10 -11 -23 -14 9 14 -17 -33 -27 -10 8 -2 -31 -42 -23 -1 10 -5 -27 -31 -4 9 24 -5 -15 -7 18 35 30 11 -20 -9 32
5972 32 41 28 -15 -20 -1 21 39 8 -14 -23 -3 8 5 -15 -28 -18 -7 8 -2 -21 -30 -21 -1 -7 -12 -23 -22 -4 6 10 -1 -5 0 1 16 0 8
6009Hj2LJ0jNpoJ0mnKj0Rj0%j4J9%j0j3J0J3MnqqnJ7J1j2ooJ1J5Kj0plJ9J6Pk8
6051ALj1K9Jjj5k5NL1Kol0qJ9J4Lk2j8j1K7J0jj6l3L7J3Qj8j4mJ7J9Mk2%kK0Q
6089A4%j4rOK5Kj3oj2J9jKqjpPQj7Nj0KRj0Kj2nKRqJ0NNj3R%jjRKmqJ2Nk%qK0
6136A9j0jqLnMJ0ollpJ3%kk8J5qJ8lk4jPJ3KKj7jJK0J6j4j2ORKK%qnK3Jop%RJ2
6182B8j1j2j4JJ9Jmk5jJ0RMj0%qJJ5oj2nOJ4Lj0KrJ5J3Kj9lKJ6kLLj7J8Onmj4
6224@QjJ2k3JPj0JKlqQKKj0LlpNQJ2j7JkJ8rj4J7OpQj4NQNLj2POMqOj2nrJ4Lo
6272Bk2J1MJ1oj4mNmRj0j1J1RMjllJ0OJ0j0njJ1LJ0j2j0QOK3k2j6RpJ6Lrk4lK2
6314FLnk4MNOJ0j3j9OJ6J0mj3k2K2MK2j3oj0LK8J0j1j8J2NJ1Lj4j8PJ1Qj2rNO
$$ plain form
6009 8 -4 -1 9 8 13 6 0 10 6 1 3 -7 2 -8 -8 -22 -3 -3 -13 -26 -16 -3 1 -4 -12 -20 -25 -8 3 -9 -15 -21 -10 5 7 -3 -10 -13 6 22 29 1
6051 1 4 -7 22 23 22 7 -18 -13 18 20 14 -16 -24 -5 9 12 -10 -28 -39 -12 -2 -3 -19 -52 -15 -2 6 -12 -26 -30 -13 6 10 -12 -12 -14 6 14
6089 14 14 0 -9 -3 22 24 11 5 -7 12 11 13 5 4 -3 4 12 -5 0 -10 -8 1 -9 -7 -19 -24 -22 -13 -21 -11 -6 -1 -14 -5 -5 -6 -7 2 4 0 -8 4 9 7 7 -1 19
6136 19 9 8 0 3 -2 2 12 6 3 0 -7 6 6 4 -24 -9 -17 1 -2 -26 -27 -20 -7 -5 -3 -20 -21 -20 0 16 2 -10 -4 5 7 9 9 1 -4 19 20 14 7 7 16 28
6182 28 17 5 -9 -8 11 12 8 -17 -18 -8 1 5 -5 -5 -13 -12 3 -3 -15 -20 -14 0 3 -7 -5 -14 1 14 16 -3 -6 -4 12 10 13 16 -1 17 23 18 14 0
6224 0 8 7 19 -4 -3 4 -6 -5 -3 -6 -14 -6 -4 -2 -12 -9 -12 -19 -14 -6 6 -11 -10 -12 6 -3 -17 0 6 -1 7 -7 -2 6 11 14 2 9 15 19 11 17 5 0 -9 5 8 2
6272 2 -20 -9 -5 6 0 -14 -18 -13 -17 -8 -18 -29 -18 -9 -5 -6 -9 -12 -2 4 14 4 -1 -2 9 12 22 10 0 8 14 37 15 -1 8 1 17 20 11 -13 -16 6
6314 6 9 4 -20 -16 -11 -5 5 -8 -27 -21 -5 5 1 -12 -34 -12 -8 14 1 -5 -15 -12 16 26 15 -3 9 14 25 28 14 -4 3 14 22 10 1 6 12
6353A2Jj0roNqJ4jj3LpK5pj5NKMJmNj0KJ2%lNlJ5mkrJ5ojjJ%jJ0j1j7JJ0MNj2
6399cj2lJ3Nk1Oj0QJ5nlj6PKK0Pj4jj0K0Rkj7%J5J0kmk1pL8mPk9qOK8nmk8kJ8
6441C%J3k1j7j5L7kOj9k0PK6J1mj9mKK2J7j9j6OJ8J5mjj5mK0Jlk4j4J9J3lj1%
6479ArlQPj7nMRj3J2pJ3oj0J6%Nklj2LJ0LMjj4J7KJ1j6Pj1J1OPj4qj0J2J4kk3
6521dj8J0J5Noj8p%K3Kj9j6J0J3J4mj3mLJ5K8j6j8mJ6J1J5j9k8QJ0L7j6j0k2O
6557aJ5J7j3k3j2J5J4Kj4j9j6K2J2%j1j7pK2J5Kk4pJ0J7J1oKj9J7lPNj0%NJ0k
6594A6prPnJ3lpmkoKJ4j2mlljJ4kqLj5K0jPj4j1MPJ9jlk3J4K2Oqj2j6J4K4njk2
6638bmJ6J7lj8j9kK0Ljk2j5J1J0J6nk5qK0K2Nj8k7oK6J4Jk2NMK5J1j7j9j1K2J3
$$ plain form
6353 12 13 3 -6 -12 -7 -15 -1 -2 -15 -12 -19 6 -1 -16 -11 -9 -5 -4 -8 -3 -13 -11 1 1 -2 3 0 15 11 9 0 15 9 8 7 8 8 7 17 6 -11 -10 0 4 9 -3
6399 -3 -15 -18 -5 0 -21 -15 -25 -17 -2 -7 -10 -26 -19 -17 3 10 -4 -5 -15 5 14 12 -5 -5 10 20 18 14 -7 -14 24 20 27 -2 -10 -4 24 19 15 -13 -15 3
6441 3 3 16 -5 -22 -37 0 -2 4 -15 -35 -28 -2 9 5 -14 -18 -16 6 23 4 -12 -6 12 27 23 22 7 3 23 24 21 -3 -17 2 15 12 1 1
6479 1 -8 -11 -3 4 -13 -18 -14 -5 -18 -6 -13 0 -6 -16 0 0 5 3 0 -12 -9 1 4 8 7 -7 10 12 23 7 14 3 14 20 27 13 5 -5 7 21 19 -4
6521 -4 -22 -12 3 8 2 -16 -23 -23 0 2 -17 -33 -23 -10 4 0 -13 -17 -14 1 29 13 -5 -9 7 18 33 14 -14 -6 4 41 25 15 -7 -1
6557 -1 14 31 18 -5 -17 -2 12 14 0 -19 -35 -13 -1 -1 -12 -29 -36 -14 1 3 -21 -28 -18 -1 10 4 6 -13 4 1 8 13 3 3 8 18 16
6594 16 9 0 7 2 15 12 5 1 -1 -7 -5 9 -3 -7 -10 -13 -14 0 -2 -10 -7 -22 -2 -3 4 -10 -21 -17 -10 9 8 5 -18 -4 18 24 16 4 -12 2 26 21 20 -2
6638 -2 -6 10 27 24 6 -13 -15 5 8 7 -15 -30 -19 -9 7 2 -23 -31 -11 11 16 -2 -29 -35 -9 5 6 -16 -11 -7 18 29 12 -7 -18 4 17
6675A7MOl5PPK4kj9j3lJ6Lj2pj6J0K2j3pj5NNJ1Kjj1pJ4LMJj7KJ8J3mKj4J0lK
6716IMrOmRmj%lj6jJ4%l%j5JKJ1mkk2jK4Rj5j1kK0Ojmj6kJ5L6j7Jj9NK0Rj0k6
6760gkJ1K3%k8kj4J2K1Jj9k0KK3J1jj9k9NM2oj9qj1J9K6Lj5k7J6RJ7lpj2PK6N
6798C0nk5jJJ9J6k3pj4J3Rjj5o%LJ0lj6onJ8Qqj3oRK2oKmpJ3P%njLj0J0J1rLm
6842G%J2kNj7oLMJ7k0rj0%RJ8qk0j5OJ2J7j3j9KJ9J3J4j9k2KJ8J4Mj9j5J0K0J7
6880B9Pk7j6OK0J0j3j8qQJ6Rj5k9kK8J5nl1j6JJ8L1j0k4j9RK5J5j7l2kL7J5%o
6916Ik1nJ9K2kk2j6J1J4J4lk5LQJ0Rk7j0pJ3J4jml0OJ4OMk1jjOJ2qmp%J1OKpK
6958gLQQRj4j2KJ4Nmkl%kMRjk0oNONj6j1qJ1L0j7j2j5J0J5J6%k8j4K2K4kj0k2
$$ plain form
6675 17 21 27 -8 -1 6 30 28 9 -4 -7 9 12 0 -7 -23 -13 9 -4 -11 -26 -21 -16 -5 -3 -4 -15 -22 -8 -5 -1 0 -17 -15 3 16 12 14 0 10 7 9
6716 9 13 4 10 6 15 11 10 10 7 -9 -10 4 4 1 1 -14 -13 -11 0 -4 -6 -28 -29 -5 4 -11 -22 -24 -4 2 1 -3 -19 -21 -6 30 13 14 -5 0 20 29 19 -7
6760 -7 -9 2 25 25 -3 -5 -19 -7 14 15 -4 -24 -22 1 12 11 -8 -37 -32 10 4 -15 -23 -34 -15 11 14 -1 -28 -12 -3 14 11 4 -8 -1 25 30
6798 30 25 0 -1 0 19 35 12 5 -9 4 13 12 -3 -9 -9 -6 4 1 -15 -21 -26 -8 0 -8 -21 -27 -18 4 -2 0 -4 -11 2 9 9 4 3 6 -4 6 17 8 11 7
6842 7 7 19 17 22 5 -1 2 6 23 3 -6 -16 -16 -7 11 3 -17 -32 -26 -14 3 -10 -29 -27 -8 5 19 0 -22 -20 -2 12 16 -3 -18 -8 12 29
6880 29 36 9 -7 -1 19 29 16 -2 -10 -2 14 23 8 -21 -23 5 20 15 -16 -32 -31 -13 18 8 -16 -35 -26 -1 14 -3 -35 -37 0 15 15 9
6916 9 -12 -17 2 24 22 0 -16 -5 9 23 20 -5 -2 6 16 25 -2 -12 -19 -6 8 7 3 -27 -21 -7 -1 3 -18 -19 -20 -14 -2 -10 -14 -21 -21 -10 -4 -2 -9 -7
6958 -7 -4 4 12 21 7 -5 -3 11 16 12 10 7 7 5 9 18 17 -3 -9 -4 2 7 -9 -20 -28 -17 13 -4 -16 -31 -21 -6 10 10 -18 -32 -10 14 12 2 -20
6999b0kK1L1Jk9j9%K7K1j1rl3J8K1J4pl3j7J7J9Mnm4RJ4K3j6ol1LL0J3j7qk0J8
7035b3L3Rj8k5nK0L5nqj3pK0J9nk6j2PJ5Pmj7j2J1J2Lj9kk1K5N%pj0nJ0MoMj4
7074b5J1J3Kj2pJ1qJ6lRKnOlNj0OKj4lJ5Plpj7J0RnJ1k4pjJ3Oj1j4qJ2K6mj0j7
7116b6MJ9J9mj8k0J0L3Pnl3kJ1J3K6k1k8PJ5K5J2m3k3PK8J3jm3j0KM0Rk9l1lK9
7152a1K0Ll0k9K1K6J3Kl4j1J9J6J1j5k1jJ4L1qmk4NJ3J5nk1pQJ5Jj0j5oK1%jl
7189bj7qJ4%OroMjJ3j8QjJ9MqMMMj0kLJRJ1j6kLJ8Jmk8j3J1J1J7k6j6lJ0L1j0
7231Fl0j6K4RK6k3k0pPK3J5k5l3J3L6J4kj3l0LM0J6ql2j7K2L1J1k0l2rL3J4Ml0
$$ plain form
6999 -20 -22 -1 30 31 2 -17 -17 10 31 20 11 -22 -4 17 31 24 -9 -26 -9 10 14 9 -35 -26 -12 11 -5 -11 -42 -39 -9 4 -13 -21 -41 -23
7035 -23 10 19 1 -24 -29 -9 26 21 13 0 -7 13 32 27 1 -11 -4 11 18 14 -3 -15 -4 8 11 -8 -10 -31 -6 -1 -1 -8 -18 -23 -13 -9 -15 -11 -25
7074 -25 -14 -1 1 -11 -18 -7 -15 1 -2 7 9 4 10 7 12 2 8 10 -4 -7 8 15 12 5 -12 -2 7 2 13 -11 -18 -19 -6 0 -11 -25 -33 -21 5 1 -9 -26
7116 -26 -22 -3 16 12 -6 -26 -16 17 24 19 -14 -16 -5 8 34 13 -15 -8 7 32 44 1 -22 -15 13 26 25 -18 -28 -26 14 23 -6 -37 -40 -11
7152 -11 9 12 -18 -47 -26 0 13 15 -19 -30 -11 5 16 1 -20 -21 -7 24 16 12 -12 -7 6 21 16 -5 -12 -4 11 12 2 -13 -19 2 2 1 -2
7189 -2 -19 -27 -13 -13 -7 -16 -22 -18 -19 -6 -24 -16 -17 2 6 -2 2 6 10 0 -2 1 2 11 22 6 4 7 25 26 22 -6 -19 -8 3 20 -6 -22 -25 -15 16 6
7231 6 -24 -40 -16 -7 19 -4 -24 -31 -24 -1 14 -11 -44 -31 5 19 17 4 -26 -23 17 33 25 -7 -24 -2 29 40 20 -12 -21 12 26 30 0
$$ [...]
8191E
##END NTUPLES=NMR FID
##END=
