##TITLE=1H_DE-80H_X3
 200.13MHz, d2o
 8 sc
 
 19ns.26.2.2025
##JCAMPDX= 6.0         $$ Bruker NMR JCAMP-DX V2.0
##DATA TYPE= NMR FID
##DATA CLASS= NTUPLES
##ORIGIN= UXNMR, Bruker Analytische Messtechnik GmbH
##OWNER= pz
$$ XWIN-NMR		Version 3.5
$$ Tue Oct 21 12:34:51 2025 Russian Standard Time (UT+4h)  Yarkov@DPX200
##.OBSERVE FREQUENCY= 200.1313
##.OBSERVE NUCLEUS= ^1H
##.DELAY= (6, 6)
##.ACQUISITION MODE= SIMULTANEOUS
##.ACQUISITION SCHEME= undefined
##.AVERAGES= 8
##.DIGITISER RES= 18
##SPECTROMETER/DATA SYSTEM= spect
##.PULSE SEQUENCE= zg30
##.SOLVENT NAME= CDCl3
##.SHIFT REFERENCE= (INTERNAL, CDCl3, 0, 14.3821)
##AUDIT TRAIL= $$ (NUMBER, WHEN, WHO, WHERE, WHAT)
$$ ##TITLE= Audit trail, XWIN-NMR		Version 3.5
$$ ##JCAMPDX= 5.01
$$ ##ORIGIN= Bruker BioSpin GmbH
$$ ##OWNER= Yarkov
$$ C:/Bruker/XWIN-NMR/data/yarkov2/nmr/H-C/1/audita.txt
$$ ##AUDIT TRAIL=  $$ (NUMBER, WHEN, WHO, WHERE, WHAT)
(   1,<2025-10-21 12:33:38.04 +0400>,<Yarkov>,<DPX200>,
      <created by zg, POWCHK disabled, PULCHK disabled
       configuration hash MD5:
       00 E9 B6 7A A2 85 ED C7 34 08 36 98 17 FE 4E 26
       data hash MD5: 16K
       45 B0 76 7E FF 09 DB 35 A4 C9 A5 26 D8 9C 14 88>)
$$ ##END=
$$ 
$$ hash MD5
$$ F7 AA 54 0D E9 63 4E A9 C2 92 B4 C1 8A 38 01 12
##$RELAX= 
##$RELAX= 
##$RELAX= 
##$RELAX= 
##$RELAX= 
##$RELAX= 
$$ Bruker specific parameters
$$ --------------------------
##$DU= <C:/Bruker/XWIN-NMR>
##$EXPNO= 1
##$NAME= <H-C>
##$PROCNO= 1
##$TYPE= <nmr>
##$USER= <yarkov2>
##$AMP= (0..31)
100 100 100 100 100 100 100 100 100 100 100 100 100 100 100 100 100 100 
100 100 100 100 100 100 100 100 100 100 100 100 100 100 
##$AQSEQ= 0
##$AQ_mod= 1
##$AUNM= <au_zg>
##$AUTOPOS= <>
##$BF1= 200.13
##$BF2= 200.13
##$BF3= 200.13
##$BF4= 200.13
##$BF5= 200.13
##$BF6= 200.13
##$BF7= 200.13
##$BF8= 200.13
##$BYTORDA= 1
##$CFDGTYP= 0
##$CFRGTYP= 5
##$CHEMSTR= <none>
##$CNST= (0..31)
1 1 145 1 1 1 1 1 1 1 1 1 1 1 1 1 1 1 1 1 1 1 1 1 1 1 1 1 1 1 1 1 
##$CPDPRG= <>
##$CPDPRG1= <>
##$CPDPRG2= <>
##$CPDPRG3= <>
##$CPDPRG4= <mlev>
##$CPDPRG5= <mlev>
##$CPDPRG6= <mlev>
##$CPDPRG7= <mlev>
##$CPDPRG8= <mlev>
##$CPDPRGB= <>
##$CPDPRGT= <>
##$D= (0..31)
0 0.7 0 0 0 0 0 0 0 0 0 0.03 0 0 0 0 0 0 0 0 0 0 0 0 0 0 0 0 0 0 0 0 
##$DATE= 1761035617
##$DBL= (0..7)
120 120 120 120 120 120 120 120 
##$DBP= (0..7)
150 150 150 150 150 150 150 150 
##$DBP07= 0
##$DBPNAM0= <>
##$DBPNAM1= <>
##$DBPNAM2= <>
##$DBPNAM3= <>
##$DBPNAM4= <>
##$DBPNAM5= <>
##$DBPNAM6= <>
##$DBPNAM7= <>
##$DBPOAL= (0..7)
0.5 0.5 0.5 0.5 0.5 0.5 0.5 0.5 
##$DBPOFFS= (0..7)
0 0 0 0 0 0 0 0 
##$DE= 6
##$DECBNUC= <off>
##$DECIM= 32
##$DECNUC= <off>
##$DECSTAT= 4
##$DIGMOD= 1
##$DIGTYP= 9
##$DL= (0..7)
0 120 120 120 120 120 120 120 
##$DP= (0..7)
150 150 150 150 150 150 150 150 
##$DP07= 0
##$DPNAME0= <>
##$DPNAME1= <>
##$DPNAME2= <>
##$DPNAME3= <>
##$DPNAME4= <>
##$DPNAME5= <>
##$DPNAME6= <>
##$DPNAME7= <>
##$DPOAL= (0..7)
0.5 0.5 0.5 0.5 0.5 0.5 0.5 0.5 
##$DPOFFS= (0..7)
0 0 0 0 0 0 0 0 
##$DQDMODE= 0
##$DR= 18
##$DS= 0
$$ [...]
##$SUBNAM2= <"">
##$SUBNAM3= <"">
##$SUBNAM4= <"">
##$SUBNAM5= <"">
##$SUBNAM6= <"">
##$SUBNAM7= <"">
##$SUBNAM8= <"">
##$SUBNAM9= <"">
##$SW= 18.0517328524113
##$SWIBOX= (0..15)
0 0 2 0 0 0 0 0 0 0 0 0 0 0 0 0 
##$SW_h= 3612.71676300578
##$TD= 16384
##$TD0= 1
##$TE= 0
##$TE2= 300
##$TE3= 300
##$TEG= 300
##$TL= (0..7)
0 120 120 120 120 120 120 120 
##$TP= (0..7)
150 150 150 150 150 150 150 150 
##$TP07= 0
##$TPNAME0= <>
##$TPNAME1= <>
##$TPNAME2= <>
##$TPNAME3= <>
##$TPNAME4= <>
##$TPNAME5= <>
##$TPNAME6= <>
##$TPNAME7= <>
##$TPOAL= (0..7)
0.5 0.5 0.5 0.5 0.5 0.5 0.5 0.5 
##$TPOFFS= (0..7)
0 0 0 0 0 0 0 0 
##$TUNHIN= 0
##$TUNHOUT= 0
##$TUNXOUT= 0
##$USERA1= <user>
##$USERA2= <user>
##$USERA3= <user>
##$USERA4= <user>
##$USERA5= <user>
##$V9= 5
##$VALIST= <valist>
##$VCLIST= <CCCCCCCCCCCCCCC>
##$VD= 0
##$VDLIST= <DDDDDDDDDDDDDDD>
##$VPLIST= <PPPPPPPPPPPPPPP>
##$VTLIST= <TTTTTTTTTTTTTTT>
##$WBST= 1024
##$WBSW= 4
##$XGAIN= (0..3)
0 0 0 0 
##$XL= 0
##$YL= 0
##$YMAX_a= 37763
##$YMIN_a= -36702
##$ZGOPTNS= <>
##$ZL1= 120
##$ZL2= 120
##$ZL3= 120
##$ZL4= 120
##$ABSF1= 10
##$ABSF2= 0
##$ABSG= 5
##$ABSL= 3
##$ALPHA= 0
##$AQORDER= 0
##$ASSFAC= 0
##$ASSFACI= 0
##$ASSFACX= 0
##$ASSWID= 0
##$AUNMP= <proc_1d>
##$AZFE= 0.1
##$AZFW= 0.1
##$BCFW= 1
##$BC_mod= 2
##$BYTORDP= 1
##$COROFFS= 0
##$CY= 83.5205535888672
##$DATMOD= 1
##$DC= 2
##$DFILT= <>
##$DTYPP= 0
##$F1P= 10.8118882576601
##$F2P= -7.23987719738617
##$FCOR= 0.5
##$FTSIZE= 0
##$FT_mod= 4
##$GAMMA= 1
##$GB= 0.15
##$INTBC= 1
##$INTSCL= 1
##$ISEN= 128
##$LB= 0.25
##$LEV0= 0
##$LPBIN= 0
##$MAXI= 10000
##$MC2= 0
##$MEAN= 0
##$ME_mod= 0
##$MI= 1.114404
##$NCOEF= 0
##$NC_proc= 0
##$NLEV= 6
##$NOISF1= 3.799351
##$NOISF2= 2.8
##$NSP= 1
##$NTH_PI= 0
##$NZP= 0
##$OFFSET= 14.38212
##$PC= 1
##$PHC0= -4432.144
##$PHC1= 3.42191
##$PH_mod= 1
##$PKNL= yes
##$PPARMOD= 0
##$PSCAL= 0
##$PSIGN= 0
##$REVERSE= no
##$SF= 200.129724274929
##$SI= 16384
##$SIGF1= 3
##$SIGF2= 2
##$SINO= 400
##$SIOLD= 16384
##$SREGLST= <1H.CDCl3>
##$SSB= 0
##$STSI= 0
##$STSR= 0
##$SW_p= 3205.1282051282
##$SYMM= 0
##$S_DEV= 0
##$TDeff= 0
##$TDoff= 0
##$TI= <>
##$TILT= no
##$TM1= 0
##$TM2= 0
##$TOPLEV= 0
##$USERP1= <user>
##$USERP2= <user>
##$USERP3= <user>
##$USERP4= <user>
##$USERP5= <user>
##$WDW= 1
##$XDIM= 8192
##$YMAX_p= 0
##$YMIN_p= 0
$$ End of Bruker specific parameters
$$ ---------------------------------
##NTUPLES= NMR FID
##VAR_NAME=  TIME,          FID/REAL,        FID/IMAG
##SYMBOL=    X,             R,               I
##VAR_TYPE=  INDEPENDENT,   DEPENDENT,       DEPENDENT
##VAR_FORM=  AFFN,          ASDF,            ASDF
##VAR_DIM=   8192,          8192,            8192
##UNITS=     SECONDS,       ARBITRARY UNITS, ARBITRARY UNITS
##FACTOR=    0.0002768,     1,               1
##FIRST=     0,             0,               0
##LAST=      2.2672688,     0,               0
##MIN=       0,             -36702,          0
##MAX=       2.2672688,     37763,           0
$$ Real data points
##PAGE= N=1
##DATA TABLE= (X++(R..R)), XYDATA
0@%%%%%%%%%%%%%%%%%%%%%%%%%mJ1j5J6j6J6j6J6k0K7l1L2l3L8m5M9n4O0o7P4
$$ 0 0 0 0 0 0 0 0 0 0 0 0 0 0 0 0 0 0 0 0 0 0 0 0 0 0 -4 7 -8 8 -8 8 -8 8 -12 15 -16 16 -17 21 -24 25 -29 31 -36 38
45C8q2R0r9J12j21J32j46J61j78J97k20K44k71L03l41L87m42N10n97P18q93J166
$$ 38 -44 46 -53 59 -62 70 -76 85 -93 104 -116 128 -143 160 -181 206 -236 274 -323 395 -498 668
67F68j671K899j2911j0019K0898J9560J2281O058n445k6227k4242n120P628O688
$$ 668 -1003 1896 -11015 -21034 -136 19424 31705 37763 32318 6091 -18151 -23271 -15643 -8955
81h955P949J803q124q711N211J4369J3271N609n050j5579j5768m929Q228J4188
$$ -8955 -1006 797 -7327 -16038 -10827 3542 16813 22422 17372 1793 -13975 -18904 -10676 3512
95C512J0369j115j0444j1077m497M204J1318R509k184j1342q258p03O826J4067
$$ 3512 13881 12766 2322 -8755 -13252 -9048 2270 11779 9595 -1747 -10005 -10708 -3882 10185
109A0185J3501k032j6774j6131q717k245Q237J3867M330o804m081L581P260J3166
$$ 10185 23686 21654 4880 -11251 -19968 -22213 -13976 -109 4221 -2583 -6664 -3083 4177 17343
123A7343J3102j289j7213j8822j2729m856O176J2617O021l265m389o8N327J1775
$$ 17343 30445 29156 11943 -6879 -19608 -24464 -18288 -5671 350 -2915 -7304 -7372 -2045 9730
137I730J2128J561j0613j5163j1637l447P573J2292O210l177o980o646j029P834
$$ 9730 21858 23419 12806 -2357 -13994 -17441 -9868 2424 8634 5457 -1523 -8169 -9198 -1364
151a364J1329L190n961r551q986k684R123J3484N577m124r015j0712o614O085
$$ -1364 9965 13155 7194 -2357 -11343 -14027 -4904 8580 14157 10033 1018 -9694 -16308 -10223
165a0223J1785O271r05m323o393k579Q023J1704M309m752j0849j4267r595K989
$$ -10223 1562 7833 6928 2605 -3788 -6367 1656 13360 17669 12917 2068 -12199 -21794 -18805
179a8805J0862Q763L416j148n026k210O560J0878N555k407r410j4229j0079J472
$$ -18805 -7943 820 4236 3088 -1938 -4148 2412 13290 18845 16438 7028 -7201 -17280 -15808
193a5808R182Q301M512k077p382n211L807Q504O626J243n391j1374q475K141Q985
$$ -15808 -6626 1675 6187 4110 -3272 -8483 -4676 3828 10454 11697 6306 -5068 -13543 -11402 -2417
208b417Q522M881k299r538q284J028O785O726M476k393r227p895J071O553P358
$$ -2417 6105 10986 8687 -851 -9135 -8107 -1322 5404 9880 7487 -1740 -9635 -8564 -2011 5347
223E347M821k374j0311r355j089N681Q290P514R55o493o621j94M587O515N051
$$ 5347 10168 7794 -2517 -11872 -12961 -7280 1010 8524 9479 2986 -3635 -3829 758 7273 12324
238A2324k560j0334j0406l347L331P801Q243K514n723o427j425L304O587O907
$$ 12324 9764 -570 -10976 -14323 -10992 -3191 5052 7566 1843 -4584 -6009 -2705 3882 10789
252A0789J9q199q966l604K055O803Q556K512n873p574l653Q97N685P373J795o238
$$ 10789 10808 2609 -6357 -9961 -7906 -1103 7453 9965 4092 -3482 -7135 -6238 -553 6820 8615 2377
268B377p928m196L46O884Q831L607m504o596m715o14N557Q072L233m683p149n733
$$ 2377 -5551 -9747 -9401 -2517 6314 9921 5417 -1179 -5894 -6508 -951 7121 10354 5671 -1478 -7211
284g211j607M748Q149L711l454o308n373j825M909Q439M231k164n738n684k469
$$ -7211 -8818 -4070 4079 7790 4336 -1972 -7345 -9170 -4261 4178 8409 6245 507 -5177 -7646
299g646M300P989M269j658n576o231l805L263P409M568r92m964o422l828L302
$$ -7646 -3346 4643 8912 7254 1678 -4553 -8358 -5095 2314 6882 5890 926 -5496 -9324 -6022
314f022P617N206l95m027o284m669L004P322N753Q38l558o182m830J744O174M383
$$ -6022 1595 6801 6406 2379 -3905 -8574 -5570 1752 7505 8343 4785 -1397 -6227 -4483 1691 6074
330F074q8m241p174n561J259P072O377L117j259n229m582J095N135M228J013l281
$$ 6074 5986 1745 -5429 -10990 -9731 -2659 3718 6835 5576 347 -4235 -3140 1995 6223 7236 3955
346C955p373o006M33N705O374L939k11n325n924l17L638M297K256j683o561o126
$$ 3955 -3418 -9424 -8991 -3286 3088 7027 6816 1491 -4433 -4750 -1112 3185 5441 3758 -2803 -8929
362h929j52N419O277N106N22n350n988j571K899M566L521j61n636o447j335L021
$$ -8929 -9081 -3662 2615 7721 8243 2893 -3095 -4666 -1767 2799 6320 6159 523 -5924 -7259 -4238
378d238M662M512K25n353o236j824K792N736O069K547l413n313k265P96K934L496
$$ -4238 424 4936 5161 -192 -6428 -8252 -5460 276 6345 8892 5479 166 -2099 -1303 1631 5127
394E127m36n724o672k793J600N894P353M088k136m658l326m66K504L805O45m838
$$ 5127 4691 -1033 -7705 -10498 -8898 -3004 4349 8437 6301 1643 -1683 -2149 355 4160 4805 -33
410c3n975l047J068N582P644M323j854n055m244j840J752M056J618l203m922l479
$$ -33 -6008 -9055 -7987 -2405 5239 9562 7708 2653 -1591 -3431 -1679 2377 3995 792 -4130 -7609
426g609k59M021O875L837j408m026m261k246K678N465L939j064l593m316k702
$$ -7609 -7868 -3847 3028 6865 5457 1431 -2830 -5076 -2398 3067 7006 5942 2349 -1967 -4669
441d669J483M368K377j807m563m512j798L071P459N763J435k289m046l938j58
$$ -4669 -3186 1182 3559 1752 -2811 -7323 -9121 -6050 1409 7172 8607 6318 2272 -1666 -1824
456a824L135J800j526l752m642k658K767P112O133K220j698m781n018q65K630
$$ -1824 1311 3111 1585 -2167 -6809 -9467 -6700 412 6545 8765 7067 2286 -2732 -3597 -967
471i67K204l4k249m069k689K042N822N710K386j268m409n272j114K748L231J594
$$ -967 1237 1203 -1046 -5115 -7804 -5762 60 5770 8156 6888 2479 -2793 -3907 -1159 2072 3666
487C666j129l908m328k68L604L897K282q80l898m440k98M179M969L744N34l650
$$ 3666 2537 -1371 -5699 -5967 -2363 1534 3816 2936 -962 -5402 -5700 -1521 3448 7192 7726 4076
503D076n067k305J108K153J605q61m208l839M9L868N605M927J669l258n224l338
$$ 4076 -991 -3296 -2188 -35 1570 709 -3499 -7338 -7289 -3421 2184 7111 8780 5522 298 -3040
519c040N5J785J947M12k954l584n73L022M813N050J625l050n274l813o61J763
$$ -3040 -2985 -1200 747 1159 -1795 -5379 -5952 -2930 1883 6933 8558 5508 234 -3579 -4240 -2477
535b477K887J366k409l266j272J295L542M523K256k163m592k978j40K592M228
$$ -2477 410 1776 -633 -3899 -5171 -3876 -334 4189 6445 4282 -310 -3288 -3428 -836 3392
550C392K290j925m088l121j009J657L254J968j895l429k159L32L391N516L277
$$ 3392 5682 3757 -331 -3452 -4461 -2804 450 2418 523 -2906 -5065 -4733 -1342 4174 7451
565G451p42l727l852k643L27K791J865j044k568k196k79K851N167L342k58l575
$$ 7451 6709 2982 -870 -3513 -3186 -395 1470 426 -2142 -4338 -4617 -1766 3401 6743 6485 2910
581B910m310k985r8K792K683Mj645k322p85J965M572L349J1k758l921l512k26
$$ 2910 -1400 -4385 -4483 -1691 992 996 -649 -2971 -3756 -1791 2781 6130 6141 3383 -538 -4050 -4276
598d276L154K961N81j690l008k361O68L167L476R45j426l075k562L11L730L661
$$ -4276 -1122 1839 2420 730 -2278 -4639 -3971 -804 2672 3617 2191 -884 -3446 -3135 595 4256
614D256J310j336l598l995j073K170K715J118o64k608k485L63L546L750K064o80
$$ 4256 5566 4230 632 -3363 -4436 -2266 449 1567 903 -1705 -4190 -3827 -281 3469 5533 4853
630D853l455m116j554J478K849J840J42k171k585l75K705L062J957m4l016m341
$$ 4853 1398 -2718 -4272 -2794 55 1895 2037 -134 -2719 -3094 -389 2673 4630 4586 1570 -2771
646b771k012J262K555K559O98j927k734r78J679K921K787P37k372l798j926Q97
$$ -2771 -4783 -3521 -966 1593 2291 364 -2370 -3348 -1669 1252 4039 4776 2404 -1394 -3320 -2423
662b423K309K711R46j975l506j990N18K195K843J206j496k773j582N67K510K827
$$ -2423 -114 2597 3543 1568 -1938 -3928 -3410 -1215 1628 2834 1338 -1435 -3017 -2450 60 2887
678B887J846j567l408k462l73J629K707J687j102k682j996q4J883K932J825j086
$$ 2887 4733 3166 -242 -2704 -3077 -1448 1259 2946 1844 -838 -2834 -2918 -1035 1897 3722 2636
694B636l143k532p19J344L176K246m00k250j957p94J427K787K067o03k768k977
$$ 2636 -507 -3039 -3758 -2414 762 3008 2608 358 -1599 -2393 -966 1821 3888 3285 517 -2460
710b460j308R76K839K231r8j972k246j163Q02L074K598k1j789k569j724O40K567
$$ -2460 -3768 -2792 47 2278 2180 208 -2038 -3201 -2399 675 3273 3252 1463 -1106 -2830 -2190 377
727C77K528L64j880k317k033L73K371K323K64j389k301k202J64K473K768J189
$$ 377 2905 3269 1389 -928 -2961 -2588 -217 2106 2370 981 -1320 -3522 -3358 -885 1883 3072
743C072j181k060k199j2K329K638R69j188k532k583n19K095K635J139r73k100
$$ 3072 1891 -169 -2368 -2380 -51 2587 3556 2368 -164 -2747 -3266 -1171 1464 2603 1630 -470
759d70k551m11K006K771J363m74j850k518o66J953K443J583k52k113k882j101
$$ -470 -3021 -3432 -1426 1345 2708 2234 384 -2134 -2800 -847 1596 3179 2927 814 -2068 -3169
775c169J575J967J635J61j657k377q01J092K288J723K84j841k703j514Q46K333
$$ -3169 -1594 373 2008 2169 512 -1865 -2666 -1574 714 2437 2721 880 -1823 -3337 -2491 -158
791a58K191R10j147k309j217P13J831J598N28j923l018j776J50K087K461J357
$$ -158 2033 2943 1796 -513 -1730 -1017 814 2412 2940 1017 -2001 -3777 -3627 -1540 921 2278
807B278p31j910j544O90J657J955R93j344k504k093r2J663K106J543q56k279j684
$$ 2278 1547 -363 -1907 -1217 440 2395 3388 2044 -460 -2553 -2645 -982 1124 2667 1811 -468 -2152
824b152n11J063K203J692n49j913j558l93J194K345J643o45k220k122j033R70
$$ -2152 -2663 -1600 603 2295 1746 -167 -1725 -2118 -924 1421 3064 2419 199 -1923 -2956 -1986
840a986K242K118J21j608j683q67O72J975J478o62k074k336j226O88K529K550
$$ -1986 256 2374 2495 887 -796 -1663 -991 984 2462 1800 -274 -2610 -3836 -3148 -619 1931
856A931P07p50j531j146L70J617J511j17k028k453j536J53J902K420J157q41j576
$$ 1931 2638 1888 357 -789 -419 1198 2709 2592 564 -1889 -3425 -3272 -1370 1050 2207 1366 -210
873b10j483r2J631K050M93r02j973j609K8J604K135R24r41j956j944n10J402K139
$$ -210 -1693 -1785 -154 1896 2389 1487 -486 -2095 -2067 -463 1672 2596 1655 -301 -2245 -2755 -1353 786
891G86J146j62j596j562o55J450J811R52o43j939k265n74J478K530J761L82r62
$$ 786 1932 1770 174 -1388 -2043 -593 1218 2170 1527 -412 -2677 -3251 -1773 757 2518 2900 1938
908A938j929j153Q49J340O80o17j897k272r53J259K271K151J051o13j873j047
$$ 1938 9 -1144 -295 1045 1725 1108 -789 -3061 -4014 -2755 -484 1667 2718 2105 232 -815
924h15K96J254J174J92j513k264j085M26K051J597R97j091j725j632K28J430J752
$$ -815 -519 735 1909 2101 588 -1676 -2761 -2335 -284 1313 2310 1219 -506 -2138 -1910 -480 1272
941A272Q20o24j787j352K54J172J581O56n70k064j633M5J361K003J308k2j969
$$ 1272 2092 1468 -319 -1671 -1417 -245 1336 1992 1422 -642 -2275 -2230 -869 1134 2442 2420 451
958D51j475m88O75J284P81n46j866j543p6J277K289K112K22j229j794p30M3J179
$$ 451 -1024 -1512 -837 447 1228 682 -1184 -2727 -2803 -1526 763 2875 3097 1868 74 -656 -613 566
976E66Q82o55j413j859n35P71K025K084L61j130j548j047K30J485J454K88j182
$$ 566 1448 793 -620 -2479 -3014 -2243 -218 1866 2227 1097 -451 -1498 -1268 217 1671 1959 777
993G77j478j090L23J587J634M86j424j683j322J66J255K066N82p34j464j129l01
$$ 777 -701 -1791 -1468 119 1753 2239 815 -868 -2190 -2024 -769 1297 1879 1145 -319 -1448 -1749
1010a749J182J592N87o93j793r92mJ584J900J004k43j665j582p93O79J223M24
$$ -1749 -567 1025 1612 919 -874 -1866 -1870 -286 1614 2618 2375 710 -872 -1665 -986 237 661
1027F61l18j421j165j97J309K326J241j16j121j400j200N58J406Q82l37r17j579
$$ 661 343 -1078 -2243 -2440 -1131 1195 2436 2320 1199 -201 -1401 -843 563 1445 1108 191 -1388
1044a388p14O77J706J271J84j148j559j117O03J488J192N79r42j698r05O32J304
$$ -1388 -2102 -1425 281 1552 1736 588 -971 -2088 -1485 3 1195 1774 832 -866 -1771 -1139 165
1061A65J061N82r47j442j104J53J299J325J004p85j705j172k34J140J202P54m83
$$ 165 1226 1808 861 -581 -1685 -1532 -233 1092 2096 1311 -394 -1566 -1800 -660 542 1296 813
1078H13j389r10P0J397J464Q32l49j541j526l28Q77P92R44k11j317j398j87J036
$$ 813 -576 -1486 -1416 -19 1445 2277 1928 387 -1139 -1467 -590 202 1146 935 -382 -1780 -1967 -931
1096i31J340J336m5j301j423n15P42J262J269j86j186j348m62P30J026J393j01
$$ -931 409 1745 1700 399 -1024 -1539 -797 465 1734 1548 362 -986 -1448 -718 308 1701 1600
1113A600j175j409q16M41Q45J437M95r59j518l60K76J150J651L56j032j329r10
$$ 1600 425 -984 -1800 -1359 -514 923 1418 459 -1059 -1419 -1143 7 1658 2014 982 -347 -1257
1130a257p1J276J260L47p97j288r68j34J090J257P66n68j449q81QR35J495N71
$$ -1257 -1328 -52 1208 1555 758 -530 -1498 -1632 -542 715 1481 913 -536 -1417 -1409 -474 1021 1592
1148A592m06r98j070l80Q01J331R30n86j180j278n48R05J259R09j43j033j323
$$ 1592 1186 188 -882 -1262 -461 870 1800 1214 34 -1244 -1792 -887 372 1281 1138 105 -1218
1165a218l86M73J528Q42M1p88j242o54Q19J404J061k98q78j508r25J97J301Q69
$$ -1218 -1604 -1131 397 1239 1280 492 -750 -1404 -585 819 1880 1582 704 -804 -1729 -1532 -231 638
1183F38Q3m58j035p72P84J140J301R1o19j426j159J75Q77J105M65n10j139m77
$$ 638 721 263 -772 -1544 -760 380 1681 1772 1153 -273 -1432 -1257 -380 725 1190 680 -459 -936
1201i36j2J151R59M81q59j203j236n6R05J369O03k06j156r67J19P84J131O45k16
$$ -936 -948 203 1162 1643 784 -419 -1655 -1711 -806 563 1166 960 -196 -1163 -1044 -260 871 1516 1300
1220A300j290r33l69Q36R60Q54k29j228j261m20M39J168J115j15o57r90n7P29
$$ 1300 10 -923 -1292 -456 504 1358 1129 -99 -1360 -1780 -1341 -173 942 827 170 -820 -877 -148
1238a48J029J064j67j123j419p85P1Q52Q87N31o21p60l41M78J063J005K27j191
$$ -148 881 1945 1778 655 -764 -1549 -1478 -626 261 792 171 -589 -930 -452 611 1616 1843 652
1256F52j408r53J60Q88J219O72m09j080l27j53Q48J116J45n08j456q76j42J029
$$ 652 -756 -1709 -1549 -661 558 1230 821 -259 -586 -739 109 1225 1370 862 -594 -1470 -1612 -583
1274e83J032Q10m59j009q87k25P21J245N01j78p97o56l2M90J119O17n21j290j208
$$ -583 449 1259 800 -209 -1096 -1321 -600 645 1146 968 171 -485 -517 -27 1092 1709 1188 -102 -1310
1293a310p46M38J197R97l6k91m47k86Q10R13L94j57j257j258q79J95J386P71M33
$$ -1310 -2056 -1618 -421 576 540 249 -198 -484 326 1239 1633 1476 219 -1039 -1918 -1723 -337 434 867
1312H67k25p66m07J52Q95O59l2q79j399n87J68J087J238L24k29q76p06Q6Q33P15
$$ 867 642 -124 -531 -379 516 1175 1143 264 -1135 -1722 -1554 -467 771 1095 866 -10 -716 -630 203 918
1332I18J50l18r27r20L9P54R23K70n12q66j001m8O94J054Q07J27o34q73K25O79
$$ 918 1068 750 -177 -1097 -1058 -304 619 889 377 -489 -1490 -1538 -844 210 1017 1144 510 -363 -138 541
1352E41P83K48o92j155j285k47N10R83R28K36n36p38J4M85N42N81j97j140j136
$$ 541 1324 1572 880 -275 -1560 -1807 -1297 -314 614 850 314 -424 -410 75 617 1198 1001 -139 -1275
1371a275l44M74J060R24L85n75p64k09J11N03M92J37j013p93o40N19O81R44M42
$$ -1275 -1619 -1145 -85 839 1224 649 -115 -324 -213 290 782 919 -94 -887 -1527 -1008 -327 617 1059
1390A059n49q79o83L09Q77P39L95m71p82n53J32N14Q05K6o48j029q27k7R06R65
$$ 1059 510 -369 -1052 -743 134 873 1268 797 15 -538 -406 108 913 939 291 -738 -1565 -1592 -686 279
1410B79Q18j70p07l72k83N99P19K37l48j218n86l95M50J211R19j77n22o66m39
$$ 279 1097 927 220 -152 -435 164 883 1120 772 -446 -1032 -1427 -977 234 1153 976 454 -212 -651
1429f51L78O56N04l25r25p31j75N12J164O59J32o63n48o10K95Q21N12k92m89p94
$$ -651 -273 383 887 562 -363 -1094 -1269 -757 407 1066 1198 535 -13 -623 -328 493 1005 713 224 -570
1449e70n24K88P13P43M6n34r16k42M0J004Q92R8k37p72o05K17M64O65j3l28q72
$$ -570 -1094 -806 -93 650 696 162 -754 -996 -956 48 940 1038 801 29 -576 -359 105 770 757 429 -443
1470d43p59R4M93J153L28k75o20p09L0L73R30K24j87p12p40j24O62Q26M83q7p24
$$ -443 -1202 -1108 -615 538 866 591 -29 -738 -708 -335 595 819 632 -80 -820 -944 -282 544 1027 940 216
1491B16p60k62O37M63M32k12q52n12l65N10R32N83J65o06q33j04K13O42N85j71
$$ 216 -544 -806 -169 294 726 514 -338 -850 -1215 -705 227 810 975 369 -464 -568 -355 287 872 701
1511G01l94n50n29J86P34L73J25m99o20m54M09N15O36J56m04n25o59J68O96O70
$$ 701 307 -243 -772 -586 148 521 646 147 -473 -927 -518 -3 633 789 385 -140 -799 -631 65 735
1531G35L29n17p01m60O2L86O07K96l16o97n73Q9N83M42N20j52p26l81k92O02P39
$$ 735 1064 547 -154 -614 -552 -166 441 737 421 -276 -849 -760 -177 265 785 633 -93 -474 -766 -164 575
1552E75L19j15m63r15LL12P25K31k94o98m26k50L54Q59O68J41o46p83j60J73N16
$$ 575 894 779 316 -599 -596 -284 441 672 378 -320 -746 -996 -642 217 885 1026 380 -403 -563 -390 126
1573A26N25k33m20n81j53J46R85N93r4m94p28l79J9N85L68Rl70n15k51K04J019
$$ 126 651 418 -2 -583 -736 -590 395 988 894 400 -328 -707 -688 -103 265 274 -96 -611 -862 -658 361
1594C61L81L02m05o11m87m5O50J57J67l20m49n78J31N89N56L1j83l76n49j5M13
$$ 361 742 1044 639 28 -459 -504 146 303 470 150 -299 -877 -746 -157 399 430 247 -129 -678 -693 -280
1615b80P07O00l41l69p33l7K22N32J82k17n95l70j20L36Q27O16M5o47o61l53J68
$$ -280 427 1027 686 317 -416 -453 -231 301 483 266 -329 -699 -819 -483 344 960 1005 358 -303 -656 -488
1636d88L09L21L5o89r8j36M34R02M73N5l71q15l53k14L18L61J66l27n63m16N14
$$ -488 -179 142 177 -512 -610 -746 -312 590 1063 1118 747 -68 -421 -635 -317 44 210 -117 -680 -1096 -582
1657e82Q31N74M8m12n34m66J81K77O04L9k59l36n00m0M98M06J98m33m43l02J28
$$ -582 249 823 871 459 -75 -541 -360 -83 521 560 301 -35 -535 -575 -77 329 527 94 -349 -651 -523
1678e23L19Q45K56j64n94o11j58K51L36K82p3l50n76L68M55N56M88j05p03p06
$$ -523 -204 641 897 733 139 -472 -630 -379 -43 239 166 -184 -760 -392 63 619 1107 1002 299 -407
1698d07l86l4N78J16J68m19j09N8M49P33K91R2n23p70l64R4K47K98J22l20l21
$$ -407 -793 -827 -249 -133 35 -384 -493 -435 14 747 1038 1130 607 -163 -527 -433 -186 112 234 -86 -407
1719d07k59J23O16N22km15n10j27J13M35M43L17n35l64m90j08L60M76J19j19o44
$$ -407 -666 -543 73 595 593 178 -332 -459 -346 89 532 849 314 -50 -540 -648 -288 188 307 188 -456
1740d56K8l4N49M63M02m81n03m56k95K91K33K49J20k09k35J40N99M87k1n6n76
$$ -456 -428 -462 87 550 952 471 -32 -488 -783 -492 -259 -10 110 -99 -334 -194 405 892 871 815 239
1761B39p33l51K58M17O5jm3l82J22L13O56K57j02o64k94j83j4N22L50J7k81n08
$$ 239 -494 -845 -587 -170 -105 -106 -149 -531 -409 -96 560 817 715 51 -243 -426 -440 82 432 449 168 -340
1783c40q1M1K76K31Q6k03l78k28M65L44K20J36k27m50n83J87M23J55K00j85l12
$$ -340 -421 -380 -104 127 213 10 -368 -596 -131 213 433 569 342 -108 -691 -504 -81 74 274 89 -223
1804b23Kj0N70M23p6p1p26m85k74K59L05M13K0j33k85J22M23N55L23m32q20l59
$$ -223 -221 -231 339 762 686 615 -111 -596 -870 -611 -306 107 127 -6 -291 -169 254 809 1132 700 -120 -479
1826d79j12J48L51L60j07l51n7j42L44M50M4j17k98l46K1LM04N48j18n79j83l03
$$ -479 -591 -443 -92 268 161 -190 -247 -389 -45 405 449 332 34 -312 -291 -288 116 664 546 -33 -216 -519
1848e19L08K45K71j40q5n92J49K99L59L61j47l51m97j50o8L14M03K42k62k99n
$$ -519 -211 34 305 165 80 -512 -363 -64 295 656 509 158 -339 -489 -557 -243 160 402 140 -159 -164
1869a64J38L34K33Q4l60n07m33L17J18L05k8Kk94N1R6K42M92k07j0l71l64o8L69
$$ -164 -26 308 541 625 265 -242 -675 -358 -240 65 37 39 -255 -204 -108 134 626 419 409 38 -326 -394 -25
1892b5K51K35j1o50j14j74M16K61J04K0l10l10k84M48L68J37j2l19l88m5J98M45
$$ -25 226 461 450 -200 -314 -488 -72 189 293 313 3 -307 -591 -143 225 362 350 31 -357 -402 -204 241
1914B41rJ46k15k73l15L88L77K30l24k32m77Lm7N22K44O1k67j05k20K30L88j1
$$ 241 232 378 163 -110 -425 -37 340 570 246 14 -463 -460 -507 15 259 320 53 -52 -272 -42 346 335
1936C35K48n23l66k55J79L48J45J97q1n00p8M9K53K83J64j05l06l30J9L09K44
$$ 335 583 60 -306 -561 -382 -34 111 308 227 -273 -351 -302 -49 234 398 293 -13 -343 -324 -15 229
1957B29J79M1o16lj19K83J4K83N2l09m56k00L95M05J07K05m91l35K41k3M07J88
$$ 229 408 449 -167 -170 -289 -6 8 291 343 34 -422 -622 -227 178 285 490 -1 -336 -95 -118 289 477
1979D77j30j75o46N9L69K20PQ2k64j27k32J26L17K81q7k94o4l50J45L25M10r5
$$ 477 347 172 -474 -415 -46 174 181 263 -1 -128 -360 -234 83 364 277 -17 -81 -431 -286 39 449 354
2001C54j15l18k36J38Q9M40N2k76l27k03R0K51L00J66k90l30j37o3K91L12N2r8
$$ 354 239 -79 -315 -177 -88 352 404 128 -199 -402 -312 -61 239 405 115 -215 -352 -415 -124 188 240 142
2023A42r3k98M5L38J68Qk6n16k31j4L67L09r4K09l84o1j95K21M40J19k19j72l92
$$ 142 49 -249 -204 134 302 310 284 -232 -463 -477 -110 199 105 314 -70 -131 -326 -105 335 454 235 63 -329
2046c29j64K63M52P7k07j1k18j51L34J08J18j68p8j24m55K20M36K64R8m24j65
$$ -329 -493 -230 222 299 92 81 -137 -288 46 154 272 104 26 -98 -553 -333 103 367 465 41 -124
2067a24k05J42L90K42K3k04j74k80P1L37o1J5k50l24j67l2N17L86J13k07j39j8
$$ -124 -329 -187 203 445 468 264 90 -190 -119 218 157 172 -78 -402 -569 -601 -84 302 415 208 69 51
2089E1j70K73K56j78j46k66m51J22K63N21j01K9j38l21K38J1K22J00j96m37q8
$$ 51 -119 154 410 232 86 -180 -631 -509 -246 275 174 203 65 -256 -18 -7 215 315 119 -318 -406
2110d06j15L99L37q8J32j33q1l14J98L88p1K8l63j92R4J59J58Q4j20l85q2nQ9
$$ -406 -521 -122 215 127 259 126 45 -269 -71 317 246 274 -89 -281 -187 -28 130 214 94 -291 -373 -378 -289
2133b89M16K18Q6l25j72oQ4J69J34M7l47l21k62K15L02L20Mk0J5j29j76J46N9
$$ -289 127 345 431 106 -66 -72 12 181 315 362 15 -306 -568 -353 -51 269 273 253 268 139 -37 109 168
2156A68J55l34k39l8j90M09L00J27j75k51j23j07K19J83oR6l99j81J71P4K42K13
$$ 168 323 -11 -250 -288 -478 -69 231 358 183 -68 -191 -298 -79 104 98 194 -205 -386 -215 -141 101 314
2178C14k81n5j17j3J77R0J19q6l2k14kJ15J95J1j96r0m78J53K56K21L88q4l13
$$ 314 33 -22 -139 -152 25 115 234 148 116 -98 -100 15 210 221 25 -65 -543 -390 -134 87 475 391 78
2201G8L4l28L38j58K08K5l94m5j21J69L49J23M3n0l35J01m3j4K27M5m88J35j41
$$ 78 112 -216 122 -36 172 197 -197 -242 -363 -194 155 278 321 271 -64 37 -6 -20 207 252 -236 -101 -242
2224b42K39J31K5Q5j42J2k71R6N2J43o6or8k38q7L14J41N8j60m9j10k2J45K53
$$ -242 -3 128 153 238 96 108 -163 -67 -15 128 62 56 -42 -280 -367 -53 88 146 -14 -63 -173 -195 -50 203
2248B03J69j57k13J4j01L4J48Mj81j2j66j33K37J99L79p5k87j38n9J84j33J85
$$ 203 372 215 2 16 -85 -51 97 101 -80 -92 -258 -391 -154 45 424 349 62 -76 -135 49 -84 101
2270A01qk30j5k74L27J91K76m9j59j95M2j86K45J06L6m15j20R4J8L02J47%k34
$$ 101 93 -137 -152 -426 -99 92 368 319 160 -35 7 -179 66 172 208 -207 -327 -233 -215 87 234 234 0
2293@q0j39n6L36Q4J90l40p7j69K19p2K29J01k51k12j31J38K84J47J36J2m94P0
$$ 0 -80 -219 -275 61 145 335 -5 -82 -251 -32 -104 125 226 -25 -237 -368 -230 54 201 337 349 -145 -75
2316g5j49L25j2R9m1k50k36K30jJ65J74Q5k60l33K87K4j1K07n3k23k89K20J34
$$ -75 -224 101 89 188 147 -103 -339 -109 -110 55 229 314 54 -279 8 32 21 228 175 -48 -337 -117 17
2339A7J70O9M4k45j13j45j3K09j09J65j21p0O6j61K17J80j9j18j97o0K15K30K47
$$ 17 187 256 300 55 -58 -203 -216 -7 -116 49 -72 -142 -76 -237 -20 160 141 23 -174 -234 -19 211 458
2362D58j68j35J9l47K5K11Q4m9p9j81j81J12M22j2R4j73j25r1m3K25J46P8r6k72
$$ 458 290 155 174 -173 -148 63 147 98 19 -162 -343 -231 191 179 273 100 -25 -116 -159 66 212 290 194 -78
2386g8j29J3J43J36P3q2n1k88m4K13p1K64K7k03j66O6K51J6J59q3j25k44K9J06
$$ -78 -207 -194 -51 85 158 76 25 -263 -307 -94 -165 99 126 -77 -243 -177 74 90 249 166 41 -203 -174 -68
2410f8pN18l46j01p7r5J14J89J05J8k86j91J44J77O0J78j48j16K8k59k6J66J15
$$ -68 -75 443 97 -4 -81 -176 -62 127 232 250 -36 -227 -83 94 154 332 184 68 96 -163 -189 -23 92
2433I2J60j21l36n8M3K59K68l8k40j88J0l4J84K62kk45j48j20J35J74K13j44R2
$$ 92 252 131 -205 -263 -220 39 307 269 29 -159 -149 -183 1 263 261 16 -132 -252 -117 57 270 126 218
2456B18l34k7j93M83L3o5j53j09j29K2K65J06J03P1l47j55J01R8J16J61k16j44
$$ 218 -116 -143 -336 147 180 115 -38 -147 -276 -254 11 117 220 291 -56 -211 -110 -12 104 265 49 -95
2478i5j20M7J00R9J20j0k38j74J41m5J46J33N5k11Nr8J99J48J33j56k02j21q6
$$ -95 -215 -168 -68 31 151 141 -97 -271 -130 -175 -29 104 159 -52 -47 -145 54 202 335 179 -23 -144 -230
2501b30R2R9J44J24k79j99JK18O7P7Q0j11p6j97J64M4J91j51m5j80ro3J56J52
$$ -230 -138 -39 105 229 -50 -249 -248 -30 37 114 194 83 7 -190 -26 18 209 58 13 -167 -176 -239 -83 69
2525F9l7r7j34R9j8K65k0JJ09l00j96LL3L10Kkj2k37K11l9L88k35J1j9j77j37
$$ 69 32 -65 -199 -100 -118 147 127 128 237 -63 -259 -256 -223 87 89 87 75 -162 49 10 398 163 174 155 -22 -159
2551a59O2m3J88J35m6k01j20J91L7J73qj29k88n6K50R7m0Lo5j19P4j16K06J0L1
$$ -159 -97 -140 48 183 137 -64 -184 7 44 217 209 80 -208 -264 -14 83 43 46 -19 -138 -64 -180 26 36 67
2576F7p8o2P6N8J87J22j86q0m9j21o1l6J34K08j48j08J6M2K0K33n8k52N0j98R1
$$ 67 -11 -73 3 61 248 370 184 104 55 -66 -127 -163 -29 179 31 -77 -61 -19 1 234 176 -76 -26 -224 -133
2601a33J70O5j51O4K8j80J48L5L0J02q6p7j32Q9KM8R1R4l84J05k9p0L17P1n1l19
$$ -133 37 102 -49 15 43 -137 11 46 76 178 92 15 -117 -28 -26 22 113 207 -177 -72 -101 -171 146 217 166 -153
2627a53J04j57LK68J99j24j43k54o6J14J61M8J66j81j12o9r4M12J80k10M0k51
$$ -153 -49 -206 -203 65 264 140 -3 -257 -323 -209 -48 0 166 -15 -127 -196 -290 122 302 92 132 -119
2649a19q9L7K18J82p8P7l10LL1J87Lj0m3n8j82K2J47J34j04J27k08j00J62n6J68
$$ -119 -208 -171 47 229 151 228 -82 -79 -48 139 142 132 89 31 -151 -129 18 152 48 175 -33 -133 29 -27 141
2674A41O6Ll91M5J29j3K19J23l26J26l90P8J07J88N7m9k04r5J10J53J25N0j52
$$ 141 207 210 -181 -136 -7 -20 199 322 -4 122 -268 -190 -83 105 162 113 -91 -186 -76 77 202 252 100
2697A00j43Nj49J29J93J9r3p9j32J17j75L86P9j9m49Q7J51k59M18j6j4j61Jm7
$$ 100 -43 -38 -187 -58 135 154 61 -18 -150 -33 -208 178 257 238 -211 -124 27 -232 186 170 156 -5 -4 -51
2721e1P3O8R6j35j00o7j12P9M0K19J49k04k55l0J18J64n6K42r9r8k63K68j77K62
$$ -51 22 90 186 51 -49 -116 -228 -149 -109 110 259 55 -200 -230 -112 52 -4 238 139 41 -222 46 -131 131
2745A31j37R1j92K5lJ44J21j53n3jj85J76j02J94J05j57J55k51J9l9J18R9m7j09
$$ 131 -6 85 -107 -82 -85 59 180 27 -26 -27 -212 -36 -138 56 161 4 159 -92 -73 -112 6 105 58 -51
2769e1o4J55j15J12J34j39j47R7k00J27J96k6k3p5O2k9k14K77%J5r1L7k60J95
$$ -51 -115 40 -75 37 171 32 -115 -18 -218 -91 105 79 56 -19 43 14 -200 77 77 92 1 38 -222 -27
2793b7r5J85O3j76N4j22J3J8J72Jj94L7j29L3J48L0J71Nk43l3j52K19L70j39j78
$$ -27 -122 63 126 -50 4 -118 -105 -87 85 86 -108 -71 -200 -167 -19 11 182 187 -56 -89 -241 -22 348 209 31
2818C1j96n6J38jK45j43J2o9q4M8j3P8J65J5k36j7l7K15L0J71j63k52O0k00K81
$$ 31 -165 -221 -83 -84 161 18 30 -39 -123 -75 -88 -10 155 170 -66 -83 -120 95 125 296 133 -119 -59 -259 22
2843B2k14K90rj85R7o6m9J47l6qjo0j69K26K02j46R2k36n6m9k4K26LJ24j60K4
$$ 22 -192 98 89 -96 1 -65 -114 33 -3 -11 -12 -72 -241 -15 187 41 133 -103 -159 -208 -232 -6 -3 121 -39 -15
2869a5J6k32O9L48k4j05r1O7p7N0J32p3K0j59L3p6J14l4j5O8M3j98l4J44M9J20
$$ -15 1 -231 -162 186 162 57 -34 33 -44 6 138 65 85 -74 -41 -117 -3 -37 -52 16 59 -139 -173 -29 20 140
2895A40r2l7l7o2J64J67n6j31j38k9j54J74Q2K2J01m8k9k59J63q8K66r1j72K2
$$ 140 48 11 -26 -88 76 243 187 56 -82 -111 -265 -91 -9 13 114 66 37 -222 -59 -147 119 28 -144 -122
2919a22Qj63L71l8J35m8k20j6L0K0K10m6j95k1m5p7K40k4J64rj53k8q0K43j90
$$ -122 -114 -277 94 56 191 143 -77 -93 -63 -43 167 121 -74 -95 -140 -217 23 -1 163 154 1 -27 -107 136 -54
2944e4R3P4k62j4pL25o3m9J33k04j74nR0J05J08q7l7j3l5R8J04n1M3j02j23p0
$$ -54 39 113 -149 -163 -170 155 92 43 176 -28 -202 -207 -117 -12 96 9 -28 -41 -76 22 126 75 118 16 -107 -177
2970a77m8L21J30q8j86j75K9K43o9J05J15j97j12J61J3n5J23j59K51m82J20J9
$$ -177 -225 96 226 138 -48 -223 -194 49 -20 85 200 3 -109 52 65 10 133 -26 225 -257 -137 -118
2992a18J30jJ10k07QO3l9J19J21Q8k06K9j85N2J12J02Mj38r4j54J10J77j30J84
$$ -118 12 11 121 -86 -78 -15 -54 65 186 274 68 97 -88 -36 76 178 182 44 -50 -204 -94 83 -47 137
3016A37j23L1n2j26J37lK16k34r3L1M3q0J32K6k2j08q1J12L4P5Q7Nj84j96M12
$$ 137 14 45 -7 -133 4 1 217 -17 -110 -79 -36 -116 16 42 20 -88 -169 -57 -23 52 139 144 -40 -236 176
3041A76l03J11L4q0m8J60j42J03L5J11jk18j79R3J26J12j24J1j9O7q8k9L25j80
$$ 176 -127 -16 18 -62 -110 50 -92 11 46 157 156 -62 -241 -148 -22 90 -34 -23 -42 25 -63 -92 233 53
3065E3Q6p1j58o2J3L0K30l9J56m28J89j24J24K8n0J77rk15L7J44p5N0j74J96k54
$$ 53 139 68 -90 -152 -139 -109 121 82 238 -190 -1 -125 -1 27 -23 154 145 -70 -33 111 36 86 -88 108 -146
3090a46N9J12J54Qk36Pm0K11j04k0K28j41R0k42J8N4K12kk65J38l11J05R5K7J02
$$ -146 -87 25 179 187 -49 -42 -82 129 25 5 233 92 182 -60 -42 12 224 222 -43 95 -216 -111 -16 11 113
3115A13Oj04r6M9l2q4J44J59k04K5j28J86MK35q6j98o7Q5j23K33j01J75r6l95
$$ 113 119 15 -81 -32 -64 -148 -4 155 -49 -24 -152 34 38 273 187 -11 -78 7 -116 117 16 191 95 -300
3139c00J85J5J21n6K39Lq3k27J01J68q8p7J89j60J1k42K30J3N6Kj34O5k16K20
$$ -300 -115 -100 21 -35 204 207 124 -103 -2 166 78 1 190 30 41 -201 29 42 98 100 -34 31 -185 35
3163C5o0M5J65j89p9K9K5P4L7O4j04m7m8k4J89J03k80L3N5k7j32J68Q9Ml1l49
$$ 35 -25 20 185 -4 -83 -54 -29 45 82 146 42 -5 -53 -77 112 215 -65 -32 23 -4 -136 32 121 125 94 -255
3189b55K26l3J51r1L4jl2j22q0J34K93j06k59Q2oJ19j80K04o6J33k44J39N4j11
$$ -255 -29 -62 89 -2 32 31 -1 -123 -203 -69 224 118 -141 -59 -65 54 -126 78 12 145 -99 40 94 -17
3213a7J12K81l44o3j42J16Q2m0P0j2k1k21J50k8J07Q9j24M9m3j47MJ87k43K79
$$ -17 95 376 32 -31 -173 -57 25 -15 55 43 22 -199 -49 -77 30 119 -5 44 1 -146 -142 45 -198 81
3237H1M9j01J23k88K15J47k71J8j6q8P5K44n9j60O6pr3n9K65m3m3R8k02KL1QK5
$$ 81 130 29 152 -136 79 226 -45 -27 -43 -131 -56 188 129 -31 35 28 -65 -124 141 98 55 153 -49 -47 -16 -8 17
3264A7j42L7j9L0J97j12m9J55j47k7n5J88Q8j92N1j09R7rM5P4j27n4R7r9p0J15
$$ 17 -125 -88 -107 -77 120 8 -41 114 -33 -60 -115 73 161 -31 20 -89 8 -1 44 118 -9 -63 34 -65 -135 -20
3290b0j27K35p2K1J38k48MP1j02K33jj73J84k25K53o9p6M2r3o1P0J87j83J8J02
$$ -20 -147 88 16 37 175 -73 -69 2 -100 133 132 -41 143 -82 171 102 26 68 -25 -86 -16 171 -12 6 108
3315A08k13Po1J85p2J90j4q8p7r8M4K2J52p8P3j45o2J76N4Q8q9o5j70p6J69j4
$$ 108 -105 -98 -159 26 -46 144 130 42 -35 -133 -89 -67 85 7 80 -65 -127 49 103 191 102 37 -133 -209 -40 -54
3341e4O3O4K6q8l7J9j0LK29j84n6p6R0J50M7Q6m12J57k04N9N4K9M9J14m13M08
$$ -54 9 73 99 11 -26 -7 -17 -14 215 31 -25 -101 -11 139 186 272 -140 17 -187 -128 -74 -45 4 118 -295 113
3367A13j57K31k5l4k17p3k1P9L2J37J05j8n5k06O7K85l67K93j00j46m2k05K01
$$ 113 -44 187 162 128 -89 -162 -183 -104 -72 65 170 152 97 -109 -42 243 -124 169 69 -77 -119 -324 -123
3390a23O9J63K8j94J09k06K09K2o1J07k58J48j6q6O9J04k48K15j08k6J9N5R8o7
$$ -123 -54 109 137 -57 52 -154 55 77 16 123 -135 13 -3 -89 -20 84 -164 51 -57 -83 -64 -9 89 22
3414B2j79J82o4p2J82J34m6j73q8M9P9n3o7J26p1J21r3kJ43j97K39k44J10r9J4
$$ 22 -157 25 -39 -111 71 205 159 -14 -102 -53 26 -27 -94 32 -39 82 -11 -13 130 -67 172 -72 38 -61 -47
3439d7lO7R6Q8o6j79%O1Q5N2q0j07j2N5J3N3N1l4p8o9MR3m4jO0Q9k48j19J16K02
$$ -47 -50 17 113 201 135 -44 -44 17 102 154 74 -33 -45 10 23 76 127 93 15 -54 -50 43 -1 -2 58 147 -101 -220 -104 98
3469I8O3q0j32J2j69K30M2k2K5q9p3J25j33R9J13o9Lk15J25J8o0K17k06J92n6
$$ 98 161 81 -51 -39 -208 22 64 42 67 -22 -95 30 -103 -4 109 40 43 -172 -47 -29 -89 128 -78 114 58
3494E8j18Oo0M3J33q3m3m5o2N3K61n8Pr4k9k7o6K16j2k48P6J34o7%l5Q0J13j66
$$ 58 -60 -54 -114 -71 62 -21 -64 -109 -171 -118 143 85 92 -2 -31 -58 -124 92 80 -168 -92 42 -25 -25 -60 20 133 -33
3522c3M0p0J43j05J60M6n11K28R1L5J14j46R1p1r6J44n0J0J30j34R4k43Q4P9j75
$$ -33 7 -63 80 -25 135 181 -330 -102 -11 24 138 -8 83 12 -84 60 10 20 150 16 110 -133 -49 30 -145
3547a45J83J69j60r8J6N9J0q9N1K32j74k23J46J39j31J28j9r5j28P7J8n4K10o9
$$ -145 38 207 47 -51 -35 24 34 -55 -4 228 54 -169 -23 116 -15 113 94 -1 -129 -52 -34 -88 122 53
3571E3k91J24K48p7J71j46J34k22qJ43R5k42K15j51l5J2j03J2O8J87j71o7k50
$$ 53 -238 -114 134 57 228 82 216 -6 -14 129 224 -18 197 46 11 23 -80 -68 0 187 16 -51 -301
3594c01J83K84j77p9L8R9j44J15r6Q5J90j94Ol9l2l9J28KO2j4j9m3j9MJ93j13
$$ -301 -118 166 -11 -90 -52 47 -97 18 -78 7 197 3 9 -30 -62 -101 27 29 91 77 58 15 -4 0 193 80
3620H0j35j41J27R7P6q8j4n6l7mKQ0k7O8r5l0J66j58O8J35q2o1J74j94j01J91
$$ 80 -55 -196 -69 28 104 16 2 -54 -91 -95 -93 -13 -40 28 -67 -97 69 -89 -21 114 32 -29 145 -49 -150 41
3646D1J06j75L4k1qo9Q2Nj21K38k96p5J22J43J48l13K44j1j15M4L5M8j98J75q9
$$ 41 147 -28 6 -15 -23 -92 -10 -5 -126 112 -184 -259 -137 6 154 -159 85 74 -41 3 38 86 -112 63 -26
3671b6M5O4qO7p1J75k93J8j30J87R2Q0j93k2k35K70l3k4J44L1k25R0Pj51J8J18
$$ -26 19 83 75 142 71 246 -47 -29 -159 28 120 200 7 -15 -250 20 -13 -37 107 138 -87 3 10 -141 -123 -5
3697eP2j36M5l4J35J6K9j93m8J05j2j1QK70k62n7L6j27J43K3Q0nJ28k61j7l5j14
$$ -5 67 -69 -24 -58 77 93 122 -71 -119 -14 -26 -37 -29 241 -21 -78 -42 -169 -26 -3 77 72 200 -61 -78 -113 -227
3724b27L19J5j30o4M9p9L19j38O8j16j3k13O7J84M0Q2j76J75m5k33L0J69j3J5
$$ -227 92 107 -23 -87 -38 -117 202 64 132 16 3 -210 -143 41 81 163 -13 162 117 -116 -86 83 70 85
3748H5j13po7K25p6K42k28j45l2P8J16n0J08n3O4j83q4J89j94L8Q0n7j35J37J
$$ 85 -28 -35 -102 123 47 289 61 -84 -116 -38 78 28 136 83 147 -36 -120 69 -125 -87 -7 -64 -199 -62 -61
3773f1M2J66j3k62l5J66J26p2j81M28m28K7M5j0P8K5j5k1k6q8j5J27J8J6p5k2
$$ -61 -19 147 134 -128 -163 3 129 57 -124 304 -124 -97 -52 -62 16 41 26 5 -21 -109 -124 3 21 37 -38 -60
3799f0j09J26n9J65j40N8Lm7J04Nq3NJ36j32j03J91k5r8K06k33n0J01L5O3O4L9
$$ -60 -169 -43 -102 63 -77 -19 -16 -63 41 46 -37 -32 104 -28 -131 60 35 -63 143 -90 -140 -39 -4 59 123 162
3825A62q7q9P9j38J13j67K76r1j72j73K38J04kL2k09J59J5K1p0j5n5k1R0q6m6
$$ 162 75 -14 65 -73 40 -127 149 58 -114 -287 -49 55 53 85 -124 35 50 71 1 -14 -69 -90 0 -86 -132
3850a32K47j89J56K4Oj76r0J73J02j50J40P5q3k65R1J18m7n8k7P7j71J38J94j25
$$ -132 115 -74 82 106 112 -64 -154 19 121 -29 111 186 103 -162 -71 47 0 -58 -85 -8 -179 -41 153 28
3874B8L3lj66J11j8M0l4J04o9q3J06qn3J74J5j70j78J95k5j43L3J06J44j53j51
$$ 28 61 58 -108 3 -15 25 -9 95 26 -57 49 41 -12 162 177 7 -171 24 -1 -144 -111 -5 139 -14 -165
3899a65J03%J34j57J4J9j43Q0J97jM1l7k0j67L5J39p8O9j06Q0j24P0m4k5K00l6
$$ -165 -62 -62 72 -85 -71 -52 -195 -115 82 81 122 85 65 -102 -67 72 -6 63 -43 37 -87 -17 -61 -86 114 78
3925G8j73K10k55J04J72j4q9J08k04L6K6J00j83P8P9k82K54r6k0J94q4m2o0O4
$$ 78 -95 115 -140 -36 136 122 33 141 -63 -27 -1 99 -84 -6 73 -209 45 -51 -71 123 39 -3 -63 1
3949Aj37K53k3J8p5j27O5j42P0Q4n9J9j22L0J81L9n5K04k10j44P9K2J7k2o6K50
$$ 1 -136 117 94 112 37 -90 -25 -167 -97 -13 -72 -53 -175 -145 36 75 20 224 14 -130 -51 -29 -12 -34 -100 150
3975A50q3j08J12j03J19K6j48j00j1j8J29k4P7Q7l32M1k0K11P5k6n3j27Q6N3p
$$ 150 67 -41 71 -32 87 113 -35 -135 -146 -164 -35 -59 18 105 -227 -186 -206 5 80 54 1 -126 -40 13 6
4000FQ4M1k66K31J05k31P5Q2j14k3j19J08j08J20J31Nn8q2%pj1JJ07P2q6j77P4
$$ 6 90 131 -135 96 201 -30 45 127 13 -10 -129 -21 -129 -9 122 127 69 -13 -13 -20 -31 -30 77 149 63 -114 -40
4027d0j91J11N8J09j35L4N6q5OJ22r3L6n0J26J6o2l7J89j49K4Jj03Q8n5J96j10
$$ -40 -231 -120 -62 47 -88 -54 2 -83 -77 45 -48 -12 -62 64 80 18 -19 170 21 45 46 -57 31 -24 172 62
4053F2j30J1J48q3K9M4j16Q2l8J6J7j94J50r7J91K9k51K71p0M4l01L18j38m8J19
$$ 62 -68 -57 91 8 37 81 -35 47 9 25 42 -152 -2 -99 92 121 -130 141 71 115 -186 132 -6 -54 65
4078F5M7j42k6J96p4j30R7pJ2M4k32PQ1M7j66L97j26r9n7K9q1Q4J21q3n5K4k29
$$ 65 112 -30 -56 140 66 -64 33 26 38 82 -150 -143 -62 -15 -181 216 90 -9 -66 -37 -118 -34 87 4 -51 -27 -256
4105b56J54J15Q7j6k60K02j51N0J20k3N4K7n9p8J37Qj21o6O8oJ7m1L1l5l6n7J18
$$ -256 -102 13 100 84 -176 26 -125 -75 45 22 76 103 44 -34 103 111 -10 -76 -8 -14 3 -38 -7 -42 -78 -135 -17
4132a7rl6r6J77J39k77Q6K6J05P9j27rj6k28K36n2J01j85J83j41J10l7j95J56
$$ -17 -26 -62 -158 19 158 -119 -33 -7 98 177 50 41 25 -203 33 -19 82 -103 80 -61 49 12 -183 -27
4156b7p6K78j84J7Lj06J34r3J33j55N1j05M9N4K5rO5Lj18J9P6N1j27K04q8k21
$$ -27 -103 175 -9 8 11 -95 39 -54 79 -76 -25 -130 -81 -27 -2 -11 54 57 -61 -42 34 85 -42 162 74 -147
4182a47J12P7J08L6j95J5q1o0J61j1n1J9j62J02q3N2J16J68l41J98n9m5Q6n5m8
$$ -147 -35 42 150 186 -9 6 -75 -135 26 15 -36 -17 -179 -77 -160 -108 8 176 -165 33 -26 -71 15 -40 -88
4207h8R7q5L4M4m4M8QJ18j54p2j0J46n2j4j18R0o9l5L6J47n9PQ1m2M0j85K15P3
$$ -88 9 -76 -42 2 -42 6 14 132 -22 -94 -104 42 -10 -24 -142 -52 -121 -156 -120 27 -32 -25 56 14 54 -131 84 157
4235A57m6p1k24K61j45n1L08k35J34N9k65J78q9jK90k19m5K59j94N8m4oO3n6j21
$$ 157 111 40 -184 77 -68 -119 189 -46 88 147 -118 60 -29 -30 260 41 -4 255 61 119 75 69 132 76 -45
4260d5J4pj35J84J30j80PR4j05P8o0J40o5J1M4j46J1O0mj4K8j84L8n9J96Q3k52
$$ -45 -31 -38 -173 11 141 -39 -32 62 -43 35 -25 115 50 61 105 -41 -30 30 26 12 40 -144 -106 -165 31 114 -138
4287a38J11J12k8p0j99L31q8p3N3j65K01o2O2J18k52N1q0J2P5Q8j4p1j38P1j1
$$ -138 -27 85 57 -13 -212 119 31 -42 11 -154 47 -15 47 165 -87 -36 -116 -104 -29 59 45 -26 -164 -93 -104
4312a04J97L6m7l0j05pL13l83K08N7l6j10NM5j22j80J04J77k1N1n4J89j91J61
$$ -104 93 129 82 52 -53 -60 253 -130 78 135 99 -11 -6 39 -83 -263 -159 18 -3 48 -6 183 -8 153
4336A53j32j61k2J34K16k1k26J05j32k7L8J85j12nl1Q0j15J08j31P4k9J21Mk00
$$ 153 21 -140 -162 -28 188 167 -59 46 -86 -113 -75 110 -2 -7 -38 42 -73 35 -96 -22 -51 70 74 -126
4360a26k0J60j0J68j65r9J20q9M1j33L91k74o3l0L6L0K56j72PK2P7j88K08K5j59
$$ -126 -146 14 4 172 7 -92 28 -61 -20 -153 238 -36 -99 -129 -93 -63 193 21 28 50 127 -61 147 172 13
4385A3K13j95k0O1j49O7r2M8N8O8k0p9J70K1r4q4N5o7L0N8l6p5k1K25j88N9j7
$$ 13 226 31 11 72 -77 -10 -102 -54 4 72 52 -27 143 164 70 -14 41 -26 4 62 26 -49 -70 155 -33 26 9
4412Im2l5P1J5k14J42Q8N0j09p2K65j46j12k1K66j05n9O2j84L8j7K96q2q0j25
$$ 9 -33 -68 3 18 -196 -54 34 84 -25 -97 168 22 -90 -111 155 50 -9 53 -131 -93 -110 186 104 24 -101
4437a01J3L6N9m3M0J04j49Q3j99K37r9K12j88K6k28K45J4j3J1j70j8o4J3K64j28
$$ -101 -88 -52 7 -36 4 108 -41 42 -157 80 -19 193 5 31 -197 48 62 49 60 -110 -128 -192 -179 85 -43
4462d3L5%M1m2k19J10N2J37Q7l16K24j40J9P7J57j01j20Q8j49Q0J68j52K34j06
$$ -43 -8 -8 33 -9 -228 -118 -66 71 158 -158 66 -74 -55 22 179 78 -42 46 -103 -23 145 -7 227 121
4486A21k21M7P0jl6Q2o5j65J80k64J75J40l3L5j76J41l7L9J01q8k18L88l05J73
$$ 121 -100 -53 17 16 -20 62 -3 -168 12 -252 -77 63 30 65 -111 30 -7 32 133 45 -173 215 -90 83
4510H3j3j25Q0K3J00j80N8q2J04r3M2J23k31j21K28j20N3J01k9j45J23J30nj31
$$ 83 70 -55 25 48 148 -32 26 -56 48 -45 -3 120 -111 -232 -4 -124 -71 30 1 -144 -21 109 104 -27
4534b7O2M5m2j61J41q5R8R9j43M8j44J31j4J4J38k2j47M0MP9j16K09j46m8j36
$$ -27 35 80 38 -123 18 -67 31 130 -13 35 -109 22 8 22 160 138 -9 31 35 114 -2 207 61 13 -123
4559a23K0j7K84nP0k34oM6m1J34j70J80j57r0n5K52j44N8q0J47l8j39J57o3KJ51
$$ -123 -103 -120 164 159 229 -5 -11 35 -6 128 -42 138 -19 -109 -164 88 -56 2 -78 69 31 -108 49 -14 -12 139
4585A39q6m8o4K37k33J61j11L8j0Q1j22J85j78mj8j4o1Q9j3O6K5k07O4j04J98
$$ 139 53 5 -59 178 -55 106 -5 33 23 104 -18 167 -11 -15 -33 -47 -108 -19 -32 34 59 -148 -84 -188 10
4610A0j73J65j2O3J2j41j0P4N9K1j19K4K9J9j43K38O8l19K5J98j3R4j94J32O2
$$ 10 -163 2 -10 53 65 -76 -86 -12 47 68 -51 -27 2 21 -122 116 184 -135 -110 88 75 169 -25 107 169
4635A69k78R4q1mj8J49P4j43o4R6l5K0N1Jj2m9J1n4q5K05m3r0K38q5j91l7J24
$$ 169 -109 -15 -96 -100 -118 31 105 -38 -102 -6 -41 -21 30 31 19 -30 -19 -73 -158 47 4 -86 152 67 -124 -161 -37
4662c7J98j88R6j08q9J53N5l0j27J15n8m3PM5J35j50N6j26mK14N7j78Q3o1j43
$$ -37 161 -27 69 -39 -128 25 80 50 -77 38 -20 -63 -56 -11 124 -26 30 -96 -100 114 171 -7 76 15 -128
4687a28J67j25K24q7J13j34o0k6M9N9qk3j0R0j94NO1L7M2k64J43J64o7J5n5P9
$$ -128 39 -86 138 51 164 30 -30 -56 -7 52 44 21 11 101 -93 -88 -27 10 52 -212 -69 95 28 43 -12 67
4713F7j2k55K14j17J93Q2j58j4j09Q9M9j92J24o0l8P4J14p2J4R0j36P5l8o0J89
$$ 67 55 -200 14 -103 90 172 14 0 -109 -20 29 -163 -39 -99 -137 -63 51 -21 -7 83 -53 22 -16 -76 113
4738A13p2l4J94k27o4n2J95m7M6j09R7r7j6P2Qpr5J20K5j02qj6J04k0mJ61j36
$$ 113 41 7 201 -26 -90 -142 53 6 52 -57 40 -57 -73 -1 7 0 -95 25 50 -52 -60 -76 28 8 4 165 29
4765B9r9J30K14k77n4MK4o5K30q9m5P7o0%j77J81J6o7J20j28j24J28r3K53j89
$$ 29 -70 60 274 -3 -57 -53 -29 -94 136 47 2 79 19 19 -158 23 39 -28 92 -36 -160 -32 -125 128 -61
4790f1J31N4j06j00Q2j67K32n8l6j7Pn5K15k60K26Pj55J46j49J05O2j17J73j83
$$ -61 70 124 18 -82 0 -167 65 7 -29 -46 -39 -94 121 -139 87 94 -61 85 -64 41 103 -14 159 -24
4814b4m8J69j77R4J65n8j93n1R4k9R5J34k31O7Jo0K23j9Q0k20l4j39N9N3m4P6
$$ -24 -72 97 -80 14 179 121 -72 -123 -29 -58 37 171 -60 7 8 -52 171 152 232 12 -22 -161 -102 -49 -93 -17
4840a7K5J7pj28j08K37J12j18o6J0k8n9K8J26J8J87j80j14J08j8J15q1j32j54
$$ -17 8 25 18 -110 -218 19 131 13 -53 -43 -71 -130 -102 24 42 229 49 -65 43 25 140 59 -73 -227
4864b27J70K44j53j48N9J38j11qN6o8K1J27j32J8m7j67L49J7j91j03J53j30N9
$$ -227 -57 187 34 -114 -55 83 -28 -36 20 -48 -27 100 -32 -14 -61 -228 121 138 -53 -156 -3 -133 -74
4887g4K6O7R5r2j21P2n5J49j3k2J9j13k3j30J42J73j1o8q8K26j58R3p3l9J11k53
$$ -74 -48 19 114 22 -99 -27 -82 67 54 32 51 -62 -85 -215 -73 100 89 21 -67 159 1 94 21 -18 93 -160
4913a60O9r6K28n5%O3P9k32j1K09N1j62n3J09j31N0O6p5J9J41k25J06jo1r1K62
$$ -160 -91 -187 41 -14 -14 49 128 -104 -115 94 145 -17 -70 39 -92 -42 24 -51 -32 109 -116 -10 -11 -72 -163 99
4939I9P6q4qk27J12J1J85l7r7P5j90J91j83N6j24J81n0M1n3nNM2o9L6P5k0r6K0
$$ 99 175 91 83 -144 -32 -21 164 127 30 105 -85 106 -77 -21 -145 36 -14 27 -26 -31 -26 16 -53 -17 58 38 -58 -38
4967c8j42J69O2m3m8J28k27P0K02k23j08P2J08n0J14p8j7Kp9J59k36L26j15Q4
$$ -38 -180 -11 51 8 -40 88 -139 -69 133 -90 -198 -126 -18 -68 46 -32 -49 -47 -126 33 -203 123 8 92
4991I2j76LQJ9L6K4J46k26l9J2M4K5N0p3J91j62L5l7m1J90o7j36kJ6M4J60j28
$$ 92 -84 -81 -73 -54 -18 6 152 -74 -113 -101 -57 -32 18 -55 136 -26 9 -28 -69 121 54 -82 -84 -68 -24 136 8
5018Hj52Q0M2j6j15J65j13J51k23J47j2jN2L7J32j22j9Nj04J77j26M2p5j2J01
$$ 8 -144 -64 -22 -38 -153 12 -101 50 -173 -26 -38 -39 13 50 182 60 41 46 -58 119 -7 35 -40 -52 49
5043D9R7k48J79q5l1R2k47J39O7J32k63J05jL5J9Q4j37O2onj97J0J74P3m1j64
$$ 49 146 -102 77 -8 -39 53 -194 -55 12 144 -119 -14 -15 20 39 123 -14 48 42 37 -160 -150 24 97 56 -108
5069a08K09o8o6L0J58L0j07p0j57J05J08j27L1J47J52l94pK18k85K90j22mK09
$$ -108 101 33 -33 -3 155 185 78 8 -149 -44 64 -63 -32 115 267 -127 -134 84 -201 89 -33 -37 172
5092A72k33J29J9k4r4k1N8r2K16m3J5J4j67k4l0NR7O9j70N1MJ63j11p5J54j67
$$ 172 -61 68 87 63 -31 -52 6 -86 130 87 102 116 -51 -75 -105 -100 -3 66 -104 -53 -49 114 3 -72 82 -85
5118h5J66qj60j13J94Q7j21nk05L73k98LK45j77J69j79m1Q8J63n1O3j10Q4k23
$$ -85 81 73 -87 -200 -6 81 -40 -45 -250 123 -175 -172 73 -104 65 -114 -155 -67 96 45 108 -2 82 -141
5142a41L6J01k7lj1j6J66k58J77K8N8p4n9LR9j13P4J44k14k1mN4o1J97j24n5j1
$$ -141 -105 -4 -31 -34 -45 -61 105 -153 24 52 110 36 -23 -20 79 -34 40 184 -30 -51 -55 -1 -62 135 11 -44 -55
5169e5l9M1J46K2j65J28j71J57j73K8N2L8m0j24J8R0J91j06J19L9k19j3J58j10
$$ -55 -94 -53 93 115 -50 78 -93 64 -109 -81 -29 9 -31 -155 -137 -47 144 38 157 196 -23 -36 122 12
5193A2O5Q7k28j03J06r0O9Q8k6k0o2l3M5l5J22L5J48k40M9K61k99N8M5N1j92Q6
$$ 12 77 164 -64 -167 -61 -151 -82 6 -20 -40 -102 -135 -90 -125 -3 32 180 -60 -11 250 -49 9 54 105 -87 -1
5219aJ19k42K67%K4j13j42l5K82j16l7P4m2nm4J6L8l8qJ4j25J6K05j69L5J14j25
$$ -1 118 -124 143 143 167 54 -88 -123 159 43 6 80 38 33 -11 5 43 5 -3 11 -114 -98 107 -62 -27 87 -38
5246c8nl0J10j4O1p9K43m12J08l0j01J03K21Q3k94m4K15j8qk02J71L4p5o4K51
$$ -38 -43 -73 37 23 84 5 248 -164 -56 -86 -187 -84 137 220 -74 -118 97 79 71 -131 40 74 -1 -65 186
5271A86j74o9N2N2j81r0N03k92J29j0J13k78km9j63M54j06M6j18r8q7J45NO8P5
$$ 186 12 -57 -5 47 -134 -224 279 -13 116 106 219 -59 -61 -110 -273 181 75 121 3 -95 -182 -37 -32 36 111
5296A11k36J47p8N2kQ1Q0n9j28n2j13K13j59N3o6J62j17j90L59qlL4j32j31Q8
$$ 111 -125 22 -56 -4 -6 75 155 96 -32 -84 -197 16 -143 -90 -156 6 -111 -301 58 50 47 81 -51 -182 -94
5321i4J94M7RN0l72m0J67Q1l1n1k7L3r2P8K39k34N7j33K6Q7J25j50M1M7j00K8
$$ -94 100 147 156 206 -166 -206 -39 42 11 -40 -67 -34 -126 -48 191 -43 14 -119 -93 -6 119 -31 10 57 -43 -15
5347a5k4k3R8K5Q2q9j36O6r3NK6J79q4j04kP1j30K68j55J35l4k49k5K99m2k7L7
$$ -15 -39 -62 36 61 143 54 -82 -16 -109 -104 -78 101 17 -87 -89 -18 -148 120 -35 100 66 -183 -208 91 49 22 59
5374E9m0k0j13J06qQ3K0k8Qn9J25kM4j25j10Q2k3MmR8p5L2j78L3Q3K0j5L9j32
$$ 59 19 -1 -114 -8 -16 67 87 59 67 8 133 131 175 50 -60 22 -1 3 -1 97 22 54 -124 -91 -8 12 -3 36 -96
5403i6J17j88m9J71J90oo8j02Q8m9J18j44K24k83R9m7N5j22P9J10k58K04o5P6
$$ -96 21 -167 -216 -45 145 139 71 -31 57 8 126 -18 206 -77 22 -25 30 -92 -13 97 -161 43 -22 54
5427E4n6O1mok9K7k23K19K7j43P8j22l1K39q0J3O8o0j06J2k02K59r3K10k09J19
$$ 54 -2 59 55 49 20 47 -176 43 70 -73 5 -117 -148 91 11 24 92 32 -74 -62 -264 -5 -98 112 -97 22
5453B2N4j63o7J34Q8j56J77j00j47R0J01N2M2j37k9l4L13l62J22j29J03m9n1J17
$$ 22 76 -87 -154 -20 68 -88 89 -11 -158 -68 33 85 127 -10 -39 -73 240 -122 0 -129 -26 -75 -126 -9
5477ikQ5j19M4j2j07n8K19M5j33qJ47q4j7J01o8L4O4k60R0M6J41r2P1j33o5k9
$$ -9 -11 74 -45 -1 -13 -120 -178 41 86 -47 -55 92 8 -9 92 24 58 122 -138 -48 -2 139 47 118 -15 -80 -109
5504a09qN8M5J23k05R6n3j5Q5n8k4J84j25N3k17J11J73j19q7Q3J52j52N8j46Q7
$$ -109 -117 -59 -14 109 -96 0 -53 -68 17 -41 -65 119 -6 47 -170 -59 114 -5 -92 -9 143 -9 49 -97 -10
5529a0J51j2k24J6J00N0q1j28K40q4j49L05j66L8K3n7l9J27j94o4K96k18p5O9
$$ -10 141 129 -95 -79 21 71 -10 -138 102 18 -131 174 8 46 69 12 -27 100 -94 -158 138 -80 -155 -86
5553h6j10K37N4j14J00nk25K05j56n7K47r5M5%k65J15J65R8m3j77Q0j02Q8n4J05
$$ -86 -196 41 95 -19 81 76 -149 56 -100 -157 90 -5 40 40 -225 -110 55 153 110 -67 13 -89 -1 -55 50
5578E0pp9J39J7k05N9pR0M2o4K4j79R5q3J71j34R9j5o0M7n0J52k81P8K46k02M9
$$ 50 43 -36 103 120 -85 -26 -33 57 99 35 59 -120 -25 -108 63 -71 28 13 -47 0 -50 102 -179 -101 145 -57 -8
5605hj58K38j50L2J33r0O0j22J32O3Pk70K14j09R5j37O6p0j9R2o9J35j69O1j61
$$ -8 -166 72 -78 -46 87 -3 57 -65 67 130 137 -133 81 -28 67 -70 -4 -74 -93 -1 -70 65 -104 -43 -204
5630b04K42P8l53K31J71k22j31K01J09l28K01oJ34l0k18R0Q0j54J14j06K3J55
$$ -204 38 116 -237 -6 165 -57 -188 13 122 -206 -5 -11 123 93 -125 -35 45 -109 5 -101 -78 77
5652G7j01Mnn7M1O6j42k5J76q6P5o0O1p4l2o5J09J00K1j46K1J03j70q3L02q6J06
$$ 77 -24 -20 -25 -82 -41 25 -117 -142 34 -52 23 -37 24 -50 -82 -147 -38 62 83 -63 -42 61 -109 -192 110 24 130
5679A30j97j9J0P6J8k5J50N5j98o0J50k24K14j6p9Q0j66OJ5K14k97J96q0K1%K9
$$ 130 -67 -86 -76 0 18 -7 143 198 0 -60 90 -134 80 64 -15 65 -101 -95 -80 134 -163 33 -47 -26 -26 3
5705CK28k72K39j87M2o6n3J23n4K9j23J11qj05J19J6L9k9p2j56K72n0J05k37J47
$$ 3 231 -41 198 11 53 -13 -66 57 3 32 -91 20 12 -93 26 42 81 52 -20 -176 96 46 151 -86 61
5730F1nj83L18k21j49L08j13n7j04k3J78J0P4j79K12k7j80J83j09kj3j67J74%
$$ 61 56 -127 191 -30 -179 129 16 -41 -145 -168 10 20 94 -85 127 100 -80 103 -6 -8 -21 -188 -14 -14
5754a4l7J58j60L07k79M4o8L4q2J0K11k26k5J58K10j9r7j59K1R4n2r1LJ65j24
$$ -14 -51 107 -53 254 -25 19 -49 -15 -97 -87 124 -102 -127 31 241 222 125 -34 -13 81 29 -62 -59 106 -18
5779a8J63j51p0Q9n4Q1K8j07O4o9j02K05K9J90j85k14K20j63j24L51n8q3K5k14
$$ -18 145 -6 -76 13 -41 40 68 -39 25 -44 -146 59 88 278 93 -121 99 -64 -188 163 105 22 47 -167
5803a67K40mJ1j11J91j65j43J50q8R0j21Q0m9jRR1P3j95J47j82K38j39J71j87
$$ -167 73 69 80 -31 160 -5 -148 2 -86 4 -117 -37 -86 -87 -78 13 86 -109 38 -144 94 -45 126 -61
5827f1N5K05l37QN4K80r3r3k55K99J00j73l1KJ02J6J2Q7k37N5P8j57K6nj1m4J05
$$ -61 -6 199 -138 -130 -76 204 111 18 -237 62 162 -11 -42 -40 62 78 90 177 -60 -5 73 -84 -58 -63 -74 -118 -13
5854a3p7P4J67q6j82J3NJ13j7m0O4j53K1J06P5m3j1M4J6n1Rk9RJ27j72M2j85K32
$$ -13 -90 -16 151 65 -117 -104 -99 14 -3 -43 21 -132 -111 -5 70 27 16 60 76 25 34 5 14 141 -31 11 -174 58
5882E8j01m7L8K39k53L1J00m2n0pj24J82j15P3oO3R1j68J50j17L5r4k0J78op4
$$ 58 -43 -90 -52 187 -66 -35 65 23 -27 -34 -158 24 -91 -18 -24 39 130 -38 112 -5 30 -64 -84 94 88 14
5908A4L1k32J82J16k04R6j75J16K8o4K10j87J88n0j06p6l6J59N9p1J70j69K4o2
$$ 14 45 -187 -5 111 -93 3 -172 -56 -28 -92 118 -69 119 69 -37 -113 -149 10 69 -2 168 -1 23 -39
5932c9J15p9o8J9L8r2l4Q8K29l4o1k64R4O5l8P9RR3j18j6m7k3J02J4J44j12j1
$$ -39 76 -3 -71 -52 -14 -106 -140 -52 177 143 82 -182 -88 -23 -61 18 27 120 2 -14 -61 -84 18 32 176 64 53
5959E3n8q5O1K3j49J98q8r6N5L41l41Q9L1J8j00o4K60r7L8p9p9J20J21r1j43K85
$$ 53 -5 -90 -29 -6 -155 43 -45 -141 -86 255 -86 3 34 52 -48 -112 148 51 89 10 -69 51 172 81 -62 223
5985B23j40q3o8J63j42k0J17m7Q4r5J71q8J71k20N8j17k15N4K45J18M8j37q2Q6
$$ 223 83 0 -68 95 -47 -67 50 3 87 -8 163 75 246 26 84 -33 -248 -194 51 169 217 80 -2 84
6009H4r7o2J34j82J99Km2J47r8r0j00J59K3k07j10K66L2N9q7j14O1L9n4pK61j50
$$ 84 -13 -75 59 -123 76 78 36 183 85 -5 -105 54 77 -130 -240 26 58 117 30 -84 -23 16 -38 -45 216 66
6035F6lk1j6J8L2J19k10J86k19m3K2J34m4j1Q7k94J73%L4O3Nj15J26k53K13o6
$$ 66 63 42 26 44 76 195 -15 171 -48 -91 -69 65 21 10 97 -197 -24 -24 10 73 78 -37 89 -164 49 -17
6061a7K67l33J25n4j1j10J07Q9K4m9J7k11K6n5P8R9J48k38KQ8J03j20j34J03J37
$$ -17 250 -83 42 -12 -23 -133 -26 63 87 38 55 -156 -130 -185 -107 -8 140 -98 -96 -8 95 -25 -159 -56 81
6086H1Lj26J49k58J98m2Q2M9j13j4J00p3j89K11K6L1j01qJ20j68MM6j36J18Q5
$$ 81 84 -42 107 -151 47 5 87 136 23 9 109 36 -153 58 84 115 14 6 126 -42 -38 8 -128 -10 75
6111G5J4M2j29k26J76m0L7l1K12n7j12l4J53k03O1J20j42K7p6J28k0Q9M8j5j31
$$ 75 89 131 2 -224 -48 -88 -51 -82 130 73 -39 -73 80 -123 -62 58 -84 -57 -133 -5 -25 64 112 97 -34
6136c4P3Q0j59lJ43m3j43l9k9r1K65m5J31k09O2N7p0L13l75P4J25k16Q9P7m7R4
$$ -34 39 119 -40 -43 100 57 -86 -125 -154 -245 20 -25 106 -103 -41 16 -54 259 -116 -42 83 -133 -44 33 -14 80
6162H0k09J83o2j67K77k7L2n8n4j8O1K6o3J01No2r2p3J06J22j01R3K9ok70K9L4
$$ 80 -129 54 -8 -175 102 75 107 49 -5 -23 38 64 1 102 107 45 -47 -120 -14 108 7 100 129 123 -147 -118 -84
6189h4K03k37j1M7O3R8j98K35j31Q0j60J14P2k2j87J13J1j68M7K7J32j5M3n0r2
$$ -84 119 -118 -129 -82 -19 79 -119 116 -15 65 -95 19 91 69 -118 -5 6 -162 -115 -88 44 29 72 22 -70
6214g0N0K7m0m7R1j25J07K8K9p5K9l4J50m3r1n4R5qpK60k84r7J89k49K54k5j6
$$ -70 -20 7 -33 -80 11 -114 -7 21 50 -25 4 -30 120 77 -14 -68 27 19 12 272 -12 -109 80 -169 85 60 44
6241D4O1p4J21k64Q9l2K66j15J3q8j00J33j87J60pj12L6oP8L0K77l32Q6j05j3
$$ 44 105 31 152 -112 -23 -55 211 96 109 21 -79 54 -133 27 20 -92 -56 -62 16 46 323 -9 77 -28 -41
6266d1k1J35M4J5k00J6J44j19o0J69q2qj42J47j20Q0rJ16j75N3J31j20J57j98
$$ -41 -62 73 117 132 -68 -52 92 -27 -87 82 0 -8 -150 -3 -123 -43 -52 64 -111 -58 73 -47 110 -88
6290h8L4Q8j12J25k2q1%qq3J64Qj12o1J82N6j40O5rRm5q3K14J1j06R7l4k10J72
$$ -88 -54 34 -78 47 25 -56 -56 -64 -147 17 25 -87 -148 34 90 -50 15 6 15 -30 -113 101 112 6 103 69 -141 31
6318C1j96J59O5j70K02j42K38j36m0l3O9p3K6J41k38jj7K41l51K00NR1J53j54
$$ 31 -165 -6 59 -111 91 -51 187 51 11 -22 47 -26 0 141 -97 -98 -115 126 -225 -25 -20 71 224 70
6342G0K1r8J26k60J52L3j03l1q7L24j21J49j26j57Q3o8m9j7J36l0J93k65jK52
$$ 70 91 -7 119 -141 11 44 -59 -90 -177 147 26 175 49 -108 -25 -93 -142 -159 -23 -53 140 -125 -126 126
6366A26l01K14j40J01n2l7J9J32j28J39m1o7p8J27J4m9R3n7j22N0Q0j08J56p9
$$ 126 -175 39 -101 0 -52 -89 -70 62 -66 73 32 -35 -113 14 28 -21 72 15 -107 -57 23 -85 71 -8
6390hJ00m1k26M8M4J90j51L4M4j73K19o6L0j8J05p0n0P5l0M7j62n0J32q9K83k67
$$ -8 92 51 -175 -127 -83 107 -44 -10 34 -139 80 14 44 26 131 61 11 86 56 103 -59 -109 23 -66 217 -50
6416e0J10k96J92K4j4J12j25L7j0K7J30j23j28J53j58J41R0j00J60j09q9j50L29
$$ -50 60 -236 -44 -20 -34 78 -47 -10 -20 7 137 14 -114 39 -119 22 112 12 172 63 -26 -176 153
6439A53k45n6J75K2K1o8J51k18O4K29j94j6N2k57K89j60K96k10j42J40P8j88J69
$$ 153 -92 -148 27 49 70 2 153 -65 -1 228 34 18 70 -187 102 -58 238 28 -114 26 104 -84 85
6462H5k32M7O1mJ01r7P8n9K7j32R7J81n5n9R5j44j8Jj07J79J2o9J45k74q8Q6J1
$$ 85 -147 -100 -39 -43 58 -39 39 -20 7 -125 -28 153 98 39 134 -10 -28 -27 -134 45 57 -12 133 -141 -229 -143 -132
6489a32R0k3j4M4r6K93j31L3Q3k09N2q1k6lJ66kj30J01J39l9r2q6J17Q7l58J81
$$ -132 -42 -65 -79 -35 -131 162 31 64 147 -62 -10 -91 -117 -120 46 44 -86 15 154 115 23 -63 54 141 -217 -36
6515c6j13K5M6j13J05M8j0M1M0j33J84k59J55qK27j00l9j67N6j21K3N6J56q6J97
$$ -36 -149 -124 -78 -191 -86 -38 -48 -7 33 -100 84 -175 -20 -28 199 99 60 -107 -51 -172 -149 -93 63 -23 174
6540A74k26K80j76K5k9m5J71k22l5Q2j47J28rJ47q6p2J57j23nPM1j2n5j3l1r5
$$ 174 -52 228 52 77 48 3 174 -48 -83 -1 -148 -20 -29 118 32 -40 117 -6 -11 -4 37 25 -30 -43 -74 -169
6566a69L2J44J09q8L0p4PM3pj38K8L2J50o9O2P4q7l6K5k48J01j5K39n4L1j94O8
$$ -169 -137 7 116 28 58 -16 -9 34 27 -111 -83 -51 99 30 92 166 79 43 68 -180 -79 -94 145 91 122 -72 -4
6593dK2%o0j22J36R4j73K38j29J06j38j12R8k8Q6M8K1j21K94j96J0j84J52j33
$$ -4 18 18 -42 -164 -28 66 -107 131 2 108 -30 -142 -44 -72 14 62 83 -38 256 60 70 -114 38 -95
6617i5lK30j38L6k03K33M4j0L7k09N7L3j6k1Q6r0M7q5J59j45J7J08j15R8j61J07
$$ -95 -98 132 -6 30 -173 60 104 94 131 -78 -21 12 -4 -25 61 -29 18 -67 92 -53 -36 72 -43 55 -106 1
6643AP9j31o3J94j93J89j4o1R0j6p8l9O9k2jm7L3M2M3j01L9m6L6j7m2J8l3P7p5
$$ 1 80 -51 -114 80 -113 76 62 1 91 75 -3 -42 27 5 4 -43 -10 32 75 -26 13 -33 3 -14 -56 -38 -71 6 -69
6672f9p3K88j43j30Q5Nj01K6O8r6P1J35K9k72O9L76k51n8O8n5Q0lo5J02M2j4o3
$$ -69 -142 146 3 -127 -42 -37 -138 -112 -44 -140 -69 66 95 -177 -108 268 17 -41 27 -28 52 49 -16 86 128 114 51
6699E1o2J44k31J97j5q1J74n0p3l6O2j5k3j30k7R1Q8k08L38k34l7J49j13K18o2
$$ 51 -11 133 -98 99 84 3 177 127 54 18 80 65 42 -88 -115 -24 64 -144 194 -40 -77 72 -41 177 115
6724A15j79r0J29n0LJ5N0O6m8j8K00o5j23o3m6N4j5j41K67p7p2K24j05o5j4n4
$$ 115 -64 -154 -25 -75 -72 -57 -7 59 11 -7 193 128 5 -58 -104 -50 -65 -206 61 -16 -88 136 31 -34 -48 -102
6750a02l4J37J97k04P8q1NM6n0K0m5m9J02j1o8m0K6L9J30j07J2L6K8j24J20m1
$$ -102 -136 1 198 -6 72 -9 -4 42 -8 12 -33 -82 20 9 -59 -99 -73 -34 96 -11 1 37 65 -59 61 20
6776B0L0o2l3O9o1R7p7L3j03J56o7J7J73l22l9K36j83R0J53j23k6J3j03J14l5
$$ 20 50 -12 -45 24 -37 60 -17 16 -87 69 2 19 192 -130 -169 67 -116 -26 127 4 -22 -9 -112 2 -33
6801c3O9J00j10j42J96Pn5KnN2j29L3o1R9N2M2q6j14J0P9o6J14j27O6J72j96j72
$$ -33 36 136 26 -116 80 87 32 34 29 81 -48 -15 -76 23 75 117 31 -83 -73 6 -60 54 -73 -7 165 -31 -203
6828b03K5K88j55Q9L7k20K54k19K47j71K01j86j04K88j41Jo9N4Ll8k4o0K9N0J7
$$ -203 -178 110 -45 44 81 -139 115 -104 143 -28 173 -13 -117 171 30 31 -38 16 19 -19 -43 -103 -74 -24 -7
6853gO8j81L9J85j74J87n6j32R5k0K48j91J58k79J30j65N6J57j81K04j87J06k25
$$ -7 61 -120 -81 104 -70 117 61 -71 24 4 252 61 219 -60 70 -95 -39 118 -63 141 -46 60 -165
6876a65Q3J58k03K60l1r8k5Q8ok4k8r7J33Mk4Rj12J25Oo7K7k05J33J91j54P3O7
$$ -165 -82 76 -127 133 102 4 -21 67 61 37 9 -88 45 49 25 34 -78 47 53 -14 13 -192 -59 132 -22 51 118
6903A18k68R2J3KK69j36j44O2O6j80J28KN6j6q6R5j12O2K2l7Qm0J24k21Q5j38
$$ 118 -150 -58 -45 -43 226 90 -54 8 74 -106 22 24 80 64 -22 73 -39 23 45 8 16 -24 100 -121 -36 -174
6929a74J78n0j63J80N6l37L31L4m1j3L2L3R7k22MN1K13l45J83j04J13j06R5N6
$$ -174 4 -46 -209 -29 27 -310 21 55 14 1 33 66 163 -59 -55 -4 209 -136 47 -57 56 -50 45 101
6953A01l2q6j30K70n4j69O2J64j00pJ02k80K55qj29J99l31K77o0n6J10l13K12
$$ 101 69 -17 -147 123 69 -100 -38 126 26 19 121 -159 96 88 -41 158 -173 104 44 -12 98 -215 -3
6976cN0o4Q5k79K88j22r1Q3o5K23p8M4j75R0n4J01jR2p9j49J0L6jK78k43L5k7
$$ -3 47 -17 68 -211 77 -45 -136 -53 -118 105 27 71 -104 -14 -68 33 32 124 45 -104 -94 -58 -59 219 -24 11 -16
7003a6J8P6j11J40p5nP7j41RJ32O4k26jp1J25K9j58J03J78l08L49j45P7j25j00
$$ -16 2 78 -33 107 32 27 104 -37 -28 104 168 -58 -59 -130 -5 24 -134 -31 147 -161 188 43 120 -5 -105
7028a05KM3M7k1j7P5K8q8J56k55P0J31rM3m5k1M6o6j04J73m2O2k16K64n4j15q2
$$ -105 -103 -60 -13 -34 -51 24 52 -36 120 -135 -65 66 57 100 55 34 80 14 -90 83 41 103 -113 151 97 -18 -100
7055a00M0M7j17K06J23k50K14j20o9J64r7n4K10l30n6J43k7L73j74j11J2Q3j20
$$ -100 -60 -13 -130 76 199 -51 163 43 -26 138 41 -13 197 -133 -189 -46 -73 300 126 15 27 110 -10
7078a0k1o9J38J56k31k9J9M2j21L4R6j73K70O5k00Qn6P6m5j16J44j4n1O5N1O9
$$ -10 -31 -100 38 194 -37 -66 -47 -5 -126 -92 4 -169 101 166 -34 -26 -82 -6 -51 -167 -23 -37 -88 -23 28 97
7104I7k22R3O3J7j90K43k7oj01k6Q5m5J83l47J14J30j14N6p4J09p1l00Q7L08j04
$$ 97 -125 -32 31 48 -142 101 74 68 -33 -59 26 -19 164 -183 -69 61 -53 3 -71 38 -33 -333 -246 62 -42
7129d2J1k7LL4L6q0K10j47Kj47J98j26P3J24j2j76O0j15K14p1j06P4J14j51j6
$$ -42 -31 -58 -55 -21 15 -65 145 -2 0 -147 51 -75 -2 122 110 -66 -6 -121 93 22 -84 -10 104 -47 -63
7154f3n5J81l7j8J25j36Jn8k0O3l1J4Q1j3j23M7L1M8%M2j62M8O8k92K43N2O2j72
$$ -63 -118 63 26 8 133 -3 -2 -60 -80 -17 -48 -34 47 34 -89 -42 -11 37 37 79 -83 -35 33 -259 -16 36 98 -74
7182g4J24l5J03l8n0L8k1q3P3p4P7R9j85O5K3rq3K3m1J97j31p6j09K72j68J36
$$ -74 50 15 118 80 30 68 47 -36 37 -37 40 139 -46 19 42 33 -50 -27 -68 129 -2 -78 -187 85 -83 53
7208E3N6j94O2J32k07K9J90O2l5n0j28J8K11q8O7j85k08J99J0P1k63j9K87m6k32
$$ 53 109 -85 -23 109 -98 -69 121 183 148 98 -30 -12 199 111 178 -7 -215 -16 -6 65 -198 -217 70 24 -208
7233b08J60J56O2k02l4P0R8m2k69J20N4j54J44N3l0j35J74L9k2L7j51o0R8J15
$$ -208 -48 108 170 -32 -66 4 102 60 -209 -89 -35 -189 -45 8 -22 -157 17 56 34 71 -80 -140 -42 73
7257G3n2L5n1J0P6r5J36j72Q1j06J7J74j79J67k5r4J13k9Q5j99J61j07j06O1M1
$$ 73 21 56 5 15 91 -4 132 -40 41 -65 -48 126 -53 114 89 -5 108 79 164 -35 126 19 -87 -26 15
7282A5n9N3k5M1j19n8P6L1N2o4p5k2L21j13q9j05RK94j44p5l1J38L9j69J39j82
$$ 15 -44 9 -16 25 -94 -152 -76 -45 7 -57 -132 -154 167 54 -35 -140 -131 163 19 -56 -87 51 90 -79 60 -122
7308a22N2QK3l7O3j8J09j12R3o8R5j07M5j30J35P5j28K17k11j5p4M8N6K3j09M7
$$ -122 -70 -62 -39 -76 -13 -31 78 -34 59 -9 86 -21 24 -106 29 104 -24 193 -18 -33 -107 -59 -3 20 -89 -42
7334d2K5J12q4J06p3o5M5R6j99J10p4P0r5J27j27J52J10k04J56j45L1r2J33j14
$$ -42 -17 95 11 117 44 -21 24 120 -79 31 -43 27 -68 59 -68 84 194 -10 146 1 32 -60 73 -41
7358d1q4J00o4P0N1p8n4R7o4K8L4k3J11j03J62j04k34Q3R8Q8j81P0K6M2n0J3J20
$$ -41 -125 -25 -89 -19 32 -46 -100 -3 -67 -39 -5 -28 83 -20 142 38 -196 -113 -15 73 -108 -38 -12 30 -20 -7 113
7385A13j80K8n6N1J8L3q4J29nj59N5k5O8J15k95K62P9k97OL01j61kJ8j09Q8K6
$$ 113 -67 -39 -95 -44 -26 7 -77 52 47 -112 -57 -82 -14 101 -194 68 147 -150 -144 157 -4 -6 12 -97 -9 17
7411A7j08Q8Mq6L7l4P9l0N9K3J09k57K78j11k6qN1K8n3N5k42J49J63l16J52k9
$$ 17 -91 -3 1 -85 -48 -82 -3 -33 26 49 158 -99 179 68 42 34 85 113 60 115 -127 22 185 -131 21 -8
7437hj26J44O0L6l07J58N5Q3r3rk5lK9J71n5j38J45j40O3j39K20j36R9j70J32
$$ -8 -134 10 70 106 -201 -43 12 95 2 -7 -32 -35 -6 165 110 -28 117 -23 40 -99 121 -15 84 -86 46
7462D6R6k43L04j39M9j21j14J10j23K54j25n3J47j45K6J67o7N7k15J05R4j39K9
$$ 46 142 -101 203 64 113 -8 -122 -12 -135 119 -6 -59 88 -57 -31 136 69 126 -89 16 110 -29 0
7485@n8J76P9r6j88R6J00m4m4l8J38j3j21o0O0j54J47o4J88Rj87J35MP2j44J84
$$ 0 -58 118 197 101 -87 9 109 65 21 -17 121 108 -13 -73 -13 -167 -20 -84 104 113 -74 61 65 137 -7 177
7511A77m01K00j8p7J93o0Kj33o2L31r6p4N1kR2k19R2j5R3j60O8J22m6j3K2k2r
$$ 177 -224 -24 -42 -119 74 14 16 -117 -179 152 56 -18 33 31 123 -96 -4 -19 74 -86 -18 104 58 45 67 45 36
7538C6j0j43J88m4n5M7j49J39O8m7p7P1J34k22n3J06J69j29KO5%p4J30k27J08
$$ 36 26 -117 71 27 -28 19 -130 9 77 30 -47 24 158 -64 -117 -11 158 29 31 96 96 22 152 -75 33
7563C3j61J91r0J02j05N1J24j33O4j93J33J52o5j62q8N0J58J8k15J86j00J84m6
$$ 33 -128 63 -27 75 -30 21 145 12 76 -117 16 168 103 -59 -147 -97 61 79 -136 50 -50 134 88
7586H8o7J10l9j36J03o4r3K00K5j01L9o9K5lj02J36N3j58J00O1N7k13N7O8j42
$$ 88 21 131 92 -44 59 -5 -98 102 127 26 65 -4 21 18 -84 52 105 -53 47 108 165 -48 9 77 -65
7611f5L3m9J09J47j78j15J27j22O5P3m6k2n5J08j00j1K4N7K14j80q9j05K09j30
$$ -65 -32 -81 28 175 -3 -118 9 -113 -48 25 -21 -43 -98 10 -90 -101 -77 -20 194 14 -75 -180 29 -101
7635a01L39k30q1p2J19R0P0L2q0j17o4J78j23Q7Lj12J68j9j20J71j66M0j47J20
$$ -101 238 8 -73 -145 -26 64 134 166 86 -31 -95 83 -40 47 50 -62 106 87 -33 138 -28 12 -135 -15
7659a5o6M6Q6Mo4J30m1j18k9j5J4Q3%j07j2J4Q1M9J8N9n9q8m2J15J40j76j19N8
$$ -15 -81 -35 51 55 -9 121 80 -38 -67 -82 -68 15 15 -92 -104 -90 -9 40 58 117 58 -30 -72 43 183 7 -112 -54
7687e4M7r7J41J7q6K6M0lk0m5J66r2R0j44L0J13j02K8k6j15O8n0mn0K92j9j12
$$ -54 -7 -104 37 54 -32 -6 34 31 11 -34 132 40 130 -14 16 129 27 55 29 -86 -18 -68 -72 -122 170 151 39
7714C9n8j41K01j93N1L8R7R5k21J75k9j43M9J58j09m9Oj28J85j58J78r1J47r2
$$ 39 -19 -160 41 -152 -101 -63 34 129 -92 83 54 -89 -40 118 9 -40 -34 -162 23 -135 43 -48 99 7
7738GJ15j54O3N2r5m3l4n0J25P9r6J49k6j79m5J27P3j30o1J73k28P5J36K39m29
$$ 7 122 -32 31 83 -12 -55 -89 -139 -14 65 -31 118 92 -87 -132 -5 68 -62 -123 50 -178 -103 33 272 -157
7763a57K16M8j78L5P6M5l01K45L1q5Qj9k7J44KRl7p9Q8n4lM8j18J91K7r5M7j24
$$ -157 59 107 -71 -36 40 85 -216 29 60 -25 -17 -36 -63 81 83 92 55 -24 64 10 7 55 -63 128 155 60 107 -17
7791a7J38j71J87j96M6NK15l27M7J81Qk09P5N3kn3O7j09J03j76J38Kl0J81k76
$$ -17 121 -50 137 -59 -13 -8 207 -120 -73 108 116 -93 -18 35 33 -20 47 -62 41 -135 3 5 -25 156 -120
7816a20J33J49o0l9Q9j22p5J18j10J50J2n2m3j23J16j66J11o0j6J29k2j10J50
$$ -120 13 162 102 63 152 30 -45 73 -37 113 125 73 30 -93 23 -143 -32 -92 -108 21 -1 -111 39
7839C9j07o3J06P5J7l4o5p1j74L12jJ48j76L9J31j07Q4l45K31j09J08j5m6J61
$$ 39 -68 -131 -25 50 67 33 -32 -103 -277 35 34 182 6 45 176 69 153 -192 39 -70 38 23 -23 138
7863A38J7k54J71o3k1n6qNK52j35o6K0o1M5N9r2J98r1m2O6j17R0m3mM5J87k28
$$ 138 155 -99 72 9 -12 -68 -76 -71 181 46 -20 0 -61 -16 43 -49 149 58 16 82 -35 55 12 8 53 240 12
7890A2R0l6o4J12l7j60j0J43k0j24J53Rp8p5J08j3L7J04j68M8j27K8L4l9J85j15
$$ 12 102 66 2 114 77 -83 -93 50 30 -94 59 68 -10 -85 23 10 47 151 -17 31 -96 -68 -34 -73 112 -3
7916cK14j84m4J42k55J70Q7k30J18J53j55n6J85j34l3j54J86j1n0PK6J14n2r8
$$ -3 211 27 -17 125 -130 40 127 -103 15 168 13 -43 142 8 -25 -179 7 -4 -54 -47 -21 93 41 -57
7940e7J13pk3l80K95R7q6J50j24k7J80j47j20J86q7J32j61N6M4j71J05l2L6Q3
$$ -57 56 49 26 -354 -59 38 -48 102 -22 -49 131 -16 -136 50 -37 95 -66 -10 34 -137 -32 -64 -28 55
7964E5M9j82O4J04j03o9J93r1q5J31n6o2oJ09n6J29k1j45j26J68J16N7j73J85
$$ 55 104 -78 -14 90 -13 -82 111 20 -65 66 10 -52 -58 51 -5 124 103 -42 -168 0 116 173 0 185
7988A85k57O7j24J04R7j20N6o4p0M1m1K10q7j56K02o8J14j16p5J70m5%j7M5n2
$$ 185 -72 -5 -129 -25 72 -48 8 -56 -126 -85 -126 84 -3 -159 43 -25 89 -27 -102 68 23 23 6 51 -1
8013aJ96j45j02Q6k8j1J08L6j7n9j6m8r1J63q8k1j20J05R0j90K70j22K9Q8n5m4
$$ -1 195 50 -52 34 6 -5 103 139 122 63 47 -1 -92 71 -17 -38 -158 -53 37 -153 117 -5 24 112 57 13
8039A3r1O6j02l1Q2N2j68J94J11j18l1k0N6oJ51j27N2j47J07q2O1m6J63j81R4
$$ 13 -78 -12 -114 -145 -63 -11 -179 15 126 8 -23 -43 13 7 158 31 83 -64 43 -39 22 -24 139 -42 52
8064E2j1n8R9n1j2L9l8O5o6k3R1j6K0j30L8K1j23r9K11P0o4m6N2P6j4OJ16l83
$$ 52 41 -17 82 31 19 58 20 85 19 -4 87 71 91 -39 -1 20 -103 -202 9 79 15 -31 21 97 83 89 205 -178
8092a78J92J09q4p7j33P9P1q1J08j82K16j92J49QO3j2j78J17l5rj25O2J89j16
$$ -178 14 123 39 -38 -171 -92 -21 -102 6 -176 40 -152 -3 5 68 56 -122 -5 -40 -49 -174 -112 77 -39
8116c9k9l1n8J6M39k88k2l1nJ99R1l20N9q8K06j4j31N1Q7j54J13j54O2P7o5K7
$$ -39 -68 -99 -157 -141 298 10 -12 -43 -48 151 242 -78 -19 -107 99 85 -46 5 92 -62 51 -103 -41 36 -29 -2
8142bk4Qn2J26Q2r7j09J5N5L1j1J04m0j22J07q4j17K51j64k6J88j05L8j38J14
$$ -2 -26 -18 -70 56 138 41 -68 -53 2 33 22 126 86 -36 71 -13 -130 121 -43 -69 119 14 52 -86 28
8167B8j36J70o5p2R0M0qp2o6l8J88Kl7j29J37J76k49j30J46Oj78K55p8J72
$$ 28 -108 62 -3 -75 15 55 47 -25 -91 -129 59 61 24 -105 32 208 -41 -171 -25 -19 -197 58 -20 152
8191A52
$$ Imaginary data points
##PAGE= N=2
##DATA TABLE= (X++(I..I)), XYDATA
0@%%%%%%%%%%%%%%%%%%%qJ6j6J6j6J6j9K7l2L3m1M8n1N9o7P5q5R4j06J22j36J50
$$ 0 0 0 0 0 0 0 0 0 0 0 0 0 0 0 0 0 0 0 0 -8 8 -8 8 -8 8 -11 16 -16 17 -24 24 -27 32 -35 40 -45 49 -57 65 -71 79
41G9j66J84k05K25k49K77l03L33l70M08m48M95n45O02o68P41q24R19j029J162
$$ 79 -87 97 -108 117 -132 145 -158 175 -195 213 -235 260 -285 317 -351 390 -434 485 -544 618
61F18j325J528j791K143k645L419m796Q014l2271r596L0957M411R873kn527m805
$$ 618 -707 821 -970 1173 -1472 1947 -2849 5165 -27106 -36702 -5745 -1334 8539 8537 3010 -1795
77a795J5383J3574O78j2160j5036k0439j0184P375J8938J2134K907o085r535o186
$$ -1795 13588 27162 27840 15680 644 -19795 -29979 -22604 -3666 8468 11375 5290 -4245 -10431
91a0431N695J1267Q426k049j1282j3023m895O601J3006J1294K827j1037j6842
$$ -10431 -4736 6531 14957 12908 1626 -11397 -16292 -9691 3315 14609 17436 6399 -10443
104a0443q565L743R592J1806Q352l769j1592l826O750P763N706J220j3213k2055
$$ -10443 -19008 -15265 -5673 6133 14485 10716 -876 -4702 2048 9811 15517 16737 3524 -18531
118a8531j2176L376J0737J4572J4072K606p949l957M753O451N042L88j1752k0062
$$ -18531 -30707 -27331 -16594 -2022 12050 14656 6707 2750 7503 13954 18996 19384 7632 -12430
132a2430j3636p80R060J4131J2297K163p062o346K29N539P694M397n827j3451
$$ -12430 -26066 -26846 -17786 -3655 8642 10805 3743 -2603 -2374 3165 10859 15256 9429 -4022
146d022j0649j857O735J2990J0396q76j0214r475l929K638J0130R633j232r093
$$ -4022 -14671 -16528 -9793 3197 13593 12717 2503 -6972 -10901 -8263 1867 11500 10268 1175
160A175p448k431K752J0225Q864l062j1747j0720n549K264J2392J4001L992m609
$$ 1175 -6273 -8704 -5952 4273 13137 10075 -1672 -12392 -17941 -15677 -3285 10716 14708 10099
174A0099o098m541R2O675O332l960j1404j1748p838J150J1911J4331O937j252
$$ 10099 4001 -540 -448 6227 12559 8599 -2805 -14553 -22391 -21241 -9330 5001 11938 10686
188A0686n486n581q08O112P076o25p848j0393q723o60R543J2330N475k188o731
$$ 10686 5200 -381 -1189 4923 11999 11374 3526 -6867 -15590 -16250 -6707 5623 11098 8910 2179
203B179q386l026O254R023K666l465o893q288k219Q111J0493M591j905p270r584
$$ 2179 -6207 -9233 -2979 6044 8710 5245 -1648 -9936 -12155 -4044 6449 11040 9135 1865 -7719
218g719l897O076R733N383R6n235r200m493M534P747L788j147o905r692m273N881
$$ -7719 -11616 -5540 4193 9576 9672 4437 -4763 -9256 -4722 3025 6813 5666 -1239 -10931 -15204 -9323
234i323J0411Q256L351l630q375n534K438O124L812Ro308j0253n705L708Q613
$$ -9323 1088 9344 12695 9065 690 -4844 -2406 3718 7530 7539 1231 -9022 -14727 -11019 -2406
249b406P894M203k687q653n726J644N950N651K929l641q986n875J974O559P210
$$ -2406 5488 9691 7004 -1649 -7375 -5731 219 5870 8799 5158 -3828 -9703 -7729 -1170 6040
264F040M849k668q775p033j84M627O172M551k214q317o242n5N118P478O007j180
$$ 6040 10889 8221 -554 -7587 -7771 -3144 3028 7579 5365 -2952 -9194 -9249 -4131 3347 9354 8174
280H174p371o404q47L454O893N544j257p325p012j914K711O442O179m94o676o456
$$ 8174 803 -5601 -6448 -2994 3899 9443 8186 861 -6151 -8065 -5354 1088 7267 6773 97 -6359
296f359k335K563O647P008K99n852o066k442J446O378P202O34n628o882l800N24
$$ -6359 -8694 -6131 516 7524 7823 1971 -4095 -6537 -5091 1287 8489 9123 3495 -3387 -7187 -6663
312f663N980O916J429m994o177m259J52N657P144J709m069n693m422J97O255Q148
$$ -6663 -683 6233 7662 2668 -3509 -7768 -7616 -1959 5185 6894 2825 -2868 -7290 -7093 -838 7310
328G310K910l189n974n079j907L971N708J448l530n586n295n62N882Q399M172
$$ 7310 10220 7031 1057 -4022 -5929 -1958 3750 5198 1668 -3918 -9213 -9775 -3893 4506 8678
343H678j161m711n550k890L015N703K205j975m671n373j816M924P807M496k10
$$ 8678 7517 2806 -2744 -5634 -2619 3084 5289 3314 -1357 -6730 -8546 -3622 4185 8681 8471
358H471m457o917m396K090N500L324k89l807n372k709M108O988M863O56l463o858
$$ 8471 4014 -2903 -7299 -5209 291 3615 3326 -481 -5853 -8562 -4454 2534 7397 8053 4590 -2268
374b268m028K141N492M491J028l004o304m548J188M163L841J066k547n701l528
$$ -2268 -6296 -4155 1337 5828 6856 3852 -2452 -7000 -5812 -1649 2192 3258 711 -4990 -8518
389h518K721O433O124L652j431o517n721j127K257L039J460k177n504l456J956
$$ -8518 -5797 636 6760 10412 8981 2464 -3257 -4384 -2127 912 2372 195 -5309 -8765 -6809
404f809N842O562M419q97o268o505k091J492L605K967o46m558l528J033M619O002
$$ -6809 -967 5595 10014 9117 2849 -3656 -5747 -4255 -650 2317 1671 -2887 -6415 -5382 -763 5239
420E239M696o40n939o383k585J037L721M089R6m333m123j142K257M353M535N99
$$ 5239 9935 9295 3356 -3027 -5612 -4575 -854 3235 3331 -1002 -5125 -6267 -4010 343 4878 5477
436E477m124m489j797K027N024N509J402m176n838l911q72K330L987P57l266l664
$$ 5477 1353 -3136 -4933 -2906 2118 7627 9029 4853 -985 -4896 -5768 -3438 549 1306 -1960 -5624
452e624j089K494N875O916K377l354n900n004k580J739M101J531k150l118j323
$$ -5624 -6713 -4219 1656 8572 10949 7595 1695 -3309 -5889 -4150 -49 1482 -668 -3786 -5109
467e109J324N176O045K351k990n332n516l104J711M288K645p82k325k494q8L662
$$ -5109 -3785 1391 7436 9787 6797 1465 -4051 -7155 -5444 -1156 1489 707 -1618 -4112 -4200 -538
483e38N495K679j463l971m818k772K132M908L092m97l185m416l106J521M209K743
$$ -538 4957 7636 6173 2202 -2616 -5388 -3256 1652 4744 4247 1062 -3354 -6460 -4939 -730 2013
499B013o1k091l196j017L011N830L758J84l421n875m723n10K942K571J061j032
$$ 2013 1952 -139 -3335 -4352 -1341 4489 8247 8431 5010 -865 -5588 -6098 -3156 -585 476 -556
515e56k676j431K982N132L936P05k985n760n342q46K630L430K394l32k380k147
$$ -556 -3232 -4663 -1681 3451 7387 8092 5107 -653 -5995 -6841 -4211 -781 1613 1281 -1099 -3246
531c246J643L948L532J451j935n564n116r70K482L468K737j60l115l399P6K873
$$ -3246 -1603 2345 5877 7328 5393 -171 -5287 -6257 -3775 -307 2430 2270 -845 -4244 -4168 -1295
547a295L337K734m06l549l739k04K513L704K844m92m385m982j990R19K852L083
$$ -1295 2042 4776 4370 821 -2918 -3122 -609 3095 5939 5447 1062 -3920 -5910 -4991 -2139 944
563I44J022k439k434L3K681L795L248j6m149n295l295L85K612L675J736j452k415
$$ 944 1966 -473 -2907 -2874 -193 3602 6850 6834 2685 -2610 -5905 -5520 -2908 767 2503 1051 -1364
580a364p05J358L096L182L84l736m982l169k44K509M296K247j156k311j489L64
$$ -1364 -2069 -711 2385 5567 5951 2215 -2767 -5936 -6180 -3671 625 2872 1716 -595 -2084 -1720
596a720K543L608J011k103m002k886o89K167L818J841j432l024l062j047J950
$$ -1720 823 4431 5442 3339 -663 -3549 -4238 -2071 1747 3588 2156 -868 -3930 -4977 -3027
611c027L901K364n82k232k049q34K257L870J769j396l519l697k346J247L349L048
$$ -3027 874 3238 2656 424 -1625 -2459 -202 3668 5437 4041 522 -3175 -5521 -4274 -925 2123
627B123K2j539k233j160J673L585K131q01k964l712k225O31L698L010J020j045
$$ 2123 2145 606 -1627 -2787 -1114 2471 4602 3801 837 -2875 -5100 -4469 -771 2239 3259 2214
643B214k472j972R41L005K142l44k030l827k735N56L064K922J425p61l115k190
$$ 2214 -258 -2230 -1289 1716 3858 3514 1484 -2343 -5078 -4522 -1458 1464 2889 2128 -987 -3177
659c177L82K924K857Q13p57l134k691j45K516K826R43j034l235l009l96K164K848
$$ -3177 -2795 129 2986 3799 3042 -92 -2783 -2928 -412 2414 3357 2323 -912 -3921 -4317 -2153 695
676F95J947nk596k430l89K165K862J553o11k649l304j094J641K898K190L60k278
$$ 695 2642 2637 41 -2389 -2778 -613 2249 3802 3191 542 -2762 -3856 -2215 683 2873 3233 955
693I55k947p62J071K367K170k2k482l152j198J252K736K932Q81j908l012j270
$$ 955 -1992 -2754 -1683 684 2854 2832 350 -2802 -4000 -2748 -12 2920 3801 1893 -1119 -2389
709b389R27K090K424O07k406l190j616O39K125K646J059j588k941j357K53K159
$$ -2389 -1462 628 3052 3659 1253 -1937 -3553 -2914 -789 1857 2916 1328 -1613 -2970 -2717 -558
725e58K646J249j331k765j700L2J641K952J442j363k475k139p22J978K479J373
$$ -558 2088 3337 2006 -759 -2459 -2427 -786 2166 3608 2245 -230 -2369 -3091 -1113 1366 2739
741B739j081k570j886o41J307L204K058m26k294k122q32J495K624K051p18k368
$$ 2739 1658 -912 -2798 -3439 -2132 1072 3130 2704 410 -1712 -2544 -1049 1575 3626 2908 540
757E40k291j256Q93K639K044l54k124k243j329R15K759K330N2j565k066j342Q25
$$ 540 -1751 -3007 -2114 525 2569 2215 91 -2152 -3481 -2566 193 2523 2575 1010 -1056 -2398 -1573
774a573K361J800L47j703k380j914L86K302K290P63j021k094k148K87J944J914
$$ -1573 788 2588 2935 1232 -1148 -3062 -2676 -374 1916 2679 1658 -436 -2584 -2297 -353 1561
790A561M20j094k187k070J45K594K723J385o25j873k233l99J404K105K84r19k466
$$ 1561 1981 887 -1300 -3370 -3225 -631 2092 3477 2852 979 -1254 -1653 -249 1856 2140 1221 -1245
807a245k335k97K112K653J515O7j841k136p25J448J926J571m12k006k281o08J199
$$ -1245 -3580 -3877 -1765 888 2403 2470 629 -1507 -2232 -784 1142 2713 2301 295 -1986 -2594 -1395
824a395K196J654o4k003k503r41Q67K110K031N62j433k178j119Q37J681J757L41
$$ -1395 801 2455 2391 388 -2115 -3056 -2189 -79 1952 2514 1081 -1097 -2216 -1379 302 2059 2400
841B400j781k532j104P86K298K577Q59j047k420j668n8J157J404L92j590j998
$$ 2400 619 -1913 -3017 -2231 67 2644 3503 2456 36 -1632 -1690 -533 871 1263 -327 -2325
857b325j386R65K121K795J535o65k153j755l66R21J521J017j235k162j600j41
$$ -2325 -3711 -2746 -625 2170 3705 3040 887 -868 -1234 -313 1208 2225 990 -1172 -2772 -2913
873b913J563K368J652n94k061j569q75R92K245J494k01j698j608o17N41K309J173
$$ -2913 -1350 1018 2670 2076 15 -1554 -2429 -1437 808 2302 2101 403 -1205 -1822 -1281 1028 2201
890B201m56j810k004o10R27K231K048J76j523j746j545L51J431J366o1j182j681
$$ 2201 1745 -65 -2069 -2679 -1752 479 2527 2703 1180 -566 -2111 -1760 -329 1037 976 -206 -1887
907a887p82R96K389K499O00j104k115k040k38J075J268Q7j099j644r85M35K323
$$ -1887 -2669 -1673 716 3215 3815 2711 596 -1444 -1682 -607 661 748 -351 -1995 -2980 -2545 -222
924b22K161R96n43j852j832m26J218J579Q18n63j500j773l91J813J756Q29n59
$$ -222 1939 2935 2392 540 -1292 -1718 -500 1079 1897 1334 -166 -1939 -2330 -517 1239 2068 1509
941A509j692j977l31J350J924J483l30j278j916p76R47J389J240p9j447j694m08
$$ 1509 -183 -2160 -2491 -1141 783 2266 1936 658 -1258 -2034 -1087 302 1542 1463 16 -1678 -2086
958b086J323K088J591L7j361k447j286J71J128J068J96r08j354l40J020K144J984
$$ -2086 -763 1325 2916 2953 1592 -855 -2141 -1970 -842 226 422 -486 -1840 -2180 -1160 984 2968
975B968M77j274k141j591j22J150J326K23p23j693r29P82J437J619Q51q26k092
$$ 2968 3445 2171 30 -1561 -1683 -533 793 1016 293 -1400 -2329 -1547 -110 1509 2360 1534 -558
992e58j241N5J091J802J033p15j447j537P1P33J612J063p68j581j345j50J141
$$ -558 -1799 -1744 -653 1149 2182 1467 20 -1517 -1446 -713 899 1962 1194 -387 -1732 -1882 -741
1009g41J895J058k94j790j609n62M22J470J388p2j482q43l3P73J945J174k99j560
$$ -741 1154 2212 1918 128 -1481 -2043 -1621 -151 1237 1165 -317 -1160 -1193 -420 1525 2699 2400 840
1027H40j763j233J79J242J278K32j005j165k57N36J652J680K23j108j720j383
$$ 840 -923 -2156 -1977 -735 543 775 -230 -1395 -1652 -1116 536 2216 2439 1331 -389 -1772
1043a772J18J394J594K73q65j456j009K55J207J517M78q47j570j185P3J171J841
$$ -1772 -1654 -260 1334 1607 742 -714 -1723 -1468 -261 1256 1734 887 -683 -1868 -1795 -624 1217
1060A217L99m95j191j392l09J224J558O40k89j277j495k4J027J482O94m76j289
$$ 1217 1616 1121 -70 -1462 -1771 -547 1011 1651 1362 85 -1410 -1434 -407 1075 1769 1293 4
1077Dj334q83P08J567J050o5q01j278l03R15J613Q42j01r32j965r67P42J248R98
$$ 4 -1330 -2213 -1505 62 1112 1047 246 -1032 -1335 -420 1193 2035 1934 1002 -963 -1930 -1188 60 1058
1096A058K09r86j457p18P47J365J067K58o83j565j154P99R29J410M26p56j211
$$ 1058 1267 281 -1176 -1894 -1147 218 1285 1543 860 -705 -1859 -1060 -131 1279 1705 949 -262
1113b62j157L48J155J028M73n30j873r99L55R21J157P24l67j191j214k0J115J326
$$ -262 -1419 -1071 84 1112 1585 1055 -818 -1817 -1462 -541 616 1340 973 -218 -1432 -1452 -337 989
1131I89P13j77j443j376q4P83J405P97l34j338j427j72P83J108J108j68j470j055
$$ 989 1702 1525 82 -1294 -1378 -595 810 1607 1273 -65 -1492 -1664 -881 227 1335 1167 -303 -1358
1149a358j91O53J470J056o6j169j186l22M71J064J085N3j216j255n26K80J197
$$ -1358 -1549 -896 574 1630 1564 395 -791 -1113 -642 422 1507 1560 344 -911 -1437 -1157 40
1166D0J067J98j006j271q16K19J244J378M36o23j168o18J40J096J267K37j126
$$ 40 1107 1305 299 -972 -1788 -1569 -325 1053 1489 866 -302 -920 -780 316 1583 1820 694
1183F94j427j189q4J015J405Q37m55j169n21K0P89J286M73o59j375r11m33R71
$$ 694 -733 -1922 -2006 -991 414 1251 796 -373 -894 -874 -85 1201 1674 1015 -360 -1271 -1704 -733
1201g33J378P44k78q94j043j43O32J083N75l15j002j351l53O56J408P61m1p43
$$ -733 645 1389 1111 217 -826 -969 -337 746 1321 1006 4 -1347 -1700 -1044 364 1125 1084 341
1219C41j056o13O07J079J086q3o16j220n94N21J027Q31k92r38j322q16L17J288
$$ 341 -715 -1328 -721 358 1444 1361 745 -475 -1069 -548 479 1310 1018 80 -1242 -2058 -1741 -453
1237d53J121O38l72j017l69K32Q29R14K5j082j284j019j24J088J366Q57k80r50
$$ -453 668 1306 934 -83 -452 -220 609 1523 1548 466 -818 -1837 -1961 -873 493 1350 1070 120
1255A20p45o5Q41P04M19n99j400q40K6Q04J392P21j63p92q31l91M79J032M60k60
$$ 120 -625 -690 151 855 1274 675 -725 -1565 -1539 -735 657 1378 1215 423 -408 -799 -320 712 1172 912
1275I12j235p88l38O67R50R54P9j385r62k76M81R05J172J91k93q50n90K42P69
$$ 912 -323 -1111 -1449 -782 168 1122 1201 -184 -1146 -1422 -941 -36 1136 1327 1034 184 -406 -164 605
1294F05M66j55j207j230m98L11J238J323N46j86j069m70N2M78P59q4q24j043p37
$$ 605 1071 916 -291 -1521 -2019 -1708 -470 853 1399 1213 144 -326 -274 204 963 879 55 -988 -1725
1313a725L60R39J362N59l88q77q30j42N06P26K94n23j068p65K41Q17J277N25l56
$$ -1725 -1365 -426 936 1495 1107 230 -600 -742 -236 490 784 261 -807 -1572 -1331 -514 763 1288 932
1332I32p30r46j65N91J118M11j04q46r23m38N92R20K83m39o96j088j78O83J247
$$ 932 202 -744 -909 -318 800 1211 1107 261 -662 -1100 -508 412 695 256 -440 -1528 -1706 -1023 224
1351B24R34L57m84q75o82K58Q46M10n33p40j128l41M48J355J089L12n65p60p38
$$ 224 1158 1515 1031 156 -526 -268 578 988 455 -285 -1413 -1754 -1306 49 1138 1450 885 125 -613
1370f13J89M63M36L1n39j095k92K75J150J125L13l89r15r02o6O08P13K65l19r75
$$ -613 -424 39 475 506 -33 -1128 -1420 -1145 5 1130 1443 1054 139 -763 -829 -221 492 757 438 -537
1390e37p27K48N82P73N31k25q84p77K2P76Q68O66Q0q89p98l13K12P60J44l50o42
$$ -537 -1264 -1016 -434 339 870 645 -239 -1016 -994 -218 650 1316 1396 507 -291 -604 -392 368 512 162 -480
1411d80q21k85Q11J064R69j32l68p57o04K24N13M71o5p58o35k97K55J131R47L54
$$ -480 -1301 -1586 -775 289 1258 1126 758 1 -603 -379 134 605 540 -218 -853 -1150 -895 236 1183 1537
1431A537q40j075n28K7O43N83K32n04r03m18N52Q45P54M61o35p61o79O0N78P28
$$ 1537 697 -378 -906 -879 -236 347 579 75 -828 -1246 -694 151 905 1366 731 -30 -709 -649 -71 657
1451F57L30m94p01p04mM56Q99K48l89o11o99PQ75P11O07m8q23n59m78L23Q57M14
$$ 657 987 493 -208 -912 -916 -460 439 687 298 -313 -1012 -1005 -130 581 1188 1140 317 -242 -720 -397 460 874
1473H74l66o03p67k57N55R29O22l0p54q27l75M14O78L99J42o36n75l40N87P16
$$ 874 508 -95 -862 -1119 -564 365 987 957 203 -624 -999 -585 93 492 634 -2 -577 -917 -330 386
1493C86N88J46p16o71o50J66O32N92K56m91p99m03J91P03P42K31m06p59m63J48
$$ 386 974 1120 404 -267 -917 -751 -119 473 729 238 -561 -964 -773 -70 672 903 497 -262 -725 -577
1513e77Q03L36M18m86p62m49j45O98N76L23m50n41n11j22N50O33L11j07o10m64
$$ -577 226 562 980 494 -268 -717 -862 -164 412 735 285 -256 -767 -889 -339 294 605 498 -112 -576
1533e76m3N42O09N50k20p98q10j08M56Q23L39k58m09q43j91K98O28O79R0p32n48
$$ -576 -619 -77 532 1082 862 64 -746 -854 -398 425 764 506 97 -746 -937 -639 -11 668 758 26 -522
1554e22j05J18P35M82J24l82q99l65K96N48L02J25m22n79j65J92N35P75J61n37
$$ -522 -627 -509 226 708 832 450 -449 -814 -518 30 332 457 35 -544 -709 -517 18 793 954 417
1574D17p88n98J47N93N08K30l62m52k51J00P60M89K14n47o99l81l74N04N12M40
$$ 417 -371 -969 -822 -229 279 509 147 -305 -556 -456 304 793 1007 460 -239 -620 -994 -490 22 462
1594D62k87n01k15MN65M58O00l51p80n39l2Q8Q44K98R2q10n51k53N55M37M40j55
$$ 462 175 -326 -541 -537 28 486 1086 735 -45 -584 -616 -528 316 614 706 -104 -655 -908 -353 84 524 369
1616C69l72m72j69M49P52J71K5k97p11l16J3L43O05j80N2p13r3L46O85N70j78
$$ 369 -3 -475 -644 -195 557 728 753 456 -255 -571 -558 -215 390 210 262 -451 -544 -198 487 1057 879
1637H79o04p95m90J2O28L92K71k23k64j92K45O68N11N2k64p50q48j31M31M31L41
$$ 879 275 -520 -1010 -998 -370 22 293 70 -194 -386 -141 527 1038 1090 826 76 -772 -903 -472 -41 300
1658C00l0n45k99K37L69L60M85m15n16m56K4M12N45L33p3o11n30k57jO97M08k19
$$ 300 270 -275 -574 -337 32 392 877 462 -54 -510 -486 -74 471 804 731 120 -410 -667 -668 29 437 218
1680B18n23j36M5K24P49M71k51q17n17m57K68L72N28K55j97k83n3J74O56L62l03
$$ 218 -305 -441 -396 -172 577 1048 797 -20 -537 -994 -726 -354 174 429 232 -51 -104 70 726 1088 785
1701G85n65r13l79K9M33P12L32l18k96p5K73N42N26j65n68p56k14j37K91P22J55
$$ 785 220 -693 -1072 -1043 -610 102 434 116 -180 -255 18 560 1086 921 353 -403 -617 -754 -463 259 414
1722D14j69m31m38P2M19K64J34o4n39q1m3P58K68K50j71p49m74j64J92N27M56
$$ 414 245 -186 -624 -552 -133 131 265 201 -338 -419 -462 296 564 814 643 -106 -580 -744 -552 -25 431
1743D31r7j00l77J34R0M84K66l28o15p94q9K7N85O34L44l52k74K14K9N17M5k73
$$ 431 334 234 -143 -9 81 565 831 503 -112 -906 -995 -968 -383 251 595 243 -31 183 212 729 774 501
1765E01n90m42l55J05M58N97J25k06k54k48K29K68L87r1j46n99l06J45N34N37
$$ 501 -89 -531 -886 -781 -323 274 399 193 -61 -309 -80 188 575 484 338 -261 -567 -422 112 649
1785F49Ml00n92k50j47M20N97qj21k85j55j27O59L06n2j55p06m91j46M98O10L11
$$ 649 653 353 -239 -489 -636 -216 381 373 252 -33 -188 -315 344 650 598 443 -263 -754 -900 -402 208 519
1807E19L7k60j49j64K50J70J33k99m73o26rJ7O97L81K67j24n46J51J26L11J17
$$ 519 556 296 147 -17 233 403 536 237 -236 -862 -871 -854 -157 224 491 367 -179 -28 98 409 526
1828E26l6l91m95k77K19N07L58m5j93m22l35K39L75L66J33m15l76j31K01J93N52
$$ 526 490 99 -396 -673 -454 53 411 366 173 -249 -584 -345 30 396 529 114 -262 -393 -192 1 553
1849E53j35m01l04k96K7L57M45L33l10m40k9q2J93M20M2k16n86k58J40K95N26
$$ 553 418 17 -287 -583 -556 -199 246 579 269 -171 -200 -282 -89 331 373 157 -429 -687 -547 -252 274
1870B74J53Q5l35k61j13M52J05k2j4n39m03L3K71N37o3K02l73j04k53K70L32K15
$$ 274 427 512 177 -84 -197 255 360 338 324 -215 -618 -585 -314 223 160 362 -11 -115 -368 -98 234 449
1892D49j37k84k62k74J76M88Q9J78n17j76k31J43M54K28N4l28k70j44K02R6N59
$$ 449 312 28 -234 -508 -332 156 245 423 -94 -270 -501 -358 96 324 378 50 -220 -364 -162 -66 493
1913D93j5k29l19l82K53K97M73r1j36m88k64P5L24K56J16m11k22k23L0L28M56
$$ 493 478 249 -70 -452 -199 98 571 480 344 -144 -408 -333 -9 247 363 -48 -270 -493 -463 -135 321
1934C21J59k22k87k59J78P7L95K76m65j85k48k47L63L45J55k8m01k62K8J37L22
$$ 321 480 258 -29 -288 -110 -33 362 638 173 -12 -260 -507 -144 201 356 328 -73 -335 -307 -170 152
1955A52J39P1l46m03o8L35J98L26J72l95n31R2M1L82K86o6l09l93j05K44Q2N54
$$ 152 291 362 16 -387 -455 -120 78 404 576 181 -350 -258 -217 165 451 385 76 -317 -422 -178 -96 458
1977D58k02k05j76j14K53M8L38r4k49k95R4r3K68J17O7o1l45r7J20K09J44J43
$$ 458 256 51 -125 -239 14 62 400 306 57 -238 -144 -237 31 148 215 154 -191 -288 -168 41 185 328
1999C28j16l59k78K26K50K42Q0l14k77n6N2L46J36Q9J4k70k17k43K04L59J13j28
$$ 328 212 -147 -425 -199 51 293 373 59 -218 -274 -222 124 260 349 363 93 -124 -367 -163 196 309 181
2021A81k56l87L3L32J90M00j10k12j28j80l7K92J72k70j62j71j77L12L70K37j08
$$ 181 -75 -462 -429 -97 93 493 383 171 43 -137 -174 118 290 20 -142 -313 -490 -178 192 429 321
2042C21k46j05j28Q2K4K84m7j32k75oj04M76L30kk10n14j8J50p6L57L3j39j63
$$ 321 75 -30 -158 -76 -52 232 185 53 -222 -228 -332 144 474 472 262 -252 -270 -120 -196 161 194 55 -108
2065a08k09J80m1M77j15J8m46j77L72L0M25O2q2l74j37j68K07N8L28j80n17j06
$$ -108 -317 -137 -178 299 184 202 -244 -421 -49 -19 406 468 386 12 -125 -293 -86 -28 300 120 -397 -503
2087e03J92L84M61j17k8k42k43l5q8L87oK4m52o3o1J69K39L34j08j00m27j31L01
$$ -503 -311 73 534 417 389 147 -96 -131 -219 168 162 186 -266 -329 -390 -221 18 352 244 144 -283 -414 -113
2110a13K19N3j12n7j79r2J36L14J06Nq6l25j52Q8L60J50J48m40j40k16J51J05
$$ -113 106 159 47 -10 -189 -281 -145 169 275 280 194 -131 -283 -195 165 315 463 23 -117 -333 -182 -77
2132g7K00oj94k74j09K21K86L96O5r4l63j99J14n3J57o0o2l09%K0L31L89N8p3
$$ -77 123 117 -77 -351 -460 -239 47 443 508 414 51 -148 -34 -87 70 10 -52 -361 -361 -341 -10 379 437 364
2156C64l31k07o4J7L54J02j93j16k97L21L1L08J59j23k47m39L0K17J92J51mk56
$$ 364 33 -174 -238 -221 133 235 42 -74 -371 -50 -19 289 448 325 78 -361 -331 -114 78 229 225 -31
2178c1j60j92K02J12L45j81j19k14J08j9L21J52K34m37o8l32rN2P2R0k2j57j01
$$ -31 -191 -383 -181 -69 276 95 -24 -238 -130 -149 172 324 558 121 53 -279 -288 -236 -164 -74 -96 -253 -354
2201c54K1L94J92K84k37m18j46K35k35N02j15r1j53j45K20R6K44K6k05p0k29j99
$$ -354 -333 61 253 537 300 -118 -264 -29 -264 238 123 32 -121 -266 -46 50 294 320 115 45 -184 -383
2223c83L55J77N3k57r3j81L27o6M73l34Q6j01l32P3%L18J49n2j42k58P%K35J12
$$ -383 -28 149 202 -55 -148 -329 -2 -68 405 71 157 56 -276 -203 -203 115 264 212 70 -188 -181 -181 54 166
2247A66J05l40k36l5L49J26K57J41l02l44k11R2K19J20k44kl5k32J03M03K59j25
$$ 166 271 -69 -305 -340 9 135 392 533 231 -113 -324 -232 -13 107 -137 -139 -174 -406 -303 100 359 234
2269B34J9k01j94J57r7K83j65Q0m93J24K81K09R4o2j73k19j06o8L06K20l6p9j77
$$ 234 253 52 -142 15 -82 201 36 116 -377 -253 28 237 331 269 96 -123 -229 -297 9 229 193 114 -63
2292f3k02j9K90J98N1j00k75j77K25J28L5J69j32k09j63m0J11J50P2J4j89k5n8
$$ -63 -265 -284 6 204 255 155 -120 -297 -72 56 91 260 128 -81 -244 -284 -173 -23 49 63 -126 -151 -209
2315b09J51J82K72k24j02k32N0o7K37J14j53j67N9j31L3L45J4K73l62k88k75L42
$$ -209 -58 124 396 172 70 -162 -112 -179 58 172 19 -148 -89 -220 -187 158 172 445 83 -205 -480 -138
2337a38J79J19nj56l60J11j36M91N3R3j07k31o8N4J75P6p4Q4k59j05p0J49J20
$$ -138 41 160 155 -1 -361 -250 -386 105 158 251 144 -87 -155 -101 74 150 76 160 -99 -204 -274 -125 -5
2360eM2O6j90j62K30L0R9q4Q3j80j12k7K08K37l09J85j41q6p3J44J03K37j80j88
$$ -5 37 103 -87 -249 -19 11 110 26 109 -71 -183 -210 -2 235 -74 111 -30 -116 -189 -45 58 295 115 -73
2384g3l8n8j07M19R3k1k87k00J30OL63K3J56o12n1K1J32k7L75j51j62l2k4K00
$$ -73 -111 -169 -276 143 236 215 -72 -272 -142 -136 227 250 406 -206 -257 -236 -104 -131 244 93 -69 -101 -125 75
2408G5J29L5qJ9l65r7J3J50J00J85n8j79j71O2J18J34K1k40j69R1J3K10J01L1
$$ 75 204 239 231 250 -115 -212 -199 -49 51 236 178 -1 -172 -110 8 142 163 -77 -246 -155 -142 68 169 200
2432B00L7l73J79j05Q5K02P5j67k57q1M1K06K0K2N8j14k26j24L37K15j02M6k98
$$ 200 237 -136 43 -62 23 225 300 133 -124 -205 -164 42 62 84 142 28 -198 -322 15 230 128 174 -124
2455a24R7J2m8K05O9j9j49l20m8J51K35P2qk21Q5j57NK43R1q5j03O5k08M6K12
$$ -124 -27 -15 -63 142 211 192 43 -277 -325 -174 61 133 125 -96 -11 -168 -163 80 171 86 -17 48 -160 -114 98
2480I8j4R2q9j22n9NQ5J34K9j04o8j11j0J25J5J87j82L4j01K4J88J74l06j2r0
$$ 98 84 176 87 -35 -94 -89 -4 130 159 55 -13 -124 -134 -9 6 193 11 45 -56 -32 156 330 24 12 -78
2505g8j38J45O0P9L2n9k00j85R6O0L85r5J8o2j93l6J67J18J2j53j77J05p2M8L06
$$ -78 -216 -71 -11 68 100 41 -159 -344 -248 -188 197 102 120 58 -135 -171 -4 114 126 -27 -204 -99 -171 -123 183
2530A83l4K2k36k04QK33P1L9L9j19j92R6q6J21L24L2j33j38j59pK54N5o6j7k76
$$ 183 149 171 -65 -269 -261 -28 43 82 121 2 -190 -94 -180 -59 265 297 164 26 -133 -140 114 169 103 86 -190
2555a90n1K40j46J31J27j98m1j18J51J94J45k2n9k47n8P1RJ67k1p8k05p7J19O3
$$ -190 -241 -1 -147 -16 111 -87 -128 -246 -95 99 244 222 163 -84 -142 -71 -62 105 84 6 -199 -276 -157 -94
2579i4K14n2Q5k79P5j6J07J32J69k43k55J07l5l1K34r1J74j27k05l0J66Q4J43
$$ -94 120 68 153 -126 -51 -67 40 172 341 98 -157 -50 -85 -116 118 27 201 74 -131 -161 5 89 232
2602B32m30K37j18j1j2L4M4J34q6j84Q7j76M20j05P8r8j97p6K65NJ08k4r0l6k19
$$ 232 -198 39 -79 -90 -102 -68 -24 110 24 -160 -73 -249 171 66 144 46 -151 -227 38 43 151 127 37 1 -218
2627b18J4J10J58K13j88p8j0n6J27J30p4M4l79Qn2K43J60Qq2j70R7j23o7L59m5
$$ -218 -204 -94 64 277 89 11 1 -55 72 202 128 172 -207 -199 -251 -8 152 160 78 -92 5 -118 -185 174 129
2652A29j11k09J52j15J70K60p4o9j36j18O5K25l4R6k83Kj35j77L28pJ36L7k97
$$ 129 18 -191 -39 -154 16 276 202 133 -3 -121 -56 169 135 231 -52 -50 -185 -362 -34 -41 95 132 -165
2675a65K3O7r7K56Q1q2mj93r1K73l4J41%j87j86j33J78J43P7J94k41r7J5PJ34
$$ -165 -142 -75 -172 84 165 83 79 -114 -205 68 34 175 175 -12 -198 -331 -153 -10 67 261 20 -77 -62 -55 79
2700G9J18j11j38R2q3R3L9J58j36L8l35J42j25L85j32L2j63j30kL2J01J8L28j90
$$ 79 197 86 -52 40 -43 50 89 247 111 149 -186 -44 -169 216 84 116 -47 -177 -179 -147 -46 -28 300 110
2724A10k13n1R3J15L8Q8k56o2r5J28r3K64Q1j02q3M3O3k69K94K9J1j33p9j0P4
$$ 110 -103 -154 -61 54 92 180 -76 -138 -233 -105 -198 66 147 45 -38 5 68 -201 93 122 133 0 -79 -89 -15
2749a5n0K76k01qj91L7j0K84K9q7j16J06n3L5M3j2j0O6k36%p3K01L9M1o5l5j5
$$ -15 -65 211 10 2 -189 -152 -162 122 151 64 -52 54 1 36 79 67 57 123 -113 -113 -186 15 54 95 30 -5 -20
2776b0J2P2l4m7k0j25j9J75r3K11Qk2k04J1Q0j37K05m1J13r9q7J54j24K03k11
$$ -20 -8 64 30 -17 -37 -162 -181 -6 -99 112 120 98 -106 -95 -15 -152 53 12 125 26 -61 93 -31 172 -39
2801c9J22pk29m1J12K02j15J39j49p6O2n6J44J53k58J66k45M9K65j29J69j40k27
$$ -39 83 76 -153 -194 -82 120 5 144 -5 -81 -19 -75 69 222 -36 130 -115 -66 199 70 239 99 -128
2824a28J5r4K52K5mJ14j54j44J7N9nJ80R6j81K0l41N0L96k04L06n3k85j39K24
$$ -128 -113 -207 45 70 66 180 26 -118 -101 -42 -47 133 229 48 68 -273 -223 173 -31 275 222 -63 -202 22
2848B2j12P6J84j79n9j19J48m3Q9LJ16k56oJ01n6K29k39K22j11J1j26N8r8K27
$$ 22 -90 -14 170 -9 -68 -187 -39 -82 7 10 126 -130 -136 -35 -91 138 -101 121 10 21 -105 -47 -145 82
2872H2K1j65P9Mp4K16j3J6k54L9j5J7K18K1k04K8J60k39J24Q7qr1pj77Q1j99L51
$$ 82 103 -62 17 21 -53 163 150 166 -88 -49 -64 -47 171 192 -12 16 176 -63 61 148 140 49 42 -135 -54 -253 98
2899I8n1J43j14L6k85J32Q3l9J22j92k2j48J71N8P6J52j71O3l69K28l1J10O4k0
$$ 98 47 190 76 112 -173 -41 42 3 125 -67 -89 -237 -66 -8 68 220 49 112 -257 -29 -60 50 114 94
2923I4j57q7J83q3J21M8l0J2j88j64K48N1l5j63P6j47J68j01J14J80J01k52R7
$$ 94 -63 -150 33 -50 71 119 89 101 -87 -251 -3 48 13 -150 -74 -221 -53 -154 -40 140 241 -11 86
2946H6j51R4o9K24k34J90k78N1J55r0L17k10k33J49M2p6nJ89j5j90K2J9j2R9J7
$$ 86 -65 29 -40 184 -50 140 -138 -87 68 -22 295 85 -148 1 43 -33 -38 151 136 -54 -32 -13 -25 74 91
2971I1Q6k31J19l04J92R8m7K82k85k77J88m0J87O4r3p4j28J49o4P0K76Q0k58j16
$$ 91 177 -54 65 -239 -47 51 4 286 1 -276 -88 -128 59 123 30 -44 -172 -23 -87 -17 259 339 81 -35
2995c5J4J2K8j4M2k77J89m1j2P0J47P4j15k72R7J06O0o4k1L2j29J9M2O1J1J39
$$ -35 -21 -9 19 5 47 -230 -41 -82 -94 -24 123 197 82 -190 -93 13 73 9 -12 20 -109 -90 -48 13 24 163
3021A63m1l09J19j19J13jQ6J77r4k38j03L9L37o8o0n4MP5j52K40p7K98j98n2j82
$$ 163 122 -187 -68 -187 -74 -75 11 188 94 -144 -247 -208 129 61 1 -53 -49 26 -126 114 37 335 137 85 -97
3046i7r8J40Q3J2p5M4rj78J83J30J84j77k68oj87K89K91j87o0M5k02Q2N5O1j00
$$ -97 -195 -55 28 40 -35 9 0 -178 5 135 319 142 -126 -132 -319 -30 261 74 14 59 -143 -61 -6 55 -45
3071d5p3J02nk7M9N8K7m9k94J98n2J34P1n9J1j90R2K5n6K36J24q4j33j72j83K80
$$ -45 -118 -16 -21 -48 1 59 86 37 -257 -59 -111 23 94 35 46 -144 -52 -27 -83 153 277 193 60 -112 -295 -15
3097a5P7J04j46n7O2j46J28Q0N0K8j26J1j25j08K44Rj56K0J89j92j8Q5J01J00
$$ -15 62 166 20 -37 25 -121 7 87 137 165 39 50 -75 -183 61 70 -86 -66 123 -69 -87 -2 99 199
3121A99j06r8k13J20%K36p5K9o0j39J5M0K42l1q3j02K7o4j07Q4KJ80k03M5m4J47
$$ 199 93 -5 -218 -98 -98 138 63 92 32 -107 -92 -52 190 159 76 -26 1 -63 -170 -86 -84 96 -107 -62 -106 41
3147D1P5r5J5m5r3K3L3J75Ql9k55J07P1j77J55L9J59m3l74R5J57K13k21J59k73
$$ 41 116 21 36 -9 -102 -79 -46 129 137 98 -157 -50 21 -156 -1 38 197 154 -220 -125 32 245 24 183 -90
3172i0K4N6Q5J06r9l5k8j85J16k0K34r9Q9j87r6R6J9J1o1J92j21o9P1j23O0K42
$$ -90 -66 -10 75 181 82 47 19 -166 -50 -70 164 65 154 -33 -129 -33 -14 -3 -64 128 7 -62 9 -114 -54 188
3198A88lj79r1l8j82J86J97Lk2P9k76O8l0J64q6R9nj07k22J99Q7R5J7j30qN0j6
$$ 188 185 6 -85 -123 -305 -119 78 81 59 138 -138 -70 -100 64 -22 77 72 -35 -257 -58 29 124 141 11 3 53 37
3225C7K6J11m7Ol87J00J14P8k2J3Rj65J01k84K70L8R8n2j47O8J24M6l12L03O5
$$ 37 63 174 127 133 -254 -154 -40 38 16 29 38 -127 -26 -310 -40 -2 96 44 -103 -35 89 135 -177 126 191
3250A91q7m17K37J6N8j2J7J0l6L1O1Q3k47J31n2j51N2p8J64N7R5k44O8J47k22
$$ 191 104 -313 -76 -60 -2 -14 3 13 -23 8 69 152 -95 36 -16 -167 -115 -193 -29 28 123 -121 -53 94 -128
3275a28J92j00J39l61J15j31J70J98j07J88j94r1J45j12J65k0J23k45m7k8J90
$$ -128 64 -36 103 -258 -143 -274 -104 94 -13 175 -19 -110 35 -77 88 68 191 -54 -101 -129 61
3296F1j57K78o1o7k53Q9J7K39j43J25l4n8K0j28N4P3j11l1q6m7J8L17p5J33p7
$$ 61 -96 182 121 54 -199 -110 -93 146 3 128 94 36 56 -72 -18 55 -56 -87 -173 -220 -202 115 40 173 96
3321I6r1j7O8o5O8J62r4j77j06K5M0L11o2J19k66O8k92K06J23L9k42l2K2k8J17
$$ 96 5 -12 56 -9 59 221 127 -50 -156 -131 -91 220 158 277 11 79 -213 -7 116 155 -87 -119 -97 -125 -8
3346hQ0l6rj8j35J09RJ43o0n7p2j10J4j9J86J66o8j97L6k4p3K87Q3P3j98j28K68
$$ -8 72 36 27 9 -126 -17 -8 135 75 18 -54 -164 -150 -169 17 183 115 -82 -46 -70 -143 144 227 300 102 -26 242
3373B42q3k24J25o6j73M9j39K09L3J09N2O5r0r9k4K5J04k26M6k9J9j5P6L9rJ01
$$ 242 159 -65 60 -6 -179 -130 -269 -60 -27 82 134 199 109 10 -14 11 115 -111 -65 -94 -75 -90 -14 25 16 117
3399A17k19K48k93K61k59m7L52j20n7Q3p8J70j20J7k23J85j16K24j14K00k54J51
$$ 117 -102 146 -147 114 -145 -192 160 40 -17 66 -12 158 38 55 -168 17 -99 125 11 211 -43 108
3421A08k33Q4L1pP1r9O6o3n7K03ML4Lm1k33L5j22L90j52P8n3k20l3K96n1J3l1
$$ 108 -125 -41 -10 -17 54 -45 21 -42 -99 104 108 142 145 104 -129 -94 -216 174 22 100 47 -173 -206 90 39 52 21
3448B1j1k8O0j80K26L4nj77n7J36r4K26k50K39l57J24J2K48k32J97P4l53J09k19
$$ 21 10 -18 42 -138 88 122 117 -60 -117 19 -75 151 -99 140 -217 -93 -81 167 -65 132 206 -147 -38 -257
3472b57K39k3J08r1R2j81p4P5l4N0J92j4j44N5k10K83j46J82j59M0m5l0J5Q4J22
$$ -257 -18 -41 67 -24 68 -113 -187 -112 -146 -96 96 82 -62 -7 -217 66 -80 102 -57 -17 -62 -92 -77 7 129
3497A29j26j05k1O8O3L3l8j16jM2p9J43J26r0J3J54k77j7J05Q7p6l5J3j27N9J
$$ 129 3 -102 -123 -55 8 41 3 -113 -114 -72 -151 -8 118 28 41 195 -82 -99 6 93 17 -18 -5 -132 -73 -72
3523g2J56k2p6J72l52K10K5m0R9L1j41j28J04j41J76J40q6q6j4j43J10L8l1L71
$$ -72 84 62 -14 158 -194 16 41 1 100 131 -10 -138 -34 -175 1 141 55 -31 -45 -188 -78 -40 -71 300
3547C00k02j28o1L0P4L3M6m6j47M2KK7Q7j7o2J28k0k30J42J04q1K5j67L8k15J91
$$ 300 98 -30 -91 -61 13 46 92 46 -101 -59 -57 -30 57 40 -22 106 86 -144 -2 102 21 46 -121 -83 -298 -107
3573a07J29k1K5n9p9P3O4j60L30k85K1P5l3o4L19pk11K0j31N0jk5K11j77k2J12
$$ -107 22 1 26 -33 -112 -39 25 -135 195 -90 -69 6 -27 -91 228 221 10 30 -101 -51 -52 -77 134 -43 -65 47
3599D7j88K40ML1l8k24J67j93J69R1o4K8J9l05J37JJ89j90L2K5j44P5jJ21K5J56
$$ 47 -141 99 103 134 96 -128 39 -154 15 106 42 70 89 -216 -79 -78 111 -79 -47 -22 -166 -91 -92 29 54 210
3625B10j04n0L1j72J85lJ3j11l3N4n2P0m6J42j54p7J28q6m9J44Q8m0o5M8M0q0
$$ 210 106 56 87 -85 100 97 110 -1 -34 20 -32 38 -8 134 -20 -97 31 -55 -104 40 128 88 23 71 111 31
3651C1m4J86K4l7l44O5J07j02J98K0n8j51K06m2M5k52K28Q3k09j55J57K9J87j61
$$ 31 -13 173 197 160 -184 -119 -12 -114 84 104 46 -105 101 59 104 -148 80 163 -46 -201 -44 -15 172 11
3675A1n9l8K8J46P3k05P0J06k28o8JJ64K7L1j05J4j18K3J40J25K9k53n9K12l19
$$ 11 -48 -86 -58 88 161 -44 26 132 -96 -164 -163 1 28 59 -46 -32 -150 -127 13 138 167 -86 -145 67 -252
3700b52L55J22l71L27k47L1J19j34M1R7Mj60J31k7N4M9k29J26mj37K44L9k29J40
$$ -252 103 225 -146 181 -66 -35 84 -50 -9 88 92 -68 63 36 90 139 -90 36 32 -105 139 178 -51 89
3724H9j9k38R9m3J08J93j59o5P3M9j58Q5j26l3K86q1j15p4m3K10K6N9k28J09m7
$$ 89 70 -168 -69 -112 -4 189 30 -35 38 87 -71 14 -112 -145 141 60 -55 -129 -172 38 64 123 -105 4 -43
3749d3l0J75R3j34l11J56O9J10q0N6k08K30l58J84O3J14J14m4j36k69J95j44K24
$$ -43 -73 102 195 61 -250 -94 -25 85 5 61 -147 83 -275 -91 -28 86 200 156 20 -249 -54 -198 26
3772B6O1j27j47n9nK71L9M3o6o6j2j26L4k4J38J04j67N1M1P5j38J18L1p5R2j50
$$ 26 87 -40 -187 -246 -251 20 59 102 36 -30 -42 -168 -134 -158 -20 84 -83 -32 9 84 -54 64 95 20 112 -38
3798c8Q7j0OL7lL9j51r3M7O4RMr0J33j20M8J10j58Q1J60j67J3k3j0J78o8M1k7
$$ -38 49 39 45 82 79 118 -33 -126 -79 -15 -6 -2 -92 41 -79 -31 79 -79 2 162 -5 8 -15 -25 153 85 126 99
3826I9j48k9L2K35k03N9j35O7j22N6J36o6P8j81J25ll3O4N1j44k4J22k36K08K50
$$ 99 -49 -78 -46 189 -14 45 -90 -23 -145 -89 47 -19 59 -122 3 0 -33 31 82 -62 -86 36 -200 8 258
3851B58j64o4j95K8k6J93j8K4p5J32k1j05M8j5l3J45r5l9J51j29j6J27k24M0K7
$$ 258 94 30 -165 -137 -163 30 12 36 -39 93 72 -33 15 0 -33 112 17 -22 129 0 -16 111 -113 -73 -46
3876d6j12J86J23M8j4k56n0J87j02K4J52j32M2j77o3J88J92j17p9Q1o6r0O5J9
$$ -46 -158 28 151 199 185 -71 -121 66 -36 -12 140 8 50 -127 -190 -2 190 73 -6 75 9 -81 -16 3
3900Ck39K61n0m7O8j03K6K29j14j76J27l4l6J30K0p4n2P5J30k05L3L4q1J70j11
$$ 3 -236 25 -25 -72 -4 -107 -81 148 34 -142 -15 -49 -85 45 65 -9 -61 14 144 -61 -28 6 -75 95 -16
3925a6J12j12L7K44l23J39k01J91k33L03j00j36o0R9N1j39PJ64N8j40M0o0r8J0
$$ -16 96 -16 21 265 -58 81 -120 71 -162 141 41 -95 -155 -56 -5 -144 -137 27 85 -55 -15 -75 -173 -163
3949a63K00J69k19J82r5j49J57j41Q8m0j31m7J81l1P4q7K48l16R2M1J35l9m5k4
$$ -163 37 206 -13 169 74 -75 82 -59 29 -11 -142 -189 -8 -39 35 -52 196 -120 -28 13 148 109 64 40
3973D0L2o9J26N9n3o4j7P5j49Jp5K11q5n4N8J67q1j47R2J99k02j05R7j90k0K60
$$ 40 72 3 129 188 135 71 54 129 -20 -19 -94 117 32 -22 36 203 122 -25 67 266 64 -41 56 -134 -154 106
3999A06pk63J27m4J36l4R8R4j70j9j0j37K43j92J86jl2j50J06k3J50N2J3j42n8
$$ 106 99 -164 -37 -81 55 21 119 213 43 24 14 -123 120 -72 114 113 81 -69 37 14 164 216 229 87 29
4024B9r9J11j49K83o8k16Q0J5J13k27m0M11k23j28K5j21K27O1j3J04j95r7L04
$$ 29 -70 41 -108 175 107 -109 -29 -14 99 -128 -168 243 20 -108 -83 -204 23 84 71 175 -20 -117 187
4047A87j74L1j29J23k8J05q4M8r5K10k17k4n7N6J77k28J56j63J19R9lj45J94J4
$$ 187 13 44 -85 38 10 115 31 79 -16 194 -23 -47 -104 -48 129 -99 57 -106 13 112 109 -36 158 172
$$ [...]
8191d9
##END NTUPLES=NMR FID
##END=
